##TITLE=1H_AM_NVACETO6H
 
 8 sc, 
 7.04.2022
##JCAMPDX= 6.0         $$ Bruker NMR JCAMP-DX V2.0
##DATA TYPE= NMR FID
##DATA CLASS= NTUPLES
##ORIGIN= UXNMR, Bruker Analytische Messtechnik GmbH
##OWNER= root
$$ XWIN-NMR		Version 3.5
$$ Thu Apr  7 10:55:13 2022 Russian Standard Time (UT+4h)  she@DPX200
##.OBSERVE FREQUENCY= 200.1313
##.OBSERVE NUCLEUS= ^1H
##.DELAY= (6, 6)
##.ACQUISITION MODE= SIMULTANEOUS
##.ACQUISITION SCHEME= undefined
##.AVERAGES= 8
##.DIGITISER RES= 18
##SPECTROMETER/DATA SYSTEM= spect
##.PULSE SEQUENCE= zg30
##.SOLVENT NAME= CDCl3
##.SHIFT REFERENCE= (INTERNAL, CDCl3, 0, 15.7039)
##AUDIT TRAIL= $$ (NUMBER, WHEN, WHO, WHERE, WHAT)
$$ ##TITLE= Audit trail, XWIN-NMR		Version 3.5
$$ ##JCAMPDX= 5.01
$$ ##ORIGIN= Bruker BioSpin GmbH
$$ ##OWNER= she
$$ F:/spectra/data/she/nmr/H-F/1/audita.txt
$$ ##AUDIT TRAIL=  $$ (NUMBER, WHEN, WHO, WHERE, WHAT)
(   1,<2022-04-07 10:53:31.10 +0400>,<she>,<DPX200>,
      <created by zg, POWCHK disabled, PULCHK disabled
       configuration hash MD5:
       00 E9 B6 7A A2 85 ED C7 34 08 36 98 17 FE 4E 26
       data hash MD5: 16K
       5A B8 C0 38 BA 04 08 3B 93 4A A0 AB BC F3 AF BD>)
$$ ##END=
$$ 
$$ hash MD5
$$ BA FA 26 A9 47 0C BA C0 19 5D 03 80 5F FA CC 4E
##$RELAX= 
##$RELAX= 
##$RELAX= 
##$RELAX= 
##$RELAX= 
##$RELAX= 
$$ Bruker specific parameters
$$ --------------------------
##$DU= <F:/spectra>
##$EXPNO= 1
##$NAME= <H-F>
##$PROCNO= 1
##$TYPE= <nmr>
##$USER= <she>
##$AMP= (0..31)
100 100 100 100 100 100 100 100 100 100 100 100 100 100 100 100 100 100 
100 100 100 100 100 100 100 100 100 100 100 100 100 100 
##$AQSEQ= 0
##$AQ_mod= 1
##$AUNM= <au_zg>
##$AUTOPOS= <>
##$BF1= 200.13
##$BF2= 200.13
##$BF3= 200.13
##$BF4= 200.13
##$BF5= 200.13
##$BF6= 200.13
##$BF7= 200.13
##$BF8= 200.13
##$BYTORDA= 1
##$CFDGTYP= 0
##$CFRGTYP= 5
##$CHEMSTR= <none>
##$CNST= (0..31)
1 1 145 1 1 1 1 1 1 1 1 1 1 1 1 1 1 1 1 1 1 1 1 1 1 1 1 1 1 1 1 1 
##$CPDPRG= <>
##$CPDPRG1= <>
##$CPDPRG2= <>
##$CPDPRG3= <>
##$CPDPRG4= <mlev>
##$CPDPRG5= <mlev>
##$CPDPRG6= <mlev>
##$CPDPRG7= <mlev>
##$CPDPRG8= <mlev>
##$CPDPRGB= <>
##$CPDPRGT= <>
##$D= (0..31)
0 1.2 0 0 0 0 0 0 0 0.06 0 0.03 0 0 0 0 0.0002 0 0 0 0 0 0 0 0 0 0 0 0 
0 0 0 
##$DATE= 1649314410
##$DBL= (0..7)
120 120 120 120 120 120 120 120 
##$DBP= (0..7)
150 150 150 150 150 150 150 150 
##$DBP07= 0
##$DBPNAM0= <>
##$DBPNAM1= <>
##$DBPNAM2= <>
##$DBPNAM3= <>
##$DBPNAM4= <>
##$DBPNAM5= <>
##$DBPNAM6= <>
##$DBPNAM7= <>
##$DBPOAL= (0..7)
0.5 0.5 0.5 0.5 0.5 0.5 0.5 0.5 
##$DBPOFFS= (0..7)
0 0 0 0 0 0 0 0 
##$DE= 6
##$DECBNUC= <off>
##$DECIM= 32
##$DECNUC= <off>
##$DECSTAT= 4
##$DIGMOD= 1
##$DIGTYP= 9
##$DL= (0..7)
0 120 120 120 120 120 120 120 
##$DP= (0..7)
150 150 150 150 150 150 150 150 
##$DP07= 0
##$DPNAME0= <>
##$DPNAME1= <>
##$DPNAME2= <>
##$DPNAME3= <>
##$DPNAME4= <>
##$DPNAME5= <>
##$DPNAME6= <>
##$DPNAME7= <>
##$DPOAL= (0..7)
0.5 0.5 0.5 0.5 0.5 0.5 0.5 0.5 
##$DPOFFS= (0..7)
0 0 0 0 0 0 0 0 
##$DQDMODE= 0
##$DR= 18
##$DS= 0
##$DSLIST= <SSSSSSSSSSSSSSS>
$$ [...]
##$SUBNAM2= <"">
##$SUBNAM3= <"">
##$SUBNAM4= <"">
##$SUBNAM5= <"">
##$SUBNAM6= <"">
##$SUBNAM7= <"">
##$SUBNAM8= <"">
##$SUBNAM9= <"">
##$SW= 18.0517328524113
##$SWIBOX= (0..15)
0 0 2 0 0 0 0 0 0 0 0 0 0 0 0 0 
##$SW_h= 3612.71676300578
##$TD= 16384
##$TD0= 1
##$TE= 0
##$TE2= 300
##$TE3= 300
##$TEG= 300
##$TL= (0..7)
0 120 120 120 120 120 120 120 
##$TP= (0..7)
150 150 150 150 150 150 150 150 
##$TP07= 0
##$TPNAME0= <>
##$TPNAME1= <>
##$TPNAME2= <>
##$TPNAME3= <>
##$TPNAME4= <>
##$TPNAME5= <>
##$TPNAME6= <>
##$TPNAME7= <>
##$TPOAL= (0..7)
0.5 0.5 0.5 0.5 0.5 0.5 0.5 0.5 
##$TPOFFS= (0..7)
0 0 0 0 0 0 0 0 
##$TUNHIN= 0
##$TUNHOUT= 0
##$TUNXOUT= 0
##$USERA1= <user>
##$USERA2= <user>
##$USERA3= <user>
##$USERA4= <user>
##$USERA5= <user>
##$V9= 5
##$VALIST= <valist>
##$VCLIST= <CCCCCCCCCCCCCCC>
##$VD= 0
##$VDLIST= <DDDDDDDDDDDDDDD>
##$VPLIST= <PPPPPPPPPPPPPPP>
##$VTLIST= <TTTTTTTTTTTTTTT>
##$WBST= 1024
##$WBSW= 4
##$XGAIN= (0..3)
0 0 0 0 
##$XL= 0
##$YL= 0
##$YMAX_a= 333308
##$YMIN_a= -322755
##$ZGOPTNS= <>
##$ZL1= 120
##$ZL2= 120
##$ZL3= 120
##$ZL4= 120
##$ABSF1= 10
##$ABSF2= 0
##$ABSG= 5
##$ABSL= 3
##$ALPHA= 0
##$AQORDER= 0
##$ASSFAC= 0
##$ASSFACI= 0
##$ASSFACX= 0
##$ASSWID= 0
##$AUNMP= <proc_1d>
##$AZFE= 0.1
##$AZFW= 0.1
##$BCFW= 1
##$BC_mod= 2
##$BYTORDP= 1
##$COROFFS= 0
##$CY= 11.3945322036743
##$DATMOD= 1
##$DC= 2
##$DFILT= <>
##$DTYPP= 0
##$F1P= 2.36226072786647
##$F2P= -0.459571619588291
##$FCOR= 0.5
##$FTSIZE= 0
##$FT_mod= 4
##$GAMMA= 1
##$GB= 0.15
##$INTBC= 1
##$INTSCL= 1
##$ISEN= 128
##$LB= 0.24
##$LEV0= 0
##$LPBIN= 0
##$MAXI= 10000
##$MC2= 0
##$MEAN= 0
##$ME_mod= 0
##$MI= 1.114404
##$NCOEF= 0
##$NC_proc= 0
##$NLEV= 6
##$NOISF1= 3.799351
##$NOISF2= 2.8
##$NSP= 1
##$NTH_PI= 0
##$NZP= 0
##$OFFSET= 15.70392
##$PC= 1
##$PHC0= -18107.23
##$PHC1= 12.60078
##$PH_mod= 1
##$PKNL= yes
##$PPARMOD= 0
##$PSCAL= 0
##$PSIGN= 0
##$REVERSE= no
##$SF= 200.130013532006
##$SI= 16384
##$SIGF1= 3
##$SIGF2= 2
##$SINO= 400
##$SIOLD= 16384
##$SREGLST= <1H.CDCl3>
##$SSB= 0
##$STSI= 0
##$STSR= 0
##$SW_p= 3612.71676300578
##$SYMM= 0
##$S_DEV= 0
##$TDeff= 0
##$TDoff= 0
##$TI= <>
##$TILT= no
##$TM1= 0
##$TM2= 0
##$TOPLEV= 0
##$USERP1= <user>
##$USERP2= <user>
##$USERP3= <user>
##$USERP4= <user>
##$USERP5= <user>
##$WDW= 1
##$XDIM= 8192
##$YMAX_p= 0
##$YMIN_p= 0
$$ End of Bruker specific parameters
$$ ---------------------------------
##NTUPLES= NMR FID
##VAR_NAME=  TIME,          FID/REAL,        FID/IMAG
##SYMBOL=    X,             R,               I
##VAR_TYPE=  INDEPENDENT,   DEPENDENT,       DEPENDENT
##VAR_FORM=  AFFN,          ASDF,            ASDF
##VAR_DIM=   8192,          8192,            8192
##UNITS=     SECONDS,       ARBITRARY UNITS, ARBITRARY UNITS
##FACTOR=    0.0002768,     1,               1
##FIRST=     0,             0,               0
##LAST=      2.2672688,     0,               0
##MIN=       0,             -322755,         0
##MAX=       2.2672688,     333308,          0
$$ Real data points
##PAGE= N=1
##DATA TABLE= (X++(R..R)), XYDATA
$$ [...]
1923I71J573l307j299L016J126k424j214J785J581j274k161R75K755j010l215
1938b122J190L381j470l280J578K886j435k474R48K167k79k136m26K359R99k751
1954h65j262L164J268l370j049L315Q38k924p44K362R52j747j399J302J988j124
1970G05k594J198K997j459l114J668K903j715k576J459K167r47j996K81K028L62
1986A367k340q14K771R91l148q92L334O64l183m51K795M75k218p28J707J268j365
2003B33j878J316K424j472k774J762K766j955k566J906K187j620j902J021J776
2018A224l79j982k32K333N69k784o75L131N33l226k95L039J93k596k24K081O26
2035A336j600j155J419J783j412k263J660K516j922k482K089K196j999j894J575
$$ plain form
1923 971 2544 -763 -2062 954 2080 -344 -1558 227 1808 534 -1627 -652 2103 1093 -2122
1938 -2122 -932 2449 979 -2301 -723 2163 728 -1746 -798 1369 1090 -1046 -1472 887 1886 -865
1954 -865 -2127 1037 2305 -1065 -2114 1201 2039 -885 -1629 733 1685 -62 -1461 -159 1829 705
1970 705 -1889 -691 2306 847 -2267 -599 2304 589 -1987 -528 1639 692 -1304 -1023 1005 1367
1986 1367 -973 -1787 984 1975 -1173 -2065 1269 1933 -1250 -1701 1094 1569 -649 -1377 330 1598 233
2003 233 -1645 -329 2095 623 -2151 -389 2377 422 -2144 -238 1949 329 -1573 -552 1224
2018 1224 845 -1137 -1369 964 1533 -1251 -1926 1205 1738 -1488 -1783 1256 1449 -1147 -1371 710 1336
2035 1336 -264 -1419 0 1783 371 -1892 -232 2284 362 -2120 -31 2165 166 -1728 -153
2050a53J649j028j697L54J906R3k361m03K780L70l103j82L095l2k839J24K392
2067I65R2j916m39J580J076j399j643J577K102j817k223K098K139k168j861J994
2083A57J580j587j443R60J489l87j878o3K281J86k735j68K918o0k927K40K591
2100A154k59k131J7J695N03j447j029J429J601j566j928J927K017k127j804K175
2116B27J549j928j292J462J256r15j431L73J792o4k284m6K636j39k801L20K663
2133A378m64k377M00J916j03j555m07J367J001j434j452J681J742j961j728K174
2149A78J539k116j254J838J083j354j084Q13J339l54j777J28K209j21k557L15
2165a175K635n54k462O39K082m95j701J38J392L94j321r47J468J351j763j523
$$ plain form
2050 -153 1496 468 -1229 -875 1031 1124 -1237 -1640 1140 1510 -1593 -1775 1320 1288 -1551 -1427 965
2067 965 1057 -859 -1298 282 1358 -41 -1684 -107 1995 178 -2045 53 2192 24 -1837 157
2083 157 1737 150 -1293 -333 1156 769 -1109 -1172 1109 1295 -1440 -1608 1310 1250 -1677 -1437 1154
2100 1154 895 -1236 -1219 476 979 -468 -1497 -68 1533 -33 -1961 -34 1983 -144 -1948 227
2116 227 1776 -152 -1444 18 1274 359 -1072 -699 1093 1029 -1255 -1301 1335 1196 -1605 -1285 1378
2133 1378 914 -1463 -1063 853 750 -805 -1212 155 1156 -278 -1730 -49 1693 -268 -1996 178
2149 178 1717 -399 -1653 185 1268 -86 -1170 -357 982 628 -1149 -1021 1188 1067 -1490 -1175
2165 -1175 1460 906 -1556 -917 1165 670 -1031 -893 499 893 -428 -1375 93 1444 -319 -1842
2181a842K053J444k181j244K104R84j788q45J273R53p58j282L98J725k68k130
2197a404L27K407n13k433P32K227p67j847N90J483j36j288l71J284Q67j480j224
2214a546J790J329k086j203K150R37j990p60J587P12j136q71O62J235l66j704
2230a260L30K077m70k270P23K222q54j954Q58J619n82j316J77J190L57j271p75
2247a199J518J045j860j055K074Q85k126o76J904M96j535n37J039P57o61j174
2263a105M31J636m59j976O26K115q26j977R54J727q35j401N75J150p0j082m13
2280i30J264P89j551r46J856Q87k046o81K002M51j784l45J358M03r34p23O28J115
2298H13n32j563O44J825q47j894J059J758j122j467R94J175o00r97J31J050L50
$$ plain form
2181 -1842 211 1655 -526 -1770 334 1318 -470 -1315 -42 911 153 -1129 -731 994 726 -1404
2197 -1404 -1077 1330 817 -1616 -884 1343 576 -1271 -681 802 666 -622 -993 291 1158 -322 -1546
2214 -1546 244 1573 -513 -1716 434 1371 -619 -1379 208 920 -216 -1087 -425 810 444 -1260
2230 -1260 -930 1147 677 -1593 -870 1352 498 -1456 -598 1021 439 -877 -700 490 847 -424 -1199
2247 -1199 319 1364 -496 -1551 523 1408 -718 -1394 510 1006 -529 -1066 -27 730 69 -1105
2263 -1105 -674 962 503 -1473 -847 1268 442 -1535 -581 1146 311 -1090 -515 635 565 -517 -930
2280 -930 334 1123 -428 -1374 482 1369 -677 -1358 644 1095 -689 -1034 324 727 -207 -930 -302 813
2298 813 281 -1282 -638 1187 340 -1554 -495 1263 141 -1326 -332 843 243 -754 -623 427 777
2315G77j231o85J578P92j850o98J980N02j892l29J591K63j182m41P69P73n36j220
2333a039N25J577o79j784R01J772j096j562J135J264r50j001N91R07j46r99k45
2350h29J287M74j609n04J873L83j964j62J822L5j511p0J120L03p77p04N97J150
2368I14o33j501Q00J678j019j634J155J416j095j151Q48R30m16r17k1J078L42
2385G74j351n06J677M55j905k37J898L3j721Q5J400l1j036k37Q06O30p23j025
2403a014Q32J337j068j435J301J334j373j120J258R06r54p97N33Q44r8j061k49
2420h24J418L60j724l21J896J48j864J4J631n6j297p0R63L89p40q14P46J168q86
2439A37j390J139J411j343j249J422R95j281p76R67P00n75q08K10J091pj437m3
$$ plain form
2315 777 -454 -1139 439 1231 -619 -1317 663 1165 -727 -1056 535 798 -384 -825 -56 717 181 -1039
2333 -1039 -514 1063 384 -1400 -499 1273 177 -1385 -250 1014 64 -937 -346 561 415 -584 -829
2350 -829 458 932 -677 -1181 692 1075 -889 -1051 771 806 -705 -775 345 648 -129 -833 -236 914
2368 914 281 -1220 -420 1258 239 -1395 -240 1176 81 -1070 -222 708 292 -625 -646 432 774
2385 774 -577 -1083 594 1049 -856 -1093 805 838 -883 -798 602 571 -465 -702 104 734 11 -1014
2403 -1014 -182 1155 87 -1348 -47 1287 -86 -1206 52 958 4 -793 -260 584 486 -575 -824
2420 -824 594 954 -770 -1091 805 953 -911 -897 734 678 -619 -689 274 663 -77 -891 -145 1023 137
2439 137 -1253 -114 1297 -46 -1295 127 1122 -159 -935 32 732 157 -651 -441 650 643 -794 -837
2457h37J711o7j852K52J779l74j529L30J199q7r20k99P99P16q20j098J022J312
2475A237j229j326J400J162j376r32J158P90q26p59M17R12r2j196o7J522M2j795
2493i58J47J828l49j705M81J414m10j128J77R03J94q45n82R78Q79j197j028J446
2511B45R66j550q17J503O36j236n46Q59O38m56q95J81J228n6j549R3J772k36j803
2530a023M10J618m52j330L14J043j6q85l56Q62P08j034r43J262R85j488q72J572
2548C75O74j482m82J202M43q68n35N36Q15l18j156K96J472l87j619N62J628o81
2566D75j422O56J181m59r47J00Q40L26r33o63J099Q59j349r18J508P81j547o21
2584a034J375M73j086m81P29O29m38r19K99J258l33j488N09J587o59j491P91J306
$$ plain form
2457 -837 874 807 -1045 -793 986 612 -917 -587 612 525 -395 -694 105 821 1 -1097 -75 1237
2475 1237 8 -1318 82 1244 -132 -1064 94 884 58 -701 -284 628 536 -660 -727 795 837 -958
2493 -958 -811 1017 668 -1037 -556 858 448 -680 -503 400 594 -251 -833 145 1024 -173 -1201 245
2511 245 1211 -339 -1156 347 983 -253 -799 60 698 242 -653 -472 756 700 -849 -756 1016 780 -1023
2530 -1023 -613 1005 553 -777 -463 580 564 -321 -677 185 893 -141 -1084 178 1163 -325 -1197 375
2548 375 1049 -433 -915 287 730 -138 -673 -137 678 360 -796 -500 972 585 -1034 -472 1156 475
2566 475 -947 -291 890 431 -516 -416 424 750 -183 -846 253 1112 -237 -1155 353 1134 -413 -1034
2584 -1034 341 814 -272 -753 -24 605 167 -752 -453 805 472 -1016 -507 1080 421 -1070 -279 1027
2602A027p32j033N38Q72j79q24j79R47M89j200o26J421O11j585n04J551L21j373
2620d58k87J027L57p21o28M73R37l88j273M30J512n74j560P54J431p72j194O84
2638b50R94m00q46R5Q65K81j007n10J266N94j483n12J589L35j519k24J312J56
2656G36j038k70O90N27n30q81M79J166n98j374P66J372q81j245Q94J038p26q36
2674g11M31P84m0q51k62J076M71j289m91J502M04j556k44J462J23j214j55R15
2692C55K99o70n91N06R14n50j183O78J283q58j260R47J104r47q79P43P29m24p09
2711e13R5Q36J85j055l17J322L30j488j81J518M4j362L4J103M5q23k75O25N66
2730F89n46q75N93J112p74j193R32J106j032r30R31P39p14o33L83O75q9q25j46
$$ plain form
2602 1027 295 -738 -200 672 493 -331 -510 437 926 -274 -900 521 1132 -453 -957 594 915 -458
2620 -458 -745 282 639 -82 -710 -237 700 312 -961 -531 981 407 -1153 -399 1032 260 -934 -250
2638 -250 744 344 -502 -407 458 739 -268 -778 488 1082 -401 -913 676 1011 -508 -732 580 736
2656 736 -302 -572 118 645 115 -766 -287 879 281 -1093 -327 1045 164 -1081 -187 851 125 -711
2674 -711 -280 504 464 -387 -649 427 898 -391 -882 620 1024 -532 -776 686 809 -405 -560 355
2692 355 654 -16 -607 -101 813 263 -920 -242 1041 183 -1077 -130 974 27 -852 -109 620 196 -513
2711 -513 -418 418 603 -452 -769 553 883 -605 -786 732 776 -586 -552 551 596 -227 -502 123 689
2730 689 143 -732 -139 973 199 -994 -62 1044 12 -918 13 752 38 -595 -212 463 374 -451 -597
2749e97J075K50j303j95J454M7j413P1J270j11r95kP63K45n90n50N70Q45o83j014
2769h63Q31J063r94r75J037P74r20o18O62N57l64o47Q2Q30R4j070j45J295L1j381
2789g21J08J320j94j145K13Q89m4o68k24N78N25n85q06P34R62r21r47J033Q21
2808I28j021o64Q74N42o15n37L15O41n4q63p8J110O9j298M9J336j91j249K71J056
2828F21k41q17O3O31K10n64n10O40P33q00q31R86P81j093o37J046M95q65l98N76
2848B6M53k90o22Q1Q71Nj102K9J258j40j274K63J149k89r59K03P32Qn93l03N78
2869H4N73o85p60Q53P99j006p27J066N70r99m19P92L60n36m14K77O04j10q49Q1
2889d46J054j41j191L06J171m04j002M02Q07k68o39K7N51K72o04n15P30O84r15
$$ plain form
2749 -597 478 728 -575 -770 684 731 -682 -611 659 548 -447 -449 314 559 -31 -581 -11 834 151 -863
2769 -863 -32 1031 37 -938 99 873 -47 -665 -3 554 190 -457 -375 455 549 -521 -666 629 660 -721
2789 -721 -613 707 513 -632 -419 470 426 -242 -466 112 637 52 -754 -20 942 21 -926 107 928
2808 928 -93 -757 117 659 44 -493 -178 463 409 -454 -532 578 647 -651 -602 734 543 -706 -435 621
2828 621 380 -437 -374 257 467 -97 -607 33 766 -34 -865 121 902 -191 -828 218 713 -152 -550 26
2848 26 479 189 -433 -352 519 524 -578 -549 709 569 -705 -442 707 418 -541 -338 394 402 -191 -494 84
2869 84 657 -28 -788 65 864 -142 -869 197 767 -232 -651 141 501 -35 -449 -172 432 322 -527 -446
2889 -446 608 467 -724 -418 753 349 -653 -251 556 288 -351 -324 227 499 -105 -620 110 794 -121
2908a21p10J052O06j068m78R51L55p17l68M60M78k36o85R8R21j14j106K30J175
2927G23l63j114M58R28m12p31K63N83l5n17k28N99M41p42n54R45N28j056m01J026
2947C41K92r04k19O75K61m42m18K45O49j61q93J84J068l05j120M16J029m68q65
2966f35L92O76k02n63n5N47L22o62m79Q17N49r82m86J067L66j010k31Q66J61o06
2986a48k22L89L86k24o33K18Q35k87r71M20R63n21q77N45O86m39n65K30M81L8
3006C04n39k94O71M47q72m47R96L98j048k70R65J95p77j93N56L04l44m87K42P28
3026E35k37r04L50R67m62r43N59Q08n44o45M06M94k04m53n7N18K53o83l63Q42
3046B37L55r73k62R97J39r00n3P00R4m74k49L28M57k24o93K79Q63l78r34N25Q67
$$ plain form
2908 -121 -831 221 827 -241 -719 232 587 -130 -498 -38 440 204 -481 -383 538 424 -682 -452 723
2927 723 360 -754 -296 632 220 -511 -248 335 300 -217 -445 154 595 -147 -701 244 772 -284 -685 341
2947 341 633 -271 -490 185 446 4 -414 -169 480 319 -574 -390 678 373 -747 -331 698 230 -635
2966 -635 -243 433 231 -332 -387 160 482 -180 -659 158 707 -275 -761 306 672 -338 -569 297 458 -148
2986 -148 -370 19 405 181 -452 -234 601 314 -657 -237 726 205 -672 -127 559 120 -445 -215 266 304
3006 304 -235 -529 142 589 -283 -730 266 664 -384 -654 311 506 -271 -464 92 396 52 -435 -193 535
3026 535 298 -606 -256 711 249 -694 -135 673 129 -516 -110 384 180 -273 -330 188 441 -242 -605 237
3046 237 592 -381 -643 354 493 -407 -460 240 334 -140 -389 -61 396 172 -521 -242 621 243 -691 -166 701
3067G01n63p36N12N79l40m89J13M87J06n86k98P39L48r09l11R97K01r78q1Q23
3087C15N1o31r2M29K46k93m56K62O75l25q04M69Q23n81p18O03N91n21m55L44L93
3108C25j23m31j08N52K53p40l05R12K04r61j03Q97K3p70j3N64J12l81k99K88N27
3129D23k94p09M00Q00n13p81O08O93o17n19N16M09l31l59P5M45J07n98j95P40
3149C00J85q91r3R12k5q33Q5O73o1n02o6L63K43k94m55L26O43m47o97N74O67o39
3171c2n46O17M46m92l51K93L62p2m60r9O39J65q17j28R06K2r07P1P86j13o44O0
3193b94M63O9l40k74L09M75l90n93N11O24o23n41O71M39o19l07M82K52k66k80
3213b32P2M18O0o00r1P68J2q41O2Q42j59p38J71N61r8m24p3L34K80l39n00M46
$$ plain form
3067 701 138 -598 -86 493 153 -336 -223 264 370 -216 -514 225 573 -336 -647 350 551 -427 -508 315
3087 315 366 -265 -357 72 318 25 -431 -169 506 181 -623 -154 669 88 -630 -27 564 43 -412 -68 325
3108 325 202 -229 -337 215 468 -272 -577 335 539 -422 -525 372 395 -375 -388 176 288 -93 -392 -104 423
3129 423 129 -580 -180 620 107 -674 -66 627 10 -509 7 416 85 -274 -199 246 353 -245 -440 300
3149 300 485 -406 -499 413 388 -445 -360 313 252 -250 -316 47 290 -4 -459 -133 510 63 -634 -60 607 -32
3171 -32 -578 39 485 -7 -358 -65 297 225 -235 -334 305 470 -347 -475 431 453 -454 -383 403 290 -354 -294
3193 -294 169 238 -102 -376 -67 408 18 -575 -64 560 -63 -604 67 506 -113 -420 62 314 48 -232
3213 -232 -160 258 318 -282 -373 395 407 -434 -372 470 311 -427 -256 305 207 -217 -290 44 324 -15 -515 -69
3235f9O07n75o09O75N24o87l81O13K89m35k64K31L38n2m54m7O32M5p73M8Q16j63
3257C09p63K26O36k34m77J21L29O6l00k67L29M36m60n17O04M87o72l97O71K98
3277D25n63k29L96K43j84l37M0N11L7o95J5P89q5q22J90P32k38n91J87M32p5l20
3299a42j31L03L04l76m28M90M64o18m05O67K97o23k00N08J53l32j71J51L08k8
3319A91m76J4O32m6p36J44P54k50o51K70N09j95l81M1L05J44l36l13L95M52n37
3340g0m63O39L95o87k77O07J96m72j60K91K28j35l37K8N08l0o49J22O95k03o58
3361d32K90N45l02m05K09K92m6k39j57K88L04m06l88N39L85o41k94O40J99n71
3381a90j35M37J18k39k35J15L83m0n61Q0O69j58p02K47O53l13n30K94L93j80k78
$$ plain form
3235 -69 538 -37 -646 29 553 -134 -515 98 387 -48 -312 -81 257 205 -249 -296 336 381 -392 -344 472 309
3257 309 -454 -228 408 174 -303 -182 147 213 -87 -354 -25 411 -49 -566 38 525 -147 -544 127 425
3277 425 -138 -367 29 272 88 -249 -209 302 339 -356 -341 448 363 -459 -269 463 225 -366 -179 253 178 -142
3299 -142 -273 30 334 -42 -470 20 484 -134 -539 128 425 -198 -398 110 263 -69 -240 -89 219 191
3319 191 -285 -271 361 315 -421 -277 477 227 -424 -154 355 160 -221 -180 125 269 -67 -380 15 467 -70
3340 -70 -533 106 501 -186 -463 144 340 -132 -292 -1 227 92 -245 -217 291 261 -388 -266 429 226 -432
3361 -432 -142 403 101 -304 -95 197 151 -88 -245 43 347 -59 -447 92 477 -164 -458 182 381 -190
3381 -190 -325 112 230 -9 -244 -129 254 214 -347 -267 402 244 -458 -211 442 129 -401 -107 286 106 -172
3402a72oK60J80l17l11M36L46n54l00O27K08o10j19N20O4l52r1J78K23q6l80N6
3424b00N14r9o11J96O19k81n55L16M42k86l05J35K43N5k69k07L46L11m69l20N72
3445A47K68o10j83N85R8m74n6L02J19j54k29N8L93p0n15J23N94k41n64L07M67
3466C65l16l55K55K33j06k16n3K43K18l60k85M68K92n66k05N90J17n27n0M00O0
3487B02k42j25J26K56o2m06P3N29j67n60K52N40l24m34L13K91k17k09N4J97Q4
3508A71k37k34L55K78m68k37N42J64n54n9M66K7l45l6K00J31q7k59N7M14j14n06
3530c31K07N34k97m70L31L54k82k65J78J91k9k08j25K77K20m02k39M86K09n56
3550b17j02N20L6m29KK89L2j42j42P4K91o6m15J26M92k17m93K95M26l21l15K74
$$ plain form
3402 -172 -178 82 262 -55 -366 70 416 -138 -438 189 397 -213 -332 188 252 -100 -191 -13 210 124 -256 -200
3424 -200 314 215 -396 -200 419 138 -417 -101 341 55 -250 -115 128 183 -86 -293 53 364 -105 -425 147
3445 147 415 -195 -378 207 305 -169 -225 77 196 42 -187 -129 264 194 -321 -198 396 155 -409 -102 365
3466 365 49 -306 -51 182 76 -140 -193 50 268 -92 -377 91 383 -183 -388 202 319 -208 -258 142 202
3487 202 -40 -165 -39 217 155 -251 -178 351 184 -376 -124 416 92 -342 -29 262 45 -164 -110 87 171
3508 171 -66 -300 55 333 -135 -372 170 334 -220 -279 187 214 -131 -167 33 164 77 -182 -125 289 175 -331
3530 -331 -124 410 113 -357 -26 328 46 -219 -41 150 121 -87 -212 65 285 -117 -356 130 339 -217
3550 -217 -319 201 237 -192 -190 99 131 -11 -153 -79 212 146 -269 -143 349 132 -361 -66 360 39 -276 -2
3572bK16j51j75kK01J31k87k29M08K23n16j43N32P1n03OL89k0k37n3J46J63o2
3595A06l10Q6M13j61m61K56M41l20l64L23K62k67j61J03J55L9k13j41K94J93m23
3616a50j71N05J04n30j3M77n6l34J3K41N3j13k10J12L27j13m30K07M53k94m07
3637c29L52L16l40k10K19J57j04j53m8K11J43l25j76M33J21m88n0M84l9m07O7
3658a66L01l8j58p2J14K01r9l17J66L99k36m09L29L54l68k60L18J95k27j48Q7
3679c4J70K4k42j32L54J25m61p7M92j4m66O5L75q5k48K5J56Q2r4k05J24L13j76
3702G1l54K83L48l48k79L66J98k99j21J79J12n7j64m7K50R0l68r8M55Rm76M8M46
3725B44j14l58J04K42l4j58r1J22K16j40l02K40L52l42k87L82K27l65j47L04Q9
$$ plain form
3572 -2 214 63 -112 -114 87 218 -69 -298 110 333 -183 -326 206 277 -226 -220 169 149 -88 -141 5 168 106
3595 106 -204 -118 295 134 -327 -71 370 50 -314 9 271 4 -157 -54 101 140 -73 -214 80 273 -150
3616 -150 -321 184 288 -242 -255 222 166 -168 -155 86 139 26 -184 -72 255 142 -288 -81 372 78 -329
3637 -329 23 339 -1 -211 8 165 61 -92 -140 71 214 -111 -287 146 267 -221 -271 213 174 -233 -166
3658 -166 135 97 -61 -133 -19 182 83 -234 -68 331 95 -314 15 369 1 -259 59 254 27 -121 -34
3679 -34 136 160 -82 -214 140 265 -196 -273 219 205 -261 -196 179 94 -154 -129 27 109 15 -190 -66 247 71
3702 71 -283 0 348 0 -279 87 285 -14 -135 44 156 99 -65 -112 138 228 -140 -238 217 226 -250 -202 244
3725 244 130 -228 -124 118 84 -74 -165 -43 173 33 -269 -29 323 -19 -306 76 303 -62 -209 95 184
3746A84j86o9M1J55M4k61p6L69K3m37L8M32j12l86J43K78j30j88N1J19Q9j35k03
3769b17J78K84k57l03L69K63m02j87L80J10k86p3J81J04o2j87kK93K8l99J8M43
3791B76j07m23J72L36j72k60J30J67m1j21r6J38K12k27k47K99K46l75j86M03J08
3812B32l41o9K73M0j36r0K3K07J1l19K7L79p3m29J47M09k04l26J92K39j37j55
3834a00J6J50J02j81j90K46K34l37k32M16J48m10p0L51L8k59k9J31R2n2j95K4
3856a07L04n3l73J14L89j69l57K09K73k05j71J13J33pj33j02J85J79k72k03L76
3877A23J59m11r8L99K3l12qK15K9j18r6L8K23n0l10R1L76j77l64K14L16k44k42
3900b24K17J67j29j20J4J38P8j92j48K86J51l50j06L73N6l65J8K85k8j84j5R8
$$ plain form
3746 184 -2 -71 -30 125 169 -92 -168 201 224 -213 -175 257 145 -241 -98 180 50 -138 -87 32 121 -14 -217
3769 -217 -39 245 -12 -315 54 317 -85 -272 108 218 -68 -141 40 144 82 -105 -107 186 214 -185 -167 276
3791 276 169 -254 -82 254 82 -178 -48 119 78 -43 -139 -1 211 -16 -263 36 282 -93 -279 124 232
3812 232 -109 -178 95 135 -1 -91 -68 139 150 -169 -142 237 164 -265 -118 291 87 -239 -47 192 55 -100
3834 -100 -84 66 168 -13 -203 43 277 -60 -292 124 272 -138 -208 143 181 -78 -107 24 116 64 -131 -107
3856 -107 197 144 -229 -115 274 105 -252 -43 230 25 -146 -33 100 93 -40 -142 43 222 -50 -253 123
3877 123 282 -129 -227 172 195 -117 -125 90 119 1 -95 -57 166 116 -194 -103 273 96 -268 -54 262 18 -224
3900 -224 -7 160 31 -89 -75 63 141 -51 -199 87 238 -112 -218 155 211 -154 -136 149 121 -63 -78 20
3922B0Q6m6j93N8K80r4l40J67L23k28k59K29J94k10j10J08Q6Rj33j02K13J45l01
3945i8j27L59Q3l76j3L40l7k49K9J53K8q1j20O4K10p3k86J42K98j98k79K38K13
3968B20k36j34J69P8p2p7l3J27J08j97j32K77R7l26m0L26k3k83M6K09l5j19j4
3991f4N6J17n6k08R2K73j57k80K15K56k59j73K20J16j62p4P4O9M1j43r0K22J04
4014A89l04o8L30J0l20O6K38o1j62L9Q1K9m2j25L5K18q1k56J50K47k17j93K30
4037C3J23j98p8J19O0k7r6m6J64Q4k43p2L05L5l23L3L00p0k43R3J51m0p6n2O9
4062EJ22p4k07J30K44k12k16K33J56k24j06J74O9j11m6RP4N9j49q7K32N4k78l
4086a52K84m2k53Q9J93o4j20J6Q8O3o1j49J04K02j60k27K33J86k62j41K41Q0j90
$$ plain form
3922 20 106 60 -133 -75 205 111 -229 -62 261 33 -226 3 197 -13 -123 -15 71 80 -53 -155 58 203 -98
3945 -98 -225 134 217 -159 -172 168 131 -118 -89 64 92 11 -109 -45 165 92 -194 -52 246 48 -231 7 220
3968 220 -16 -150 19 97 25 -52 -85 42 150 -47 -179 98 195 -131 -171 155 132 -151 -105 104 69 -50 -64
3991 -64 -8 109 53 -155 -63 210 53 -227 -12 244 -15 -188 32 148 -14 -88 -14 55 96 -47 -137 85 189
4014 189 -115 -183 147 157 -163 -97 141 80 -82 -43 38 67 25 -100 -65 153 72 -184 -34 213 -4 -197 33
4037 33 156 -42 -120 -1 59 32 -64 -110 54 138 -105 -177 128 163 -160 -127 173 103 -140 -47 104 64 -12 -64 5
4062 5 127 53 -154 -24 220 8 -208 25 181 -43 -149 25 94 -17 -63 -54 20 79 -70 -157 75 129 -149 -152
4086 -152 132 90 -163 -74 119 55 -65 -49 39 102 41 -108 -4 198 38 -189 44 230 -32 -173 68 148 -42
4109d2n9R5O8j8j18m8J85N1k58j8K89k5k74O5K39q7j61P5R6rn1p7O2J57j01j85
4135a49J61J98k07j67K38J01k27n3J71K6q4o6LJ28K7k15k0K64k1l01O4K89j24
4158C6k27J19J69p9j09NR6Q7j06j58J65J94k15j72K53J28k33q6K23L3j62k1O7
4181GO0Lj29m3J98Rk58K7K90r2k47J16J92j11j35O0Q9K1r6q4J20J48j91j46K37
4206D5J33k63j02K78N5k30l6J64L6o8r9K7J60jk28K8K65p0k80J23K32j41j62J15
4230a9J08o0p0l4R0J03j33j45J79J60k42j11K51P4k46m7K09J5j26m2O2R7k7j76
4254a30K6K67q3k89J33K76j68k18J59J81j45j04N4J04K5j12r7J74J29k39j28K73
4276H8R0k79l7K37J5j87j5J16M1o1j06K4J76l0k43P3K77j33k53J74J93j55j44
$$ plain form
4109 -42 -101 -6 62 44 -74 -122 63 114 -144 -162 127 102 -172 -107 132 45 -116 -41 55 46 -5 -82 -20 137 36 -149
4135 -149 12 210 3 -164 74 175 -52 -105 66 92 8 -58 -55 73 100 -115 -135 129 108 -193 -129 160 36
4158 36 -191 -72 97 18 -91 -86 10 97 -9 -167 -2 192 -23 -195 58 186 -47 -133 90 123 -39 -60 7
4181 7 67 70 -59 -102 96 105 -153 -126 164 72 -175 -59 133 22 -113 -53 36 57 -39 -123 -3 145 -46 -192 45
4206 45 178 -85 -187 91 146 -84 -120 44 80 12 -87 -60 100 99 -129 -101 164 94 -186 -63 169 28 -134 -19
4230 -19 89 29 -41 -75 15 118 -15 -160 19 179 -63 -174 77 151 -95 -142 67 82 -44 -86 -24 73 46 -130
4254 -130 -104 163 80 -209 -76 200 32 -186 -27 154 9 -95 -41 63 88 -24 -121 53 182 -57 -185 88
4276 88 178 -101 -138 99 114 -73 -88 28 69 8 -98 -74 102 72 -171 -98 179 46 -207 -33 160 5 -139
4299a39J25J14n8j10j6J46Q4j90j17K51R8k71p7L03J6k61%J96Rj29n7O6J23o5
4323D1k01Q5K30j06k58J69K18j89j69J67J26j19q9M3R2M1j24q8J95R8k45p0K86
4346A33K0k73PK48l8j69J3J10M6p2j28P7J84j18k28J64K23k01j92K08J45j96r4
4369a31J22J01o5j18PJ55K8k05m3K62K9k78J6K68m9k09M1J63k0j03m1Q1J28j14
4393B5j63J27K03j85j76K07J53k29r7J79O4j17o7M3J09jj67k8K13L0k65PK92o8
4417H9k37P2K06p8j48K6J15L7r2j04J20J55j60j74K08J68k44j20K32Q1j84n3J24
4440C9N5n3j11KJ75J1k29J8K40n8k55Q5K20q5j90P5J43l0j10k4P6J20j30j37J80
4465B7J50k14j31K37R2k15o2J72M2j12o1O8J00j3j73K3K07l3k50P6K37j08j93
$$ plain form
4299 -139 -14 100 42 -68 -84 62 146 -44 -161 90 188 -83 -160 143 159 -102 -102 94 103 -26 -83 -17 106 41
4323 41 -160 -75 155 49 -209 -40 178 -11 -180 -13 113 -6 -95 -52 40 81 -43 -131 64 162 -83 -153 133
4346 133 153 -120 -113 135 97 -72 -59 51 97 25 -103 -26 158 40 -188 -24 199 -2 -194 14 159 -37 -131
4369 -131 -9 92 27 -91 -84 71 99 -106 -149 113 142 -136 -120 148 99 -110 -69 94 74 -29 -70 11 139 25
4393 25 -138 -11 192 7 -169 38 191 -38 -135 44 108 -9 -76 -33 76 75 -92 -120 93 123 -142 -135 157 89
4417 89 -148 -76 130 52 -96 -70 45 82 -10 -114 6 161 1 -173 35 203 -41 -161 71 152 -32 -85 39
4440 39 94 41 -70 -68 107 118 -111 -93 147 89 -166 -81 139 54 -136 -61 82 52 -58 -82 -6 114 -16 -153 27
4465 27 177 -37 -168 69 161 -54 -116 56 98 -14 -75 -7 93 80 -93 -70 137 104 -146 -70 167 59 -134
4488a34J04J50q9j14L4R0K3r7r6J47J18j83j24K27R8k32o0K18K8j56k9J08M9m2
4512C8j10K5J79l4k09O1K38j17k12J27J71j25j33R4R6l5j03l5J22P8j64j03K08
4535E7Q5k33o6K41L1k10rJ52K9j00m3M5J11l7j66O4K07j01k10J38J89j45j38J17
4559HJ09p8j01K4R5K8j25p7J81P3k19o8K41J7k17mJ91oj50rR5O0n9j09M7J87r6
4586C8k00J39J95j46j77J65J26j34r3R0P8j6j05l8J50N5j86n5K08M3k38j1K19
4609A07k2j78J7J22K1r1n9N5J21o9j53R5J95j47j78J66J52j59j12J42P6q4o5J7
4633c1R8L2j50n1J91L7k27lK26j5k14L1J75l0j22j5Q0O5o8j25R6J48j18j63J50
4658cJ73j84j32J60R0j20p5Q2P3k4r6l2J52N1k03mK07qk28L7J91l8j44K7R8K1
$$ plain form
4488 -134 -30 120 31 -83 -49 41 64 -33 -129 18 136 -47 -171 56 154 -78 -138 80 108 -48 -77 31 80 38
4512 38 -72 -47 132 98 -111 -50 188 71 -141 -14 157 32 -101 -7 89 54 -49 -84 38 116 -48 -151 57
4535 57 142 -91 -157 84 115 -95 -104 48 77 -23 -66 -21 90 53 -113 -49 158 57 -153 -15 174 29 -109 8
4559 8 117 39 -62 -38 57 85 -40 -117 64 137 -82 -150 91 108 -109 -113 78 72 -78 -87 8 68 9 -100 -53 134 38
4586 38 -162 -23 172 26 -151 14 140 6 -87 3 81 65 -40 -78 72 127 -59 -114 94 137 -101 -112 107
4609 107 85 -93 -76 46 67 -24 -83 -28 93 24 -129 -34 161 14 -164 2 154 -5 -117 25 101 17 -48 -31
4633 -31 67 99 -51 -102 89 126 -101 -104 122 107 -107 -76 99 69 -53 -68 12 77 9 -116 -20 128 10 -153 -3
4658 -3 170 -14 -146 14 104 -16 -91 -9 64 40 -56 -88 64 115 -88 -92 115 107 -121 -84 107 69 -75 -48 50 71
4684G1q3p7P8J24r2j69J42J74j69j56J77J17j60q3J20O2n5q3J1J25J1j68l1K15
4708A01J1k34K0K23n0j73M4J32k0r4l3Q3P5q5j23J12J61j48j67J84J23j75q6J42
4732B3P2r6o7M2Q8Oj41k5J88J9k13KK20l2j96M7J68m7j33OR3M3q9p7R3J21j18
4759cj39J52J38j74j15J74P6j49n8R6P8m8j01MJ61J2k01RK04k6k20N5J95n2j65
4784i7L9J28j5q9m4P8J04j04j34J39J24j60j29J67J20j75p3J34O5q0q9M8J11j2
4808E6j43oJ91j7k01K8K18p1j75O6J58n4j09JJ03L9j03p9J12J18j59j27J87J06
4832A39j93p5J69N9j31n4P5P3m0j16J1J61j7j92L3K08o5j84P9J53n8j37N8R4%
4857E0r3m5J06R5j37j01J67R9j92p6J86N5j76k8J14M4p6p7N5R8j5j77N3J86p1
$$ plain form
4684 71 -12 -89 -11 113 21 -148 -6 168 -1 -157 20 137 -23 -106 14 76 21 -62 -51 74 85 -83 -114 101
4708 101 112 -122 -102 121 71 -102 -58 74 54 -40 -73 10 85 0 -123 -11 150 2 -165 19 142 -33 -119 23
4732 23 95 -1 -68 -26 62 68 -73 -98 90 109 -104 -102 118 86 -110 -63 105 58 -75 -69 24 67 -22 -99 -6 115 -3
4759 -3 -142 10 148 -26 -141 33 109 -40 -98 -2 76 28 -73 -69 92 104 -97 -88 116 90 -130 -75 120 68 -97
4784 -97 -58 70 55 -34 -78 0 104 0 -134 5 129 -31 -160 7 127 -48 -121 13 78 -2 -91 -43 68 56
4808 56 -87 -93 98 81 -120 -92 126 55 -120 -54 104 50 -59 -58 45 84 -19 -98 14 132 -27 -154 33 139
4832 139 -54 -129 40 99 -32 -86 -11 62 22 -94 -83 78 61 -131 -98 110 45 -139 -60 93 35 -102 -44 50 50
4857 50 -43 -88 18 113 -24 -125 42 141 -51 -127 59 114 -62 -90 24 68 -8 -85 -30 68 53 -124 -71 115 44
4882D4j96R1J74r4j47P1J27m7q3rJ06L2j05q0J51R1j85q1J93O3j87j6J49L0j22
4907c0l6P6O4n6j04M6J47n8j84Q3J76j04j64J17J28r3j10N2R4pj01k7J19N7j45
4932f0n9J81N1k00k4J88J0j53j0J25K0o8p7O9J08o6j53R9J50j13j57J22J38j33
4956a2j08R7R7o1j01J7J11K1j38m3J67N0j95k8K11Lj94J4J52J4j19k6R6N6q3r9
4982a01Q2J41j00j57J22J48j34j33J36R9j05q2O6Q2k4j12j3J39K8j83j5K07j1
5005H0k01J7J88k0j56J8J18J5j04m9R3R4j08j16J27J46j58j22J58J14j56r4J25
5028IP9r3q1L5J28lj54j4K08l5j95K4J98m3j73N9J28j7j28mR5N3j16q3J22J20
5054A19j42j22J72J04j87p0J38Q7j38o3R5Q6n1j17L0J52k8j77L7K02n6k01P6J68
$$ plain form
4882 44 -152 -61 113 19 -128 -57 70 23 -60 -69 37 69 -36 -116 35 126 -59 -140 53 116 -71 -87 62 92 -30
4907 -30 -66 10 74 18 -86 -40 107 49 -135 -52 124 20 -144 -27 101 8 -102 -50 44 37 -64 -91 28 85 -60
4932 -60 -119 62 113 -87 -111 77 87 -66 -76 49 69 1 -76 -7 101 35 -118 -19 131 18 -139 -17 121 -12
4956 -12 -120 -23 74 13 -88 -71 40 61 -77 -120 47 97 -98 -126 85 88 -106 -92 60 74 -45 -71 25 81 -2 -101
4982 -101 -19 122 22 -135 -13 135 1 -132 4 103 -2 -84 -18 64 40 -72 -85 54 82 -101 -116 91 80
5005 80 -121 -104 84 64 -92 -74 44 59 -45 -94 -1 93 -15 -131 -4 142 -16 -138 20 134 -22 -116 9
5028 9 88 -5 -86 -51 77 74 -80 -94 114 79 -116 -92 106 63 -110 -51 77 60 -68 -72 23 76 -40 -123 -1 119
5054 119 -23 -145 27 131 -56 -126 12 99 -39 -102 -7 79 28 -89 -59 93 65 -112 -75 127 71 -130 -54 114
5078A14o2j39M2J11lj07m5J21Q1j45r3J61J03j91p5J72N3j56n2J29N0q8p7N5J23
5103H2m4j52M6J86o8j94R1J79q9j50R0J17n8r5LJ22K5j23n9J47P5j87o0J87M8
5128A19j90m0J65K7j23n2J01O9p1j09N5J43p7j48P9J80j15j49J05J46j02j05O8
5151b4R8j8j04j9J30M1j56l7J73M4j92k4J85J3j56k4J21K7r4p0O5J22r1j18P7
5176c1J52j14j61J41J30j17j23J09R8o0j09M0J10Kj31k0J58L9j80l0K02%j81J5
5200f1J50Kj25k3Q1Q4j05r8R7J22j11j32J23J22j26j27J34Q0q5r6O1R6l5j06l
5225h1J53Oj64pJ78oj73NJ80j7j51J0J13L0r7m6R0P9r0j30J36J19j42j24J50J14
5251A35j44q4R9R3q0j05O0J04j6j52J1J75j4j91K3J85l5j78N1J43k1j20j0J03
$$ plain form
5078 114 52 -87 -45 66 63 -44 -89 32 113 -32 -125 36 139 -52 -127 45 98 -58 -110 19 69 -19 -96 -41 82
5103 82 38 -114 -68 118 50 -144 -53 126 37 -113 -23 94 36 -59 -56 66 91 -32 -91 56 131 -56 -116 71 119
5128 119 -71 -111 54 81 -42 -94 7 76 5 -104 -49 94 17 -131 -52 128 13 -136 -31 115 13 -92 -24
5151 -24 74 56 -48 -67 63 104 -52 -89 84 128 -64 -88 97 110 -46 -70 51 78 -16 -86 -21 101 10 -108 -31
5176 -31 121 7 -154 -13 117 0 -123 -14 84 24 -85 -45 65 67 -64 -84 74 113 -67 -97 105 105 -76 -61
5200 -61 89 91 -34 -57 24 108 3 -95 2 124 13 -119 4 126 0 -127 7 87 2 -94 -33 63 28 -78 -81
5225 -81 72 78 -86 -93 85 79 -94 -89 91 74 -77 -67 46 76 -21 -67 23 102 12 -118 18 137 -5 -129 21 135
5251 135 -9 -93 6 99 19 -86 -26 78 62 -90 -79 96 82 -109 -86 99 64 -114 -63 80 59 -61 -71 32
5275C2N0j02q6J22J12j32j17J57R9j42r5J36P9j14q4Q4J00n8j08K7J37j9j88L5
5299g5J99n5j79N6J54m8j41K8J16J3j06n6J35O4j29j07J60J11j85q2J70R0j67
5322c4n4J29O2r1j07P7J22l8j51L6J73n6j80N6J88o8j59N0J37k9j25k6J33N0j51
5347e6n4J48Q3j75q2J79P9j79o6J62P3j42o2Q2J14o7j28N9J61o6j75Q2J85p8j88
5372a11Q1J55o3j37M9R9J0j36l6J34P5j60q4J79O4j84o7J89N4j69n9J45O1q9j08
5397a08Q3J38p1j63Q0J70q8j77R7J79r2j46O5J51n9j39K1J38L1j66n3J70P1k01
5421f9m6K09K5j80n1J65M7j30p3J04J00j01j25Q3J73j03j68J06J74j13j61R7J56
5444A19q3j38M2J39Qj62k0J66M5j96k7K09K3k03l8J94L6j65m6J38O8j21j01J05
$$ plain form
5275 32 82 -20 -106 16 128 -4 -121 36 135 -7 -102 34 113 -1 -85 -1 99 41 -67 -40 97 78 -110 -75
5299 -75 124 69 -110 -54 100 52 -89 -61 55 68 -38 -94 41 105 -24 -131 29 140 -45 -127 43 133 -34
5322 -34 -88 41 103 12 -95 -18 104 66 -85 -49 124 68 -112 -56 132 64 -95 -45 92 63 -62 -88 45 95 -56
5347 -56 -110 38 121 -54 -136 43 122 -57 -123 39 112 -30 -92 -10 104 37 -91 -32 129 63 -112 -30 155 77 -111
5372 -111 -30 125 62 -75 -26 73 83 -53 -89 45 120 -40 -124 55 119 -65 -132 57 111 -58 -117 28 89 0 -108
5397 -108 -25 113 42 -121 -41 129 41 -136 -39 140 48 -98 -33 118 59 -80 -59 79 110 -56 -109 61 132 -69
5421 -69 -115 94 119 -61 -112 53 100 -30 -103 1 101 0 -125 -42 131 28 -140 -34 140 27 -134 -37 119
5444 119 36 -102 -60 79 87 -75 -95 71 116 -80 -107 102 125 -78 -116 78 114 -51 -97 41 109 -12 -113 -8
5468hJ40j16j55J17J62j22j68J30J50j23j32Q6J35l8j51J6J57K0j83l2K03K0k20
5491a12j4K22Lj84k3J79L5j40n5J17J06j25j44J35J51j28j64J48J55j55j46J32
5513gJ30j03j28M9J65m6j66%K15j2k07j2K29mk11nK06j2j56k4J39O8j36r3J27
5538FJ53j62j43J55J66j69j49J70J25j41j27R8J42o8j64N1J66k3k04J5K18nk44
5561a34J5K30l2k00J1J77L3j70n4J44J08j60j32J93J38j81j49J87J40j66j44J46
5583@J50j32j30Q4J61n5j93L3K07l3k27M3K24n3k06L5J96kk03j1J69N9j85p9J81
5608C3J00j83j13J91J26j93j15J82J16j43j30J30J38j03j62Q6J77n1k15N6K36
5629A63p7k23N4K22m4k09J8J88Lj75m1J89O5j94r4J97J18k10j12K02J03j86j01
$$ plain form
5468 -8 132 16 -139 -22 140 18 -150 -20 130 7 -125 -39 96 58 -93 -77 80 100 -83 -115 88 108 -112
5491 -112 -126 96 99 -85 -108 71 106 -34 -89 28 134 9 -135 0 151 23 -141 7 162 7 -139 -7
5513 -7 123 20 -108 -59 106 60 -106 -106 109 97 -110 -122 107 103 -108 -113 93 81 -75 -99 40 108 -28 -121 6
5538 6 159 -3 -146 9 175 6 -143 27 152 11 -116 -18 124 56 -108 -57 109 86 -118 -103 115 110 -134
5561 -134 -119 111 79 -121 -110 67 100 -70 -124 20 128 -32 -164 29 167 -14 -163 24 164 -2 -146 0
5583 0 150 18 -112 -28 133 78 -115 -82 125 92 -135 -92 132 79 -127 -92 104 102 -101 -112 57 116 -69 -148 33
5608 33 133 -50 -163 28 154 -39 -154 28 144 1 -129 1 139 36 -126 -40 137 86 -129 -73 163
5629 163 86 -137 -83 139 95 -114 -96 92 95 -80 -121 68 133 -61 -155 42 160 -50 -162 40 143 -43 -144
5652a44J63J20j29j37R6J72q8j85Q1K04p6k26Q0K21q2k11P4J98l6j93NJ86K6j85
5676f6o4K00Q8k22q7K20Q1k09q1J90R0j76j05J40J24j09j58J06J91r9k24J13K24
5699A67j19k02R4K03q5j86N6J74oj85k0J93N9k13o8K19P8k40n1K21M8j96p9J81
5723D3R2j51j19J36J42j15j97J32J95j14k02J26J93j14k01J08J74p0j61J1K01
5744A09jj94l1K14L6k18n4K28N1k21n9K03P8j80q7J58J22j55j42J41J60j32k03
5767a77J47K04j39j93J32J73j14j78P8J71k2j96J0K14Ok37j3K43J1k39nK30K1
5790A27k05m1J82P0j57j02J48J45j70j56J73J65j56j81J50J80j47j68J16J65q2
5811E6j65L3J96k5k09j0K32J2k35j9K44Ok38nK13L0j80p5J77R7j53j26J72J47
$$ plain form
5652 -144 19 139 10 -127 -31 141 53 -132 -51 153 77 -149 -69 152 70 -141 -67 131 95 -98 -93 93 119 -66
5676 -66 -130 70 158 -64 -151 69 150 -59 -140 50 140 -36 -141 -1 123 14 -144 -38 153 54 -170 -57 167
5699 167 48 -154 -60 143 58 -128 -72 102 96 -89 -109 84 143 -70 -138 81 159 -81 -132 89 137 -59 -138 43
5723 43 135 -16 -135 1 143 28 -169 -37 158 44 -158 -32 161 47 -154 -46 128 58 -103 -92 109
5744 109 108 -86 -117 97 133 -85 -139 89 140 -81 -140 63 141 -39 -126 32 154 -1 -143 -2 158 26 -177
5767 -177 -30 174 35 -158 -26 147 33 -145 -67 104 82 -114 -104 110 116 -121 -134 109 120 -119 -124 106 127
5790 127 -78 -119 63 133 -24 -126 22 167 -3 -159 14 179 23 -158 -8 172 25 -143 -27 138 56
5811 56 -109 -76 120 95 -114 -124 108 120 -115 -134 110 116 -122 -127 86 116 -64 -139 38 135 -18 -144 28 175
5835A75j70j70J69J75j68j63J61J47j30j40O6J71l5j96K0K15j6k29LK40j0k38
5857a23J1K23Lk11k2J75O1j77q8J73J25j78j37J86J43j78j55J87J44j66j26J21
5879iJ45r1j66P5J80m1k18N1K20m4k25K9K29k7k20J9J85J2j71n9J75P9j70j11
5903a53J85J16j77j35J80J39j75j36J60J23j21j36R1J60o6j84N0K11m7k14M4K32
5925A47m3k24M1K00j0j90j4J76L8j68q5J75J11j81j31J97J14j97j11J87J10j58
5947a6j15J08J38r5j62P7J85o2k02O2K13n4j99N7K04m9j90K4J73Rj78l8J80O0
5971A30j78r2J94J00j93j07J87J05j90r5J51J12j21j31R1J53q0j77O5K01o5k04
5993a44N6K19p2k02O9J78k7j64nJ76K2j63n7J81Q7k05q6K02R6k12p5J72R1j46
$$ plain form
5835 175 5 -165 4 179 11 -152 9 156 26 -114 -48 123 88 -108 -88 127 111 -118 -115 125 115 -123
5857 -123 -112 111 114 -97 -119 56 117 -60 -148 25 150 -28 -165 21 164 -14 -169 18 162 -4 -130 -9
5879 -9 136 45 -121 -46 134 93 -125 -74 146 102 -123 -94 135 108 -112 -93 92 104 -67 -126 49 128 -42 -153
5903 -153 32 148 -29 -164 16 155 -20 -156 4 127 6 -130 -39 121 55 -129 -79 132 85 -129 -85 147
5925 147 104 -120 -79 121 111 -79 -93 83 121 -47 -132 43 154 -27 -158 39 153 -44 -155 32 142 -16
5947 -16 -131 -23 115 20 -142 -65 120 58 -144 -82 131 77 -122 -65 139 90 -100 -76 97 106 -72 -110 70 130
5971 130 -48 -140 54 154 -39 -146 41 146 -44 -139 12 124 3 -128 -37 116 36 -141 -76 125 60 -144
5993 -144 -88 131 59 -143 -74 104 77 -87 -92 84 106 -57 -114 67 154 -51 -137 65 161 -51 -126 46 137 -9
6017ij10J28J08q6j67Q8J76q5j89R1J95p8k04P1J86n3j74L1J74kj78k2J90L4j84
6042f9q0K19P1j98o8J92P6j92o9J63Q2j22j12J03J45j01j66R4J85j03j88Q3K12
6065A57j10j94Q6J56k0j87K3J73J3j80l9J90N5k03n4K05O2k17n2J79O5j38r0J29
6089IJ21j21j33J16J59j15j76J13J80j10j75J04J67q4j63N0J58k4j73J0J64K4
6111A01j95k9K05M1k11m6K07M2j79n6J60P9j45j02J28J34j25j55J31J73j29j64
6133a35J20J52r5j63Q3J71q0j51K9J67nj95RJ97J1k05j5K04J6j99k5J80L4j66
6157f1o7J55J03j56j18J41J44j41j66J50J65j48j38J21J46r9j44O8J63m5j76K8
6179g5J92rk08PJ98kk03MJ94J7j96k7J67O7j73q2J52J13j52j40J65J37j64j30
$$ plain form
6017 -9 -119 9 117 31 -136 -48 128 43 -146 -55 140 62 -142 -71 115 62 -112 -81 93 91 -87 -109 81 115 -69
6042 -69 -149 70 141 -57 -125 67 143 -49 -118 45 127 5 -107 -4 141 40 -126 -32 153 50 -138 -55 157
6065 157 47 -147 -61 95 75 -112 -89 84 97 -83 -122 68 123 -80 -134 71 133 -84 -136 43 108 -30 -120 9
6089 9 130 9 -124 -8 151 36 -140 -27 153 43 -132 -28 139 55 -108 -58 100 76 -97 -87 77 101
6111 101 -94 -123 82 123 -88 -134 73 115 -64 -120 40 119 -26 -128 0 134 9 -146 -15 158 29 -135
6133 -135 -15 137 42 -121 -38 133 53 -98 -69 98 93 -102 -93 104 115 -90 -105 99 115 -84 -109 71 105 -61
6157 -61 -128 27 130 -26 -144 -3 141 0 -166 -16 149 1 -137 -16 130 31 -113 -45 118 73 -103 -75
6179 -75 117 108 -100 -93 105 103 -100 -96 98 115 -81 -108 59 126 -47 -129 23 136 -16 -156 9 146 -18 -148
6203a48J35J47j32j35J06J45p6j64O6J67l5j94L8K01l5k00L0K05k4j85NJ70K7
6226A14j70m7J61P4j65j11J73J26j77j34J73J35j68j30J46J05j01j42R1J62o9
6247D6j70O0J90n7j97L3K23n5j97M3J89j1j95QJ77J9j58o5J82P2j80q7J76J03
6271A49j94q7J62J08j57j02J19J18r2j53Q7J59p7j74O1K00p1j97P2J85n0j93N4
6294g3J57jj67lJ51M8j65p2J90P1j83q1J98O8j64r7J55R9j38j10J25J14j04j42
6318a24Q4J68q7j64O8J88q2j85P4J68n0j72L4J70j1j59k2J61N8j92n8J94N9j91
6342g1n5J79O4j57q8J60Q9j20j11J12J37r4j66J01J63j16j69J03J77r7j50N7J53
6365A01m0j47J7J57Rj83l3J99K7j98k4J93L2j85m6J74M9j35p5J26J03j10j39J31
$$ plain form
6203 -148 -13 134 2 -133 -27 118 42 -122 -56 111 76 -118 -80 121 86 -114 -84 121 97 -88 -83 87 114
6226 114 -56 -103 58 132 -33 -144 29 155 -22 -156 17 152 -16 -146 0 105 4 -138 -47 115 46
6247 46 -124 -64 126 69 -128 -95 128 73 -124 -81 108 97 -98 -90 87 106 -52 -117 65 137 -43 -130 46 149
6271 149 -45 -132 30 138 -19 -121 -2 116 24 -129 -42 117 40 -134 -73 127 56 -141 -69 116 66 -127 -73
6294 -73 84 83 -84 -87 64 112 -53 -125 65 136 -47 -128 70 138 -26 -123 32 131 -7 -117 8 122 18 -124
6318 -124 -40 128 41 -123 -55 133 51 -134 -60 108 58 -114 -80 90 79 -80 -102 59 117 -75 -133 61 120 -71
6342 -71 -126 53 117 -40 -128 32 121 1 -110 2 139 45 -121 -20 143 27 -142 -39 138 41 -109 -52 101
6365 101 61 -86 -69 88 97 -86 -119 80 107 -91 -115 78 110 -75 -121 53 102 -33 -108 18 121 11 -128 3
6389CJ36j16j56J27J47j10j49J04J42q0j35M3J35j7j56NJ60Pj83jJ79K0j96j9
6413a10J79K2j49n0J41P0j31q6J35R8j26j19J28J38j32j30J18J33j04j30Q8J35
6435A18p4j29L6J59k6j74J0J83pj87LJ82%j82MJ56J3j42m6J26Q6j36j02J36J13
6460A20j36j20J40J21j27j17J28R8j06j12Q0J39n3j46L1J76l7j81L4J86k5j75
6482h2J1J65oj57nJ40K4j27o0J28Q7j37j04J43J05j46j00J37R3j33r1J01J03o6
6506B3j35O6J49n7j44M6J57l8j69L5J80m1j51K7J35J2j47j7J29M0j26p0J41Q0
6530A25j60p2J45P9j38q4J20P9r7q2P7J06o7j38O2J38m8j55M8J70o4j43M5J52
6554I8l5j32RJ30J4j43k3J31N4j37o5J39P9j57n9J48O2j24q7J14Q5j03r2P7J16
$$ plain form
6389 3 139 23 -133 -6 141 31 -118 -14 128 48 -87 -44 91 74 -82 -77 83 90 -93 -94 85 105 -91 -110
6413 -110 69 91 -58 -108 33 103 -28 -114 21 119 -7 -126 2 140 8 -122 -4 129 25 -105 -17 118
6435 118 44 -85 -49 110 84 -90 -80 103 96 -91 -88 94 94 -88 -84 72 85 -57 -103 23 109 -27 -129 7 120
6460 120 -16 -136 4 125 -2 -119 9 107 1 -111 -31 108 55 -91 -60 116 79 -102 -68 118 93 -82
6482 -82 -71 94 88 -69 -74 66 90 -37 -97 31 118 -19 -123 20 125 -21 -121 16 109 -24 -115 -14 89 23
6506 23 -112 -46 103 46 -98 -52 105 67 -102 -67 113 72 -79 -52 83 95 -52 -69 60 100 -26 -96 45 125
6530 125 -35 -107 38 117 -21 -105 15 94 -3 -85 -8 98 31 -107 -45 93 45 -110 -62 108 44 -99 -54 98
6554 98 63 -69 -60 70 84 -59 -82 49 103 -34 -99 40 119 -38 -97 51 113 -11 -98 16 101 -2 -94 -17 99
6579I9p4j34Q0J44p7j55P7J28n0j36M7J22rj42KJ42K4j37m0J51N1j61n4J54O1
6604A13j50n1J27O6j11p3J00R0r1j13Q6J33p9j54Q7J36r0j27P3J37p2j10K0J16
6628F3Mj51JJ47L3j59k8J46M5j73k4J50L0j29l5J14P1j07r3R7J04r3j10Q8J31
6653A22r6j20Q3J21q1j19N4J13k2j24OJ33Qj57nJ50L0j72j5J56J3j33l2J24M5
6678H2j15o4J09R2j03j10J09J21j16j09J02J15r1j21J04J00o1j22M7J24l4j20
6700f1jJ51j8j43j2J70oj56PJ34J8j40k9J10O9j09q1J03R9j08j21J33J08j05j32
6725a20J22J09r6j12Q7R4l5j23K4J48k0j56NJ68j7j53jJ65Kj44k6J34L8j22o4
6750i3J19P7j11r2J18Q8j19j00J09J01r6j09R2J06o9j27P3J34l7j45L0J57k6j61
$$ plain form
6579 99 25 -109 -29 115 38 -117 -40 88 38 -98 -51 71 62 -80 -78 64 88 -49 -89 62 113 -48 -102 52 113
6604 113 -37 -88 39 105 -6 -79 21 111 20 -93 -7 126 47 -107 -20 116 26 -101 -28 109 37 -73 -53 63
6628 63 67 -84 -83 64 97 -62 -90 56 101 -72 -96 54 84 -45 -80 34 105 -2 -95 2 106 13 -97 -9 122
6653 122 26 -94 -11 110 29 -90 -36 77 55 -69 -63 70 78 -79 -84 66 96 -76 -91 65 78 -55 -87 37 82
6678 82 -33 -97 12 104 1 -109 0 121 5 -104 -2 113 22 -99 5 105 44 -78 -31 93 59 -61
6700 -61 -62 89 71 -72 -84 86 80 -76 -69 65 83 -57 -86 24 93 -16 -97 6 105 -3 -124 9 117 12 -120
6725 -120 2 111 15 -97 -10 84 49 -74 -50 98 78 -78 -73 95 78 -75 -76 89 91 -53 -79 55 93 -29 -93
6750 -93 26 103 -8 -100 18 106 -13 -113 -4 97 1 -108 -16 90 21 -106 -33 101 64 -81 -51 106 80 -81
6774h1J6J67l1j38J3J44Mj38k6J17M6j21o1J28P6j33j01J41R1j36q3J11Q9j05
6798a1q9Q1J13p4j31N6J45m2j57N7J51l6j60L7J38j2j44K4J31nj18l1J20O1j37
6823c3n7J42O1j41p0J38O4j22q7J13P4p5j03O9J20o5j41N4J59n6j55N6J53m8j42
6848i2L3J45k5j34nJ35L6j47m6J52N2j55n1J53O2j40p6J35P7j13q2J02P9p4j11
6873i0P0J24o7j36O1J37n8j40M9J35n0j31L1J26Rj44j0J37L3j49l7J59N4j58n6
6898a01J56M9j28o2J20O9j10r3R6J12q6j27R0J34r5j33P8J36o8j47N8J23k6j34
6922h9K3J37j0j45pJ55K2j63l8J60M1j44m0J41N6j45n3J23Q0j10j00J12J15j06
6946A5j29J06J29j03j21R1J15o2j37N6J25k8j35KJ50Pj65j5J65K2j67l1J68K4
$$ plain form
6774 -81 -65 102 71 -67 -54 90 94 -44 -70 47 93 -28 -89 39 115 -18 -119 22 113 -23 -106 5 94 -11
6798 -11 -100 -19 94 20 -111 -55 90 48 -109 -52 99 63 -97 -60 78 66 -78 -54 77 72 -46 -77 43 104 -33
6823 -33 -90 52 113 -28 -98 40 104 -18 -105 8 82 7 -96 -27 93 28 -113 -59 100 44 -111 -55 98 50 -92
6848 -92 -59 86 61 -73 -78 57 93 -54 -100 52 104 -51 -102 51 113 -27 -103 32 109 -4 -86 16 95 21 -90
6873 -90 -20 104 37 -99 -38 99 41 -99 -50 85 35 -96 -65 61 70 -74 -84 53 86 -63 -100 59 113 -45 -101
6898 -101 55 104 -24 -86 34 103 -7 -100 -4 108 22 -105 -15 119 24 -109 -31 105 37 -110 -52 71 45 -89
6922 -89 -66 71 61 -84 -91 64 86 -77 -115 45 86 -58 -98 43 99 -46 -99 24 104 -6 -106 6 121 15
6946 15 -114 -8 121 18 -103 -12 103 41 -96 -40 85 57 -78 -76 74 81 -84 -99 66 88 -79 -110 58 82
6970H2j39l6J20O2j34o8J13J05j19j09J23J30j33j14J19J27j01j29P9J40p6j23
6992h1L7J42k7j57K3J65jj78nJ55J3j52j9J42L2j45l6J17P4j27q7J31Q9j12j09
7017a16J23R8j14j12J22J00q2j18O9J32n7j39N0J50l7j61K2J76m2j52K1J52nj38
7041e8l1J47K9j25o4J35O7j35p6J31Q6j28j02J41Q6j17r9J06J11q8j11O4J31n4
7065D6j38M1J58m8j54L5J56k4j51K2J39J1j59j5J28M9j28p4J42O9j45p4J48P2
7089A06j32q0J20Q5j06j07J02J07o4j35N3J46n7j43N3J47n2j39M0J52l4j38J2
7112f4J37Pj35k5J40M9j54n0J46O0j41p0J30P7j26p1J04Q6r9r7Q5J06p2j34P3
7137c8J35o2j43O4J45n3j31J8J36nj43QJ25K4j36m4J55M4j44n3J38O8j31o5J28
$$ plain form
6970 82 -57 -93 27 89 -45 -113 0 105 -14 -123 0 130 -3 -117 2 129 28 -101 -22 118 42 -81
6992 -81 -44 98 71 -86 -63 102 101 -77 -82 73 86 -66 -85 57 89 -56 -92 25 99 -28 -115 16 105 -7 -116
7017 -116 7 105 -9 -121 1 101 19 -99 -30 102 45 -94 -44 106 69 -92 -70 106 64 -88 -67 85 80 -58
7041 -58 -89 58 87 -38 -102 33 100 -35 -111 20 106 -22 -124 17 103 -14 -113 -7 104 16 -95 -31 100 46
7065 46 -92 -51 107 59 -95 -60 96 72 -79 -57 82 93 -66 -81 47 96 -32 -106 36 105 -40 -114 34 106
7089 106 -26 -106 14 99 -7 -114 -12 95 31 -104 -51 95 38 -105 -52 95 43 -96 -56 96 62 -76 -64
7112 -64 73 80 -55 -80 60 109 -45 -95 51 111 -30 -100 30 107 -19 -90 14 100 1 -96 -11 95 23 -111 -38
7137 -38 97 35 -108 -44 101 48 -83 -65 71 66 -77 -69 56 80 -56 -100 55 99 -45 -98 40 108 -23 -88 40
7162D0O3j07r1R9J03r2j17Q1J31p7j42P5J36p5j27N3J33l9j30L7J14nj27k9J56
7187F3J9j41m1J62L1j43m5J42M4j22n4J09P1q3j01Q4J19q4j27R5J18p0j42Q2J06
7212I2n4j22M2J27l6j31J9J38kj38j8J41J6j49j8J48L4j45l1J23L9j05n1Q8R2
7237I9r5j02R8R9q0j20Q7J23q3j12P6J01m7j08K9J16j4j32QJ44j3j38oJ46Rj39
7263e4k5J33K6j19n3J03P2r9p6R8R1r7j05J10J01r4j03Q9R7p3j01N4J22n1j16
7288g0K0J38k1j28kJ39Pj49nJ49Lj40k1J24M0j14n9J00P6j01r3J13Q8j01j09J24
7314HR2j03r0P7J02n0j24N2J18k6j32J7J47j9j52K0J50j3j34QJ21J5j12m0J05
7339C7N5j09o1J12P6j21r4J18Q7j02r9R6J02r3r1O7J03n9j09M6J25l5j35K8J45
$$ plain form
7162 40 103 -4 -95 4 107 15 -102 -21 110 33 -109 -34 102 27 -100 -47 86 47 -83 -46 68 63 -64 -93 63
7187 63 82 -59 -100 62 93 -50 -95 47 91 -31 -85 24 95 12 -89 -5 114 30 -97 -2 116 46 -96 -14 92
7212 92 38 -84 -42 85 49 -82 -63 75 73 -65 -83 58 74 -75 -93 55 89 -56 -87 36 75 -30 -81 7 99
7237 99 4 -98 0 99 19 -101 -14 109 26 -86 -10 91 44 -64 -35 81 67 -65 -57 87 74 -64 -70 76 85 -54
7263 -54 -79 54 80 -39 -92 11 83 -16 -92 6 97 0 -105 5 106 12 -91 -2 95 22 -79 -25 97 46 -70
7288 -70 -50 88 67 -61 -63 76 83 -66 -71 78 81 -59 -80 44 84 -30 -89 11 87 -14 -107 6 94 -7 -116 8
7314 8 100 -3 -93 -16 86 36 -88 -36 82 56 -76 -59 88 69 -83 -63 87 74 -60 -52 69 84 -28 -68 37
7339 37 92 -17 -78 34 110 -11 -105 13 100 -2 -101 -5 97 4 -87 -20 83 24 -85 -39 86 51 -84 -56 89
7364H9k0j48J5J44oj35MJ22K8j24l6J11O6j24p3J11P9j19p7J16P6j12o8Q5Q7o7
7390B4j19O0J22l9j45N5J22m0j23L0J43l0j30K2J15Lj21j8J23K5j07n3J37M7j23
7415b0o5J19O9j20o7J09P7j01q5Q6J02p5j17P1J07n6j20M6J34m7j40M6J20j5j26
7440f8RJ07K5j33k1J33L7j19o4J40M7j20o1J29N9j01q1R3Q2p2j09Q2J07n8j33
7465i0P4J20o4j22M5J28m8j21L0J08Jj28rJ30J6j24l7J44K9j34m9J35N4j26n5
7490i3J15N9r9p4R0J07r2j03P7J20p0j38P6J31o0j42O4J12k6j25K3J17oj24rJ25
7516E5L7j49k9J39K2j22m8J31O0j35n6R6Q5q0j06J01R7q5j18R3J15o6j37P5J26
7541A01o5j17M4J30m1j22L0J24qj34qJ39J9j41k6J31K1j20m1J18O1j18p1J03R6
$$ plain form
7364 89 69 -79 -64 80 74 -61 -57 65 93 -31 -67 44 110 -14 -87 24 103 -16 -93 23 99 -13 -81 4 91 24
7390 24 -95 -35 87 48 -97 -42 80 40 -83 -53 90 60 -70 -48 67 70 -51 -69 54 79 -28 -81 56 103 -20
7415 -20 -85 34 103 -17 -84 25 102 1 -84 2 104 29 -88 -17 90 34 -86 -40 94 47 -93 -47 73 58 -68
7440 -68 -59 48 73 -60 -81 52 89 -30 -94 46 93 -27 -88 41 100 -1 -82 11 93 21 -88 -6 101 43 -90
7465 -90 -16 104 40 -82 -37 91 43 -78 -48 60 61 -67 -76 54 70 -54 -91 53 82 -52 -101 34 88 -38 -93
7490 -93 22 81 -18 -92 -2 105 13 -90 -13 107 37 -101 -25 106 46 -96 -32 80 54 -71 -48 69 63 -61 -70 55
7516 55 92 -57 -86 53 75 -47 -95 36 96 -39 -95 1 86 6 -100 1 98 13 -105 -12 103 37 -100 -25 101
7541 101 36 -81 -37 93 52 -70 -40 84 76 -58 -66 73 92 -49 -75 56 77 -43 -84 34 95 -23 -94 9 105
7566A05j05j00R4J18j10q9P5J15p9j18P5J14n1j35N8J19j5j31kJ50nj40j8J55
7590H0J4j48j6J28K4j21l8J11N5j11p2J12P5j03r2J00R8q9r9P7J01o6j08N7J09
7615G8l3j27L3J32k6j40K3J46j8j33lJ47Kj36j6J25L7j21n5J16P1j13q7J08R7
7640A07j16r4J14Q1r0j01R9Q8o7r9L7J22m3j31M1J36k4j53K6J43k1j17lJ32jj22
7666e6rJ18L5j07n7J07P9j26o4J11O9j06q0J01Q0o8j07O6R2n2j04M9J14m6j28
7691h9N1J20l6j22J3J41j8j26JJ27Nj16k4J09N5j26m5J23N7j21o1J13P8j18p3
7716h2R6Q4q4q8P1J02o8j08M9J23n8j20L6J29l8j31K7J33k0j12MR6K9j30k7J23
7742C6N1j34m2J19N6j13n9J08Q1j04p0P6Q3p6r2O8J14o8j19O5J26n3j22L9J10
$$ plain form
7566 105 0 -100 -6 112 2 -87 -12 103 24 -94 -19 95 44 -91 -33 86 71 -60 -62 88 83 -57 -75 80
7590 80 94 -54 -70 58 82 -39 -77 34 89 -22 -94 18 93 -10 -102 -2 96 7 -92 -15 86 20 -88 -31 78
7615 78 45 -82 -49 83 57 -83 -60 86 68 -65 -68 79 81 -55 -71 54 91 -30 -85 31 102 -11 -98 10 107
7640 107 -9 -103 11 92 2 -99 0 88 21 -78 -41 81 38 -93 -52 84 60 -93 -67 76 55 -62 -65 67 66 -56
7666 -56 -65 53 88 -19 -76 31 110 -16 -80 31 100 -6 -86 15 95 27 -80 -14 78 26 -78 -29 85 39 -89
7691 -89 -38 82 46 -76 -63 78 60 -66 -65 62 67 -49 -73 36 91 -35 -80 43 100 -21 -82 31 109 -9 -82
7716 -82 14 98 14 -74 -3 99 31 -77 -28 95 37 -83 -47 82 44 -87 -60 73 53 -59 -55 41 70 -60 -87 36
7742 36 87 -47 -89 30 86 -27 -86 22 103 -1 -71 5 88 12 -80 -12 102 34 -85 -20 106 53 -69 -30 80
7767H0m1j07J7J18j3j16oJ12K5j21l1J30L3j27l8J14N1j21l7R5O6r0p4P6Q9p1
7793A3j06Q2J11n8j19N8J03m5r9L8J07k9j21J6J13jj15qJ14L1j42k3J27K8j28
7818e3l1J09N1r9n3Q9O9q2q6Q0R4o7j04P4J04p9r2N7J04n2r7K2J16j4j16MJ13
7845F1Mj15k2J29J9j17k1J15J3j04l1J04N0j09n4R3P1r5q0R1Q0q0r3P7R3o3r2
7872g6O3R3m4r4J3J17j1j23J8J15Mj31JJ18J4j17j3R6L4r9m8R0Q3j13p6J00P5
7899H9q5r3R7Q9r2q2O1R2n6r3M5R6k7j05J1J15mj17kJ30kj14j4J15K2j13k4J03
7927D2L7r6m2Q4O2r9n9Q0Q3q6q3Q5O1o1r3O2Q9m3r4L1R5j9j05J5J14k2j01jJ22
7956E8Nj06k5J06L1j10k0P5N1q2n7R4P0r2p2Q6Q1p6q8P7Q2n7r4M9R7m6r9K4J03
$$ plain form
7767 80 39 -68 -51 67 54 -62 -68 44 69 -52 -83 47 80 -47 -85 29 80 -41 -78 17 83 -7 -81 -5 84 13
7793 13 -93 -11 100 42 -77 -19 84 39 -60 -22 85 56 -65 -49 64 63 -52 -60 54 85 -57 -80 47 75 -53
7818 -53 -84 25 76 -23 -76 13 82 0 -86 -6 88 21 -83 -9 95 16 -76 -19 85 33 -64 -42 74 60 -56 -52 61
7845 61 65 -50 -72 57 76 -41 -62 53 66 -38 -69 35 85 -24 -78 15 86 -9 -89 2 82 2 -91 -14 79 16 -76
7872 -76 -13 80 36 -58 -45 72 61 -62 -44 71 75 -56 -55 63 77 -40 -53 43 77 -22 -70 20 103 -10 -86 14 89
7899 89 4 -89 8 97 5 -77 -16 76 20 -73 -28 68 41 -64 -53 62 58 -59 -61 69 67 -47 -61 54 76 -37 -61 42
7927 42 79 -17 -59 25 87 -12 -71 9 92 6 -77 8 69 8 -85 -23 66 23 -71 -40 55 36 -69 -54 60 38 -63 -64 58
7956 58 63 -43 -68 38 69 -41 -61 14 65 -17 -74 20 90 -2 -74 12 93 17 -71 6 88 31 -63 -14 83 37 -62 -38 65
7985F5k5j02J1J13j9j03NJ03Mq7l1J08K4r0n5J05O0r9q2J11P3j05n4P9Q4p7p8
8012f2O0Q9n3r7M9J02l9j13K9J10j8j21L3R8j9r9LR6J7j02l5J07L1j02m0J05M9
8039G8j05n5R6O8q4p1P2P4o3p6N6Q9l6j13M9J09l8j03K5J09l4j13K9J11j5r2j0
8066d3Q7K3r6m2J11M2j20l6J08L9j04m9R9N1p1o7O8P5o3q5O0J02n7j08N7J05m2
8093D4j08M1J01k1r8J0R5Kq8k6J02L3j17m3J27L3j16l0R3M7r4n3Q9M9o7q1N7R5
8121G6o1q3M7J06n7r7M5J06l6j16L6J01k4r1NJ09Kj12rJ05K4j06l3J07L4j03l4
8148e9J01L6q2p1Q2O4o1q9Q1Q6p7q8N9R4o0j07O3J09m7r9K4J07j8r2kJ06J3j26
8176e3mJ15K7j17k1J20J9j08l7R4N1q0o2P2P4
$$ plain form
7985 65 40 -62 -51 62 43 -60 -55 48 52 -35 -66 42 66 -24 -79 26 86 -13 -95 16 89 -16 -70 9 93 16 -62
8012 -62 -2 87 34 -63 -14 88 49 -64 -35 75 57 -64 -31 67 48 -51 -48 48 65 -37 -72 35 66 -36 -76 29 78
8039 78 -27 -82 14 82 -2 -73 -1 73 10 -66 -10 79 43 -70 -21 88 50 -53 -28 81 47 -66 -37 74 59 -33 -43
8066 -43 44 67 -29 -71 40 82 -38 -74 34 73 -31 -80 19 70 -1 -68 0 75 12 -73 -13 89 32 -76 -19 86 44
8093 44 -64 -23 78 57 -41 -31 64 66 -22 -48 54 87 -30 -73 54 87 -29 -59 34 81 -13 -66 23 72 5 -76 -19 76
8121 76 15 -68 -21 85 28 -69 -24 82 46 -70 -34 67 43 -48 -43 66 68 -44 -53 52 76 -30 -63 44 78 -25 -59
8148 -59 42 78 -4 -75 7 71 10 -79 2 88 11 -77 -18 76 16 -91 -28 81 34 -65 -41 66 48 -44 -46 60 73 -53
8176 -53 -57 58 85 -32 -53 67 86 -22 -59 35 86 6 -56 16 90
8191I0
$$ Imaginary data points
##PAGE= N=2
##DATA TABLE= (X++(I..I)), XYDATA
0@%%%%%%%%%%Qj6J6j6J6k4L2m0M8n6P0p9R7j20J36j57J82k10K42k81L25l67M17
33B23m73N36o07O82p63Q52r53J062j182J313j454J609j780J967k168K386k629
50a379K898l192L518l880M285m740N254n845O526p320Q269r422J0855j2695J5158
65H290j8639K3970l3233N3760j77056J08268L67948l41432l02495K53898L58350
76C01629k45139l44247J84772L78545j58948l75527J09467M01413q6682l97478
86b32195N0454M04205k9090l89860o876L81813L2672l62688p1678L47897J02335
97B26989l30822j41284L18462J68488l05706j95803K92193K12442k73334k28819
107b57194K51837K40670k23923k52105J94569K65132j60649k78830J31966K94042
$$ plain form
0 0 0 0 0 0 0 0 0 0 0 0 8 -8 8 -8 8 -16 16 -24 24 -32 38 -41 56 -64 72 -85 97 -113 129 -152 173 -194 223
33 223 -250 286 -321 361 -402 450 -503 559 -623 690 -764 845 -935 1032 -1136 1250 -1379
50 -1379 1519 -1673 1845 -2035 2250 -2490 2764 -3081 3445 -3875 4394 -5028 5827 -6868 8290
65 8290 -10349 13621 -19612 34148 -142908 -34640 333308 -8124 -310619 -56721 301629
76 301629 56490 -287757 -102985 275560 116612 -258915 -149448 251965 165283 -232195
86 -232195 -181741 222464 193374 -196486 -203362 178451 211123 -151565 -223243 124654 226989
97 226989 -103833 -245117 73345 241833 -63873 -259676 32517 244959 -28375 -257194
107 -257194 -5357 235313 11390 -240715 -46146 218986 58337 -220493 -88527 205515
117B05515j03810l03752Q1120L10847n7795l11129L7100L06413j4172k96374j1535
128a57572K83952L9280k72906o8567K61857R4710k53594j19075K43914J37132
138A89131k34332j51911K20189J62317k02808j71855J81151J81927j57014j93350
148a76555J33660K06586j11134k18161R2174K29063p4398k35206N9533K37556
158A43118m3268k34331K5291K28931m269k22511j8336K16032M1336k10957o3862
169a42826K06525Q2624k02641r7846J95771J08925j85819j18550J71852J27274
179A45289j55017j36531J36235J47271j17125j58799J00295J70327q5617j78783
189a32455P3384J84037o1015j85099M8213J83466l3487j79325J6414J74761K702
$$ plain form
117 205515 101705 -202047 -120927 189920 132125 -179004 -141904 164509 150337 -146037 -157572
128 -157572 126380 165660 -107246 -175813 86044 180754 -72840 -191915 51999 189131
138 189131 -45201 -197112 23077 185394 -17414 -189269 -8118 173809 16795 -176555
148 -176555 -42895 163691 52557 -165604 -73430 155633 81235 -153971 -94438 143118
158 143118 99850 -134481 -109190 119741 115472 -107039 -125375 90657 131993 -78964 -142826
169 -142826 63699 146323 -56318 -154164 41607 150532 -35287 -153837 18015 145289
179 145289 -9728 -146259 -10024 137247 20122 -138677 -38382 131945 46328 -132455
189 -132455 -59071 124966 63951 -121148 -72935 110531 77044 -102281 -85867 88894 91596
200I1596j71571k2169J69870L9521j68867n4523J66745O6676j63098p6599J56520
211C4101Q4681j46273r2956J33097J02964j18873j14096J05445J25759r2938j36299
222a15388Q2211J45200p2584j50553O3455J52260n2666j50906L9475J48475k4129
233F4850j46250P682J44749Q567j44290k3631J44252L6101j43740m5725J40833
244D3398N3303j34753o0580J25961O8700j15375p7904J04217Q8426r3333r9439
255i7379Q4191J09892p6675j17724O9968J22617o2352j24714N3165J24982m1868
266D4103j24315K8617J23849j4161j24395j65J26019J2668j27518k2889J27542
277D9355L1171j25244l8212J20278M5054j12717n2534J03421O1592r3720p1779
$$ plain form
200 91596 -79975 -102144 67726 107247 -61620 -116143 50602 117278 -45820 -122419 34101
211 34101 118782 -27491 -120447 12650 115614 -3259 -117355 -11910 113849 20911 -115388
222 -115388 -33177 112023 39439 -111114 -47659 104601 51935 -98971 -59496 88979 64850
233 64850 -81400 -73718 71031 79598 -64692 -88323 55929 92030 -51710 -97435 43398
244 43398 96701 -38052 -98632 27329 96029 -19346 -97250 6967 95393 2060 -97379
255 -97379 -13188 96704 20029 -97695 -27727 94890 32538 -92176 -39011 85971 44103
266 44103 -80212 -51595 72254 58093 -66302 -66467 59552 72220 -55298 -78187 49355
277 49355 80526 -44718 -82930 37348 82402 -30315 -82849 20572 82164 -11556 -83335
288h3335Q5206Q2029p8065r0851P2041R7575o6266j01676N9869J03375n1811j03380
300g5289M1492J03165k9368j03880J6753J05619m826j07932n557J09985J4078
311F4240j10726k0783J09216K6667j04931l2864R8547M0392r1090m9082Q3824
322A3410N8564p7287o7787P1958P5914o7522q1749O3142Q5085n7532q6434N0040
334b0198Q6900m0770q7391L0184Q8570j9239r0754Q940R3513l85r5847o278R6482
347D3727J1686r4833j6864R1076K2657q5601k9521P9470L7766p3539m6622O8916
359H318N5166o5333o2018O2334O6923n8744o9787N4041P1207m7567p1954L9249
371a8165P3060k9888p5247K0461P8202j2196q1413N279Q3651J34q4471m772Q3150
$$ plain form
288 -83335 1871 83900 5835 -85016 -12975 84600 18334 -83342 -23473 79902 28091 -75289
300 -75289 -33797 69368 40000 -63880 -47127 58492 53666 -54266 -59823 50162 64240
311 64240 -46486 -67269 41947 68614 -36317 -69181 29366 69758 -21332 -70414 13410
322 13410 71974 -5313 -73100 -1142 74772 7250 -74499 -11357 73728 16196 -70238 -20198
334 -20198 66702 25932 -61459 -31275 57295 38056 -52698 -43758 49755 49370 -46477 -52755 43727
347 43727 55413 -39420 -56284 34792 57449 -28152 -57673 21797 59563 -13976 -60598 8318
359 8318 63484 -1849 -63867 -1533 65390 6646 -63141 -9100 62107 14540 -57414 -18165
371 -18165 54895 25007 -50240 -29779 48423 36227 -45186 -39907 43744 43878 -40593 -45365 37785
384C7785R268p9831j4628P5217K1365p0257k9076O6097L7242o2717m4541O0397
396F321N0713n8114n4783N5491N7202n1236n8368M5262N9489l7723o1336K9482
408a7600O3974k1634o7454J4587P0689r242p3265M823P3876j214p2710l011O9721
421C1540Q208o5978j4664O2306K2043n9185k9371N7263L6217n5743m1205N4531
433E962M4830n2106m6652M8368M8216m2863m9742L6282N2066k9212n5323K2421
445a7753N8977j6959o2650J2510O4785r228o5587N678O4311j850o2000l303N8812
458B5743R497n5932j6517N3975K3474n2791k9195N2275L3684n1015l6363M9145
470E980L8295m5392l9463M0371M1418l4116m4176K7915M7780k2480n1671J7911
$$ plain form
384 37785 47053 -32778 -47406 27811 49176 -21081 -50157 15940 53182 -9535 -54076 6321
396 6321 57034 -1080 -55863 -372 56830 5594 -52774 -7512 51977 14254 -47082 -17600
408 -17600 46374 24740 -42714 -28127 42562 33320 -39945 -35122 38754 37540 -35170 -38181 31540
421 31540 39748 -26230 -40894 21412 43455 -15730 -45101 12162 48379 -7364 -48569 5962
433 5962 50792 -1314 -47966 402 48618 5755 -43987 -7705 44361 15149 -40174 -17753
445 -17753 41224 24265 -38385 -25875 38910 29682 -35905 -30227 34084 32234 -29766 -33069 25743
458 25743 35240 -20692 -37209 16766 40240 -12551 -41746 10529 44213 -6802 -43165 5980
470 5980 44275 -1117 -40580 -209 41209 7093 -37083 -9168 38612 16132 -35539 -17628
482a7628N4889j4626n7262J1652N7653q978n6721N008N4454r1n2288n971N0402
495B0493J2386m9275j8502M8983K3838m8776k7378M8284K9837m6111l1266M2769
507E282L3027l7932l5056L2524L8069k7089m1777K2321M5569j8940m8845J6180
519a6667N0427j4078n0807J1173M9545p706m7819K806M5908K879m4717q858M4509
532A6595J4427m4729j8537M5215K1643m4527k3321M2937K4978l9624k6520L5471
544D008K9009l0704l2308K6167L6159k2697m0110J9975M2770j8243m4535J6022
556a4487M4472j3727m3785J0061M2102n517m0907p1M0502N576m0829j0084M1659
569A4965J3833m1806j6082M1682J7958l9850j8903L6992K0838l2713k3514K8712
$$ plain form
482 -17628 37261 22635 -34627 -22975 34678 25700 -31021 -26013 28441 28350 -23938 -29909 20493
495 20493 32879 -16396 -34898 14085 37923 -10853 -38231 10053 39890 -6221 -37487 5282
507 5282 38309 377 -34679 -2155 35914 8825 -32952 -10631 34938 15998 -32847 -16667
519 -16667 33760 19682 -31125 -19952 29593 21887 -25932 -23126 22782 25661 -19056 -27914 16595
532 16595 31022 -13707 -32244 12971 34614 -9913 -33234 9703 34681 -4943 -31463 4008
544 4008 33017 2313 -29995 -3828 32331 9634 -30476 -10501 32269 14026 -30509 -14487
556 -14487 29985 16258 -27527 -17466 24636 19119 -21788 -21859 18643 24219 -16610 -26694 14965
569 14965 28798 -13008 -29090 12592 30550 -9300 -28203 8789 29627 -3086 -26600 2112
581B112K7192k5260l1009K2451L4408k0668l7381J9104L8513j8000l8678J5332
593a1884L7446j1949l6823P233L6222k497l6490k389L7286O646l8415r482L9386
606A4290J1465l8719j2523L7218J4344l4177j6142L1032J9201k7331k2658K4487
618D87K6700k2527l0129K1331L2239k0445l3403J8735L3167j6702l2766J3040
630a0273L1813q886l2035L942L2665K32l4149l708L5437O072l6098p506L5849
643A3355Q768l3986j0027L1486J2512k8148j5440K5495J9351k3207k2903K2032
655g12K6078k1263k8043K0519K8787j9283k8753J6814K8157j3608k8114R300K8431
668A8310n260k9812J362L1241J384l2817l335L3461M462l2980n504L1327P133
$$ plain form
581 2112 29304 4044 -26965 -4514 29894 9226 -28155 -9051 29462 11462 -27216 -11884
593 -11884 25562 13613 -23210 -15977 20245 17748 -18742 -21131 16155 22801 -15614 -25096 14290
606 14290 25755 -12964 -25487 11731 26075 -8102 -24244 6788 25989 -1342 -24000 487
618 487 27187 4660 -25469 -4138 28101 7656 -25747 -7012 26155 9453 -23313 -10273
630 -10273 21540 12654 -19381 -15439 17226 17458 -16691 -20399 15038 21110 -14988 -22494 13355
643 13355 22123 -11863 -21890 9596 22108 -6040 -21480 4015 23366 159 -22744 -712
655 -712 25366 4103 -23940 -3421 25366 6083 -22670 -5856 22301 8693 -19421 -10121 18310
668 18310 13050 -16762 -15400 15841 17225 -15592 -18927 14534 18996 -13984 -19488 11839 18972
681A8972k8733r467K6157J2806k3709j6300K2183J9967k1294k2587K1036K4201
693B3232k0413k4566J9056K4359j6697k4092J3380K4084r600k4929N609K6423
705A5846k523k8434L15K9779Q94l0382j905K9808K927k8355m476K6141O927k3823
719g261j0244K2220J3883k1378j6946K1158J9291k0944k0599K0537K1065j9309
731A473k0779J7017K0581j3684k1062J0025K2309o726k4053M081K5765k299k7149
744a4501J222K7563o43k6834l07K5017K082k2993m766K1234P927k0123j1180J9663
758C361J4083j9827j6122K0176J7044j9918j7110J8647J7059j6365j7313J3531
770b754J8174j0410j9690P572K1736n458k3782M296K5129l724k5362L065K4582
$$ plain form
681 18972 -9761 -19228 6929 19735 -3974 -20274 1909 21876 582 -22005 -969 23232
693 23232 2819 -21747 -2691 21668 4971 -19121 -5741 18343 8743 -16186 -10577 15846
705 15846 13323 -15111 -14796 14983 15877 -14505 -16410 13398 16325 -12030 -16506 9635 16562 -7261
719 -7261 -17505 4715 18598 -2780 -19726 1432 20723 -221 -20820 -283 20782 1473
731 1473 -19306 -2289 18292 4608 -16454 -6429 15880 9154 -14899 -10818 14947 12648 -14501
744 -14501 -13279 14284 13641 -13193 -13500 11517 13599 -9394 -14160 7074 15001 -5122 -16302 3361
758 3361 17444 -2383 -18505 1671 18715 -1203 -18313 334 17393 1028 -16285 -2754
770 -2754 15420 5010 -14680 -7108 14628 9170 -14612 -10316 14813 11089 -14273 -11208 13374
783A3374j920k3171M5K1427K589j9960n816J9138R014j9153j1577J9515J3087
796A6592j9679j3731J9190J3812j7859j3731J5604J4029j2707j5123R844J7009
808A3250p562j9169O155K1070n395k2255N014K2558m594k1850L579K0554j641
821I714j9260j132J8485M180j8425p032J8835R266j9503j0632J9862J1096j9466
834d012j1137J8001J1270j5681j1995J2994J3396j0432j5283Q420J7372p157j9096
847a3340O630K0061o379j9935N825J9050m529j7831K480J6769J72j6229l090J6422
861F076N697j7288p538J8198Q380j8623q645J8139Q710j6860r037J4829R928j2485
875e19j1604J0388J3833q963j6003Q303J7677q054j8367P834J8282p160j7435
$$ plain form
783 13374 11454 -11717 -11672 9755 12344 -7616 -13432 5706 14720 -4433 -16010 3505 16592
796 16592 -3087 -16818 2372 16184 -1675 -15406 198 14227 1520 -13603 -3759 13250
808 13250 5688 -13481 -7326 13744 8349 -13906 -8892 13666 9072 -12778 -9199 11355 9714
821 9714 -9546 -10678 7807 11987 -6438 -13470 5365 14631 -4872 -15504 4358 15454 -4012
834 -4012 -15149 2852 14122 -1559 -13554 -560 12836 2404 -12879 -4459 12913 5756 -13340
847 -13340 -6710 13351 6972 -12963 -7138 11912 7383 -10448 -7968 8801 8973 -7256 -10346 6076
861 6076 11773 -5515 -13053 5145 13525 -5098 -13743 4396 13106 -3754 -12791 2038 11966 -519
875 -519 -12123 -1735 12098 3135 -12868 -4565 13112 5058 -13309 -5475 12807 5647 -11788
888a1788N853J6342l625j5459Q43J5260J945j5760m205J6499N682j7228o458J7410
902E311O536j6873o555J5284O930j3224q119J1107R893r480j2006Q491J4059q137
916C217j5544Q291J6223q270j5896P763J5160o247j4358M148J4062j563j4259
929g273r08J5085K898j6167m113J6994M493j7148m605J6282M732j4805n444J2756
943B777O664j0884q617R356J0718q643j2610Q504J3784q576j4078Q484J3716p660
957B935j2913O263J2318m044j2076J704J2684N47j3708k044J4943K826j5729l030
971i324J5839K991j5191l211J3703L901j2016n513J0398P505r551r664R184J1313
985A0364r344j2352R508J2543r353j2077Q518J1375o752j0903M597J1127k265
$$ plain form
888 -11788 -5935 10407 6782 -8677 -7834 7426 9371 -6389 -10594 5905 11587 -5641 -12099 5311
902 5311 11847 -5026 -11581 3703 10633 -2591 -10710 397 10290 810 -11196 -2705 11354 3217
916 3217 -12327 -4036 12187 3917 -11979 -4216 10944 4697 -9661 -5513 8549 6986 -7273
929 -7273 -8181 6904 9802 -6365 -10478 6516 11009 -6139 -10744 5538 10270 -4535 -9979 2777
943 2777 9441 -1443 -10060 -704 10014 1371 -11239 -2735 11049 2473 -11605 -3121 10595 2935
957 2935 -9978 -3715 8603 4559 -7517 -5813 6871 7418 -6290 -8334 6609 9435 -6294 -9324
971 -9324 6515 9506 -5685 -8896 4807 8708 -3308 -8821 1577 9082 -469 -10133 -949 10364
985 10364 1020 -11332 -1824 10719 1366 -10711 -2193 9182 2430 -8473 -3876 7251 4986
998D986j1779M11J2924R80j3969j546J4721J621j4612j563J3715J879j2286k927
1012g445J0783M445r637o461Q938Q414q983j0062R366J0773r736j0779R485J0323
1026I424q533r876O963R711m890j0042K794J1108j079j2404J73J3581J52j4069
1040f987j19J3852K22j2930o73J1568J768j0149l603R188N623q921p472R112Q693
1055I172r530r302R760R196r486q729Q431Q377o769q426M824R130k998j0258J686
1070d922J1603r62j2670Q72J3123r66j2780Q65J1804k19j0585j069R415K859q818
1085b450m852Q776O488r226p568R711P907r918p715R522P290q373p035O672P415
1100F644m809q291L304R617k248j0899J866J1897j867j2206K020J1769j832j0786
$$ plain form
998 4986 -6793 -6382 6542 7522 -6447 -7993 6728 8349 -6263 -7826 5889 7768 -4518 -7445
1012 -7445 3338 7783 -1854 -8315 623 9037 54 -10008 -642 10131 395 -10384 -899 9424
1026 9424 891 -8985 -2022 7689 2799 -7243 -4449 6659 5580 -6824 -6651 6930 7082 -6987
1040 -6987 -7106 6746 6968 -5962 -6635 4933 6701 -3448 -7051 2137 7760 -1161 -8633 479 9172
1055 9172 -358 -9660 100 9296 -190 -8919 -488 7889 1120 -7306 -2482 6648 3650 -6608 -4922
1070 -4922 6681 5719 -6951 -6079 7044 6078 -6702 -5837 5967 5748 -4837 -5906 3509 6368 -2450
1085 -2450 -7302 1474 7962 -1264 -8832 879 8786 -1132 -8847 675 7965 -408 -7443 -771 6644
1100 6644 1835 -6456 -3152 6465 4217 -6682 -4816 7081 5214 -6992 -4972 6797 4965 -5821
1114e821R79R687M10q897k216Q483M021q715n576R213O397r771o604R825O308
1129G723r245o012Q053N977o397o437M717P543l331q889K675J0186k454j0946
1143f837K641J1154k712j0626K481R692j545q764L0Q213J729q252l431Q666M635
1158G074r380n347R893N341r999n083R311M801q018n087O475N814n002o961L893
1173b275Q371l306r528L299J0238l462j0123L481R560k947q677J914P960l96p540
1188c431j347P731K908q376l956R125M306r619m250R526L948q869l886P639M245
1203E694o278n195N022O543m280p976M062R101m246r632M475R519m373q913L756
1218b721Q194k548p593R34P482Q08p846k212Q575L059r215l340R533L249r250
$$ plain form
1114 -5821 -4842 4845 5255 -3642 -5858 2625 6646 -2069 -7645 1568 7965 -1806 -8410 1415 7723
1129 7723 -1522 -7534 519 6496 99 -6338 -1621 5922 2591 -6298 -3623 6563 4109 -6837
1143 -6837 -4196 6958 4246 -6380 -3899 5793 4248 -4516 -4486 3727 5456 -2796 -6227 2439 7074
1158 7074 -2306 -7653 2240 7581 -2418 -7501 1810 6611 -1407 -6494 -19 5795 793 -6168 -2275
1173 -2275 6096 2790 -6738 -3439 6799 3337 -6786 -3305 6255 3308 -5369 -3455 4505 4109 -3431
1188 -3431 -4778 2953 5861 -2515 -6471 2654 6960 -2659 -6909 2617 6565 -2304 -6190 1449 5694
1203 5694 -584 -5779 -757 5786 1506 -6470 -2408 6693 2447 -7185 -2710 6809 2436 -6477 -2721
1218 -2721 5473 2925 -4668 -3734 3748 4556 -3290 -5502 3073 6132 -3083 -6423 3110 6359 -2891
1233b891l061Q423L098p131l649N771M728m735o108M210P419m224q351M450Q731
1248F680m725q581M629P974l992p356K706P030j141p281l73P908J538q740k166
1263e890R473K306r734k124R425K031q425k261P204L107n975m278N135N694m694
1278I94o941M741P770m999p980N105P597m791p041L878O473k579o380J028O647
1293C522L10p422j282Q240J679q954j631R129J416q680j371P850J771o721k595
1308d739N810L929n167n295N137O514n382p096N711P202n764o825N307O290m324
1323A308n958K857N977j397o516N2P280O94q118j042Q559R45q572q00P997Q62
1339D128o986j391N976K412n142l636M796M978m835n903N246O431n592o314N631
$$ plain form
1233 -2891 -5952 2471 5569 -1562 -5211 560 5288 553 -5555 -1345 6074 1850 -6501 -2051 6680
1248 6680 1955 -6626 -1997 5977 1985 -5371 -2665 4365 3224 -4057 -4430 3478 5016 -3724 -5890
1263 -5890 3583 5889 -3845 -5969 3456 5487 -2938 -5199 2005 5112 -863 -5141 -6 5688 994
1278 994 -5947 -1206 6564 1565 -6415 -1310 6287 1496 -5545 -1667 4806 2227 -4153 -3125 3522
1293 3522 3832 -3590 -4872 3368 5047 -3907 -5538 3591 5007 -3673 -5044 2806 4577 -2144 -4739
1308 -4739 1071 5000 -167 -5462 -325 6189 807 -6289 -578 6624 860 -5965 -658 5632 1308
1323 1308 -4650 -1793 4184 2787 -3729 -3677 3603 4297 -3821 -4863 3696 4641 -3931 -4731 3266 4128
1339 4128 -2858 -4249 1727 4139 -1003 -4639 157 5135 300 -5603 -357 6074 482 -5832 -201
1354b01N942n131n515M150N326k871n606J538O236n27p186q2P979J38q435qQ287
1371D034j26p655j09O716Q22n775j910N109L285m862m499N103N363n442n634N714
1387A34N487n529n081M896M733l832m688K536N039j348n836M77O750k05p486K24
1403c729P761m07p621M96O986k38o112n16N372J702m951k960N035M063n332m701
1419e152N777M918n982m677N799M290n055m073L910M231k700m831J609N636r65
1434B735o540O94P162q38p393J017P026j003o288N11N515L97m906j535M681K773
1450D008m800l691N281M249n679m229N852L979n493l657M761L542l678l850K563
1465h42M507j701n434J188O275j204o858J362O872j574o518J407N838q97n170
$$ plain form
1354 -201 5741 610 -4905 -755 4571 1700 -3906 -2368 3868 3341 -3845 -3927 4052 4190 -4245 -4253 4034
1371 4034 3908 -3747 -3856 2860 3682 -2093 -4003 1106 4391 -471 -4970 133 5496 54 -5580 134
1387 134 5621 92 -4989 -93 4640 808 -3880 -1344 3695 2347 -3489 -3012 3738 3533 -3953 -3729
1403 -3729 4032 3625 -3996 -3500 3486 3248 -2864 -3380 1992 3694 -1257 -4217 818 4881 -451 -5152
1419 -5152 625 5543 -439 -5116 683 4973 -82 -4155 -245 3986 1286 -3545 -1936 3700 2735
1434 2735 -3805 -3111 4051 3213 -4180 -3163 3863 2860 -3428 -2917 2598 2995 -1911 -3446 1235 4008
1450 4008 -792 -4483 798 5047 -632 -4861 991 4970 -523 -4180 581 4123 445 -3405 -842
1465 -842 3665 1964 -3470 -2282 3993 2789 -4069 -2707 4165 2591 -3927 -2520 3318 2421 -2749
1480b749q1M721J302m665k411M997L257n445l562N873L549n844l225N484L000
1495D201m568l022L537L469k448m292J740N190j476n948J471O328j710o335J782
1510b081N823j626n197R05M578Q1m346j248M444K215m835k851N349L093n703k900
1526d299N752K598n185k408M417K647l396l173K609M013k003m935J878N694k086
1541B123n986K318N771k368n301J930M704j234m270J05M061J010m338j989M815
1556A351K432n292k494N488K323n295k074M765K030l860k258K964K956k179l839
1571b982J927M678j914n222K192N420k434n232K483M727k127m214J293L916l14
1586B197m010p38M368J457m969j843N439J792n633j559N349J388m673j485L827
$$ plain form
1480 -2749 -2830 1891 3193 -1472 -3883 1114 4371 -1074 -4636 1237 4786 -1058 -4283 1201 4201
1495 4201 -367 -3389 148 3617 1169 -3123 -1383 3807 2331 -3617 -2146 4182 2472 -3863 -2081
1510 -2081 3742 2116 -3081 -2176 2402 2483 -1863 -3111 1333 3548 -1287 -4138 1211 4304 -1399 -4299
1526 -4299 1453 4051 -1134 -3542 875 3522 126 -3047 -438 3575 1572 -3363 -1485 4209 2123
1541 2123 -3863 -1545 4226 1858 -3443 -1513 3191 1957 -2313 -2208 1853 2863 -1475 -3464 1351
1556 1351 3783 -1509 -4003 1485 3808 -1487 -3561 1204 3234 -626 -2884 80 3036 857 -2982
1571 -2982 -1055 3623 1709 -3513 -1321 4099 1665 -3567 -1084 3643 1516 -2698 -1405 2511 2197
1586 2197 -1813 -2551 1817 3274 -1695 -3538 1901 3693 -1940 -3499 1850 3238 -1435 -2920 907
1601I07J923k922k676K317L637k043m442K154M931k382m939K522M636k385m133
1616b895J865L657r98l482l3L663Q84m132j483M716J645n181j489N314J192n024
1632a781j019M407J172l635j683K977K476k551l395K509M158k761m539L022M480
1647C837l105m185K850L728k207l376J227L304j84l596p01M161J187m661j310
1662c031M988J194m939r53M543Q82l780j132L015J766k417k616K236L364k291
1677H29l998K588M234k965m139L094L690k864l287K163L080j351l230M88L605
1692A937K19m194n91M790O20n072l74M972K52m421l15L756P57l001j459K501K379
1709B756k286l216K424L740k720l900K889L647k882l283K415K890j757k770Q32
$$ plain form
1601 907 2830 -92 -2768 -451 3186 1143 -3299 -1145 3786 1404 -3535 -1013 3623 1238 -2895
1616 -2895 -1030 2627 1629 -1853 -1886 1777 2661 -1471 -2954 1762 3407 -1774 -3263 2051 3243 -1781
1632 -1781 -2800 1607 2779 -856 -2539 438 2914 363 -3032 -523 3635 874 -3665 -643 3837
1647 3837 732 -3453 -603 3125 918 -2458 -1231 2073 1889 -1707 -2408 1753 2940 -1721 -3031
1662 -3031 1957 3151 -1788 -2741 1802 2684 -1096 -2228 787 2553 136 -2480 -244 3120 829
1677 829 -3169 -581 3653 688 -3451 -357 3333 469 -2818 -655 2425 1074 -2156 -1668 1937
1692 1937 2156 -2038 -2629 2161 2781 -2291 -2665 2307 2559 -1862 -2177 1579 2336 -665 -2124 377 2756
1709 2756 470 -2746 -322 3418 698 -3202 -313 3334 452 -2831 -416 2474 717 -2053 -1221
1724a221K952o8l469m56M082N83m562m06M789J65m611N8M182N7l513m58K995J225
1742B324k650k067K675K817k935l246L264L287l458l097L279K712k800k505J959
1757d41K472j071k837K54L387J86l972l14M394J88m466N3M202j01l610q4L017
1774A257O62k514j386K351K196k499k782K875L027l260k958L413K640l292k338
1789b608K775K140k081k305J288K722o86l356L67L965l63m326N52M357o92m023
1805b274O91L476l00k890l30K497J209k400k006K593K539k923k763L189K641l287
1821c38k351K984K029k406j971J632K182r38k711M81L336l58l849M92M161p44
1837A631m077R64L739q87l198N23K753J79k517r56K568J684k870k143L218K258
$$ plain form
1724 -1221 1731 1663 -1806 -2262 1820 2403 -2159 -2565 2224 2389 -2222 -2164 2018 2075 -1438 -1896 1099 2324
1742 2324 -326 -2393 282 3099 164 -3082 182 3469 11 -3086 193 2905 105 -2400 -441
1757 -441 2031 960 -1877 -1623 1764 1950 -2022 -2336 2058 2246 -2220 -2167 2035 1934 -1676 -1760 1257
1774 1257 1919 -595 -1981 370 2566 67 -2715 160 3187 -73 -3031 382 3022 -270 -2608
1789 -2608 167 2307 226 -2079 -791 1931 1245 -2111 -1744 2221 1858 -2468 -1916 2441 1749 -2274
1805 -2274 -1583 1893 1593 -1297 -1627 870 2079 -321 -2327 266 2805 -118 -2881 308 2949 -338
1821 -338 -2689 295 2324 -82 -2053 -421 1761 823 -1888 -1407 1929 1571 -2278 -1786 2375 1631
1837 1631 -2446 -1482 2257 1370 -1828 -1305 1448 1627 -890 -1846 722 2406 -464 -2607 611 2869
1853B869l513k132L477J811l119j664K430J698j695k082J029K618n98l247M99
1868a619L750o26l929R07L765r60l318Q15K854l22k437l37K319J106k468j705
1884b205K848J991l268j987L471J725l423j478K988J318k407j469J690J874j155
1899E13k535Q98L128r19l539J120L650j292l436J343L050j052k579N24K296K54
1915A424k242r73K504J504k865j735L220J675l364j463L211J185k754j147K112
1930B92J338j510j870J077K451r66l026J095L335j349l368J565L109j539k670
1945b036J225K308o13k121q2K241P42k537j161K978J299l293j183L397R36l153
1961a053p72K641Q16k050j151J493J682j194k308J114K830j328l094J568L039
$$ plain form
1853 2869 -644 -2776 701 2512 -607 -2271 159 1857 162 -1920 -891 1727 1129 -2118 -1619
1868 -1619 2131 1505 -2424 -1517 2248 1288 -2030 -1215 1639 1317 -1120 -1457 862 1968 -500 -2205
1884 -2205 643 2634 -634 -2621 850 2575 -848 -2326 662 1980 -427 -1896 -206 1668 513
1899 513 -2022 -1124 2004 1085 -2454 -1334 2316 1024 -2412 -1069 1981 929 -1650 -1126 1170 1424
1915 1424 -818 -1791 713 2217 -648 -2383 837 2512 -852 -2315 896 2081 -673 -1820 292
1930 292 1630 120 -1750 -673 1778 812 -2214 -1119 2216 867 -2501 -936 2173 634 -2036
1945 -2036 -811 1497 884 -1237 -1319 922 1664 -873 -2034 944 2243 -1050 -2233 1164 2100 -1053
1961 -1053 -1825 816 1632 -418 -1569 -76 1606 412 -1896 -782 2048 720 -2374 -806 2233
1976B233j722k743J610K366j245k039O33J974P4k153o33K571R56k973r78L292
1992A223P96l283n49L019M29k509n59J940R58j522j567J308K155j380k638J606
2008e73K791j893k688J960K368j805k033J342J830p05j843O4K149M43k547o51
2024a791L000O37l200m04L178K23k829j69K349M01j833q74J476J459j387k054
2040a818J509K409j819k543K018K345k099k058J817J723j319j646O96J769r7k125
2056a238k72K592M38k961k66L152Q0k962J13K642l1k136k27J730P51j443j386
2073a424J454J908j707k206J954K183k169k036K088J703j836j491J261J433o72
2088D43j684J31K076J68k526j83K872O7k943J78K798k57k352J80J929K39j546
$$ plain form
1976 2233 511 -2232 -622 1744 499 -1540 -907 1067 1141 -1012 -1645 926 1882 -1091 -2069 1223
1992 1223 2019 -1264 -1813 1206 1635 -874 -1433 507 1465 -57 -1624 -316 1839 459 -2179 -573
2008 -573 2218 325 -2363 -403 1965 160 -1873 -531 1299 594 -1249 -1185 964 1407 -1140 -1791
2024 -1791 1209 1846 -1354 -1758 1420 1643 -1186 -1355 994 1395 -438 -1312 164 1623 236 -1818
2040 -1818 -309 2100 281 -2262 -244 2101 2 -2056 -239 1484 165 -1481 -785 984 887 -1238
2056 -1238 -1510 1082 1520 -1441 -1707 1445 1525 -1437 -1324 1318 1287 -849 -1076 654 1405 -38 -1424
2073 -1424 30 1938 231 -1975 -21 2162 -7 -2043 45 1748 -88 -1579 -318 1115 443
2088 443 -1241 -1110 966 1134 -1392 -1575 1297 1364 -1579 -1401 1397 1140 -1212 -1032 897 1136 -410
2105d10p42J410J348j488j788J755J988k043j949K192J661k100j417J701J234
2120A352j215j318O07J580k00k032k8K477j4k771K28K774m12k529M83K159k75
2137H66j701j31J446P20j367j247J546J656j828j780K099J659k176j414K017J138
2153A503j623j048J058J191n65j550K01K002r5k428K09K624m41k560O06K288n93
2170G79j899L45J538J18j328o73J366J184j616j471J932J504k137j358K179J125
2186A588j981q78J534Q70j006j091N59J494l00j937K71K299m11k463O36K364p87
2203G61k055P18J642l75j380j22J282O26j368j089J631J313j946j317K153J077
2219A551k105q22J812P07j365p64Q95J038m87j444L22J925l68k219O08K279q00
$$ plain form
2105 -410 -1152 258 1606 118 -1670 85 2073 30 -1919 273 1934 -166 -1583 118 1352
2120 1352 137 -1181 -574 1006 806 -1226 -1254 1223 1209 -1562 -1334 1440 1028 -1501 -1018 1141 866
2137 866 -835 -966 480 1200 -167 -1414 132 1788 -40 -1820 279 1938 -238 -1652 365 1503
2153 1503 -120 -1168 -110 1081 516 -1034 -833 1169 1074 -1354 -1145 1479 1038 -1522 -916 1372 779
2170 779 -1120 -775 763 881 -447 -1120 246 1430 -186 -1657 275 1779 -358 -1716 463 1588
2186 1588 -393 -1271 263 1133 127 -964 -405 1089 789 -1148 -877 1422 1011 -1452 -816 1548 761
2203 761 -1294 -576 1066 691 -689 -811 471 1097 -271 -1360 271 1584 -362 -1679 474 1551
2219 1551 -554 -1376 436 1143 -222 -986 -91 947 460 -984 -662 1263 895 -1324 -716 1563 763
2236G63k108Q89J791p62j458M18J202P3j199o00J384R23j701j090J983R92k148
2253f48p81K046N57j715m89J272O40q12r66N27J421l95j835N38K091p21k080R13
2271d37J883r27j544P26J244l31j096j77J147O10j406r18J707R39j992p98K041
2288F71N57j920l83J582L38j140n35P61R19n48j329N61J726p16j881R70J850j101
2306C82j609J076J315p96j077L87R86J21j130n46J397P64j745p77J941O08j973
2323f76m23J751K82j401l32R73N73o29r88N07J410n76j706Q01J792r98j675J144
2341a71J423j075j109Q05R11l61r18q3J152L79j453n10J752M49j944k63J915Q6
2359I85j715pJ312J39r18m92O83R06o04j332O88J620r08j678J090J558j173j263
$$ plain form
2236 763 -1345 -456 1335 573 -885 -467 735 808 -391 -991 393 1316 -385 -1475 508 1500 -648
2253 -648 -1429 617 1174 -541 -1030 242 882 70 -896 -369 1052 657 -1178 -640 1451 730 -1350 -437
2271 -437 1446 519 -1025 -299 945 614 -482 -659 488 1098 -308 -1226 481 1420 -572 -1370 671
2288 671 1228 -692 -1075 507 845 -295 -830 -69 850 302 -1027 -466 1260 544 -1337 -367 1483 382
2306 382 -1227 -151 1164 368 -709 -322 664 785 -345 -891 506 1270 -475 -1252 689 1297 -676
2323 -676 -1099 652 934 -467 -799 174 747 118 -870 -363 1047 471 -1235 -434 1358 360 -1315 -171
2341 -171 1252 177 -932 -127 784 423 -495 -578 574 953 -500 -1010 742 1191 -753 -1016 899 985
2359 985 -730 -737 575 714 -204 -696 -13 893 289 -1043 -355 1265 357 -1321 -231 1327 154 -1109
2377a109R98J012o41q92J93R72K03j205m46J526N04j814l63J945J40j857N6J581
2395H03r1j208r2R03M19p30q27P50J193r29j412J179J408j365j237J343J004j145
2413c4q33P57P89l08r46q2J228L31j582l58J838K40j908n2J768l9j473J4J129
2432D79K16q25o00P18J006q11j300J018J416j259j346J405J136j385q73J131P02
2449H28p70p31L79R18p1j260n3J603j6j811J70J838l38j665L83J372k29j054p8
2468e85Q35N14p84r36R26J217j117j335J327J242j409j045J294Q34r94p70O22
2485a64Q04k47j049oJ379O0j673N2J826k73j777M34J572m72j271L19R98lq35l96
2505g22Q98P48j083r58J321J012j510r05J556P17j397n66J057N70o45p52L02J056
$$ plain form
2377 -1109 -111 901 260 -632 -439 533 736 -469 -915 611 1115 -699 -1062 883 1023 -834 -778 803
2395 803 712 -496 -588 315 734 4 -823 -73 1120 191 -1221 -42 1366 1 -1236 107 1111 -34
2413 -34 -867 -110 679 371 -575 -657 571 902 -680 -1038 800 1040 -868 -920 848 809 -664 -650 479
2432 479 695 -130 -730 -12 994 183 -1117 -99 1317 58 -1288 117 1253 -132 -1005 126 828
2449 828 58 -673 -294 624 553 -707 -760 843 827 -984 -814 1024 686 -979 -596 776 547 -507 -585
2468 -585 250 764 -20 -956 -30 1187 70 -1265 62 1304 -105 -1150 144 978 -16 -786 -164
2485 -164 640 393 -656 -662 717 777 -896 -844 982 709 -1068 -634 938 466 -805 -486 512 509 -326 -722
2505 -722 176 924 -159 -1117 204 1216 -294 -1199 357 1074 -323 -889 168 738 93 -659 -357 699
2523F99r8j408N1J684j70j806L40J699m37j481L87J193j90r54j73Q57N33r23q49
2542a046J142R92j388r38J540P84j546n50J371M42j036m65O95O72m09r77K86J329
2560H98l19j589M86J655o52j548O93J295n78j058K72Q76R4q61n17R92P84j236
2578c13r20J452Q65j566o94J490N28j234m63R35N42n82p41L63J094k91j373M05
2596e03J580n76j571P52J413p94j162O40R24l68q12l2Q61L49j087n90J296O35
2614I55j518n95J595M17j503l03J238K98q74m68N85P81m02j095M03J404m81j546
2632a109O92J519p79j319P67J089n61q91K47Q20J03r27m00J122N66j399n81J555
2650E14M10j591k77J422J54j173j96Q50L79n95o97M92J032n18j293P00J397q13
$$ plain form
2523 699 601 -807 -756 928 758 -1048 -708 991 554 -927 -540 653 463 -491 -664 193 726 -197 -1046
2542 -1046 96 1088 -300 -1238 302 1086 -460 -1010 361 803 -233 -698 -3 669 260 -717 -431 898
2560 898 579 -1010 -524 1131 479 -1069 -376 919 341 -717 -445 431 525 -336 -853 139 923 -313
2578 -313 -1233 219 1084 -482 -1176 314 842 -392 -855 80 622 40 -701 -338 756 465 -908 -503
2596 -503 1077 501 -1070 -318 1095 301 -861 -221 703 335 -477 -509 352 701 -386 -976 320 955
2614 955 -563 -1158 437 854 -649 -952 286 584 -290 -758 -173 608 206 -889 -486 918 437 -1109
2632 -1109 -417 1102 323 -996 -229 860 299 -592 -345 475 578 -349 -749 373 939 -460 -1041 514
2650 514 924 -667 -944 478 632 -541 -737 113 492 -103 -800 -308 724 206 -1087 -387 1010 197
2668A97j332R25J153q41r09O00Q07k36q02j25R64L79j192n08J419M53j563l25
2686i36J526J55j347j29J053K12p82m45N67P48n26j045O09J252p72j287R21J195
2704I69r71r85Q77Q05n93p08K72P67M9r31k67J189L37j405k74J513J19j456nJ247
2724E49k2r66j35O97M13n77p28N50J010o81j179Q57J180r90j024R89Q43q32o82
2743g28N58O42k20p38n3R60K27j205k33J412J19j457J5J347r9j148Q9Q55R9o42
2763b00l93N58O97o16r46P62J053r24j039J039Q75j012o85Q21N60n07n75K10P27
2782D05J5r37j32J197R5j353M1J372j63j233K10J020j39p78p8N96L90n83o72O47
2802h0Q97q30r72J005Q83j045p40R73N86p56n18M66N69j84p36k1R85R6j230jJ333
$$ plain form
2668 197 -1135 -210 943 102 -807 -207 600 364 -438 -563 401 780 -412 -920 499 952 -611 -936
2686 -936 590 745 -602 -731 322 534 -248 -693 -126 622 96 -949 -340 912 140 -1147 -226 969
2704 969 -2 -987 -110 695 102 -606 -334 433 482 -449 -716 473 810 -595 -869 644 763 -693 -698 549
2724 549 527 -439 -574 123 536 -41 -769 -219 791 110 -1069 -212 968 -22 -1046 -57 786 -46 -728
2743 -728 -170 472 252 -486 -539 421 648 -557 -790 622 741 -716 -701 646 547 -601 -512 343 442 -200
2763 -200 -593 -35 662 46 -900 -138 915 -9 -1048 -9 866 -146 -831 -10 550 43 -532 -322 405
2782 405 420 -517 -649 548 643 -710 -669 703 540 -693 -483 537 398 -380 -458 138 528 -55 -727 -80
2802 -80 817 -13 -985 20 903 -142 -882 91 677 -79 -597 -131 438 254 -482 -503 482 578 -652 -653 680
2823F80j32j304K37J169k86r25J77P07O1n63l81N87O29p02p92Q95Q18j047p07
2842h79J061N68r70m24P29M13m46n11J76P49k9j006lJ207q5j301K23J238l03j052
2862f45K71Q28j01o47j59N72M26o21o72P67P89r43p65J063O36j052m89R26L77
2881E61o68l72L93N09j77p25Q1R61j12j120K23J192l60j106M21R22l59p10J61
2900b85N69J20n58m06O62O04q24p05R84O76j077n53J034M07q48l51N82M19l45
2919A05n71J57P95r7j012J59J167k95j157M30J021m50q39L80O44j60n41r4N40
2938A82L64o63n22Q41N63j005m84J056L54r95k42Q08K04n46l33L16N35j71p84
2957e22J53J000k56j114L85J078m61r50M40P79l13o12R3N49J78n83m16P51N29
$$ plain form
2823 680 548 -756 -519 650 364 -561 -384 323 384 -179 -560 27 656 -46 -838 57 875 -172 -879
2842 -879 182 750 -220 -644 85 498 52 -459 -283 466 437 -569 -572 635 550 -751 -528 710 407 -645
2862 -645 -374 454 353 -294 -453 119 545 -76 -748 19 808 -135 -900 163 799 -253 -742 184 561
2881 561 -107 -479 -86 423 246 -479 -398 563 451 -669 -446 746 386 -720 -299 623 264 -446 -285
2900 -285 284 404 -154 -560 102 706 -118 -823 161 837 -240 -793 241 648 -200 -551 31 450 105
2919 105 -466 -309 486 389 -623 -464 703 408 -749 -319 702 252 -587 -207 437 277 -264 -358 182
2938 182 546 -117 -639 202 765 -240 -724 332 686 -309 -551 257 461 -85 -418 -102 433 262 -522
2957 -522 -369 631 375 -739 -354 724 263 -687 -247 532 219 -393 -300 249 427 -156 -572 179 708
2976G08r09n18J038M24j050k76R44J72p34j64M72L15l04n12K00P37k40r23L36
2995b84R99m88r35N39P85n07o25L50N12r9n02j57N87L79p53m61R35M47j040l38
3015f56J023K35q86j70O78K29m52l87K96O01k19q22K78R55m05r93N18Q86n58p36
3035e85M96N56l11m64N8M90J60n97l26P55L73r07l21J008J96r55q6P99P8n84j51
3056c18L91L43k55n88K47P82l23r16M33R39n60q13N54O48m41n19K29M68Nn15k36
3077d45O65L48q27l48R57K75r98j45R36L2p28n4N25J68l51l56K70N71k95p41L97
3098a44Q30n23p88N90O64n83n24M38M13k31m14J7M73J96o51k76Q19K66r52j57
3118e37R58O5q53j0O90M3m65j94L28M21k93o19L47P66m52q15N62P44o24o21N75
$$ plain form
2976 708 -201 -719 319 743 -307 -583 361 533 -201 -365 107 422 118 -394 -194 543 303 -620 -284
2995 -284 715 227 -708 -169 616 109 -516 -166 346 247 -255 -412 175 554 -199 -660 275 722 -318 -656
3015 -656 367 602 -284 -454 224 453 1 -386 -90 511 292 -530 -252 703 298 -695 -177 709 151 -585
3035 -585 -89 467 156 -308 -250 240 400 -197 -523 232 605 -302 -623 385 581 -374 -460 339 417 -167 -318
3056 -318 73 416 161 -427 -180 602 279 -637 -204 735 175 -638 -84 564 123 -396 -167 301 306 -209 -445
3077 -445 220 568 -259 -607 350 625 -373 -518 418 450 -278 -332 193 361 10 -346 -76 495 200 -541 -144
3098 -144 686 163 -625 -35 629 46 -478 -40 373 142 -272 -255 218 414 -237 -513 306 572 -380 -537
3118 -537 421 486 -367 -377 313 356 -109 -303 25 446 153 -466 -119 647 195 -620 -58 686 62 -559 16
3139A6M58m26l80J84L98Rm96j74O72K05q18j55R11L9q86P6P57r2n74K8M18J36
3161C06l03l41K95N50l66o82N18O93o17o27O53M94n68l98L98L39j85m03l7N33
3181B52J59p31j63Q55Q5r20K4Q62j09p13J01N42%l77j63L12L82l18n42M51O15
3202F04n63o14O73N04o73l64N66K74l87k64J65L41j4n08r2O93O3q25J4Q45j14
3223C24q01J74O61j45m93J7L60J92l23l78L63N75n02o06O30N64o72m64O69L30
3243D75n10k71L27K84j34l98rN51M9p14j7P93r5q08K10O88k47n57J78L98l0l01
3265a38j62L00L66l71n01N28N19o18m52O79L56o28k53M92K14k90k76J05M10J2
3285B92n95l0P47m6q16J31P82k12o85K28N17j43l77k4L02K21l40l72M26M78n65
$$ plain form
3139 16 474 48 -332 -148 250 259 -237 -411 261 466 -352 -507 404 443 -443 -367 390 298 -276 -248 170 306
3161 306 3 -338 -43 507 141 -541 -23 670 53 -574 79 573 5 -393 5 344 159 -244 -281 252
3181 252 411 -320 -483 372 457 -463 -439 423 314 -399 -298 244 244 -133 -296 16 398 80 -462 -11 604
3202 604 41 -573 100 604 -69 -433 133 407 20 -244 -79 262 248 -260 -352 341 404 -421 -407 438 324
3223 324 -477 -303 358 213 -280 -263 97 289 -34 -412 -49 526 24 -582 48 612 -60 -524 145 475
3243 475 -35 -306 21 305 171 -227 -236 315 364 -350 -367 426 331 -477 -267 421 174 -383 -205 193 163 -138
3265 -138 -300 0 366 -5 -506 22 541 -77 -529 150 506 -122 -375 117 331 41 -235 -130 280 292
3285 292 -303 -333 414 368 -448 -317 465 253 -432 -204 313 170 -207 -231 71 292 -48 -420 6 484 -81
3306h1m45O37L71o58k54N97J58m24j45K50K18p9l84ON60op12J07P43k06p01K57
3328a91N96k61m40J27L34M9l28k24L65L88m68m61O03M29o75l34O67K26n39j90
3348c27M04J73k05k80P2M24j8n81N6O85j64o86K56O07k94m81K49L43j07k72n7
3369b03K64K40l52l51M76L74n81l43O54K52o29j50M98J24l29j77J79K81n6m67
3389b96L3O23j15o92J97O95l03n75L02M47k28l32R5K62J01k93k50L86L34m87l39
3410d35N96K70o30j60N60R3m30p8K69J39j24k74M8M40p0n69J32O20k35n99L13
3431a24M94l04l77K02K98m5k60j34L14K70m10l43N39L18o05k37O17J22n30o9L90
3452A26P5k23j65J00L12n3m59P8N79j83n94K67N35l32m09K89L02j86k16J0K31
$$ plain form
3306 -81 -526 111 482 -176 -430 167 325 -99 -244 6 224 145 -239 -233 327 321 -391 -284 459 253 -448 -191
3328 -191 405 144 -296 -169 165 214 -114 -338 27 415 -53 -514 89 518 -157 -491 176 402 -137 -327
3348 -327 77 250 45 -235 -163 261 243 -338 -282 403 239 -447 -191 416 122 -359 -110 233 126 -146 -203
3369 -203 61 301 -51 -402 74 448 -133 -476 178 430 -199 -349 149 273 -56 -233 -54 227 171 -296
3389 -296 -263 360 245 -447 -250 445 142 -433 -131 316 88 -244 -149 113 214 -79 -329 57 391 -96 -435
3410 -435 161 431 -199 -359 201 294 -136 -214 55 194 70 -204 -156 284 214 -355 -223 397 162 -437 -124
3431 -124 370 66 -311 -109 189 144 -116 -250 64 334 -76 -419 120 438 -167 -404 213 335 -195 -264 126
3452 126 201 -22 -187 -87 225 172 -287 -209 370 187 -407 -140 395 63 -346 -57 245 59 -157 -147 84
3473H4J47k96k50M02K95n34k36N88J62n79o5M70L6l26q0J85J87q9l43O4M82j15
3495A89n68K10N60k92m89L17L86k84k50J39J97J1j99j61K93K59m12k72N27K04
3515C65n63r7N07M3m06k0K51Q1j29k09O2L51q2m73J43N35k43n16L06M21l01l25
3537b99K39K34j08j80m7K18J89l11k50M39K30n15j67N39P8m79lL53Mk10q6J08
3559b4K13n9l61Q3M64j69n02K47M65l23l73L16K53k11j96P4J81P9k50j78L55K42
3581C26m66k03N35J14n09k7M52j3l24lJ85J01r4k46O8L77j28m55K01M71l09l90
3603c37L21K96k97k05J80J54l7j85q0K47J80l64j89M71J56n34n8N11k6l91M2K90
3625A45J3j74j16J07K61j01l80J56M61k67m44L29L57l40k73K83J59j74j29OJ84
$$ plain form
3473 84 231 -65 -315 87 382 -152 -388 200 362 -217 -282 188 224 -102 -182 3 190 101 -242 -178 304 189
3495 189 -379 -169 391 99 -390 -73 313 29 -221 -82 115 126 -73 -234 59 318 -94 -366 161 365
3515 365 -198 -295 212 255 -151 -171 80 161 32 -177 -115 236 154 -319 -176 359 116 -400 -94 327 26 -299
3537 -299 -60 174 66 -114 -161 57 246 -65 -315 124 354 -161 -328 211 289 -190 -193 160 164 -46 -132 -24
3559 -24 189 130 -231 -148 316 147 -355 -108 357 34 -339 -23 230 19 -177 -103 78 157 -93 -271 84 326
3581 326 -140 -343 192 306 -203 -230 222 209 -115 -118 67 168 74 -172 -104 273 145 -310 -109 362 53 -337
3603 -337 -16 280 -17 -222 -42 112 75 -110 -190 57 237 -127 -316 155 311 -223 -281 230 204 -187 -145 145
3625 145 158 -16 -132 -25 236 135 -245 -89 372 105 -339 -10 347 7 -266 17 176 2 -127 -121 63
3646F3R7k72j59L76J66m78q1M97J3m42O1L49n3k22j2J40J30p7k77J24L71j97m17
3669c00K76M06l67l17L51K06k69j60J38J57k3k04r7L04J36m25j05M82N7n01M4
3690b11M42r7l10O5K02K5j13j40J05K70j35l51K18L68k99l32L50K34l17j60K38
3711E2Q9j24j22%J95P4l14q8M10N3m80K4M83r9m01J26K97p2j96j9J41J50j20k71
3735b12J93L26k80l20L45K71l82j88L21J23k38q6J05J11J8k06r2L17O8m00mM33
3757B23o8m14J48L29j49k37J00J56K1j07j61J58K59k38k95L30K80l89k24L97J54
3778B73l41j05K43P1j09j45RK41J3l47MM22o9m34J27L89j62l07J61K17q7j45j6
3801i7J29J42j63k29K50K66l46k17L90J47l72r2L07M2k07o2R4J37k4k40qL56m7
$$ plain form
3646 63 160 -112 -271 105 271 -207 -288 209 222 -220 -159 190 137 -85 -97 43 173 96 -181 -57 314 117 -300
3669 -300 -24 382 15 -302 49 255 -14 -174 -36 121 98 -106 -203 101 237 -188 -293 189 246 -255 -211
3690 -211 231 134 -176 -111 91 116 3 -137 -32 238 103 -248 -30 338 39 -293 57 291 -26 -186 52
3711 52 141 17 -105 -105 90 164 -150 -238 172 225 -255 -231 252 153 -248 -122 175 103 -93 -112 29 179 59 -212
3735 -212 -19 307 27 -293 52 323 -59 -247 74 197 -41 -127 -22 89 107 -99 -191 126 194 -206 -210 223
3757 223 155 -259 -111 218 69 -168 -68 88 109 2 -159 -1 258 20 -275 55 335 -54 -278 119 273
3778 273 -68 -173 70 141 32 -113 -104 137 150 -197 -193 229 160 -274 -147 242 80 -227 -66 151 64 -81 -97
3801 -97 32 174 11 -218 32 298 -48 -265 125 272 -100 -192 115 157 -50 -112 -18 119 95 -145 -153 203 156
3824A56m12J16M10j87l56J92K87j77j90Q4J59K9j40j54K15K11k93k29L67J96m12
3845a28j10L83N6l06j7J86O0q5j50J9K63l4l52P4L88j51l68K05L08k11k36J72
3867c4J49p2j28m2J61J42k21j88L06J91l70j44M04N9l55j6K78Oj74o0P5J66l9
3890I4k76P5L37j18l80J95L51k48k83K42J95j78j18N3J25M5j65j22K34J65l32
3911a09j43L80Q1l77mL14k3k34J8J38N6o0j54L4K52p3l21J52L23k04k92K27K27
3934B08k20j43J43R8l3j07o4J65J19k40j44L28J01l74l4L63l4k89M2J90Kj26n7
3957a06N7J66n7k58J20K93j64k98K23K41k23j77K06R5j21o5J6R4P8j61j16K32
3979G5J30l21n7L14J8l22M8K30n0j58J5P5P3m8j67P5K47j26k90J91K68k43j98
$$ plain form
3824 156 -256 -140 270 83 -273 -81 206 29 -161 -77 82 111 -29 -183 32 243 -50 -279 88 284 -128
3845 -128 -238 145 201 -105 -122 64 124 39 -111 -92 171 137 -215 -141 247 96 -272 -67 241 30 -206 -34
3867 -34 115 43 -85 -127 34 176 -45 -233 73 264 -106 -250 154 213 -142 -158 120 126 -48 -108 -33 133 94
3890 94 -182 -107 230 112 -268 -73 278 30 -253 -11 184 6 -112 -59 66 111 -54 -176 58 223 -109
3911 -109 -252 128 209 -168 -172 142 119 -115 -97 41 97 37 -117 -83 169 96 -225 -73 250 46 -246 -19 208
3934 208 -12 -155 -12 86 53 -54 -118 47 166 -74 -218 110 211 -163 -197 166 132 -157 -115 75 77 -49 -106
3957 -106 -49 117 60 -198 -78 215 51 -247 -24 217 -6 -183 23 118 -3 -68 -52 42 120 -41 -157 75
3979 75 205 -116 -173 141 159 -163 -115 115 65 -93 -78 -3 70 22 -145 -70 177 51 -239 -48 220 -23 -221
4002b21K41J41j89r3J09P5mj11n5J74J03k58r0L25L5l36K9K94p5j94N9J06jn6
4026Hq6K8J73o6k42J27K45j93k25K35J55k24r4J64O6o3q2oJ25P9j99q5K82N0l14
4051a42PL22o2k79Q3K03o0j23pP0R9p1j82R0K29j59k35K07K03k41j33K07O1j30
4075d3m7N3O3L5j19o8J79R0k57m2K94j4k76Q4K23r1j41O4O8L3o6j14Q1J73j24
4100C8k31J90K11k53j78K69J02k20p5J67M1p1q2qJ47N5k24l1K76Mk92N7K73r5
4124G0j94R7J23m6n8m4O2R6n6j87J28J98j92j78K26J37k46o5J83K9j18m9M9P9
4148D4K3j70k0K31jk79M4L00r9k63J36K01j06j27M6R5L6r2j18J33J59j73j82K22
4172D0J62k59j06K31N1j91k0J05M7l4q3k3J48M6k40J6K74n5k79J08K24j21j65
$$ plain form
4002 -221 20 161 -28 -121 -12 63 59 -52 -107 67 170 -88 -178 147 182 -154 -125 169 94 -100 -41 65 64 8
4026 8 -78 -50 123 57 -185 -58 187 -6 -231 4 159 -65 -159 5 71 8 -74 -80 45 124 -75 -160 122 172 -142
4051 -142 -135 187 125 -154 -71 132 72 -51 -58 12 111 40 -142 -52 177 18 -217 -10 193 -48 -181 26 87 -43
4075 -43 -90 -37 26 61 -58 -126 53 143 -114 -156 138 124 -152 -68 155 64 -77 -13 55 88 22 -92 -11 162 38
4100 38 -193 -3 208 -45 -223 46 148 -72 -147 20 61 -10 -92 -100 47 102 -122 -153 123 127 -165 -108 165 70
4124 70 -124 -27 96 50 -8 -52 10 106 50 -137 -9 189 -3 -181 45 182 -64 -129 54 83 -35 -84 -35 44
4148 44 67 -103 -123 108 107 -172 -128 172 73 -190 -54 147 41 -86 -40 55 91 -1 -119 14 173 0 -182 40
4172 40 202 -57 -163 68 119 -72 -92 13 60 26 -57 -80 68 114 -126 -110 164 109 -170 -62 162 41 -124
4195a24R8J08j8r7n0R5J36j61j63K07J53k54j22K81O3k45m8K05M1j27n8L5J35
4218I0nk01J3K48m3k66R5K58j27k09J26J50q5r1NP9P3j00j34J45J59k05j53K61
4242H3J06k71o5K26J9j61k6R9O3l6j35K4K21n2k62Q3K95j30k67J67K10j42j59
4265a10R6J02lj07n7J29J23k00j31K46J10k85p2K46N1k23rJ56K1p6q5K6J50k3
4289G5k03M5K50r5k55J47K30j80j71J59J11p0r9J0J12O6j67r7K24R9k76p0K91
4312A36L4k79QK16qj60k3R4Q6o8j65P7K08q8k43J50K36j86j95J73J56j53r8Q4
4336hR3j1j20m0J56Q4k19p6K62M6k76PK44j8k02J2J44J6q8q0O7J60r8k05J28K35
4362B13j95k07K08J72k01j16J54Q4q2j00K8J16M0j87m1K38J9k56%K65l1k42O2
$$ plain form
4195 -124 -26 82 64 -33 -83 12 148 -13 -176 31 184 -70 -192 89 152 -93 -141 64 105 -22 -80 -45 90
4218 90 85 -116 -103 145 102 -164 -69 189 62 -147 -21 129 44 -47 -42 37 110 10 -124 21 180 -25 -178 83
4242 83 189 -82 -147 79 98 -63 -89 10 73 37 -98 -74 147 95 -167 -84 211 81 -186 -19 191 49 -110
4265 -110 -14 88 85 -22 -79 50 173 -27 -158 88 198 -87 -159 87 138 -85 -94 62 83 7 -78 -52 98 75
4289 75 -128 -83 167 72 -183 -36 194 14 -157 2 113 43 -56 -46 66 132 -35 -132 92 191 -85 -155 136
4312 136 170 -109 -101 115 107 -53 -76 18 104 36 -129 -52 156 68 -175 -25 211 25 -170 3 159 6 -92 -8
4336 -8 85 74 -46 -86 70 154 -65 -141 121 167 -109 -102 142 124 -78 -66 78 94 6 -74 -7 153 55 -150 -22 213
4362 213 18 -189 19 191 -10 -126 28 112 30 -70 -42 74 114 -73 -114 124 143 -113 -113 152 121 -121 -59
4385e9J84m9j15k1R1Q2r6j35J13J93j56j98J83J83k17j18J88R4j58p6Q9R9l0j28
4409e7l7K01L9k54j1K71k5k86P6K33p5j75N0J33mr3p5J13J38j46j66J77J77k21
4433a7j35K25J01k13n8J49P0j00q2K1J37Nk07QK40k8k57P5K34q3k10Q8J60o6j01
4458d4j7J07M9r1j30J46J56j94j42K28J08k24p1J98N3j44n6Q4Q2l1j46K8J87j2
4482A24k52N0K55j03k31J16J79q7j45O7R6mq9o5J28J14j75j18K05J17k43p4K31
4505I6L5j83k8J33L6p0r0M8J31j9k01N2K25q2k26J09J99j26j60J14J13o1q8j3
4529e6J05P4j48j09J97J02k17r5K55M3k41kJ76K2j22m1P5R2n8j44M9J91q1k04
4553a37J13J93j41j70J47J22j05j13O1Q8%j05m7J47P7j84q0K35N9k49k1K22nj64
$$ plain form
4385 -59 125 76 -39 -60 31 113 17 -118 -5 188 32 -166 17 200 -17 -135 53 147 -11 -87 2 101 71 -57
4409 -57 -94 107 146 -108 -119 152 127 -159 -83 150 75 -100 -50 83 79 -14 -89 24 162 16 -150 27 204 -17
4433 -17 -152 73 174 -39 -97 52 122 22 -60 -39 98 103 -104 -96 144 116 -141 -66 168 85 -125 -37 123 57 -44
4458 -44 -61 46 95 4 -126 20 176 -18 -160 68 176 -48 -119 79 132 -12 -68 16 98 67 -79 -51 136 124
4482 124 -128 -78 177 74 -157 -41 138 51 -94 -27 69 65 -24 -89 39 153 -22 -140 65 182 -61 -135 96
4505 96 131 -52 -80 53 89 19 -71 -23 108 89 -112 -60 165 83 -143 -34 165 39 -121 -7 106 45 -43 -56
4529 -56 49 123 -25 -134 63 165 -52 -147 108 151 -90 -92 84 106 -16 -57 18 110 52 -92 -43 148 67 -137
4553 -137 -24 169 28 -142 5 127 22 -91 -30 58 58 -47 -94 53 130 -54 -134 101 160 -89 -110 112 107 -57
4577e7PJ12K6o9q6O2J39p2j82J03J91j43j85J62J53j52j21J09R4n6j04NJ01N9
4601I6j61o1K15M1k39lK34k4j97K3J65j5j03l3Q4Q0n4j51R1J84j28j81J53J64
4625A80j70j35J45R9j04p4M1Q2pj07o4J78N4k24l0K33jk19L7K00m1j45OJ21L3
4650H8q0j02Q2J53j15j61J49J64j81j29J70J06j57p3J09N7l1r3pJ26M3k00k1K02
4674I9J2k26J5K18m9j70K9J40oj00m5Q0J10q5j44J24J57j49j51J70J23j64q2J28
4698C4P2q5o9K9R3J5j47k3J70K3k23QK23l1j89L9J48k8j12qQ4N5p1j24J01J42
4724A26j24j58J60J45j83j00J63Q4j25o9Q4P2j9j07k9J67K6j99j1K21j6k19L2
4747g9K05n0j53K5Q9K6j00m7P6J16j06j48J48J46j71j38J89J01j69o8J20P1o2
$$ plain form
4577 -57 -50 62 88 19 -67 -5 134 62 -120 -17 174 31 -154 8 161 9 -112 -3 91 35 -69 -64 37 96
4601 96 -65 -126 89 130 -109 -112 122 98 -99 -76 89 74 -29 -62 22 102 48 -103 -12 172 44 -137 16 180
4625 180 10 -125 20 119 15 -59 -18 64 57 -50 -114 64 118 -106 -136 97 96 -123 -86 114 73 -72 -66 55 88
4650 88 8 -94 -12 141 26 -135 14 178 -3 -132 38 144 -13 -86 23 80 49 -44 -51 75 118 -82 -103 99
4674 99 111 -115 -100 118 69 -101 -72 68 62 -38 -83 -3 107 22 -122 2 159 10 -141 29 152 -12 -94 34
4698 34 106 21 -48 -19 74 89 -58 -81 89 112 -111 -103 120 89 -100 -61 87 59 -53 -61 23 78 7 -117 -16 126
4724 126 2 -156 4 149 -34 -134 29 113 -12 -81 3 75 56 -51 -80 87 113 -86 -97 124 108 -111 -79
4747 -79 126 76 -77 -52 37 63 -37 -84 -8 108 2 -146 2 148 -23 -161 28 129 -40 -108 12 83 21
4770B1r2K2J28jj69%K01j4k07K8K20o5j64M7J29k3r9k5R3O5j02j01J13J38j56
4795a3j45J75J18j82q2J44P9j08q0O9P9j4j25pJ81pk10L7K26n6k02O9J64o3j21
4820g4K8J00K2r2r3J12J23j33j33J63J15j82r0J60P6j35n9R7N3m2j06J9J34j0
4844E3j74L5J92n1k05P6J81q2j36O1J07k3q5k4J01P3j29r8J62J07j78j01J94P1
4868A27j69n6J38M7r9p1N6R2k9j40L6J66l5j96O4J91q9j67Q2J39p2r5K3Q6L1j08
4894d8n7J38P1j57r2J86Q0j91m9J80L1j39l6J07M1n2j00N2J42n8j73P3J86q9j95
4919a49J15J52j11j15P7R2l4r1j8J16N7j52n4J73O0j95m6K05J1j68j8J35J4r2
4943c6l3N5R5o7j28P8J54r0j69J17J61j38j32J26J13q8j02N1Q8Jj06m1J51M7j87
$$ plain form
4770 21 -71 -49 79 78 -91 -91 110 96 -111 -83 137 72 -92 -45 84 61 -38 -63 30 95 -7 -108 5 143 -13
4795 -13 -158 17 135 -47 -129 15 94 -14 -94 -25 54 40 -85 -92 89 82 -128 -91 135 79 -123 -54 110 47 -74
4820 -74 -46 54 76 -16 -109 3 126 -7 -140 23 138 -44 -134 26 102 -33 -92 5 58 16 -90 -71 63 53
4844 53 -121 -86 106 55 -150 -74 107 25 -111 -50 57 34 -51 -75 26 99 -30 -128 34 141 -37 -138 56 127
4868 127 -42 -98 40 87 -12 -83 -27 65 36 -104 -68 98 63 -133 -69 122 33 -134 -52 87 15 -80 -57 29 60 -48
4894 -48 -105 33 104 -53 -145 41 121 -70 -119 61 92 -47 -83 24 65 13 -87 -35 107 49 -124 -51 135 46 -149
4919 -149 -34 118 7 -108 -31 61 27 -64 -82 34 91 -61 -115 58 118 -77 -123 82 93 -75 -93 42 56 -36
4943 -36 -69 -14 81 14 -114 -36 118 28 -141 -24 137 -1 -133 -7 106 18 -84 -33 55 56 -50 -91 60 107 -80
4968h0l9K06J3j88j8J82mj44kR8L9p9r3Q1J36r7j58J28J53j47j29J45J10j19r8
4993a04Q7R6l9j07J2J24Rj61rJ90J1k08J6J88l4j64K8J32lj12l9J02Q1j12j20
5018a36J29J29j45j29J62J07j50r3J36P6r9p4N6J14k6j28NJ69qj90J9J92m0j81
5042a05N8J46l2j34PJ02L2j10n7J11R9j35j36J81J03j79r0J71P3j44p2J18P1o5
5066A3j01L5J40k2j69L7J96m9k02P0J80o2j53O0J08j9j05k2J02N5j12r4J47J01
5090A34j77q8J80O7j71o0J39M2r9n0N6J09m9j42M7J70n4j85Q0J78q3j66R5J30
$$ plain form
4968 -80 -119 87 100 -88 -106 76 72 -72 -74 24 63 -16 -109 -28 108 11 -147 -19 134 -13 -142 3 113 -6 -104
4993 -104 -17 79 40 -67 -55 69 78 -83 -92 98 109 -99 -83 105 71 -93 -65 67 64 -48 -87 15 96 -16 -136
5018 -136 -7 122 -23 -152 10 117 -33 -126 10 86 -13 -87 -31 83 57 -71 -66 103 95 -95 -76 116 76 -105
5042 -105 -47 99 67 -67 -60 42 74 -36 -93 18 117 -18 -154 27 130 -49 -139 32 105 -39 -111 7 78 13
5066 13 -88 -53 87 65 -104 -67 129 80 -122 -52 128 66 -87 -27 81 62 -43 -65 37 92 -20 -114 33 134
5090 134 -43 -131 49 116 -55 -115 24 66 -33 -83 -27 82 33 -109 -62 108 54 -131 -51 127 44 -122 -27 103
$$ [...]
8191D
##END NTUPLES=NMR FID
##END=
