##TITLE=1H_AM-NVA499EA
 CDCl3
 8 sc, 
 20.09.2022
##JCAMPDX= 6.0         $$ Bruker NMR JCAMP-DX V2.0
##DATA TYPE= NMR FID
##DATA CLASS= NTUPLES
##ORIGIN= UXNMR, Bruker Analytische Messtechnik GmbH
##OWNER= root
$$ XWIN-NMR		Version 3.5
$$ Tue Sep 20 13:23:30 2022 Russian Standard Time (UT+4h)  she@DPX200
##.OBSERVE FREQUENCY= 200.1313499994
##.OBSERVE NUCLEUS= ^1H
##.DELAY= (6, 6)
##.ACQUISITION MODE= SIMULTANEOUS
##.ACQUISITION SCHEME= undefined
##.AVERAGES= 8
##.DIGITISER RES= 18
##SPECTROMETER/DATA SYSTEM= spect
##.PULSE SEQUENCE= zg30
##.SOLVENT NAME= CDCl3
##.SHIFT REFERENCE= (INTERNAL, CDCl3, 0, 15.7039)
##AUDIT TRAIL= $$ (NUMBER, WHEN, WHO, WHERE, WHAT)
$$ ##TITLE= Audit trail, XWIN-NMR		Version 3.5
$$ ##JCAMPDX= 5.01
$$ ##ORIGIN= Bruker BioSpin GmbH
$$ ##OWNER= she
$$ F:/spectra/data/she/nmr/H-F/1/audita.txt
$$ ##AUDIT TRAIL=  $$ (NUMBER, WHEN, WHO, WHERE, WHAT)
(   1,<2022-09-20 13:21:46.18 +0400>,<she>,<DPX200>,
      <created by zg, POWCHK disabled, PULCHK disabled
       configuration hash MD5:
       00 E9 B6 7A A2 85 ED C7 34 08 36 98 17 FE 4E 26
       data hash MD5: 16K
       29 8F 62 AB C7 78 60 87 39 CF C1 59 C8 24 4B 47>)
$$ ##END=
$$ 
$$ hash MD5
$$ 2E E7 BD C4 C5 B8 D7 41 5A A5 B2 F7 27 39 F4 2B
##$RELAX= 
##$RELAX= 
##$RELAX= 
##$RELAX= 
##$RELAX= 
##$RELAX= 
$$ Bruker specific parameters
$$ --------------------------
##$DU= <F:/spectra>
##$EXPNO= 1
##$NAME= <H-F>
##$PROCNO= 1
##$TYPE= <nmr>
##$USER= <she>
##$AMP= (0..31)
100 100 100 100 100 100 100 100 100 100 100 100 100 100 100 100 100 100 
100 100 100 100 100 100 100 100 100 100 100 100 100 100 
##$AQSEQ= 0
##$AQ_mod= 1
##$AUNM= <au_zg>
##$AUTOPOS= <>
##$BF1= 200.13
##$BF2= 200.13
##$BF3= 200.13
##$BF4= 200.13
##$BF5= 200.13
##$BF6= 200.13
##$BF7= 200.13
##$BF8= 200.13
##$BYTORDA= 1
##$CFDGTYP= 0
##$CFRGTYP= 5
##$CHEMSTR= <none>
##$CNST= (0..31)
1 1 145 1 1 1 1 1 1 1 1 1 1 1 1 1 1 1 1 1 1 1 1 1 1 1 1 1 1 1 1 1 
##$CPDPRG= <>
##$CPDPRG1= <>
##$CPDPRG2= <>
##$CPDPRG3= <>
##$CPDPRG4= <mlev>
##$CPDPRG5= <mlev>
##$CPDPRG6= <mlev>
##$CPDPRG7= <mlev>
##$CPDPRG8= <mlev>
##$CPDPRGB= <>
##$CPDPRGT= <>
##$D= (0..31)
0 1.2 0 0 0 0 0 0 0 0.06 0 0.03 0 0 0 0 0.0002 0 0 0 0 0 0 0 0 0 0 0 0 
0 0 0 
##$DATE= 1663665705
##$DBL= (0..7)
120 120 120 120 120 120 120 120 
##$DBP= (0..7)
150 150 150 150 150 150 150 150 
##$DBP07= 0
##$DBPNAM0= <>
##$DBPNAM1= <>
##$DBPNAM2= <>
##$DBPNAM3= <>
##$DBPNAM4= <>
##$DBPNAM5= <>
##$DBPNAM6= <>
##$DBPNAM7= <>
##$DBPOAL= (0..7)
0.5 0.5 0.5 0.5 0.5 0.5 0.5 0.5 
##$DBPOFFS= (0..7)
0 0 0 0 0 0 0 0 
##$DE= 6
##$DECBNUC= <off>
##$DECIM= 32
##$DECNUC= <off>
##$DECSTAT= 4
##$DIGMOD= 1
##$DIGTYP= 9
##$DL= (0..7)
0 120 120 120 120 120 120 120 
##$DP= (0..7)
150 150 150 150 150 150 150 150 
##$DP07= 0
##$DPNAME0= <>
##$DPNAME1= <>
##$DPNAME2= <>
##$DPNAME3= <>
##$DPNAME4= <>
##$DPNAME5= <>
##$DPNAME6= <>
##$DPNAME7= <>
##$DPOAL= (0..7)
0.5 0.5 0.5 0.5 0.5 0.5 0.5 0.5 
##$DPOFFS= (0..7)
0 0 0 0 0 0 0 0 
##$DQDMODE= 0
##$DR= 18
##$DS= 0
##$DSLIST= <SSSSSSSSSSSSSSS>
$$ [...]
##$SUBNAM2= <"">
##$SUBNAM3= <"">
##$SUBNAM4= <"">
##$SUBNAM5= <"">
##$SUBNAM6= <"">
##$SUBNAM7= <"">
##$SUBNAM8= <"">
##$SUBNAM9= <"">
##$SW= 18.0517283424941
##$SWIBOX= (0..15)
0 0 2 0 0 0 0 0 0 0 0 0 0 0 0 0 
##$SW_h= 3612.71676300578
##$TD= 16384
##$TD0= 1
##$TE= 0
##$TE2= 300
##$TE3= 300
##$TEG= 300
##$TL= (0..7)
0 120 120 120 120 120 120 120 
##$TP= (0..7)
150 150 150 150 150 150 150 150 
##$TP07= 0
##$TPNAME0= <>
##$TPNAME1= <>
##$TPNAME2= <>
##$TPNAME3= <>
##$TPNAME4= <>
##$TPNAME5= <>
##$TPNAME6= <>
##$TPNAME7= <>
##$TPOAL= (0..7)
0.5 0.5 0.5 0.5 0.5 0.5 0.5 0.5 
##$TPOFFS= (0..7)
0 0 0 0 0 0 0 0 
##$TUNHIN= 0
##$TUNHOUT= 0
##$TUNXOUT= 0
##$USERA1= <user>
##$USERA2= <user>
##$USERA3= <user>
##$USERA4= <user>
##$USERA5= <user>
##$V9= 5
##$VALIST= <valist>
##$VCLIST= <CCCCCCCCCCCCCCC>
##$VD= 0
##$VDLIST= <DDDDDDDDDDDDDDD>
##$VPLIST= <PPPPPPPPPPPPPPP>
##$VTLIST= <TTTTTTTTTTTTTTT>
##$WBST= 1024
##$WBSW= 4
##$XGAIN= (0..3)
0 0 0 0 
##$XL= 0
##$YL= 0
##$YMAX_a= 185137
##$YMIN_a= -206168
##$ZGOPTNS= <>
##$ZL1= 120
##$ZL2= 120
##$ZL3= 120
##$ZL4= 120
##$ABSF1= 10
##$ABSF2= 0
##$ABSG= 5
##$ABSL= 3
##$ALPHA= 0
##$AQORDER= 0
##$ASSFAC= 0
##$ASSFACI= 0
##$ASSFACX= 0
##$ASSWID= 0
##$AUNMP= <proc_1d>
##$AZFE= 0.1
##$AZFW= 0.1
##$BCFW= 1
##$BC_mod= 2
##$BYTORDP= 1
##$COROFFS= 0
##$CY= 11.3945322036743
##$DATMOD= 1
##$DC= 2
##$DFILT= <>
##$DTYPP= 0
##$F1P= 2.36226072786647
##$F2P= -0.459571619588291
##$FCOR= 0.5
##$FTSIZE= 0
##$FT_mod= 4
##$GAMMA= 1
##$GB= 0.15
##$INTBC= 1
##$INTSCL= 1
##$ISEN= 128
##$LB= 0.24
##$LEV0= 0
##$LPBIN= 0
##$MAXI= 10000
##$MC2= 0
##$MEAN= 0
##$ME_mod= 0
##$MI= 1.114404
##$NCOEF= 0
##$NC_proc= 0
##$NLEV= 6
##$NOISF1= 3.799351
##$NOISF2= 2.8
##$NSP= 1
##$NTH_PI= 0
##$NZP= 0
##$OFFSET= 15.70392
##$PC= 1
##$PHC0= -18118.81
##$PHC1= 17.40069
##$PH_mod= 1
##$PKNL= yes
##$PPARMOD= 0
##$PSCAL= 0
##$PSIGN= 0
##$REVERSE= no
##$SF= 200.130013532006
##$SI= 16384
##$SIGF1= 3
##$SIGF2= 2
##$SINO= 400
##$SIOLD= 16384
##$SREGLST= <1H.CDCl3>
##$SSB= 0
##$STSI= 0
##$STSR= 0
##$SW_p= 3612.71676300578
##$SYMM= 0
##$S_DEV= 0
##$TDeff= 0
##$TDoff= 0
##$TI= <>
##$TILT= no
##$TM1= 0
##$TM2= 0
##$TOPLEV= 0
##$USERP1= <user>
##$USERP2= <user>
##$USERP3= <user>
##$USERP4= <user>
##$USERP5= <user>
##$WDW= 1
##$XDIM= 8192
##$YMAX_p= 0
##$YMIN_p= 0
$$ End of Bruker specific parameters
$$ ---------------------------------
##NTUPLES= NMR FID
##VAR_NAME=  TIME,          FID/REAL,        FID/IMAG
##SYMBOL=    X,             R,               I
##VAR_TYPE=  INDEPENDENT,   DEPENDENT,       DEPENDENT
##VAR_FORM=  AFFN,          ASDF,            ASDF
##VAR_DIM=   8192,          8192,            8192
##UNITS=     SECONDS,       ARBITRARY UNITS, ARBITRARY UNITS
##FACTOR=    0.0002768,     1,               1
##FIRST=     0,             0,               0
##LAST=      2.2672688,     0,               0
##MIN=       0,             -206168,         0
##MAX=       2.2672688,     185137,          0
$$ Real data points
##PAGE= N=1
##DATA TABLE= (X++(R..R)), XYDATA
0@%%%%%%%%%%%%%%%%Mj2J6j6J6j6J6k4L2l2L6m4M8n6O4p2Q4r2J04j17J29j44J60
$$ 0 0 0 0 0 0 0 0 0 0 0 0 0 0 0 0 0 4 -8 8 -8 8 -8 8 -16 16 -16 20 -24 24 -32 32 -40 44 -48 56 -61 68 -76 84
39H4j78K02k24K47k73K99l31L66m01M41m87N36n90O50p20P98q85R86j104J244
$$ 84 -94 108 -116 131 -142 157 -174 192 -209 232 -255 281 -309 341 -379 419 -466 520 -584 660
59F60j411J614j872K207k655L289m251N861q990J7054p2126j45548K46978Q2286
$$ 660 -751 863 -1009 1198 -1457 1832 -2419 3442 -5548 11506 -60620 -206168 40810 123096
73A23096j06796o1200k6622P9723O0174n2103l6029k7241K5421P5792K152r2544
$$ 123096 16300 -44900 -71522 8201 68375 16272 -19757 -46998 -21577 54215 56367 -36177
85c6177n8690J18751Q9947j34855o4174P5658M9982K4072q5138o8986J00119M8253
$$ -36177 -94867 23884 113831 -21024 -85198 -9540 40442 64514 -20624 -89610 10509 58762
97E8762l1724m2654n5584O5928P4735m4056n0386m0531N8314R7727q3350p0892
$$ 58762 27038 -15616 -71200 -5272 69463 25407 -24979 -65510 -7196 90531 7181 -63711
109f3711N7343J4579J2512R162n6036j9760N6981M7585n3873o7082M7136N8893
$$ -63711 -6368 8211 20723 29885 -26151 -45911 11070 58655 4782 -62300 -15164 43729
121D3729m393o1838n0765R6016N4131j02857r606L3781r142N7496k0800q5610
$$ 43729 39336 -22502 -73267 22749 76880 -25977 -35583 -1802 -10944 46552 25752 -59858
133e9858L7210N1447M69j7439n0209K977O4913J8756n6694m7319M9185N4778k9479
$$ -59858 -22648 28799 29268 11829 -38380 -35403 29510 48266 -8428 -55747 -6562 48216 18737
146A8737m6034j0581N0940L9196o2177l4531M3157K4550L565l7049l3859M7674
$$ 18737 -27297 -37878 13062 52258 -9919 -44450 -1293 23257 26822 -10227 -44086 3588
158C588L1511k1770k6656k4223L5595M7133l1951m1290k879L4344M4636l4292
$$ 3588 35099 13329 -13327 -37550 -1955 45178 13227 -28063 -30942 3402 48038 13746
170A3746o3529K4507O2109k523n3741j5409L5044K5834m134l8213k1225M5529
$$ 13746 -49783 -25276 36833 34310 -19431 -34840 204 26038 21904 -16309 -37534 7995
182G995K7580k7980k8366j0513L8477L9576m4614m2170K4771L1906J4998k3945
$$ 7995 35575 7595 -20771 -31284 7193 46769 2155 -40015 -15244 16662 31660 7715
194G715m6740J2988N5297R336m6434l5304K7662N1805j240n5709k5420M8285M1308
$$ 7715 -39025 -26037 29260 38596 -7838 -43142 -15480 36325 35085 -20624 -46044 2241 43549
207D3549k7537m4725l316M1534K9781l1042l9703O888L5479K7451k5692n6028
$$ 43549 16012 -28713 -32029 9505 39286 8244 -31459 -24571 10908 38359 12667 -43361
219d3361J1140O6056J1765n8348l8894M0449N8271j7343o0863p667M6634K9279
$$ -43361 -32221 33835 45600 -12748 -51642 -11193 47078 29735 -31128 -38795 7839 37118
231C7118k1325m1597p206M1607L0644k8941m3424O274M4934J9620l7459l9452
$$ 37118 15793 -25804 -33010 8597 39241 10300 -33124 -26850 18084 37704 245 -39207
243c9207K2584M7034k158m2245j9254K8708L4869j0679l9376q182L1474K4648
$$ -39207 -16623 30411 28253 -13992 -33246 -4538 30331 19652 -19724 -27906 3568 28216
255B8216j4805l5360l896L6865J8633k7295k7108R754K9108Q625k3862k1597J1123
$$ 28216 13411 -21949 -25845 11020 29653 2358 -24750 -14996 14112 22737 -1125 -22722 -11599
268a1599K7294N812k6239k0994J8816L0068o396l1927p178K6658J7667j4960k3436
$$ -11599 15695 21507 -4732 -25726 -6910 23158 16762 -15165 -22343 4315 21982 7022 -16414
281a6414J87K3972J2570j8049k0556O118K4049P549k2782j8041J5368K3957k993
$$ -16414 -16227 7745 20315 2266 -18290 -12172 11877 19426 -3356 -21397 -6029 17928 14935
294A4935k5929r752K3277J8943j4868k3998K657K5018R122k0710j7946J0793K3516
$$ 14935 -10994 -20746 2531 21474 6606 -17392 -14735 10283 19405 -1305 -19251 -8458 15058
307A5058J648k4813j2832K0035K1144r795k6035k255K5564J3015j8374k1335O485
$$ 15058 16706 -8107 -20939 -904 20240 10445 -15590 -17845 7719 20734 2360 -18975 -12490
320a2490K5769O223k3999j7076J5631K4654l510k6890q715K2141J8716j1467k4568
$$ -12490 13279 19502 -4497 -21573 -5942 18712 15202 -11688 -20403 1738 20454 8987 -15581
333a5581j648K4242J3732j7134k2361N341K5468P398k1592j7939J1424K3990J847
$$ -15581 -17229 7013 20745 3611 -18750 -13409 12059 19457 -2135 -20074 -8650 15340 17187
346A7187k3832j4246J6814K2706m600k5300r132K1154K0266j0801k5702l355K4216
$$ 17187 -6645 -20891 -4077 18629 14029 -11271 -20403 751 21017 10216 -15486 -18841 5375
359E375J7300j6263k6568L543K8257J1028k2139k3329J0058K9278N165k7074j9649
$$ 5375 22675 6412 -20156 -16613 11644 22672 533 -22796 -12738 16540 21705 -5369 -25018
372b5018J7517K9059k962l0711j3038K4815K5519j2999l0290k743K6839J8708
$$ -25018 -7501 21558 18596 -12115 -25153 -338 25181 12182 -18108 -20851 5988 24696
384B4696j7701k9297N199L0564R323k3506k2820J2197L0077N69k8088j3267J8694
$$ 24696 6995 -22302 -17103 13461 22784 -722 -23542 -11345 18732 19301 -8787 -22054 -3360
397c360K2972n837k6011p633K1743J8662j2253k3698m43K1855J3887j6007k3033
$$ -3360 19612 13775 -12236 -19869 1874 20536 8283 -15415 -15858 5997 19884 3877 -19156
410a9156Q275K3545J890j7116j3253R434K0147k823j8008m695R292J3104K8j7955
$$ -19156 -10881 12664 14554 -2562 -15815 -6381 13766 10943 -7065 -11760 -2468 10636 10664 -7291
424g291p329J5905J3231q613j6920p63J6776J0054j3537j6177Q618J5525j024
$$ -7291 -14620 1285 14516 5903 -11017 -11780 4996 15050 1513 -14664 -6046 9479 8455
437H455r440r100L756J6065p43j4057l645N638J1504J450j7755m401J6800P095
$$ 8455 -985 -10085 -6329 9736 8993 -5064 -8709 -3071 8433 9883 -7872 -12273 4527 11622
451A1622j0091j1706K722J5367L456j5354q710J1688J1974m570j2600n555J2560
$$ 11622 1531 -10175 -7453 7914 11370 -3984 -12694 -1006 10968 6398 -6202 -11757 803
464H03J4167j1995j5763O689J1672M840q757j5505Q680J7118n278j1129m936N405
$$ 803 14970 2975 -12788 -6099 5573 10413 1656 -13849 -5169 11949 6671 -4458 -9394 -3989
478c989J6272k826k1206m24J8702O794j1910j4211L225J9944M780k1554q699J5558
$$ -3989 12283 9457 -11749 -12173 6529 13323 1413 -12798 -9573 10371 15151 -6403 -15102 456
492D56Q909j720r791j2160J1821J6503q589j1387l556N670J7237l730k2235J175
$$ 456 9365 7645 -2146 -14306 -2485 14018 5429 -5958 -9514 -3844 13393 9663 -12572 -11397
506a1397J7255N979q809j4617J474J9415M380j8281q474J1114J0598O89j1939
$$ -11397 5858 11837 3028 -11589 -10115 9300 13680 -4601 -13075 -1961 8637 9326 -2613
519b613j1799J1875J5511n727j1747q382P329K2546n463k6019J147J7925R577
$$ -2613 -14412 -2537 12974 7247 -4500 -12882 -5553 16993 11530 -14489 -13342 4583 14160
532A4160p316k1170Q32K4485L188j7369q342N102J4199O392j7890j3551J6873
$$ 14160 6844 -14326 -13494 10991 14179 -3190 -11532 -6430 7769 14161 -3729 -17280 -407
545d07J4851q975j2282m928J0624J7482j0683j9887O589J1874N951k505k0740
$$ -407 14444 5469 -6813 -11741 -1117 16365 5682 -14205 -7616 4258 10209 7704 -13036
558a3036j669K6547L415j9842q408P887J5843O98j9862l312J6528K382o945j262
$$ -13036 -14705 11842 15257 -4585 -12993 -5106 10737 11435 -8427 -11739 4789 7171 226 -1036
572a036m370J869J1788k938j1577j2O266Q980k781j8439M094K0044n306j2439
$$ -1036 -5406 -3537 8251 5313 -6264 -6276 -10 8970 6189 -12250 -8156 11888 6582 -5857
586e857O22L166P861N78j2022M36P520q09K026k429r260O779J0051p672n954K650
$$ -5857 -5235 -2069 5792 6370 -5652 -5216 2304 1495 3521 1092 -8168 -1389 8662 990 -4964 -2314
602b314K257N741k723j1730N814J1109n663n855j194K099J0991k849j6181M656
$$ -2314 -57 5684 2961 -8769 -2955 8154 2491 -3364 -4558 -2459 8532 5683 -10498 -5842
616e842J3362k100o367n253J269J2130l69j2591Q05N664J574L583o949r015J0724
$$ -5842 7520 5420 -947 -6200 -4931 7199 6830 -5761 -4956 708 2282 5865 -1084 -10099 625
631F25Q979p841p672j070R459R885j3152j3285J3487J1566p496q823j957P569
$$ 625 9604 1763 -5909 -6979 2480 12365 -787 -14072 -585 10981 3485 -5338 -7295 274
645B74R202o907j0257M163N523J925J043r395n030J3276N684r796o590J201J0275
$$ 274 9476 2569 -7688 -3525 1998 3923 4966 -4429 -9459 3817 9501 -295 -6885 -5684 4591
660D591N894j3674p755J1596O844l651o997m877P610R412n510r578r4P108O771
$$ 4591 10485 -3189 -10944 652 7496 3845 -3152 -8029 -419 8993 3483 -6095 -6189 919 7690
675G690l150j1541j284J2218M934p363q097j352J1421Q753j2642j1124P844J0559
$$ 7690 4540 -7001 -8285 3933 8867 1504 -6593 -7945 3476 12229 -413 -11537 -3693 6866
689F866K060j0904j0477J1143J2492p111r988j188P066Q695m005j1706p36J0600
$$ 6866 8926 -1978 -12455 -1312 11180 4069 -5919 -7107 -41 8654 4649 -7057 -7793 2807
703B807O285o684j0262L20J2349O338j2493r840Q852R842q75r525o999R542R733
$$ 2807 9092 2408 -7854 -7534 4815 11153 -1340 -11180 -2328 7514 6639 -2886 -9885 -343 9390
718I390o639q071k17O414O524n576q066K648O250K476m281o186K005O691J884
$$ 9390 2751 -5320 -5537 877 7401 1825 -6241 -3593 2657 5133 852 -5334 -3329 3362 5246
733E246n759n640M286O816r40o394l540O309N647n255m356J173K879L523k955
$$ 5246 -513 -6153 -1867 4949 4009 -2385 -5925 384 6031 776 -3580 -2407 472 3995 1040
748A040m667K045K462J789q17n526O56N931O61m250l655L051N617j774n422j013
$$ 1040 -3627 -1582 880 2669 1852 -3674 -3018 2913 3574 -676 -4331 -1280 4337 2563 -2859 -3872
764c872M781L994m336m859K178M467J800m674m789M567N093j858m614k505M806
$$ -3872 909 4903 567 -4292 -2114 2353 4153 -521 -5310 -743 4350 2492 -2122 -4627 179
779A79N252l938n615M49N465L871n288o377L306P183P05p449m508O614O508l440
$$ 179 5431 1493 -4122 -3673 1792 5663 375 -6002 -2696 4487 5192 -2257 -6765 -151 6357 2917
795B917p421r25P584M175n762n737J602O515K827o120n592L443O743R77o870m955
$$ 2917 -4504 -5429 2155 6330 568 -5169 -3567 2948 5775 -345 -5937 -2494 4249 5226 -1644 -6599
811f599N458O983j941p381k476O457N730l820o952l11O485M342m516o616J009
$$ -6599 -1141 5842 3901 -3480 -5956 501 6231 2411 -4541 -4852 1633 5975 1459 -5157 -4148
826d148O763L158n138o369K132P381J835o121n687L314P887L97p543m363M977
$$ -4148 2615 5773 635 -5734 -3602 3779 5614 -507 -6194 -2880 5007 5404 -2139 -6502 -1525
841a525P553j360q518k560O786O143l196q377q73Q101M591n183p531R83Q717L025
$$ -1525 6028 4668 -3850 -6410 376 6519 3323 -5054 -5927 2174 6765 1582 -5949 -4966 3751 6776
857F776p230o305L575Q462N40q428m070N779O919j871q382j611P241M366l719
$$ 6776 -454 -6759 -3184 5278 5818 -2610 -6680 -901 6018 4147 -4235 -5846 1395 5761 2042
872B042o683r0P542K695n649m589J855O175J422o172l321L807M622n17n249j864
$$ 2042 -4641 -4731 2811 5506 -143 -4732 -2877 3298 4720 -1452 -4773 -966 3656 3139 -2110 -3974
888c974M160L318j573m364o99M218J888k166k963l81M012J460l413j551P73K362
$$ -3974 186 3504 1931 -2433 -3132 1086 2974 808 -2155 -2536 1476 2936 -477 -2028 -1255 1107
904A107J627l399k096K604J833l1k374k064K811K683j723k905k25L138J590k337
$$ 1107 2734 -665 -2761 -157 1676 1645 -729 -2793 18 2701 978 -1927 -2152 986 2576 239
920B39k553N30L777P16m114j115K366K260J16m371j082N052J125k939k461L3M754
$$ 239 -2314 -1784 1993 2709 -1405 -2520 -154 2106 2222 -2149 -3231 1821 2946 7 -2454 -2421 2333
937B333J470n328k318L280L864l41n338k063N183L995l458n300J145M996J734
$$ 2333 3803 -1525 -3843 -563 3301 2960 -2378 -4441 742 4737 1279 -4021 -2876 2120 3854
952C854l445m814K095O277j018m755j459J897N276l29p513q0O037J630k297m618
$$ 3854 409 -4405 -2310 3967 2949 -1806 -3265 -1368 3908 3579 -3934 -4014 2023 3653 1356 -3262
968c262q75O537K690n432l922J852M718K334m452n680L187O798j132n054j878
$$ -3262 -4137 2400 5090 -342 -4264 -2412 2306 4640 188 -5492 -2305 4493 3361 -1693 -3571
983c571J849N085M00o138j230L492K491R89m789l990O067M537m172m473j14N096
$$ -3571 -1722 3363 3763 -2375 -3605 -113 2378 3367 -1422 -5412 655 5192 1020 -3453 -3567 1529
999A529L948n309n580L542N098K87l286m734R93P681J080p326k994L531N366J227
$$ 1529 5477 168 -5412 -1870 3228 3515 229 -4505 -3512 4169 5249 -2077 -5071 -1540 3826 5053
1015E053p571l907P590L831m052l170j320L702N056m558n419L499L932l9k828
$$ 5053 -2518 -6425 1165 4996 944 -2226 -3546 156 5212 654 -4765 -1266 2666 2627 -201
1030b01m057K824O320k770n690J187K957K058o0n202j406N689J738k713k395j672
$$ -201 -4258 -1434 4886 2116 -3574 -2387 570 2628 2568 -2634 -4040 1649 3387 674 -1721 -3393
1046c393L908M065m729l386L368J348k00m01k444J179K630k031p55J218j183J346
$$ -3393 515 4580 -149 -3535 -167 1181 981 580 -1864 -685 1945 -86 -841 377 -806 540
1062E40J347l672p3L743o35j476p69j139L436K050m658j343K839O88Q32j299l503
$$ 540 1887 -1785 -1858 1885 1250 -226 -995 -2134 1302 3352 -1306 -2649 190 878 1710 411 -3092
1079c092K525L401k699j354J003k84J636j16l221J797K564k227o37j37l53L910
$$ -3092 -567 2834 135 -1219 -216 -500 1136 1020 -2201 -404 2160 -67 -704 -841 -1194 2716
1095B716m00n956J087M873M17k057l855j35O615P72o261q97K894J693J249l230
$$ 2716 2316 -3640 -2553 2320 2737 680 -3175 -3310 3305 4077 -2184 -3081 -187 1506 2755 -475
1111d75l578M153L354l000j939m27J569M083k741n356L303L916j130j717l198
$$ -475 -4053 100 3454 454 -1485 -1912 -343 3740 999 -4357 -1054 2862 1732 15 -3183
1126c183P64O388n77o169o07L148L240J55n549j955N581K082k786j495j425J216
$$ -3183 -2419 3969 3392 -2777 -3384 -236 3004 3159 -2390 -4345 1236 3318 532 -963 -2388 -1172
1142a172M473j133m632Q0K494K688n21n754L00O637p23m538l02J269K798Q57m472
$$ -1172 3301 2168 -2464 -2384 110 2798 2277 -3477 -3177 3460 2737 -1801 -2103 -834 1964 2821 -1651
1159a651j504L378J882J27k811l872L630N883l143n529P21L685K851j860n520
$$ -1651 -3155 223 2105 2232 -579 -4451 -821 5062 1919 -3610 -2889 796 3647 1787 -3733
1174c733P50N515K94k854k335k58M815J697n717j723M125J918j213k855j105L548
$$ -3733 -2983 2532 2826 -28 -2363 -2621 2194 3891 -1826 -3549 576 2494 1281 -1574 -2679 869
1190H69J929k700j787K57J476K630j282m530R56M541M9l068j793J500L281q58
$$ 869 2798 98 -1689 -1432 44 2674 1392 -3138 -2182 2359 2408 -660 -2453 -953 2328 1470
1206A470l209Q09J415l41P31o91j677J260J426o74j007o56J204J593j627j707
$$ 1470 -1739 -930 485 144 875 184 -1493 -233 1193 519 -488 -1144 60 1653 26 -1681
1222a681J609J227q15o35n16L39J627k59j895rJ272Q50m39j943Q4K406r5j811
$$ -1681 -72 1155 340 -295 -811 -472 1155 896 -999 -1008 264 1114 675 -1268 -1184 1222 1127 -684
1240f84j30O14P93M15j383r79J248J424m18j920p91K427J831k509k475J876K661
$$ -684 -814 -200 593 1008 -375 -1354 -106 1318 900 -1020 -1811 616 2447 -62 -2537 -661 2000
1257B000n69k510r36K044J999j123k288k67J863J848j031l004l3L330J165k663
$$ 2000 1431 -1079 -2015 29 2028 905 -1383 -1650 213 2061 1030 -1974 -2007 1323 2488 -175
1273a75k277J348L065J33l127j391K197K333n68k840j133K627K416j609l038P5
$$ -175 -2452 -1104 1961 2094 -1033 -2424 -227 2106 1538 -1302 -2435 192 2608 999 -2039 -1964
1289a964K924J383k061k335O65K515Q45j846k011M29K645J158k511k393J523L009
$$ -1964 960 2343 282 -2053 -1388 1127 1972 126 -1885 -1456 1189 2347 -164 -2557 -1034 1975
1305A975P7l011j575K314K412q66k530q73K019K208q41k773p92K562K346j719
$$ 1975 2052 -959 -2534 -220 2192 1326 -1204 -2077 -58 2150 1309 -1464 -2256 306 2652 933
1321I33l202K66L260J406k663k636J437L040K78k755j901J942K804n92k844j091
$$ 933 -2269 -2003 1257 2663 0 -2636 -1199 1841 2119 -636 -2537 -595 2209 1617 -1227 -2318
1337b318K339K388j401k805MK510J451j791k310O93K364O69j931j770J194K145
$$ -2318 21 2409 1008 -1797 -1793 717 2168 377 -1933 -1240 1124 1793 -138 -1908 -714 1431
1353A431r3j960j054J525J700q62j624j37J247J087r03j345L04J066N37o90j198
$$ 1431 1338 -622 -1676 -151 1549 687 -937 -1074 173 1260 357 -988 -684 382 919 229 -969
1370i69L95J224J39r25p55N85J087k32r72l32P66P68n28p89mO70O44o34r59N00
$$ -969 -574 650 789 -136 -891 -306 781 549 -423 -755 11 779 251 -538 -542 128 772 138 -821 -321
1390c21Q09P3o18q23O51J172n48r95j18Q20R06o79j352L13J410L43j241r78Q00
$$ -321 488 561 -57 -880 -229 943 395 -600 -718 102 1008 329 -1023 -710 700 1043 -198 -1176 -376
1409c76J413o4j660o52J581J058r00j331k21J643J124j663j472Q87J595M33j753
$$ -376 1037 973 -687 -1339 242 1300 400 -931 -1152 491 1615 -48 -1520 -633 962 1395 -358
1426c58j513J604J971p83j954n08J669J616j021k178P6K097Q65j335j626J76K109
$$ -358 -1871 -267 1704 921 -1033 -1541 128 1744 723 -1455 -1379 718 1583 248 -1378 -1202 907
1443I07Q13k005j299J108J434L29j558j455J468J736p04j445o10J046J783o26
$$ 907 1720 -285 -1584 -476 958 1287 -271 -1726 -258 1478 774 -671 -1281 -235 1548 922
1459I22k185l2J714R49p23j779l78K101J218j648j592M02J631J138j530k135J130
$$ 922 -1263 -1295 419 1368 645 -1134 -1512 589 1807 159 -1433 -1031 600 1738 208 -1927 -797
1476g97K111j32j424j265P42K318k76k376k72J512J176m10k101l84K431Q18j811
$$ -797 1314 1182 -242 -1507 -765 1553 1277 -1099 -1371 141 1317 907 -1194 -1578 853 1671 -140
1493a40j142M43J568R23j819j622J438J545k55j150j232Q74K131p26j910K53R83
$$ -140 -1282 -839 729 1652 -167 -1789 -351 1194 939 -211 -1443 -569 1562 836 -1074 -821 162
1510A62O09j48j407j16J588n9q97rj48O01P52j285n98J299J93m19k43o43P71J055
$$ 162 771 623 -784 -900 688 629 -268 -277 -425 176 928 -357 -955 344 537 118 -125 -768 3 1058
1530A058j091o86O66O4L79J53j223O9J270l14n31O8l06O61M81j260MJ096m50k03
$$ 1058 -33 -719 -53 11 390 543 -680 -611 659 345 -186 -118 -424 237 718 -542 -538 558 108 -95
1550i5J17o10P91O75j281k61P22J82M24o71j250J205J283j061q36J64M81R19m79
$$ -95 22 -588 203 878 -403 -664 58 240 664 -7 -1257 -52 1231 170 -666 -502 -21 898 419
1569D19j487O32J196m16l95m18j66J454O8j824J91J187J98j47j258m33K077M28
$$ 419 -1068 -436 760 344 -51 -469 -635 819 887 -937 -746 441 639 492 -766 -1199 878 1306
1587A306j809m30N56Q64P47j395j405J425J272o48p79o49M73J713m93j834M12
$$ 1306 -503 -933 -377 487 1234 -161 -1566 -141 1131 483 -296 -945 -472 1241 748 -1086 -674
1604f74J004K09N7j243m89J808L46j268l55J5Q83R81j397j243J220R73j83o97
$$ -674 330 539 596 -647 -1136 672 1018 -250 -605 -590 293 1274 -123 -1366 -146 827 644 -53
1622e3j080N96J767m29j525q0O36R24K51j679o30J695O10p73p58m87J235J188
$$ -53 -1133 -537 1230 801 -724 -804 -168 756 1007 -672 -1302 393 1003 230 -528 -1015 220 1408
1640A408j509j112J043P71Q2p26j115R04J449q22j046J10M47R29q8j620k8J559
$$ 1408 -101 -1213 -170 601 683 -43 -1158 -254 1195 373 -673 -563 -116 813 725 -895 -923 636
1658F36J41p19o27j82J270N36j492l78R54K21J9m27p15Q06P15p89l45K01J19N78
$$ 636 777 58 -569 -751 519 1055 -437 -815 139 360 379 -48 -763 43 758 -31 -376 -175 -56 522
1678E22k76r76N13P58l77k37j89r8P83M1q73P7M26O8J67m77m18P86K72o64m9J64
$$ 522 246 -730 -217 541 164 -73 -262 -360 423 464 -409 -332 94 162 329 -148 -566 220 492 -172 -221 -57
1700e7O8L52l46m90N21K68k68m7l01R1Q05l33q43L12N57J15k83p28K28J041k17
$$ -57 11 363 17 -473 48 316 48 1 -300 -209 596 263 -580 -268 289 404 121 -607 -379 662 445
1721D45q50m9M06N29j8r30k29R89M10o29o21J2Q75N40j018q10P92Q15j05q13o52
$$ 445 -405 -454 -48 481 463 -467 -696 293 703 74 -547 -535 340 880 -138 -948 -156 659 554 -259 -911
1742i11Q07J081n88j052LQ34P03n81j114K41J094K16p51o85K68R47K32r28o11
$$ -911 -104 977 389 -663 -660 174 877 296 -818 -577 517 733 -18 -703 -435 512 744 -184 -795
1761g95N85Q10k0q52n67P41R08m43q74j19O66P01m02r75P2Q25M14m75q45P4R79
$$ -795 -210 600 580 -272 -839 -98 810 367 -507 -626 40 741 339 -636 -564 261 675 200 -645 -571 408
1782D08L56p81p36L67R48J33q79o30O03R55j98r77l10P30Q28m14j050j1R55M61
$$ 408 764 -17 -753 -386 562 695 -184 -814 -211 744 546 -431 -741 -11 817 403 -647 -658 297 758
1802G58n98q77K25R89J51p45o06M03Q88k0q79l85O33P28l10q73m5P82M04n45o53
$$ 758 160 -717 -492 497 648 -97 -703 -300 588 568 -311 -696 -63 665 355 -518 -563 219 623 78 -575
1823e75K71O72L8m93l78L16N65j13n33j35L59M20k03n41K5M79J98l46l86K06M20
$$ -575 -304 368 406 -87 -465 -149 416 303 -230 -365 -6 414 211 -330 -305 174 372 26 -360 -154 266
1844B66rl49k17K60L40j21l30j12K54L39j91m02K7L67J94k72l96J65M26N2l62
$$ 266 257 -92 -309 -49 291 170 -160 -272 -18 321 130 -272 -245 122 316 44 -352 -187 239 291 -71
1865g1l00K35M92n7n13k25M50M85k73o21j4O36L42n53n62L02O43R1o08n05M65
$$ -71 -371 -136 356 299 -214 -439 11 496 223 -398 -412 224 566 13 -549 -247 396 487 -121 -626 -161
1886a61P51j79p60k71O47O83m15r13P6Q86L35o57p02K96Q77J26q18m99N29P22
$$ -161 590 411 -349 -620 27 710 295 -618 -542 344 679 22 -680 -384 493 619 -199 -698 -169 553
1906E53n5p97m28P18P18l98p81r3O93N67m85q15J67P65K56n05o44J74Q29J45p03
$$ 553 498 -299 -727 -9 709 311 -470 -563 130 697 212 -603 -436 329 585 80 -564 -390 439 584 -119
1927a19m48L60O44P4p11m34N59O36k22o29k72N37O76l38q33L0O85L82l73p74O8
$$ -119 -567 -207 437 511 -200 -634 -75 561 339 -290 -562 -25 651 313 -520 -490 195 577 204 -570 -502
1948e02Q94K35o98m87K45P23J83p65n08N92O22j69o35l18N92O61m55p27J50O09
$$ -502 392 627 -71 -558 -313 410 593 -172 -680 -88 534 365 -270 -588 4 665 210 -517 -367 242
1968B42K56m17o07K19P71n0o30k18L24N27m2p07j40O34K32l00l68o7M76L04m88
$$ 242 498 81 -526 -307 464 414 -216 -434 -110 417 375 -332 -472 162 394 94 -274 -341 135 439 -49
1989d9l24K98K58K2k26l11K83M01k81l14J28J66J83j05m45J47M49r8k30j20k1
$$ -49 -373 -75 183 205 -21 -332 -49 352 71 -243 -115 51 234 129 -316 -169 280 182 -48 -168 -189
2010a89L82J61n14j41L31J45L0k49l26L75L93l69k74R7J94K72k22n41K79N48j65
$$ -189 193 354 -160 -301 30 175 205 -44 -370 5 398 29 -245 -148 46 318 96 -445 -166 382 217
2031B17l67j79J61O24p3q11j2O11K39j63o00k13Q47L65p08m03K12M81L18n93n97
$$ 217 -150 -329 -168 456 383 -428 -440 171 410 247 -353 -566 281 646 -62 -465 -253 228 546 -47 -644
2052f44N73N87k95m17k22L49O56l51p79K47N67R7k42n79M2Q68K9p09j81K25M53
$$ -644 -71 516 221 -196 -418 -69 587 236 -543 -296 271 368 126 -453 -411 457 486 -223 -404 -179 274
2073B74K54o96m69O48M17k27l20l08L13O33l21n75J58K92K03k8n86l7O97M3m57
$$ 274 528 -168 -637 11 428 201 -119 -427 -114 519 198 -377 -219 73 276 248 -338 -375 322 365 -92
2094i2j77L3M84K73p09l52N56L44q8l62m51M27P03l51n94J5L15M55j19p60M6P00
$$ -92 -269 -236 248 521 -188 -540 16 360 272 -90 -541 -114 589 238 -356 -341 -26 429 310 -450 -404 296
2116B96J0l18k23m6M92K04o17j62M37J64p7l01k49M98L60n23k79K58K06J52k52
$$ 296 306 -12 -235 -281 211 415 -202 -364 73 237 160 -141 -390 108 468 -55 -334 -76 130 282 30
2137C0m18L01M22k24k17l4L8L35n2m46J39L05j11o1j21k8L20ml73P8K08j0L2j94
$$ 30 -388 -87 335 111 -106 -140 -102 233 181 -265 -126 179 68 7 -114 -142 178 174 -199 -121 87 77 109 -85
2161h5j82L52J74k90j02J6R2K80j66l65J72K34k7j3k58m3M22J1l55k6J40J61M9
$$ -85 -267 85 259 -31 -133 -117 -25 255 89 -276 -104 130 103 90 -168 -211 211 222 -133 -159 -19 142 191
2184A91l18j64M24J38k90j68J9K82K43l77l86L34L59p5k86l08K87N19k50m85N7
$$ 191 -127 -291 133 271 -19 -187 -168 114 357 -20 -406 -72 287 212 -74 -382 -95 424 174 -311 -254
2205b54L27K40j56n02O7N48L8l87k15J65L90M6m94j80M35K32j72k88j33L44L33
$$ -254 73 313 157 -345 -278 270 308 -79 -294 -129 261 307 -187 -367 68 300 128 -160 -293 51 384
2226C84l21l45J20K69J72k09l85J60L79l4k29j46O3K90L9l02j15J71J66L0k27
$$ 384 63 -282 -162 107 279 70 -315 -155 224 190 -39 -185 -122 168 207 -95 -210 -39 127 157 -70
2247g0j83K29K58j37k48j8J77K32j23l40L5K96J03j56k71K3L83O0l21j68J70K71
$$ -70 -253 -24 234 97 -151 -169 8 240 117 -223 -188 108 211 55 -216 -193 190 250 -71 -239 -69 202
2269B02nl28j22K77K37j66k82qL01J43k53k66J81K87m5k64j18K18K47j64k78N7
$$ 202 197 -131 -253 24 261 95 -187 -195 106 249 -4 -270 -89 198 153 -111 -229 -11 236 72 -206 -149
2291a49K42Q9j86k06J37K53m8k40o1J81J65j18k06M2K10L3j70r3R7J43j9j64m7
$$ -149 93 182 -4 -210 -73 180 132 -108 -169 12 177 59 -147 -105 105 138 -32 -125 -28 115 96 -68 -115
2314a15J48P8o7j23MJ26M3j06p2M7Q7K1p4p9K6J04K7q1j03N1J31J8j28r4Q5J44
$$ -115 33 111 44 -79 -75 51 94 -12 -84 -37 50 71 -3 -82 -56 48 75 -6 -109 -58 73 91 -37 -131 -46 98
2340I8mj63q8J42J65n5k07o1K13J86j62k65N0L02Q3k66k18J61L16k9l35j33K81
$$ 98 94 -69 -157 -15 150 95 -112 -173 40 226 64 -201 -151 151 234 -32 -250 -89 227 198 -137 -270 11
2363A1K79j56l62j8L69J81k96l08J51L66K6l48k03K67L07j03l41o8K99K40k11
$$ 11 290 134 -228 -246 123 304 8 -300 -149 217 243 -105 -308 -41 266 163 -178 -246 53 293 82
2384H2l32P1L41P7k82j96J62K68k6k64q9J82J83o5k16m9J66J43q3j73k8J54J31
$$ 82 -250 -179 162 239 -43 -239 -77 191 165 -99 -188 -6 177 112 -104 -153 13 156 73 -100 -128 26 157
2407A57j21j54J3J42P8o7j47l3J76R8j14j67J3K03J04k01j62J01K18J5j96j48
$$ 157 36 -118 -105 37 115 48 -99 -132 44 142 28 -139 -126 77 181 -20 -182 -81 137 152 -44 -192
2429a92J62K29o3k85n6K57J93j87k91Q2L37K5k73j59J66K86o7l28m2K83J42j56
$$ -192 -30 199 136 -149 -205 52 245 58 -233 -151 186 211 -62 -221 -55 231 164 -164 -206 77 219 63
2451F3k61N6L11M9l12j35K14K28j07k86l8L12J27k47k00J28K45K6k50j43K06K15
$$ 63 -198 -142 169 218 -94 -229 -15 213 106 -180 -218 94 221 -26 -226 -98 147 173 -77 -220 -14 201
2473B01j20k15rJ87J52j72k08J13J96pj37j21J09J82l9j91m8J23J27k8j72o2J65
$$ 201 81 -134 -143 44 196 24 -184 -71 125 118 -19 -140 -31 151 112 -79 -127 -4 123 95 -77 -139 26
2496B6J05o8j32o6J16J90q3k15m0J57J88o8k72l7L01J21k06k36P0L09R7l10k40
$$ 26 131 63 -69 -135 -19 171 88 -127 -167 -10 178 110 -162 -199 102 223 17 -219 -149 160 257 -53 -293
2519b93K18L38n2l68j77L47L78k27m68L0M25K31l25m32J43N20M6m39k57K48M45
$$ -293 -75 263 211 -157 -334 13 391 164 -304 -274 151 382 57 -375 -232 288 334 -105 -362 -114 331
2540C31o3m91j22M16K52k22l67J7M11J58l65k59J96L15J9k94k38K53L22j20k67
$$ 331 268 -223 -345 71 323 101 -266 -249 162 320 -45 -304 -108 207 226 -68 -306 -53 269 149 -118
2561a18p8J61K58o1l14j9K20J00m2j80j06K10J58j35j57j0J16J76j09k30M2K17
$$ -118 -196 -35 223 162 -152 -171 49 149 107 -73 -179 31 189 54 -103 -113 3 179 70 -160 -118 99
2583I9M8j13k05K2L10N3l27j11J81K32Ol45j43L49K20k18k42j0K69K31k94k95
$$ 99 147 34 -171 -149 161 214 -113 -224 -43 189 195 -150 -293 56 276 58 -184 -194 75 306 12 -283
2605b83K06K89m9k51j73K46L14k23l27J25K70O2k08k74J83L75j14l54k0K21K40
$$ -283 -77 212 163 -88 -261 -15 299 76 -251 -126 144 206 -2 -276 -93 282 168 -186 -206 15 255
2626B55j19l81L6L94J2k44j42Q3K64L3l39n7K67R6r5j84o7K69J58k66j68J35J58
$$ 255 136 -245 -209 185 197 -47 -189 -106 158 191 -148 -205 62 158 63 -121 -188 81 239 -27 -195 -60 98
2649I8P2j62k15J26K52m5j36j21lK76O9k85j12J30J74Q8k42k22K14K67q3k45j24
$$ 98 170 8 -207 -81 171 126 -10 -131 -134 142 211 -74 -186 -56 118 206 -36 -258 -44 223 140 -105 -229
2672b29J83L25j27m07J1L47J75k08l71L4M91J36m68k36K22M06M1m98k50M45L76
$$ -229 -46 279 152 -255 -244 103 278 70 -301 -267 224 360 -108 -344 -122 284 325 -173 -423 22 398
2693C98k37m18p4M34L23l67m42J97M40O4l66k95K28M45j01m29q6L04K70j42l79
$$ 398 161 -257 -331 103 426 59 -383 -186 254 318 -48 -343 -115 330 229 -200 -286 18 288 146 -233
2714b33k8L81J43k49k25M3K75J35k54k27J54K15L1j59j88R7K28Mk01p6P7J69N2
$$ -233 -261 120 263 14 -211 -168 107 242 -12 -239 -85 130 161 2 -186 -89 139 143 -58 -134 -57 112 164
2737A64k14j21J61J52k1j71j41J85K25j30k44NK03J50j43k81Q0K92K8k24j58J33
$$ 164 -50 -171 -10 142 121 -50 -191 -6 219 89 -155 -150 53 203 60 -221 -141 151 179 -45 -203 -70
2759g0K74l5l34o3K78J73j70k65L6L29P8l24j63K32K40o6l01r5L29J91k52k61
$$ -70 204 169 -165 -228 50 223 53 -212 -176 153 231 -93 -256 -24 216 150 -151 -246 83 274 22 -239
2781b39J13K95P4l03k21K59K83j32k87l6K52K02k03k86Q1K96N9k26j94J30K71
$$ -239 -126 169 243 -60 -281 -22 261 129 -158 -194 58 260 57 -229 -148 148 207 -19 -213 -83 188
2802A88l1k71q0J76J84n1k28n7J90J47r2j82m3J66J58r3k26LJ81J51j03k53nK76
$$ 188 157 -114 -194 -18 166 115 -113 -170 20 167 75 -107 -150 16 174 81 -145 -142 39 190 87 -166 -171 105
2826A05J29j92k44M3L26J13k91k71J64L57J3l58k18K77L66j17m32q4L64L06k41
$$ 105 234 42 -202 -159 167 280 -11 -282 -118 239 252 -106 -324 -47 319 202 -230 -314 50 356 115
2847A15m30L6M77J49l74l35J93M65Lm38k09L27L47j27m18p1L77K32k43l33N7L52
$$ 115 -315 -279 198 347 -27 -362 -169 296 299 -139 -348 -21 326 199 -219 -290 87 319 76 -257 -200 152
2869A52J17k77k50J46L14j1k67j35J71K29m0k55p1J99J33p4j85k0J46J18q4j45
$$ 152 269 -8 -258 -112 202 191 -76 -211 -40 189 149 -106 -177 22 155 81 -104 -124 22 140 56 -89
2891h9j9J22J12o2j71j7J75Q5j12j40PJ89Q7j75j36P8J75M1j94j25J56J85p0j98
$$ -89 -108 14 126 64 -107 -124 51 136 24 -116 -109 80 167 -8 -144 -66 109 150 -44 -169 -13 172 102 -96
2915i6o0K09J63j75k35R7K59J6k44j41J86K37r3k87j2K63J22j82k40J00K95jk98
$$ -96 -156 53 216 41 -194 -97 162 178 -66 -207 -21 216 123 -164 -176 87 209 27 -213 -113 182 181 -117
2938a17r0K09K04j00k83j0L03J03k19k01J08K59L2k78j57K38K04r6k30m7K07J76
$$ -117 -207 2 206 106 -177 -187 116 219 0 -201 -93 166 198 -80 -237 1 205 109 -121 -168 39 215
2960B15j65k09O0J79O9j19j78M7K15J2j53j00M1J77O9j91j32J05J66K4j43j78
$$ 215 50 -159 -99 80 149 30 -148 -101 114 126 -27 -127 -86 91 160 -31 -163 -58 108 132 -11 -189
2982a89J07K55j4k38r3J08K57pl23r4K83J78j20k77p0L39J99k73k83J18L15R9
$$ -189 -82 173 159 -79 -172 -64 193 186 -137 -231 52 230 110 -167 -237 102 301 28 -255 -137 178 277
3004B77l17k78K59L73j23l65j00K91K97j76m05L5L75J11k18k85O4L82M7l49j40
$$ 277 -40 -318 -59 314 191 -174 -274 17 314 138 -267 -232 143 254 36 -249 -185 197 244 -105 -245
3025b45K11K16j7k75j17K66J78j87j52kJ70J37j47j99J05J63j0q7j06K7J63K1
$$ -245 -34 182 165 -110 -227 39 217 30 -122 -124 46 183 36 -163 -58 105 95 8 -98 -71 92 113
3047A13j37l7J8P3R4j15j32R7R8pn7j06M1J75l9j51JP0P3Jj64l2K01N6j57r5M7
$$ 113 -24 -61 -43 30 124 9 -123 -26 72 65 8 -98 -57 118 79 -72 -71 -1 72 73 -91 -123 78 134 -23 -118 -71
3074g1J80N6k41j22K28J48j20j66m1K01J51k00j89J51J87m4j60j21J67K34j71
$$ -71 109 165 -76 -198 30 178 58 -108 -149 52 203 3 -186 -35 152 108 -52 -173 -6 228 57
3095E7k40Q1J99P6j72k43J48L22j01k60k8J54J82m3l06j0K94M6j63j20J3K02R7
$$ 57 -183 -102 97 173 1 -242 -94 228 127 -133 -161 -7 175 132 -174 -184 110 156 -7 -127 -114 88 185
3118A85k50r1J81P6l0j12j10J48J80j36j22PO2J45j8k47%K03M4m5j42j08K11J84
$$ 185 -65 -156 25 101 71 -41 -151 -3 177 41 -81 -74 -12 133 115 -132 -132 71 115 70 -72 -180 31 215
3142B15j78j76L5J15J95j19l15R3K74J4j60j80L0L51J6l54q0K32J78j8l21j17
$$ 215 37 -139 -104 11 206 87 -228 -135 139 153 -7 -187 -157 194 210 -144 -224 8 186 168 -153 -270
3164b70L68K04k74k42M8K68J97k91l03K22K96m2k37j75J72L26j17l40N1K07Q9
$$ -270 98 302 28 -214 -166 102 299 8 -295 -73 223 181 -56 -231 -59 267 150 -190 -139 68 157
3185A57q7k36J7K93Nk16m0O1J37N1k16p8J94N8p2n2r0J04J38q9j07L1J9P8L0j55
$$ 157 70 -166 -149 144 149 -67 -107 -46 91 142 -74 -152 42 100 28 -24 -114 -10 128 39 -68 -37 -18 60 90 -65
3211f5k2J38J4m0m9n6R1J14j14q8N9M2P1q0j37Q3J73n4j54m0J05J49o7k29L4K25
$$ -65 -87 51 65 25 -24 -80 11 125 11 -77 -18 24 95 15 -122 -39 134 80 -74 -114 -9 140 73 -156 -122 103
3237A03K3j31j37N9K25nk38n3J80J19q3j86rK42O9k31j11J36J77j2k31r1K28J74
$$ 103 126 -5 -142 -83 142 137 -101 -154 26 145 62 -124 -133 109 178 -53 -164 -28 149 137 -94 -185 43 217
3261B17j67k05L4K14R4j95j88J30K31l7j98j08J48J93p3k04j4J70Q3o0j79rJ86
$$ 217 50 -155 -121 93 187 -8 -196 -66 165 128 -70 -178 -30 163 90 -114 -128 42 125 65 -114 -123 63
3284F3P5j31j20L5J29Q0j06j44M8J33N9r3j31RJ91N1j60j19O3J74M9j73j57J43
$$ 63 138 7 -113 -78 51 131 25 -119 -71 62 121 28 -103 -94 97 148 -12 -131 -68 106 155 -18 -175 -32
3308c2K00l8k14j15J92K30j25k73MK50J40j85k60R9K71O8k63j77J50K68k4k96
$$ -32 168 130 -84 -199 -7 223 98 -175 -171 79 219 34 -226 -127 144 212 -51 -228 -78 190 166 -130
3330a30j02K60K04j48k56kK69J21k14j95J15K08K0j98j17J43J78o7j76k4J31J20
$$ -130 -232 28 232 84 -172 -174 95 216 2 -193 -78 130 150 -48 -165 -22 156 89 -87 -111 20 140
3352A40q7j57K4J46K2r2p3K0R3L0p6o3M8N8K3o2n9L3P7Qp5m2K7P9K4r3n4O5R9
$$ 140 53 -104 -80 66 88 -4 -77 -57 36 66 -10 -73 -25 33 56 -6 -65 -32 45 53 -22 -64 -37 42 66 -27 -81 -16 83
3381H3j2j14n1J15R3q4j22K7J39M5j27j15R2J53m4j50m2J33J31j13j82N7J75M0
$$ 83 71 -43 -94 21 114 30 -92 -65 74 119 -8 -123 -31 122 78 -72 -114 19 150 37 -145 -88 87 127
3405A27j68j15J12J99m9k22n2J98J39j15k09J7K53O3k14j30J22J93j3k24p8J82
$$ 127 -41 -156 -44 155 106 -116 -168 30 169 54 -155 -138 115 178 -36 -166 -44 149 136 -88 -166 16
3427A6J55r5j99lJ85J10j44j65O8J66N2j40j37P9J69j3j42o9P1J29J5j55p6R8
$$ 16 171 76 -123 -126 59 169 25 -140 -72 94 146 6 -131 -52 117 104 -38 -107 -36 93 108 -47 -123 -25
3451b5J22j2j31p9J06J44n6j60k4J16J36m7k10l1K04J24j28k04K4K44J09k42j84
$$ -25 97 85 -46 -125 -19 125 69 -91 -115 1 137 90 -120 -151 53 177 49 -155 -131 113 222 -20 -204
3474b04J33K37J4k41j52J84K50q9k65n6K33J73j44k86N7K87N8k18j74J13K59p
$$ -204 -71 166 180 -61 -213 -29 221 132 -133 -189 44 217 73 -213 -156 131 189 -29 -203 -90 169 162
3496A62k79p7K06J44o7k16m0K17J27j60j50O0J38O6j34j34J01J43l2q9n7L7J25
$$ 162 -117 -194 12 156 89 -127 -167 50 177 17 -133 -73 65 131 -3 -137 -36 107 75 -14 -71 -34 91
3519I1k8j36J9Q6J9j3q2k9R8M5p4l4j5N0J05q1j22L7J24K2o5j15RJ81Pj44m1O0
$$ 91 63 -73 -54 32 51 38 -44 -73 25 70 -4 -38 -53 -3 102 21 -101 -64 60 82 17 -98 -89 92 99 -45 -86 -26
3547b6J04Rj60n0J81O6j22r5J7J66O5k08j12J79J39p1j62q4J97J81j67k31Q6K02
$$ -26 78 87 -73 -123 58 124 2 -93 -76 90 155 -53 -165 14 153 82 -80 -164 33 214 47 -184 -98 104
3571A04O4j73k00J33K57p6k32k6J49J54p5k44K4K50M6j78j33M7K26O3k53j14J66
$$ 104 168 -5 -205 -72 185 109 -123 -149 0 154 79 -165 -141 109 155 -23 -156 -109 117 180 -73 -187 -21
3594b1J53lj87j15J54J90r4j56l4J01J38l1j87j8J66N3n0j28n9J70J05j48j24
$$ -21 132 129 -58 -173 -19 171 77 -79 -113 -12 126 95 -92 -110 56 109 59 -69 -128 42 147 -1 -125
3617a25M1J32J06j45j96J07K34j3k00j19J12K48j6k99p3K24J68o6k64p6K91J82
$$ -125 -84 48 154 9 -187 -80 154 141 -59 -178 -66 182 166 -133 -206 18 186 120 -144 -220 71 253
3639B53k30k15Q3K23J06k48k15J98K59r8k17q1J82K23j22k99N1K57O8j51j91K1
$$ 253 23 -192 -109 114 220 -28 -243 -45 214 116 -101 -182 0 223 101 -198 -147 110 178 27 -164 -143
3661a43K63M3k28q7J23J20K8j80j08J82J09r9q2j8Q1J13r2j40R2Q2mk2j07J3J41
$$ -143 120 163 -65 -152 -29 91 119 -61 -169 13 122 23 -59 -77 4 117 25 -115 -23 59 55 33 -74 -61 80
3686H0nj02l1L3P2O1j38p9J21P5k7q0r4J11J45r8j46K9J07P1o6j87O5K07l9j54
$$ 80 75 -27 -58 -25 47 108 -30 -109 12 87 60 -20 -114 -3 142 44 -102 -73 34 105 39 -148 -83 124 85 -69
3712f9m8Q9J45j7k38j7K40P1j41j63K2K40Q8k64j27J68J65%k20j30K25J99j66
$$ -69 -117 -28 117 100 -138 -155 85 156 15 -148 -126 114 202 -62 -189 -21 144 144 -76 -206 19 218 52
3735E2j97K3J84J24j68k27J39K28l1j93j04J21K28n7k58k0J87J19p4j91m4K21
$$ 52 -145 -122 62 186 18 -209 -70 158 127 -66 -170 -49 179 122 -136 -156 31 150 76 -115 -159 62
3757F2R3j46j29J6J58J01j37j66P4J66L2j21j44P2K02J6k07q6J17J62Pk27r9J96
$$ 62 155 9 -120 -104 54 155 18 -148 -74 92 124 3 -141 -69 133 149 -58 -144 -27 135 142 -85 -184 12
3781A2J74r3k06o1K11J78j61k39L2K44J12k06k19J03K89J5k79j24J65K52m9l07
$$ 12 186 93 -113 -174 37 215 54 -185 -153 91 203 -3 -222 -119 170 185 -94 -218 -53 199 150 -157
3803a57n5K49J66j54k23K4K52R3k10j69J13K19Nk13j17J69J71p6k06j6J71J12
$$ -157 -212 37 203 49 -174 -150 102 195 -15 -184 -71 148 153 -60 -177 -8 163 87 -119 -135 36 148
3825A48j03j83M1J71N3j32j17N7J58Rj45p0Q1J10j1j13n9R5J12m2j31k1J01R4
$$ 148 45 -138 -97 74 127 -5 -122 -65 93 102 -43 -113 -32 78 67 -46 -105 -10 102 60 -71 -92 9 103
3849A03o0j32RJ31M9r2j02L9J37L4j40j02R0J49j8j50q9J53J49q3j78k0J78J10
$$ 103 43 -89 -80 51 100 8 -94 -55 82 116 -24 -126 -36 113 95 -55 -144 9 158 75 -103 -123 55 165
3873A65j42j96Q3K27J1k10j35J63J98o5k33l3K04J57j45k29K5K60R4k24j77J25
$$ 165 23 -173 -90 137 148 -62 -197 -34 164 99 -134 -167 37 194 49 -180 -155 105 199 -25 -202 -77
3895g7K39Kk40j26J86K13q3k40l5K07J55j46k11L6K12P0j54j67O7K07L3j78j26
$$ -77 162 164 -76 -202 -16 197 114 -126 -161 46 201 55 -156 -120 92 162 8 -159 -92 115 148 -30 -156
3918a56J04J72J0j93j02J50J48l1j92q2J61J71q2k07j9J75J40j03k17QK26Q8j52
$$ -156 -52 120 130 -63 -165 -15 133 102 -90 -172 -11 160 78 -129 -148 27 167 64 -153 -145 81 169 17
3941A7j90N4K41P6k44j60J54K29j6k57j20K16K23j31k56qK33J57j73k56P6K73
$$ 17 -173 -119 122 198 -46 -206 -52 177 161 -96 -216 0 223 92 -164 -172 61 218 45 -211 -135 138
3963A38M5k17j70J38K36k8k53q2K01J70r6k28j6K26J10j78j64P9J86L7j73j24
$$ 138 183 -34 -204 -66 170 142 -111 -193 8 178 82 -146 -162 64 174 -4 -168 -89 97 134 -39 -163
3985a63J38J65n5j58n4J26J35p2j64QJ40N4o2j30jJ69L7j31q8N3J08K9j14q8Q7
$$ -163 -25 140 85 -73 -127 -1 134 62 -102 -94 46 100 38 -92 -93 76 113 -18 -106 -53 55 84 -30 -118 -31
4010c1J19k6j26o1R7J56o8j64JJ35P8o2j65jK08N9j68j31R4J76K1k13j11K04J59
$$ -31 88 62 -64 -125 -28 128 60 -104 -103 32 110 48 -117 -118 90 149 -19 -150 -56 120 141 -72 -183 21 180
4035A80j05j94k7J99J55j92k15J04K19M2j99j84J51K54o1k63m9J93J71r3k67O
$$ 180 75 -119 -146 53 208 16 -199 -95 124 166 -33 -217 -66 188 127 -136 -185 8 179 86 -181 -175
4057a75K75Q9j96j68N4K37O8k44j32J70J61m3j80q7J74J81j04k09QJ56J22q6k22
$$ -175 100 189 -7 -175 -121 116 184 -60 -192 -22 139 96 -84 -171 3 184 80 -129 -121 35 157 71 -151
4080a51K0K21O3j36j45J0K03R1k05j43J15J59L3j73j58J38K22n8j97o5J33J98
$$ -151 -131 90 153 17 -128 -118 85 176 -29 -172 -57 102 135 -38 -196 -58 164 106 -91 -156 -23 175
4102A75o2k78jK30J16j37k18K1K72Q5k43j57J35K09K7k43j40K10K10j29k02k8
$$ 175 113 -165 -166 64 180 43 -175 -154 118 203 -40 -197 -62 147 174 -69 -209 1 211 82 -120 -148
4124a48J84J74j58k47Q6K38J7j64j51R8K41m5k40l7J74J12n6k06k5K27P2j49j28
$$ -148 36 210 52 -195 -109 129 146 -18 -169 -71 170 125 -115 -152 22 134 78 -128 -153 74 146 -3 -131
4147a31M1J54P8j59j30J17J36k9j13p4Q4J53o7j48J9J01N8l2j43j4J62N8j40q3
$$ -131 -90 64 142 -17 -147 -30 106 77 -36 -110 -26 127 60 -88 -69 32 90 58 -85 -99 63 121 -19 -102
4171a02L1J28O6j49j23J19J35j2j30j13J25J86p1k15KJ55J15r6k02L8K40K7j94
$$ -102 -71 57 123 -26 -149 -30 105 93 -37 -150 -25 161 90 -125 -123 32 147 51 -151 -113 127 154 -40
4194d0j24R7K12J4k64j08K27J82j02k26m8K51J63k04k36R4K34P6k04k13J59K60
$$ -40 -164 -67 145 159 -105 -213 14 196 94 -132 -180 71 234 30 -206 -112 122 198 -6 -219 -60 200
4216B00o3k43n4J50J87o9k64kK18J05j37j70JK26J03k13j41R9J70N0j82j65J64
$$ 200 137 -106 -160 -10 177 108 -156 -158 60 165 28 -142 -141 85 188 -25 -166 -67 103 153 -29 -194 -30
4239c0J83m6j76p0J12J89m8k33oJ65J07p4j85l4K24J11j56j68L7J76J13k01k04
$$ -30 153 107 -69 -139 -27 162 114 -119 -125 40 147 73 -112 -146 78 189 33 -135 -98 78 191 -10 -214
4262b14J40K30k3j97j26J42K47q2k58l2K18J36j06k41J4K64P7k09j59Q9K42K7
$$ -214 -74 156 133 -64 -190 -48 199 117 -141 -173 45 181 75 -166 -152 112 189 -20 -179 -90 152 179
4284A79k52j34K02J97j05j94o4K25J49j73j89O3J94O2j58j59R1K11l4j83o6J26
$$ 179 -73 -207 -5 192 87 -107 -171 54 203 30 -159 -96 98 160 2 -157 -66 145 111 -72 -138 -12
4306a2J48n5j84k2J72P7r8j46K3J53Q0j45j17Q1J22J7j34q3R1J48m3j32n3J09
$$ -12 136 81 -103 -125 47 124 26 -120 -97 56 136 -9 -126 -45 77 94 -40 -123 -32 116 73 -59 -112 -3
4330cJ38o5j67j8J60R7j02j64J2J87Q8j77j42Q2J98K1k09j26J65J97p7k19n0J97
$$ -3 135 70 -97 -115 45 142 40 -124 -112 75 163 -14 -156 -74 124 145 -64 -190 -25 172 95 -124 -174 23
4354B3J59j29k34J9K55Q9j81k20J12K57J9k54j28J79K08m5k64n7K38J69j55k30
$$ 23 182 53 -181 -162 93 182 1 -219 -107 150 169 -85 -213 -34 174 129 -135 -192 46 215 60 -170
4376a70L4K29J06j97j89R1K32K6k13j31J33K15m2k43n3J70J68q7k16k6K10J19
$$ -170 -136 93 199 2 -187 -96 136 162 -51 -182 -49 166 124 -119 -172 -2 166 79 -137 -163 47 166
4398A66j22j94K0J92J04j58j78P4K03M7j74j49R7K20mk04j15J42J87l7k31o3K11
$$ 166 44 -150 -130 62 166 8 -170 -96 107 154 -20 -169 -72 148 144 -60 -175 -33 154 117 -114 -177 34
4421C4J49j14k12kK16J13j69j92P6K25L8k09j57J51K24l6k55n9J90J80j16k46
$$ 34 183 69 -143 -145 71 184 15 -177 -101 124 162 -47 -204 -53 171 135 -120 -179 11 191 75 -171
4443a71QK51R7j92j76P0K46K4k20j14J58J73n4k07n4J89J52j33j83L0J84P1j45
$$ -171 -163 88 185 -7 -183 -113 133 157 -63 -177 -19 154 100 -107 -161 28 180 47 -136 -106 78 149 4
4466Dj60Q7J85pj57q6R6J72l9j84l3J30J10n9j53l4J66R3j23j26L7J37P1j40j49
$$ 4 -156 -69 116 109 -48 -134 -38 134 95 -89 -122 8 118 59 -94 -128 38 131 8 -118 -81 56 127 -13 -162
4491a62R4J71Nj54j07J14J88m7k17k5J58J53q5k28k4K54J13j85j79N7K31O9k23
$$ -162 -68 103 108 -46 -153 -39 149 102 -115 -140 18 171 86 -142 -166 88 201 16 -163 -106 125 194 -29
4514b9j77J51K25m5k21r5K05K01j29k67K9K31J23j71k28P5K66K8k32j33J31K36
$$ -29 -206 -55 170 125 -96 -191 14 215 86 -181 -152 79 202 31 -197 -122 144 172 -60 -193 -62 174
4536A74j9k65r7K16J72q5k16n3K14J56j69j90N1K01P6j62j74Q1K31nj87r1R0J89
$$ 174 155 -110 -207 9 181 96 -120 -173 41 197 28 -162 -111 90 166 4 -170 -89 142 137 -50 -141 -51 138
4560A38rk20p4J61J48m1j96q1J89J70j32k01PJ89J09j13k18N7K37L0j68j43P6
$$ 138 129 -91 -165 -4 144 103 -93 -174 15 185 53 -148 -141 48 157 44 -174 -117 120 150 -18 -161 -85
4583h5K19K2k33j07J91J68q2k17n5K39J57j86k08P4K02Q9j99k00J62K26m9k13
$$ -85 134 156 -77 -184 7 175 93 -124 -179 60 217 31 -177 -103 99 188 -11 -211 -49 177 128 -85
4605h5q7J54J91p7k42PK00P9j16j72L2K22K7j97q2J13J54j8j77r4J89J36j19j37
$$ -85 -172 -18 173 96 -146 -139 61 140 24 -148 -116 106 133 -64 -146 -33 121 103 -74 -168 21 157 38 -99
4629i9j9J35J39j26j67N4J56M5j01j39L8J91J7j69q5R6J30J4j84p4J66J25q6j52
$$ -99 -118 17 156 30 -137 -83 73 118 17 -122 -84 107 124 -45 -130 -34 96 110 -74 -148 18 143 57 -95
4653i5m3J65J51j47k12Q0J78P6j46j94P8K65ok29r8J37K11l1k67p0K48J38j37
$$ -95 -138 27 178 31 -181 -101 77 153 7 -187 -109 156 150 -79 -177 -40 171 140 -127 -197 51 189 52
4676E2k06NK40J18k23j79J30K24Ok38j37J80K44j07k53k1J85J80j24k54J1K73
$$ 52 -154 -149 91 209 -14 -193 -63 161 167 -71 -208 -28 216 109 -144 -165 20 200 76 -178 -167 106
4698A06P9j86j74M9K42N2k21j40J37J89j5j81j15J69J82q9j89l3J58J43p8k10
$$ 106 185 -1 -175 -126 116 168 -53 -193 -56 133 118 -63 -178 -9 173 84 -105 -138 20 163 85 -125
4720a25rK04P1j01j71J3K12P4j81j36R2J57L5j66j58J49K11o4k05n3J55J62q9
$$ -125 -134 70 141 40 -131 -118 94 168 -13 -149 -57 100 135 -31 -189 -40 171 107 -98 -151 4 166 77
4743G7k40L1K10P5j48j75O0K50J6k29j04J50J85l0k32p1K13J55j56j79K3J93J12
$$ 77 -163 -132 78 153 5 -170 -110 140 156 -73 -177 -27 158 128 -104 -175 38 193 37 -142 -119 74 186
4766A86j79j81J17J91rj73j16J33J92o7k12qJ68R2q7j80K5J98L8j45j00M3J49
$$ 186 7 -174 -57 134 125 -48 -164 -31 161 94 -118 -126 42 134 47 -133 -108 90 128 -17 -117 -74 75
4789G5L7j59r1J19J29l7j27q4J25J63r0j62NJ31R1q4j59K6J88L7j46j05N1J76
$$ 75 112 -47 -138 -19 110 73 -54 -138 -13 150 60 -102 -97 34 125 41 -118 -92 96 133 -13 -118 -67 109
4813A09L0j80j22J43J64l5j90r1J91J61j13k17J0K04J22j63k16Q4K49J5j91j51
$$ 109 139 -41 -163 -20 144 109 -81 -172 19 180 67 -150 -140 64 186 23 -193 -109 140 155 -36 -187
4835a87J32K25k9k54p6K09J71j03k38j7K47J28j84j89O4K28N8k16j53J48K04l0
$$ -187 -55 170 141 -113 -189 20 191 88 -150 -167 80 208 24 -165 -101 127 185 -31 -184 -36 168 138
4857A38k22q9J77J79q4k23rJ76J17j18j83K7J94N7j41j30N0J73M4j64j15J06J57
$$ 138 -84 -173 4 183 99 -124 -133 43 160 42 -141 -114 80 137 -4 -134 -84 89 133 -31 -146 -40 117
4880A17nj65q8J14J55l6j81l6J42J29p6j84mJ83Q9j28j64N1J86N8j90j45J34J93
$$ 117 112 -53 -141 -27 128 92 -89 -125 17 146 70 -114 -118 65 154 26 -138 -87 99 157 -33 -178 -44 149
4904A49k5k13p5J69J76j08k11NJ97R8j46j92Q1K08K3j80j27J26J86m1k05m2J77
$$ 149 124 -89 -164 5 181 73 -138 -133 64 162 16 -176 -95 113 136 -44 -171 -45 141 100 -105 -147 30
4927C0J21j05j71J3J84Q6j73j35R9J53J7j68q4J20J42n8j45l5J31J01p6j58J7
$$ 30 151 46 -125 -112 72 158 -15 -150 -51 102 119 -49 -133 -13 129 71 -74 -109 22 123 47 -111 -94
4950i4J57N0j07j11K5J69K8j49q3Q0J35mj40p9J07J35n0j45l8J26J30p6j79rJ90
$$ -94 63 113 6 -105 -80 89 117 -32 -115 -35 100 96 -44 -123 -16 119 69 -76 -114 12 142 66 -113 -122 68
4975F8P0j06j65K7K20N4j92j26J04J90Mk22j10J92J86j01k18l8K06J54j57k24
$$ 68 138 32 -133 -106 114 168 -24 -150 -46 144 148 -74 -184 8 194 93 -125 -163 43 197 40 -184
4997a84O9K28N9j85j94J24K44k3k38q2J79J79p2k41m0K46J07j53j66L2K05P2j72
$$ -184 -115 113 172 -13 -207 -83 161 138 -100 -182 -3 176 104 -137 -177 69 176 23 -143 -111 94 166 -6
5020fj51J07J68J9j62j20J18J74o0j55n6J20J28n0j65j9J57P6q4j25j7J54Q0j34
$$ -6 -157 -50 118 137 -25 -145 -27 147 87 -68 -124 -4 124 74 -91 -110 47 123 39 -86 -103 51 131 -3
5044cj12M3J38M8j19j49J07J74l0j60p1J11J62m4k08l2J88J07j04j73J8K04P2
$$ -3 -115 -72 66 114 -5 -154 -47 127 97 -63 -134 -23 139 95 -113 -145 43 150 46 -127 -109 95 167
5067A67k03j12J05J53K3j79j24J68J64r5j63l1J61J24j26k02Q9J84J2j51j12R6
$$ 167 -36 -148 -43 110 133 -46 -170 -2 162 67 -96 -127 34 158 32 -170 -81 103 115 -36 -148 -52
5089e2J80k5k10k2J47J08o8j53j3J74O1j31j09M8J44L0j39j06J22J30m4j11o1
$$ -52 128 103 -107 -129 18 126 58 -95 -108 66 127 -4 -113 -65 79 109 -30 -136 -14 116 72 -39 -100
5112a00J01J24o5j52J6J06P2o5j39kJ67N5j22j01L0J41O1j35j43J05J49lj48j04
$$ -100 1 125 60 -92 -76 30 102 37 -102 -104 63 118 -4 -105 -75 66 127 -8 -151 -46 103 100 -48 -152
5136a52J19J79o0k16oJ62J11o6k26J9K31P6j87j41P9K05M5k29j31J82J72o2k08
$$ -152 -33 146 86 -130 -136 26 137 71 -155 -136 95 171 -16 -157 -78 127 172 -57 -188 -6 166 104 -104
5159a04n9J92J74j39k21N5J92O5j43j72P0K36k9j84q0J10J69k2k21l7J83R5p2
$$ -104 -163 29 203 64 -157 -102 90 155 12 -160 -90 146 117 -67 -147 -37 132 110 -111 -148 35 130 58
5182E8j55l5J72J14j46j30N6J26O9j23j54R9J51pj28o3M9J59Lj89m7J30R2l6j42
$$ 58 -97 -132 40 154 8 -122 -66 60 129 6 -148 -49 102 95 -33 -96 -47 112 115 -74 -121 9 101 65 -77
5207g7m8J54J15j19j32OJ47Q6j28j48P5J73mj35r7Q6J71k8j91l6J58J05p6j68
$$ -77 -125 29 144 25 -107 -101 46 132 4 -144 -69 104 100 -35 -132 -46 125 97 -94 -130 28 133 57 -111
5231a11kK00O1j70j20Q9J54K6j75r2J63J32p5j76pJ47J14j34j62P2J59K7j34j15
$$ -111 -113 87 148 -22 -142 -53 101 127 -48 -140 23 155 80 -96 -103 44 158 24 -138 -66 93 120 -14 -129
5255a29Q8J61k6j85k0J11J18n3j65qJ59O7j04j16J8J39P1j27j23Q0J35Oj11j03
$$ -129 -41 120 94 -91 -111 0 118 65 -100 -108 51 118 14 -102 -84 55 126 -1 -124 -44 91 97 -14 -117
5279a17P9J46nj46n5R2J19l0j71k6J58R9r6j46j3J69R6j48j47O7J69L8j64j32
$$ -117 -38 108 103 -43 -98 -6 113 83 -88 -114 44 143 47 -99 -112 57 153 5 -142 -75 94 132 -32 -164
5303a64J12K08m4k05o5J64J53p3k28rK29R5j50j82M6K34N3k20j20J26J85j3k09
$$ -164 -52 156 112 -93 -158 6 159 86 -142 -151 78 173 23 -159 -113 121 174 -46 -166 -40 145 132 -77
5326g7r5K02J45r8j89%J62J16j17j90M6J75N1j33j41O9J86Oj76p2J23J15j5j68
$$ -77 -172 30 175 77 -112 -112 50 166 49 -141 -95 80 131 -2 -143 -74 112 118 -58 -130 -7 108 93 -75
5350g5n1J27J27q9j26j8J19J08r4j39L0J37O0j04j31L8J75K7j56q3R4J42j0j73
$$ -75 -126 1 128 39 -87 -105 14 122 28 -111 -81 56 116 12 -119 -81 94 121 -35 -118 -24 118 108 -65
5374f5o8J59J19q8j48l2J60J10j17j71N5J81L8j51j40J17J75l4j93n6J50J32q1
$$ -65 -133 26 145 57 -91 -123 37 147 30 -141 -86 95 133 -18 -158 -41 134 100 -93 -149 1 133 52
5397E2j78J1J78Q3j45j35O3J68K2j72p8J18J36l7j65m1J51J12j03j46K6J43O6
$$ 52 -126 -115 63 146 1 -134 -71 97 119 -53 -131 -13 123 86 -79 -120 31 143 40 -106 -80 63 129
5420A29j19j39O9J58Qj30r2Q6J26j0j43o1J14J07l9j51k7J31J02p1j51J4J36Q2
$$ 129 10 -129 -60 98 106 -24 -116 -30 96 86 -57 -118 -4 103 64 -87 -114 17 119 48 -103 -89 47 129
5444A29j06j47N4J62L5j40j28Q7J83j1j86q2J43J52n4j96m5K00J14j25j86M6K00
$$ 129 23 -124 -70 92 127 -13 -141 -54 129 118 -68 -150 -7 145 91 -105 -150 50 164 39 -147 -101 99
5467I9O9j79j72J16K08j0j90j19J48K00o7k32k8J91J34j17j87J3J98O5j45j36
$$ 99 168 -11 -183 -67 141 131 -59 -178 -30 170 103 -129 -157 34 168 51 -136 -123 75 140 -5 -141
5489a41O5J73M3j83j12J39J50l8j62n4J38J27q5j65QJ38Q8q5j56L0J67L9j35j00
$$ -141 -76 97 140 -43 -155 -16 134 96 -66 -120 18 145 60 -105 -97 41 129 44 -112 -82 85 124 -11 -111
5513a11L7J64K6j55q8R6J35j8j42p1J20J35q0j34j4J20J11q5j76L9J69N9j33j34
$$ -111 -74 90 116 -39 -127 -31 104 86 -56 -127 -7 128 48 -86 -100 20 131 46 -130 -91 78 137 4 -130
5537a30N9J75K4j89q0J33J49m1j79n5J72J22j26j48L6J51P2j47j54J19J59k7j47
$$ -130 -71 104 128 -61 -141 -8 141 100 -79 -134 38 160 34 -114 -78 73 145 -2 -156 -37 122 95 -52
5560e2o8J21J30o0j88OJ60P3r6j50L3J74L8j58p4P1J33K0j49p3J22J06n9j14m3
$$ -52 -120 1 131 71 -117 -111 49 122 26 -124 -91 83 121 -37 -111 -40 93 113 -36 -109 13 119 60 -54 -97
5585i7J19J11q3j52L6J16N4p8j27K3J66K5j32q3N3J45K3j69r0J32J27l9j48o5
$$ -97 22 133 50 -102 -66 50 104 26 -101 -78 88 113 -19 -102 -49 96 119 -50 -140 -8 119 80 -68 -133
5609a33J38J48q9j84J4J58Q9j12j76N7K12J8j80j05J06J76ok17q0J94J29p8j94
$$ -133 5 153 64 -120 -106 52 141 29 -147 -90 122 140 -40 -145 -39 137 131 -86 -166 28 157 79 -115
5632a15k2J98J16j52j78P2J77M6j44j60J03J91k3j82n5J21J40m7j79l1J75P0r4
$$ -115 -137 61 177 25 -153 -81 96 142 -2 -162 -59 132 109 -73 -128 -7 133 86 -93 -124 51 121 27
5655B7j27QJ55O8j34j15P6J24K3j24j10R4J53m0j25n0Q4J29m1j45l8J40Q4o7j23
$$ 27 -100 -92 63 131 -3 -118 -42 82 105 -19 -129 -35 118 78 -47 -97 -13 116 75 -70 -108 32 116 49 -74
5680g4k7J53Q1j34j10N9J25M1j28j31J05J67m9j44n1J02J50n5j94j0J82P2j02
$$ -74 -101 52 133 -1 -111 -52 73 114 -14 -145 -40 127 78 -66 -117 -15 135 80 -114 -124 58 130 28
5703B8j44K8J75L9j70p8R7J28%j66o4J62J03j04j32J8J37P7j23j41Q6J44qj22
$$ 28 -116 -88 87 126 -44 -122 -25 103 103 -63 -127 35 138 34 -98 -80 57 134 11 -130 -44 100 92 -30
5727c0q3Q7J42l0j63k1J05P7l2j39j7J58M6r3r7K7J11O3j26r8Q7J00J0j04q6P2
$$ -30 -113 -26 116 86 -77 -98 7 84 52 -87 -104 54 100 7 -90 -63 48 111 -15 -113 -26 74 84 -20 -106 -34
5753c4J46l8j38k9J05J01l9j55l0J74O5q9j39J0J57R0j64j37R7J43K0j47j19J16
$$ -34 112 74 -64 -93 12 113 74 -81 -111 63 128 39 -100 -90 67 157 -7 -144 -47 96 116 -31 -150 -34
5777c4J66m5j83k5J46J17q8j89K5J92N1j30j36N1J92K3j77r3J33J27k7j65o1J57
$$ -34 132 87 -96 -121 25 142 54 -135 -110 82 133 3 -133 -82 110 133 -44 -137 -4 123 96 -69 -130 27
5801B7J22j12j36J8J38P1j13j32N5J56Lj23p5N9J35%j54m2J08R1l6j36k1J24P3
$$ 27 149 37 -99 -81 57 128 15 -117 -62 94 97 -26 -101 -42 93 93 -61 -103 5 96 60 -76 -97 27 100
5826A00o4j11LJ10P2r3j14L8J32J4r0q3M0J28J3j30n8Q6J06j8j36m4J25J02q5
$$ 100 36 -75 -72 38 110 17 -97 -59 73 87 -3 -86 -46 82 95 -35 -93 -7 99 81 -55 -99 26 128 43
5851D3j10LJ24P0j36j16O9J59j3j31p8R9J34n1j45pJ23P2q1j50L8J68J5j28r2
$$ 43 -67 -64 60 130 -6 -122 -53 106 93 -38 -116 -17 117 66 -79 -86 37 109 28 -122 -84 84 99 -29 -121
5876a21R3J27mj48n0J20R7o4j16qJ16Q4j11j08M4J12K8r6q8N3J24lj14m8O6J13
$$ -121 -28 99 95 -53 -103 17 114 50 -66 -74 42 126 15 -93 -49 63 91 -5 -93 -40 84 81 -33 -81 -15 98
5902I8l5j24k1J00O5m5j08oJ09O7r5r0K8J15M1j06j04P8J13J1j22o0P2J19k2j38
$$ 98 63 -61 -82 18 83 38 -70 -76 33 100 5 -85 -57 58 99 -7 -111 -33 80 91 -31 -91 -19 100 78 -60
5928f0l6J24Q1n1j40pJ43P1j06j30N4J31M3j34j09R9J48l4j47o7J30J25q4j54
$$ -60 -96 28 109 58 -82 -89 54 125 19 -111 -57 74 117 -17 -126 -27 121 87 -60 -127 3 128 44 -110
5952a10J8J41O3r1j39N1J58J2j39p4R4J10j3j32m9J13R3o6j08oJ08P0q1j06L3
$$ -110 -92 49 112 21 -118 -67 91 103 -36 -110 -16 94 81 -51 -100 13 106 40 -68 -74 34 104 23 -83 -50
5977e0J09L2p9r6M8J11Rj06n1O0Q7j4r8m0Q4O7l4r1k6R6Q1p7j04J6J10L9p6r2
$$ -50 59 91 12 -84 -36 75 84 -22 -73 -13 74 60 -38 -78 6 73 39 -52 -78 18 99 22 -82 -66 44 83 7 -85
6005h5M2J19Kj06n3O8J05k1j35j3J21N7n9j16%J36M2j10q1O7J07Lj28p1J12J11
$$ -85 -43 76 78 -28 -81 -13 92 71 -64 -77 44 101 42 -74 -74 62 104 -6 -87 -20 87 90 -38 -109 3 114
6031A14o1j22j4J13Q4r8j10K8J24K2r3q7N1J29rj24l8Q7Q2l2j04k3J11O4p6q5
$$ 114 53 -69 -83 30 114 16 -94 -66 58 80 -13 -100 -49 80 71 -53 -91 -4 78 46 -58 -81 30 94 18 -67
6057f7J7R6N4r0r3M9R8J1q5o3L6J18j0j17k9P7P9j5j23l8J15O8o6r9kJ15O8r8
$$ -67 -50 46 100 10 -83 -34 64 75 -10 -73 -37 81 71 -46 -75 2 81 66 -57 -95 20 88 22 -77 -79 36 104 6
6085Fj03N6J11J5r8r6P4J52l6j32m5R1J08l7j45k1J51P2j01j13K3J48M2j43q9
$$ 6 -97 -41 70 85 -13 -109 -35 117 81 -51 -96 -5 103 66 -79 -100 51 123 22 -91 -68 80 122 -21 -110
6110a10R0J16k5j14o2J18R8o5j26KJ20N7p7j17L4J25J9q7p8L4J16%j19l7R0P0
$$ -110 -20 96 71 -43 -105 13 111 46 -80 -78 42 99 22 -95 -61 64 83 -4 -82 -48 68 68 -51 -88 2 72
6136G2k0r2l2Q7P0n5q0jP5N9p0q0J7J06J4o8p5L9R9oq4n5Q0P4k2j02l4J09O5o9
$$ 72 52 -40 -72 15 85 30 -50 -51 24 83 13 -67 -50 56 70 2 -73 -34 65 59 -25 -80 0 74 52 -50 -84 25 90 21
6166B1r5J4R9N4q3j01N3J04jr3o9P6J14l2j24j1J03O1o3j01J4J15M7j15p5N0J20
$$ 21 -74 -60 39 93 10 -91 -38 66 65 -28 -97 -21 93 61 -63 -74 29 90 27 -74 -60 55 102 -13 -88 -38 82
6193H2lj02o7Q0J04m9j02j8J00O6n7j16K9R8L6q6p4K7J17Jj08k9N4P5rq5n1R7
$$ 82 79 -23 -90 -10 94 45 -57 -75 25 91 34 -82 -53 45 81 -5 -79 -52 65 66 -42 -71 -17 58 49 -36 -87 10
6221A0P4n4q2j9R0O5n7j07M9Q4K0p0p7L0J16J2j07n3P2P5mj14n2R8Q8m3j02k9
$$ 10 84 30 -52 -71 19 84 27 -80 -31 53 73 3 -74 -44 72 84 -23 -76 -4 71 67 -47 -99 -1 87 44 -58 -87
6249h7J05Q1q4j16L9J21K3q7j11P5J11lj15n5R3R1j8j30j5J15O8q7p6lJ17M6j09
$$ -87 18 99 15 -101 -62 59 82 -5 -116 -41 70 67 -48 -103 -10 81 63 -67 -82 33 101 14 -62 -65 52 98 -11
6276a1p6N9R8Jr6n7P6Q9n1q5j2O8Q3p0r8K3J01K5p0o2J7R6J6r5m2N7N8Kp4l4O1
$$ -11 -87 -28 70 71 -25 -82 -6 83 32 -53 -65 3 86 16 -82 -59 42 67 -3 -65 -48 48 64 -31 -73 -16 42 44 -30 -64 -3
6307cO4l2o5k2O5O9m8q4K1P8J3m6p1K1J07Mr5m8O7Q1j4j08k9R9O7o5q2MQ6M0q0
$$ -3 61 29 -36 -58 7 76 28 -56 -35 43 56 10 -61 -40 67 71 -24 -72 -5 76 62 -46 -75 24 91 26 -56 -52 34 74 -6
6338fo6M3R2Kq9o4O3J10l5j12qQ8N7m7r7LJ15K2q0n8K9J00jp9n2Q3O4l2j00LO9
$$ -6 -72 -29 63 65 -24 -88 -25 85 50 -62 -70 18 75 28 -69 -66 49 71 -9 -67 -38 62 61 -18 -70 13 77 45 -55 -52 17
6369A7O9n9r0K3P3M1o8p6L3R4jp5n3N6P3mr4k5N8P5k5q8l1Q6P0n4q4J0Q0N7p3
$$ 17 86 27 -63 -40 33 74 6 -70 -37 57 56 -19 -72 -16 57 53 -41 -66 -8 67 42 -46 -77 9 79 25 -59 -49 31 88 15
6400A5q5K8R9J2p6o4M1J00mj09l3Q2P0l1j06j5J08N4p4r1K2J10K8r2p4N4R4j0
$$ 15 -70 -42 57 69 -7 -71 -30 70 66 -43 -76 6 76 45 -61 -76 32 86 12 -79 -57 53 81 -11 -85 -31 63 53
6428E3r0l8P1P9n0r6J1Q8L6l9q7%J07J9q0n6M9P2J9q9m1N3O8j0p5k8O7N0l8p3
$$ 53 -37 -75 -4 75 25 -71 -60 28 64 25 -62 -62 45 64 -16 -72 -23 49 68 -21 -62 -9 59 49 -26 -54 13 63 25 -48
6458d8oP4L9n0n4jQ0Qn8n1L8O7J6q3l4N8N6k4q4oO2O7n1o9NQ1K7m9p2L5P9Np6
$$ -48 -54 20 59 9 -45 -46 34 42 -16 -67 -29 38 54 -29 -63 -5 51 27 -57 -63 -1 66 15 -54 -49 32 59 10 -62 -27 52 57 -19
6491a9m3M7Q2nj00j9Q1M5m6p9OR3K1o3p0M1P9Kp7n4P3O3j9q1k1O3P0m0r6K3P4
$$ -19 -62 -15 67 62 -38 -57 24 69 23 -56 -50 43 64 1 -69 -28 51 53 -24 -78 -5 58 39 -42 -63 0 70 30 -66 -43 31
6522C1L4o4o0L0Q1Jo8l8M3N9po8k8O8M7k5p7mN6N5m7n7JN4L4m2o2J3Q6lo6l6L3
$$ 31 65 1 -59 -29 52 53 -15 -53 -10 49 42 -26 -54 14 61 36 -41 -45 11 66 19 -38 -37 17 51 9 -53 -40 46 43 -23 -59 -26
6555b6O0J4q1l5O6N8l3o5j6O9N5n3q1K9P2K5n1p6L7J00or1k4M4P0j7r1j2P4M6
$$ -26 34 48 -33 -68 -2 56 23 -42 -58 11 66 13 -68 -39 33 58 7 -69 -32 68 62 -29 -53 -9 61 44 -47 -59 15 61
6585F1n4m6rQ4L8q3m9L7N5Lo0l7M3P0l0o7qN4L2j6p1J0N7L4n1l6jN9K4n5k6L0
$$ 61 7 -39 -48 36 74 -9 -58 -21 34 37 -23 -60 -17 53 23 -44 -52 2 34 18 -53 -43 14 48 -3 -39 -40 19 43 -12 -38 -8
6617hL5ml5k9M0M5k7m5oM3L8k2n7rQ0jm1l8J6N2J8n4m2L2M0Qm9l9O4M9l6n9jO9
$$ -8 27 23 -12 -41 -1 44 17 -28 -34 9 47 25 -32 -41 39 38 -3 -41 -25 27 45 -9 -51 -19 21 29 -20 -59 5 54 18 -41 -42 27
6651B7K4m8m7K9N8Ko6l4L9Q1k9o0rM5N0l7p1J9O4Nl0n2K2O8j2m9m0N4M2k3n4j4
$$ 27 51 3 -44 -15 43 45 -21 -55 -16 65 36 -24 -33 12 62 25 -46 -27 37 42 12 -40 -18 50 38 -11 -51 3 45 22 -32 -46
6683d6N0M2k4p1J7N3J2l4l6RN7J3n5l2L3L4J7m3l1L1M4j0m7j5K4N4l0m9KM9K6
$$ -46 4 46 22 -49 -32 21 33 -1 -37 -28 29 42 -13 -45 -12 22 39 -4 -35 -4 40 30 -17 -32 -8 46 16 -33 -31 18 44
6714D4k7n3NO2J1m6l8K2M0J8p4j5M0N8l3n4lN1L5k6o8K4N7Rl8m0J3M9J2n3k4L2
$$ 44 17 -36 -31 31 42 -4 -42 -20 20 38 -36 -51 -11 47 14 -40 -43 8 43 17 -51 -27 30 39 1 -39 -26 23 35 -18 -42 -10
6746a0M9po0j6N7L2l8l5%M5J7m4l0L8L0%l1l8L9L3j6l2j0RL9j1n5J9L0J0k1j9
$$ -10 39 32 -28 -44 13 45 7 -28 -28 17 34 -10 -40 -2 28 28 -3 -41 -2 31 15 -17 -27 -18 21 10 -45 -26 4 14 -7 -26
6778b6nM5Ol3j6K5J5J3k5l4L5L4k0l4LK3K8k0l8J2L1J7k9l8QN3%m2k0K7K2Qm7
$$ -26 -31 14 20 -13 -29 -4 11 24 -1 -35 0 34 14 -20 -17 6 34 14 -24 -12 19 36 7 -31 -23 30 30 -12 -32 -5 17 25 -22
6811b2j4M4L5m0l5JM6K9n0k8J6M6qk8k5K9M1k3m0oM5J9k0k7mM8Jk8k6J7L0Kl7
$$ -22 -36 8 43 3 -32 -31 15 44 -6 -34 -18 28 20 -8 -33 -4 37 14 -26 -32 13 32 12 -15 -19 29 30 2 -24 -7 23 25 -12
6844a2k0K5L8k1j9j8K5L1k7k9mL5J8j8l7J2K6J7k5j6jL6Ql0k6K2L5Rm6k7L7L8
$$ -12 -32 -7 31 10 -9 -27 -2 29 2 -27 -31 4 22 4 -33 -21 5 22 -3 -19 -20 16 24 -6 -32 -10 25 34 -12 -39 -2 36
6876C6k1k4j3L7K0k6l3RM3Rl1k9J6L4rl5j3L0L1j8l5j8N0J5l2l1J8L3J2k8l2L2
$$ 36 15 -9 -22 15 35 9 -24 -15 28 37 6 -23 -7 27 18 -17 -30 0 31 13 -22 -40 10 25 -7 -38 -20 13 25 -3 -35 -3
6908cL0j4k0j4J6K8j5l8K3K4Mj9j9jL8Kk2kKK6lk1j4J8J3qk2mJ6J4j8j7QJ5Rk2
$$ -3 27 13 -7 -21 -5 23 8 -30 -7 17 21 2 -17 -18 20 22 0 -2 0 26 23 2 -12 6 19 11 -11 -15 1 15 -3 -20 -12 3 12 -10
6944a0%LK2Kj9j5QK3Nl0j0K7J9j0l3LJ8K7k2k1LK8J0j8l5K5L2rk7j3L1J4ol1j6
$$ -10 -10 -7 15 17 -2 -17 -9 14 19 -11 -21 6 25 15 -18 -15 3 30 8 -13 -10 18 28 10 -25 0 32 23 -4 -17 14 28 22 -9 -25
6979b5M4J1l9rLL3Nk8k7K5L5j8k1j9M2J6k9j9OJ4K7k9j8J4L7j3j5k1J3K5Jl0M
$$ -25 19 30 -9 -18 -15 18 23 -5 -32 -7 28 10 -11 -30 12 28 -1 -20 -14 0 27 -2 -20 -6 31 18 3 -18 -5 20 21 -9 -5
7012eJ0J8pk2nJ3K5k8rJ0%K0k8j5MJ8Qj5j1J6K3qj9j5QK9nk7j2M1Lj2j5pK9K1
$$ -5 5 23 16 -6 -11 2 27 -1 -10 0 0 20 -8 -23 -19 -1 7 -8 -19 -3 20 12 -7 -22 -14 15 10 -17 -29 12 15 3 -12 -19 10 31
7048C1l0l0K5K5%k5k1K9K5j8m1ML2K2j9l2LM1lj5k4PK9Jl5%J2J8j9%mJ7J2j6j7
$$ 31 1 -29 -4 21 21 -4 -25 4 29 11 -30 -26 6 28 9 -23 -20 21 18 3 -21 -14 15 16 -19 -19 -7 11 -8 -8 -12 5 17 1 -16
7083a6J1J7lj4rRK0poqPJ9rk3OJ4Mqj7jK8Nj6j8OJ4Rj3j4PRQk0qJ4K3k0j3NK0
$$ -16 -5 12 9 -5 -14 -5 15 8 2 -6 1 20 11 -12 -6 8 12 4 -13 -14 14 19 3 -15 -9 5 14 1 -13 -6 3 11 -9 -17 -3 20 0 -13 -8 12
7123A2Oj0k3lK7K3l5j0NK6J3m0oJ5K5j2k5MJ6L1l2j3nK5Nk3j9J4L1%l1j4L0K2
$$ 12 18 8 -15 -18 9 32 -3 -13 -8 18 31 -9 -15 0 25 13 -12 -8 8 39 7 -6 -11 14 19 -4 -23 -9 22 22 -9 -23 7 29
7157B9j7k4mJ8J1j2qj2L2kKl1J2J1J0j9nPJ4Kj8jJ0K0lk2j5K9Ojk5lJ9J1k8kr
$$ 29 12 -12 -16 2 13 1 -7 -19 13 11 13 -18 -6 5 15 -4 -9 -2 12 14 -4 -5 5 25 22 0 -15 14 20 19 -6 -9 10 21 -7 -9 -18
7194a8L9%k0k7PM0j7j7j0J2K2Ml4KK3J9j8k0NK6Nl2oJ7J5Ql0j9K1M0k7j2j1L1
$$ -18 21 21 1 -26 -19 21 4 -13 -23 -11 11 15 -19 -17 6 25 7 -13 -8 18 23 -9 -15 2 17 25 -5 -24 -3 37 10 -2 -13 18
7228A8Oj5k2J5K0qj5j1QK2mj9j3K1K0k6rJJ9J0j6k2NK5kpj3OlJ5j2j6K0J1lj2
$$ 18 24 9 -13 2 22 14 -1 -12 -4 18 14 -5 -18 3 23 -3 -12 -11 8 18 2 -20 -15 10 8 1 -12 -6 -9 6 -6 -22 -2 9 6 -6
7264fkJ3QQj8j5K0J0Ml2jL0jj6k5J7J7Jj4j8J9J5rk0j1L0Kok6QK0J6k5k0J2L4
$$ -6 -8 5 13 21 3 -12 8 18 22 -10 -11 19 18 2 -23 -6 11 12 -2 -20 -1 14 5 -15 -26 4 6 0 -26 -18 2 18 -7 -27 -15 19
7300A9Kk7j1L1J2j6l3QJ8J7j0j7LK1Lj5j0OJ9nj6mLK3qk7oK4Qmj3j0J8kjoNOR
$$ 19 21 -6 -17 14 26 10 -23 -15 3 20 10 -7 -4 17 20 5 -5 1 20 15 -1 -5 -2 21 13 -14 -20 4 12 8 -5 -15 3 1 0 -6 -1 5 14
7339A4j2j3J0PMj0pJK1nj1j3J5J1kj7j0K5J4kl4LK2Jrj4NJ5Nj5j1K2%nk4mJ8O
$$ 14 2 -11 -1 6 10 0 -7 -6 15 10 -1 -14 1 12 10 -7 -17 8 22 20 -14 -11 11 12 3 -11 -6 9 14 -1 -12 10 10 5 -19 -23 -5 1
7377AKl3J5K2J0k1k6K9K0nj8j0J5J9j3j9MPK0j2j7J3QPj3olJ5k1rPOJ3j1Lj2J7
$$ 1 3 -30 -15 7 17 -4 -30 -1 19 14 -4 -14 1 20 7 -12 -8 -1 19 7 -10 3 11 18 5 -1 -4 11 -10 -19 -12 -6 7 -4 -1 -13 4
7414DmlJmMQqj6RJ6lmrJ0RRj7ojK2Lk2j4K4Jo%nJ0J3k0j1jK3pqj7OL2Ok5rJ1R
$$ 4 0 -3 -2 -6 -2 6 -2 -18 -9 7 4 0 -9 1 10 19 2 -4 -5 17 20 -2 -16 8 9 3 3 -2 8 21 1 -10 -11 12 5 -3 -20 -14 18 24 -1 -10 1 10
7458A0ll0%K7J2k7qJ0J9%k1nPJ3Rj1nK7qj4j4J4J3%j1j2PK0j0kj9J6J1pkrKLR
$$ 10 7 -23 -23 4 16 -11 -19 -9 10 10 -11 -16 -9 4 13 2 -3 24 16 2 -12 2 15 15 4 -8 -1 19 9 7 -12 4 15 8 6 -3 -1 2 11
7497A1j5lOjj0QoOJ7j1j0%RLMk5QJ0J0j1j1PJ3Nk1%J0J3Jj2nLK5k2j6J2J4Pk2
$$ 11 -4 -7 -1 -2 -12 -4 -10 -4 13 2 -8 -8 1 4 8 -17 -9 1 11 0 -11 -4 9 14 -7 -7 3 16 17 5 0 3 28 6 -10 2 16 23 1
7536AqLK3j7j2nJ8J1lk3%K3jk8J0QJ0j0rQKJ1mk4J1J7mnj7J7Onj1OLPj4J2ljJ
$$ 1 -7 -4 19 2 -10 -15 3 14 11 -12 -12 11 10 -18 -8 0 10 0 -9 -1 1 12 8 -16 -5 12 8 3 -14 3 9 4 -7 -1 2 9 -5 7 4 3 4
7577DMk0QOmQj3%J1Kj6oJ1lJ5pj3jROlllJ9rj3KJ7Rpj9PJ4n%j5nK0J1j7j8J8m
$$ 4 8 -12 -4 2 -2 6 -7 -7 4 6 -10 -16 -5 -8 7 0 -13 -14 -5 1 -2 -5 -8 11 2 -11 -9 8 17 10 -9 -2 12 7 7 -8 -13 7 18 1 -17 1 -3
7620cJ6m2J9RRmj4QJ0Mj2k3K2J5j6mqJ2Kj2J1j8K1Qj8J0mJ8pj4MlJ1mJrQJ3lp
$$ -3 13 -29 -10 -1 8 4 -10 -2 8 12 0 -23 -1 14 -2 -6 -14 -2 0 -12 -1 -19 2 10 -8 2 -2 16 9 -5 -1 -4 7 3 4 -5 3 16 13 6
7660Fj0QPj7%PnNkmj1PK2kj3j1J2%Oj4lJ6Pj3oQJ3Rk5KLJ6j7qmK3%j5KPJ2j2L
$$ 6 -4 4 11 -6 -6 1 -4 1 -1 -5 -16 -9 13 11 -2 -13 -1 -1 5 -9 -12 4 11 -2 -8 0 13 22 -3 -1 2 18 1 -7 -11 12 12 -3 -1 6 18 6 9
7703IpNJ3j6qnJ7kpj5OPJ0j5L%J2qoKJNmmJJ1Ll%JKRk3NMQqm%%J5%nmj5MNj0J0
$$ 9 2 7 20 4 -4 -9 8 6 -1 -16 -10 -3 7 -8 -5 -5 7 -1 -7 -5 -4 1 -3 -7 -6 5 8 5 5 6 8 17 -6 -1 3 11 3 -1 -1 -1 14 14 9 5 -10 -6 -1 -11 -1
7752ajQnj4jJ6Nj3KoJ1%lj4kJ9lqrK2Rrj5MJ0J1j2k1J9PQk3%J1J1qlj7J8J5j7
$$ -1 -2 6 1 -13 -14 2 7 -6 -4 -10 1 1 -2 -16 -18 1 -2 -10 -19 3 12 3 -12 -8 2 13 1 -20 -1 6 14 -9 -9 2 13 5 2 -15 3 18 1
7793Aj1PJ2Lj2j0PMRj8%NPj1l%J0jkj0J5Qn%mKQrpJkJ1JokJ1mMj9QjPJkqKOMj6
$$ 1 -10 -3 9 12 0 -10 -3 1 10 -8 -8 -3 4 -7 -10 -10 0 -1 -3 -13 2 10 5 5 1 3 11 2 -5 -4 -6 5 6 0 -2 9 5 9 -10 -2 -3 4 5 3 -5 -3 3 7 -9
7842iRnRj0j0J0jJ7j4j0J1OkqKJ0Lmj0JJ7Mj5j2J0J7j1kqJ0J4k5qJ2K1jj9j0J3
$$ -9 0 -5 4 -6 -16 -6 -7 10 -4 -14 -3 3 1 -7 -5 5 8 4 -6 -5 12 16 1 -11 -1 16 5 3 -5 5 19 -6 -14 -2 19 18 -1 -11 2
7881BJ0j1nJJ0KorMmkMkkJ0koLo%K0oj5OJ0%qmQOnoMkPLj6J0OJ2j4j1j1J4J9k1
$$ 2 12 1 -4 -3 7 9 3 -6 -2 -6 -8 -4 -6 -8 2 0 -6 -3 -9 -9 11 5 -10 -4 6 6 -2 -6 2 8 3 -3 1 -1 6 9 -7 3 9 21 7 -4 -15 -1 18 -3
7927c%KJ0Mj9rJ3J8j1k1MJ5MrrOJ4J0j1j4mK2mj3mNJ1%pkJ5kjj7PLJ0kk5J8kJ0
$$ -3 -3 -1 9 13 -6 -15 -2 16 5 -16 -12 3 7 -2 -11 -5 9 19 8 -6 -10 12 8 -5 -9 -4 7 7 0 -2 13 11 10 -7 0 3 13 11 -14 4 2 12
7969A2j4lOOmr%NjJqmJ8Lj4OpRJ3j7JkJ6mj1KqK4qroJ1J0kk2kK1J1j4k3PK3oM
$$ 12 -2 -5 1 7 3 -6 -6 -1 -2 -1 -9 -13 5 8 -6 0 -7 2 15 -2 -1 -3 13 9 -2 0 -8 16 8 -1 -7 4 14 12 -10 -12 9 20 6 -17 -10 13 7 11
8013A1j6j2K9%j3j1J1PrqJNJ6k0pNJ9Mj0qNJ2%j1%R%mooPJ6rj9J1RnJj5RJ8oj5
$$ 11 -5 -17 12 12 -1 -12 -1 6 -3 -11 -10 -5 11 -9 -16 -11 8 12 2 -6 -1 11 11 0 0 9 9 5 -1 -7 0 16 7 -12 -1 8 3 4 -11 -2 16 10 -5
8056epNJ1Kj4mLQNrmKJ6j3qMQQj8%OJ9jk3%OK0j3%j0J1QLk8mK5Onk4K1LOk5j1
$$ -5 -12 -7 4 6 -8 -12 -9 -1 4 -5 -9 -7 9 -4 -12 -8 0 8 -10 -10 -4 15 14 -9 -9 -3 17 4 4 -6 5 13 16 -12 -16 9 15 10 -14 7 10 16 -9 -20
8100b0K3Rj0j4j4K2J3j1qJOJ6jl3J6J0Rk2qRK0np%%Nkjj8K5Lj0qNRQj1oQLLk0
$$ -20 3 12 2 -12 -26 -4 9 -2 -10 -9 -3 13 12 -21 -5 5 14 -8 -16 -7 13 8 1 1 1 6 4 3 -15 10 13 3 -5 0 9 17 6 0 8 11 14 -6
8142fjJJ5Lj8j0QJ5Kj4mMJ3qj9PJ5Rj9nMK3oj0k2K6K1j2j7%MK2j0j8RJ1J1j8j5
$$ -6 -7 -6 9 12 -6 -16 -8 7 9 -5 -9 -5 8 0 -19 -12 3 12 -7 -12 -8 15 9 -1 -23 3 24 12 -5 -5 -1 21 11 -7 2 13 24 6 -9
8181iJ2QMj9j0J8J4j4j5J0
$$ -9 3 11 15 -4 -14 4 18 4 -11 -1
8191a
$$ Imaginary data points
##PAGE= N=2
##DATA TABLE= (X++(I..I)), XYDATA
0@%%%%%%%%%%%%Qj6J6j6K0k8L2m0M8n6P2q4R6j14J34j52J76k03K30k65L02l42
$$ 0 0 0 0 0 0 0 0 0 0 0 0 0 8 -8 8 -8 12 -16 16 -24 24 -32 40 -44 52 -62 72 -80 96 -107 123 -142 160 -182
34a82L86m36M91n48O13o85P64q51R44j044J155j280J413j557J717j893K088k301
$$ -182 204 -232 259 -289 324 -361 403 -448 496 -548 607 -673 740 -817 900 -993 1095 -1206
52a206K533k790L083l409L777m199M684n253N926o741P753r043J0757j3156J6773
$$ -1206 1327 -1463 1620 -1789 1988 -2211 2473 -2780 3146 -3595 4158 -4885 5872 -7284 9489
67I489k2929L6124j11811J12782J61482k12884m3423J5896Q2600M6728o7462n5707
$$ 9489 -13440 22684 -89127 23655 185137 -27747 -71170 -55274 27326 74054 6592 -49115
79d9115J9551K4049O2735k0573q1361l2445J06372P9098j30485q3660J17622M8795
$$ -49115 -29564 -5515 57220 36647 -44714 -77159 29213 108311 -22174 -105834 11788 60583
91F0583k2837o5262n6000J00278O3323p6157l8729j7624N5428P4481o4207o2911
$$ 60583 37746 -27516 -83516 16762 80085 3928 -34801 -52425 3003 77484 13277 -49634
103d9634N819M8064P9172p3779r3135P8667M1145k3739K007m0877j2934N9474
$$ -49634 -43815 4249 83421 9642 -83493 -4826 36319 12580 14587 -26290 -39224 20250
115B0250L2102n4342o0883N3250O5059l0825n5879k6029P7254O1212j07828l3638
$$ 20250 52352 -1990 -62873 -9623 55436 24611 -31268 -57297 19957 81169 -26659 -60297
127f0297P6826o957J5510k535q1999L5199P2487k4001l1420k7968R259O2473N793
$$ -60297 16529 9572 25082 22547 -59452 -24253 48234 24233 -7187 -35155 -25896 36577 42370
140D2370o1471l4041N2942N4617m2292n0359J0712M5904K8812n8193m0264N7805
$$ 42370 -19101 -53142 -200 54417 12125 -38234 -27522 18382 47194 -10999 -51263 6542
152F542K7485k0783k8302k3202M5497L5434l9686k7269j705L0418M0207l7498
$$ 6542 34027 13244 -15058 -38260 7237 42671 2985 -24284 -25989 4429 44636 7138
164G138m6210J7766L6548K5363l4358n7535L1469O4282j4098n8613p739M6262
$$ 7138 -39072 -21306 15242 40605 6247 -51288 -19819 44463 30365 -28248 -35987 10275
176A0275K0922k0379l1571j0671M3876K6501m0529k7248R677L2383K8086m3766
$$ 10275 31197 10818 -20753 -31424 12452 38953 -1576 -28824 -19147 13236 41322 -2444
188b444m3857L8414L7276n720k7541l3439J9650N3872l189n2377k2819L8133M5216
$$ -2444 -46301 -7887 29389 23669 -3872 -37311 -17661 36211 33022 -19355 -42174 -4041 41175
201D1175j5171n5188j2820N3506L5121l9647m4211J2635M3747J8155l7649l6990
$$ 41175 26004 -29184 -42004 11502 46623 6976 -37235 -24600 19147 37302 -347 -37337
213c7337K0826L8742R864l0987m3557J9286O3611p47o3964k5476N0264N0298k9361
$$ -37337 -16511 22231 32095 1108 -42449 -23163 40448 39701 -24263 -49739 525 50823 21462
226B1462o1870M790N5581J9304l4899l6883O943M3229K0012l6764l8520J8558
$$ 21462 -40408 -35618 19963 39267 4368 -32515 -25572 17657 37669 905 -37615 -19057
238a9057M5451O870m2192l0828L0888M4922j2863m5995q848L6286K8190k0004
$$ -19057 26394 33264 -8928 -39756 -8868 36054 23191 -22804 -31652 4634 32824 12820
250A2820l8721J131L6861J6896k3853l0943N274L7461J1972l3387k3668J9127
$$ 12820 -25901 -24770 12091 28987 5134 -25809 -20535 16926 28898 -4489 -28157 -9030
262i030K8937j80k7459j6003J8327K5349k832k7574j3971K3300K6410j3040l1889
$$ -9030 19907 19727 -7732 -23735 -5408 19941 17109 -10465 -24436 -1136 25274 12234 -19655
275a9655n67L0181J2978k1499k1176P636K4430O702k1873j7186J2657K2825Q50
$$ -19655 -20222 9959 22937 1438 -19738 -12102 12328 19030 -2843 -20029 -7372 15453 16303
288A6303k4086j3394J9880K1533r571k5424l649K5300J4898j9765k1962Q985K5084
$$ 16303 -7783 -21177 -1297 20236 10665 -14759 -18408 6892 21790 2025 -19937 -10952 14132
301A4132L520k3605j3959J6334K1154m602k4826p570K3238J7367j5404k4110L731
$$ 14132 17652 -5953 -19912 -3578 17576 12974 -11852 -19422 3816 21183 5779 -18331 -14600
314a4600K6606P915k2781j7536J2766K4193j8k5787j1959K0512K1371r777k6583
$$ -14600 12006 19921 -2860 -20396 -7630 16563 16545 -9242 -21201 -689 20682 10905 -15678
327a5678k783K5412J4125j7357k2294M980K5287P982k1449j8605J1577K4729J144
$$ -15678 -18461 6951 21076 3719 -18575 -13595 11692 19674 -1775 -20380 -8803 15926 17070
340A7070k4433j3097J7134K1641m927k4773q368K1124J9120j1169k4819k341K4078
$$ 17070 -7363 -20460 -3326 18315 13388 -11385 -19753 1371 20491 9322 -15497 -17838 6240
353F240J5263j6663k3804L980K5831J0637k0964k2745J0339K8439L738k6079j7738
$$ 6240 21503 4840 -18964 -14984 10847 21484 520 -22225 -11886 16553 20291 -5788 -23526
366b3526J6691K7265k626k9204j2765K3080K5233j0687l0905n146K8612K0040
$$ -23526 -6835 20430 17804 -11400 -24165 -1085 24148 13461 -17444 -22590 6022 26062
378B6062j9537k9011N438K9466J1045k2804k5026J1812L1162J921k7823j6530
$$ 26062 6525 -22486 -17048 12418 23463 659 -24367 -12555 18607 20528 -7295 -23825
390b3825J8151K7525n901l0221p049K4056J8763j2483k5459r97K4685J3708j7502
$$ -23825 -5674 21851 15950 -14271 -21320 2736 21499 9016 -16443 -17440 7245 20953 3451
403C451k2105O197K3510P323j9213j9362J2356K4438l543k0847p719J3141J7689
$$ 3451 -18654 -12457 11053 18376 -837 -20199 -7843 16595 13052 -7795 -15514 -2373 15316
416A5316o085k0245o81J4092R000m422j6276l905J7782J0453j2699j5476M044
$$ 15316 9231 -11014 -11695 2397 11397 6975 -9301 -13206 4576 15029 2330 -13146 -9102
429i102J7355N566j5415j3781J1292J6778n261j2823l953O216J3455k072j6261
$$ -9102 8253 13819 -1596 -15377 -4085 12693 7432 -5391 -9344 -3128 10327 8255 -8006
442h006r87J0164P315j543j5315l275J8282N515j3840r239O255J3894M98j5868
$$ -8006 -8993 1171 8486 6943 -8372 -11647 6635 12150 -1690 -10929 -4674 9220 9718 -6150
456f150o230J3944J0689q577j2529l03J2542J0472j2551j5970J0209J4014j436
$$ -6150 -12380 1564 12253 3676 -8853 -9156 3386 13858 1307 -14663 -4454 9560 8124
469H124r730j0944Q662J7641p823j4610Q60P834J1043l891j9773J545K0714L274
$$ 8124 -1606 -12550 -3888 13753 5930 -8680 -7820 14 11057 7166 -12607 -11062 9652 12926
483A2926j5656j0571P672J7421J103k1464p368J9683R025r314r057n927J0990
$$ 12926 -2730 -13301 -5629 11792 12895 -8569 -15937 3746 12771 3457 -5600 -11527 -537
496e37J5821j1324j4638L402Q079J0951m351k1187K915K0654J864j3052j0500
$$ -537 15284 3960 -10678 -7276 803 11754 7403 -13784 -10869 9785 11649 -1403 -11903
509a1903M937J7727J598j9600o688J5435R738n578j1293o813J2334J4811r866
$$ -11903 -6966 10761 12359 -7241 -13929 1506 11244 5666 -5627 -12440 -106 14705 4839
522D839j4205o03R225J6214o244k6002M035K2963L523j2330j5887L499K4233J199
$$ 4839 -9366 -9969 -744 15470 9226 -16776 -12741 10222 13745 1415 -14472 -10973 13260 14459
536A4459k2012n550J1451J1355J018j6492j0666J8132J4918j3875j3750K477J1120
$$ 14459 -7553 -13103 -1652 9703 10721 -5771 -16437 1695 16613 2738 -11012 -8535 2585
549B585J2006j0717k0250R622J6725j249o747j3786k57K5272K407k4456n376J3875
$$ 2585 14591 3874 -16376 -6754 9971 8722 1975 -11811 -12068 13204 15611 -8845 -14221 -346
563c46J2162k835j8657k665J9151L085j2301j653J141J316Q911k587j2660K241
$$ -346 11816 8981 -9676 -12341 6810 9895 -2406 -4059 -2918 -1602 7309 4722 -7938 -5697
577e697R150L898l914j4214K976K0574n195j7056L790P452L622m69j0936l49J0794
$$ -5697 3453 7351 3437 -10777 -7801 12773 7578 -9478 -5688 1764 5386 4917 -6019 -6368 4426
592D426j036k870m14o339M766J0490p909q314N856L751J420j916r412M260J2294
$$ 4426 3390 520 106 -6233 -1467 9023 1114 -7200 -1344 2407 3827 1911 -7501 -3241 9053
607I053o508q673K987L435O223j986j4555M024J5661m113r965j220L284R202l65
$$ 9053 2545 -6128 -3141 294 6517 4531 -10024 -6000 9661 5548 -4417 -5637 -2353 6849 6484
622F484j3402P25R826j40q61m084p058R431R503j0245q122L819Q105N923j1384
$$ 6484 -6918 -6193 3633 3493 2632 -1452 -8510 921 10424 179 -7943 -4124 3981 9904 -1480
637a480j2378J4053J2850j1243j0063K850P985O203p325j0591N954Q410j501k115
$$ -1480 -13858 195 13045 1802 -8261 -5411 2574 8777 1452 -9139 -3185 5225 3724 1609
651A609n795l532J2122N626j2494n848N754Q148K919j2379p455J3522P349q119
$$ 1609 -4186 -7718 4404 10030 -2464 -8312 -2558 5590 8509 -3870 -11325 2197 9546 1427
665A427o702r05P438P763p056r927L037Q581L495n261r553R10J2521L235j0486
$$ 1427 -5275 -6180 1258 9021 1965 -7962 -4925 3656 7151 1890 -7663 -6753 5768 9003 -1483
680a483o480L205R781N587j2593j0573J1126J0900l177j0534o912J1314J2305
$$ -1483 -7963 -4758 5023 10610 -1983 -12556 -1430 9470 6293 -4241 -11153 161 12466
693A2466r809j1510L237Q455N374n670j0806J873J1546L564q961q545L740J1513
$$ 12466 2657 -8853 -5616 2839 8213 2543 -8263 -6390 5156 8720 -241 -8786 -5046 6467
707F467L202j2732q635J1282J0097n223r567l465R651R129q670r162L511P035
$$ 6467 9669 -3063 -11698 -416 9681 4458 -5109 -8574 1077 10206 1536 -7626 -4115 2920
721B920L823o052p932M507P305j65n178m739L310O762k11o294l967N169O586k923
$$ 2920 6743 691 -7241 -2734 4571 4406 -772 -5511 -2201 4561 4350 -1944 -5911 -742 5844 2921
737B921o635j339O296N081o093n274L580L388J416k815m680K864L728m05j384
$$ 2921 -3714 -5053 1243 6324 231 -5043 -1463 1925 3341 526 -4154 -1290 2438 2033 649
752F49l936O68O167k80n136k103L537M941k563n713N66N041K669m636m727L586
$$ 649 -3287 -2619 3548 3268 -1868 -3971 -434 4507 1944 -3769 -3203 1838 4507 -129 -4856 -1270
768a270M679k79m499l600M844N219l568m823k95M658M235m660n651K515N492J803
$$ -1270 3409 3130 -1369 -4969 -125 5094 1526 -3297 -3592 1066 5301 641 -5010 -2495 2997 4800
784D800n479n421M625O875j430p360k791P273N713n311p046J256P644K791o994
$$ 4800 -679 -6100 -1475 5400 3970 -3390 -6181 1092 6805 1494 -5552 -4296 3348 6139 -855
799h55n121L903O193P38o546m461N110O307j319o955l154O427O209l930p356k63
$$ -855 -5976 -2073 4120 4858 -1688 -6149 -1039 5268 3949 -3006 -6160 267 6476 2546 -4810 -5073
815e073P091M324n364o568J853O897K472n690n755K916O936J095o133m999L808
$$ -5073 2018 6342 978 -5590 -3737 3160 5632 -58 -5813 -2897 4039 5134 -999 -5998 -2190
830b190P159k02o995l876M865P074j533q041k389O464O145l244q378o03P974M426
$$ -2190 4969 4767 -2228 -6104 -1239 5835 4302 -3739 -6128 336 6481 3237 -5141 -5744 2230 6656
846F656n110p546J178Q586K807o921o194L137Q409J087q316m762N589P580j482
$$ 6656 1546 -6000 -4822 3764 6571 -350 -6544 -3407 5002 6089 -2227 -6989 -1400 6180 4698
861D698q787k394P396N594l844p919M1Q176L028n660n607J705P405J556o958l674
$$ 4698 -4089 -6483 913 6507 2663 -5256 -5215 2961 5989 329 -5278 -3573 3832 5388 -1570 -5244
877e244L849N470m4o463k520N237L998k123n085q46M970K659k956l919K99M530
$$ -5244 -1395 4075 4031 -2432 -4952 285 4283 2160 -2925 -3771 1199 3858 902 -3017 -2718 1812
893A812J380l394k384Q06L571J144m004j500K235J846O16k997k071L316J903j410
$$ 1812 3192 -202 -2586 -1780 1791 2935 -1069 -2569 -334 1512 2128 -869 -2940 376 2279 869
909H69k005j203K742K503k478k769P39L066J022k911k056J455L175K39m178r34
$$ 869 -1136 -2339 403 2906 428 -2341 -1602 1464 2486 -425 -2481 -1026 2149 2388 -1790 -2724
925b724L487J502j042l314q21N037J061m281j547J393L638R35n415j857M563K995
$$ -2724 763 2265 1223 -2091 -2912 2125 3186 -1095 -2642 -1249 2389 3324 -2091 -3948 615 3610
941C610j779m746r42N505L076m454m800K371N360K10m274l314K674N877j610n877
$$ 3610 1831 -2915 -3857 1648 4724 270 -4530 -2159 3201 3411 -863 -4177 -1503 4374 2764 -3113
957c113M1L307L332q57o810J23P233N88m221l086N37N886J898o366l352L846M408
$$ -3113 -3072 235 3567 2710 -4100 -3977 3256 3844 -377 -3463 -2926 2960 4858 -1508 -4860 -1014 3394
974C394K61m730m213L937O585k260o263k37L453L586n23o015r05N251J695j262
$$ 3394 3655 -1075 -5288 -1351 5234 2974 -3289 -3526 -73 3513 2990 -3025 -3930 1321 3016 1754
990A754l593k800N733M487n549m440K158M721K247n371n073M739N521j788m310
$$ 1754 -1839 -4639 1094 5581 32 -4408 -2250 2471 4718 -653 -5726 -987 4534 2746 -1564
1005a564k558K144O524Q4p987k010N764M095j058o604k945Q006M114o244l416
$$ -1564 -4122 -1978 4546 4630 -3357 -5367 397 4492 3434 -3170 -6115 1891 6005 -239 -3655
1020c655J371L291L577m224n634M368M771k013l243k095K726N534k904o368K244
$$ -3655 -2284 1007 4584 360 -5274 -906 3865 1852 -1391 -3486 -760 4774 1870 -4498 -2254
1035b254M488K84j392l816q76N888J605m555j942M66L098L265m513m049M348K360
$$ -2254 2234 2518 1126 -2690 -3566 2322 3927 -628 -2570 -2104 994 4259 -254 -4303 45 2405
1051B405j892o36j355O54K883j731j853J891l56n7J524k685q04M065m84k827K08
$$ 2405 513 -123 -1478 -824 2059 328 -1525 366 10 -47 1477 -1208 -2012 2053 1569 -1258 -1050
1068a050M8K109J866m388j813M132Q87j062q36k451J941L800k851k485K096L20
$$ -1050 -1002 1107 2973 -1415 -3228 904 1791 729 -107 -2558 -617 3183 332 -2153 -57 263
1084B63L47L44k684R46L155k318j613J371p8K045J19n292R11N763o85l507k017
$$ 263 610 954 -1730 -784 2371 53 -1560 -189 -267 1778 1897 -3395 -2484 3279 2594 -913 -2930
1101b930P40N518O20o880q00M838J165p33k442k745L886L735l895k640J489J527
$$ -2930 -2190 3328 3948 -2932 -3732 1106 2271 1538 -904 -3649 237 3972 77 -2563 -1074 453
1117D53K415k044n116L272M890k603k743r32J050N132o78o731J87M864J819j386
$$ 453 2868 824 -4292 -1020 3870 1267 -1476 -2408 -1358 3774 3096 -3635 -3448 1416 3235 1849
1133A849m602j270N930K156m482j794P14J278L253j214m941Q14L705J117j329
$$ 1849 -2753 -4023 1907 4063 -419 -2213 -1499 -221 3032 1818 -3123 -2309 1396 2513 1184
1148A184m353K38O570n83n907M64K887J483J2l908j290M315J634j810k292k132
$$ 1184 -3169 -2931 3639 3056 -2851 -2387 500 1983 1995 -1913 -3203 1112 2746 936 -1356 -3488
1164c488L322N172l602n976K160M707J028k699m445J245N897l09m404j166J178
$$ -3488 -166 5006 1404 -4572 -2412 2295 3323 624 -3821 -2576 3321 3012 -1392 -2558 -1380
1179a380L627J245n569j792N204J716k710k330j13L328J688l355j928J631J622
$$ -1380 2247 3492 -2077 -3869 1335 3051 341 -1989 -2102 1226 2914 -441 -2369 -738 884
1194H84J230j379l788J180M765n54l911q64K198K654j047l488Q27K466o62k72
$$ 884 2114 735 -3053 -1873 2892 2338 -1573 -2437 -239 2415 1368 -2120 -1293 1173 511 239
1210B39j49j403J104J646j112j143K9J033J210j421j764J706J511j303r29J85
$$ 239 90 -1313 -209 1437 325 -818 -789 244 1454 33 -1731 -25 1486 183 -746 -561
1226e61M52J132k88j892J81J654L67q27j423J91K293p2k232L2J227M48l2j162
$$ -561 -109 1023 735 -1157 -976 678 1045 218 -1205 -1014 1279 1207 -1025 -993 234 682 650 -512
1244e12p34J415J205r14j658j73K216J334k548k197K288K620j294k605k09K315
$$ -512 -1246 169 1374 460 -1198 -1371 845 2179 -369 -2566 -278 2342 1048 -1557 -1766 549
1260E49J565j638k257M72K147J070j469k524N08L290O05l125j722K058K729o09
$$ 549 2114 476 -1781 -1309 838 1908 439 -2085 -1577 1713 2318 -807 -2529 -471 2258 1649
1276A649l208p87K763J914j428k665k86K810J843k205k812Q83L068O91k573j945
$$ 1649 -1559 -2346 417 2331 903 -1762 -2048 762 2605 400 -2412 -1529 1539 2230 -343 -2288
1292b288J408K522J19k279j495J208K409L76k682j847K126K766p53l082q81K736
$$ -2288 -880 1642 1761 -518 -2013 -805 1604 1980 -702 -2549 -423 2343 1590 -1492 -2373 363
1308C63K102j672k552k0K362J623j504k589O0K733J636k227k881J055L330N78
$$ 363 2465 793 -1759 -1779 583 2206 702 -1887 -1827 906 2542 315 -2566 -1511 1819 2397
1324B397l051k099K132K940o35k962j154K430K468j319k915k65K652J844j931
$$ 2397 -654 -2753 -621 2319 1684 -1278 -2432 -2 2466 1147 -1768 -2033 619 2463 532
1339E32k719P59K712P61k173j987J290K438l6k201j277J597K051o83k102n12J771
$$ 532 -2187 -1428 1284 2045 -128 -2115 -825 1613 1577 -624 -1901 -304 1747 1064 -1038 -1550 221
1356B21J460j246j725L85J446O51j068j309O42J233J11q60r26N54J259j59j077
$$ 221 1681 435 -1290 -905 541 1192 124 -1185 -543 690 801 -59 -985 -431 828 669 -408
1373d08m55P53R74m28j054m2Q60N73o31q25K98P35L22o42q61O08R21k71o76m86
$$ -408 -863 -110 864 436 -618 -660 200 773 142 -683 -385 350 672 30 -831 -223 698 427 -249 -735
1393g35O34J068o49j128K70Q91N26p54j189N47J425j2j350p02J066J219m47j547
$$ -735 -101 967 318 -810 -540 351 877 123 -1066 -519 906 894 -456 -1158 -92 1127 680 -867
1411h67l44J689R07j329j201L64J502P22j729j357J386J534k57j680j040J748
$$ -867 -1211 478 1385 56 -1145 -781 721 1443 -286 -1643 -257 1277 1020 -660 -1700 48
1427D8J823j274j998J51J851J108j387j977N71K215M19j792j284P79J904L82k153
$$ 48 1871 597 -1401 -1250 601 1709 322 -1655 -1084 1131 1550 -242 -1526 -747 1157 1539 -614
1444f14j117J662J394m31j501r75J567J700j182j639Q8J238J277q44k108L33K032
$$ -614 -1731 -69 1325 894 -607 -1582 -15 1685 503 -1136 -1048 190 1467 623 -1485 -1152 880
1461H80M88j256j411J69K031Q56j998j460J107J647L92j611j747J389K236o98
$$ 880 1368 112 -1299 -1130 901 1757 -241 -1701 -594 1053 1445 -166 -1913 -524 1712 1014
1477A014j811n59J046J898m90k490M9K003P06r56j687m3K377O37k240r84J189
$$ 1014 -797 -1356 -310 1588 1098 -1392 -1343 660 1366 410 -1277 -1320 1057 1694 -546 -1530 -341
1494c41J332K96j747j362J724J658r22j365n04R99J807q10k164N55J482J38m92
$$ -341 991 1287 -460 -1822 -98 1560 638 -727 -1231 -232 1575 765 -1399 -844 638 776 284
1511B84j054p0J614L4j328Q4L79K44N38r85p51J417L84r42j59j37M63R74j004
$$ 284 -770 -840 774 808 -520 -436 -57 187 725 -260 -1011 406 790 -152 -311 -448 15 989 -15
1530a5r46R79L58j85J24q76q2J364k29r66K56Q6K54N02j019k99J301k95o93L86
$$ -15 -961 18 376 191 315 -561 -643 721 492 -474 -218 -132 122 624 -395 -694 607 312 -381 5
1550Ek66L19P50j162m77J138J51j70l77r22R89J357j236j083O83O12M07m24j327
$$ 5 -261 58 808 -354 -831 307 458 288 -89 -1011 -22 1335 99 -984 -301 311 718 294 -1033
1569a033N67J455n93q25N8M2R82J82j787Q9J639j25o61o74k39J774M68k090l93
$$ -1033 -466 989 396 -429 -371 -329 653 835 -952 -863 776 651 -10 -684 -923 851 1319 -771 -1164
1588a164J256O13J37j157j175J506J411j127j046K6N86J277m58j902M94J506j88
$$ -1164 92 705 842 -315 -1490 16 1427 300 -746 -720 -134 1143 685 -1217 -723 783 595
1605E95m41p18l74J650M33j678k83O90N45N76j192j219J431J144p91q11m70O34
$$ 595 154 -564 -938 712 1145 -533 -816 -126 419 995 -197 -1416 15 1159 368 -443 -913 -279
1623b79J508n32j748K18J123M79j40j360n03J822O10j322o37J41R53R46j438j228
$$ -279 1229 697 -1051 -833 290 769 629 -731 -1234 588 1198 -124 -761 -620 333 1279 -159 -1387
1641a387J392R32n37o84o64Q12J396r39j310N38P42L88k14j355J3J698M5j184
$$ -1387 5 937 400 -284 -948 -136 1260 321 -989 -451 291 679 465 -890 -877 821 866 -318
1659c18l45K34R61M38j464n09J320K69m84k80m42O32Q05q72n52N55J85K08j63
$$ -318 -663 -429 532 970 -494 -1003 317 586 102 -178 -620 12 817 -55 -607 -52 133 341 178
1678A78q44M17R32n00n06J35K2N27J11r26M3P09p4j02k44l69O96L71p94j33M24
$$ 178 -666 -249 683 183 -323 -188 -166 361 472 -454 -411 298 224 122 -122 -491 205 576 -218 -351 73
1699G3K5J11j96m70M73M09m66j23mL0N83k02q96L84P21j41l89m46K41R40k32j007
$$ 73 98 209 13 -457 16 425 -41 -164 -168 -138 445 243 -653 -269 452 311 -78 -524 -283 657 425 -582
1721e82J22O46K76j99p63j11J021L07q45n01L32P56K95j000p00R53Q32m78q21
$$ -582 -460 186 462 263 -500 -611 410 717 -128 -629 -297 459 754 -246 -946 7 839 361 -460
1740d60k99Q30R26p49j114L32R57L49p02r55M26J154l4r40m69N18Q51j6r72m38
$$ -460 -759 71 997 248 -866 -534 423 772 70 -885 -459 695 661 -279 -748 -230 621 605 -367 -805
1760h05P89P41l27q50k97Q23P91o33r30K06P69M37n44q93K70R36J54o55o48K58
$$ -805 -16 725 398 -452 -749 74 865 232 -698 -492 277 714 170 -723 -453 483 637 -18 -666 -408
1780d08R68J39r23n54N86Q77j12r67l85P54Q31m13j012n8Q82N78n73r82K01J060
$$ -408 560 699 -224 -778 -192 685 573 -394 -779 -25 806 393 -619 -677 205 783 210 -772 -571 489
1800D89K27q01o88M24R77l6r00l83N75P78k00r31j72P80N57m70q27J38Q46K25
$$ 489 716 -85 -773 -349 628 592 -308 -691 -116 662 462 -469 -641 139 696 226 -601 -463 383 608
1820F08o60n56M10P06j44n92k10M10M90k20n68rM47K87k73n15J08N34P8m19l02
$$ 608 -52 -608 -198 508 364 -228 -438 -28 462 242 -326 -335 112 399 126 -389 -281 253 331 -88 -390
1841c90K86M13j06l86j22L05L08k01l39MK98K23k10l96J23M07P7l13l19K24M35
$$ -390 -104 309 203 -183 -305 0 308 107 -232 -228 70 293 83 -313 -190 217 294 -19 -338 -114 321
1862C21p5l98j79K94M21j56n25p1M94L53l69n63J37O40J66o03m69M39O15j09o24
$$ 321 246 -152 -331 -37 384 228 -297 -368 126 479 110 -453 -316 324 490 -113 -582 -143 472 363 -261
1883b61l22N56O49l47p79l3P14N05n36q39K51R30J43p99n38M95Q17q1q82l33P14
$$ -261 -583 -27 622 275 -504 -537 177 682 146 -693 -442 488 631 -168 -706 -211 606 525 -357 -690 24
1904B4O38l17p83j77P70N93n76p77J62P53L49o10p25L36Q25L8o53m65L41P66j7
$$ 24 662 345 -438 -615 155 748 172 -605 -443 310 659 49 -676 -340 485 523 -130 -595 -254 512 495
1925D95p95l09N52N62j42o89k87O76N48m11o40l4N90N15m48q03K20P74J77n45
$$ 495 -300 -609 -57 505 363 -326 -613 63 611 200 -440 -474 116 631 183 -620 -400 374 551 6
1945Fn97K27Q82Q0q48l49M85O07j2p59l94P24N83m05o47p2O36M92n31p33L25O80
$$ 6 -591 -364 518 598 -250 -599 -114 493 481 -278 -672 52 635 230 -417 -489 147 639 108 -625 -300 380
1967C80M4n01m58L17P38j60p33p3M84L79j69o41n5P08J96m99k83J06M16K10m95
$$ 380 424 -77 -535 -218 520 360 -373 -446 38 417 248 -393 -448 260 456 -43 -326 -220 196 406 -89
1988h9l29M26K81j60k20j76K57L84l11l81K29K41J7j23l13J07M75j25l67NQ9K60
$$ -89 -418 8 289 129 -91 -267 -10 374 63 -318 -89 152 169 46 -267 -160 315 190 -177 -172 -83 177
2010A77J12m86j62M61J39j69j93j96L44L76m07l32K45K25J01k02m40K72N71k54
$$ 177 289 -197 -359 102 241 72 -121 -317 27 403 -4 -336 -91 134 235 33 -407 -135 436 182
2030A82m56OK48M31j23p39L2P62J00m07m04n2P54L12q23l91M91M23O0n40n01O00
$$ 182 -274 -268 -20 411 288 -451 -419 343 443 36 -368 -420 334 646 -177 -568 -77 346 406 -134 -635 -35
2052c5O32m71m89L5L62M58l34p65L22P13r8m07l49J12P97jq46j02M89L12M6n91
$$ -35 597 126 -363 -328 34 492 158 -607 -285 428 330 -77 -426 -314 483 482 -364 -466 23 335 381 -210
2074b10l97P08M49m44l71o1L08N26l35o45K73M34%j33m09l4O85L9o14r0K39L37
$$ -210 -607 101 550 106 -265 -326 -18 508 173 -472 -199 235 235 102 -307 -341 344 383 -231 -321 -82 255
2096B55J29o19l49O92L53l55l29k16M05O38m26o80K14M56K22j91o45O4P78j3n39
$$ 255 384 -235 -584 108 461 106 -223 -439 -34 604 178 -502 -288 168 390 199 -446 -382 396 383 -156
2117a56j18J38L71J46n94j92N70J50k84j95j20M18L16n38l32M28K30n1k17l32
$$ -156 -274 -136 235 381 -213 -405 165 315 31 -164 -284 134 450 -88 -420 8 238 187 -30 -362
2137c62K93M51k96l14J03J04K08l7m23R9M05j44j77J4j0K23L6l82M9L09n4p0r0
$$ -362 -69 382 86 -228 -125 -21 187 150 -273 -174 231 87 -90 -76 -86 137 173 -209 -160 149 95 25 -65
2160f5j32K96J95l51j37J75P3J50j22l63J93L25j29j17j22l5L58M3m20j5K65P0
$$ -65 -197 99 294 -57 -194 -19 54 204 82 -281 -88 237 108 -9 -131 -166 192 235 -185 -200 65 135
2182A35k6k51j22L96J54l76j55J65K15J36l32l56L89M03k37l31j02K81M34k67
$$ 135 109 -142 -264 132 286 -90 -245 -80 135 271 -61 -417 -28 375 138 -193 -295 -14 420 153
2202A53n37J74M17Q9k33l88J08N48l1m83j14K75L00m1m70j10M87J91l22k47LL33
$$ 153 -384 -210 207 296 63 -325 -217 331 300 -183 -297 -22 278 237 -233 -343 144 335 13 -234 -231 102
2224A02K52l66l48K50L05J6k27l09J90M14j06l16m9J36K43Pl33p4K42J55p8k02
$$ 102 354 -12 -360 -110 195 211 -16 -325 -135 279 173 -143 -192 -56 187 194 -139 -213 29 184 106 -96
2246i6j13K27K46k08k43N8K12J38j52l02Q5L36J7k35j85Q4L47K2l70j18K58K13
$$ -96 -209 18 264 56 -187 -129 83 221 69 -233 -148 188 205 -30 -215 -131 216 238 -132 -250 8 221
2268B21q3l11p6L21J75k18k79R7K82P6k64k16K20L00j21k96l3K48J99k12k62J25
$$ 221 138 -173 -249 72 247 29 -250 -153 129 205 -59 -275 -55 245 124 -172 -205 43 242 30 -232 -107
2290a07K67mk01j46J65K22q6k44JJ92J13j44j92P4K22oj91p1J36J21o3j51k8J56
$$ -107 160 156 -45 -191 -26 196 110 -134 -133 59 172 28 -164 -90 132 126 -65 -136 0 121 58 -93 -121 35
2314C5O8j10j04M0J25L8j34o2Q3O2J0p4m8M6R5Lr3p2P3J12j0j26o8J24J15m6j57
$$ 35 103 -7 -111 -71 54 92 -42 -104 -21 41 51 -23 -71 -25 70 73 -20 -92 -19 93 83 -43 -111 13 128 82 -75
2341g5l8J51J36j14k01LK25J26k02k29J02K94Rk87j51K15K73j09l20n5L22K03
$$ -75 -113 38 174 60 -141 -138 87 213 11 -218 -116 178 187 -100 -251 -36 237 128 -192 -247 75 278
2363B78k23l21O5L87J03l56k50K39L57o5l80j18L22K60j84l35J3L37J63k59k87
$$ 278 55 -266 -201 186 289 -67 -317 -78 279 214 -166 -284 38 298 114 -221 -208 129 292 33 -254
2384b54J32L38J6l19j58K23K57j05k68m0K28J25j11k09KJ93J10j33j76L7J85P7
$$ -254 -122 216 232 -87 -245 -22 235 130 -138 -178 50 175 64 -145 -143 50 160 27 -149 -112 73 150
2406A50j54j41N9J53L9r4j29J9J87N4j55j20O5J67O3k01j42J65J83l8k24p6J90
$$ 150 -4 -145 -86 67 106 12 -117 -98 89 143 -12 -132 -67 100 163 -38 -180 -15 168 130 -94 -170 20
2429B0J99j23k76J5K76J00k14k41J25L17j4l15j07K32K37j33l03J5L06Q4k16k14
$$ 20 219 96 -180 -165 111 211 -3 -244 -119 198 184 -131 -238 -6 231 98 -205 -190 116 200 -16 -230
2451b30J23L03j3l15r3K77J81j65k62L3L17O7k80j78K07K22m6k48j00K38J93j81
$$ -230 -107 196 183 -132 -225 52 233 68 -194 -161 156 223 -57 -235 -28 194 148 -100 -200 38 231 50
2473E0k21N1K12Q9j90j75J50J94o8j62o2J14J64o7k03nJ56R8q0j65rJ83Q9j18
$$ 50 -171 -120 92 181 -9 -184 -34 160 92 -70 -132 -18 146 79 -124 -129 27 125 45 -120 -129 54 143 25
2497B5j28kJ22J41r0k20K0J93J08j05k32K2K89R0k68j71J32K78J7l24j74K91K85
$$ 25 -103 -105 17 158 68 -152 -132 61 169 64 -168 -146 143 233 -35 -206 -74 204 221 -103 -277 14 299
2520B99j56l58p2L70K85l07m24J43M61Q9l78l53K34N05n4m92j51L42L56j44m78
$$ 299 143 -215 -287 83 368 61 -363 -220 241 330 -48 -401 -167 338 284 -208 -359 -17 339 195 -283
2541b83k5M68J92l40l06J22L95P5l87k22K95K88r7k92j48K72K99j97l13L1K27
$$ -283 -308 160 352 12 -294 -172 223 298 -89 -311 -16 272 175 -117 -265 7 306 109 -204 -173 54
2562E4J62j23k89K1K76N5j28j44l9K03J39j83j57O4J27R8j06k16Q5K40j0j70j14
$$ 54 216 93 -196 -175 101 156 28 -116 -155 48 187 4 -153 -89 38 136 30 -186 -101 139 129 -41 -155
2585a55O1K75jl28p6K61J74p8k83j00L66J98l03k31R0K71J35k99k87K81K86j33
$$ -155 -94 181 180 -148 -224 37 211 133 -150 -250 116 314 11 -220 -130 141 276 -23 -310 -29 257 124
2607A24k63p4K49K39k23l30J76L07n0k40j64J89L45j61l84N9K91J22j57l13R0
$$ 124 -139 -213 36 275 52 -278 -102 205 155 -85 -249 -60 285 124 -260 -201 90 212 55 -258 -168
2628a68M07l4l21o9J73J88j2l12m6L19P3j90j39J0K26J19k65j76K16J59m2j56
$$ -168 239 205 -116 -185 -12 176 164 -148 -194 125 198 8 -131 -121 105 224 -41 -217 -1 158 116 -40
2650d0j58J55K63j16k13k5N3K27K6l02q7K08J45kk13j69K45K52j61k46l5K22K52
$$ -40 -198 -43 220 104 -109 -134 -81 146 172 -130 -217 -9 136 134 -79 -248 -3 249 88 -158 -193 29 281
2673B81j73l85Q0L93P3k83k71J23M51L2m95j85L61L39r6m68j61M89L18l47m12
$$ 281 108 -277 -197 196 269 -14 -285 -162 289 321 -174 -359 2 341 245 -223 -384 105 423 76 -336
2694c36P6M33K10m10l87K87M35n9m06j90K93L99j69m56RL81J74k22l22M3M05Q6
$$ -336 -260 173 383 -27 -414 -127 308 249 -157 -347 -54 345 176 -280 -271 110 284 62 -260 -217 188 274
2716B74l34j85J49K59O4k88j81J98K32n3j81j24J27K29n5k31l4J33J32Jk14r5
$$ 274 -60 -245 -96 163 227 -61 -242 -44 188 135 -46 -170 -43 186 131 -100 -134 -1 131 132 -82 -177
2738a77J96J45j02j76o2J92J86j62k44P9K27O7j73k19J15L00l3k81r5K01K22o8
$$ -177 19 164 62 -114 -176 16 202 40 -204 -125 102 169 -4 -223 -108 192 159 -122 -217 -16 206 138
2760A38l17l1L35J14k36k05R6K94L7l46j14K82J95j57k62k1L31J44l00k44J84
$$ 138 -179 -210 125 239 3 -202 -106 188 225 -121 -235 47 242 85 -177 -198 133 277 -23 -267 -83
2781h3K95k6l11j36K72K52j96k90M1K75J32k27k53J35L10k7k46j46J85K56q1k86
$$ -83 212 186 -125 -261 11 263 67 -223 -182 93 225 -2 -255 -120 190 163 -83 -229 -44 212 131 -155
2803a55k9K46J37j24k21mK24J13j60j59K3J88J10j49k05N6K18O7j57k04N4K78
$$ -155 -184 62 199 75 -146 -150 74 187 27 -132 -109 79 189 40 -165 -109 109 176 19 -185 -131 147
2825A47N2k33k04J19K99M7l19k10K41L22q1l65j27L27L03k04l88J4M08J98l16
$$ 147 199 -34 -238 -119 180 227 -92 -302 -61 261 180 -185 -312 15 318 114 -274 -260 148 346 30
2846C0l71J43M78M6m39k42K79M15r4m58j15M00K94k41l91K3M12J65l26l13J60
$$ 30 -341 -198 280 326 -113 -355 -76 339 245 -213 -328 72 366 125 -266 -243 169 334 8 -305 -145
2867a45L65K1l11j99K14K93q4l10o3K21J92j03k64nK34J02j27j64PJ87Q0j18j28
$$ -145 220 241 -70 -269 -55 238 154 -156 -219 2 194 91 -173 -178 56 158 31 -133 -126 61 141 23 -105
2890a05K5J39Q2j05j49L4J72L2j18j21M2J82L1j86j05J15J78k6j95r4J99J61j32
$$ -105 -80 59 141 36 -113 -79 93 125 7 -114 -72 110 141 -45 -150 -35 143 117 -78 -172 27 188 56
2913E6k11J3K18J08k06j86J27K50l3k51q9K09K03j42k70N5K86N3k23j85J47K92
$$ 56 -155 -142 76 184 -22 -208 -81 169 136 -115 -204 5 208 66 -204 -149 137 190 -33 -218 -71 221
2935B21o0l05m4K51J50j60k35M8K98N2k71j58J57K49k4k92r2K56J81j68k21J5
$$ 221 161 -144 -188 63 213 53 -182 -134 164 216 -55 -213 -56 193 169 -123 -215 41 222 54 -167 -152
2957a52K24J20j94k04J26K03pj52j25Q3K19k8j92o0R4J63Pj91r9J51J47l3j55
$$ -152 72 192 -2 -206 -80 123 116 -36 -161 -78 141 113 -79 -139 -45 118 125 -66 -165 -14 133 100 -55
2980e5j04J25K31p0k40m7J71J87o1l09m2L11J44k13k29J8L26J39l32k56K19L01
$$ -55 -159 -34 197 127 -113 -160 11 198 137 -172 -214 97 241 28 -201 -183 143 282 -50 -306 -87 214
3002B14j0l20k01L01L36k04l59kL23K05k16l77J20M05L0l04j87J30L45Ol72j09
$$ 214 204 -116 -317 -16 320 116 -243 -245 78 283 67 -310 -190 215 245 -59 -246 -116 229 235 -137 -246
3024b46K90J76j05k49o4K79J53k31j65R1J58P0j68j74J26J89m5j30o2M2J61jj82
$$ -246 44 220 115 -134 -198 81 234 3 -162 -71 87 157 -11 -185 -59 130 85 -45 -107 -65 96 95 -87
3047h7j7R5M6L5r3j11J04J13m4p7m9L6J56k9j78K7J19L0k3j19l4K04M0j95o3J09
$$ -87 -104 -9 37 72 -21 -132 -28 85 41 -36 -85 -49 107 78 -100 -73 46 76 53 -66 -100 104 144 -51 -114 -5
3073eJ20J8k12r7K30J46j85j54L6J95Q7k10j84J99J86j11j50n4J60J93j84k34
$$ -5 115 133 -79 -176 54 200 15 -139 -103 92 179 -31 -215 -16 170 59 -91 -145 15 208 24 -210
3095b10J35K16j6j86j43J60K71j03k98K6K18J14j07k47J0L12M8k61q2R5J69M7
$$ -210 -75 141 125 -61 -204 -44 227 124 -174 -148 70 184 77 -170 -160 152 200 -61 -143 -48 121 168
3117A68k49q5K27Q3j11r0n6J25J53j43j70Q5J07N2m0k08J7K30J6j26r2k9J73J57
$$ 168 -81 -166 61 144 33 -57 -113 12 165 22 -148 -63 44 96 56 -152 -135 95 111 -15 -107 -136 37 194
3141A94k02j82J04J49Q7j12k50J01L15m6k30q9R3K68Ml68n3L00J44j40k61m3L63
$$ 194 -8 -190 -86 63 150 38 -212 -111 204 158 -72 -161 -68 200 204 -164 -217 83 227 87 -174 -217 146
3164A46J59l30k38J74K65P2l05k65K76L19j49k67o4J85K71j44l48R0K76K2j36
$$ 146 305 -25 -263 -89 176 248 -57 -322 -46 273 124 -143 -207 -22 249 105 -243 -153 123 145 9
3185Ij73L9K87j1k67j5J52R3pj78p9K13Q0j35o3mP8J15r8j33O9O3J5J4j28k3J47
$$ 9 -164 -125 162 151 -116 -131 21 114 107 -71 -150 63 143 8 -55 -59 19 134 36 -97 -28 35 50 64 -64 -87 60
3212F0J2q5j8k1O3R1j00j13Q7Q2%o8j03P2J78q5j58J7J23R3q0j93M3K34j2j61
$$ 60 72 -13 -31 -52 11 102 2 -111 -24 58 58 -10 -113 -41 137 52 -106 -89 34 127 47 -146 -103 131 119 -42
3238d2q5J00J82l4k36k1K05R8j41j49L4K18L4k42r0J82J43p0k00m7K28J23j95
$$ -42 -127 -27 155 121 -115 -136 69 167 26 -123 -89 129 163 -79 -169 13 156 86 -114 -161 67 190 -5
3261ej84J01K06M0k23j36J54K21q8k10k7J72J48j04k00K5J97M9j14j39K4J93L8
$$ -5 -189 -88 118 158 -65 -201 -47 174 86 -124 -151 21 169 65 -135 -110 87 136 22 -117 -93 100 138
3284A38j50j02P4J34J9j24j03P4J42Jj10j10O2J65J9j84r6J34J37Mk04j00J71
$$ 138 -12 -114 -40 94 113 -11 -114 -40 102 103 -7 -117 -55 110 129 -55 -151 -17 120 124 -80 -180 -9
3307iJ79r5k06n5K17J75j63k46O4K65Q1k27j98J37K69%k87j14K17K25j01k91l0
$$ -9 170 75 -131 -186 31 206 43 -203 -139 126 207 -20 -218 -81 188 188 -99 -213 4 229 128 -163 -193
3330a93K85J59k12k40Q0K67O3k51j71J79J95l8k08r3J80J62j13j81QJ66Q7j29
$$ -193 92 251 39 -201 -121 146 209 -42 -213 -34 161 123 -85 -178 2 164 51 -130 -122 44 131 2
3352Bj30N4J43Mj08m0L8R4J8r2n8O7P0j3n5o0O9O1j4p0k0M1O9nr3m5Q5O9k9j17
$$ 2 -128 -74 69 73 -35 -75 -37 57 75 -17 -75 -8 62 49 -6 -66 3 64 50 -20 -40 1 70 65 -28 -73 12 81 52 -65
3382f5j6J23O5j11j13O4J33Mj41p7J15J38q0j44j5J75Q1j39j60R0J95rj90q3J58
$$ -65 -81 42 107 -4 -117 -53 80 84 -57 -134 -19 119 39 -105 -120 55 136 -3 -163 -73 122 113 -77 -160 -2
3407bJ65o8k18nK06R4j48j77O9K33Ok20r9J66J60o0k18n1K25J22j60j63L5J92
$$ -2 163 95 -123 -128 78 172 24 -153 -84 149 155 -65 -164 2 162 102 -116 -167 58 180 20 -143 -108 84
3431H4N8j74j38J06J72mj67r9J25J71m4j76m2J24J05k6j38n0J35R7n4j23m3J15
$$ 84 142 -32 -170 -64 108 104 -63 -162 -37 134 90 -86 -128 -4 101 75 -63 -113 22 119 65 -58 -101 14
3455A4J31q2j67J2J47R8q7j87MK20Q5j98j55P8K18M9k45j56J83K19n3k46r8K18
$$ 14 145 63 -104 -92 55 153 66 -121 -117 103 188 -10 -165 -87 131 180 -65 -221 -38 181 128 -118 -216 2
3479BK24j41k68MK64J18j98k42J12K95pk49j11J67K21n3k79l5K56J14j39j85j2
$$ 2 226 85 -183 -179 85 203 5 -237 -125 170 163 -86 -197 -30 191 138 -141 -176 80 194 55 -130 -142
3502a42K55Q1k00j43J20J41mj28j23J28J31o4j21j3P7Q6l3j33J9J10km7l9k3R9
$$ -142 113 194 -6 -149 -29 112 108 -20 -143 -15 116 52 -69 -82 -5 81 48 -85 -66 44 42 -5 -44 -67 32
3527C2M4j02m2L0N7N2n7j20M9J36Kr0q2L4J62rj68j4J01P0j6j46l0J78O7j71q1
$$ 32 76 -26 -68 -38 19 71 14 -106 -57 79 81 -9 -91 -57 105 96 -72 -86 15 85 69 -77 -107 71 138 -33 -114
3554a14Q0J19K3j86q6J97J42j54j50j0J89J42j90k23J37K17jj91j33J50K32j05
$$ -114 -34 85 108 -78 -164 33 175 21 -129 -139 50 192 2 -221 -84 133 132 -59 -192 -42 190 85
3576H5k39K1J98R0j17j98M9K58J3k16r4J03J93Qk49r4K20J45r7j62p4J67J55j15
$$ 85 -154 -133 65 155 38 -160 -111 147 160 -56 -150 -47 146 154 -95 -189 31 176 79 -83 -157 10 165 50
3600E0j83L3J24R3n8j91OJ93L8j07j01LJ50P7j62j13R3J47K1j41j60J30K32o0
$$ 50 -133 -100 24 117 59 -132 -126 67 105 -2 -103 -100 50 127 -35 -148 -55 92 113 -28 -188 -58 174 114
3624A14k24m8J59J86n2k88k4K68J09j50k06pK85J17k59k07J63K25Kk25j67K19
$$ 114 -110 -158 1 187 135 -153 -177 91 200 50 -156 -163 122 239 -20 -227 -64 161 163 -62 -229 -10
3646a0K44j58k47MK13J57j63k63R4K67J8j96j25P3K57lk67n8K03R0n1j57o5J95
$$ -10 234 76 -171 -167 46 203 40 -223 -129 138 156 -40 -165 -92 165 162 -105 -163 40 130 79 -78 -143 52
$$ [...]
8191E
##END NTUPLES=NMR FID
##END=
