##TITLE=1H_AM_NV91
 CDCl3
 64 sc, 
 1.12.2023
##JCAMPDX= 6.0         $$ Bruker NMR JCAMP-DX V2.0
##DATA TYPE= NMR FID
##DATA CLASS= NTUPLES
##ORIGIN= UXNMR, Bruker Analytische Messtechnik GmbH
##OWNER= root
$$ XWIN-NMR		Version 3.5
$$ Fri Dec  1 13:52:05 2023 Russian Standard Time (UT+4h)  she@DPX200
##.OBSERVE FREQUENCY= 200.1313
##.OBSERVE NUCLEUS= ^1H
##.DELAY= (6, 6)
##.ACQUISITION MODE= SIMULTANEOUS
##.ACQUISITION SCHEME= undefined
##.AVERAGES= 64
##.DIGITISER RES= 18
##SPECTROMETER/DATA SYSTEM= spect
##.PULSE SEQUENCE= zg30
##.SOLVENT NAME= CDCl3
##.SHIFT REFERENCE= (INTERNAL, CDCl3, 0, 15.7039)
##AUDIT TRAIL= $$ (NUMBER, WHEN, WHO, WHERE, WHAT)
$$ ##TITLE= Audit trail, XWIN-NMR		Version 3.5
$$ ##JCAMPDX= 5.01
$$ ##ORIGIN= Bruker BioSpin GmbH
$$ ##OWNER= she
$$ F:/spectra/data/she/nmr/H-F/1/audita.txt
$$ ##AUDIT TRAIL=  $$ (NUMBER, WHEN, WHO, WHERE, WHAT)
(   1,<2023-12-01 13:50:50.09 +0400>,<she>,<DPX200>,
      <created by zg, POWCHK disabled, PULCHK disabled
       configuration hash MD5:
       00 E9 B6 7A A2 85 ED C7 34 08 36 98 17 FE 4E 26
       data hash MD5: 16K
       AE 1D 29 D3 53 90 0C ED A9 3A 4B 8A FB 91 F2 99>)
$$ ##END=
$$ 
$$ hash MD5
$$ 93 BA FE 4C D6 75 C3 CF D0 B6 D9 54 13 E0 3B 92
##$RELAX= 
##$RELAX= 
##$RELAX= 
##$RELAX= 
##$RELAX= 
##$RELAX= 
$$ Bruker specific parameters
$$ --------------------------
##$DU= <F:/spectra>
##$EXPNO= 1
##$NAME= <H-F>
##$PROCNO= 1
##$TYPE= <nmr>
##$USER= <she>
##$AMP= (0..31)
100 100 100 100 100 100 100 100 100 100 100 100 100 100 100 100 100 100 
100 100 100 100 100 100 100 100 100 100 100 100 100 100 
##$AQSEQ= 0
##$AQ_mod= 1
##$AUNM= <au_zg>
##$AUTOPOS= <>
##$BF1= 200.13
##$BF2= 200.13
##$BF3= 200.13
##$BF4= 200.13
##$BF5= 200.13
##$BF6= 200.13
##$BF7= 200.13
##$BF8= 200.13
##$BYTORDA= 1
##$CFDGTYP= 0
##$CFRGTYP= 5
##$CHEMSTR= <none>
##$CNST= (0..31)
1 1 145 1 1 1 1 1 1 1 1 1 1 1 1 1 1 1 1 1 1 1 1 1 1 1 1 1 1 1 1 1 
##$CPDPRG= <>
##$CPDPRG1= <>
##$CPDPRG2= <>
##$CPDPRG3= <>
##$CPDPRG4= <mlev>
##$CPDPRG5= <mlev>
##$CPDPRG6= <mlev>
##$CPDPRG7= <mlev>
##$CPDPRG8= <mlev>
##$CPDPRGB= <>
##$CPDPRGT= <>
##$D= (0..31)
0 1.2 0 0 0 0 0 0 0 0.06 0 0.03 0 0 0 0 0.0002 0 0 0 0 0 0 0 0 0 0 0 0 
0 0 0 
##$DATE= 1701424249
##$DBL= (0..7)
120 120 120 120 120 120 120 120 
##$DBP= (0..7)
150 150 150 150 150 150 150 150 
##$DBP07= 0
##$DBPNAM0= <>
##$DBPNAM1= <>
##$DBPNAM2= <>
##$DBPNAM3= <>
##$DBPNAM4= <>
##$DBPNAM5= <>
##$DBPNAM6= <>
##$DBPNAM7= <>
##$DBPOAL= (0..7)
0.5 0.5 0.5 0.5 0.5 0.5 0.5 0.5 
##$DBPOFFS= (0..7)
0 0 0 0 0 0 0 0 
##$DE= 6
##$DECBNUC= <off>
##$DECIM= 32
##$DECNUC= <off>
##$DECSTAT= 4
##$DIGMOD= 1
##$DIGTYP= 9
##$DL= (0..7)
0 120 120 120 120 120 120 120 
##$DP= (0..7)
150 150 150 150 150 150 150 150 
##$DP07= 0
##$DPNAME0= <>
##$DPNAME1= <>
##$DPNAME2= <>
##$DPNAME3= <>
##$DPNAME4= <>
##$DPNAME5= <>
##$DPNAME6= <>
##$DPNAME7= <>
##$DPOAL= (0..7)
0.5 0.5 0.5 0.5 0.5 0.5 0.5 0.5 
##$DPOFFS= (0..7)
0 0 0 0 0 0 0 0 
##$DQDMODE= 0
##$DR= 18
##$DS= 0
##$DSLIST= <SSSSSSSSSSSSSSS>
$$ [...]
##$SUBNAM2= <"">
##$SUBNAM3= <"">
##$SUBNAM4= <"">
##$SUBNAM5= <"">
##$SUBNAM6= <"">
##$SUBNAM7= <"">
##$SUBNAM8= <"">
##$SUBNAM9= <"">
##$SW= 18.0517328524113
##$SWIBOX= (0..15)
0 0 2 0 0 0 0 0 0 0 0 0 0 0 0 0 
##$SW_h= 3612.71676300578
##$TD= 16384
##$TD0= 1
##$TE= 0
##$TE2= 300
##$TE3= 300
##$TEG= 300
##$TL= (0..7)
0 120 120 120 120 120 120 120 
##$TP= (0..7)
150 150 150 150 150 150 150 150 
##$TP07= 0
##$TPNAME0= <>
##$TPNAME1= <>
##$TPNAME2= <>
##$TPNAME3= <>
##$TPNAME4= <>
##$TPNAME5= <>
##$TPNAME6= <>
##$TPNAME7= <>
##$TPOAL= (0..7)
0.5 0.5 0.5 0.5 0.5 0.5 0.5 0.5 
##$TPOFFS= (0..7)
0 0 0 0 0 0 0 0 
##$TUNHIN= 0
##$TUNHOUT= 0
##$TUNXOUT= 0
##$USERA1= <user>
##$USERA2= <user>
##$USERA3= <user>
##$USERA4= <user>
##$USERA5= <user>
##$V9= 5
##$VALIST= <valist>
##$VCLIST= <CCCCCCCCCCCCCCC>
##$VD= 0
##$VDLIST= <DDDDDDDDDDDDDDD>
##$VPLIST= <PPPPPPPPPPPPPPP>
##$VTLIST= <TTTTTTTTTTTTTTT>
##$WBST= 1024
##$WBSW= 4
##$XGAIN= (0..3)
0 0 0 0 
##$XL= 0
##$YL= 0
##$YMAX_a= 567803
##$YMIN_a= -775686
##$ZGOPTNS= <>
##$ZL1= 120
##$ZL2= 120
##$ZL3= 120
##$ZL4= 120
##$ABSF1= 10
##$ABSF2= 0
##$ABSG= 5
##$ABSL= 3
##$ALPHA= 0
##$AQORDER= 0
##$ASSFAC= 0
##$ASSFACI= 0
##$ASSFACX= 0
##$ASSWID= 0
##$AUNMP= <proc_1d>
##$AZFE= 0.1
##$AZFW= 0.1
##$BCFW= 1
##$BC_mod= 2
##$BYTORDP= 1
##$COROFFS= 0
##$CY= 11.3945322036743
##$DATMOD= 1
##$DC= 2
##$DFILT= <>
##$DTYPP= 0
##$F1P= 15.7292609196834
##$F2P= 12.9074282941183
##$FCOR= 0.5
##$FTSIZE= 0
##$FT_mod= 4
##$GAMMA= 1
##$GB= 0.15
##$INTBC= 1
##$INTSCL= 1
##$ISEN= 128
##$LB= 0.24
##$LEV0= 0
##$LPBIN= 0
##$MAXI= 10000
##$MC2= 0
##$MEAN= 0
##$ME_mod= 0
##$MI= 1.114404
##$NCOEF= 0
##$NC_proc= 0
##$NLEV= 6
##$NOISF1= 3.799351
##$NOISF2= 2.8
##$NSP= 1
##$NTH_PI= 0
##$NZP= 0
##$OFFSET= 15.70392
##$PC= 1
##$PHC0= -24579.22
##$PHC1= 1.65271
##$PH_mod= 1
##$PKNL= yes
##$PPARMOD= 0
##$PSCAL= 0
##$PSIGN= 0
##$REVERSE= no
##$SF= 200.130013532006
##$SI= 16384
##$SIGF1= 3
##$SIGF2= 2
##$SINO= 400
##$SIOLD= 16384
##$SREGLST= <1H.CDCl3>
##$SSB= 0
##$STSI= 0
##$STSR= 0
##$SW_p= 3612.71676300578
##$SYMM= 0
##$S_DEV= 0
##$TDeff= 0
##$TDoff= 0
##$TI= <>
##$TILT= no
##$TM1= 0
##$TM2= 0
##$TOPLEV= 0
##$USERP1= <user>
##$USERP2= <user>
##$USERP3= <user>
##$USERP4= <user>
##$USERP5= <user>
##$WDW= 1
##$XDIM= 8192
##$YMAX_p= 0
##$YMIN_p= 0
$$ End of Bruker specific parameters
$$ ---------------------------------
##NTUPLES= NMR FID
##VAR_NAME=  TIME,          FID/REAL,        FID/IMAG
##SYMBOL=    X,             R,               I
##VAR_TYPE=  INDEPENDENT,   DEPENDENT,       DEPENDENT
##VAR_FORM=  AFFN,          ASDF,            ASDF
##VAR_DIM=   8192,          8192,            8192
##UNITS=     SECONDS,       ARBITRARY UNITS, ARBITRARY UNITS
##FACTOR=    0.0002768,     1,               1
##FIRST=     0,             0,               0
##LAST=      2.2672688,     0,               0
##MIN=       0,             -775686,         0
##MAX=       2.2672688,     567803,          0
$$ Real data points
##PAGE= N=1
##DATA TABLE= (X++(R..R)), XYDATA
0@%%%%%%%%%%%%%%%%%%%%N1j15J28j28J28j28J28j70K33k55K57l06L68l91M43
35B43n01N63o32O99p82Q62r56J067j184J305j442J590j745J919k114K328k565
52a345K830l122L454l834M265m764N344o044O905p965R321j1131J3675j7491K3762
67A3860l5836O6751k73780n46681R03900K58869p04994N3374N36170k23244k64632
78b16243K61949O7582k02066Q0607Q9080j22705j2688R2892m3626l0633M6044
89A0193N866r665Q567k1369J9356J4340o0841P421P7116n0410n0857R0515O003
102D6235r8580M5542O3558q2527j6545P1824m6022l7015P5517j1407n8297P3927
114B6210K8271r2044K3946P9083o5931m6717P7068P14o6540K9182L3970l8689
$$ y = [0, 0, 0, 0, 0, 0, 0, 0, 0, 0, 0, 0, 0, 0, 0, 0, 0, 0, 0, 0, 0, 51, -64, 64, -64, 64, -64, 64, -106, 127, -128, 129, -177, 191, -200, 243, -258, 305, -327, 372, -410, 452, -504, 563, -621, 684, -758, 832, -913, 1006, -1108, 1220, -1345, 1485, -1637, 1817, -2017, 2248, -2516, 2828, -3216, 3689, -4276, 5045, -6086, 7589, -9902, 13860, -21976, 44775, -229005, -775686, 128214, 387083, -317911, -264537, 271633, 48389, -216243, 45706, 113288, -88778, -8171, 80909, -41796, -54484, 38408, -5218, -35851, 10193, 16059, 6394, 14961, -6408, 12948, 27288, -33553, -26132, 50984, 574, -50283, 40232, 46235, -52345, -6803, 56755, -25772, -42317, 29507, -16515, -53530, 21987, 10580, -47717, 26210, 54481, -37563, -13617, 65466, -465, -47182, 29886, 30600, -35940, -6758, 27212, -11477]
126a1477k422K7360j6764q371J8820j3278o792J7153n327o250J7663o366j0296
139f347J7878o987k0686K3986P478l5029J1646L1793k9456j6059L8727r30l4389
152a8375J8145J7169k6530j818J9940j2091n250J8911q999j2267K0679q27k1838
165a3151J3238J4886k0194l141J7716q054j1148J4778o06j2638R203M610j3447
178g948L565J0101q795k481J1417l058m408N979r37n160M272P23p036M177K571
193B982p886O81P794m793m700P545k0o223M223K563l986L832K413m419K418L127
209E551n974j088O268m492n466N675M8q069M259N344n782J873P727n318l958P265
225C863j006p438N018N691o456j231N272k253l754M079J52m194J691M92k543o77
$$ y = [-11477, -13899, 13461, -3303, -11674, 7146, -6132, -12924, 4229, -1098, -7348, 10315, 3949, -6347, 11531, 4544, -16142, 7844, 15322, -19707, -8061, 23732, -5724, -21783, 16944, 16014, -18375, -230, 16939, -9591, -11409, 8531, -3560, -8810, 10101, 1102, -11165, 9514, 8687, -13151, 87, 14973, -5221, -8362, 9354, 1300, -9848, 4930, 4324, -8314, 889, 5499, -7948, -4383, 5718, -3077, -5558, 5859, 2801, -1607, 4372, 3435, -1725, 2547, 3270, -3766, 411, 2982, -4904, -4223, 3571, -1222, -5922, 1623, 1603, -4620, -397, 2166, -1820, 2012, 4425, 6, 2424, 5551, -423, -1511, 4757, 265, -5201, 474, 522, -7547, -3288, 2056, -3726, -1853, 5874, 556, -3402, 3863, 2857, -4581, 437, 6128, -328, -1559, 3713, 1460, -2294, 1785, 1937, -2257, -566, -74, -2617, -3294]
241c294K090J93n48J950J619p55p02M50P42J042l649Q4L593k423l206M303P17
258B206m403K217K611l216k819L056m59l269K974K694l261R86K666m01j529K286
274B339O56k986Q88o95j317k76J899j490j040J525Q07j907P20L57K18K59j62Q29
292F24r22j17K298J65r59n50J738k039j697N65J583k204m57K697l10l004L398
309H09R79l027P11J790k34l094J582J436j088j60J684o61l03L64l49n14j83K66
327Hj440l58J674j170J212M37m13R6J117r4r37j81N00n49l81N57J007o75q28O97
347B79N19j504p80J025L86j817J125J653j897O88J686O12j847J000k15p04m85
364b76N94m3l52Q1M32r62l79R05n39K4p06J040p65M06L09N92Q75p43M01r23J047
$$ y = [-3294, -1204, -1011, -1559, 391, 2010, 1255, 553, 1003, 1745, 2787, -862, -778, 2815, 392, -2814, 1489, 2206, -2197, 20, 2631, -585, -3404, -348, -807, -4076, -1102, 1592, -1669, -683, 1983, 1582, 53, 2339, 2995, 9, 897, 202, -1115, -1391, 508, -982, -2022, -497, 310, -1597, -877, -520, -302, -43, -205, 624, -298, -415, 1883, 2048, 1089, 539, 2277, 238, -1459, -894, 689, -1515, -1972, 725, 415, -2589, 809, 1788, -1239, -528, 1262, 1028, -2066, -484, 952, -136, -296, 1388, 727, 424, 788, 439, -75, -258, 8, -1432, -1790, -116, -1286, -74, 363, -50, 46, 1163, 1069, 132, -49, 451, -98, -479, 78, 1085, 410, -418, 279, 798, -706, -1486, -461, -75, -1892, -767, 886, -1011, -323, 1363, 1975, 128, 1128, 913, 209, -276, 318, 275, -77, 4, 436, -526, -905, 0, -539, -515, -1221, -181, -946, -540, -231, 361, 1236, 493, 894, -29, 1018]
385A018j001O76j85p5m40L21r65Q21k77r06O53K84r67L60J223j450O01P36J25
404E52p57l40J025p9l55K67L07j132L78J21l36n69J263l81p34O42K44m49m68J087
424B86l02J36N86K59l92j42k9J21L2j235J64R1L41k4J46o58J461j368P15J45n14
445a81N37k39O6J75m60J33N64j20l14M92j57p75k0j19R92j013j56J269p23r23
465i72J562L50r05j13M48k34j093Q66j06K39O51P7r44N81j011Q01K71r12O95n69
485c18M44p40Q67o86M66K2O1ql87j24Q70j057R41n80J63r75M39M29l75O21k51
506a78n93M42N59k5n67J104j094R42j73N28j487N07j19j103O48R55o93mQ31n0
526D30p69O72o66O29p42K66J98q06J155R7m34N9O09Q2o57n62M31M34q02R9J81
$$ y = [1018, 17, 693, 508, 433, -7, 314, -651, 170, -107, -1013, -360, -76, -1043, -683, 540, -910, -309, 427, 552, -205, -545, 480, 401, 46, 313, 620, -512, -134, -13, -349, -918, 345, -36, -770, -128, 116, -333, -801, 286, -16, 120, 706, 965, 573, 431, 402, 523, 555, -680, -516, -425, -84, -108, 38, -620, 841, -527, 188, 333, -181, 356, 117, 183, 358, -102, 31, 595, 475, 161, 653, 496, -279, -299, -418, 574, -439, -595, 674, -49, -972, 590, 940, 35, -78, 370, 136, -957, -91, -197, 42, 693, 770, -174, 407, -604, 197, 468, -444, 251, -318, 126, -614, 253, -433, 33, 55, 116, 108, -279, -403, 467, -590, 351, -229, -66, -1041, -602, -173, -548, 73, -178, -771, -329, 230, 205, -362, 742, -352, 590, 417, 945, -542, -35, -154, -1257, -609, 346, -347, -351, 480, 430, -339, 333, -333, 296, -446, -180, 18, -788, 367, 464, 30, 89, 698, 780, 123, -439, -8, 426, -376, -277, -96]
547i6L64n85M46m46M14j409J612n02K51L01o69J317j199N02j099J556k80r09L78
566e3K13L21m75j107J145k65n31O33L82m28K91J13l74N78j86J42o67N36j32N03
586F39p20R9q2N35r13k75K90O02q48Q61M41q56K4r6J027p76M96n94L09P9K64k47
608B59o8K02p72L79r66J067j51K89J95n34p62Q24O03k45p87N02M75q45P04o87
628c18m79J678r36M65l98L05n49l27N52J61M55n89j54K60m35O76p42j46L28Q95
648G02m59n81K37O31m77l78R51j624Q74L73k12N20j093O81l2l62k33K63M21l43
668a41j49L11j99K70J59n94k69N46O87m20j85K12j29l02o76P82j63k88Q84O0o42
689b46Q99j177O54m55M51J38m58M90o17L20K5J15M03o68p23O63j55q5N6J350l98
$$ y = [-96, 268, -317, 129, -317, 97, -1312, 300, -202, 49, 350, -319, 998, -201, 301, -798, 758, 478, -431, -53, 160, 481, 6, -1101, 44, -221, -752, -119, 263, -165, 126, 239, -135, 443, 257, 399, -268, 268, 136, 639, -81, 18, -64, 471, -442, -717, -427, 175, -673, 188, 629, -227, -203, -299, 728, -48, 448, -146, 163, 242, 506, 259, 191, 393, -379, 0, -966, 101, -50, 239, 434, -100, -862, -38, 565, 320, -467, 35, 510, -335, 369, -318, -797, 881, -55, 410, 12, 317, -232, -559, -7, 154, 609, 20, -134, 126, -309, 367, -375, -521, -193, 702, 243, -338, -101, 530, 53, -325, 626, -998, -124, 249, 37, 557, -536, 145, 113, -249, -482, -219, 202, -141, -290, 21, -178, 92, 251, -343, -612, -66, 621, 201, 16, 228, 99, -203, -879, -97, -260, -548, 336, 396, -246, 653, -524, 130, -325, 126, 264, -194, 296, -321, -1, 24, 139, 542, -126, -849, -186, -341, -426, -370, 980, 582]
710E82m95M76r86q9Q27j10j23L43L13j071k97K00l74N95o7j37l71J354k05p53
730c88rP57m52J07q27P51L87k30m70J046Q9r45n16J08J425j406J300r28P18l60
750A57k8k34K5O2N35k38p7l59L38n01O23L03o07m99N74k17l24P32L9m12L48k18
772B2k11N27j39j03k89K40o95J086p53K32J62M77k21k81P46j333m76J448j51o70
792c82O88j36k00Oj21p71P67Q82l12o90P95m75K58k45o42J225m69j3L74o94J087
813I32o01j07J04j49L44r55M47O53m33m6p5L52q11M99P9J08K20l00p35J64L9R0
835a81O53p03J92L07j75K93K03J75j067Q38n37k91L88p24J168j142M88J5N77M44
855I21p13q2m67J98K84J5n17l18J020R2q47K57m81J524m23q99O81P44n98n9j045
$$ y = [582, 87, 563, -423, -512, 315, 205, 82, 425, 738, -333, -630, -430, -804, -209, -276, -413, -784, 570, 365, -388, -397, 360, -92, 15, -812, -61, 326, 96, -374, 672, 761, -184, -700, -592, 833, -573, 727, -201, 517, 157, 129, -105, -80, -18, 517, 279, 202, -157, 181, -320, 303, 606, -1, -500, 74, -143, -467, 265, 304, -108, 240, 22, -189, 338, 199, 96, -193, 47, -648, 438, -315, -83, 79, 556, 335, 54, 800, -533, -1009, 439, 288, -382, 306, 170, -30, -24, -145, -916, -149, 733, 421, -269, 526, 51, 309, 64, -578, 647, 178, 165, 539, -155, 932, 331, 224, 328, 179, 523, -432, 15, 668, 235, 189, 114, 466, -345, 154, 233, 341, 561, 261, -474, -310, -271, -181, 472, -231, -39, 268, 93, 386, 589, 764, -303, 535, -2, -293, 95, -629, 539, -603, -115, -100, 477, 921, 208, 126, -341, -143, 141, 156, -361, -679, 341, 433, -414, -157, -638, 886, 463, -436, 245, 989, 391, 332, -713]
876g13J389q0m10k74j53Q25n56j22M79p01j01J134j241k35R51J27M68o33j241
895a087J246M20q38N26L35l79p9J85j87m89P02o22j51K35N46k49K07M9p99M91
915F2o07O75K02m5mK3m44J59n22M4m18K55L83n31P35j17P30p38M54N33m04ln00
938g8K16k34K21Q4Rn81R38j97J17k88m35O91m43J42O3J51k07L39j211R01L09n88
960h1j49N98m70K44l29L09m65K16pj141J243O97n32n11m1K00J64O08n93k81m3
981c64J4P6N88n64j36L3N61J05M2n03L56p5j14Q44j018%P64k61r46N16k41q5M71
1004F3M1j75L45o91M72o1j09k58L77L94l42o07O67l61oN59j94j69k56J88O02m10
1026F9m57J272l53q4J72j588J009j30j5J045l34l31M5q78J14P5J65Q24J61j117
$$ y = [-713, 676, 596, 186, -88, -241, 584, 28, -94, 385, -316, -417, 717, -524, -759, 192, 319, 787, 154, -1087, 159, 579, -259, 267, 602, 223, 144, 329, 142, -347, 355, -267, -418, -183, 363, 114, 321, 370, -429, 62, -545, 130, 332, 287, 283, 306, -138, 21, -501, -457, -875, -620, -237, -768, -33, -150, 580, -158, 296, 829, 425, 422, -78, 138, -96, 125, 209, 218, -363, 575, 378, 495, 207, -228, 463, 20, 162, 225, 376, 169, 508, -703, 198, 507, -81, -230, 368, -102, 142, -187, 122, -343, -127, -134, -1275, -32, 665, 133, -378, -419, -219, -55, 553, -40, -321, -364, -350, -274, 314, -250, -386, -353, 208, 313, 355, -148, 208, 133, 19, 863, -155, -155, 609, 348, -598, -82, -323, -408, 63, 104, -71, 274, -417, 55, -6, -115, -373, 4, 398, 56, -551, 116, -245, -251, 308, 114, -55, -311, -123, 479, 69, -388, 884, 531, 447, 619, -969, 40, -90, -105, 940, 606, 275, 320, -558, -444, -369, -204, 620, 781, -336]
1046c36m59R32o20P60p19J378j345L73M93k33m98MN73M5r43Q76m7J54j84J41o88
1067c43p49J048K27k18L89j9p0Q1o5j03O18n13r59J097j90M21j90m4J50n19j14
1088f5J097j226p5J12k25L11q5K7J01k7q8k25O99n9k47m34K9K89R8K91M74j27
1110F45o45k77j65M99Q0n93K73l43n8O74Q0l30N92l0k02j92p5k39M95l47Q40p69
1132h7j00L88k82j87M95j65k54M31J52j014M94k47j31J201j337J014k92J55N44
1151G78q89M97k67j40j73J01mQ%K61J68p22L51M1K67J50j86j49L17l60R49n39
1173D59m55L77n24l47l00M08J53p3R1J08J1L32K21m26l11Q31n46L42l87k84M30
1194A10n66J358p65l26L30L57p02m6KJ47n64O88k83K44l1M10n02j34N47m75O06
$$ y = [-336, -795, 137, -483, 277, -442, 936, -409, -36, 457, 224, -274, -270, 303, 348, -595, 281, 234, 388, 204, 345, -343, -1092, -44, 183, -35, 354, 335, 265, 346, 281, 178, 796, 283, -676, 421, 231, 652, 462, 418, 568, 49, -65, 1032, -194, -269, -157, -382, -71, -156, -129, -28, -55, -143, -368, 331, 272, 25, -409, -380, -91, 7, 298, 772, 645, 0, -277, -442, 57, 137, -456, -183, -526, -584, 90, 170, -160, 432, 402, 200, 8, -67, -306, 189, -158, 682, -87, -187, 201, -81, -268, 227, 62, -192, 239, 391, -623, -129, -376, -507, 694, -643, 371, 79, 234, 778, -111, 386, 119, -21, -194, -93, -97, -89, -89, 172, 340, -382, -31, 10, 277, 427, 241, 92, 409, 49, 998, 459, 4, 381, -143, -490, -790, -382, -229, -302, -211, -103, -92, 240, 461, 35, -276, 555, 9, 351, -36, -320, 110, -456, 902, 137, -189, 141, 498, -204, -250, -248, -101, -665, 23, -260, -16, -47, 363, -139, -273, 274, -201, 405]
1215D05J67l88K47q17M93lK09q9Q6l38k53K92m07N68K92j16o20J003j157L50j90
1236b66J86m37K39K11l95K7P56r44R99k09J12m06K42l5m5J030l28m48k87O8O7
1257A37N56n89L9K39k72L21k39L21o70n09P45K16m71J2L35k69j54K36M90n84p1
1278a81M81m85N5M93l62M60p12J19L46m85O63L6L0l23l50O39j56j25Q57q17k11
1299b8n95J05M54J27Q94r81J3l1r1L01q07R90j158Q40O58j572K09Q75l69O5j69
1320b70J93n19O62k09J25n62P23J69q38L77m05P39P53r73q9ML8n57P04J81L99
1341F45r48O41r64k88N49P17m75l27L59N4m29P23k22n25M02O04J82k96o95N9Q79
1362F45p33n36J092m40o59N20R14r80k36J074j0p07n6l7k44Q05k91o23Q07o7k87
$$ y = [405, 572, 184, 431, -386, 107, 104, 313, 224, 310, -28, -281, 11, -396, 172, 464, 348, -272, 731, -426, -76, -266, -80, -517, -278, -67, -462, -435, 321, -623, 376, 167, 279, -127, 115, 80, 35, 1065, 737, 289, 2, 70, 137, 693, 104, 143, 382, 110, 431, 192, 513, -157, -666, 79, 295, -176, -164, 171, -98, -252, -16, 474, -110, -181, 300, -185, -130, 363, 1, 461, -251, -132, 214, -271, 392, 428, 458, 135, -215, 424, 268, 143, 1000, 183, -28, -623, -518, -64, 63, 957, -24, -11, -42, -133, 168, -639, 351, -807, 33, 691, -881, -672, 203, -166, -101, -270, -77, -596, 66, -143, -18, -580, 143, 312, -526, -149, -554, 185, 938, -35, -124, -120, -82, -639, 65, 246, 645, -303, 338, -626, -914, -365, 352, -123, -450, -91, -37, -466, 257, 35, -490, -88, 516, 698, 402, -293, -234, 645, -88, -624, 468, 28, -631, -111, 803, -177, -413, 661, 651, -56, -112, -149, -393, 412, 121, -502, 305, 238, -49]
1383d9K24P4j31L50j116Q82K28n26p2K87n9o3K17m86Q52m76J47n83J56N8R21r52
1405a17L46k2j82j47p63Q89r7J69JL00L76q25Q47j142P70o8o75J29J088p84N17
1426F10j105P6j8K11o27P55K42K43m92K39k5p06M62O07k66j32N00q52J18L80l79
1447a59p39N50N79k01K47j87l10k18N41j15k21P09k35m10L69o04j85J511j022
1466a00j90k4L55m92J079m71n71Q86o80k93P64J59j2K50o83l34L32M93n46P7m
1487eN63o25O9K69o42K6P30L60q26l2k26M53l55j49J6K36K00k84o36R25P33p94
1509FLp3p82K68M76k66M92J53j72N78m33l94M38j059L18k93L28M94K88l91l63
1530c84l11J176m60k33J90l03L41j59J40N24K42q9o77J98j1K48o92R74j183k25
$$ y = [-49, 175, 249, 118, 468, -648, 234, 462, -64, -136, 151, 92, 29, 246, -240, 612, 136, 283, -300, -144, -86, 835, -117, 229, 207, 25, -122, -885, 4, -93, 76, 77, 377, 753, -72, 775, -367, 403, 335, -340, -211, 877, 93, 610, -495, -419, -437, -226, -853, -98, 144, 387, -105, 134, 109, -597, -135, 472, 206, 74, 574, -278, -160, 220, -159, -898, -348, 231, 30, 277, 90, -220, -438, 103, -12, -233, 476, 241, -169, 200, -404, -589, 922, -100, -290, -314, 41, -451, 628, 157, -414, 472, -208, -501, 263, 422, 410, 660, -23, -357, -25, 468, -78, -1, -5, 558, -67, 2, 271, -371, -345, 385, 745, -81, -113, -339, 114, -241, -390, -374, -138, 62, -222, -858, 67, 800, 6, 9, -64, -846, -578, -102, -368, 124, 277, 105, 683, 250, -144, 294, -765, -447, -740, -412, 82, 370, -21, -384, -695, 481, 21, -212, -22, -325, 16, -143, -3, 521, 763, 674, -3, 195, 184, 432, -260, 714, -469, -694]
1550f94Q43J61p65J118p47J15J41r32N44K08k10L04j72J14o17K12N27r70N42M32
1570A54j041Q48N64j014J50Q31n23n85O93l48N4J33J5K93k87j93L42o38J72L05
1590g5K09J72N33q05l3j69N36k82j07j1k98l82M15O26r47Q26m49qK59n08J56p3
1612d15K30k03K99j05r19J202j6j69k35L75m37Q91K37j016M5o46N69J97j73N1
1632b38J42j80L08l73M63L87l81J46p48%K27m0M98j44L31k55L48j047L55k56Q1
1653c76K82k27L57L98k93j59m46J23J325r59K81k08M92o73M95J88l94K1q6k64
1673a23j26K61l52L66K02k41O19k05j111J348j502N43M16L34j00r18P2R55l47
1692I1j11K48o34J091r85O83l49j39M4P42m50l21m2L26K15l91p3j8m1j41J60j72
$$ y = [-694, 149, 310, -455, 663, -84, 31, 172, -760, -216, -8, -218, 86, -86, 28, -589, -377, 150, -820, -278, 154, -887, -39, 525, -489, -339, 492, -31, -616, 77, -271, -217, -84, -69, 224, -63, -256, 86, -552, -380, -75, 134, 306, 839, 34, 1, -168, 368, 86, -21, -32, -330, -712, -297, 329, -618, 208, -241, -249, 10, -498, -342, -415, -185, -388, -89, -194, -1113, 89, 73, -96, -331, 44, -393, 498, 735, -281, -236, -882, -313, -116, -289, -238, -96, -276, 32, -341, 122, 509, 128, 274, -474, -474, -247, -287, 211, 67, 398, 143, 491, -556, -201, -457, -376, -94, -321, 36, 434, 141, -18, -464, -341, 984, 25, 306, 98, 590, -83, 412, 600, 206, 227, 141, -123, -249, 12, -340, 26, 228, -13, 606, 401, -710, 638, -864, -321, 95, 429, 329, -589, -517, 438, 91, -20, 228, -406, 685, -300, 383, 34, -105, -61, 681, 231, -90, -132, 194, 409, 18, -55, -73, -114, -255, -95, -267]
1714b67P00j115R98q1L81j211L28M29m85O73q76o8N40K33K07j047Q45n48N04q9
1734E1n4J00n28Q00L78k72k67n15N62l00q18R17J7j93K67J17P3j16l86L60O43
1755H36n07m83Q87n30o16L14N4J21m24L43J12l89O45J14k34q3J55k85K20k87k55
1776b92P49o10l83R46j90k71m7M53l27n53M91K12J17J34Kol40k99K50K74L38q51
1798b03r8m69P94j55j64J051J49r84p1o25k05J191Q2j99l58n52J073K56q30M92
1818A75o39M53J9j12Q56q94k2o56L80M12j30N1k67K55p1J012q90J77K86j9N3n58
1840a29M54q4o2l11P4N06q86O55j9j20r9n3J90r3j71J1n58M82L1L51p04O47l49
1863b37k71N90L14m62l35o4n85R09M57J17q26L60J4L79p23M96n67P57m79Q93n75
$$ y = [-267, 433, -682, 316, 235, 616, -595, -267, 162, -323, 350, -526, -594, -54, 179, 386, -661, 184, -364, 140, 51, -3, 97, -431, 369, 747, 475, 208, -307, 255, -45, -863, 54, 71, -122, 145, 262, 335, 219, -167, 193, 836, 329, -154, 733, 203, -413, -99, -45, 76, -348, -5, 107, -282, 363, 477, 243, 160, 315, 30, 250, -37, -292, 457, -153, -536, 410, 220, -51, -98, 355, 28, -525, -34, 178, 295, 429, 431, 425, 85, -214, 36, 310, 648, -203, -301, -770, 24, -131, -295, 756, 905, -79, -150, -775, -980, 211, 293, 94, -264, -816, 257, 513, -317, 175, -464, -11, 8, -104, 752, -142, -164, -820, -440, -28, -158, -107, -374, -119, -190, 822, -68, 109, 395, 376, 429, -129, 325, 241, 179, -132, -58, 448, -438, 217, 198, 78, -21, -74, 116, 23, -148, -137, -695, -213, -182, 169, -535, 112, -237, -508, 82, 396, -66, -401, -465, -1050, -141, 316, 433, -393, -33, -19, 360, -363, 133, -434, 323, -156, 737, 162]
1884A62j48r4k37l54M16o6L99m25q6N11K85l20j50j80M79Q08j015L18L51j045
1904c91L96j47N41n52O87l74K41r74R61l85L16j15l72R20j294J197k62J36m38
1923I1K45m72J189r34M0p0r7k04L11L94j043M09R61n61q28N88J34k62L37J19j19
1944B28o73P66K75q44M67J7p40Q81q26P01o8r9l63J27Q5j49l16j79Q31N87J89
1965H97m41j45M88j135J28J67l80J53m21O29K40j78j49RP18n54Q13o17o9Q9m05
1986a63k87l83N59L79o18q0M87j64P23m85n05P52L18k23j545J351J97N08p05o08
2006d92J126j13m59N22n88L81k20j10l79J47j18Q29n36j09J92K41r03J83k27N05
2026a28Mk23R70l70k96R7J13M51j160L1J325o74m14P63k14k97K33j36l01L62p6
$$ y = [162, 14, -80, -317, -671, -255, -321, 78, -347, -433, 78, 363, 43, -107, -287, 192, 1000, -15, 303, 654, -391, 5, -142, 399, -153, 534, 160, 401, -573, 388, 3, 319, 204, -168, 752, -542, 655, 393, 529, 91, 336, -136, 1053, 119, 159, 89, -8, -212, 99, 493, -550, -141, 820, 259, -569, 19, 153, -109, 228, 347, 228, -445, 321, 596, -248, 219, 236, -504, 377, -449, 252, 184, 85, -278, -151, -66, -215, -531, -710, 121, 708, 897, 456, 311, 799, -336, -208, -41, -421, -268, -689, -60, 180, 2, -147, -138, 580, 26, 839, 222, 153, 242, -163, -450, -833, -274, 105, -513, -593, -106, -270, 453, -32, -537, 215, 533, 310, -1235, 116, 313, 821, 116, -492, 634, 521, 62, 584, -4, 377, 157, 47, -332, -185, -303, 526, -10, -119, 73, 314, -589, -406, -633, -128, -124, -347, 623, 253, -43, 54, 167, 618, -542, -511, 814, 140, -274, 489, 275, -22, 211, 75, -226, 136, 60]
2047F0l4L48m70r24J024n02J78J557j521M1L52O6k11p3k48O68Rp98J196o92j192
2068a166J375j25j41J48n21l66J205O3o62P51r02J030l8m34K36j25k58K61m17
2087h6Q66p71J08j99L73m45l11P3J076p43j57n67N42J041o21K00r35r3J611n30
2107D32p50M47L92o67q25R38k1l7l29J72K64J47n36k3K80o05J173l03M48l79k28
2128a0Q05j212J95N59k65k13J25k74R1R55n21J74m62k04R34r32K31j34K03p4J89
2149A60p89J080o05k02k03O18l13O52l11j09j11J99o03J53K51q36J211n23M53
2168A72J08N5q14K69O12k79J29M0l04m78O82M44J66n52q01P38m75L55J17Q1J52
2189D17p79Q85l81l31l31K72L77l25j89Q39q04N96j026K76N26K99p8n22j5K98
$$ y = [60, 26, 374, -96, -1020, 4, -498, -320, 1237, -284, -243, 109, 175, -36, -109, -357, 311, 320, -478, 718, 26, -1166, 209, 84, -57, 91, -430, -796, 409, 472, -190, 561, -341, 689, 651, 217, 453, 328, 70, 331, -86, 780, 9, 117, -82, 291, -154, -465, -392, 684, -59, -216, -783, -241, 800, 179, 379, -556, -649, 962, 432, -318, 129, 521, -146, -971, -33, -54, -91, -420, -248, 16, 163, -373, -396, -116, -721, 452, 149, 597, 218, -10, 795, -417, -222, 337, 72, -141, -16, -290, -199, 756, 235, 409, -53, -257, 677, -255, -24, -158, 45, -29, 160, -629, 451, -154, -356, -559, 59, -254, 398, 87, -22, -133, 66, -537, -384, -133, -969, 242, -281, 172, 280, 335, -479, -210, 402, 123, 252, 292, -12, -490, 192, 636, 802, 250, -551, 187, -288, 67, 184, 265, 417, -362, 523, 142, -189, -520, -248, 129, -196, -385, 454, -350, 246, -780, -504, 22, 321, 243, -279, -294, 4]
2209DL45m00r8R8K60l27J44q4j31m91O77Q6J04n09L59lk1j34l54J09N50k43k1
2232h0l09M09l80p5K69J70j81j52J19J80O0j22k49P75m24R22j607P25M2k23j2
2253a43K95l72Q0j05K66k88R27l88R7r8k42M01o18q4N00n39O56j62n67P77Jn03
2275a09l28K92m78Q52j1p9O00j519P34n83O38j31m18R69K56o73M49k61k30j44
2295a74L00j9o70Q60n31k0j96L79L82n01J088j293j1K69L28k17N0J20j87n58N65
2316c6j43J69m24M95N70j119J20K9Q07p48m6R31k47j17l11j10K62J00k68L30m43
2337a99M75K95l13r17Q67l3m06m84R29j09L1P30l24j032P42k95k46n57P69k24
2357c01j48P57k32N01o58P03q69p8P57n43p31M78L36l6L65K2M06q93q0K34o5l16
$$ y = [4, 349, -51, -149, -51, 209, -118, 26, -58, -189, -680, -3, 83, 187, -322, 37, 34, 13, -121, -475, -366, 184, -59, -80, -389, 20, -360, -435, -166, 4, -177, -329, -210, -30, 30, -92, -341, 434, 10, 932, -675, 50, 92, -131, -143, 152, -220, -140, -245, 21, -267, 660, 272, 369, 271, 29, 430, -188, -272, 228, -311, 345, 183, -384, 393, 394, -109, -437, -145, -623, 229, 218, 139, 739, -780, -46, -629, 9, -122, -540, 429, 685, 12, 461, 200, -30, -174, 126, 107, -563, 297, -234, -254, -450, -71, 311, -190, 898, -395, -406, -137, 191, -26, 24, 144, -43, -601, -36, -179, -10, -434, 61, 631, -488, -368, -339, 468, -280, -326, 605, 358, 241, -70, -180, 82, 182, -86, 244, -199, 276, 571, 258, -659, 208, 175, -231, -715, 214, 105, 136, 866, 542, -490, 252, -43, -289, -846, -77, -301, -449, 308, 76, 577, -81, 622, -247, -325, 432, -111, -842, -364, -28, -64, 301, 323, 729, -164, -244, -10, -75, -391]
2379c91L57L86k57J97N1n14K63L9l08k41L16R1Q3M04K32p44K26J51p71Q53q40
2400d17J238p65M03o01m95R73m68M14O6j85o26N05N37o75m03M75m85O22j31K80
2420B62q67R76o59P56j52K40l30J65o32k44L63Q7L12j005R53m08l9l5L29J22l31
2441a37j08J20p67N68n79J012k9L71m18kL05m36l31k3k85P65l61J30R52k59N21
2462A009j069P16r58L78ok21K86r4j32L74k72k47N32k35n00O87j43J70QJ26j73
2483B36o67O68k91l13j90M77m61R65L35m28m64N37k30J46o46l40J589o02k52M5
2503A14k98nN33m05O46m34k79M27j88L83l84j37j07M68M64j411R02n01L63p97
2523f46J968j814K96K90L39J6l44N7j1j34k49QP53p80J05L19J33M45n36p39J009
$$ y = [-391, -34, 352, 95, 292, 343, -171, 92, 131, -177, -418, -102, -11, 72, 476, 708, -36, 190, 341, -430, 423, -417, 821, 56, 459, -142, -637, 336, -132, 282, 348, 163, -463, 42, 579, -96, -499, -24, -509, 113, -18, 262, -605, 371, -288, 468, 316, 556, 226, 391, -241, -485, -122, -35, 277, -728, 225, -183, -222, -257, 72, 194, -137, -245, -125, -892, -324, -903, 109, 80, 451, 33, 31, 336, -100, -431, -454, -739, 26, -335, -205, 747, 488, 1009, -60, 656, -302, 76, 70, -151, 135, 41, -91, 283, 11, -236, 296, 61, -439, 248, 105, 275, 283, 409, 236, -431, 237, -54, -367, -557, -80, -541, 424, 759, 331, -133, 404, 174, 320, -326, -666, 923, 321, 69, 114, -184, -189, 344, -61, 585, 151, -128, 299, 111, 494, 110, -27, -134, 334, 798, -613, 289, -212, 151, -646, 1322, -492, -196, 94, 433, 449, 105, 162, 151, 17, -232, -224, 529, -251, -146, 173, 306, 751, 215, -524, 485]
2544D85n6k68L47o95O03r04N0O15J8m11Q7J0o05J081q10L63P62n80m21P5P27L30
2566H03j204M12m02L19N85N1o19j41O98l61l05p05J246n38N12l79M47r95L44L98
2586A66p26O11j42p13J074l35J59M68K38j193K13n3n5M3J32j97O55m1J35l82L78
2607D35m04m81L48j69N1K63J05l39PQJ01L25l12l73J93O67J71p54L55R3m05O40
2629E25r46P0J3P81m09K90r3K36j62n19O50m2q27J019m59N44j393M38j81O21J61
2650C17o25p2N3P44J28K11p14J70J42m61J16Q6o92P6J84N63l66N8m63Q80l80o04
2672f49K24L06r2K7J02j01M70j24p74O60L02J38m94K1j44O1L07m75k98n75J219
2693A11j47j059J109j019J101p0n42N48K3l93O73m90l21N62m19K73K44r29O76
$$ y = [485, 429, 161, 508, -187, 416, -488, -438, 177, 195, -216, -129, -119, -724, 357, -453, -90, 672, 92, -329, -254, 473, 803, -401, 11, -391, -72, 513, 564, -55, -196, 502, 141, -164, -869, 377, -161, 351, -28, 419, -576, -232, 166, -560, 51, -91, -804, 270, -65, 94, 562, 800, -393, -180, -233, -288, -245, -113, -310, 345, 304, 439, 57, 435, 31, -450, -102, -271, -220, 43, 148, -191, -184, -176, -75, 250, -62, -435, -242, 425, 596, -158, 197, 290, -115, 525, -421, -351, -338, 443, 34, 324, 231, 467, 305, -214, 436, 394, -433, 586, 127, 671, -722, -284, -465, 156, 317, -308, -380, -327, 417, 545, 756, 42, 212, 354, -107, 9, 95, -597, -521, -337, 226, -140, -82, -545, 335, -45, -649, -425, -119, -211, -184, -82, -183, 287, 163, -611, 49, 351, 489, -5, 16, -128, -67, 240, -235, -533, -1108, 111, -36, -1095, 14, -1005, 96, 26, -516, 32, 55, -338, 335, -155, -476, 86, -333, -60, 184, -745, -69]
2712f9K84m16N18n79k35R75j6n07Q47n90m36J93m42K80P5k48L12k75M91k23N93
2733E32m83J62r42P12J40J0j7j7l04J5N79m11J23N28q99L15N47k03m80N12p12
2754b93O53n89m53O50P82r10J98Q83l96l47J57l81J15l46N63q13N43j18o0L18
2774A56k5M43j309J053K89q14m07Q91M0o85L66o54J23L79l18J060m66q01O5N29
2794h5N56n07r1J79R3k27k31L51L5j98N6r0m81K71O25O96j256P83l28k73j74R17
2816F21j151O45n79P61k23P1M39j235M84Q23o54l70P39k26o19m41J479p77P7k20
2836c56j72N80n90j90M91NO69j8l88n31P65q58R00O0m17Q98j168L85J72j110J094
2857B21n8K81j83l3o69J10l99N60j6M30l56K08M48j056N48l84P1K45R4l74P86
$$ y = [-69, 215, -201, 317, -262, -497, 478, 462, -45, 802, 212, -224, -31, -473, -193, -118, -366, -54, -329, 162, -61, 532, 49, 211, -731, -19, 121, 131, 114, 97, -207, -192, 387, -24, 99, 627, -272, 43, 590, 387, -93, 419, -293, 360, -229, -682, -32, 750, -160, 38, 921, 525, 178, 335, -46, 69, -277, 286, -527, 16, -102, -162, 156, 131, 574, -735, 318, 607, -207, -614, 277, 317, -368, -2, -656, -533, -154, -472, 588, 122, -679, -614, -85, 471, -36, -127, 52, 145, -82, -313, 38, 73, -125, -69, -159, -640, -369, 256, 952, -304, 479, 151, -122, -296, 621, -530, 115, -464, 297, 74, 145, 584, -651, -167, 656, 2, -368, 371, 145, -474, -915, 564, -213, -136, -356, -528, 52, -538, -728, -237, -232, 437, 419, 31, -500, 265, -593, 307, 367, -50, 848, -320, 65, 237, -873, 221, 163, 444, 261, 228, -441, -331, -730, -170, -186, 244, -112, 96, 544, -512, 36, -348, -277, -32, 62, -312, 474]
2878D74M91j387j99j2K16K1Q9pK00M93o70J55l81R7J60J77L48n17J90J31J52L13
2900E34l47p35R86o08L6n1J45J27J26l27k33Q1J24K42k74N26q99P74l50K01m39
2921c61j06O20m94P69j145J593j007M40o9J57J43j223M70K48K06l78O80n99o8
2940a24K6o63M06l79N71M00L94q13j18M06K06L56j248O29o06J04k37N81j26J56
2960g9m42P04Q1p34R52l81k31r5J14M26N63j463J091l8j27n72J39J06j63j55K46
2981e8j88J275p11q45M71m80M05l29k04K00O1K84o61J024j15L43j402Q91j11R8
3001e2O25q7n57k34o6K58k12L59J6o3L21j1p15q6j58J349j143l7R01p36N09l1
3023A50K93l50m38R87j384P83R4n71k03K76M44n15Q14j042J018j76j84p1jK42
$$ y = [474, 965, -422, -621, -633, -417, -396, -307, -314, -114, 379, -291, -136, -517, -420, -260, -83, 265, -252, -62, 69, 221, 534, 187, -548, 438, -170, -134, -185, -40, 87, 213, -114, -347, -266, -142, 100, -174, 352, -547, 227, -123, 78, -361, -467, 153, -341, 428, -717, 876, -131, 309, 240, 397, 540, -683, -213, 35, 241, -137, 543, -56, -124, -98, -761, -355, -734, -163, 237, 631, -182, -300, 106, 312, 668, -580, 49, -557, -453, -690, -109, -235, -79, -521, 183, 264, -470, 482, 101, -130, -225, -111, 315, 878, -585, 506, 468, 341, -231, -92, 14, -149, -304, -58, -246, 1029, 318, -527, -56, -536, -131, -460, -664, -464, -403, -119, -780, 244, 129, 472, -930, -39, -150, -52, 573, 486, -71, -305, -371, -113, -325, 34, 50, -13, 308, 297, -418, -504, -662, 687, -456, -493, 408, -328, 181, 150, 443, 93, -345, 642, -742, 41, 135, -436, -639, -363, 81, -434, 380, -662, 356, 180, -4, -75, -76, 166]
3043A66N1j60k57k33N00J95j52J92K71k99p58O37K88J26p12M31l47J62j42J71
3063A30j7J18j082P16k29K81k98O14n56J69J98K81m0n48J32k72K59l9j00O69n5
3084C31p79K11M74j08o95K46Q82j170L80P39n13n65R05j56j34l41O13o3p29N29
3104E7N7L79j078N98M18n46l46M78k40k95K36R02n90K11o62Q47m75K02j85j80
3124b12m73K00l62O85K72j13O2L30k07o44K82o89Q64k72L20K51k10n21M4R82o91
3145a02m11R17o47N67q66M92p5j33J62j86J24K16q54M4J101k4Q3j14l2o88Q26
3166D00p42l73N03J164j360j59M08M9P46l95n00K66L1o09J294m18o16L95l24n1
3186b91K17M08qK24p14O99j232N83O57p33k15O31K93o33J06j355J127N35j097
$$ y = [166, 217, 57, -200, -433, 67, 262, 110, 302, 573, 274, -484, 153, 441, 567, -145, 286, -61, 101, -41, 130, 113, 231, -851, -135, -364, -83, -381, 233, -323, -154, 44, 325, 285, -263, -131, -403, -144, -183, -283, 386, 331, -448, -237, 237, 129, -566, -320, 562, -608, -228, 511, -2, -567, 338, 182, 48, -293, 320, 257, -472, 57, 114, 493, -585, 13, 431, -115, -461, 17, -223, -518, -282, 620, 30, 241, -421, 426, -49, 153, -32, -212, -685, -485, -847, -162, 110, -3, 59, 389, 182, -462, -180, -869, -5, -277, 43, 294, 84, -437, -393, 589, -102, -513, 404, -243, 324, -542, -50, -125, -258, -96, -282, -158, 58, -796, -752, 349, 325, 408, 294, 262, -426, 400, -342, -715, -212, 952, -408, -567, -159, -110, 636, 241, -259, 7, 38, -571, 723, 305, -311, 84, -240, -291, -74, 334, 326, 550, -164, 535, -697, -114, 543, -190, -405, 226, 519, -114, -8, -1363, -236, 299, -798]
3205g98R68l72J81p59J277k02j33Q9j82j47k59k01Q86L6o05M56J89l96j91J74
3225A1j25q3j7N25k85K83p36j00M94l20J54M30k49q12N48Q15K06j099L30L72o09
3246b67N25P4k61J10L24l61N6l78q62P54N94m59Q0K29j200J226j38k03M54k43
3266E4l76L3P16k69m75J67o20J289m19J03q1n28P83l43M6L24j11k24O55r56M07
3287A75K57k03M61r92j80K35N29l81J71l53K15ON01M42q85j19J41J06l00j70J77
3308a67P51j73J48m00K88j557R04J78N16p57L56q66K66K94l73k29J139q86L41
3327b27p27P62N53n21N16m62N49o77N8n27J045n89J4M5O60p88L64K19P66j55j106
3348b28J13l59N51l99N1K42k05J08M75J14j273O56m31L76O13l01r8o60L29J45
$$ y = [-798, 170, -202, -21, -780, 497, 295, 162, 251, 69, -78, -337, -538, 348, 384, -221, 235, 424, 28, -163, 11, -114, -197, -214, 311, 26, 309, -427, -527, -33, -353, -199, 231, -18, -830, -282, 533, 739, -360, -30, 342, -267, 258, 332, 71, 181, 505, 144, 200, -178, -1040, -286, 308, -151, -71, 158, -1042, 184, 46, -157, 297, 54, -322, -289, 427, 158, -317, -150, -770, 519, 100, 203, 122, -406, 377, 34, 80, 404, 293, 69, 724, -232, 175, 432, 229, 690, -302, -482, -247, 282, -99, 72, -281, -66, -60, 441, 883, -2, -121, 20, 126, -174, -344, -167, 584, 411, 559, 159, 447, -1110, -206, -28, 488, -269, 87, -779, -513, -219, -592, -821, 318, -568, -227, -954, -192, 361, -160, 356, -106, 443, -234, -176, -703, 342, -247, -233, -188, 472, -316, 48, 267, 1033, 878, -228, -115, -474, 77, -322, -271, -29, -234, -126, 349, 463, -810, -154, -585, -209, 404, 103, 5, -655, -326, -181]
3368a81rM00K1j88m2l58l8J14J94L05l25l99O79J22q79O16J51j08r2K75N07n43
3390B22K9O7j18p42L42m2R15o40R4J79n84n61P25O05o96N06m16o98R51o57Q03
3411B84p35J39L81M32n21l25L60L16J24m1l55l20Q38k95M4k34M68j205Q27l2p91
3432f41O96J7J23j21O60l93n10J98J49l05j41k28K33K74m38K29n22J341q89O65
3452C97m83k5N89k00M1n67L64K22p25R72o72l63Q10o4p81K13Q16o03ql36K05L81
3474A83l89j08N85L39r52M37n1k21r3Q05q72O30k95K48q90O15j41j85P43l58j62
3495a32k78P79j02K59m06l16l70N49j85P2KQ17p49l38L17O6L94n0k50j71M48j24
3517B32k84M70o36J90K18p47M29J04K29L37l12n44N05n84L5N45o43J326p86o32
$$ y = [-181, -190, 210, 231, 43, 1, -357, -395, -281, -87, 218, -107, -506, 173, 295, -584, 32, 183, 75, -17, 258, 765, 222, 251, 318, 200, -542, -200, -242, 673, 33, 127, 306, -278, -839, -114, 491, -205, 301, -115, -813, 138, -519, 284, -451, -312, 69, 501, -20, -345, 15, 331, 455, 414, 59, -261, 577, 282, 326, 92, 560, -645, 182, 150, -641, 55, 72, 195, 74, 734, 341, -169, 29, 178, -127, -268, -496, -263, 11, -427, -198, -720, 621, -268, 397, -86, -111, 478, 278, 319, -248, 116, 338, -387, 585, -87, -450, 360, 296, -485, -272, 544, -59, -67, -403, -198, 183, -206, -314, 271, 610, -342, 95, 44, -177, -270, 535, -337, 293, -2, 246, -644, -29, -170, -355, 388, 30, -132, -410, 369, 267, 526, 120, -196, -566, -17, -202, -130, -128, 689, -60, -398, -81, -15, 379, 329, 79, -92, 356, 232, -52, 418, -218, -28, 190, -557, -128, -24, 205, 542, 230, -314, 191, -393, -358, 187, -456, 870, 84, -548]
3537e48Q02n39j91K4P99l43J34J98o92K34J83m71J123m76K82p52K66j8N59n14
3557F0n13Q43k28L90K38r48l1m5J26p2N24M3l48M8J49n1l44L66k11m55L95m20
3579d84j28O22p02N47N74L17p55P2l80k25O85M03k29m29K55q37M46O21j56P8q99
3600f04Q30M93o24Q3L09j73o95Q62p41Q4j80K24j05k0n7N35M6m58J36K74j53K94
3622C60n11l25M17M87p43N8m74J283l96J15m92L34n18N82o63Q37p14Q14K08m28
3642B31l62M58o89L36M03m30L02k93j64O67o33L93q92P47k8k84K40l45j91O84
3662A50m47j51R64q09Pm40Q67K49j51j1n53K29m38k7J02R7Q6q8L94m62Q68k74
3684A62k58K62j58M31j28m90O30p81P88j067J025j86j86j0l40Q56o74L47k23N
$$ y = [-548, 254, -285, -476, -452, 347, 4, 138, 336, -356, -122, 61, -410, 713, 237, 519, -233, 33, 15, 574, 60, -453, 390, 162, 552, 790, -158, -189, -234, -108, -180, 344, 387, 39, 87, 236, 185, -159, 207, -4, -459, -64, -484, -612, 10, -692, -145, 429, 746, -9, 63, -317, -542, 143, 546, 317, -112, 143, -694, -248, 373, 217, 295, -604, 226, 719, 95, 178, 487, 314, -381, 481, -260, -176, -356, -132, -237, -257, -314, 221, 267, -191, -55, 219, 66, 360, -151, -476, -59, 428, -315, -257, -731, 552, 156, 271, -221, 113, -405, 177, -486, 351, -363, 451, 659, 231, -131, 327, -362, -26, 377, -53, 249, -44, -208, 459, -174, 219, -673, 74, 46, -238, 2, -343, -534, 150, -297, -448, 516, -293, -286, -726, 141, 390, 239, 228, -325, -96, -534, -561, -459, -362, -276, -364, 30, -432, 436, 162, -96, 166, 8, 439, 311, -179, 451, -330, 458, -609, 416, 230, 44, 34, -306, 550, -124, 223, 0, 5]
3704Ep9p08K24Q02r58J100j432N64N89L93j033M46J34o80K39L95o79J101J04o78
3724a51P83n26K76p13M39l84Q09K60j527Q20j112R88J50q54M54O39j30l13KJ66
3744G6m65N14J47N91r99j11J26M23k74q78N50L11Q65q22m43L18M18m59q5O35l58
3765H0k04j4o1P0m70J71M70P7l04K35p32M61M65q05O98J26J41o06L3L36p69J14
3787d88O82j34K44q01N83l2N32l47q86J43q8J52M79p33O83K94r18Q72J47j01o19
3808c36M75l08j69K90l77P16J40j047N48o41R56kq53M18L96j6j6k78J67q25R61
3829A99L83r83L54m09K48j36N10J74r26N73J82r6n85Q29o75J71M73q39O72L90
3849E09pr15N46o69O06m04K43N42k02q43P72L99m46J36n53L81J36K77k91N44j116
$$ y = [5, -74, -782, -558, 244, -714, 386, -1046, -482, 107, 500, -533, -87, 47, -633, -394, 1, -678, 423, 527, -151, 632, 106, 382, -331, 108, -276, 533, 793, -734, 86, -1026, -38, 112, -742, -288, 351, 221, -92, -90, 76, -389, 125, 272, 863, -136, -247, -121, 302, 28, -850, -300, 11, 876, 54, -389, -71, 347, -112, -197, 438, 80, -124, -138, -199, -129, -599, -428, 42, 119, -185, 50, -682, -221, 244, -561, 137, 263, 404, -202, -169, 167, -602, -488, 194, 60, 304, -497, 86, 54, 586, 239, -647, -504, -592, -440, 39, -694, -11, 283, -635, 237, 384, 283, -336, 139, -169, -338, -48, -425, 291, 431, -616, -68, -709, 247, 245, -608, -190, 206, 190, 174, -104, 63, -762, 199, 582, -401, -47, -456, -208, -344, 166, 340, -586, -13, 169, 73, -512, 317, -358, -187, 286, -553, 119, 509, 502, -413, 133, -536, 70, -334, -91, 451, 249, -594, 178, 577, 131, 267, -286, 95, 231, 508, 217, 761, -355]
3870c55M13J69j16r80O64N1l7J39q05M08m6P51O3n72n65O76K67L18q99qN55j16
3892b5M7m8oj0N38k91j183J210L12j119P44k91k46L6L23L07p93O07j92J2O94p36
3914a10m2P72r29J76J75L94n51R1L63j764J592l1O70r73n45O13q6%P93j463N84
3935b71M89p83N27o18L85J2j79n29L74M11L51p85Q52n16M71m08M41J32l16N11
3955E51q24R23j080%O98r10P52Q14M2j304N55J72p11M69M94o86N37m71j22Ok25
3976c20L82m33K01K43M26k82O7r08R64k09k41N74m08k17j37K2O97j05q41M80j74
3997b19l8O67p97J84j29O52l71L05n21R0j22N9L57L26l85J41j51k32N81p33N01
4018A65l90k68L81P3J11P26o66nq4L70o70M77o08r7Q40m35K25J5j61PL37K0q97
$$ y = [-355, 58, 227, 111, -869, -205, -154, -191, -52, -857, -449, -495, 256, 319, -253, -818, -142, 125, 443, -456, -464, 91, -25, 22, -26, -32, -42, 496, 205, -978, 232, 544, -575, 169, -122, -368, -332, -9, 298, -495, 112, -80, -68, 626, -110, -152, 620, -309, -133, 42, 436, -115, -24, 339, -1425, 167, 136, 806, -167, -712, -99, -185, -185, 608, -855, -271, 218, -565, -38, -656, -271, -259, -438, -967, -593, -182, 169, -616, 236, -280, 191, -217, 224, 356, 40, 551, -273, 650, -430, -430, 268, -642, 110, 924, 966, -338, 217, 389, -322, 147, 641, -45, 492, 21, -101, -95, -320, 62, -371, -170, 73, 499, 217, 284, -624, 340, 131, -110, 464, 56, -161, -298, -276, 421, 316, -525, -45, -219, -257, 410, -387, -203, -332, 320, -51, 254, -267, -177, -299, -240, 117, 443, 58, 199, 48, -184, 397, -336, 165, -225, -493, -112, -39, 72, 798, 132, 127, 43, 413, -257, 220, -388, -485, 355, -80, 145, 160, -1, 6, 343, 363, -534]
4041e34Q01N45k75k45l34J02l31M6O64m93K19l04l26N83L72j021P79q53P57m40
4061b88J0Q92j000Q14j236N13M76n44J076p58r6K45j27J48m32J11M7J64%m49l35
4082g69P62O0l90n5P56j075M95N55r0p52P90l01o3O9m42M69q66J043n83P57o00
4103b30L88l06n64J489q21J13L8J0o13N32J24m05j90P70o28N22n53J48J68q8M42
4124C46m49L6L34p75R41J09p76J90m31Q57L13q76L35k36m30j58O02N17n27N25
4144D47l02J94m19J94L43r80K32R54o20n47R93j495P45j63J81jP26j007J223j069
4164c71N39k97O45q48L68J00l29l17J131k9m65m2J76k70k75K09j09j2k18J44J97
4185g3M30n58m7O57k31o00m38Q32j23K85J35M33n21k46K82m8k00K05o25k78Q7
$$ y = [-534, 267, 812, 537, 292, -42, 60, -271, -225, 439, -54, 165, -139, -465, 118, 490, -531, 248, -605, 152, -288, -278, 614, -386, 428, -808, -295, 181, -363, 713, -45, -141, 104, -23, 125, -307, -196, -149, 15, 15, -434, -769, -7, 53, -337, -392, 364, -711, -216, 339, 249, -503, 287, -14, -77, -8, -450, 19, -847, 196, -387, 370, -230, 158, -148, -712, 777, -44, 69, 107, 117, -496, 36, 160, -245, -435, 335, -293, 229, -324, -176, -8, -96, 346, -103, -67, 267, -508, 433, 542, -234, -44, -475, 382, 695, -181, 154, -82, -512, -670, -68, 449, -78, 447, 145, 339, -80, 114, 457, -523, -291, 663, 43, -504, 489, -1006, -261, -424, -243, -244, 482, -525, 698, -371, 168, -129, 516, -332, 36, 136, -193, -510, 621, 592, 127, 85, 261, -9, -284, -75, -184, -196, -414, -270, -73, 357, -201, -248, 409, 178, -422, -860, -28, -151, 134, 269, 702, 181, -65, 217, 169, -31, 174, -451, -729, -642]
4206f42O87j3m62O39j99K34l84K85n16Q79j50k27m24L49o4m14N47k82R9M01J01
4227D44J19o21J60n10L98N92r9o56J02P83j74j65j84l43k65N00J27r32O35j06
4247a95N31o50J37j10P5M30o82L26J47M0n32M70nK20L17m51k51P2n29k27O54R25
4269G12k88m36K15J82o72R10p4n55J00m91K85r1M48n81J87k89O79n63L2J88m13
4290e15l1L80j07j66J300j623K84j43N43K79k97l90Q40q03L95L10n01N17l18K94
4310B48r96Q64k97J9N9J11L1J4m57P15q04Q22j14l38L71LK64j43P3n34Q0M89l72
4333A08K55j101N32q7M12K78p73P38n42J04M89m83l36N86j32K6P73r68m7o21N17
4354b72K86R5j89O99j101o2J266l66j63J27k32O82q68k18M49m92J060m24O81n12
$$ y = [-642, 45, 32, -430, 209, 10, 244, -140, 145, -371, 508, 358, 131, -293, 56, -8, -422, 125, -157, -58, 343, 444, 563, -58, 102, -408, -10, 582, 483, -173, -71, 712, 538, 373, 189, -154, -419, 81, 208, -724, -89, -195, 336, -314, -177, -287, -212, 218, -464, -138, 9, 49, -483, -13, -18, 202, 519, 68, -183, -111, -640, -867, -213, 712, 424, -12, 203, 385, -287, 623, 549, -6, 94, -397, -112, -203, 245, -336, -149, -438, 241, -322, -290, -102, -515, -546, -166, -273, -439, 861, -762, -478, -621, -78, 201, -96, -486, 354, -449, -54, 256, -245, 272, -46, 248, -748, 116, -181, -162, -103, 8, 39, 53, -404, 311, -493, 329, 215, -123, 248, 251, 515, 372, 445, -89, -9, 480, 108, 363, -738, -206, -293, 119, 397, -376, 362, -180, -76, 413, -70, -406, 180, 48, 74, 847, -121, -168, -789, -272, 14, 109, -80, 619, -482, -544, 722, 356, 193, 320, 88, 770, -98, -316, 133, -359, 701, 277, 958, 446]
4374D46m3K77m82L46p69K37j22l2j63N66o2p6J63K95J56j429Q79O37j394M61K57
4395A48j57l94N55m58P13m5l20N43j220R50J4M76r84J86k77N93l81j35J95l79
4415c77O92j91l39m17R48o86M97j91O8N5L27m61kJ0M37l61J50J61p37n85O07p8
4437d73N39n43O02m8mO1k59J020n13J53o37N37j004J464j479K87j37N98P2n75
4457c39K24J40N22O30n90q01l21N01N5r25R40o4P9O86n46l30L03k61m79R60k84
4478A00k60N91j27q58N34k42J16M62N34j299L80n0O85o49j37j11Q83o11N47l01
4498A87l60L5M4L15n53J350j278P3n1L71J10K50l34m79p7N08jm48P02l1k61k7
4520D5k73L04n88J129j62o93K46J11m07m29O99n80R50l96j005J376M88r26R8j10
$$ y = [446, 403, 680, 198, 544, -225, 12, -110, -142, -305, 261, 199, 123, 286, 581, 737, -692, 187, 824, -570, -109, 148, -9, -403, 152, -306, 407, 362, 42, 585, -635, 315, 329, 805, -179, 7, -270, 323, -58, -193, 2, -377, 315, 124, -215, -632, 316, -370, 127, -64, 4, 59, 386, -75, -77, -67, 370, 9, 159, 320, -417, -1002, -395, -473, 66, -477, 125, 77, 73, 134, -125, 895, 382, 535, -102, 435, -569, 895, -584, -297, -434, 164, 236, -339, -115, 25, 547, 1177, 587, -214, -535, -34, 21, -904, 36, -28, 51, 737, 191, -139, 164, -97, -576, 384, 100, -160, 431, 304, -554, -20, -262, -146, 316, 850, -449, -69, -119, 566, -83, -220, -331, 552, -59, 488, 187, -173, -138, -94, 221, -332, 1018, -260, -187, -238, 133, 243, 493, 159, -320, -397, 111, 110, -338, 364, 333, 72, 45, -228, 76, -512, 617, 455, -238, 8, 119, -288, -717, -18, -598, 352, -44, -1049, 327, 815, -111, -13, -123]
4540a23M47o78R68p52l23N77q9j10j03N2Q7k77J047p55O7o8m9l43M19L61n32M62
4562B85P6j072l1P17N77r41l19J152K24m17p28J202q81q2M87j9J70o09m77j5J229
4583E28j47j34m27k69O00j12j92J124r87p83L94o53J468n11k36P53n7l46J73q6
4603A00m97k78J128p89J4Q82n82K91o78N12J44M61r24o7M76j015P92N42m59j46
4623i3L71P7k43J26o64N70q49P67j8R1o1n20J005r61r9O31L54m13l30J30k9J09
4645d9K79p30O46J13m62n2R08p90j71L65K8j36L54m25J64j85M43N04o29l43p13
4666h81L70j40R26jk26o31M68P05r86R29n36k66Q18m84K06o71J90K69j93j43L44
4687F7k54k8k54O79K51q4o61O59k73L16J37q5l27M46M6l27l1p51O61J77j54j06
$$ y = [-123, 324, -354, 614, -138, -461, 116, 27, -83, -186, -134, -47, -324, 723, -32, 35, -33, -82, -425, -6, 355, -177, 285, 361, -711, -742, -25, 552, -389, -708, 444, 668, 251, -477, 725, -156, -238, 249, 230, 400, -209, -686, -701, 528, 381, 247, -180, -449, 151, 39, -153, 971, -16, -799, -405, -1058, 410, -101, -337, 416, 359, 13, 186, 100, -397, -675, 453, -336, -322, 560, -22, 269, -409, 103, 247, 708, -216, -283, 193, -822, -30, 512, 53, -93, 278, 355, 112, 238, -426, 144, -705, 62, 44, 135, 74, -446, 559, -402, -501, 130, 484, 71, -259, -129, -158, -49, 230, -500, 146, 259, -203, -255, 653, -137, -308, 57, 85, -51, 303, -122, 42, -143, 300, 804, 175, -168, -881, -511, -651, 275, 274, 48, -583, -115, 590, -396, 533, -3, -269, 549, 65, 271, -400, -210, 59, -134, -277, 67, -187, -215, -469, 210, 461, 377, -284, 375, 102, 418, 555, 470, 143, 589, 635, 308, 277, -474, 187, 364, 210, 104]
4709A04J1j69N26R6n33J3J84O90m69r57M41O27n78m60P4k64J257j059K77R1K49
4730A51j76Q7k04M52j35l67K59J06j00K82j36j34o6J83k08P01q38R35m89j213
4750i10P20K17j00J68N43q36J85m5J55%J16n07M68m16k4J33O19j120k51K93L01
4771b91k29N92L38r61M8p5R65p76P50q00K88r28J000N89k81J26r90P58k42K01
4791H2k71J44k6L59o3m85L2M6LJ1P37o50N57o08K32j03K28q01Q8N90K12o44P97
4814D67l87n78N08L29n9j94r14K59O99r17J662q96j39L66M12J27q86Q67j065j09
4834d48J259p09q66J180j17m35J258j624L23P72p07k96Q21j609R65N71j09k52
4852b3m35J24P86p83K33K00J53k51k87l33J256p50K75m06M25p26L11n3R47n03
$$ y = [104, 115, -54, 472, 568, 35, 48, 232, 922, 453, -504, -63, 564, -14, -474, -400, -664, 593, -466, -189, -98, 151, -25, 62, -142, 310, 175, -192, 67, 173, 73, 355, 219, 85, 19, 202, -6, 695, -143, 792, 303, -910, -190, 27, -73, 95, 638, -198, -13, -58, 97, 97, 213, -294, 174, -242, -266, -133, 486, -634, -885, -592, -291, -520, 72, 410, -551, -503, -578, 387, -389, 361, -439, -151, -1079, -79, 510, 229, 355, -635, 123, -119, 82, -189, -45, -71, 288, 225, -260, -228, -182, -179, -168, 569, -81, 476, -132, 100, -3, 225, -576, -488, 102, 314, -330, 467, 80, -498, 10, 339, 280, 86, -828, -569, 130, -787, 875, -21, -160, 206, 618, 745, -141, 726, -339, -448, 811, 102, -764, 416, 299, -136, 1122, -502, -179, 593, -114, -410, 411, -1198, -233, 338, 229, -23, -458, -334, 452, -331, -98, 102, 255, 4, -283, -616, 640, -110, 165, -241, 184, -542, -231, -284, 663, 160]
4872A60m38N18n44K33k22L08l63M78K90M58k91o48Q57m45o24n00J242r1n96K17
4892ar4q7N63n07k60k6R1O80J66k9j97K82p79K75l65J010p52L23m20M12j12N66
4914G39l43n8k47K06j39N8j28J94k80k4n50L91K28l22K89p33J096O0p42M34q8
4935D1N36q72J52K65k06P1P85j201M77j85l24N49j44L26n51L83K72j46M04j10
4955E22m23K83m57L06K41j019P76n58J95j19J09l64n2N38M21l57m73K57j72J21
4975b25L00j98K41k23J87o12K84P32o50J92J04p87Q00m20M00M47o09l8rN69j38
4996C47K58q08L40l39p7O12l87M4Q67j144L22j73M6J96K79l2KO0j58j63M18q49
5018c39j39J02j24L92j70R3O61l78n1N60n16O9P07p58k43K53K11o79L47L92k62
$$ y = [160, -278, 240, -304, -71, -293, 15, -348, 130, 420, 878, 587, -61, 796, 351, -273, -773, 469, 378, -218, -1, -95, -182, 381, -126, -386, -412, -321, 359, 525, 496, 299, 581, -198, 77, -288, 722, -30, 293, -127, 285, 173, 739, 396, 338, 91, 297, 158, 216, 88, 282, 2, -22, -572, -181, 47, -275, 14, -719, 377, 437, -305, 129, 41, 577, -295, -143, 122, -84, -13, 772, -429, 48, -137, -461, 88, -56, 270, -281, 102, 374, 228, 632, 522, 99, 382, -75, 231, 472, -547, 229, -329, -134, -253, -144, -508, -560, -22, 399, 42, -431, -174, -346, -225, 75, -123, 118, -105, 82, -530, -246, 486, -164, 28, 132, -655, 145, -275, 125, 572, -37, -75, -84, 485, 347, 605, -203, 137, -202, -279, 333, -54, -10, 857, -287, 35, -138, -92, 104, 383, 351, 353, 413, 255, 92, 510, -339, -478, -376, -500, -108, -278, -185, 476, 98, 47, 607, 91, 160, 867, 109, -134, 119, 330, -349, -2, 390, 128]
5039A28n60P98l77K68r0k82L00M31n30M62K98m74q27j90R85j98J37R0p73j4J152
5060G34l57k31p83N20RM30o71P48k57Q5q63L44m1N72J00o25J051p65J33P7M24
5081F34p18P4m51R8N59m21K54j99M68n25N96o35k0j81P4J465j712L85m0q0j68
5102e43O67n5q0j65n33J024K01r2o31Q0J12k47o6K37L44k2k15j03l37q7J82m65
5124g94O44O57mp11J1K1Q36r33K70k1m26O73l52j1L03N9N9l0p86O38L79r93J37
5147c74O2N7R16j337P35L51j83m43L86r9j32L60k11j00N88m80l52l11r9R19J01
5168C54j13j41j071R62m22P20J05j038P62K90o0J77n74n12P46k70j82J87j75o62
5188i17J363j602J324k07P95j090K52K68o12K22L47o70M82k75K77j77J31q9L27
$$ y = [128, -432, 366, -11, 257, 167, -115, 185, 616, 86, 548, 846, 372, -455, -645, 340, 142, 279, 369, -404, -418, 734, 377, 146, -637, -117, -108, 322, -349, 399, 142, 227, -636, -292, -333, 239, 339, -286, 765, 0, 133, 210, 634, -84, -10, -461, -363, 196, -225, 29, -170, 298, -227, 369, -266, -286, -467, -393, 1072, -640, -255, -295, -375, -543, 124, 69, -11, -176, -709, 315, 516, 424, -207, -127, -15, -262, -328, -91, 253, 231, 16, -87, -424, -511, -329, -794, -150, 507, 503, -208, -197, -176, 660, -273, -3, -24, -450, 223, -129, -140, 163, 222, 281, 251, -535, 103, 482, -511, -374, -312, -255, 661, -676, 59, 410, 227, -216, 170, 71, -61, 299, 88, -12, 576, 96, -256, -567, -666, 253, 354, 241, 100, -971, -9, -431, 289, 394, -644, 118, 408, 348, 525, -49, -561, 185, -85, -267, -80, -255, -917, 446, -1156, 168, -39, 756, -334, -82, 186, -426, -204, 143, -527, -45, -320, -43, -220, -89, -178, 149]
5207A49k7L47j28k5l93K27LN44k19q32M58o2j10o2J18r3J44O00q8l28o12O30k23
5230A8n72R17O4r58P42n99P86k67q44Q81n00q4P49o37K34J54k09l66O57J24j75
5251A15l83M20j53M16K17r31M06N25n89j00N5J20m12J082p96q00O09K93o02N12
5271DM3m9J50j15o62r3O15N28j229M55L93K3J24N58q26O7k94L47L41p18R90p92
5293a40o27O47J091o40l09L83J18r02K05J80O77q00n05K95M91K55l88q38J30M18
5313b59L17r99J402l81k31L43n34N5M34K65j60o32M77rK26o69K73O47p99m54P10
5334B2j82k51P34n29n74M63o3J041o68j75k71O7K51M41o70L70n28N81o3j69K35
5355F2r2P34q53N03o24j2J109j021L35m14l27L59K46J02J2K50k92J11l71M35m3
$$ y = [149, 122, 469, 341, 316, -77, 150, 153, 697, 478, -354, 104, 42, -68, -130, -12, -105, 39, 639, 551, 223, -389, 241, 18, -554, 363, 427, -531, 211, -388, 398, 131, -713, 168, -332, -416, 333, -304, -70, 84, -125, -491, 166, 290, 115, -268, 152, -1, 415, 632, -299, 107, 632, 43, -57, -2, 118, -294, 788, -8, -808, -199, 94, -508, 4, 47, -2, 148, 33, -629, -722, -107, 421, -808, -353, 40, 63, 187, 745, -81, -14, -308, 39, 380, -338, 652, -140, -767, -120, 971, 331, 22, 405, 523, -379, -174, 6, 683, -117, -622, -327, 164, 419, 31, -807, -677, -259, 58, -941, 461, 80, -151, 192, -342, -287, 147, 412, 252, -380, 97, 88, 314, -355, -82, 565, -234, -688, 22, -160, -411, 323, -206, -780, -317, -380, 661, -7, -182, -453, -386, -135, 306, -364, 6, -522, 59, -4, -173, 62, -30, 704, -149, 354, -270, -282, 827, -194, 141, -273, -600, -241, 5, 107, 119, 369, 77, 188, -183, 252, 209]
5376B09n10K78J5Q0o00J051o41J38k45J69j13N10l36P9k50N87k16j18L51n86k22
5397c70M28j19M55n67L85j28k55n82O61j95K76M44k43p27P71P79j690N79j31j93
5417d22M34N42r99O18j89Ko70j49J634j349O53l54N06o2J28n55J162p75N6P2k2
5438B61p18O7O80n81O61o93m75K29L06K62M87m20l01P5J58n4n94P02l84N81n15
5459b66Q7j20l1L87M56j055L14K00M60l75k7k91J89N03n0m93K73m04j30L21J69
5480A17K87n94M37K84J49r06K64n5l22Q4L85M66r3J75p19M38j01r47N89M07l01
5501D4k02n3N15k49K8l04j12L1j84M35M89M48j073j80L25k33q8O71l13l65M53
5522H3O88j052K85J5l94Q67q46P12p4K15p63K79L24p90O47j22L21o94K8L52l95
$$ y = [209, -301, -23, -8, 72, -528, 523, -118, 20, -225, -56, -169, 341, 5, 84, -166, 421, 205, 87, 438, -148, -370, 58, -61, 394, -173, 212, 84, -171, -753, -92, -287, -11, 433, 190, -537, 234, 1013, -677, -98, -229, -422, 12, 554, -445, 173, -16, -14, -684, -833, 801, -548, 105, -249, 257, 195, 323, -232, 930, 155, 211, 283, 261, -457, -390, 290, -291, 370, -323, -798, -569, -263, -1, 486, 66, -235, -160, -2, -56, -650, 52, -332, 249, -266, -179, -299, -330, 57, 513, -542, -228, -28, 432, 57, 30, -261, -72, 431, 381, -112, 161, -243, -373, -52, 117, 404, -190, 247, 531, 680, -226, 38, -17, -339, -255, 130, 596, 503, 678, -41, 397, 296, -651, -62, 345, 44, -158, -211, 304, 55, 83, -221, -333, -302, -486, -51, 438, 886, -187, -367, -42, -275, -363, 308, -5, -370, 83, 771, -281, 4, 19, -375, 492, -354, 358, 284, 499, -264, 15, 339, -451, 196, 74, 395, -299, -271, 81, -314]
5543c14J04L36l4q83J137o53N09m54pK00P39o68M31j13m95j49P72p75l19R04p18
5564d50J077r25j99J084j000j12J219n38k18J77l60k37O54nk58N20l15l49Q5k31
5584c81L4O51m20N88n42L20j3r5k55m25Q66N6n84m30L00P74l89j14L23k59m11
5605d06L61Q3O19r99Q62n95K75m14K41J99O05n66m1n37M07j94m8p5K67j17J05
5626C2M10j45K09j313J189n92N74m04N13q56L03j62K12J78m16n29K02L00n2M33
5646H6o10J55J34K84n8m35J068o82J15Jl91N9l98P87K83j62m96J206r53n80Q17
5667B30J79k86L68q31L99K34q14Q49l03M04j050Q84n02J45p3o15P33j12L92J94
5687D25r38J287l43r3m28r9j04J60j56J168r84k7K89l82L37j12KM96n23M92J40
$$ y = [-314, -210, 126, 92, -791, 346, -307, 202, -252, -259, -59, 680, 12, 443, 330, -165, -314, 458, -317, -636, 268, -450, 627, -298, -497, 587, -413, -525, 694, 156, -62, 115, -245, -482, 172, 167, -91, 429, 114, -235, -150, -381, -347, 304, -116, 472, -70, 250, 237, 142, -113, -538, 328, 384, -200, -630, -330, 444, 55, -59, 264, 5, -406, -45, 38, 657, -342, 520, -75, 200, -214, 27, 226, 831, 265, 224, -313, 94, -100, -148, -223, 44, -73, 32, 442, 297, 506, -807, 382, -210, 364, -40, 473, -383, -80, -242, -30, 148, -268, -797, -595, -295, -347, 86, -524, -369, -235, 49, -9, -444, 624, -58, 57, 58, -333, -274, -672, 115, 398, 236, -260, 946, -7, -587, 230, 409, 123, 491, -340, 59, 293, -521, 328, 25, 429, -621, 263, -239, -94, -167, -782, -49, -161, 231, 425, -513, 774, 431, 338, -90, -189, -293, -133, -289, 879, -105, -132, 157, -225, 112, 0, 2, 498, -25, 467, 607]
5708F07m52J67m65l17K02K16K5J026j370J30N67o26K32Q7j71K70m65J7M19m46
5728c47K23L98L17j025N88j09J09M48r58K06j60L42m64P62o8L71p06J45j17L17
5748B72l68M36L64j410Q17m1k53M67k52N8k45l40Q3K23M73L06j415O30q6j32N01
5769H8j1k54L58l10N8q17J431o30o64J314j76k55j48K31n31L21p9J93K1j0K71
5790D01m05J38J17o39K67k08K81l40O51l99n05J124n14L54l79k88k01P61qp42
5810e34OK77P04o28q8M83n81L12j61m4n5N08j57k49O84l71J70o14P44k21L46p39
5832b08R5M28n31M78q5p83J0O55q05Q27N59o77M69J17j149K90k41N98p56J53J324
5853G68j114O50q11J27K40J132p71PJ74m13p81J35O88N55p81j29L13j42Q3M06
$$ y = [607, 155, 322, -143, -460, -258, -42, -17, 1009, -361, -231, 336, -290, -58, 29, -142, 128, -337, -320, 99, -347, -124, 274, 591, -434, 154, 45, 154, 602, -356, -150, -310, 32, -432, 330, 262, 633, -73, 72, -45, 272, -96, 340, 704, -706, 111, 70, -183, 284, 32, 90, -155, -495, -412, -189, 284, 590, -825, -195, -281, -413, 88, 77, -177, 181, -129, -71, -888, 543, -87, -751, 563, 387, 132, -16, 215, -316, 5, -74, 119, 140, 130, 401, -4, 134, 251, -388, -121, -329, -48, -388, 263, -136, -641, 483, -31, 323, -56, -344, -545, 216, 208, -534, -528, -251, 453, -175, -263, 220, -361, -49, -210, -254, -309, 199, 42, -207, 477, 106, 276, -338, 406, 185, 531, -208, -113, 315, -216, 262, 177, -606, -596, 59, -746, 81, 640, -37, 432, 549, -600, -310, -551, 47, -709, -556, 768, -346, 304, -507, -380, -140, 992, 221, 228, 402, -11, -792, -657, 31, 586, -195, -324, -11, -153, -70, 336]
5873C36n94K37J53k5N43p27P8m68J303j132R79p11r3J98j29k02j97K85L51l55
5893a70L48J04k76J08m29Q96m57l91L63N49m20j20n29N16l18O6M70N8j66QL90
5914F00m84l69l85J294n89lN3K11l00j52O97j046K53P81n52N88q40J41O8k16J64
5935h6J83K83K86l83l66P50r63j8q1n43J537O1Q7q39J28j88N79j041K72J03L93
5956A54j22M5J40j90k22J89n1J34Q4k53m49R54o09L55l77k61N11N93l48k57j49
5977a29j35P23q91N26m29M94j231J259p10jN57m5L25k46J42l02L71K1l50m52R13
5998D10l56J35qJ93o64P3J93jl79N47k59j17j4M22K10l64K89k77m20K5J6Q63o30
6021a13L65l75k30K94L05p01P48o79k87Q26o08L37O15p78M42m86O93k4r51R50
$$ y = [336, -258, -21, 132, 107, 650, -77, 1, -467, 836, -296, 683, -28, -121, 77, -52, -254, -451, -166, 185, -170, 178, 282, 6, 114, -315, 581, 124, -267, 96, 645, 225, 105, -424, 92, -226, -160, 310, 368, 202, 210, 600, 116, -253, -638, 656, 67, 64, 117, 328, 28, -124, 573, -473, -220, 561, 9, 597, -243, -102, -34, -250, -86, 97, 380, 666, 283, -83, 667, -296, -314, -395, -938, 599, 660, 747, -92, 36, -152, 427, -614, -342, -239, 154, 32, 77, 217, 27, -195, -6, -57, 77, 161, -92, -541, 413, -196, 159, -218, -479, 32, 625, 277, 20, -129, -264, 459, -432, 94, -335, 159, -1072, 187, -523, -524, 33, -12, 313, 67, 209, -93, 278, 299, -51, -503, 410, 54, 189, 181, 374, -290, -217, -24, -25, -404, 143, -116, -233, -247, 175, 385, 21, 310, 33, -387, -362, -346, 517, -113, 252, -123, -353, -59, 246, -455, 293, -386, -673, 153, -455, -118, 497, -281, 161, -325, 368, 344, -607, 343]
6041C43K56j263m0J266l36l27m3L3l50O86m27M04o99o2O15l9m34P00j58j57j02
6062a34J08l03O21k93p42M81r1K83K24o17M1J54k46N95R5k40M24l6q60n3R38l13
6084C6L52l92n99N54m85J77O55J29j899K017J06o72j52N22o35M94l20P6M14j77
6104B01o39N97m26O85N26r49J44l28N8M36l73K00M59q23J049o42o4J64o27M91
6124A39l95K58j09Q9O22r76J038j58m89j15K15k01L08l37N12n84q6k23L18Q29
6144F55n29m0M9J59j007J217q93L72m73L67O7L15j21Kk51j84J87k51O14j84k44
6165a73J86q3M75j0q9n39O11o86K21p6k09L32M46j023M02J72M06M94n26o44O92
6186C79n31N48p91j42M28l5q39R22n1m48J61N02j58M3m03L94n88P87j78k88l23
$$ y = [343, 599, -664, -704, 562, 226, -101, -144, -111, -461, 225, -202, 202, -497, -559, 56, 17, -417, 283, 125, -32, -134, -26, -329, 292, -1, -743, -262, -353, -70, 154, -463, -422, -268, -514, 81, 176, -64, 360, 324, -536, -589, 349, 36, 388, -4, -603, -49, -534, -357, 298, 427, -1472, 545, 651, -21, -173, 349, -286, 208, -112, -36, 378, 201, -438, 159, -267, 418, 944, -5, 139, -189, -131, 305, -68, 132, 591, -232, 817, 175, 111, 275, -352, 139, -256, 2, -107, -18, 604, -372, 666, 508, 19, -96, 119, -82, 226, -111, 401, -183, -269, -492, -174, 655, 126, 86, 135, 294, -713, 504, -389, -17, -490, -123, -56, 259, 138, 140, -111, -295, -108, -359, 255, 71, -173, 13, -70, 405, 395, 306, -233, 378, -308, -87, -163, -372, -40, 406, -617, -215, -43, 363, 857, 331, -313, 379, -152, 396, -395, -537, -109, -144, -983, -61, -112, -560, -399, 103, -55, -12, -415, -21, -609, 178, 0, -288, -611]
6207f11M69L4R4k03M50N83j534J348n26R9j38J52M73p88k46J067j002O43j310
6226i46P53M12m15J07L23m73O8L11M0k37O59m99KL33j70l33m42R14k35J94l80
6247a4L87q91M41o1K36l24J47M05l35j55K82j78M02n16l01J05r8J264n10n68j6
6268b98j1M72m0M3r9n60J233j114l53M99K49j62k76K6R4M29j97k57kJ120o15j007
6290h26J086J22n06m01l36J171k13l87N4k98L33L4K35k79k90R08j76L41l29q03
6310e60Q7J53K73O71n80J24j84r8J324j510J184p61J75m60l50M30R83j581Q06
6329A26l6k12M4k13K52j15j81l34R15o35L92k31k96K12L78m20O84j116J326o05
6349f5P5K9j50L57o08M20l23M47l09L35o25J292p9l48o40O94l32k34M1j20J70
$$ y = [-611, -142, -108, -14, -217, 233, 816, -718, 630, 104, 203, 65, 217, 690, -98, -344, 723, -279, 364, -946, -193, 219, -196, -89, 234, -239, -171, 140, 180, -57, 602, 103, 105, 438, 268, -65, -507, 407, 172, 366, -14, 373, -518, -77, -138, 98, -226, -79, 326, -9, -164, 118, -60, 342, -174, -475, -370, -468, 796, 286, -282, -298, -309, 163, 123, 166, 67, -493, 740, -374, -727, -228, 21, -141, -417, -391, -297, 132, -65, -322, -324, 796, 181, -826, 260, 382, -124, -525, -861, 310, 97, -290, -236, -534, -201, -167, 68, -211, -501, 407, 231, 572, 243, -560, -473, -320, -47, 624, 44, 168, -16, -114, 1210, -300, 884, 123, 298, -162, -512, -82, 901, -680, 126, 90, -122, -78, -291, -39, -154, -335, -669, 246, -389, 3, -228, -524, -312, 66, -354, 330, -786, 540, -65, 10, 39, -111, 246, -362, 58, -265, 182, -127, 208, -417, 875, 796, 448, -192, 502, 170, -64, -23, -143, 27]
6370B7o44Q46l80j34P82m8o68M76K32K19l51m27N91k87j45k6K74n31P32k65J21
6391C94k43J93m42Q02j036K09m5M69M44j059R53n72q7Rj36p4O16j036P23l68l43
6412f29L52o9q5q9M70M25q63j58J227r04L77q61R32j74K52M79r92L91N24N66j359
6433a88k63k10Q39j78l53N09n22K01P07j394J203j06n75J71K21k55K33K10L29
6452E79p74L55l69P18J12j323N55n9O27q65L83L86k15M27o46q4L17K53r31O44
6472I0l78j15P67q35K92J47j67M05k32K33p2p29N87n67M19L27N0l54K07k67m4
6493b36K56L92j89P47o03l23N11n16N6K17M9l92Q36j314J216n78p8l1m16M0L60
6514DP05r91J23n81O00K13K17l75n01J306p43J9j02N27m44n34M57L80m56K63O2
$$ y = [27, -617, 229, -151, -285, 497, 449, -219, 257, 489, 708, 357, -70, 521, 234, 89, 63, 337, -194, 538, 273, 394, 151, 344, -98, 704, -332, -123, -168, 301, 745, -314, 639, 67, -20, -11, -147, -221, 395, -641, 82, -286, -629, -277, -346, -431, -520, -50, 375, -488, -646, 581, -323, 54, -807, 125, -49, 203, 682, -310, 81, 605, 1171, -188, -451, -661, 178, 0, -353, 156, -366, -165, 542, -852, 351, 245, -330, -159, 62, -193, 40, 250, 579, -195, 160, -209, 509, 621, -702, -147, -206, 421, -444, -61, 325, 110, 537, -109, -193, 124, 377, -554, 90, -288, -403, 364, -471, -179, -32, -199, 206, -26, 207, 135, -594, -7, -574, -155, 172, 222, -132, 75, -192, -236, 20, 412, 223, 970, 367, 44, 555, 39, 95, 312, 361, -31, 805, -509, 707, 129, 51, 20, -396, -356, 4, 709, -282, -159, -740, -140, 73, 290, -85, -586, 720, -23, -4, -106, 421, -23, -557, -100, 280, -176, 87, 149]
6535A49M50j072R5P23r8M84m53l7k27j20J74m45N74L48O1l89Oq45O32K27j63K89
6557C63J54l85J29l92K27L10r81k15J516k49j180J013o55P22o30M42k32M51m61
6576e3K51m03Q2L44k5n53K88L09m1l33L11L07L74q87j47Mk60R53m08l42m36M98
6598a67k03J70j55M80L74o14N68p87R90l88q32N39O24j096K05L00l17J64l47M79
6618a3k65k19P96k49l10L81n2K59l58j26N04l31J61o97R25n14O65k97k16k43K43
6639D4l14M62p02O83q03L26l75M09o8l53P72k8N8n92Q15l70r14N25O22L69m99
6660F7M65o13L56k46p82J386q80k70M33L59j321P23M25n30J137j005M28Q7j10
6679A09j47n21J019r5L06m11m42M87L31j00l97k73j12K63n11R15p65o2K79L86
$$ y = [149, 599, -473, -378, 345, 247, 731, 278, 241, 14, -106, 68, -377, 197, 545, 606, 217, 223, -622, 10, 237, 74, 363, 517, 132, 261, -131, 96, 406, -575, -790, 726, 477, -703, 310, -345, 377, -253, 189, -43, 408, -53, 198, -205, -123, 221, 196, -357, -69, 240, 199, -134, 177, 484, 858, -29, -176, -172, -432, 521, 113, -229, -665, -167, -370, -200, -355, 125, 499, -115, 453, -334, 656, 268, -564, -25, 599, -497, -292, 8, -309, -145, -492, -13, -278, -497, 299, 50, -260, 121, 69, 328, -30, -156, 348, 17, 178, -519, 406, -108, 557, 260, 44, -199, 44, -270, 192, -510, 173, -630, -304, -679, -270, -338, -691, 81, 53, 111, -481, 334, -36, -950, -425, 197, 566, 67, 532, -81, 275, 29, -753, 633, -247, -517, -84, 275, -1046, -323, 102, -428, 709, -296, 132, 219, 109, -38, -559, 460, 365, 671, 260, -182, 305, 636, 536, 139, -134, -246, 17, -494, 421, -344, -406, -127, 259]
6699B59k08m91Q82k49L03m69k95k23N32M1Ok18L33J7l22m20K82R0p81J267o17
6720b81j83M73L78k7o8o20N54J84j74M15r14N89K1l66l06k07Q63j255N68j38L65
6741a29j95P87k13QL40p6o24r5L67m25Q27m04r77K71M21K17j80j94L08M39J63
6762F36q85O39k71n56L41k48j24O23j97m7L41p07P89n88M03l86k60J95j77J59
6782c20k86J279j370J004J45l57m20r9K41R20n24j89L17J13O6k98q14J103p16
6801b05n25J085j202k2J443k02n52J64m65K54q2J242m48l84Kk50J4R63n71l34
6821g5k52l44O00N66m60J88J98k09m38N31l06K0j52J2N86p2m16nK95J97m35nj41
6844a17L18P67j109K76o05R87J68p05P66j202M49O73q88M65L01q08J3N90n23k51
$$ y = [259, 51, -440, 442, 193, 496, 27, -268, -491, 41, 82, 88, -130, 203, 220, -102, -522, -240, -150, -931, 336, -281, -464, 9, 387, 360, 292, -328, 226, 410, 236, 651, -263, 326, 347, -19, -325, -532, 331, -924, -356, -494, -129, -324, 463, 250, 258, 598, 522, -102, -197, 170, -255, 572, 168, -809, -538, -117, 100, -80, -274, 34, 473, 636, -249, 390, 119, -437, -96, -344, -468, 155, -42, -89, 252, -455, 334, -254, 149, -237, -497, -302, -479, -320, -606, 673, -697, 307, 452, 95, -325, -424, -183, 737, 213, 24, 341, 454, 520, 222, -592, 511, -205, -730, 355, -847, -869, 574, 372, -180, -16, -481, -227, -309, 933, 485, 101, 103, -147, -133, 830, 259, -75, -327, -671, -71, 495, 35, 223, 421, 212, -226, 305, -1, 19, -133, -121, 465, 393, -23, -28, 267, 464, 29, 24, -117, 201, 968, -141, 135, -470, 517, 685, -20, 746, -456, -7, 666, -222, 243, 544, -264, -251, 339, -184, -435]
6864d35M90J87L64k36l43m11p1J189n06m4r74K4P83J34j33m9n72N78j1j85J151
6885I30j024M99K25q56M32m50M59m8k2n52M22J84j128N32O66k96n9J59n18l04
6905g49J033n55L12K5K56j032O81o03J008q03L30l3K86N57p36J00L10r90N9Q10
6925B66M10p74K37n11P6j2Q7j57J044k43l76l31k58P37j42L52k87L2m15P3N81
6946C89J66q23M35N06r60P12J58K21n99m96O50j71K49m87M67n94K23N05k08k93
6966E0j90L44R9m79m56P61r51%O16k58m6l06Q99K75r26J49M33M14L4j598J250
6987A14p54O08K31l56P09p65K99l63L62J16J48m13K13l51l5K21o00P53m17J49
7007a31k04K57q7K30KN32k60j56m33N42N30o97K45r6m26M09m24k06O22K14l43
$$ y = [-435, 55, 242, 606, 370, 27, -384, -455, 734, 228, 184, -790, -766, 17, 151, 18, -31, -603, -25, -36, -221, 930, -94, 405, 630, -226, 206, -244, 215, 167, 145, -407, 15, 199, -929, -397, 269, -27, -86, 73, -445, -749, 284, -271, 41, 66, 322, -710, -29, -632, 376, -427, -97, -130, 156, 713, -23, 77, 387, -603, -544, 266, 676, -98, 139, -372, -296, -308, -221, -378, 666, 423, 47, -284, -542, 195, 53, 405, 118, 150, -265, -192, 389, 555, -268, 167, 673, -287, 425, 583, 804, 205, -291, 359, 188, 437, -50, 417, -177, 46, 551, 343, 50, -140, 204, 303, -176, -632, 129, -822, -822, -206, -464, -510, -816, 83, 358, -568, -419, 14, 428, 462, -1136, 114, -640, -32, 199, -157, 552, -213, 86, -277, 85, 201, 349, -64, 149, -202, -237, -16, -616, 137, -280, -131, -335, -78, -165, 65, 67, 599, 339, 183, -250, 292, 822, 125, 370, 274, -152, 257, -167, -373, 249, 463, 120]
7028A20j82O64J62j206N91M88r09J45n7j22O00o49N31Q6m61m04Q30j93K81o65
7048c50P19j04k93N1J02j16O2Q70j103K21j19K35k80M12l71J06K1l69Q39j20p91
7069c78R3J75l86O40J74j67l46J97J20k19J83k64O62k34j59m21K22j52N94o65
7089c31J172o46m35M12p31J134o47N19J52L27j143j44P14j55M7M60m63L42q68
7108b84J91j41J07oM2J88J00j99j07n8r2P70j84m01M73q47J68J053r38N83M15
7129H33o87M66m28q63J019m11j30J98P69j9J65o69J69p77P28j91l86J83K60p96
7149e67L57L85k50p2J42m4j51N7K17j90k71P04k7R3q56Q34j46K53l27j91J6K03
7171A69L10q46L51L03Q9l81P64r85M73m10P82n75O42n69l79J64p78R48O6k28P4
$$ y = [120, -62, 602, 764, -442, 149, 637, -272, -127, -184, -306, 294, -355, 176, 262, -199, -603, 227, 34, 315, -350, 369, 265, -28, 23, 125, 9, 71, 941, -162, 59, -60, 175, -105, 307, -64, 42, 63, -306, 533, 413, -378, -285, -110, -496, 144, 318, 151, -195, 2, 122, -97, 86, -178, 484, 250, 91, -330, -108, -260, 334, -331, 841, 195, -240, 172, -559, 575, -72, 447, 599, 926, -217, -361, 353, 198, 245, 705, 242, 584, -284, -93, -234, -127, -133, -91, 97, 197, -2, -109, -167, -259, 511, 327, -74, 399, -448, -280, 773, -165, 418, 833, 146, 612, 184, -679, 340, -71, -201, -3, 766, 747, 912, 243, 412, -365, 363, 172, -214, -31, 229, -567, -210, 175, -75, -147, -5, -49, -200, -143, 74, -116, -387, 317, 290, 383, -473, 361, 215, 468, 141, -50, -34, 169, 479, -367, -16, 287, 376, -5, 759, -226, 247, -163, 619, 44, 686, 117, -262, -98, -876, 72, 138, -90, -16]
7192a6O99m05r14R34p47N12N33o73J44m29J95l5O7O75j490P70Q28O2n43n37K95
7213g5J56m52K86O04o95o1R2q8P34j041Q08L45o6n53K72k18k41K45o28L56R95
7234G75p92n24P86J2O5p37O34m36L49j41n21O75l47l2j62K26k84J051p29M1J380
7255A289j206N32m51j70N09p15mO80j75L12q28O98r07M03j37M88o93J13P66n91
7275h7j12k95K52J27J33n8j20M62l87P5M02J59n80j33O26l49l92L41r2O43o91
7296g6p50J693j007k56O93j99N21n42L24o96P0K21M92k91k93O36p39l72M53M3
7316g5n4K61k42M7K16m77N39n18K41j67M82l42l2O11n66K25M07L3k84j327J224
7337B02m59L3J27j08k57J50N57q33J282p27k3j63j82K90LR26j248K26K76j87L52
$$ y = [-16, 683, 278, -636, 298, -449, 63, 596, -77, 67, -362, -167, -202, -135, 540, -950, -180, 648, 710, 167, -370, -75, 81, -371, -85, 519, -176, -237, -145, -233, 501, -540, 268, 613, 547, -6, 266, 48, -193, 52, -576, -220, 775, -17, -541, 245, 257, 322, -415, 219, -217, 132, -9, -530, 145, -202, -234, -396, -170, -454, 597, -132, -91, 1289, 83, 615, 164, -6, 503, -212, -216, 464, 289, 601, -227, 471, -436, -33, -170, 318, -375, -262, 504, -87, -199, -494, -242, -115, 18, -40, -160, 302, -85, -10, 392, 551, -29, -162, 464, 115, -277, 64, -28, 615, -76, -826, 867, -140, -396, 297, 98, 619, 77, 401, -295, -225, -4, 488, 197, -96, 540, -199, -571, -118, -75, -129, 132, -110, -63, 153, -324, 215, -303, -62, -229, 253, -89, -121, 490, -76, 149, 556, 589, 305, -1022, 202, -257, -224, -97, -205, -462, -312, 245, -588, 694, -33, -56, -219, -401, -111, -108, 818, -430, -204, 72, -115, 237]
7358B37m63j41P62j83R2m80N64m32l71J85R88l39R7op92k19J071m09n32M1P57
7379D27n65Q54n94OR67r86j00N43m78J36N71p93K58k02j084J880o92J91o34L09
7399A4J91m63L4Q50n95J31Po35L73k84P09k97k22k10P37l20m26J118j434P48O22
7420F48n97N46m74Q4m60K89j58K2P07K30o60l07r9k53J121r41J45K05k38k20J110
7441G00r91rK92p56J219K73k31q22R86l72J33p23n80J179p17L30M34o27N50m81
7461b13K10k42k86J45R80J12k4r29M15N49q40P20l01o72L95M68m36Q4p6J1n2K34
7483B52k92J24L57p03J74N58Ok91P5q15O0O77J49p80Q0K19l98J57J22P36j90n85
7505c08P66o38M46j01o25J53o60R64M81k9j079O90R32p59p43N07o15M02N29j009
$$ y = [237, -226, -367, 395, 212, 304, -176, 388, -44, -415, -230, 758, 419, 516, 510, -282, -501, 570, 161, -371, -330, 427, -138, 716, 122, 128, 1095, 109, 9, 552, 74, 210, 781, -12, 246, 44, -1040, 840, 148, 339, -295, 14, 205, -258, -224, 626, 31, 162, 169, -466, -93, -377, 332, 35, -187, -397, 340, 20, -406, 712, -722, 26, 648, 51, 597, 123, 207, -253, 36, -122, -100, 607, 837, 177, -130, -229, -482, 639, -302, -157, 48, -190, -410, 700, -291, -300, -8, -764, 455, 728, 497, -325, 661, 289, 422, -301, -881, 298, -419, -89, 345, -282, 268, -213, -3, -245, -531, -386, 594, 706, 682, -247, 168, 717, -123, 597, 296, -376, 19, 487, 51, 135, 59, 70, 18, 252, -40, 84, 441, -262, -88, 470, 476, 185, 260, -555, -495, 182, 331, -449, -369, -150, -548, -391, -269, 467, 277, -308, 458, -180, 266, 165, -460, -307, -967, -3, 478, 449, -630, 60, 992, 233, -510, -3, -618, -216, 313, -696]
7525f96J084l12J09q41J133n64m5l00M42l06L26k52n01N56P41q79m81P55o1l33
7545d25Q7M3K78K20R2Q0k63J41j95j99P10k99K64k72n03J32K75l50m10P48N75
7566G29p78j74J0n71O87O14Q3n37p39M94O3K67M46o13n3L04r30P65K17l10N88
7587E62j029M61L42L18j249M81N9k70O84N8l72O87n05R5k87K83j91m07Q93J13
7607G26r12k30R33n37o31K58M24j99O62j496L29K38L05N44K6m84l13K53J97o31
7627e38O72l14MP94j236J327k86m20j11O4j09M92K74j28p27R65R1q31QO28K0p27
7649h8M37M70j124k68O41M3o8n20J222q13n61M55m28K34m8R99q56P88j213P29
7669C1n41L54j89L09J66O3K98k73J181q32q5n44N30n40J11L32q02L67M77j156
$$ y = [-696, 388, 76, 185, -656, 477, -87, -132, -432, 10, -296, 30, -222, -723, -167, 574, -305, -786, -31, -92, -425, -338, -295, -17, 203, 295, 375, 112, 253, 58, -141, 569, 270, 534, 262, -241, -109, 166, -184, -594, 154, 729, -49, -223, -213, -784, -97, 517, 600, 63, -676, -182, -119, 148, 594, -19, -72, 232, -698, 67, 284, -26, 562, -467, -6, 336, 654, -595, -114, -55, -325, 359, 417, 45, 732, 227, 322, 35, 318, 127, -280, 613, 726, -186, -416, 517, -20, -651, -393, 31, -168, 494, -1002, -673, -435, -130, 414, 440, -44, -357, -104, 93, -538, 134, -180, -176, 618, -618, 709, 423, 3, -108, -44, -153, 339, 613, 485, -242, 723, 814, -17, -9, 619, 639, -88, 349, 819, -305, -573, 68, 111, 43, -477, 745, -68, -629, -174, -602, -368, -416, 583, -273, 515, -698, 31, -510, -156, -345, -36, 130, 193, 491, 218, 1399, 567, 482, -62, 468, -72, 39, 371, -431, -64, 413, -743]
7689g43J318p44R6Q70j40q35O02j63P5j052J242K48J14j281M53o85N0O34L22q54
7709d73J217j252L99K97m41K62m64P60p60l6P54L65m52j25m48J09K55L75m32l77
7729d67J14J31P1L63j28J7q41O40O1m17P7K77N00q80K92N54qp71k08J316j256
7750e63P2K83L55n54L84K75l44L16j73L52j63k88P5k37L35j39n76N57J98J01O85
7771I51n76j53L20q03O55p24M85Q18q56n94J325p91M78o12O6Q6o86Q22l6j37L93
7792D31j002j6O24o8k21K39k53J038n58m51K87q2K98J86j19k01L91M91j090Q6
7812A0R8k92N90p65M44o48K00M88m73L2L89j058R34J55m99P41k98J089j197m31
7832d91N10J98q70O89o8j16j11j82j02N76j31M44n86l08J008r68J028q0o78Q24
$$ y = [-743, 575, -169, -73, 797, 657, -178, 424, 261, 336, -716, 526, 774, 888, -393, 60, -625, -575, 59, 381, -473, 744, -508, -109, 188, -253, 9, -455, 305, -455, -491, 263, 628, 176, 51, -397, -288, -33, 342, -90, -467, -353, -222, -151, 212, 84, 101, -740, -100, -39, -456, -379, -102, 398, -482, -190, 364, 356, -415, -623, 693, -563, -491, -208, 147, -407, -23, 252, -92, 224, 51, 403, 240, -48, 27, -210, 125, -14, -590, -33, 165, 266, 951, 375, 222, 542, -261, 394, -330, 155, 973, 117, -477, 848, 57, 535, -77, -11, 75, -611, 211, 175, 38, 431, -571, -587, 37, -31, -252, -13, -266, 772, 214, -237, 50, -32, 266, 452, 333, 132, 523, 1014, -76, 10, 108, -184, 406, -359, 85, -563, -363, 125, -348, -316, 73, -985, -51, 104, -395, 346, 48, 1137, -60, -491, 19, 217, -653, 36, -32, -148, -259, -441, -543, 33, -98, 346, -240, -548, 460, -508, 520, 440, -238, 586]
7852E86n59L23k62j53l83Q41l75j9k57n80N57M59J44l60J44Lk23K84K31j82P1
7873B90o28O10n45O31k15q7K61l98q1K32p33J531m50M24j693J193J68j08m95P64
7893F71r15K41m89P97j00K63j122M85O28k41l45m81L46N02K87p44J00O0l02m84
7913h43J281j40n61O92j03j300J198J39k68j19k61n82P14l7J68m64L83R01q89
7932i1J2m67P84q59J035n05j83Q6M5k26K23J94r9J05l59L09k69l5P41m56l40L05
7954e0Q09k40o48L81m46N6O11M8J91l85K76m76j1jj44L87l33j29K81j21J05P7
7976B38m24l19L81k43N98m89m0O5M0O77q46O4J16l77R73m90N02j040N75J187k142
7997i94J309o0k10M5k53J71R7L2J87l0o08J99K98j90R63r84J47M25r00M29p9m3
$$ y = [586, 27, 350, 88, -65, -448, 393, 18, -1, -258, -838, -281, 178, 322, -38, 106, 109, -114, 170, 401, 219, 290, -338, 272, -273, 358, 143, 56, 317, -81, -162, 70, -663, 868, 418, 842, -851, 342, 510, 402, -93, 671, -244, -3, -492, 305, 205, 468, -654, -169, 459, 218, -127, -608, -262, 240, 527, -217, -117, -57, -359, -843, 438, 298, -263, 429, 326, -974, 224, 363, 95, -24, -285, -867, -153, -190, -22, -486, -103, 798, -91, -79, -546, 238, -621, 414, -91, -274, -188, -143, -369, -146, 48, -51, 54, -305, 4, -265, -300, 441, -15, -355, -50, 759, 519, -129, 252, -194, -138, 473, 521, 712, 327, 603, 127, 116, 115, -29, 358, 25, -104, 177, 56, 161, 238, -186, -505, -124, -367, 231, -258, -298, -233, -193, 484, -362, -298, -182, -559, 414, -76, 426, -614, -39, 1148, -994, 315, 255, 45, 90, -163, 8, 105, 137, 324, 294, -314, -115, 183, -7, 956, -28, 119, 544, -356, 73, -6, -49]
8019d9K57j41K99j54q80J85L90k35M49J13m32R5k5m62P23M26K05q89j00O32m52
8040d5L09n25N14j03K57m86P56j358L84k94N8N5J295n11o49m03J188p9n73M38
8060B28n41N38l88K59J63l30O48r37O11m97N00l78n72L73M05l16K91j039O23N67
8080B08l23M37p0J21K06n46l76N56k01j15M5L04j9KJ57n9m9m65k67R40j39n78
8102b31K22P98j167L49K79K52q5j022O13K19N22l12l2j822J429L56l88l90N62
8121A52l2n82O86k73o02L12L02O33j247Q99M65r10K46N06n93k15j12K54O61j274
8141g24R96m04R6o07R48p5n85O98o9n06O78k69j17j82L33j82N9n28K41N46j044
8162f97J272n18O9l65K48L07L9q7l13qk07O93K99n49K2j457J895m85n49O06l31
$$ y = [-49, 208, 67, 366, 212, -668, -483, -93, -328, 121, 234, -198, -103, -128, -590, 133, 559, 764, -125, -225, 407, -45, 264, -261, 253, 150, 407, -79, 677, -681, -297, -591, -533, -478, 817, 306, -343, -746, 442, 363, -210, 228, -313, 225, -163, 96, 259, -71, 577, -360, 251, -246, 254, -124, -696, -323, 82, -234, 57, -982, -359, 208, -115, 322, 252, 373, 579, 33, -343, 213, 12, -103, -58, 246, 227, 229, 386, 327, 278, -187, -454, 486, 347, -231, -9, 789, -378, -29, 250, 502, 417, -605, 8, 227, 749, 437, 405, -1417, 12, 368, -20, -410, 152, 120, -462, 224, -49, -651, -339, -37, 596, -651, 248, 713, -197, 49, 555, -38, -253, -365, -111, 550, -724, 272, -132, -36, -643, 305, 230, -355, 343, 274, -232, 446, 177, 60, -122, 211, 29, 88, -440, -199, 347, -697, 575, 57, 126, -239, 9, 316, 355, 268, -45, -53, -260, 433, 732, 183, 205, -1252, 643, 158, -391, 215, -116]
8183a16j45J078o9l77p56L37N21n29
$$ y = [-116, -261, 817, 748, 371, -385, -48, 473, -56]
8191e6
$$ Imaginary data points
##PAGE= N=2
##DATA TABLE= (X++(I..I)), XYDATA
0@%%%%%%%%%%%%%%O4j28J28j28J28j92K56k57L21l85M49n18N83p05Q32r61J090
31E77j220J407j600J797k047K301k573K881l224L594l991M432m920N440o012O642
47C484p323Q071q896R802j0800J1904j3125J4489j6024J7757j9744K2035k4704
60a3074K7891l1755L6542m2673N0848o2361P9920j10269J77397o27271L78333
71a36472P04275q92875K0758N80150q8854m32445L02417J27461k17135j1822J63505
82A18963j37717l3990R3404j1291p6270O1049K353k1250n544k499n682K9814m5491
95c4151J843P1837j9764p0513P8388K7768r7015J7776Q6380p1133m1549P9156
107B9023j5535n8497O7621J3145p1589M4222M5113q9443l109Q8360m8002o4581
$$ y = [0, 0, 0, 0, 0, 0, 0, 0, 0, 0, 0, 0, 0, 0, 0, 64, -64, 64, -64, 64, -128, 128, -129, 192, -193, 256, -262, 321, -384, 448, -513, 577, -643, 764, -836, 961, -1086, 1215, -1358, 1523, -1701, 1893, -2098, 2334, -2586, 2854, -3158, 3484, -3839, 4232, -4664, 5138, -5662, 6242, -6883, 7606, -8418, 9339, -10405, 11630, -13074, 14817, -16938, 19604, -23069, 27779, -34582, 45338, -64931, 112466, -514805, -136472, 567803, -325072, -304314, 275836, 186982, -245463, 56954, 184415, -32720, -44542, 118963, -18754, -52744, 40660, 29369, -46901, 14148, 16501, -4749, -10293, -12792, -18474, 11340, -34151, -32308, 39529, 19765, -50748, 27640, 55408, -41607, -23831, 62549, -8584, -50133, 29023, 13488, -45009, 22612, 35757, -35832, 8390, 53503, -35940, -39049, 49311, 1309, -63272]
119f3272P7169K5274p3812J8341N2641l6842j7013L5440r703j9111J8594n251
131B455j3464J7014O31j5032J1835r76j5631J2417K348k0045J7377J7536k8342
144a1877K528L5692k0016k4569L6403O551l9519P664K5621k4944j2316K5002o266
157d6j2576J6399k345j5103J5486P614k0543P740J9422j6873q757K0702m369j4078
171g327J1681M212j4372L868P325j1341j494J2077m800p023J1083N72r243M740
185d2K727n297K813L911o791J571O947p620j266R200l291o479N590J316p540J757
201b494M638l699K14L223m184O90N417n643k112O726j432n885N547M153o726J665
217I8N493m594k018N888m640n958N888J706q993L209P633n724k247P118p59m656
$$ y = [-63272, 13897, 39171, -34641, -16300, 36341, -501, -17514, 17926, 8223, -10888, 7706, 2455, -11009, 6005, 6636, -8396, 3439, 2463, -13168, -751, 1597, -18448, -1071, 16465, -11877, -9349, 26343, 6327, -18242, 18161, 24712, -14807, -7143, 18478, -6466, -18782, 6220, -46, -12622, 3777, 1432, -13671, 1815, 9429, -11114, -3374, 16048, -825, -9582, 11120, 6751, -7327, 4354, 8566, -5806, -1938, 5387, -5954, -7448, 4629, -171, -7194, 3889, 4461, -4782, -42, 2685, -2612, 201, 4112, -2679, -1108, 5839, -1781, -3047, 6153, 2862, -3617, 1973, 3289, -4251, -2494, 2144, -1555, -1341, 1882, -2302, -1612, 3805, -1838, -3950, 2776, 1344, -4541, 1006, 5159, -1567, 98, 5591, 997, -1021, 4867, 227, -5731, 157, 1863, -7130, -3921, 3712, -2012, -4259, 2859, 2100, -2556]
233b556M000K406l633l24K127j955r40L070j192j240R6K59j300p74Q5O54P37j548
251b028J018L731j939j913L998J213m145j14L645l372l050L227l76k983J409L324
267A645l037m85L560j435k221K412J008k948J384J978k342k86J708L62j066L81
283F18J281k383o90J162o09j411O86O61q4K16J401N85j329r07J549p45j767K218
301D52P82j415j0K562q87k502J202J455k709j649K860o57k351J779J409q25rJ858
319A345k41o39M63O45j247r07N35r8l61k2L68P04j017J46l29M31K99j300P25k8
339e28N05n5j8J595Q23k072P64L00k90j691N15k29j382J370R85r70p02J084M76
358D80j863R63J616j896m09J897j89j48K56O97n89j000J086j050n1O2J62k94m65
$$ y = [-2556, 1444, 3850, 217, -107, 2020, 65, -875, 2195, 1003, -237, -141, 118, -1182, -1956, -1871, -1217, -480, -2028, -1010, 2721, 782, -1131, 2867, 4080, -65, -179, 3466, 94, -2956, 271, -105, -3088, -1679, 1645, -1392, -1877, 1683, 248, -1973, 439, 1447, -1501, -117, 1861, -481, -767, 941, 1303, 237, 618, 1899, -484, -1174, -12, -621, -2032, -1346, -685, -769, -553, 848, 1433, 104, -803, 746, 1, -1766, 452, 1234, -181, -191, 2371, 1484, -1018, 184, 1639, -1070, -2719, 141, -516, -2867, -1088, 321, -504, -513, 1345, 1104, 465, 928, 1573, 326, -581, -46, -144, -505, -527, -159, 545, -472, -326, -655, -224, 75, -1225, -500, -528, -23, -78, -96, 1499, 2322, 250, 1014, 1314, 1024, -667, -152, -381, -1763, -393, 592, -378, -1080, 4, 480, -1383, -420, 1196, -700, -1109, 788, 599, 451, 707, 1404, 815, -185, 901, -149, -200, -138, 24, -270, -735]
377g35J99j61P20M9o03L16j13J13K40K12j13L83J24K94k82L01n09m11o54M26p13
398i17M7M21m1J86K13r2j452K764j258p56P71J233j697O79Q51r01l36J129l55
417D89l43n71M52r33N29l73P23q6J4J02ql31J97k72K05M77k82L67P3k45J50l05
439B9m03n97O78J26p55R35m0l18N17K95p71N14O49j080K43P41m79k90l19P04j137
460g58J130m00l51k37N44L92j368O69P47q5n07R63l50p71N87P20j014O43O4k67
480C51p38k25N0L86J89j61L4P37r16N7N86r4q16J03P60L45k26n92K62L38K88l20
502C98p72M44j3j28r0j80P37r52L06n60J019K2j44q81R20N72n89j48N9N3k24K13
524F2M93p71J93J22k32r58M84Q11l18Q17j53j150L75o2M41m7k30J82n71k43Q57
$$ y = [-735, -536, -697, 23, 72, -531, -215, -328, -215, 25, 237, 124, 507, 631, 925, 643, 944, 435, 24, -630, -204, -917, -870, -449, -490, -304, -91, -183, -1635, 1129, -129, -885, -114, 1119, -578, 101, 952, 51, -285, 844, 489, 146, -425, 27, -906, -377, -750, -27, -113, -99, 3, -5, -336, -139, -411, -206, 271, -11, 356, 429, 184, 334, 29, -374, -971, -293, -167, -922, 13, -27, -345, 172, 467, -304, 210, 859, -221, 22, 763, 284, -6, -325, 379, -758, 372, -28, -379, -616, -72, 320, -1048, -379, 368, 283, -224, 739, 389, -382, 205, 925, -89, 554, 618, 351, -387, -612, -562, -176, 13, -148, -114, 623, -293, -236, 350, 256, -560, -457, 303, 648, 422, -170, 92, 430, 718, 398, -374, 70, 57, -71, -161, -341, 396, -556, -250, -810, 209, 231, 87, -794, 126, 698, 109, -39, 20, 73, -151, 62, 555, -216, -23, 99, -133, -1091, -607, 204, -114, 703, 550, -600, -225, -287, 154, 107, -123, 59, -512, -755, 102]
545A02j65N33K9j202L95P78r88O60N03j164j46P29n80n24J516K07j79m62K22n40
565b76l83J405j698R18j50M51k40M5O12n52j69k08N07l25J67N69k27k12j84j4
585C6M63k32M97n39l66L76p32Q38j355M06N95r4n82P88J48n78O52J19o64P8J95
606D9P06j201j67M20K38q44Q57j1j48O8k66k00L31O31m20K76N3o00Q20m84k96
627a88K51M4K95j288Q23K55k64K95j82j07m5K57K03m19j47Q4rn83O97L08j75L3
649A38m16j76M64k31L20K0q4o7K63k56M64n42K48l03M77r45Q23k12j186Q39J35
670b27k30L0p6M43N15j019O23J95j51l60J15O50n6mo81K31On7R8Pl69P18q73Q22
694C50m43K17k78l80K82L18J93j75Q66j073N21k02j378J023j6l02N22M08j157
$$ y = [102, -63, 470, 499, -703, -308, 470, -518, 142, 645, -519, -665, 64, -516, -1040, 476, 683, 504, 42, 264, -276, -659, 746, -952, -34, -184, 267, 27, 72, 684, 132, -37, -245, 262, -63, 104, 673, 446, 234, 50, 36, 499, 267, 764, 225, -141, 235, -497, 341, -1014, -608, -13, -107, -689, 99, 247, -331, 321, 440, -224, -146, 49, 755, -446, -613, -193, 45, -799, 58, 47, -101, -33, -299, -499, -168, 463, 43, 319, 372, -228, 592, 108, -188, 63, 107, 402, -886, -63, 192, -72, 223, 41, -66, -111, 146, 349, -70, -217, -133, -142, -725, -28, 280, 105, 138, -278, -454, 10, -221, 99, 119, 35, -32, 231, -25, 439, -103, 145, -158, 319, -626, 197, -15, -1201, -362, -227, -457, -427, -503, -60, 455, -564, 59, 254, 103, -257, -142, 508, 452, 448, -233, -2, 4, -53, 45, 52, -317, 401, -472, 350, -93, 124, -154, -534, -252, 66, 259, 84, 950, -123, 398, 196, -1182, -159, -175, -477, 45, 453, -704]
713g04J326J74p95O27J16m71l90N64l89L43l63J86L25J36m12l38K06N5k15J7Q98
734H96j87r00M8k17L85Nl98K43j98M27L39k96P4m72L41o15P40L9k17j73J99o2
756AL8k15K89m48R31m36P2J83p92P34J22m73n9k53P3K35J63k96M9M30j57j04N40
779F27o20l05j04O24l21o04N71k54N40o69L47P11n4j38o72M28r7O13p17K54M4
800B04l31j34K44M62l91J24J7o42K15M63n5L56r04M01K87Q6J92l3l40J59l05m61
822c86N36P86r96K91J59J84q72j49O29r53O52J24J40M5O21o55k63P5L3o57L24
843c32P61m01j5K57O5k47n46N93l99R87j156Q89K67q26k43J122j243P70m27m95
863f19N17R9l12J78l87K90N20O5m37K7O80q68K3k20O18p16J092L38q19o68P97
$$ y = [-704, 622, 796, 1, 628, 744, 273, -117, 447, 58, 401, 38, 224, 549, 685, 273, -65, 141, 196, -19, -2, 896, 709, -191, -143, -360, 25, 30, -368, -125, -323, 104, 443, 147, 221, -251, 90, -525, 215, 254, 37, -136, 63, 1, 39, -176, 113, -335, 596, 160, 232, 415, -377, 357, 479, 6, -53, -306, -233, 2, 165, -131, -82, 348, 191, 87, 627, 7, -298, -402, 222, -99, -703, -132, -386, 154, -515, -168, 543, 489, 351, -321, 107, 10, 623, -94, 160, 204, -127, -261, -17, 445, 54, 178, 195, -447, -232, 231, 176, 532, -372, 29, 316, 402, 594, 561, 221, 380, 75, -386, 150, 936, -60, 231, 390, 574, -298, -447, 182, -771, -119, 5, 145, 190, 811, 156, -107, -32, 1, -656, -332, 429, 28, 13, 270, 335, 88, -458, 135, -264, 723, -433, 456, 723, -103, -346, 776, -467, 303, -124, -619, -102, -3, -315, -137, -524, -234, 286, 351, -86, -59, 621, -247, -224, -444, 174, -542, 550, 888, 69, -599, 198]
884A98J00k53K72j014Q50k40l60L00J79K14l40O44l15l7j198J176n46K71Q27j294
904e66Q48K13p74K5K11j58P04j74K84r82J173q75m94J98o7L80K46l25R10k58q69
925c50J67j73K70k49L25K55J89ol99k45J45m19N55k81r6J59K60o76M96K53N4l0
947B04J75r33O00O0M45r81P92o0L56q51M54M1o69N00op5l97K76L89l31K66l68
969a13J02l47N75L6n99L21J34o71L09k30L17n56K66N58j13Q6N40l95j70L44q56
990d62O28l0L65j36l32j79k4l34L80N43o85j57O19J31k7q79O54K64p45K91L12
1011A97j08j53k41j28L43L31j01n97J112p10m65O89o22N44J69q87L7J112m96O70
1031F96m63l17p18J072J67q77N42m46J0j21J40L46M73k82k16m23K92k84J029r36
$$ y = [198, 298, 45, 317, -697, 153, -87, -447, -147, 32, 246, -94, 550, 235, 198, -1000, 176, -370, -99, 728, -566, 282, 495, -279, -254, -43, -201, 503, 329, 613, -369, 804, -71, -565, -367, -434, -54, 192, -133, 777, 519, -350, -183, -356, -86, -335, -10, 245, 434, 428, 29, -216, -71, -490, 65, -216, -312, -153, 107, -569, -73, 180, 234, 204, 379, -554, 46, 106, 551, -430, 362, 302, 658, -193, 261, 302, -367, 133, 127, 52, -345, -69, 320, -11, 255, -113, -11, -358, 217, 253, -346, -25, 109, -562, -253, -483, -166, -722, -456, 102, -11, 75, 615, 220, 50, 394, -462, 166, 136, 501, 365, 33, -146, -170, -504, -124, 419, -266, -423, 196, 327, 300, -579, 75, 339, -406, -115, 197, 89, -64, -305, -433, -90, 241, 140, -457, 655, -55, -520, 169, -453, 91, 260, -627, -590, 522, 26, 696, 233, -84, -802, 270, 437, -440, 102, -344, -334, -455, -315, 31, 504, 222, 6, -417, -125, -409, 620, -316]
1051c16O11n60Q5M84r5l45J036j036j21M28k54N26J05o81K8J77m37O73l61p3K36
1072A10o80R70j35n16M93Q0O91n14j166J50L53O54m44k10K58J31o46R32o40j12
1092b41J04L61j61L91o86p9M22k18N19n24r4J165j169J1M2J35q3l76J96o2O58
1113C11m27J44p39J214j37K26o44k83N57l55k1q9J86P2K14n2m79K76L80q37O12
1134A29p62O58k15K15k63O91m08j01j7k29M61L2k28j95L35NK78l76k24L30N00
1155F16p21O09o10o7P8m9M81O26q04n3l1j70O64j086N24l63L31M49J37r59M50
1176E2n62J85j48J33L71K8M07r50O86j23l30K27j74R17j77J11o64l66R04j418
1196h91J50J035m54P07l38k82Q76p33R6K92l99J00L49p9l93p52J114n60P31q26
$$ y = [-316, 295, -265, -180, 304, 209, -136, 900, -136, -257, 171, -83, 443, 548, -133, -105, 72, -365, 308, -53, -126, 110, -570, 400, 265, -251, 242, 322, 1013, 499, -667, -517, -164, 490, 46, -164, 94, 225, -421, 511, -129, -241, -137, 224, 63, 454, -232, -311, 111, -107, 412, -112, -206, 959, -210, -199, -157, -22, -105, -481, -285, -347, 311, -116, 28, -711, 503, 366, 592, -52, -335, 222, -133, -154, -243, -57, 15, 229, 177, -302, -26, 354, -483, 129, -633, 25, -190, 25, -238, 453, 45, -56, -73, -302, 159, 191, -37, -232, 103, 108, 386, 10, -214, 116, 616, -105, 504, -106, -173, -95, -144, 337, 963, 159, 106, 75, -95, 569, -517, 7, -356, -25, 424, 561, -398, 52, -510, -325, -473, -340, 31, 59, 466, -484, 202, 79, -251, -24, -198, 719, 542, 653, -11, -377, 527, -891, -741, 294, -160, 547, 209, -73, 803, 70, 166, 458, 59, 159, 508, 429, 36, -716, 398, -162, 569, -257]
1216b57l56R50o4n66O16M48o77l28L39j403J082P12n89K02K89k98n12L45M88q6
1236C35n72M76j114J309n53N19R39j312l9J95p1L23m04l29Q22k35l42N9R7J60
1256B63o43kN78q2K70K83l30j82K44n27L68j34L14p35P76j067O20J44K64r5l33
1277fM55m98p6L2k29L93j6j87L12jM25r39J751j879P16R8q36M66o7L25R7o91K4
1300c31P30K74q72O60j65m64m29J121n69m59J66L96j13J89l54J29n52M01N03j89
1320G2M33ML9r72N08k24p87J041k92j67K61N05k3k27m16M33n63P94r13R55n51
1341i0r8M64j81p6m18J81K16N14j07n8n84M94P06o90n75O34j89n85O65o2M8j3
1363A96o43N35r4J95N5oL38q86P34n36j27j91j5K20M79j59N7m73M90J05J27k37
$$ y = [-257, -613, 337, 273, -293, 323, 771, 94, -234, 105, -1298, -216, 496, -93, 109, 398, 100, -412, -67, 421, 335, -237, 239, -875, 434, -119, 400, 1339, 27, -12, 183, 112, 435, 31, -298, 524, 289, -53, 6, 103, 263, -380, -382, 196, 114, 384, 667, 337, 155, 399, -128, 240, 106, 420, -315, 461, -606, 14, 158, 422, 327, -6, 449, -49, -125, -93, -322, 71, 55, -132, 180, 179, 604, -335, 1416, -463, 253, 351, -485, -19, -86, 239, 336, -355, -331, 399, 673, -199, 461, 296, -168, -597, 524, -45, -504, -338, 58, -55, 134, -220, -91, -643, -242, 261, 72, 505, 509, 548, -424, 84, -140, -927, 114, -178, -345, -84, 421, 398, 171, -245, 188, -375, 419, -494, 461, -90, -188, 276, 95, 19, -399, -218, -2, 512, 405, 347, -237, 257, 963, 273, -302, 332, 143, -442, 223, 161, 209, 196, -447, 88, -6, 189, 244, 238, 576, -310, 424, -112, -239, -430, -445, -225, 254, 95, 152, -321, 169, 274, 401, 164]
1385A64k80N52L12p85l1r8L10P4q03M68m7m06J280n87l93O85l24P96p97m56M15
1406D9J34l02L68L0m35O04l91Q05n78j22K20l3n91K29K55n38Q2K43m9r0N06r1
1428C05j27m30l05L05K15L11l10k13O33j94N47r07K95o35M63N35o42K40k03J15
1448bl13R38l96K87l23j29K52k58l11L52k15J73M3o93M41k87M40J18m0k01J078
1469I54j063K52q2k92j91O74k37j351J261N8m85N87J98M32j068L39j86o98R27
1488B9j53N67n40n24N47r6o35K40M20L8O19jk73m39k03J50L12j34L59k29m20l98
1510g64Q30Q37r32n13Q96J70m16R5m48O54K75M7k86j65n87K29l7K68l85r5L35
1531Hl21M88L43n92m66N16k53M00l03k9O63r7q24J53M26j08M18n54P57o07p30
$$ y = [164, -116, 436, 748, -37, -68, -166, 144, 218, -585, -117, -164, -570, 710, 123, -270, 415, 91, 887, 90, -366, 49, 183, -119, 249, 279, -156, 448, 57, 862, 284, 162, 382, 349, -242, -13, 242, -296, -214, 29, -20, -110, 396, 305, 178, -252, -557, -252, -37, 274, -36, -249, 384, 190, 737, -170, 125, -510, -47, 488, -154, 86, -117, -2, -315, 623, 227, 514, 191, 62, 314, 56, -255, 97, -118, 55, 98, -595, -154, -441, -1, 117, 77, -124, 954, -109, 143, 61, -231, -422, 252, 15, -1336, -75, -17, -502, 85, 283, 715, -353, -14, -200, -898, 29, -124, 443, -97, -621, -74, -170, -805, -565, -145, -107, 512, 511, 238, -201, -404, -254, 58, -76, 283, 54, -366, -764, 66, 903, -29, -542, 354, 524, 108, 203, -245, 409, 684, 731, 445, 280, -307, -78, -115, 153, -232, -327, 8, -313, 175, 518, -74, -540, -24, -277, 123, -180, -209, 454, 357, -467, -314, 112, 4, 422, -132, 625, 18, -712]
1552g12N54M83p96R33k41m78K27M00m45K12J58j3L29o75K36q56j3Q88n00O4L36
1573I1Q15j816J565q40o04J62J551o79q55Q13o76N27l34J329j343o11Q77j75N70
1592C67M16j069k00R02l67o5j81m00N59M97J44m75J61j5j99L96n26K93r04J288
1612F22r27L08l5j29l63K37N17l23j28k41M56l82K67n36L58m99J047J64q3O3k24
1633A69j0m7Lk04Lj2k12L27k94k63L97Q5J32Q8j20l17k31K15O14J39o90M78m11
1656a61P1o24q4N91N48m2j055O10M97r86J025n60Q84p86k5J14rK5kJ69p2l31Q14
1679F11n30Kq0j2m09J22O31j20k64j88O02p20k01L71j78K25l03K28m2L73m50M50
1701A18l96P95l23o31M65O70l91J04n96l24J13N57L57m44M36o06J06K24n6j38
$$ y = [-712, -158, 325, -471, 462, 221, -257, -30, 370, -75, 137, 295, 282, 611, -64, 172, -684, -697, 191, -309, -245, 91, 906, -910, 655, -185, -789, -627, 924, 245, -610, 203, -473, 54, -280, 1049, -294, -905, -28, -203, 367, 783, -286, -486, 416, 49, -16, -197, -597, -38, 459, 603, 128, 289, 274, 75, 471, -55, 238, -666, 622, -305, 3, -32, -161, -524, -287, 230, -93, -221, -462, -6, -388, -121, -657, -299, -798, 249, 413, 330, 393, 169, 159, 112, 115, -89, -86, -98, -310, 17, -277, -540, -143, -58, 74, 162, 42, -275, -506, -291, 323, 462, -228, 250, -161, -90, -714, -798, -207, 341, 299, -756, -146, 351, -635, 390, -170, 714, -72, -97, 17, 8, 33, 31, 200, 128, -203, 611, 81, 83, 3, -9, -418, -296, 335, 215, -49, -237, 365, -355, -556, -185, -363, -138, -441, -213, -255, 118, -332, 118, -278, 517, 194, -437, 28, 698, 307, 411, -185, -509, -396, 161, 518, 74, 510, -96, 10, 234, 178, 40]
1721D0k22k96P42l52J33J89p5j16m75K02l34M76k06L03j63K89k75J29K21p16O41
1742A35P4%j09j62J59m30L77M64l42m51j77N19r8l77K35L28m74m0K15K19l48K
1764b81J96M18q61N45J42j5N81j040M37L69j019Q6l64R69n38Q55j209O75m97P49
1784A98l13o60K065j418o53Q53j90oL29J18K48j187K92L83Qm40R22p5j45M5p50
1805c76J46p0P53n83n26J258r05q3J187k25m00k1l3p99O53n39J33P57m4o83L22
1826g8J84R55o77n35K80j16K43k76O10r79N1L32J43n3l6J25K23m88M5L98M8p25
1848c26O01N60q81M24q97O64m20j30L87m97P68p30M06l28k17N01N66M88j105N3
1868a13j14N34K26p69J141r9l44J27p03o3K81p62M21J71k11K92k26O99L33k87
$$ y = [40, -182, -478, 264, -88, 45, 234, 159, 43, -432, -230, -564, -88, -294, 9, -154, 135, -140, -11, 210, -506, 135, 209, 209, 100, -62, 97, -333, 44, 508, 166, -285, -462, 57, -41, -418, -183, 145, -329, -369, -154, 65, -283, -281, -85, 333, -528, 17, 159, 144, 725, -315, 122, 491, -528, -442, -806, 163, -375, 480, -729, -54, -551, 198, -115, -775, 1290, -128, -781, 72, -118, -124, 205, 323, 571, -616, -324, 59, 67, -373, 549, 474, 329, 374, -376, -230, -300, 453, -130, -656, 602, -303, -386, 801, 576, 176, 155, 122, -677, -24, -563, -430, 327, 283, -400, -78, 106, 1061, 384, -151, 129, 13, 256, -20, 590, -389, -338, -6, 137, 84, 48, 173, 396, -92, -47, 351, 399, -326, 275, 835, -46, 378, -519, 145, -275, -405, -18, -515, 253, -477, -71, -399, -616, -115, 451, 939, -166, -113, -227, 307, 533, -236, 905, 806, 462, 589, -114, -177, 104, -658, -237, -66, -277, 15, -211, 488, 821, 534]
1888E34n57J85K62p17M41J41l18K49l35O21l57m38L97K80j81l66o6k84N32k09
1908a86J12J33K90k0r79Q47M3o35L29L3K16K91j098M26K67K55k85j10N4o3l38
1929d18m41J071j22l22L98m5l64M99k82j62k86P75o17M81J44K29n78l81K43O36
1949D58l02K21k00rL89n51r5j1O99q53Q22mj9j37o06L53j81l53j50O70k80K78
1971A39J57o45O55l8r40P21M65m87k82k49Q93p47J89j65L02M78m49l23k1P10o57
1992b94j48J77M0L52L90p20J174r55M67k7k40r9l96N83l17K4o34N10k23K77j09
2013a68k13O1M59m00k5K82j25R2P68k04r37L75L43j58o72O32j28J5K40j96J02
2034A43o72K96n30N98j78M04k87N55q4j56k9j96J90k05N65O3p14N55j77m28M2
$$ y = [534, -23, 162, 424, -293, 148, 289, -29, 220, -115, 506, 149, -289, 108, 388, 207, -159, -225, -509, 23, -186, -74, 59, 349, 329, -650, 197, 240, -395, -66, -33, 183, 474, -624, -198, 69, 324, 39, -71, -17, -80, -418, -859, 212, 90, -232, 166, 121, -243, 256, -26, -188, -474, 301, -316, 165, 309, 538, -40, -421, -178, 458, 156, 377, 177, 168, 557, 6, -89, -100, 599, -254, 568, 564, 545, 408, -198, 155, -26, -379, -529, 141, -139, 139, 296, -349, 306, 268, -672, 49, 514, 27, -255, -504, 389, -358, -169, -334, -32, 446, -3, -326, -347, 363, -294, -442, -265, -225, 127, 517, -203, 971, 16, 483, 456, 216, 117, -279, 304, -13, 11, -623, -113, -336, -59, -168, -381, -320, 139, -261, -286, -4, -129, -37, 731, 527, -410, -35, 308, 150, -522, 110, -18, -3, 237, 41, 143, -529, -233, -763, -165, -343, 61, -226, 329, 245, 89, 60, -136, 54, -151, 414, 477, -237, 318, 141, -287, -245]
2055b45M50l96K37l07L67m84M65n26KQ89n07k85N2R97n16q4k96J084q70p18J235
2076E44q80N05j082J515r43R91o05l24j08O8N93k2J81j243K74O7L9K53P07l48
2096A82o83Q9O15n52R62J76q95L43k97l89L67J79l04l75P20n26l51J011k37J37
2116A72l32k56O40J98n34L70n19L64j83kL84K80p70KL20J29K0k16l78kJ540j190
2138C7r00J016k80O64Q9m10l42k4k6N42k02l03j65M24k79L08m72J61Q93j206J256
2159G81j284L38P8P2k6L01l79J342j360J82N85r24N55o32o9Q18j61p8o37J012
2179E14q59R6n8K82N84k71k08p16P05p8J62k25Q0j28l63J218j217j8l28M74J242
2200H88j011O90r90N83m33L28J31o44j67N89k30J59P46m81m29j26P45j50o25N77
$$ y = [-245, 205, -191, 46, -261, 106, -378, 87, -439, -437, 452, -55, -340, -288, 709, 193, 109, -187, 897, 27, -691, 544, -336, 169, -913, 602, -341, 650, 45, -279, -387, -319, 274, 252, 433, -810, -536, -469, -430, -177, 530, 182, -501, -412, 203, -349, 613, 789, -106, 237, -60, -449, -82, 97, -207, -582, 138, -388, -739, 272, 35, 172, -160, -416, 224, 422, -112, 258, -261, 103, -80, -82, 302, 582, -188, -186, 134, 263, 283, 67, -311, -313, 1227, 37, -863, 153, -127, 537, 626, 216, -126, -150, -176, 366, 164, -139, -304, 120, -159, 149, -323, -162, 731, -475, 781, -503, -165, -87, -15, -41, 260, -119, 1223, -137, 45, 630, -294, 261, -371, -440, 378, 217, 139, -498, 514, -345, -249, -307, -25, 559, 288, 80, -636, 69, -9, 153, -72, 8, -120, -483, 735, -482, -500, -828, -354, 888, -123, 567, -423, 160, -273, 55, 186, -458, -625, -36, -266, -107, 639, 158, -271, -397, 348, 198, -427, 150]
2220A50j06N75o70P2o25J023J84M7j117J59L12P55p39J6k75Q75j17m99j40P97
2240F77j140O42n07p8L55k81M55o43J05P47n47M82N03j74k06k97M51L2n73K33
2260B36l66q5P65q04L71r6j73P86o12j99K59P8m34K54m77L37L40n3M81j717R93
2281a16J85K67k21j99p5N2P69l51o95J50l55Q13J83Q0p41P89n89J59J99L28j475
2302h43J557k75p96L51j60J10K70m63K16M31p14N83p43Q36j1N21j538M72J02J30
2322C6j61J4K65q5l41L42O4n72N27O5N1n16R22l38l84K7J2N7l86M43M50j63l22
2345Go00N65L74p04L85K30N6K04j37l66O3l78L43p34R72l90j99J075o25l76k22
2366d57R67q40K99j29K53j11j43J61m9L86K97m78QM30j23l17%o07R3P3L07J04
$$ y = [150, 44, 619, -51, 21, -604, 419, 603, 650, -467, -308, 4, 759, 20, 36, -239, 636, 519, 20, -120, 677, -463, 179, -328, -406, -51, -332, 123, -520, -415, 332, -215, 267, 770, 596, 390, 93, 544, 576, 3, 236, -130, -215, 550, -254, 117, 21, -152, 634, 22, -177, 82, 160, -274, -20, -497, -160, 180, 127, 608, -1109, -116, 69, 336, 115, -84, -159, -107, 662, 311, -384, -234, -589, 224, 407, 487, -254, 535, -54, 105, 304, 632, -843, 714, 439, -357, -6, -166, -56, 214, -249, -33, 398, -316, 267, -476, 360, 349, 870, -668, -196, -94, 36, -125, -111, 154, 69, -272, 70, 134, -438, 89, 154, 205, -311, 611, 273, -111, -84, -72, -15, -401, 42, 492, 329, 7, -593, -28, 346, -358, 27, 257, 313, 517, 380, 14, 77, -301, 42, -692, 280, -110, -309, 766, 141, -235, -457, 510, -330, -31, -160, 93, -18, -161, 0, -49, 337, 634, 156, 164, 594, 471, 154, 154, -453, -360, -287, 20, 124]
2388A24m30L51q9k01O48j5m45M39J69l71M82j705Q99k18P29n00L00k05J7N66J66
2409G11l76l10o43P7K40l94J106m44L77j054P02m84Q59M59q11n2L5J87j004P28
2429i1M90l7M8k71p68P75L33l89J08n37K83J65q89J350l4n79k52q0Q49j40q8o2
2451A84J7k91P42r75J32%K13j11r37L4Q48L91o65P98n06M13K01J68j040j28M65
2472d7m4L34n08k2m47J215m46M35l93K88k76K91R0r04O08r1M60q59N75O10l98
2493D71k37K60p99J50p7j57j5R41L4l42n03O15q44j30Q38n54k20R33o79J014l57
2514C42p38J46m20J184l83j1l63j16R8M99o60P55L51n15o89q5P68L96j007N78
2534A30K76p84O3J53o2p63K46R77K89l46K39m31N73p97L61p65N72K98k80L30o90
$$ y = [124, -306, 45, -44, -245, 403, 388, -57, 382, 551, 180, 662, -1043, -144, -362, 367, -133, 167, -38, -21, 545, 711, 335, 25, -618, -541, -301, -695, 411, -33, 344, -710, -8, -492, 367, 826, 15, -37, -2, 185, -819, -91, 399, 362, 410, 139, -629, 146, 479, 90, 198, -339, -56, 109, -780, 570, 536, -43, -295, -375, 474, 334, 246, 184, 201, -90, 652, -323, -191, -191, 22, -89, -1026, -992, -144, 247, -418, 380, -126, 287, 488, 656, -384, -512, -47, -91, 243, -265, -287, -734, 481, 35, 470, 77, 365, 89, 380, 470, -434, 174, 83, 543, -316, 259, 869, 471, 234, 494, -305, -155, -232, -389, -404, 537, 571, 229, -274, 341, -503, -633, 205, -349, -569, 364, -315, 699, 342, -396, -250, -670, 514, 131, 120, -243, -359, -261, 238, -422, 333, 684, 169, -520, -605, 163, 559, -448, 130, 406, -378, -315, -162, -224, -987, -741, 236, 525, 179, 418, -13, 560, -237, 124, -641, -69, 229, -51, 279, -411]
2555d11K41L66K22r09O31K2P0m79k24K84j40P80l17k88L54j74j27M68o22n81J519
2576F85m41k95P71j173J75N69j87k77M83m5m91L42K87k57l48O78m92l7k05N89
2596C31l60J73J24l1J46p16Q91q11N55l6l3p03m26J347k89l89J03Q42q12m28K47
2617b75K90l04M93N8K49m63k63P85j80p76Q17n42J85n74N95K78p37J54J213q78
2637A25J96K03p37P03j031J69P61J65j017O74j03j42L09q12M58L04o43P00l92
2656a10L24o54N19m74O30l47j68J23L86m1j89kP82o73m0Mj20J53L18M15q24q75
2678h63J215n68r48J142j45J96O06j335M26J42n6j3M94j62q78M74J40j19K88k61
2698b25J7K28N45n27L5j3j31Om7N97p71L54L91o98k3O5Jn82L29N89o69O15O38
$$ y = [-411, -170, 196, 418, -491, 140, 162, 232, -247, -471, -187, -327, 453, 136, -152, 202, 28, -99, 369, -253, -834, 685, 244, -51, 720, -453, -278, 291, 104, -173, 310, 265, -226, 116, 403, 146, -202, 476, -16, -53, -258, 331, -29, 144, 268, 237, 383, -333, 558, -253, 302, 266, 233, -470, -896, 451, 162, -227, -124, 718, -94, -522, -275, 15, -289, 204, 262, 511, 48, -215, 570, 390, -386, 431, -111, 74, -500, 95, 373, -364, -210, 1003, 125, 321, 524, -213, 490, -541, -372, 389, 554, -463, 211, 108, -34, 275, -537, -79, 225, -418, 282, -110, 214, -440, 79, -395, 235, -112, -280, -157, 229, 188, -1, -3, 779, 106, 66, 70, -50, 103, 421, 836, 12, -863, 352, -216, -1164, -22, -167, 29, 635, -700, -274, -132, -188, -201, 293, 131, -747, -273, -133, -252, 36, -225, -208, 20, 565, 38, 73, 60, -71, -65, -112, 485, -286, 68, 459, -239, -262, -197, -196, -778, -449, 140, -529, 86, 724]
2721G24l12m98K43oP89j116J041q99j54N56p50N94l47L1r34R57j98O46j99j77
2741iK83o37QM12L2q5M62k96M45r87M53p25Q48q42R68k41q47Q15o77R61q76J032
2763D97o64K66m93O83o18L83n34K59L22n30K07k38J038n58j81n1N18q8l01j67
2783b50L18k06K98m6l53O4j15P1M39n1J08j030M4R27k67l97k01J111p31k8P18
2804D23J84o77K77m74L63o21K78N18k2j83jk89P65r63O12j80m73M94N63l95l07
2825a08j70J11j57L36m5k74K95J3k8O9j88m65O21n83L61M96j50O00q35L30K15
2846D44m98P20L9j090O32m15k52R36q19Q34k93J07l28j80K30k20M51m21l19L63
2866g9j14l21L77O86l88N52r27J62k59L69n76R36m84m35O51k2j48q10J019k27
$$ y = [724, 412, -86, 157, 151, 940, -176, 865, -34, -188, 368, -382, 212, -135, -104, -1038, -81, -279, 367, 168, -9, 274, -363, -355, 57, 89, 4, 466, 170, 615, -372, 81, -644, 204, -638, 330, 89, -758, 57, -620, 341, -535, 497, -167, 99, -394, 289, -329, 54, -480, -221, 101, -429, -222, -460, 578, 20, -161, -212, 306, 218, -83, -250, 68, -138, 160, 114, -239, -175, -290, -219, 220, 169, 277, -753, -709, 218, -49, -446, -647, 464, -267, -295, 423, 607, -70, 207, -267, 96, -525, -247, 271, 249, 66, 65, -224, 541, -422, 190, 10, -463, 31, 594, 199, -108, -278, -167, -324, 12, -33, -307, -12, 1, -27, 42, -146, -611, 10, -573, -212, 284, 134, 734, -101, 229, 444, -54, 666, 705, -385, 247, -168, -420, 516, -303, 531, 238, 345, 17, -163, 67, -153, 298, -123, -442, -79, -193, -514, -137, 549, 161, 713, -214, -52, -311, 58, -518, 418, -66, -501, 150, 128, -20, -830, 189, -38]
2886c8j34M37J43m50J69O82j006M28j073M57Q22k46M71p06J22M31K93j83j196
2905e77Q22l5N4J69o83O40K76m44k07j49K52L41j546N93L13r6P3P7k20L26J15
2926I4k33r1J66l3n5J05L8N52l76r18P95m89L99P35l42l29J40p16J73Q04J5J65
2948E99k56m3k08L21o16K54p55P39m57P20n90L91l62k45R28l30l19k9P95l72k89
2969a24j34K04N32k76j219J169n9M58l18n47m58O62P9N08n17l4j59k2R46k99m04
2990a2j53K05q05J121j117J334o23j80k43J070n60j05O32q00M64n03Q65r00J69
3009a41M64j45K01m22o60J340m43r85P64k32N72o68O17n17Q9P68n68m69O79p47
3029e03J104q33n3K35K72m03O7L76l61M22n57O26n65J29J07J19J99P4k40n3q54
$$ y = [-38, -172, 265, 408, -42, 127, 809, -197, 231, -842, -385, 437, 191, 662, -44, 78, 509, 802, 619, -577, 245, 210, 264, 433, -250, 390, 666, 222, 15, -134, 118, 459, -1087, -494, -181, -277, -204, -127, -347, -21, 94, -139, -230, -64, -97, -152, -47, -9, 543, 167, -751, 44, -445, -46, 689, 347, 18, 158, -558, -385, 419, 434, 599, 343, 300, 92, 413, -203, 51, -704, 35, -422, 298, -292, 99, -263, -508, 420, 90, -229, -258, 537, 165, -124, -258, -54, 478, 202, -1017, 152, 93, 551, 233, -314, -772, -110, -31, 477, -40, -74, -233, -255, 691, 392, -12, -165, 40, -765, 356, -761, 573, -50, -230, -473, 597, 37, -68, 564, -236, 228, -275, 590, -310, -141, 323, 178, 379, -43, -703, 637, 194, -791, -27, -259, 313, -355, 262, -255, -166, 602, 34, -435, 244, -503, 601, -232, -285, -50, 222, -181, -114, 262, -99, 323, -234, 392, -173, -44, 63, 182, 381, 455, 215, 162, -692]
3050f92Q1J863j625J89O3J30Rl27l5R8Q68n72p13N51M52j439M07J080m87NK41
3071A47k25m23J355j697M27J15K38Q6K29o48M94M43o05m20N52o42J215q82K58
3090A7l1K17n87M28M12j456J336j27J83m46Q3O29k88j080P36N17r69N98n35L35
3110b8L79k05q72N48K4m43L81j08N83l85o10P69K07o52j04L47N32j27p81P0l91
3131h66J131J52l06jj58n72L87R90n97l57m4K71L95r55K76J99j23l07N56r26M98
3152c57Q22o88J14m35O83L54K91j442Q67l57k23M03K86r99k4O6J111n32J04j09
3172f5K19K40j36L72o78m90J121J14p01K69j23j12j21K0o9Jm27L90j05l08Q19
3193B30n76O96o47N23J7j052O60o4l54M89N77R2o63k68J99R3q3R48l97n60K46
$$ y = [-692, -611, 1252, -373, -184, -121, 9, 18, -309, -344, -246, 622, 50, -663, -112, 340, -1099, -692, 388, -99, -94, 147, -78, -501, 854, -843, -416, -301, -63, 23, 252, -396, 98, 541, -64, -484, 68, -574, 641, -241, 17, -14, 203, -384, 44, 456, -1000, 336, 209, 392, -54, 29, 658, 370, -710, 26, 543, -426, 172, -363, -28, 351, 146, -726, -178, -154, -597, -216, -324, 259, -126, -736, 33, 240, -412, -516, -169, 363, 236, -545, -475, -866, 265, 417, 111, 110, -48, -620, -233, 757, 160, -197, -241, 30, 425, -530, -254, -55, -178, -485, 71, -855, -357, 465, -223, -109, -544, 139, 493, 784, -658, 209, -148, -371, 32, 318, -681, -705, -639, 472, -60, 44, -65, 154, 394, 258, 630, -48, -538, 583, 697, -4, 265, 142, 30, -91, -71, -140, -139, -566, -176, -281, -589, 230, -346, 350, -297, 226, 243, -809, -149, -213, -567, -78, 499, 591, -72, -340, -141, -48, -131, 817, 420, -140, 106]
3214A06j45N25q18k29M36N31j99m43O61Q6k54o66J78l90M62R03J19l19q43k13
3234e12k14J97L71nL00J266k078J527o28j98k56p48R57Q5k89j29M08o19Q21l18
3254f2On49R43j006J64L61m37R25R0j235J091o67K24J84O77J40j308O71J38n75
3274b25N35l05K96j43p01P63j03m15O23m03q5N56l09P90q40q3l12J471j132r4
3294a16k58J91nK53L0M79p50j44P4m57M55O19m99o82K35K34L08k47J87m73Q0O22
3316A36L27m36l39M16J95l3m85J16l76J002l56k29q52Q65l15J74J24q6M42k80
3336A0M12k03K02L16p99m39L32K53M9k59L05j014J46P44p2o46R95l1k15j86m55
$$ y = [106, -39, 486, -332, -561, -125, 406, 207, -236, 425, 511, 257, -409, -231, -621, -159, 744, 863, 544, -299, -512, -726, -529, -158, -163, 137, 1403, -675, 852, 224, 26, -230, -978, -21, 64, -225, -354, 54, -565, 256, -62, -56, -605, 338, -668, -504, -143, -580, 345, 435, -800, 291, -376, -152, 32, 709, 849, -459, 212, 350, -225, 310, 5, 301, 158, -543, 220, 117, -298, 325, -78, -163, 393, 84, 874, 34, -49, -361, 1110, -22, -116, -374, -183, -188, 65, 95, 574, -176, -320, -246, -703, -248, 371, -128, -810, -575, -341, -33, -280, -93, -566, -486, 136, 463, 27, -312, 104, 299, 266, -219, -103, -479, 523, 167, -62, -914, -49, -364, -190, -66, -152, 290, 10, 422, 219, 421, 737, -62, -501, -169, 84, 133, -126, 179, -835, -689, 55, -17, -663, 332, 301, 86, -100, -555]
$$ [...]
8191E5
##END NTUPLES=NMR FID
##END=
