##TITLE=1H_AM_NV90
 CDCl3
 64 sc, 
 1.12.2023
##JCAMPDX= 6.0         $$ Bruker NMR JCAMP-DX V2.0
##DATA TYPE= NMR FID
##DATA CLASS= NTUPLES
##ORIGIN= UXNMR, Bruker Analytische Messtechnik GmbH
##OWNER= root
$$ XWIN-NMR		Version 3.5
$$ Fri Dec  1 14:01:47 2023 Russian Standard Time (UT+4h)  she@DPX200
##.OBSERVE FREQUENCY= 200.1313
##.OBSERVE NUCLEUS= ^1H
##.DELAY= (6, 6)
##.ACQUISITION MODE= SIMULTANEOUS
##.ACQUISITION SCHEME= undefined
##.AVERAGES= 8
##.DIGITISER RES= 18
##SPECTROMETER/DATA SYSTEM= spect
##.PULSE SEQUENCE= zg30
##.SOLVENT NAME= CDCl3
##.SHIFT REFERENCE= (INTERNAL, CDCl3, 0, 15.7039)
##AUDIT TRAIL= $$ (NUMBER, WHEN, WHO, WHERE, WHAT)
$$ ##TITLE= Audit trail, XWIN-NMR		Version 3.5
$$ ##JCAMPDX= 5.01
$$ ##ORIGIN= Bruker BioSpin GmbH
$$ ##OWNER= she
$$ F:/spectra/data/she/nmr/H-F/1/audita.txt
$$ ##AUDIT TRAIL=  $$ (NUMBER, WHEN, WHO, WHERE, WHAT)
(   1,<2023-12-01 14:00:31.21 +0400>,<she>,<DPX200>,
      <created by zg, POWCHK disabled, PULCHK disabled
       configuration hash MD5:
       00 E9 B6 7A A2 85 ED C7 34 08 36 98 17 FE 4E 26
       data hash MD5: 16K
       0C 84 86 01 6A DB CC C8 52 7D C7 5E A8 11 CE C6>)
$$ ##END=
$$ 
$$ hash MD5
$$ C2 5F 67 95 C7 E3 74 89 2A C4 1A E2 B1 0D 25 E2
##$RELAX= 
##$RELAX= 
##$RELAX= 
##$RELAX= 
##$RELAX= 
##$RELAX= 
$$ Bruker specific parameters
$$ --------------------------
##$DU= <F:/spectra>
##$EXPNO= 1
##$NAME= <H-F>
##$PROCNO= 1
##$TYPE= <nmr>
##$USER= <she>
##$AMP= (0..31)
100 100 100 100 100 100 100 100 100 100 100 100 100 100 100 100 100 100 
100 100 100 100 100 100 100 100 100 100 100 100 100 100 
##$AQSEQ= 0
##$AQ_mod= 1
##$AUNM= <au_zg>
##$AUTOPOS= <>
##$BF1= 200.13
##$BF2= 200.13
##$BF3= 200.13
##$BF4= 200.13
##$BF5= 200.13
##$BF6= 200.13
##$BF7= 200.13
##$BF8= 200.13
##$BYTORDA= 1
##$CFDGTYP= 0
##$CFRGTYP= 5
##$CHEMSTR= <none>
##$CNST= (0..31)
1 1 145 1 1 1 1 1 1 1 1 1 1 1 1 1 1 1 1 1 1 1 1 1 1 1 1 1 1 1 1 1 
##$CPDPRG= <>
##$CPDPRG1= <>
##$CPDPRG2= <>
##$CPDPRG3= <>
##$CPDPRG4= <mlev>
##$CPDPRG5= <mlev>
##$CPDPRG6= <mlev>
##$CPDPRG7= <mlev>
##$CPDPRG8= <mlev>
##$CPDPRGB= <>
##$CPDPRGT= <>
##$D= (0..31)
0 1.2 0 0 0 0 0 0 0 0.06 0 0.03 0 0 0 0 0.0002 0 0 0 0 0 0 0 0 0 0 0 0 
0 0 0 
##$DATE= 1701424830
##$DBL= (0..7)
120 120 120 120 120 120 120 120 
##$DBP= (0..7)
150 150 150 150 150 150 150 150 
##$DBP07= 0
##$DBPNAM0= <>
##$DBPNAM1= <>
##$DBPNAM2= <>
##$DBPNAM3= <>
##$DBPNAM4= <>
##$DBPNAM5= <>
##$DBPNAM6= <>
##$DBPNAM7= <>
##$DBPOAL= (0..7)
0.5 0.5 0.5 0.5 0.5 0.5 0.5 0.5 
##$DBPOFFS= (0..7)
0 0 0 0 0 0 0 0 
##$DE= 6
##$DECBNUC= <off>
##$DECIM= 32
##$DECNUC= <off>
##$DECSTAT= 4
##$DIGMOD= 1
##$DIGTYP= 9
##$DL= (0..7)
0 120 120 120 120 120 120 120 
##$DP= (0..7)
150 150 150 150 150 150 150 150 
##$DP07= 0
##$DPNAME0= <>
##$DPNAME1= <>
##$DPNAME2= <>
##$DPNAME3= <>
##$DPNAME4= <>
##$DPNAME5= <>
##$DPNAME6= <>
##$DPNAME7= <>
##$DPOAL= (0..7)
0.5 0.5 0.5 0.5 0.5 0.5 0.5 0.5 
##$DPOFFS= (0..7)
0 0 0 0 0 0 0 0 
##$DQDMODE= 0
##$DR= 18
##$DS= 0
##$DSLIST= <SSSSSSSSSSSSSSS>
$$ [...]
##$SUBNAM2= <"">
##$SUBNAM3= <"">
##$SUBNAM4= <"">
##$SUBNAM5= <"">
##$SUBNAM6= <"">
##$SUBNAM7= <"">
##$SUBNAM8= <"">
##$SUBNAM9= <"">
##$SW= 18.0517328524113
##$SWIBOX= (0..15)
0 0 2 0 0 0 0 0 0 0 0 0 0 0 0 0 
##$SW_h= 3612.71676300578
##$TD= 16384
##$TD0= 1
##$TE= 0
##$TE2= 300
##$TE3= 300
##$TEG= 300
##$TL= (0..7)
0 120 120 120 120 120 120 120 
##$TP= (0..7)
150 150 150 150 150 150 150 150 
##$TP07= 0
##$TPNAME0= <>
##$TPNAME1= <>
##$TPNAME2= <>
##$TPNAME3= <>
##$TPNAME4= <>
##$TPNAME5= <>
##$TPNAME6= <>
##$TPNAME7= <>
##$TPOAL= (0..7)
0.5 0.5 0.5 0.5 0.5 0.5 0.5 0.5 
##$TPOFFS= (0..7)
0 0 0 0 0 0 0 0 
##$TUNHIN= 0
##$TUNHOUT= 0
##$TUNXOUT= 0
##$USERA1= <user>
##$USERA2= <user>
##$USERA3= <user>
##$USERA4= <user>
##$USERA5= <user>
##$V9= 5
##$VALIST= <valist>
##$VCLIST= <CCCCCCCCCCCCCCC>
##$VD= 0
##$VDLIST= <DDDDDDDDDDDDDDD>
##$VPLIST= <PPPPPPPPPPPPPPP>
##$VTLIST= <TTTTTTTTTTTTTTT>
##$WBST= 1024
##$WBSW= 4
##$XGAIN= (0..3)
0 0 0 0 
##$XL= 0
##$YL= 0
##$YMAX_a= 218495
##$YMIN_a= -306509
##$ZGOPTNS= <>
##$ZL1= 120
##$ZL2= 120
##$ZL3= 120
##$ZL4= 120
##$ABSF1= 10
##$ABSF2= 0
##$ABSG= 5
##$ABSL= 3
##$ALPHA= 0
##$AQORDER= 0
##$ASSFAC= 0
##$ASSFACI= 0
##$ASSFACX= 0
##$ASSWID= 0
##$AUNMP= <proc_1d>
##$AZFE= 0.1
##$AZFW= 0.1
##$BCFW= 1
##$BC_mod= 2
##$BYTORDP= 1
##$COROFFS= 0
##$CY= 11.3945322036743
##$DATMOD= 1
##$DC= 2
##$DFILT= <>
##$DTYPP= 0
##$F1P= 15.7292609196834
##$F2P= 12.9074282941183
##$FCOR= 0.5
##$FTSIZE= 0
##$FT_mod= 4
##$GAMMA= 1
##$GB= 0.15
##$INTBC= 1
##$INTSCL= 1
##$ISEN= 128
##$LB= 0.24
##$LEV0= 0
##$LPBIN= 0
##$MAXI= 10000
##$MC2= 0
##$MEAN= 0
##$ME_mod= 0
##$MI= 1.114404
##$NCOEF= 0
##$NC_proc= 0
##$NLEV= 6
##$NOISF1= 3.799351
##$NOISF2= 2.8
##$NSP= 1
##$NTH_PI= 0
##$NZP= 0
##$OFFSET= 15.70392
##$PC= 1
##$PHC0= -24500.44
##$PHC1= 9.65271
##$PH_mod= 1
##$PKNL= yes
##$PPARMOD= 0
##$PSCAL= 0
##$PSIGN= 0
##$REVERSE= no
##$SF= 200.130013532006
##$SI= 16384
##$SIGF1= 3
##$SIGF2= 2
##$SINO= 400
##$SIOLD= 16384
##$SREGLST= <1H.CDCl3>
##$SSB= 0
##$STSI= 0
##$STSR= 0
##$SW_p= 3612.71676300578
##$SYMM= 0
##$S_DEV= 0
##$TDeff= 0
##$TDoff= 0
##$TI= <>
##$TILT= no
##$TM1= 0
##$TM2= 0
##$TOPLEV= 0
##$USERP1= <user>
##$USERP2= <user>
##$USERP3= <user>
##$USERP4= <user>
##$USERP5= <user>
##$WDW= 1
##$XDIM= 8192
##$YMAX_p= 0
##$YMIN_p= 0
$$ End of Bruker specific parameters
$$ ---------------------------------
##NTUPLES= NMR FID
##VAR_NAME=  TIME,          FID/REAL,        FID/IMAG
##SYMBOL=    X,             R,               I
##VAR_TYPE=  INDEPENDENT,   DEPENDENT,       DEPENDENT
##VAR_FORM=  AFFN,          ASDF,            ASDF
##VAR_DIM=   8192,          8192,            8192
##UNITS=     SECONDS,       ARBITRARY UNITS, ARBITRARY UNITS
##FACTOR=    0.0002768,     1,               1
##FIRST=     0,             0,               0
##LAST=      2.2672688,     0,               0
##MIN=       0,             -306509,         0
##MAX=       2.2672688,     218495,          0
$$ Real data points
##PAGE= N=1
##DATA TABLE= (X++(R..R)), XYDATA
0@%%%%%%%%%%%Qj6J6j7K5l2M0n1O0p3Q8j05J25j49J77k06K39k74L14l62M12m68
33b49N32o00O75p60Q53r55J066j187J319j465J625j801J991k196K423k671K944
50A544l243L571l935M339m791N298n871O527p285Q171r224J0497j2079J4103j6795
65i173K0576k6307L6103n7210J78995j69323k21647M66481q0418l61845J46359
76g7409K26107k37349n0233J67194k9141n8573R8028l1886j7225R6344l2971q4793
88c1907R4592L928j08244L5638L4051r5502L3816N0351j03076K5621J31836r9328
100b8224o0364J76342l119j52706J01496Q5322j42570N285R5176j15031k3917
111f2310J25434j09294r3748K01249k711k22351J38341K01923k10456r0017K56537
$$ plain form
0 0 0 0 0 0 0 0 0 0 0 0 0 8 -8 8 -9 16 -16 24 -27 33 -40 48 -57 68 -81 96 -110 129 -145 169 -193 219 -249
33 -249 283 -317 358 -402 451 -504 562 -625 694 -771 854 -947 1044 -1152 1271 -1400 1544
50 1544 -1699 1872 -2063 2276 -2515 2783 -3088 3439 -3846 4325 -4899 5598 -6481 7622 -9173
65 -9173 11403 -14904 21199 -36011 142984 -26339 -247986 218495 138077 -223768 -77409
76 -77409 148698 -88651 -138884 28310 -831 -59404 38624 6738 -10487 85857 52886 -31907
88 -31907 62685 66613 -41631 -5993 28058 -67444 -33628 16723 -86353 -60732 71104 -28224
100 -28224 -88588 87754 84635 -68071 33425 118747 -23823 -18538 76638 -38393 -62310
111 -62310 63124 -46170 -139918 61331 58620 -163731 -25390 176533 -33923 -123940 132597
122A32597q614k22584Q2917J37151j25052p5148Q3822Q106m6446p608K241L9441
134H23K0085o1361J9408R4586m9038o6428R3167J9333j07291K8344O6558q4471
146b6285k7708P8970l7532n5883P1295J3095o0438M2276M1274m6189J5158L7467
158D5500m4674M554M4030o0822k6581P8738l4995q7912P7411N2582j06028J037
170e7160J13006l6673p3912P3860M3439o7854o884M7250j3159k9920j084L480
182e611P270j2436k6911K5310K9960l9367q774N8941m817m5287L3200L1214m0581
195B111r064K8822j5530j8786R944q600m585J3807j6462n556L7948p669l3794
208b7414M1068K8421n4016J091N8825l2702n0908M8041J8316o3659K310N0840
$$ plain form
122 132597 123983 -98601 -15684 121467 -3585 -78733 5089 13195 -33251 -40859 -38618 823
134 823 20908 -40453 -21045 73541 24503 -41925 51242 70575 -36716 -8372 58186 -26285
146 -26285 -53993 24977 -12555 -68438 2857 15952 -44486 -2210 39064 -7125 8033 45500
158 45500 826 5380 49410 -11412 -37993 40745 5750 -82162 -4751 47831 -58197 -57160
170 -57160 55846 19173 -54739 19121 62560 -5294 -12178 35072 21913 -8007 -9091 -5611
182 -5611 1659 -10777 -37688 -12378 17582 -21785 -30559 28382 23565 -21722 11478 42692 2111
195 2111 -6953 21869 6339 -12447 -2503 -11103 -15688 -1881 -18343 -23899 14049 6380 -27414
208 -27414 13654 42075 -11941 -10850 47975 15273 -35635 12406 30722 -32937 -30627 20213
220B0213k6328l3551L8191J9351k9444J758K8318l77j5566P76J2343K86k0069
233d099p078J8716m997k8146J0444K3960j9268j2735K8344O993j8611Q866J4759
246A7148q414k204K951p877K961K006k0228M71K1789j7055k1006L1378J3592l5170
260a9658P327M0781j7817k8627L1724J6034l7271m738L0459j1640k8288J3838
272g876J6385j7928r461J8544P436j2843l40J5916K190j2448J477J1841n586j3000
286e693M701O262r989n971P100J506m308J529L193K769L291k674j207R285m20
301I374j3595M213J2524j4174j3494J7661N258k3222K618K4184r725j8476J9578
314B724J4782k1330n039K3179k416k1505P060J5400j3263j2672J3014O407j3977
$$ plain form
220 20213 -6115 -39666 -1475 17876 -11568 -9810 18508 18131 2565 3341 15684 15970 -4099
233 -4099 -11177 7539 2542 -25604 -15160 8800 -10468 -23203 5141 12134 -6477 2389 17148
246 17148 8734 6530 9481 1604 4565 6571 -13657 -13186 8603 -8452 -29458 1920 15512 -19658
260 -19658 -12331 28450 10633 -17994 13730 29764 -7507 -12245 18214 6574 -21714 -7876
272 -7876 8509 -9419 -18880 -336 7100 -5743 -6083 9833 12023 -425 1052 12893 7307 -5693
286 -5693 -992 5270 -4719 -10690 -3590 -2084 -6392 -4863 -1670 1099 4390 1716 509 9794 9374
301 9374 -4221 -8 12516 -1658 -15152 2509 7767 -15455 -12837 11347 1622 -16854 2724
314 2724 17506 -3824 -8863 14316 11900 -9605 -2545 12855 -408 -13080 -66 6341 -7636
327g636k668J3510O86j0213L608J0098l541o530N313M165n591k929K777k41k198
342a390j213j357K330K947n027j457J0034r6j1402O349J2542j2052r869J6751
356G090L168k0458L128J8619j1097j5019J5952R000j7429j835J7196k453j3341
369g479O295J0288p544p487P395M773q403m003Q014J599q659R23Q522l271o041
384e078O524L585o586M43N261l453k260L501k395k106M452k581m517P088J374
399C252r571M664R977r869n821J4200J02j4847N945J1963j1051q118J2426K977
413F229j2354L07J0803j936q853L434Q658m082q063O367P079r256m752J0959j28
428D412j1466N083Q418q988k911J0087k751o914P118J713p462M067L922p501J389
$$ plain form
327 -7636 -10304 3206 3892 -6321 -2713 7385 3844 -2686 2627 6792 1201 -1728 1049 808 -1390
342 -1390 -2603 -3960 -1630 1317 -3710 -5167 4867 4771 -6631 -282 12260 208 -9661 7090
356 7090 10258 -10200 -7072 11547 450 -14569 1383 10383 -7046 -8881 8315 5862 -7479
369 -7479 -1184 9104 1560 -5927 1468 6241 -2162 -6165 1849 3448 -5211 -4288 4234 963 -5078
384 -5078 1446 5031 -1555 -1112 4149 696 -1564 1937 -458 -2564 1888 -693 -5210 1878 3252
399 3252 -6319 -1655 8322 -1547 -7368 6832 6934 -7913 -1968 9995 -1056 -9174 3252 6229
413 6229 -6125 -5818 4985 3049 -5804 -2370 6288 2206 -5857 510 7589 -1667 -6419 4540 4412
428 4412 -7054 -1971 6447 -2541 -5452 4635 1884 -5030 2088 3801 -3661 406 4328 -3173 -1784
443a784O428o652k243Q249l806n770Q276N01q411N932N067q965J101Q067o346
458c56l678P287k617m535N651k008m329P819j337r002R698N217j4758L906J4483
473A1441j3299p663J8033l734j6158J3414O487j7817N851J3624j5652k067J8378
486A0838j0769j1446K0235j133k0338J4362J1269k1867K580J8992j5922q086K1138
499I853p351j6463J9781M028k3057J1459J6898k1456l294K2403j0503j3937J7654
512F015j78j5654J1725M811j5720Q395R861j6987L062J6599j5325o008K0889q929
526B556j5349K1057M20k3943J6876J4245k9596L562L0286k2808j8672L5073j91
539A3516l4408J9358K2592k9363l997K7547j2628j5403J9900j450j6744J3761
$$ plain form
443 -1784 4644 -2008 -4251 3998 192 -5578 2698 3199 -5212 720 5787 -3178 -2077 5990 -356
458 -356 -4034 3253 636 -3899 1752 -256 -4585 3234 1897 -7105 2593 7810 -6948 -3042 11441
473 11441 -1858 -9521 8512 4778 -11380 2034 8521 -9296 -3445 10179 -5473 -7540 10838
486 10838 69 -11377 8858 7725 -12613 1749 13018 -8849 -6269 12723 -3199 -11285 9853
499 9853 2502 -13961 5820 9848 -13209 -1750 15148 -6308 -9602 12801 2298 -11639 6015
512 6015 5837 -9817 1908 6719 -9001 -606 9255 -7732 -4670 11929 -3396 -9404 11485 2556
526 2556 -12793 8264 8684 -15259 1617 15862 -13734 -10172 20114 -2694 -21366 13707 13516
539 13516 -20892 -1534 21058 -8305 -12302 15245 2617 -12786 7114 5664 -11080 2681
551B681M665j7696Q608J1780j6371L2J5597r855o099J3670n441q014J3236l587
565C206j3007J4517L529k0083R182J5244j9889k802K2259j1543j3822K1956r10
578G837k1630J7156J1669k6740M448K5697k0545j5790K8697K07k7762J2779J8425
591A4448j8640o013J6630k460q188N063L23p11L415o320j127J0350o337r495J2802
606C740J982j5152P925J0694j5124j38J6771j0569j0188J7896o10j7748J1054
619E33J0067j7038L84J4475j0070o236J3452m360r347J2469Q45j3501R357Q767
633I797j4954J3J4497q096r055J0877R00q702L796K162l940M034r08n717Q213
648B917K600j2371N522J1783j3198n033J6773n133j4401J3309N452j7009M921
$$ plain form
551 2681 7346 -10350 -1742 10038 -6333 -6301 9296 -559 -6658 7012 1571 -6443 6793 3206
565 3206 -9801 4716 8245 -11838 -2656 12588 -7301 -10103 12156 613 -13209 8747 7837
578 7837 -13793 3363 15032 -11708 -7260 18437 -2108 -17898 10799 11006 -16756 -3977 14448
591 14448 -4192 -10205 6425 3965 -4223 840 1163 452 3867 -2453 -3580 6770 433 -9062 3740
606 3740 5722 -9430 -1505 9189 -5935 -6073 10698 129 -10059 7837 7227 -10521 533
619 533 10600 -6438 -6054 8421 -1649 -7885 5567 1207 -8140 4329 5174 -8327 1030 9797
633 9797 -5157 -5144 9353 1257 -7798 3079 3979 -4723 -927 1235 -2705 1329 421 -5296 2917
648 2917 5517 -6854 -1332 10451 -2747 -7780 8993 3860 -10541 2768 8220 -8789 -3868
661c868J3103j3107m184J5442n424j0430J2304J953j2119P002O387j1481K462
674a960R302j0390k578J2545o607r320J2695J534j3539O928R236j1378j064J1111
688F515n539n443Q460j832o212O674l03p547O421K774r981M171Q215j0119j653
703e399J2368n771q618J1856J469j2720O612Q274j2102r34J1829p085p289J1158
717C648l37j0380P281N613j0112J813R103p245l792R455k469p676O622K462q263
732d277K332N551n814j224N941k568k834M754m80l225L698L10m005L052J577n244
748b456J672L938n289j254O042k770m401N876J095n968L445M241n630PN876m059
764C65l552O177q78o592M282L731o900j56O834l127m482N593J870n169J273L982
$$ plain form
661 -3868 9235 -3872 -8056 7386 1962 -8468 3836 5789 -6330 672 7059 -4422 -1960
674 -1960 7342 -3048 -5626 6919 312 -9008 3687 5221 -8318 -1390 7846 -3532 -4596 6515
688 6515 976 -4467 3993 2161 -4051 2623 2320 -5227 1194 3968 -6013 -1842 6373 -3746 -5399
703 -5399 6969 1198 -7420 4436 5905 -6815 -203 8071 -4031 -4965 6864 -221 -7510 3648
717 3648 3311 -7069 212 5825 -4287 -2474 6629 -616 -4408 5047 2578 -5098 1524 3986 -4277
732 -4277 -1945 3606 -2208 -3432 2509 -59 -2893 1861 1381 -1844 1854 2164 -1841 1211 2788 -2456
748 -2456 -784 3154 -2135 -3389 2653 -117 -4518 1358 2453 -3515 -70 4171 -1459 -1452 4424 365
764 365 -3187 2990 2112 -4480 -198 3533 -3367 -3523 3311 184 -4298 1295 3165 -2004 -731 3251
780C251k551j856K389j46j724L09J3k37K41r56J28J770r73j172K636M94k639J424
798D01K253k724r28K768j289k434J980L01k354J300J173k056J162K197k489K6
814g13L774j926l153L923J122n388P52M416l453l406M266J369m274N96L989r12
830I82k355J706K266j179k090J154J991k284k717K633J430m215l57M446j264l415
846c268L341K518l226J93L140j350j443J575q13j221J159j291j624K419k03l189
862c283K529K886l692k14M983j491l537L441J741m104k67K762j576k148Q11P80
878c79o0j002n17K813Q57l797J605N113l943l979O467Q80q015K271O113o021l419
895e013O895p69n263M083K290m080K148K589l959J498L525n174p80O097m150n120
$$ plain form
780 3251 700 -1156 1233 1087 -637 -328 -315 -552 -311 -1267 -1139 631 -342 -1514 1122 1616 -1023 401
798 401 2654 -70 -998 1770 481 -1953 27 328 -2026 -726 447 -1609 -447 1750 -739 -713
814 -713 3061 1135 -2018 1905 3027 -2361 -1609 2807 -646 -4052 214 1583 -2691 -2095 1894 982
830 982 -1373 333 2599 1420 -670 484 2475 191 -2526 107 1537 -2678 -3035 1411 147 -3268
846 -3268 73 2591 -635 -442 2698 1348 -95 1480 667 -554 605 -686 -2310 109 -94 -3283
862 -3283 -754 2132 -1560 -1774 3209 1718 -1819 1622 3363 -741 -1008 1754 178 -1970 -1159 -379
878 -379 -439 -1441 -1958 855 1712 -2085 -480 4633 690 -3289 3178 4058 -3957 -1686 4427 -1594 -5013
895 -5013 1882 1113 -4150 -67 2223 -1857 291 2880 -1079 419 3944 -1230 -2010 4087 -63 -5183
911e183O952O69p962L927N794o663q13P323k901l885N497k68m302L496J17m492
927b694L648P67o439M011M679q632O54J0461o861o733J2592M94j3170P520R073
942I370j2994j786J2886o691q781J0906N99j0550O548N354r550K641Q151q081
956a978j478J0051n568o383J0079r98j0225P317M501j1141K789Q786q965k023
970e236J0835n318o179J0879j211j0088R331L877j3450N012J0625j3577l314J6164
984H350p263j2583J5228L854j6919O890J2977j3384l539J4608n461r475J0272
997C555O82r850N985L154q960M348N385r416K303R598r213l002J3248n326j0363
1012g872J3005K291j5729P035J1108j4973k919J6079p168j1370J3735K808j3793
$$ plain form
911 -5183 1769 2438 -5524 -1597 4197 -2466 -3279 4044 1143 -2742 2755 2487 -1815 1681 1798 -2694
927 -2694 954 1721 -4718 -707 3972 -4660 -4006 6455 -406 -7139 5453 5947 -7223 297 9370
942 9370 -3624 -5410 7476 785 -7996 2910 3509 -7041 -493 4861 -4689 -2048 6103 -1978
956 -1978 -3456 6595 1027 -5356 4723 3725 -6500 817 5318 -5823 -3034 5752 -3213 -5236
970 -5236 5599 281 -5898 4981 3770 -6318 3013 6890 -6560 -1548 9077 -4500 -7814 8350
984 8350 1087 -11496 3732 7586 -9333 -2443 10534 -2850 -6389 8219 2758 -6717 3555
997 3555 4237 -5613 372 3526 -5434 -1086 4299 -5117 -2814 6784 -2429 -5431 7817 2491 -7872
1012 -7872 5133 7424 -8305 -1270 9838 -5135 -8054 8025 857 -10513 3222 6030 -7763
1025g763O778R072j1242j79J0775p182n152R999k962q268P966J490r350M920N314
1040D216q406J579P497o520j382Q518n047m704R631k462r629R152L783j3375L743
1055c406J1399j1039n112J4295k944j1614J0158N718j2314K140J0196p678m907
1068e108Q890j234o907M163K226m254J346J325k063K530L00l896L994K741o972
1083b919J470P340o578m626R405j158r561O369N580r537L33R059n453m594Q430
1098C560n96p194N344L366p064J156N275m723j977M819j920k754L639n65k605
1113b239L191J53k950K942R30l880K492K206n008J174M658n289k119P222k543
1128I40o428O707K951q455K225P516o172l447P956j238o543M757K746o017J193
$$ plain form
1025 -7763 -985 8087 -3155 -3334 7441 259 -4893 5106 2144 -6124 1842 3332 -6018 -1098 4216
1040 4216 -4190 -2611 4886 -1634 -3016 5502 455 -4249 5382 2920 -6709 2443 6226 -7149 -3406
1055 -3406 7993 -3046 -8158 6137 3193 -8421 1737 7455 -4859 -2719 7477 -201 -5108
1068 -5108 3782 2548 -4359 -196 2030 -2224 -878 447 -1616 914 1214 -2682 1312 4053 -2919
1083 -2919 -1449 5891 -687 -5313 4092 2934 -6627 -258 5322 -4215 -3882 5177 -276 -4870 3560
1098 3560 2964 -4230 1114 4480 -2584 -1428 3847 -876 -2853 1966 46 -2708 931 366 -2239
1113 -2239 952 1105 -1845 1097 2027 -1853 639 2845 -2163 -989 3669 -1620 -3739 3483 940
1128 940 -5488 1219 4170 -4285 -2060 5456 -716 -4163 3793 2555 -3988 769 3515 -2502 -1309
1143a309M053m124p12M145k560j824M176j217l035L840L15l996K923K006m853
1158b172J250M195m510j673N590j934m438M599J509n031K096L308m121J66M074
1173B908l380j621M856k028m173M787J176n972K270M628m933j553N685j590m040
1188b980M055J272m191J745K598l427o1L055k463j483L211j004k578K654N56k846
1204a887J786J714k810O92K722k516r92L387j239k792K712P81l368J035K151k490
1220a114k32K400j503r06K670q50j916K815L62l283J689K447l461r11L617j399
1236D25l055K659J307l012N49K387j392o76J756l12q07J059l53q79R85k77j469
1253a105R87N49j802M50J630j289n29K022k86j306J499N56j680N10R65j492l24
$$ plain form
1143 -1309 2744 -1380 -2092 2053 -507 -2331 1845 628 -2407 1433 1748 -2248 675 2681 -2172
1158 -2172 -922 3273 -1237 -2910 2680 746 -3692 907 2416 -2615 -519 2789 -1332 -1166 2908
1173 2908 -472 -2093 2763 735 -3438 1349 2525 -3447 -1177 3451 -1482 -3035 2650 1060 -2980
1188 -2980 1075 2347 -1844 -99 2499 -928 -989 2066 -397 -1880 1331 327 -2251 403 959 -1887
1204 -1887 -101 1613 -1197 -505 2217 -299 -1291 2096 857 -1935 777 1558 -1810 -775 1376 -1114
1220 -1114 -1346 1054 -449 -1355 1315 465 -1451 1364 1726 -1557 132 2579 -882 -1793 1824 425
1236 425 -2630 29 1336 -1676 -1127 1260 -132 -808 948 636 -171 888 535 -344 641 364 -1105
1253 -1105 -118 431 -1371 -921 709 -580 -1109 913 627 -679 820 1376 -304 206 1171 -321 -645
1270f45J116r77o99J135k69p92J368J87j159J307R94j747J60J898j465j599J827
1287F40J48k408N35J553j201p61J424L77n53L55N20J96J39n55j18P23o98j273
1305i57P31M75j477r3J312l75o11J064M84m31M78L69m33K08M9q89P5K79r83l41
1325a066Q46m42n77J101L47p11P86R12q13r0J016n04j106M63K41j028m72N33K03
1344c61m99k02R36P45o93m6J498mj395M55J040j375r86R48k53j173M04M36m29
1363i54N46M39k92Q13P17q51J21J120r72r98R65l96j534N84L85j255M55J080q13
1382h40K58J576n43l59J530l08j214R92p7j765N92M18j954L34J626j789l42K849
1400I84o28j840K742J127k817Q90K189k414j095K123j398j823J864m10k006K054
$$ plain form
1270 -645 471 -506 -1205 -70 -339 -1131 237 424 -735 572 1566 -181 -21 1877 412 -1187 640
1287 640 788 -1620 -1085 468 -733 -1494 -70 307 -246 109 629 825 964 409 291 1014 316 -957
1305 -957 -226 249 -1228 -1321 -9 -384 -995 69 553 122 600 969 536 744 793 -96 -21 258 -725 -1066
1325 -1066 -220 -662 -1239 -138 209 -502 284 1196 383 293 1309 805 -301 162 403 -625 -1097 -564 -361
1344 -361 -860 -1062 -126 619 -74 -120 1378 1374 -21 434 1474 99 -887 61 -192 -1365 -961 -525 -954
1363 -954 -408 31 -261 552 1269 418 539 1659 687 -311 654 258 -1276 -692 -307 -1562 -1107 -27 -840
1382 -840 -582 994 451 92 1622 1314 100 1092 1015 -750 -158 260 -1694 -1360 266 -1523 -1865 984
1400 984 356 -1484 1258 2385 -432 458 2647 233 -862 1261 -137 -1960 -96 -506 -2512 -458
1416d58J026k328J449K505k278k04L150j586k202K560j73l324J359J270k962L19
1432a877K398j945m00L094r44j366L110m7k584K135R26l553P84K075l623p55L612
1449A040k218k517M268N73l728K829L107l652J50L755k540k213L131j118l347
1464b480K189N33l218J442J995k475Q11L063j908m29L478j324k249K941l40l747
1480a718J813J267m022M88L042k887r38M207r02k434L807R43l413K074K075l847
1496d45j06K964l149k083L344j056k897K862J046k568K051K048k402J091K482
1511C182k775n25K880k524k373L200j127l643L144J353m138K014L919l515m31
1526a359M955j958l020M124m3m711K219J936m650K14L381l001j109L988j289j826
$$ plain form
1416 -458 568 -1760 -311 2194 -84 -288 2862 1276 -926 1634 1461 -1863 -504 766 -2196 -1877
1432 -1877 521 -1424 -1824 1270 326 -1040 2070 2023 -561 1574 2500 -1053 -269 1806 -1817 -2572 1040
1449 1040 -1178 -3695 573 1146 -2582 247 3354 -298 -148 3607 1067 -1146 1985 867 -2480
1464 -2480 -291 242 -2976 -1534 461 -2014 -1203 1860 -48 -477 3001 1677 -572 2369 2029 -1718
1480 -1718 95 1362 -2660 -2172 870 -2017 -2955 1252 350 -2084 1723 2666 -747 1327 3402 -445
1496 -445 -551 2413 -736 -2819 525 -531 -3428 -566 480 -2088 -37 2011 -391 700 3182
1511 3182 407 -118 2762 238 -2135 1065 -62 -3705 -561 792 -3346 -1332 2587 -928 -1359
1526 -1359 3596 1638 -1382 2742 2699 -2012 207 2143 -2507 -2293 1088 -1913 -3022 966 -323 -2149
1542b149M113j31l212L477J381m735J405L284m793j297M609k813l443M858J97
1557G51m611L806L111m902J357M930m124j855N362k337m646M535N41n914K486
1572a510L611n026J11N318l006k082N488r16m010M238J142n355K040L172n188
1587a973m88M536l429k474N221r63m099M792J835n300K534M339n174j010N525
1602C872l138m269M920O7n444L007K905m729Q95M574l321j183N126j823l474M535
1618B520L31n311K442K894n164k47M427l068k300M651n47l469L795J577l978J952
1634E05K971l924m07L696k862k490L740r25l726L233J438m121J809L664l443o43
1650a485M567j694l075L595M47m125J556K046l532j34K885k234j133L346q12k177
$$ plain form
1542 -2149 1964 1833 -1379 2098 3479 -1256 149 3433 -1360 -2657 1952 -861 -4304 554 751
1557 751 -3860 -54 3057 -1845 -488 4442 318 -1537 3825 1488 -3158 1377 1918 -3996 -1510
1572 -1510 2101 -2925 -2814 2504 -502 -2584 2904 1988 -2022 2216 3358 -1997 43 3215 -1973
1587 -1973 -2461 2075 -1354 -3828 1393 430 -3669 1123 2958 -2342 192 4531 -643 -1653 3872
1602 3872 734 -3535 1385 1452 -3992 -985 1920 -2809 -1914 2660 -661 -1844 3282 1459 -2015 2520
1618 2520 2851 -2460 -18 2876 -2288 -2535 1892 -1176 -3476 1175 628 -2841 954 2531 -1447 505
1634 505 3476 -448 -855 2841 -21 -2511 1229 304 -3422 -189 1249 -2872 -1063 2601 -842 -1485
1650 -1485 3082 1388 -1687 1908 2355 -1770 -214 1832 -1700 -1834 1051 -1183 -2316 1030 218 -1959
1666a959L215P43l207J732K347l203o17K932j855k290K440J4k515J553J262j921
1682a329Q26J858j551P3K065j349j063K107q30k283J772N60k846P54K198k118
1698a156p52K942m28j954K108J120k108L60J547j415p14J052q03q28R48n12q40
1715a433J403J75j378J207J384j489j05J840p49j384J189K01j475J33N97q21l6
1732g41N46m59J57Q35m75lJ169m61q49J175J34j614M56J029j503n79J562m26j308
1751a355J117Q55j076J00J108l32m04M77p8j85O6m60j58N94n37p61R85L90j177
1770h31L47J328o77o82J090K65r75J00N45m04k98N3j00J17j4m97M28O66p58j93
1790d90J191j22j116P54P64j183j96R71m34q50O27K82o95J35M46k30K2K91j22
$$ plain form
1666 -1959 1256 1999 -1208 524 2871 -332 -949 1983 128 -2162 278 292 -2223 -670 592 -1329
1682 -1329 -503 1355 -196 -123 1942 593 -470 1637 807 -1476 296 856 -1990 -1236 962 -1156
1698 -1156 -1908 1034 606 -1348 760 1880 -228 132 1679 264 -450 602 -201 -1029 -81 -593 -1433
1715 -1433 -30 145 -1233 -26 1358 -131 -236 1604 855 -529 660 861 -614 -481 116 -705 -741
1732 -741 -195 -654 -497 338 -137 -140 1029 568 -281 894 1028 -586 -130 899 -604 -1183 379 -47 -1355
1751 -1355 -238 617 -459 -359 749 417 13 490 412 227 293 -167 -325 269 -268 -1029 -44 346 -831
1770 -831 -484 844 167 -515 575 840 -135 -35 510 106 -192 -139 -239 -122 -136 -633 -205 461 -297 -490
1790 -490 701 579 -537 217 981 -202 -398 573 139 -711 -84 198 -497 -362 84 -146 -124 167 45
1809D5J59J46m16K34L55o85k38Q53l35r19P36N65j010l3R93k45o25M72K95k44
1829A03o5j02P6M05n49n14R61J54j282L80J308q86r51J340L34j259L22Q50o05
1848B0l62N18j06k02K29k99K2N15m32l15Q13j11q42P43N01j156J65J026q19o22
1868g14J166j27j127P64N79r78J10Q29n65k00O95m33l37Q76m30p61J056J44j443
1887h96O13J188j225n42J456j93j138P94N07q23J51M53n12J73L91p82J64R24r04
1906b01n53J364j54j429R90R51j472j25J431n92j024J048K95j032K90N65m93k5
1924a66L74l46J07L88n65K7P55n55o00R96K0j149M89R21r49m45J120j12q72N82
1944B0M98o93l4N83k44l35L28j1k32Q2P4q6Kk5p1J59J9j48K9J45O3q3j19J62J92
$$ plain form
1809 45 204 350 -66 168 523 -162 -400 453 118 -801 -65 500 -510 -543 450 205 -420 52 347 103
1829 103 38 -64 12 417 -132 -646 315 469 -813 -433 875 -11 -962 378 712 -547 -225 625 20
1848 20 -342 176 70 -132 97 -202 -180 335 -97 -412 401 290 -552 191 692 -464 -299 727 -92 -714
1868 -714 452 325 -802 -38 541 -437 -327 502 -63 -263 432 -1 -338 538 108 -653 403 547 -896
1887 -896 -283 905 -320 -862 594 401 -737 57 564 -259 -108 345 -167 6 397 -385 -221 703 -201
1906 -201 -754 610 456 -973 17 968 -504 -629 802 210 -814 234 529 -503 -213 352 -141 -166
1924 -166 208 -138 -31 357 -208 -181 574 19 -581 415 435 -714 -225 696 -253 -698 422 310 -562 20
1944 20 518 -175 -209 374 130 -205 123 112 -120 -38 36 -50 -48 -73 -144 15 34 -114 -85 60 123 40 -79 83 275
1969B75l15k17M48J15p00J55O68m22n44N90L08n54j12M58J00l14k14L78L95n81
1989h3m80R44K17j272K95J257r77q97J510Q5j564P94J155j385l35J629n72j245
2007i24J231M92j371K35R50p69k95P33l33k84O34l90l25R34k73r23J028M04j356
2026f02M09J101j189m22J352n99r61J254k1j275J108P25j710M64J765j533q98
2043a032K073k97j996J313J002j953J03J659j166p73J610k03j158J123M11j136
2059d20N46O51j004J45P24r49j62J059q58o51J375k88j318J335P78j734M39J684
2077A352j328p80J783m33j524J176M24j578N04J054j327j34J542p48r04J504J41
2094G24j369Q28Q58j321o5J058p44o38Q49j84o92O66J61o24N25L83o64L36N97
$$ plain form
1969 275 -40 -257 191 306 -394 -239 429 7 -537 53 361 -193 -305 153 253 -61 -275 103 498 -83
1989 -83 -563 381 598 -674 -379 878 -99 -996 514 599 -965 -171 984 -401 -736 893 321 -924
2007 -924 307 799 -572 -337 613 -156 -451 282 -51 -335 299 -91 -416 518 245 -678 350 754 -602
2026 -602 -193 908 -281 -703 649 50 -911 343 322 -953 155 880 -830 -366 1399 -134 -1032
2043 -1032 1041 744 -1252 61 1063 -890 -787 872 -294 -1067 543 340 -818 305 716 -420
2059 -420 126 777 -227 -82 642 -307 -469 590 -268 -919 456 168 -1150 185 963 -771 -332 1352
2077 1352 24 -756 1027 594 -930 246 670 -908 -404 650 -677 -811 731 -17 -921 583 724
2094 724 -645 183 1041 -280 -345 713 -31 -669 180 -4 -696 -30 131 -493 32 415 -249 87 684
2113F84p23q5P57n52n58P81j98q58O51L75r30K92Q95o99k51J076k73p77P92K76
2133F75r89K30O04p67l33P26k09o10M91L41m05P6M36K1j96O1K12Ll45j62L95j37
2155A18o68K93N13o44k59Q91p1o68N50N23o04p8O55k82m15L51k2l74J03L2k78
2176c34J92Q7k99K50L27k94p8N26j15k99K61R5l41Kj9q7J46k07k51M62J67o85
2198d94L00Q06n89n19J038J47j126L64Q84r06n39R17q4q78M30M94n21o5M90p4
2218G5j28K33rM1R0k99l7M00l86m90N49J62p65J19P75l95m41O75K53m28K8L06
2240C28p5o3j30j35K60r7o31K54O20p05m26J052J63j029M57R81o50n42Q58J10
2260F00q25Q2M75l71l33J69P4p3p1j3L13J29l07J17N37k54m45N57J34p76Q6N48
$$ plain form
2113 684 -39 -124 633 81 -477 304 106 -752 -101 274 -656 -364 531 -168 -419 657 384 -393 399 675
2133 675 -314 -84 520 -247 -580 146 -63 -673 -182 159 -246 -170 266 287 91 152 364 367 22 -140 255 118
2155 118 -550 -257 256 -388 -647 244 173 -495 55 578 -26 -104 551 269 -146 205 183 -191 -88 -56 -334
2176 -334 -142 -55 -354 -104 223 -71 -149 377 262 -37 224 319 -22 -20 -39 -126 20 -187 -438 24 191 -494
2198 -494 -194 612 23 -496 542 689 -437 -73 811 -95 -634 283 199 -679 -249 245 -276 -341 149 75
2218 75 -53 180 171 212 302 3 -34 366 -20 -510 39 201 -564 -445 330 -65 -506 169 422 -6 22 328
2240 328 253 190 60 -75 185 88 -543 -289 331 -374 -800 252 415 -614 -157 824 174 -368 490 600
2260 600 -225 -143 332 -39 -372 -203 -129 -202 -273 -286 27 156 -151 -34 503 249 -196 361 495 -281 -195 353
2282C53m86m21M68J71m63R0L82j3m3L5P5K06j22m03L18L26p16l16P91p8r37M41
2304c42P96o15m34R03K36p24J16O00k15m23P4K33j07l82p8L75k7n45K29P01l96
2325b5m05O80L56p14N6O42k97n39K97J91m44j08J57k0rn7lL06R5l11K06M54l90
2348A18k81N63M6p50J27N31n06m75N56K59n98k4O47J3m47J43N63j24n05J30N45
2369E31l29p12L82N71o83n08Q22K77q12j3Q91o4o51K27O34k51n77K48M53l84n29
2390d77L63L72n52k19N86P8m50J57M83j45k48J95J30j31j58K3O2r5k80J39K89
2411A22l62k20O15J50o98K79P74n28n69P77K66r02k8O34k42m79J41K80M2k60k24
2432d32N65M03p94k20J274k29j373P43J114j285o81J455p1j349N86Q60p91k08
$$ plain form
2282 353 -133 -554 -86 85 -378 -288 94 81 38 73 148 354 232 -171 147 473 -243 -559 232 154 -783 -342
2304 -342 454 -161 -595 308 544 -180 -64 536 321 -102 -28 205 98 -284 -362 13 -14 -559 -330 371 -25
2325 -25 -430 250 606 -108 -52 590 293 -246 51 242 -202 -310 -153 -173 -182 -239 -242 64 159 -152 54 508 118
2348 118 -163 400 446 -304 -177 354 -152 -627 -71 188 -410 -434 213 226 -221 -78 485 361 -144 -14 531
2369 531 202 -510 -128 443 -240 -748 74 351 -461 -474 417 353 -298 -71 563 312 -265 -17 436 52 -477
2390 -477 -114 258 -294 -513 73 151 -299 -142 341 196 -52 143 273 142 -16 7 69 -26 -306 -167 122
2411 122 -240 -460 155 305 -393 -114 660 132 -437 340 606 -296 -324 310 68 -411 -270 10 52 -208 -432
2432 -432 133 536 -258 -478 796 567 -806 -63 1051 -234 -915 540 469 -880 -294 566 -225 -433
2450d33O54m7k69K48j63M8K85m67j23P34l94p98R46L51j348L56J376j104q43J615
2470F24J25j596O36J118j056m65R78j66n20L79j09j88O27m22o51J187J86j555
2488h68O22J438j401q21J770o2j651Q05J010j212j51R84m86l46P20l52l31P94
2506D62l79o72R93L6j251Q12R18j568m1J767r34j411J779N12k042N03J679j211
2524d8r64J477N4j061M98L74m85K87k7n55P21K81j264L83J336j199q70J677O0
2543F75j692P95J177j283l02J229m53o61Q18m2o88O36J02p96M96M33r30J82R14
2562F10q41l82J204k77j114J021N95j364Q0J335p41r27J010L58j001J03O59k84
2580D4k38J19N3J89m0m79L81N11p40l70J033q2j043M75P87p60l80Q30o7n61L26
$$ plain form
2450 -433 221 174 -95 153 -10 38 323 -144 -267 467 73 -725 221 572 -776 -420 956 -148 -991 624
2470 624 749 -847 -211 907 -149 -614 364 198 -322 57 -52 -240 387 -35 -686 501 687 -868
2488 -868 -246 1192 -209 -1030 740 678 -973 -168 842 -370 -521 463 -23 -369 351 -1 -332 462
2506 462 83 -589 404 440 -811 1 919 -649 -690 1077 143 -1268 511 1023 -1019 -516 1163 -48
2524 -48 -1012 465 519 -542 -44 330 -155 132 105 -450 271 552 -712 -329 1007 -192 -1062 615 675
2543 675 -1017 -222 955 -328 -630 599 146 -515 303 261 -427 209 311 -485 11 444 -486 -304 610
2562 610 -231 -613 591 314 -800 221 816 -548 -468 867 126 -801 209 567 -434 -331 328 44
2580 44 -194 -75 -22 167 127 -352 29 540 -200 -570 463 381 -662 -187 600 -160 -540 290 223 -338 -12
2601a2K32l13R3J07k02J57Q2l76J03L70l71k07N04m1m40K89L48m45m9M75j22l89
2623b07K20K18k59j94K11J45k77j58L05J67l74j13O10k3o06K41N60m05m09M80
2643A32K06n37j04M41m8l23P0K18K5j49l1K25R3l04k0L34j04l05J68J32j98j03
2665a82J61K0n6oL7O6M7j11P1J48k02j05L06j13l95K54K93m92o0N56j58m19L48
2688HL65m15j10L79J9l31L9J63r4j20j7O6R4k01r1L34M4l04J47L26k34j68K97
2711A96j6k60O4R0j91k4J10j29L3J31j15K6J99o2j00K31j8k55J94J47l66k6L25
2734A84k07l31L00J66l14k6L48l2j96J17J55n2n7k2O6mj49n4J71o4j85J08J25
2757D7j22k8J59J1j08J43K5j27P5N0j81m1K29j43j51J01J01j11n0J43K3l5MKJ16
$$ plain form
2601 -12 220 -93 0 107 -95 62 144 -232 -129 241 -130 -337 167 126 -314 -25 323 -122 -171 304 182 -207
2623 -207 13 231 -28 -222 -11 134 -143 -301 4 171 -203 -316 294 271 -335 -94 466 61 -348 132
2643 132 338 -199 -303 138 90 -233 -163 55 80 -69 -100 125 218 -86 -106 228 124 -181 -13 119 -79 -182
2665 -182 -21 -1 -57 -63 -26 40 87 -24 47 195 -7 -112 194 81 -314 -60 233 -259 -319 237 79 -340 8
2688 8 373 -42 -152 227 246 -85 -46 117 23 -97 -114 -48 46 -155 -246 88 132 -172 -25 301 67 -101 196
2711 196 180 -80 -16 74 -117 -141 -31 -160 -127 4 -111 -85 114 52 -48 183 165 -90 104 251 -115 -141 184
2734 184 -23 -354 -54 112 -202 -228 120 88 -108 9 164 112 55 33 99 95 -54 -108 63 -1 -186 -78 47
2757 47 -75 -103 56 67 -41 102 127 0 75 125 -56 -97 132 -11 -162 -61 40 -71 -121 22 45 10 14 16 132
2782A32j2j53kJ80j23j68R7J35j56j39K04J07j94k5K14J4j68L4J78q9j42R1O9
2805H4j14r7R2J8j05P1P8m9m4J20J0q3OJ65p1j60P0K20j85k68K35K36l71j21L94
2830A31K8l98J37L58j88k67K21J39j65p7J7J37k6k01j6L25p5l39K22L50l99j65
2852b51M31J7m63J79L26l05j39K96l8j88J33P6o7L5m4k2J93j59j67K80J25n55
2874c07J44N37m73l89O66J38p59K38O90m77m10O08J52n86J00L36j97j58Q6KR7
2895C8n1k24K42K92n03q8P05j95o85N61M36p83j15Q40l22o21N41K52n48N0L52
2916A74k76J5K39k94N5M17m28k14O28j43o62M91M77p77p3P87l28n44N65K12n95
2937b74J74L81l52r8L18j85n9K02k01m4L94l14k89O27L3q53M84P45r37l84J189
$$ plain form
2782 132 120 -33 -35 145 22 -146 -49 86 -70 -209 -5 102 -92 -117 97 111 -57 -23 155 66 -76 15 84
2805 84 -30 -127 -35 -17 -122 -51 27 -22 -66 54 64 -19 -13 152 81 -79 -9 211 26 -242 -7 229 -142 -263 131
2830 131 159 -239 -102 256 68 -199 22 161 -4 -81 -64 73 47 -154 -170 155 80 -259 -37 313 -86 -251
2852 -251 180 197 -266 -87 239 -66 -205 91 53 -135 -2 74 7 42 -2 -24 169 10 -157 123 248 -307
2874 -307 -163 374 -99 -488 178 316 -443 -205 485 8 -402 206 358 -228 -128 208 11 -147 -61 -59 38
2895 38 -13 -237 5 297 -206 -294 411 216 -469 92 528 -255 -370 470 148 -473 68 320 -228 -178 174
2916 174 -102 -87 152 -142 -87 330 -98 -312 316 173 -489 2 479 -298 -371 416 88 -456 109 321 -274
2937 -274 -100 281 -71 -169 149 -36 -95 107 -94 -138 256 -58 -347 280 313 -540 -56 689 -248 -632 557
2958E57j55j095N93P59q63l28Q73r4n92K75K51j80k6j9j01L05n1m96L96M00o37
2979b28j24P70k59n91N34K93o66J09N08m20j86M72j67l04L45K4l53K59J63l64
2999a85J88K85m63K9N58l70m72O30J55p93J81O64m41m60N82J97m67m6L41J02j93
3020B2j57J69K75l42l37N15K13o82j6P15k96n53M63L74n17q7N29j59l05K41J33
3041A98k35l0R5k5m3l5KJ01o5j54J99J57k17j11L17Ll05J27J79j12k06Q6J21l2
3065A5j91l0L89p2m21K20N05m09m00O34J60o72N0N88l11m69L92K48l51j39K81
3086A7J32j82r9K01J62k75j30L81jm74J70M10m25k79N09M3n00K00M28l20j51L39
3108A56l2j49J13q6k4K22j93l12M34R7o22J76O34m56m15O80J68o89J31N36k53
$$ plain form
2958 557 402 -693 -100 659 -204 -532 341 247 -345 -70 181 1 -25 -44 -145 160 109 -387 9 409 -228
2979 -228 -352 418 159 -432 102 395 -271 -162 346 -74 -260 212 45 -259 86 110 -243 16 179 -185
2999 -185 3 288 -175 -146 412 42 -430 200 355 -438 -257 407 -34 -494 88 285 -182 -228 113 215 22
3020 22 -135 34 309 -33 -370 145 358 -324 -340 375 79 -474 -11 363 -154 -241 288 129 -176 65 198
3041 198 -37 -67 28 3 -40 -75 -73 28 -37 -191 8 165 -52 -163 154 157 -148 -21 158 46 -160 -74 47 15
3065 15 -176 -206 183 111 -310 -90 415 6 -394 240 400 -272 -222 366 55 -414 -22 226 -125 -264 17
3086 17 149 -33 -132 69 231 -44 -174 207 206 -268 -98 312 -113 -392 117 160 -340 -140 288 -32 -183 156
3108 156 124 -25 88 2 -22 200 7 -305 129 226 -396 -220 414 -42 -457 223 391 -298 -167 369 116
3129A16l66K65J49j95j20M6J89Ml60J21M85l51m08O27K21q07J96P24n35n14O90
3150A77K04p93K48N38m51k49M59L7l01J14Q1o1J46j53j82L67L2n53K00N25m88
3171a03l26O16Q7o37J82N27k92k46K44J10j34j37M3K19j8l99J20M85l85m70O65
3192A51K33q09J24Q55m40o43P50L03q04J1O79k70n13L61K44l41j14K26P7q8j24
3213a32Q0L00j83l19L28K56m77r2M82q3m81K18L24k95j60K48P8j27m2J00J28n1
3235A00k36J28K86k89l29M74J45n96P6N81k97m85N21K73n20r1N75j01m69J90L54
3256B90k26l06J81K60k17l03L04K60l68j78M48J26m83K5M86j35l98K11K73k76
3276b6k04K30J21k30p9K09N5j32r3K12Q6k02m7K91l1k99P2K74j52k59J91J76k74
$$ plain form
3129 116 -250 15 164 -31 -151 -105 84 88 -272 -151 334 -17 -425 202 423 -384 -188 536 1 -513 177
3150 177 381 -412 -164 374 -77 -326 133 170 -131 -17 64 3 149 -4 -186 181 213 -340 -140 385 -103
3171 -103 -429 187 274 -363 -181 346 54 -192 52 162 28 -109 -66 153 135 -264 -144 341 -44 -514 151
3192 151 384 -425 -301 554 114 -529 221 524 -280 -269 410 140 -373 -12 232 -109 -223 3 80 -8 -132
3213 -132 -52 248 65 -254 74 330 -147 -239 243 160 -321 -103 221 -74 -234 14 92 -35 -77 23 151 100
3235 100 -136 -8 278 -11 -340 134 279 -317 -241 340 43 -442 79 352 -168 -259 316 215 -254 -64 290
3256 290 64 -242 -61 199 -18 -321 -17 243 -125 -303 145 271 -212 -187 299 164 -234 -23 250 -26
3276 -26 -230 0 121 -109 -188 21 76 -56 -149 63 149 -53 -100 191 160 -139 -67 207 55 -204 -13 163 -111
3299a11j45L06N8k45K4K82p0l03K08K10k30j69K88N0l10K0K29n8k10P6K03r8j72
3322a67J54J67j23j61J83J31j92j30K13Q9k77m0K60m9k08Q3J52q5r0N7J21Pj23
3345b8l6J87k3k29M4K56j89k58K67J94l49k2L46q6k29K07J37k12k9J60n1j49P8
3368a4L3q2Pl4M3N1o1mJ90o1j67J70J47l05l3L29j46l45K51J97l30m8K71m4j53
3393a38J14R1o6O1j4r1J62Kk73M5K90k34k23L06J09l41L7K89n8j83J64Q7m4q0
3417A2m5J03M5j98j05K60j0l18J84K72l10p4M11r6k86K26J90l54o7L45j53k92
3439b60K40J48k78n4K87j3j78R4J42n5l2k6Q1N0k08n3K06k6k97R2K47j90j23K52
3463D6P1j39N5O5k1qNq4M6J7j82J2K07j52k06K38J60k84O0K80q3j94J95J37k45
$$ plain form
3299 -111 -256 50 108 -137 -113 169 99 -204 4 214 -16 -185 103 153 -157 -137 92 34 -176 -100 103 5 -167
3322 -167 -13 154 31 -130 53 184 -8 -138 75 164 -113 -153 107 58 -150 -67 85 0 -90 -33 88 95 -28
3345 -28 -64 123 100 -129 -85 171 -18 -276 -9 185 -164 -186 160 74 -155 52 189 -23 -52 108 57 -92 -14
3368 -14 19 -63 -56 -90 -47 4 -57 -61 129 68 -99 71 218 -87 -120 209 63 -282 -31 166 -164 -212 59 15 -138
3393 -138 -24 67 1 62 48 -43 119 121 -152 -107 183 -51 -274 32 141 -200 -163 126 68 -115 49 136 92 12
3417 12 -33 70 115 -83 -188 72 62 -256 -72 200 -110 -184 227 131 -155 71 261 -93 -160 185 32 -260
3439 -260 -20 128 -150 -204 83 70 -108 -14 128 73 41 15 96 146 -62 -115 91 65 -232 -140 107 -83 -206 46
3463 46 117 -22 33 98 77 69 74 -10 36 53 -129 -117 90 -62 -268 -30 130 -154 -94 186 103 -91 104 241 -4
3488dr8K45o8k38J07R3j07q1J13R2p9l9J47P5j51l4K40j21k19J06J66k24j14J70
3512b3Q0k27L6J98l2j10R6J55r9p6P2L1q9o4L8j7m4k0N3k0J8oK8J16k5n7O3Q5
3540A60j19r7J67m8j66j2J48j55p1J52K8o4P0O5j7M5jkj1j3p3RJ7j29NJ03j11
3567a20m9J42N5j13P6J86j52m3K04p6j99J51L1k21J4J68j97n0K20m7j49K47P5
3590A53k10R6J76j76q3J39p3j00P2m3j21R1K0q9J61J6j07O5K20j96j5K37r8k58
3614a23J73N2k71K0K08j88p6K36k0j18J45Q9j46J51K8k00Q3J33k51o0K04j16k49
3637b96K01J74k35QK68l7j35J34O5m6n1j8L4Oj42p1J75n1k41J70K07k24n4L35
3661A76qk77K21J68k76n9K22j03k28P9P2j10l5J13OK4l7K3J28lj34Q4J70j92j60
$$ plain form
3488 -4 -102 143 75 -163 -56 37 -70 -151 -38 54 -25 -64 83 158 7 -27 213 92 -127 -21 145 -79 -193 -23
3512 -23 57 -170 -134 64 32 -78 18 173 74 -2 70 101 12 -52 -14 -31 -75 -95 -42 -62 -44 -50 -22 94 69 12 75 160
3540 160 41 -56 111 63 -103 -115 33 -122 -193 -41 -13 -77 -7 58 41 86 85 83 72 59 -14 -5 12 -117 -112 -9 -120
3567 -120 -169 -27 28 -85 -9 177 25 -18 186 110 -89 62 93 -128 -114 54 -143 -193 27 -20 -169 78 153
3590 153 -57 39 215 39 -44 95 22 -78 -6 -49 -170 -79 -59 -148 13 29 -78 -13 207 11 -4 233 135 -123
3614 -123 50 102 -169 -149 59 -129 -205 31 11 -107 38 127 -19 132 160 -40 43 176 -75 -135 69 -47 -296
3637 -296 -95 79 -156 -148 120 83 -52 82 147 101 50 32 66 72 -70 -141 34 -17 -258 -88 119 -105 -159 176
3661 176 168 -109 112 280 4 -55 167 64 -164 -85 -13 -123 -158 -45 -39 -15 -52 -29 99 96 -38 46 216 24 -136
3686a36K22nk63J9K36j10j41J15J28n2m1M7J03j3j18O2J36j55j87J64O4k97OL01
3710H5q5k30K37J92k34l1K82k6k24J2J44o9j80K8J05o2j50R0J89j31j04K00J49
3733A87k16kK56o0k76J07J60j95j18J19M1j07m1J26L4o9J4J27Q0j80OJ96o6k56
3757a33J09J60k09j71K53N6k39J6K40j1j80J11J36n6j40O9J43q8k18J04J68j97
3779g7j46K13Q1k38O0K36n8j81J80R5j57n2J03L1j53l4J03J8j30m1J64M4j63L2
3803g0K24q3j94J91J48k54j13K89n9k56R0J53j36j11J43J04o9p4R2J26o0j34J35
3826H2J06k26j07K45l6k56J27J88j90j14K34M7j60O1J29p3o6R3l2m6l4J0k5N6
3850A3o8r8J61j7j27J37J51j81m0K05m0j88J17P4j59KR5p3rM0m3L2M7q2L9J34
$$ plain form
3686 -136 86 81 -182 -163 73 -37 -178 -63 65 13 -28 19 122 109 -9 53 189 34 -153 11 75 -222 -216 85
3710 85 0 -230 7 199 -35 -66 216 190 -34 -22 122 53 -127 -99 6 -56 -206 -116 73 -58 -162 38 187
3733 187 -29 -31 225 165 -111 -4 156 -39 -157 -38 3 -104 -145 -19 15 -54 -40 87 167 -13 -7 189 123 -133
3757 -133 -24 136 -73 -244 9 65 -174 -158 82 71 -109 2 138 82 -58 11 154 66 -152 -48 120 -77
3779 -77 -223 -10 71 -167 -107 129 71 -110 70 165 8 -44 59 90 -63 -97 6 24 -106 -147 17 61 -102 -70
3803 -70 154 71 -123 68 216 -38 -151 138 79 -177 -87 66 -70 -181 -38 66 -3 -77 15 141 81 -53 82
3826 82 188 -38 -145 100 64 -192 -65 123 -67 -181 53 100 -60 1 130 57 -9 84 52 6 -28 -18 -43 13
3850 13 -55 -153 8 -9 -136 1 152 -29 -69 136 96 -92 25 99 -60 -58 37 -36 -45 -5 -48 -16 31 -51 -12 122
3876A22o6j35J56J01k81L7K44j88j96K42M4k23O8J87j44n8J46K1q5N2k1l5L7l9
3900a4n0P7l5j27J19R9j48kK08j00j47K20J0j95J03J12j64l5J49q8j13J41J7j59
3924a22J31N0j15M5J25j25n1J28rj06N2M3q9pN5r5N4L7n7K6P4o4k5J27n2j00J46
3951G6K8j46mJ31j08q0J29nj12O9J01j38L6R8o5k6R6o1n8M1L1p3J3Qpk5L3lL2
3980A1j9j4K1L2l7K1M5q8k5R8m3j01P5J20j46qR4Kp1K5O9l9l9N9Rl2o1M9N2j30
4010g1L6P8n9o1O2P1j21mJ66p9q6J01M0j29L7O4o3m4R4m0m5N9J3q6P5K3o9K9R1
4039H2q7o0J24l0p2L9M8p6K9MoJ0j1k0N3M2j26K1J36j31n1J35Qj60M8J59j51q2
4067a25J82Rj87J34J16j42m2J36q5o5Q0J3n7J4kk8K6O4r0N2O7q6J0Q0o4n4O5K3
$$ plain form
3876 122 56 -79 77 178 -103 -66 178 -10 -206 36 80 -143 -75 112 -32 -90 56 77 -8 44 23 -12 25 -14
3900 -14 -64 13 -22 -149 -30 69 -79 -81 127 27 -120 100 110 -85 18 130 -34 -69 80 -8 -121 20 37 -122
3924 -122 9 59 -56 -11 114 -11 -62 66 57 -49 3 46 -43 -50 5 -90 -36 1 -56 -30 44 -20 -45 82 30 -70 76
3951 76 104 -42 -46 85 -23 -103 26 21 -91 -22 79 -59 -23 75 10 -16 80 19 -39 2 33 -40 -27 -19 -26 -51 -18 -21 11
3980 11 -8 -22 -1 31 -6 15 60 -28 -53 45 2 -99 -24 96 -50 -58 36 38 -33 -8 61 22 -17 42 51 19 -42 7 59 -71
4010 -71 -35 43 -16 -77 -15 56 -65 -69 97 18 -68 33 73 -56 -19 45 -18 -62 32 -8 -53 6 19 -67 8 31 -38 -9 82
4039 82 -5 -65 59 29 -43 -4 44 -32 -3 1 -5 5 -6 -26 27 69 -57 -36 100 -31 -82 53 61 -99 -51 108 -43 -125
4067 -125 57 66 -121 13 129 -13 -55 81 -4 -69 11 24 -33 -19 -21 -49 -23 41 -49 3 70 -16 -6 74 10 -44 21 44
4095D4j01L0L1m4mO8m5j5O4o1pJ03l2j26J39J5j55K7J63j05r4J29L3j66P9J03
4121G3l1q6Q6J4q4PP6n3j5loJ5j6j1L9J9n5K8M5o0qJ18o1q2N4N7j01LN9l4p1Q7
4153CJ2o7K9P5m7qP2k7n3M7Rn4k0Q8m9p4N0K8p1K7L2J4rl2O2j7l8M2J4k2l3kK0
4186Al6j4O3j5n2M9M8l1l0P7k6n1K4J7k7j5K1Jo9O7OJn2O8j9Rj3L1j4l2L9j3l9
4219b6J2K0m8k2RM2j2qM5mJ2L5j5m2%M4j7q6QM1j7j4K6O1q3rO6N1q7J7R2n7o0
4252b6L6L3p8kL2j5m6M2J8mJM0J1j7qj1K3mk2k0K0n0j5N8rm4L3N6n6j0P3J2n9
4285hM5rql8L9l7mMl9K3Qj1PO7j3n7N5O8r3k3N1j7o7M6J3q5J7Q5m8j1K7J8oJ3
4319A2Pm9R0o2k3K0N8j21K0O1m6m6P8K6n7L3P8r0j0P6l6j3Ojk8N1o1l1L3%n1P8
$$ plain form
4095 44 -57 -27 4 -40 -44 24 -21 -36 28 -33 -40 63 31 -95 44 59 -96 -69 94 -11 -105 24 57 -109 -30 73
4121 73 42 -44 42 56 -28 -21 55 2 -13 -16 -22 -7 -23 -34 5 24 -31 -3 42 -18 -26 92 31 -51 3 60 -41 -38 21 -13 -84 3
4153 3 15 -52 -23 52 5 -3 69 42 -11 36 45 -9 -29 59 10 -64 -14 14 -57 -30 2 16 7 -25 37 20 -18 24 38 16 -17 -19 1
4186 1 -35 -49 14 -1 -53 -4 44 13 -17 60 34 -17 7 24 -3 -18 3 4 -65 2 8 9 -43 25 6 15 2 33 19 -13 26 13 -26
4219 -26 -14 6 -42 -64 -55 -13 -25 -33 12 8 20 55 40 -2 -2 42 25 -61 -53 -12 -29 -43 -17 44 -39 -48 18 69 -18 -1 91 34 -26
4252 -26 10 43 -35 -37 -5 -20 -66 -24 -6 -10 -9 31 42 25 17 6 29 25 3 -17 3 -47 -62 -4 -13 -57 -24 32 -24 -34 39 51 -8
4285 -8 37 28 20 -18 21 -16 -20 -16 -55 -32 -24 -35 -28 39 26 -31 24 92 -1 -24 27 10 -57 -11 2 -83 -66 19 -29 -40 -13 5 -1 12
4319 12 19 -30 60 -2 -25 -5 53 -68 -48 13 -33 -79 -1 25 -32 1 79 -11 -21 55 19 6 12 11 -17 34 -27 -58 -25 -25 -76 2
4351BO3j18J4J13l3r8J11J0j46O7J02j29o5J00J2p5O6jrMPJ7M6k0p3N2L6j05J4
4380c6Q5l8p7O5L1j00K5R7p3qQ0Lo4pK7k6j8K5mQkm5L3L5m7j5P9kn3K6J3oj9L4
4414B6rn2J7Ok7J5K6k7O6m1k4O7j0o7L3K9l7k7O4rq4K3M2j0m7M0L4%n6N7L4n4
4446bo9J24J7j10kR6o0p0R7L0j34M9J09r2l7N3K7l7K1oOk1J3k1L2m1j2N5J6q4
4476e3L6R4r0o0J24m2q1N6Q4j24K1M3k8j2L5l9J0L0j6OM3j2j02M1J44j21m9J15
4504E3j1j21P9M8q8%M6Rm5M6J2l5K6j7k9L5K2o0K4K6q4K6O9p1m2J15K5j28L4J05
4534F9j11m3J35l9p0M9L0j9J1j3l4N6mn8P4L0j27J0J44o8j00R4O6j35kJ07m5n1
4562d4L1L4n9NL1kj2k0M0QQm2JN5q0MP5k0p8L1O8j00K4R9m3p5R2K9q7pQ6j4n6
$$ plain form
4351 2 65 -53 -39 74 41 -57 54 64 -82 -15 87 -42 -107 -7 5 -70 -4 -5 -14 -10 -3 14 60 40 -33 19 55 -50 -36
4380 -36 49 11 -66 -1 30 -70 -45 52 -21 -29 51 54 -10 -17 10 -16 -34 -9 -13 -5 -7 -52 -19 16 -31 -46 33 31 -22 4 17 11 -8 26
4414 26 17 -35 -18 -12 -39 -24 2 -25 41 0 -24 43 33 -34 -1 28 -9 -36 28 19 -65 -42 0 -10 -57 -17 17 17 -39 18 52 -2
4446 -2 -71 53 70 -40 -42 54 -6 -76 21 51 -83 -34 75 -17 -54 -1 26 -11 10 4 10 -11 2 -19 13 -28 -40 15 31 -53
4476 -53 -17 77 -13 -73 51 9 -72 -16 68 -56 -35 8 -20 -32 3 -36 -26 4 -12 -6 37 25 -77 -36 108 -13 -62 53
4504 53 42 -79 0 48 -40 -40 6 15 -30 16 28 -7 19 2 -27 8 30 -30 -6 20 -64 -38 31 -40 -82 33 58 -70 -36 69
4534 69 -42 -85 50 11 -59 -10 20 1 12 -1 -35 21 17 -41 33 63 -64 -54 90 22 -78 16 82 -53 -55 52 7 -44
4562 -44 -13 21 -38 -33 -2 -4 -16 -36 4 12 20 -22 -21 34 -46 -42 33 13 -65 -34 34 -66 -42 57 14 -61 31 60 -27 -34 52 38 -18
4595a8L9k0ojl5KM2J0o5P4kn4qO8k5o1N2J0l6KO3l4k8L3N1r0L0Lj0J3%J2j1K8
4629B8o2N5%l5j4P0j4r5O5N1p9j7J00j0q2K2P0o5j2OK4nm9L5M7k4o0N7%l0NM8
4661C0j7o2N9J5m5PL5k3l3%M7roNj4LJ0l4K8Lm5L5K9l9n2J04l2m0L1K3l4k4L9
4694fJ6j8J7j9J8k9mkL7l2k3O5J0q6J2R4l2o6O0L7q3L7M7n7j2J9J1k7J1k2J2M3
4726B8m9k4Q9k4o7K1O0r2K4N7j5n0O5K2q2RQ5q0qN9l7j2L3mm8P6jr4N6M6r9N1
4758eO9p1o2J16n4j00J40J1p9J7P4p2m9J02m8m9Q0rp7N9J4o3N2N2q0j0Q0m3o0
4787f5R9k1o3Q1J2j06N8P0q1j8Q7p9n6J15J2r6P4M2j04J2P9q8j8R9m9q2R7K5j12
4816g6P3N4r8L3O0o4l0R3n9m9R1k0o7M3P2q6j5R0o8n1J64n3o1O3Kq1M5N7q6j6
$$ plain form
4595 -18 21 1 -5 -6 -41 -39 3 13 -52 22 20 -34 -42 26 1 -60 -8 2 -34 -32 31 -3 -31 2 53 -37 -7 -4 -14 -1 -1 11 0 28
4629 28 -34 21 21 -14 -28 42 28 -67 -2 49 -30 -47 53 43 -39 -17 53 -12 -24 -18 6 1 -48 -13 34 10 -50 7 7 -23 -18 30
4661 30 13 -49 10 25 -20 -13 22 -1 -34 -34 13 4 -2 3 -11 -8 2 -32 -4 -1 -46 -11 18 -21 -73 31 -1 -41 -10 13 -21 -45 -6
4694 -6 10 -8 9 -10 8 -21 -25 -27 10 -22 -45 20 30 -56 -44 50 18 -48 12 49 -34 3 50 -7 -19 0 11 -16 -5 -27 -15 28
4726 28 -21 -45 44 20 -47 -26 34 -58 -34 23 8 -42 23 45 -37 -28 57 -23 -31 28 -9 -21 12 8 -40 36 35 -59 -3 43 -56 -5
4758 -5 64 -7 -69 47 -7 -107 33 44 -35 -18 56 -16 -65 37 -11 -60 20 11 -66 -7 7 -56 -4 48 -32 -42 38 -5 -65
4787 -65 34 13 -50 31 43 -63 -5 65 -16 -34 53 -26 -82 33 45 -51 23 65 -39 -27 52 -36 -54 45 -4 -86 11 36 -76
4816 -76 -3 51 -47 -14 46 -18 -48 45 -14 -63 28 8 -59 -16 56 -30 -45 45 -23 -74 90 37 -24 39 41 -40 5 62 -24 -40
4846d0Q1l8o6J00m0n0P3J1o6L7O8j03mO5l4n1O0J6n9L1jm5N0K6n0J7M4m3oQ4m3
4877B4p5P6J0n7PN6p2j2O0kl3J5L4j8MRj0MNn9MK1j5rK6l4%OL6lMK9nl3K2j2K0
4914B3l2j4lM6l6j7L2mrJ2L1o3J5O0k6l4M6lpl3J5Jk3jlK6Np5N6N5n2oN8j6m5
4949b1N6Oo7J0J9nl2K2Rj8L7rk8N7om9N8jn1J6L8n5l9N9k2m1O8K3o7M0L5m0J1
4982A3L6j5n3N4l3Lpml4K0L3l1m1R0l0n5J03ok3K2%m2k6L9k8j9K7ok5N7J8n0J5
5015BRj2L0K8o5lM7m6k0M0mo3J1Q0p0k8Q3K0m9L7K0n3j5K1Qm1L5k5J5pl7J8M3
5048IJ5qk6O4m9k3O3ml5l6L0l3L3rj2pkQK4Nk5J2L2qn6M4J5m5k7P2l7n1N5L6p4
5083e0J9P4j8l8L4M4l2n1L6Jm2j8K4K6o3J5N5Lm4K2M5n1k4M5K9p7PO1o3j5J3N3
$$ plain form
4846 -40 41 3 -63 37 -3 -53 20 31 -35 2 70 -33 -37 28 -6 -57 3 19 -40 -9 -10 -55 -5 21 -29 -12 32 -11 -17 67 24
4877 24 -51 25 35 -22 -15 41 -31 -43 17 15 -18 -3 31 13 17 26 16 20 25 -34 -30 -9 -24 -33 -7 -41 -41 -35 1 -2 2 31 26 -7 15 3 23
4914 23 -9 -23 -26 20 -16 -33 -1 -5 -14 -2 29 -34 -19 41 15 -19 27 24 17 -16 -1 0 -23 -24 -27 -1 4 -71 -15 40 -12 -18 40 24 -21
4949 -21 35 41 -26 -16 3 -2 -34 -12 -3 -21 16 7 -21 36 30 -19 39 38 -13 3 41 -14 -53 6 -16 -57 11 34 -33 7 42 2 13
4982 13 49 34 -19 35 2 5 -2 -6 -40 -20 13 -18 -59 31 1 -54 49 43 20 42 42 0 -26 13 -15 -34 -7 -13 -38 19 37 -13 2
5015 2 11 -1 29 57 -8 -11 36 -10 -30 10 6 -57 -46 34 -36 -64 19 39 -10 27 47 -6 -21 0 8 -33 2 -23 -8 -15 -52 -34 9
5048 9 24 16 -10 54 5 -18 45 41 6 -30 0 -33 0 -9 -21 -28 -30 -22 2 7 -18 -6 26 18 -38 6 21 -24 -51 21 -16 -67 -12 24 -50
5083 -50 -31 43 25 -13 21 65 33 -18 18 19 -23 -41 -17 9 -54 -39 16 19 -25 -3 42 -9 -33 12 41 -36 -29 32 -31 -46 -33 20
5115B0l5k0M4Mm8NO8oPk5J4lm4ML0nk3l2O1jn2PM1K1oJ6Ml6k3JM5o8j6N1K8o9
5151d1J7P4q3m9R6L3o8j6P4K0o2k0N5k8l6J5O2p5o3J12Mq0L4O3pp6N4M8m2l0O9
5182E4l7l8Nj4mopK9K1j7rM2Qm0L0K4l1p2P4J3q6%N3k7K6K8rmRpQJ7qm3P6m7n9
5219d8L0O0o5n2J12%p8P7J7l4m3N9j8j7rNmj3k7mP8l9m1N8M7j17L5J29q8o3R6
5250D3M3j52M7O8n5j6K8J0j8Rn2N0Rk2lN9Oj26Q2Q1j25j7J13n9q2P0L1o4j9Q6
5280B5l0k3L8Rl0J0l0NN4o1l4R0K4j05%J23p1m8P9Om1j9P8n3j6J7J8j2Kq6O3M5
5312B7o7LJ17o2q2Q8O7j54MQ8Jr4N3N9m1l6L6J7n3j5L3N3l7k9M1N2j02%J03Kj38
5343f6Q7K8o6k8N8J2p5J1O5km1j1L8K3l7k6N0J3o2j7J05o7o5O7On1L4N8k3m4K9
$$ plain form
5115 20 -15 -35 9 13 -35 -30 38 32 39 14 28 25 -19 -15 15 10 -13 -45 16 15 -37 -30 11 32 26 42 46 10 -13 -12 33 -35 -51 0 28 -41
5151 -41 -24 50 -33 -82 14 47 -21 -37 37 57 -5 -25 30 2 -34 -19 43 -32 -95 17 21 -59 -25 38 31 -45 9 57 15 -15 54
5182 54 17 -21 -16 -30 -34 -40 -47 -18 3 -14 -23 19 27 -13 17 41 10 -62 12 25 -61 -61 -8 -35 -9 19 10 6 15 8 16 33 25 -18 58 11 -48
5219 -48 -18 42 -23 -75 37 37 -41 36 53 19 -24 35 17 0 -9 -4 -8 -21 -48 -52 26 -13 -54 4 51 -66 -31 98 10 -53 43
5250 43 86 -66 -19 49 -6 -22 6 16 -2 7 -45 5 14 -8 -11 48 54 -72 10 91 -34 -51 62 3 -79 -9 22 -42 -61 25
5280 25 -5 -28 10 19 -11 -1 -31 -26 28 -33 -67 23 47 -58 -58 65 -6 -54 25 31 -10 -29 49 -4 -20 -3 15 3 5 -81 -18 27
5312 27 -40 -37 80 18 -64 24 91 -63 -59 29 30 -64 -11 48 7 -29 7 24 -29 -44 -11 42 5 -24 17 69 -33 -33 70 72 -66
5343 -66 21 49 -17 -45 13 25 -50 -39 26 24 -17 -28 10 33 -4 -30 20 33 -29 -46 59 -8 -73 -6 0 -51 -17 41 18 -26 3
5374CK1j6k4RM2l0n8L1R0r5m4Q6N2j06LJ05n0m8L6O1o0l2N5J8n4o6N6N9n0k9M5
5405A0J6p0LQ9l0p8O4O1p3m1N3kn7L0N3l9j2lM4J9l5j8R7k3j29P5R2r2p6J18j4
5436C2p5jJ30q9p0O6M9m0k6L6Nl0j4K6M8o7n6J05Qr1QJ38r6p9R5L8q9JP6k0p1
5467e3K1O2j4j7%L7ln5j2Q5j6j21P6P1q6k4J14Pj15J2P4n3o2L3P4p1k0O3L1l4
5497Dl0K0M3o8j3R0pr8L3P9l7j13R9O7j05lQ2J2p0OM2j0m7%P6l0p6M3M0m8n6R9
5529B4K1j09pJ18k9p6K9M3j0m6L7N6o9LL0Rn0j9L0N1l4l8O5J1q3K6P7n3n9M8O2
5560E8n1m0P1j4p9K6M0Ro4J1O5l4m9L2L5l5m3N4N8j03oQ1K5j11K8P1k8p9Q0N4
5590F2p5l8P3J1n3j0L7K4n8k0P5mn3M1N5o7n1N5K5p9K0O8Jo8K0L1j6pl2N5l5j3
$$ plain form
5374 3 24 8 -16 -7 35 5 -53 -22 68 -27 -71 15 67 -39 -36 69 19 -29 7 68 8 -24 31 49 -5 -71 -15 44 -6 -35 10
5405 10 26 -44 -41 48 18 -60 4 65 -8 -49 4 2 -55 -25 28 -11 -23 -26 18 37 2 -16 81 58 -71 4 96 4 -72 46 32
5436 32 -43 -44 86 -3 -73 -7 42 2 -24 12 17 -13 -27 -1 47 -20 -76 29 37 -54 -46 92 -4 -83 12 50 -39 -38 38 18 -53
5467 -53 -32 30 16 -1 -1 36 33 -22 -34 51 35 -86 -10 61 -25 -49 65 72 -43 -31 43 -10 -72 -39 35 -36 -56 7 38 4
5497 4 -26 -6 37 -31 -44 46 39 -59 -26 53 16 -97 2 69 -36 -39 43 55 -15 -9 33 23 -24 -24 52 22 -54 -11 29 -19 -75 24
5529 24 45 -64 -71 47 18 -58 -29 14 4 -42 -5 51 -18 -15 15 24 -26 -45 -15 36 2 -36 29 40 -43 -17 60 7 -52 -4 58
5560 58 7 -33 38 24 -55 -29 11 20 -44 -33 32 -2 -51 -19 16 -19 -62 -8 50 -53 -59 22 47 -64 -36 35 7 -72 8 62
5590 62 -13 -51 22 33 -20 -30 7 31 -27 -47 28 24 -29 12 67 0 -51 4 29 -50 -30 38 39 -29 -9 22 6 -1 -33 22 -13 -26
5622b6oN2Mo8N6L8q6m6J14L4j38N6Q0n3p1R4mm9RL0k2ok2K3M0m7k9R8k0j11L8
5653c8J01n4q7R3K6q4PR2p1o9J08m3pK4nRPj1l1O2k2p7N6J00j35j8J16j7r6P5
5683A1M4j13J8Q1j5m5M1mpKj6o6J00m9m1P7L8j28M9Q8q2k6R4nj17O0K7j4l8O9
5713C3k6j2K6j7m1P1m5k3Q6j2j07O3R9j26j7R2j5p2N1O3j00j5Q3m0k5L4%m0M1
5742Ik3k7N1l3n0Q5J5p6QQ8m9p9J40l6o8L8M6m6j1N2n0J6L1l3j7K4njK5k5m1L3
5774iO2o7k7R0l7j06J08J6p1nM7j9PQj3nK4k2J4L7l9j5N2rl5PM2l5k8P7m5m0M5
5807IOl9K1J4j4j4LNL4Jk5j9L6l0k0L6pk5L3J4k4k9L8j7k9J5K7J1l1nK5J4m1R
5841a8K1J3j4RLNk7N2l3k0J8Jj7J4Ok7RmJ4l2L2k0K4Lm1jL6k1l0K7J8l1rN0j5
$$ plain form
5622 -26 -32 20 24 -44 12 50 -36 -82 32 66 -72 -16 64 11 -60 34 30 -19 -10 20 -2 -8 -30 -7 33 -14 -43 55 35 -76 -38
5653 -38 63 9 -78 15 41 -43 -36 56 -15 -84 24 -19 -26 -2 -7 2 9 -2 -33 29 7 -70 -14 86 -49 -67 49 32 -64 11
5683 11 55 -58 -40 41 26 -19 22 18 11 13 -3 -69 31 -18 -59 18 56 -72 -23 65 -17 -43 51 46 -71 -11 16 2 -36 33
5713 33 7 -5 21 4 -37 34 -11 -34 52 40 -67 -4 95 -31 -48 44 29 -43 8 71 -29 -44 39 -1 -26 8 8 -32 9
5742 9 -14 -41 10 -23 -73 12 27 -49 -41 47 -2 -81 59 23 -45 -7 39 -7 -18 34 -16 0 31 -2 -19 5 0 -1 24 -1 -42 -9
5774 -9 53 -14 -41 49 12 -94 14 30 -41 -46 1 -18 -11 -3 -16 -21 3 -19 -5 32 -7 -22 30 21 -14 -7 35 0 -28 49 4 -36 9
5807 9 15 -24 -3 11 -3 -17 -14 -9 25 26 1 -18 18 -12 -32 4 -3 -28 5 19 -5 -34 4 -13 -42 -27 0 11 -20 -25 0 14 -27 -18
5841 -18 3 16 2 11 14 19 -8 44 11 -9 9 10 -7 7 13 -14 -5 -9 5 -27 5 -15 9 12 -29 -30 6 -15 -45 -18 0 -31 -40 10 -5
5876eoPJ4j5J8j8J6j2LLk0K4j2JK7l4j0K6J0j7J6nj4l1K6PqNJ0k1j0RoJL0j6j7
5913b4L1l0j4L9J3K4k9J3l7rQK1PJ0k3lJ0NKl%Jj9K2rj4K4l9M6k3j5J1pM9m3k
5949gK4rpj2K7m2PRJ2k3oM1lk8J8kLjNOl1K0K8j7kK4m6J4Nk4M6m1KL1lk0j4L2
5987A6j4j7L0J1k1k8K3Lj0j5J3J7j1m0M2L3m7J2MKl1J1K4kl2N1j0j7j5N4k4j4
6019bj2L0Prj6J7j3k5L2k6kj4N9Lm1j3L2J1m6M2jl1k6L7J7m3K4K3plk1L6J8m0
6053cJ7Rl8MOJ2Lk0j4K9Mm6N2j1NJ4j6k3j6J9M3o7K3pM2m9J2J8j3j1lK2J1j4j9
6088b5L2jm9K7K8j5k5O2po5K7M1o2lM9Ll9M1J6k0Pj9%Pk1mJ1Kk8L1K9m8m4P8O
6123B2l5J0K4m8OL2j5k0M0k4KM7n0k7O0po8O5M9q2k3N7pk2J5L5p5J0N3k1j4j7
$$ plain form
5876 -5 -11 -4 10 -5 13 -5 11 -1 2 5 -15 9 -3 -2 25 -9 -19 7 17 0 16 11 -3 -34 -8 -1 -9 -4 6 -15 -25 -16 -22 -21 9 -7 -24
5913 -24 7 -23 -37 2 15 39 10 23 -14 -23 -15 6 13 23 0 -3 7 12 14 11 11 12 -7 15 6 -8 16 -23 23 0 -15 -4 -11 38 -5 -7
5949 -7 17 8 1 -11 16 -26 -19 -10 2 -21 -27 14 11 -17 1 -1 2 1 6 12 -19 1 29 12 10 34 -12 2 7 -17 29 -12 -10 21 18 -2 -16 16
5987 16 2 -15 15 26 5 -23 0 3 -7 -22 -9 8 -3 -43 -1 32 -15 -3 1 3 -28 -17 7 5 -27 24 14 -3 -18 36 12 -2
6019 -2 -14 16 23 14 -2 15 2 -23 9 -17 -19 -33 26 29 -12 -25 7 18 -28 14 13 -18 -44 -7 10 -33 -9 14 7 4 -17 19 37 -3
6053 -3 14 23 -15 -11 -5 7 10 -10 -24 5 9 -37 15 4 9 23 7 -16 -32 -13 30 -37 -14 -21 21 -28 -16 2 -11 -22 -25 -3 8 -6 -25
6088 -25 7 6 -43 -16 12 -3 -28 34 27 -38 -11 30 -32 -35 14 17 -22 19 35 15 22 3 3 10 -11 -15 -4 -2 -30 1 30 -18 -62 16 22
6123 22 -13 -3 21 -27 -21 11 -4 -24 16 -8 -6 41 -9 -36 24 17 -51 14 63 -19 -42 15 8 -14 1 36 -39 -29 24 3 -11 -28
6155b8nK9J0j0k5P9p3k4O1L2r7QQ5n9o2R3Rq5N7K7l8k2P2m0OQl3KO4m0n3P1K9
6188D8j05N5O7r7j6Q6j4p9R1j0q2M1K9k1l0N1m1K5L4n7j9M4J1n4N5M4j38K7R7
6217D2p1j8P9no4L8M1o2K5j5J6j2J6j4lO4p6k4Q0l5n8P8Rr4J5Q4m7l7N7Ln9J4
6249c3N8k9l3L7k6N1j5l6J9M0k8p9J16j5q8N2N8o7j2M9jo3M4K1l8K1J0j2NLk3
6280a4K4Ol7%N0n5m4R9J1j00M2M7o1oM6j3k3MK5k2OJ0jNOn8N7K8n6k6P2m4qN9
6314B9pm0j3N4k7o1O1QQk4J3jJ3l3k9O3mm5J3M1k2n0Q2k1n6M9M1n7k2N9rOj1K3
6348C1p1O3k9kK1k1k9N5lo8L9K7j4j6K5J1m3J9%K1k9J4k9oL0j2J1Rk7j5N8m6J5
6381a1K0Mj8pK2Oo3M9K8l7kM7l0k6J0L6l3k6PL5j9j0KM9m9nM3j1l1qJ4oJ0j1K9
$$ plain form
6155 -28 -33 -4 6 -4 -29 50 -23 -47 14 46 -51 -43 42 -17 -79 14 23 -62 -5 22 -16 -38 34 -6 0 8 -25 -23 41 1 -52 19 48
6188 48 -57 -2 65 -32 -48 38 24 -55 36 26 -56 -15 14 -7 -37 14 -27 -2 32 -25 -44 0 11 -43 12 56 -82 -55 42
6217 42 -29 -47 32 27 -37 1 42 -20 5 -10 6 -6 10 -4 -7 57 -19 -43 37 2 -56 22 31 -63 -48 36 -11 -48 9 12 -47 -33
6249 -33 25 -4 -37 0 -26 25 10 -26 -7 33 5 -74 42 27 -61 -9 49 -18 -30 19 18 -45 -1 20 -18 3 13 1 6 9 -14
6280 -14 10 16 -21 -21 29 -26 -70 29 40 -60 -18 29 -32 -38 8 -5 -28 -24 1 -21 -15 -5 -6 -1 5 -53 4 32 -24 -50 22 -22 -30 29
6314 29 22 -18 -31 23 -4 -65 -4 4 12 -12 1 0 13 -20 -49 14 10 -35 -22 19 -3 -53 29 8 -48 1 42 -15 -37 22 13 19 8 31
6348 31 -40 23 -6 -8 13 -8 -37 18 15 -53 -14 13 -1 -17 8 19 -24 -5 -5 16 -13 1 -28 -34 -4 -16 -5 4 -23 -38 20 -26 -11
6381 -11 9 13 -5 -12 10 16 -47 2 30 -7 -9 38 8 -18 -8 28 -5 -31 -24 11 -8 -18 -16 33 -16 -21 22 11 -20 -28 -14 -20 -10 -21 8
6416Hlk4j4L1m0J2M2Ql0kJ3%k9J3K0k1RJj7LL4j0J2rK0n0K0k5J6L6l1lMK7j2k0
6452a1jjK2m4M2j7OJj%Kk1L0j7J1Pj6J9m8M6Mk6K7K9m4jL2l7qJ2%Kk7L3k5J1K3
6489A4j5jPj8kL3Km8K7j0Jk6M9l3KL4j8j9L2k7J2rL1k8RoJk0N0k6MlJ3k3nK5j8
6526iK5j2J1J1l7%PKK3k8jJOj4j6L1K1l9K4oj5J8lM2n4qK1KMj6k2M2pk6K4J9k0
6563Aj2K1jj5K2j4k6NM0l2NJ7jm3J4K8k3Kj9jPJ6k7M2J3m7K1%Kk2L4j1j1J1J0
6598FpJ1K8j7MrJ6m3J5Nn5N6K0m2RK8j7m2N3Ml5J0J3j4j8rk0K5kQROok2L0J2k4
6635a4j3M5k1k4L6rl6L4%kJ9Ok4MJ0j%%j2k3L5mk7JOKJ1K6m2jOK0k1qM9m9M1j5
6673El8J5J0RmJk1K3J4K1m6J4J9k0orK3k7J1L7m0J1Lk5J5LRlNj5%mJ1j4K9k9J8
$$ plain form
6416 8 5 -19 -33 -2 -42 -30 12 20 -10 -12 1 1 -28 -15 5 -16 -7 -6 -23 -20 14 4 16 7 27 -23 -3 -28 -12 24 -7 -10 -6 21 9 -11
6452 -11 -12 -13 9 -35 7 -10 -4 -3 -4 -4 -2 -23 7 -10 1 8 -8 11 -37 9 13 -13 14 43 -1 -2 30 -7 -15 -3 -3 -1 -28 5 -20 -9 14
6489 14 -1 -2 5 -13 -15 18 20 -28 -1 -11 -10 -36 13 -20 -18 16 -2 -21 11 -16 -4 -13 18 -10 -1 -7 -6 -26 24 -2 2 -1 12 -11 -16 9 -9
6526 -9 16 4 15 26 -11 -11 -4 -2 21 -7 -8 -7 -1 -15 -31 0 21 -18 6 0 -15 3 0 42 -12 -20 1 3 7 -9 -31 11 4 -22 2 21 1
6563 1 -11 10 9 -6 16 2 -24 -19 21 -11 -6 11 10 -33 -19 9 -14 -12 -31 -32 -25 -9 -36 6 19 -28 -7 -7 -5 -27 7 -4 -15 -4 6
6598 6 -1 10 38 21 25 16 32 -11 4 9 -46 10 30 -12 -3 25 8 -34 19 23 -12 -2 11 -3 -21 -30 -50 -25 -27 -19 -10 -4 -10 -32 -2 10 -14
6635 -14 -27 18 -3 -27 9 0 -36 -2 -2 -4 15 21 -3 1 11 10 10 10 -2 -25 10 6 -21 -20 -14 -12 -1 25 -17 -18 -12 8 -13 -21 28 -21 20 5
6673 5 -33 -18 -8 1 -3 -2 -23 0 14 35 -11 3 22 2 -4 -13 10 -17 -6 31 -9 2 5 -20 -5 -2 7 4 9 -6 -6 -10 1 -13 16 -13 5
6710Emj2nL%qJ1jjL0j8j8j6K1K1j4J9k5j3j3M0j7j1J3oJ7PlMlJj0j3M9n8j2L7
6747ck0rM8k5k4N0j8Lj9L5m0PLPMJ3l3POQk2K5J5k1RK0k1qM1m1k3J1%j6J5J4L
6784ANK7l8j6K5nk3L5l1JJ4K0m3K2J4k9J2j5L0j6QmL8l8K2J5Rl1kkNj7j4M1pp
6820Fj5L5n0nNK0kMJk2k5L5L0j3jNk0J9j9J1Pj5J2qQprRJ2j4K6j8k5L2%k4J3P
6858EPJ2o1O3pk9Pj2K3m1K2j0N1l4j3kj0NKL6J0n2K9%J3k8K3k3Nj1J0LRJ7j5j0
6894fL2j4j1K2j5j7K6ok5KL0k0mQJ9l1K6Nn7LM6l8J7J6l1JJ3j9RK4k8MJ1RpJ4
6930HJ4lk8K9pl2%j2L3l9M2Nk7J6pl3N5Kk7M2j9k6mJ3qPPJ2m4M1l7RqrL2mJ5l6
6968b8J8PJ5m4J8L9k3oJ1j1j4L5mJj0L1m0P%m0RL8l4rL8k5j2N1lm3K1J8l7K4K2
$$ plain form
6710 5 1 -11 -16 -13 -13 -21 -10 -11 -12 18 0 -18 -34 -13 8 -6 13 -12 -25 -38 2 -15 -26 -13 -19 -2 5 2 6 3 4 -6 -19 30 -28 -40 -3
6747 -3 -23 -32 16 -9 -33 17 -1 2 -17 18 -22 -15 -12 -5 -1 12 -21 -14 -8 0 -22 3 18 -3 6 26 5 -3 38 -3 -26 -15 -15 -31 -16 -2 1
6784 1 6 33 -5 -21 4 -1 -24 11 -20 -19 -5 15 -28 -6 8 -21 -9 -24 6 -10 -2 -6 32 -6 16 31 40 9 7 5 10 -7 -21 20 13 6
6820 6 -9 26 -24 -29 -24 -4 -6 -2 -1 -23 -48 -13 17 4 3 8 -12 7 -12 -1 6 -9 3 -5 3 -4 -13 -4 8 -6 20 2 -23 9 9 -15 -2 5
6858 5 12 24 -37 26 19 -10 -3 -15 8 -33 -11 -21 30 -4 -17 -19 -29 -24 -22 14 24 -28 1 1 14 -14 9 -14 -9 -20 -10 -7 2 19 4 -6
6894 -6 26 12 1 23 8 -9 17 11 -14 -12 18 -2 -6 2 21 -10 16 21 -36 -33 13 -25 -8 8 -23 -22 -9 -28 -19 5 -23 -19 -8 1 -6 8
6930 8 22 19 -9 20 13 -19 -19 -31 2 -37 5 10 -17 -1 -8 -41 14 16 -11 31 12 -14 -18 -5 -13 -6 1 13 -31 10 -27 -18 -26 -35 -3 -7 8 -28
6968 -28 -10 -3 12 -32 -14 25 2 -4 7 -4 -18 17 13 14 4 35 -5 2 2 -38 -29 9 -25 -34 4 -21 -33 18 15 -28 -7 11 -26 -2 20
7003B0k6j2K5j1j5j8L2L7k7J2qnNk2L5k1J4k1J7Mk0J0j7KjM6j0l5K6mj2LRk1O
7038clK4j4r%Jk0J1Lk3K9Nl7N1k8rK6J0m0MJ8Om3M7L3r1M7K3l0QnL4%k1K2j4R
7075B1l5rK7J0n4J4J8nm2L9M2m3nM2k0k8M4k2l5K9k0NPJ8%J0K2n2J9O1p5KK2J3
7109B0l9L1j8k2jL7l6PK5k9K1rlJ6MJ4n4L1N2n6j6L6rn5N4j8j7M2j1Lk0L0Rmj0
7144EjnM3o2J9K1pm2M2j4l7J1M3k4l9P3m5nJ0M2n0nK7j4j2M4l6oJ0K1k1M6j1l8
7178a7L5%n1K3M0n7m0Q5l5k0J3M1k4j7M2l2J4M6o1jJ4ml9Q1l8l4oO8m6m3Q5l9
7210a7j3K4M6p2kL8l1K9nl1j2M5k7K1Pj0jK7lm3NN8m1lL2k3mq%jJ8Jj7j5K7QJ1
7247A8K3n7oK1Kj7QL3m8k8M9Ln0N6J6j7j3K3j7j7L0Pk1MpqJ5jk4K8ok8L3K7k0
$$ plain form
7003 20 -6 -18 7 -4 -19 -37 -5 32 5 17 9 4 9 -13 22 1 15 -6 11 15 -5 5 -12 -10 -11 35 25 -10 16 12 0 3 12 -9 -3
7038 -3 -6 18 4 -5 -5 -4 -24 -13 -10 -33 -4 1 -36 15 -13 -22 4 14 -26 -22 -4 2 -41 6 39 -52 -5 18 -12 -4 -9 25 25 4 26 12 21
7075 21 -14 -23 4 14 -40 -26 -8 -13 -55 -16 26 -17 -22 20 0 -28 16 -6 -41 -12 -32 -27 -20 -2 -2 8 30 -22 -3 58 -17 -15 7 20
7109 20 -19 12 -6 -28 -29 8 -28 -21 4 -25 -4 -13 -16 0 4 18 -36 -5 47 -9 -25 11 2 -53 1 -17 -34 8 -3 0 -20 10 19 15 5
7144 5 4 -1 42 -20 -1 20 13 -29 13 -1 -38 -27 16 -8 -47 26 -19 -24 -14 28 -22 -27 0 -14 -26 18 -18 -24 -14 7 -14 32 21 -17
7178 -17 18 18 -33 -10 30 -27 -67 18 -17 -37 -24 17 -7 -24 18 -14 0 46 -15 -16 -2 -6 -45 36 -2 -36 -42 26 -20 -63 22 -17
7210 -17 -30 -6 40 -32 -34 4 -27 2 -3 -34 -46 -1 -28 -7 0 -10 -11 16 13 -30 -25 33 -8 -11 21 -2 -6 -14 -14 -15 3 4 -13 -28 -1 7 18
7247 18 41 -16 -22 -1 1 -16 -8 25 -23 -51 -2 1 -49 7 23 6 -7 16 -1 -18 12 19 -2 2 -5 -13 2 1 -23 5 -1 -29 4 31 11
7282A1l2L8J3n1L2Ol9K1K0j1l8J1J0nj6K2KJ7J4j3j1k0RqKJ6l4K1J5Nl5N0j4k
7316FJ1jj3J8Nm0%J4j7MJ9j4j4QPpL4l4K1l3L4Jl2L7k7oqL3m2K4J6Qm1K0J9KP
7353A9qJ1k4Njj5K8j4loJ1k3K4Rk7J2K1qk8L4k3k9lL0k7nN0j4k7PM0lok0RpJ9
7390Hj2OL7l4m3M5J2n2L3J2k6LK3qkJ0ml4J2K5j4rNppK9l6J1K1k5l5O4J7l7NK9
7426B2l2j6K0oKJ0J4j5j6KL5Kj6LlJ9k5J2L3l9k%K6n1J6Kl8K1MK8k4mM6m0qJ8
7462@j4K0l5MJ0j6K0k2K9k3PL1l5j4L7K5J0l5k2K8j8pK5jmoJ9Kj2l1QL3j3MJl6
7498c1j6M4K0m1KJQj2J7NkrmL2j4rJL5n9j0N0nk5J9J0j8k0M1k2mJ7mL3k3J1l5
7534a7M2j2j6pJ9j3l2K1K6m2nL0Mj5K1pl5OM0j8J3j0J2nm0M0kLnjJ1jk7J8M2n2
$$ plain form
7282 11 -21 17 30 -21 11 17 -22 -1 19 8 -30 -19 -9 -14 -30 -8 -6 11 25 12 1 -19 -10 -18 -16 0 -34 -13 2 7 -28 22 8 6
7316 6 17 16 3 21 26 -14 -14 0 -17 -13 6 -8 -22 -14 -7 -14 20 -14 7 -26 8 9 -23 14 -13 -19 -27 6 -36 -12 4 12 -29 -9 10 12 19
7353 19 11 22 -2 3 2 -13 15 1 -2 -8 3 -20 4 13 -14 -2 19 11 -17 17 -6 -35 -38 -8 -35 -40 10 -4 -31 -24 16 13 7 -13 -4 -11 8
7390 8 -4 2 39 5 -38 7 19 -33 0 12 -14 -11 12 4 2 12 8 -26 -14 11 -3 -12 -7 -14 -21 8 -28 -17 4 -21 -56 8 25 -12 -7 22
7426 22 -10 -26 -6 -12 -10 0 14 -1 -17 -15 20 22 6 9 6 25 0 12 45 6 4 4 30 -21 -5 -3 -41 -20 -16 12 -12 -16 30 -10 -18 0
7462 0 -14 6 -29 -25 -15 -31 -11 -33 -4 -27 -20 11 -24 -38 -1 24 34 -1 -23 5 -13 -20 5 4 0 -6 13 15 3 -28 -20 13 0 4 5 -31
7498 -31 -47 -3 17 -24 -22 -21 -13 -25 -8 -3 -5 -14 -18 14 0 -9 -8 27 -32 -42 8 3 -22 -3 7 -11 -31 10 -12 -16 1 -3 30 7 18 -17
7534 -17 25 13 -3 -10 9 -4 -36 -15 11 -31 -36 -6 -2 -17 4 -3 -38 -32 8 -10 3 -7 5 0 -40 0 -2 1 -4 -5 6 5 -22 -4 38 -14
7570a4RJ9Jk2lL3l1J8L2l0Qj9Pk7J5Nj4%jJ5j9Lnj5O2k7j8L2nl1J2K7k7K5J3j7
7606A1k0Qj4oK7j5rK2Qj0k5L2l0KK9J0l6K7J9o0QJ6Mj2K6j6Nk5OpQJ7j6MK1Jn4
7643d4M0J9k0L1m8j2J7N6l4j9J6J6qrQl5M2J3m1j0M2m9j2L5J6l2L1jp2M0L3m0
7675c1L2J1j6mJ6oj4J5j5j9K4J6k5OL8m6RM3j9l9QK8l1J5L4l2OJ6j3j4NK1k7Q
7709@K2p0M2J8j1k8J9Jl2O5l2n2N6L2o2J2K6rn1O5Jk9kK0MK6j6j0k4M4k4k7M2
7742A6Ko5J7K4L1m0L1m4KJ9J0Kj4J2%Kl3J7J9Nj4oL8l4k1jL1Pl1K1K6j4k3J9l
7777HJ6k2J3okMpJj1j6K3pj8M9k8j0PL0l8JJ5Rk3NJ3j3nj3M0nk3k7M9j1lJ5LP
7815B0l7M0k6ROjJ1k9JK6Jj1j1L5n3K1jnrL0Ml4k7M8jnMJ0l7L3k2KkKj5L2kk0
$$ plain form
7570 -14 -5 14 15 -7 -10 23 -8 10 42 12 20 1 8 -19 -4 1 -13 -13 -14 1 -18 -15 -20 -35 27 0 -18 14 9 -22 -10 17 -10 15 28 11
7606 11 -9 -1 -15 -21 6 -9 -18 4 12 2 -23 9 -21 -19 10 20 -16 11 30 -30 -22 -6 -2 -14 12 -4 1 -24 -18 -25 -17 0 -16 -12 9 10 -44
7643 -44 -4 15 -5 26 -22 -34 -17 39 5 -14 2 18 10 1 9 -26 16 29 -12 -22 20 -29 -41 -6 10 -22 9 8 -64 -24 9 -31
7675 -31 1 12 -4 -8 8 2 -12 3 -12 -31 -7 9 -16 -10 28 -18 -9 34 15 -24 -16 12 -19 -4 30 -2 4 20 7 -7 -2 19 -8 0
7709 0 22 -48 -6 12 1 -27 -8 -7 -39 26 -6 -58 -2 30 -32 -20 6 -3 -54 11 12 -17 -19 1 5 31 15 5 -19 25 1 -26 16
7742 16 18 -47 -30 -6 25 -15 16 -28 -26 -7 3 5 -9 3 3 5 -28 -11 8 13 -1 -7 31 -3 -24 -25 6 13 -18 3 29 15 -8 11 8
7777 8 24 2 15 9 7 11 4 5 -6 -22 1 -6 -24 25 -3 -13 -6 24 -14 -13 2 11 -12 -7 6 -7 -12 -25 15 10 -13 -40 9 -2 -5 10 13 20
7815 20 -17 23 -3 6 12 11 22 -7 -6 20 21 10 -1 34 -19 2 1 -4 -13 17 21 -13 -40 8 7 2 6 16 -21 12 -10 -8 -10 -8 -23 9 7 -13
7853a3J4j3jMNj0JK2j3moM2l7nL2k2oKORm3N0k6j1J9kk1K2Qj9K7Rm0L1l7oK1K
7891inJ2K0k5K3Llj1J4j0J8l5J1l1J2J1k3K7j4L2j9Jjj3j0M3k8jj1K3k8j0M2J6
7925B1m9Pj8J6j2J2J0K5nnjk4L8Nj9MJ6rj0l6K8J3Rl1L8k5LjRK5k9oK5j0l0K1
7961EOj2%j0L0k2Kj7Rk9K6L3k5kK9k7k4J3j1K1J2k9K5pJkK6j1k0J4j0J4j8KJ7
7996Ij3qN4k4k3j9J9J5k5LJ1Jnk1KJ4rNJ8j6RQlm4M4J3k8J4L3m8nQJK2qk5MJ3
8034dj7K1K1pj7L0l0K5l2OKpKK5o8N0lPoKQKrjOJ3j6J5k3Jk8j7P6n8M0K1j4k7
8072a1J8J0k4k5N4l0%j3Mj1J0K6l8M6Kl2QPk5jK1jj4mL0m6J2L7k0pOj4NJ0M5m8
8108a3j6M6l3L5poJ6j3k2j0K9j1qOL5m2lM2n4MK0noJ2kJKJ2l9PJ1K0j9K7k2m2
$$ plain form
7853 -13 1 -12 -13 -9 -4 -14 -13 9 -4 -8 -14 28 -9 -14 18 -4 -10 -8 -2 7 -36 14 -12 -23 -4 -6 -27 -5 3 -16 11 20 -20 11 -26 -32 -11 -9
7891 -9 -14 -2 18 -7 16 19 16 5 19 9 27 -8 3 -28 -16 -5 -28 -1 -15 17 -2 -1 -2 -15 -25 18 -10 -11 -22 1 -27 -37 5 21
7925 21 -28 -21 -39 -23 -35 -23 -13 12 7 2 1 -23 15 20 1 5 21 12 2 -34 -6 7 16 -15 23 -2 1 0 9 34 5 -1 24 14 -16 5
7961 5 11 -1 -1 -11 19 -3 -1 -18 -9 -38 -12 21 -4 -6 23 -4 -28 -15 -26 -5 7 -22 3 -4 -3 -5 21 10 -10 4 -6 8 -10 -8 9
7996 9 -4 -12 42 18 -5 -24 -5 10 -15 -12 -1 0 -5 -26 -24 -10 -19 -14 4 -12 -3 5 2 -42 2 15 -13 1 34 -14 -19 -11 -10 12 4 -21 -17 -4
8034 -4 -21 0 21 14 -3 27 -3 22 -10 -4 -2 -9 -7 18 -50 0 -3 4 -2 0 8 10 1 0 6 19 3 18 -5 -4 -32 -49 27 -31 9 30 16 -11
8072 -11 7 17 -7 -32 22 -8 -8 -21 -17 -28 -18 8 -30 16 18 -14 -6 1 -24 -25 -4 -5 -19 -23 7 -39 -27 10 -10 -17 -11 -25 -20 -10 35 -13
8108 -13 -29 17 -16 19 12 6 22 9 -13 -23 6 -5 -13 -7 28 -14 -17 25 -29 -25 -5 -10 -16 -4 -6 -5 -3 9 -30 -23 -12 8 -11 16 -6 -48
8144d8P5m7j6L3Lk3J8L6o8%M6J7j8K3rj9k6L3Lj8K7j4j3j4K3j3J8l4J2J2j7kp
8177b7M1ol8K7J3m4K2L3jl1j0L5l8Q
$$ plain form
8144 -48 27 -20 -36 -3 0 -23 -5 31 -37 -37 9 26 8 31 22 3 -23 10 13 -5 22 8 -5 -19 4 -9 9 -25 -13 -1 -18 -20 -27
8177 -27 14 8 -30 -3 10 -34 -12 21 20 -11 -21 14 -24 -16
8191a6
$$ Imaginary data points
##PAGE= N=2
##DATA TABLE= (X++(I..I)), XYDATA
0@%%%%%%%%%%%%%%%qJ6j6J6j6J6k2L0l2L5m3M8n5O4p3Q5r5J06j19J33j49J68j90
38a01K12k35K61k88L18l52L88m26M69n17N69o27O92p62Q40r29J028j141J272j427
58g56J612j830K098k439K884l486M345n664P897j2308K3911j04156k18617M23808
72A17299M6879m18757J19409L10034k00212j23221K19215J2318j11186Q0062Q860
83F0700o6196O5572j3569j07992O1036L9112j14931J3858P7377p0111M631Q6895
95C6382o4686q421J33384n8382r9975J44209K8878j78236M9004J17462j37965
106c8346m8442J22999o7571o5343J31566l7639j11907J68797N8070k14883P5454
117b7245K22872j80555j52922K37176L3275k53649M5077J77710j14833j06368
$$ plain form
0 0 0 0 0 0 0 0 0 0 0 0 0 0 0 0 0 -8 8 -8 8 -8 8 -14 16 -16 19 -24 24 -31 33 -40 45 -50 56 -63 70 -79 89 -101
38 -101 111 -124 137 -151 167 -185 203 -223 246 -271 298 -329 363 -399 441 -488 540 -601 671 -756
58 -756 856 -974 1124 -1315 1569 -1917 2428 -3236 4661 -7647 16264 -87892 -306509 117299
72 117299 164178 -254579 -135170 174864 -25348 -148569 70646 82964 -28222 51840 60700
83 60700 -5496 60076 46507 -61485 -449 38663 -76268 -62410 14967 -55144 -50513 36382
95 36382 -28304 -36725 96659 38277 -61698 82511 111389 -66847 -17843 99619 -38346
106 -38346 -86788 36211 -31360 -96703 34863 -2776 -114683 54114 112184 -102699 -27245
117 -27245 195627 15072 -137850 99326 132601 -121048 -75971 101739 -13094 -119462
127a19462J09861L9149o1792L167K7496K6019J8332m7678k537Q1143l5850q9202
139e1354O8545M0531j09773O31Q8136o1023m8140Q9155k560o6776O3081M0125
151E0578o6569J9239N4433m9533j5521M2572l6795k2952M4346l6922m0880P2825
163A4821j720q5380O0767P7450r1016k2821J16238j8966r5815N7464N6934p7165
175i209k7274N5330r161m0670O856J4669M523l591j4993K1255L3867k9765j8931
188a7094N2105K674n5252J7733L6519m2099k3123L3904o705k5906J4731N723o647
201a3437J5722k675q879L0934K249l6916K4308L1825n1055j7271N5851j9934n9344
214d8622M0092L4887n7471o431O0827j3243m0349L6547K8428l3629p391K8705
$$ plain form
127 -119462 -9601 29548 -32244 -29077 -1581 24438 42770 -4908 -7445 73698 37848 -51354
139 -51354 17191 57722 -52051 -51420 36716 -24307 -72447 16708 14148 -52628 10453 50578
151 50578 -15991 3248 57681 8148 -7373 35199 -1596 -24548 19798 -17124 -58004 14821
163 14821 13101 -72279 -11512 65938 -25078 -47899 68339 49373 -46442 11022 67956 -9209
175 -9209 -36483 18847 9686 -30984 -24128 -9459 -4936 -8527 -23520 -2265 31602 1837 -17094
188 -17094 35011 37685 -17567 166 36685 -5414 -28537 5367 -1338 -27244 -12513 -6790 -13437
201 -13437 2285 -390 -9269 21665 23914 -13002 11306 43131 -7924 -25195 30656 10722 -48622
214 -48622 -8530 26357 -31114 -37545 23282 10039 -30310 6237 34665 1036 -6355 22350
226B2350l343k3264j060J0527k547j7447n436J9170K221k2857R166K9146j2778
239C848j6851K6187J0841k4281J044J6111j1459j0589M394n389j741N263j2074
252a4696j117K3253o533k0491K6516J9794l2977k767L9137j3673l7010K3738K0823
265B3997l7081j1692L3493m530k9580J4239K3723j4764j1052J9988R515j4749
277A507l261J3959L40j5297j747J0749m963j3872M478R598p246n427R786M815
291C419m601J686M904Q42L19k742l141N030l50j2935Q35J2663r510j3530J6347
306g64J0261j9977m49K5298n360k1267J5214J6965k1088j0470K1839K29k3462
319a3031M485J8244j0717j4129J3645J0014j2942l718J4383J991j1546J788J0242
$$ plain form
226 22350 19007 -4257 -5317 5210 2663 -14784 -20220 -1050 1171 -21686 -12520 16626 3848
239 3848 -13003 13184 24025 -256 788 16899 5440 -5149 -755 -6144 -7885 -2622 -14696
252 -14696 -15813 7440 907 -19584 6932 26726 -6251 -9018 30119 16446 -20564 3174 23997
265 23997 -13084 -24776 8717 4187 -25393 -11154 12569 -2195 -13247 6741 16256 1507
277 1507 -1754 12205 12545 -2752 -4499 6250 1287 -12585 -8107 1491 -5755 -11182 -1396 3419
291 3419 -1182 504 5408 6250 6569 3827 686 5716 5366 -7569 -6734 5929 -3581 -17111 -764
306 -764 9497 -10480 -10929 14369 9009 -12258 2956 19921 -1167 -11637 10202 10431 -13031
319 -13031 -8546 9698 -1019 -15148 -1503 8511 -4431 -8149 6234 8225 -3321 -1533 8709
332H709l989q921L956M824o033l954L930J061k433J02Q90K022K831l107k097P892
348E683J006j1181K578J1948r557j2042J4193O403j9120k8K0206p007j6894J4195
362C83J2644j6693n076J7713o04j5534M502J1583p540r209P241N792p878m395
376g071Q199K983q072OR089j894p396N113N017o860j771N919k485m125L735j66
392B21l268L680J1m655N214L440q617J529J0344p267q306J2149K930j5120K958
407d757J3720q860j0272J2090N570j2359r61J1713j256r655K838Q639l854q599
421f003M941P595p846o266J0209K525j1459K881J0488p198n792J0086J02q901
435d638N245M325q005J214O075o384j546P375m260m566Q125o65p402O507L578
$$ plain form
332 8709 4720 -4201 -245 4579 -1454 -5408 -1478 -417 -2850 -2748 -1858 164 2995 -112 -2209 5683
348 5683 6689 -4492 -1914 10034 477 -11565 2628 9031 -10089 -10117 10089 3082 -13812 383
362 383 13027 -3666 -8742 8971 8367 -7167 -2665 8918 1378 -7831 -590 5202 -2676 -7071
376 -7071 1128 4111 -3961 -3955 5134 3240 -4156 957 5974 -886 -2657 3262 777 -3348 387 221
392 221 -3047 633 644 -4011 1203 4643 -3974 -2445 7899 632 -7674 4475 7405 -7715 -4757
407 -4757 8963 103 -10169 1921 7491 -4868 -5829 5884 4628 -5027 -2189 6450 2596 -6003
421 -6003 -1062 6533 -1313 -7579 2630 5155 -6304 -3423 7065 -133 -5925 4161 4263 -4638
435 -4638 607 4932 -3073 -1859 4216 -2168 -3714 3661 -599 -5165 2960 2295 -5107 1400 4978
450D978q746K941P088q035k178R003m185o372P211L60o385M747J548n647N346
465A674K061q913N619P755j2896j125J5462q871j1929J6302K146j8094R188J2147
479A0526j6553l18J6836j1309q296J8159m631j6046J6336N530k1607P984J6584
492A3195j9280m617K1809r801j4358J9893O00j9831J4522J1037k2728L906K1033
505A5380j7506j0789K3030m209j9300J5137P064j7922O671J1157j4774K061J4088
518A0088j3594l772J8254r645j2404J9186j435j9630J5754Q596k4206Q289K0526
531A6007k4255n906L1611j3508k5742L0508R897l6287J0336K9685k5820j3607
543a7081K9918n272k2666J7552O996j9681Q539J1357j7011K388J5962j3347o100
$$ plain form
450 4978 -3768 -827 6261 -1774 -3952 5051 866 -5506 1705 2065 -4320 427 1975 -3672 1674
465 1674 3735 -5178 441 8196 -4700 -5825 9637 766 -11163 5139 7285 -10809 -1621 10526
479 10526 -6027 -6345 10491 -818 -9114 9045 4414 -11632 4704 10234 -11373 -3389 13195
492 13195 -6085 -10702 11107 1306 -13052 6841 7441 -12390 2132 13169 -9559 -5653 15380
505 15380 -2126 -12915 10115 5906 -13394 1743 8807 -9115 -2444 8713 -6061 -4000 10088
518 10088 -3506 -7278 10976 1331 -11073 8113 6678 -12952 2802 11398 -12808 -4519 16007
531 16007 -8248 -14154 17457 3949 -21793 8715 18612 -17675 -7339 22346 -3474 -17081
543 -17081 12837 7565 -15101 2451 9447 -10234 -1695 9662 -7349 -4961 11001 -2346 -8446
556h446J7161n501j1534J2824J31j1989R994K557j4361R445R084j8344K775J8997
570A2793j5105r624K2426m401j9186J7756O923k3284R256J7628k3215m101K7473
583A5339j3109k1688K5907Q274k9268P036K3969j6559j2061J8661J043j2887M536
596h07L860l723K119l053l168Q871k238j0691R967O469j4567L217J4020j2011
610a735n827J6891n435j4374J4824M872j9070O070J4504j5037m996J6705n666
623A726j0764J2877J121j2104R137N584j3792M531J1759j3034m735J5379m592
636C093j2376J0053M886j0439K039N846m523J333K179n437M703M845j0807J104
650c501J2789r722r173J5607m0j6501R655J0499j5991k07J6032r473q976J5231
$$ plain form
556 -8446 8715 3214 -8320 4504 4635 -7354 2640 5197 -9164 281 9365 -8979 -6204 12793
570 12793 -2312 -11936 10490 6089 -13097 4659 11582 -11702 -2446 15182 -8033 -12134 15339
583 15339 2230 -19458 6449 14723 -14545 -7509 16460 -99 -12160 6501 7544 -5343 -807
596 -807 3053 -670 1449 -1604 -4772 4099 1861 -8830 1137 7606 -6961 -3744 10276 -1735
610 -1735 -7562 9329 3894 -10480 4344 9216 -9854 -3784 10720 -4317 -9313 7392 1726
623 1726 -9038 3839 4960 -7144 1993 7577 -6215 -1684 10075 -2959 -7694 7685 3093
636 3093 -9283 770 5656 -4783 -2744 3102 -1421 -88 2091 -3346 1357 6202 -4605 -3501
650 -3501 9288 -434 -9607 6000 5960 -10541 -886 9613 -6378 -6585 9447 -26 -9002 6229
664F229p23j3649R526O450j3134K725R698j0090k090J1083o904o429J2237j919
678C010j1524J0341N856j3777L010J2056r745n378J1811k656q861P528J608q074
692d795M579L232p736L676N778q658P54R971p310n307J1949k101j1223R234N223
707G266j3161K511J0937j0023m886J2663l295j0004R847L812j1254M247Q579r192
721a953j902J0161m967o924Q713M75r219M758N210q011J44P351m327l322O406
736B593o55m570M105J271m396K254J847m306J302K895m537p9M892l647k733O094
752B330o69n419M694L050o225J263N377m842k374N987k346n082N332J382o746
767d288K746N493n756j821P279j480n756M647L197n640l51M618k273l089K510
$$ plain form
664 6229 5506 -8143 1383 7833 -5301 -2576 7122 -2968 -5058 6025 -879 -7308 4929 3010
678 3010 -8514 1827 7683 -6094 -3084 8972 -773 -6151 5660 3004 -5857 1671 3279 -4795
692 -4795 -216 3016 -4720 -1044 4734 -3924 -3170 6801 -509 -5816 6133 4032 -7191 2043 7266
707 7266 -5895 -3384 7553 -2470 -7356 5307 2012 -7992 1855 5667 -5587 -1340 7239 -1953
721 -1953 -3855 6306 1339 -5585 3128 3603 -5616 -858 4352 -3659 -3515 3836 -491 -3813 2593
736 2593 1938 -2632 1473 2744 -1652 602 2449 -1857 -555 2340 -2197 -2276 2616 -1031 -3764 2330
752 2330 1661 -3758 936 3986 -2239 -976 4401 -441 -2815 3172 826 -4256 1076 2458 -4288
767 -4288 -1542 3951 -1805 -3626 3653 2173 -3583 1064 4261 -1379 -1730 2888 615 -2474 36
782C6O43k208L59Q91k20L41j84M3J622l46j478J796Q52k830K62K418k373j881
800b257K750l14k744J802J532k180P33K150j604J18K440j859j300L161j093l870
816b535K841J978m968l12N021k153l927M200K622m196j09M370p44l103J361K124
832B470j661k306Q88J857j827k525K390K257l327q21M666j97l913K552L159l459
848B03j240L171j054k605J400P7j652J029N7j454K112J076k763J584L425l113
864B53j616M441p63m634K347K489m247j102L449p78k369J470J547k73m52j4J937
881A685R81l322R6M449k908n001N047K358p681N73P363m243m828O977J547o090
897b997K856M109m308RL575l521q21L886l720k690N813j720n974N846L234p647
$$ plain form
782 36 679 -1529 -1170 -279 -499 -158 -342 -299 1323 977 -501 1295 2147 -683 -421 1997 -376 -2257
800 -2257 493 179 -2565 -763 769 -1411 -678 1472 -132 -14 2426 567 -733 2428 1335 -2535
816 -2535 306 2284 -2684 -2996 2025 -128 -4055 145 2767 -1429 -1538 2832 2088 -1015 346 2470
832 2470 809 -1497 -609 1248 -579 -3104 -714 1543 -1784 -2605 2061 1864 -2049 503 3662 203
848 203 -1037 2134 1080 -1525 -125 -48 -1700 -671 -614 -2068 44 1120 -1643 -59 3366 253
864 253 -1363 3078 2315 -2319 28 2517 -1730 -2832 617 -161 -2530 -1060 487 214 -238 -252 1685
881 1685 2666 -656 -560 3889 981 -4020 1027 3385 -4296 -3723 3640 -603 -5431 1546 3093 -2997
897 -2997 -141 3968 -340 -331 3244 -277 -1098 2788 -932 -3622 2191 471 -5503 343 3577 -4070
913d070J892P420n326l342P475j176o013M455J666n507J946K294m556J820L003
928A981n348J638O218o404k196J0260l685r123J0098L853j3667L453J1526j0938
942b334n849J3570k673j1333R460N026j1261L467Q635q558j317R522n855n314
956d814R604k351q996Q180K732j0883M433P884r708p32J0788o056n610J0790j671
971C590r136Q573K642j1427N322P379j2310K61J2738r732p429J5769j801j4957
985a0518J1997Q880j6753J724J5754j0804q679J4684j453j2887Q354N039j0934
998e596L045O993q088Q03Q071p194j661J0406n926o833J1878j151j2755R388O607
1013G987j5325K225J4143j1560p363J6480k145j4233J1290P527j4433K290J2016
$$ plain form
913 -4070 -2178 5242 -84 -3426 4049 2873 -3140 1315 2981 -2526 -580 1714 -2842 -1022 1981
928 1981 -3367 -1729 4489 -1915 -4111 6149 2464 -6659 3439 7292 -6375 -2922 8604 -2334
942 -2334 -8183 5387 2714 -8619 841 5867 -5394 -1927 6708 -1850 -3167 6355 500 -4814
956 -4814 4790 2439 -6557 1623 4355 -6528 -2095 5789 -3919 -4651 6137 81 -5529 5261 3590
971 3590 -5546 3027 5669 -5758 -436 6943 -5367 -5106 7632 -2100 -9529 6240 4439 -10518
985 -10518 1479 10359 -6394 -4670 11084 280 -8399 6285 4832 -8055 299 5338 -5596
998 -5596 -2551 4442 -3646 -2843 5228 -1966 -3627 6779 853 -5980 5898 4747 -8008 1380 7987
1013 7987 -7338 -5113 9030 -2530 -9893 6587 4442 -9791 1499 9026 -5407 -3117 8899
1026H899r752m877J1611m139q584R126R91r838N948N271r186K077Q069p007j885
1041c276Q683m342m874Q064k027p394P583J232j0471N939P223j1827l6J3215p560
1056A32q479J3498J217j3491O976Q986j1962j853J1578n497p960Q713J580q329
1070d891L154M723m524k6L228j988Q40J573l536J808L627n824j070P437m237o507
1086f213Q285J889r941L968Q067q246k558R894l054p077P388K038q317L146N412
1101D681o734j123O475l275l793N153n5l997L194J192l352K142J518l395J512
1116A43K104l805P06L298m028p33N194l329l671O621kp092M833N045p906l95Q333
1133E316m424n790P351J000p709L192M764n744p08N347k833k422M545r36l201
$$ plain form
1026 8899 -853 -5730 5881 1742 -6842 2284 3275 -6563 -615 4656 -4530 -2453 5616 -1391 -3276
1041 -3276 5407 1065 -3809 4255 2228 -5166 2417 3649 -6822 -883 6340 -5487 -5523 7692 132
1056 132 -8347 5151 6368 -7123 -147 8839 -3123 -4976 6602 1105 -6855 1858 3438 -4891
1070 -4891 -1737 2986 -1538 -1564 1664 -324 516 2089 -1447 361 3988 -1836 -2906 4531 294 -6213
1086 -6213 2072 3961 -5980 -2012 6055 -2191 -4749 5145 2091 -4986 2402 4440 -3877 -731 4681
1101 4681 -2053 -3176 3299 24 -3769 1384 1329 -2668 526 1718 -1634 508 2026 -1369 143
1116 143 2247 -1558 -852 2446 -1582 -2315 2879 -450 -4121 2500 2498 -4594 239 5284 -2622 -3017 5316
1133 5316 892 -4898 2453 3453 -4256 -1064 3700 -2044 -2752 2595 -238 -2660 1885 949 -2252
1148b252L744L65l899K719J751m319J300L158m187n35M783l005l117N378n2n260
1164c428L558L237n094M19M449l342j729M365j965l131M305k50m841L532K889
1179B974n686O01N655l727l177N691l3n088L040K765m419K63L538k902j392L411
1195A514j383k421L036K80l081K028J726k878O86K504k419n63K949j747k037L087
1211A281j58l346K029J856l180J77K933j849j181K722o53j744K268L3k465J832
1227E55J180l285N96K948k757j755L696k35l476K249K368k888k46K881j041j586
1243g96J690N5j470O41J17j175O74L29j382P14J190j338N6J915p59j088J821J06
1261A300j734Q40Q15j810j29J253j193p37J373k48r16J278L35r06J030O48j335
$$ plain form
1148 -2252 1492 1857 -2042 677 2428 -1891 -591 2567 -1620 -2155 2628 -377 -3494 1884 1832 -3428
1164 -3428 130 3367 -1727 -1308 3141 -201 -1930 2435 470 -2661 1644 1394 -3447 85 2974
1179 2974 -2712 -2111 3544 -183 -3360 2331 2298 -2790 250 3015 -1404 -1141 2397 -505 -1897 1514
1195 1514 131 -2290 746 1026 -2055 -27 1699 -1179 -493 2011 -408 -971 1978 231 -1806 1281
1211 1281 1123 -2223 -194 1662 -1518 -1341 1592 -257 -1438 1284 631 -1113 1155 1188 -1277 555
1227 555 1735 -1550 -954 1994 -763 -2518 1178 943 -2533 -284 2084 -804 -1050 1831 790 -796
1243 -796 894 949 -521 120 237 -938 -264 65 -1317 -603 587 -751 -695 1220 461 -627 1194 1300
1261 1300 -434 406 1221 -589 -718 535 -658 -1395 -22 -270 -1186 92 427 -479 551 1199 -136
1278a36N96J115j691n50J756j014j962J640Q23k135K64K129p80j057J572O63r78
1295B55Q0M73k05k73m69l23N32l63j134P38R68j027j82J608J9q90Q85N69q26o5
1315C70L01o91k31J22p15p8O15m86k32J145Q8n80R59O16q52K21P59r56o82P62
1335D55m48j242L99N99p13k97R72M82l03L0Q47N97p08m71R61n5j667J0J076j140
1355f16j173J184M31j033N55R95k82K33O78l28J30N78j001n14Q65q02j285Q62
1373e23K32j271N79J125p69K29J420m97l45J371m17j153R79j85j690N49M24j589
1391a531K64J263j293J13K149q82q77K604Pk460J727J454l158l82K448j954j902
1408b410K258k12k019J904J011j864J482J906k132L45K616k097j594K668r56l094
$$ plain form
1278 -136 460 1575 -116 -666 1090 76 -1886 -246 577 -1558 -1294 835 55 -1002 570 1233 255
1295 255 335 808 603 330 -139 -462 70 -293 -1427 -689 279 -748 -930 678 697 -193 692 1261 435 370
1315 370 671 -20 -251 -129 -844 -922 -307 -793 -1025 120 208 -372 587 1203 351 572 1331 375 -307 455
1335 455 7 -1235 -836 -237 -950 -1247 -275 207 -96 -66 781 1378 670 199 1160 1105 -562 -552 524 -616
1355 -616 -1789 -605 -174 -1207 -652 343 61 294 972 644 774 1352 351 -163 702 -100 -1385 -523
1373 -523 -291 -1562 -983 142 -627 -398 1022 525 180 1551 1134 -19 960 775 -915 -366 58 -1531
1391 -1531 -1267 -4 -1297 -1184 965 83 -794 1810 1817 -643 1084 2538 -620 -1002 1446 -508 -2410
1408 -2410 -152 -364 -2383 -479 532 -1332 150 2056 -76 269 2885 788 -806 1862 906 -2188
1424b188J921Q52l227Q42K481k159k78L163r48j231K911j97k385K098N37l298
1440a106Q78J626l339k44K928k312j465M004m82k992L696J914m052J247L598l511
1456C88j768L683j761l407K795L71l474J821K174k687P96L097j859m51L143j401
1472A460j931K690p48l373K040P49l780J018K631k976j88M038j514j872M073K65
1488B582l465K467J627m017L35K583l478j401L461j731k619L641P51l007K422
1503A51K390k657P37K546k519o71K418k369k010K757j292k980L025P87l503K496
1519f94L039l566N88M498k797k298M429j010m511K935J278m953J037L393l685
1534b317p63M488j457k135M032J73k994K971R13m039J668K230m639l10M115l440
$$ plain form
1424 -2188 -267 585 -2642 -1800 681 -1478 -1756 1407 459 -772 2139 1942 -443 1655 2192 -1106
1440 -1106 -228 1398 -1941 -2185 743 -1569 -3034 970 488 -2504 1192 3106 -946 301 3899 388
1456 388 -1380 2303 542 -2865 -70 301 -3173 -1352 822 -1865 -1069 2028 169 -282 2861 1460
1472 1460 -471 2219 1471 -1902 138 887 -2893 -1875 756 -2220 -2408 1630 116 -1756 2317 2582
1488 2582 -883 1584 3211 -806 -471 2112 -1366 -2767 694 -1037 -3656 -15 736 -2271 151
1503 151 2541 -116 621 3167 648 -23 2395 26 -1984 773 -519 -3499 -474 313 -3190 -694
1519 -694 2345 -1221 -633 3865 1068 -1230 3199 2189 -2322 613 1891 -3062 -2025 1368 -2317
1534 -2317 -3080 1408 -49 -2184 1848 2021 -973 1998 2911 -1128 540 2770 -1869 -2179 1936 -1504
1550a504k500N057o15m101M350K227m815K062M267m612j020N029l128l862M806
1565A641n16n502L563K740n409J237N270l787j582N755j523l839M486N20n245
1580b191K548K500n437K61M389l908j871N263j355l552M905J066m758L161L199
1595D220n368K49M927m345l078N491j348n274M215K297n364J767M668l888q87
1610a718N137k143l035M456m54m788L154J851n397R45M226m045j607N234j349
1625D67l350M318J090m162K430K610m265J28L540l298k035L915j455l306L584
1640B11Q27l839K407K952l670L05M229k761k320M155p19m212K616J668m272N43
1656a880L273k689j089L602r20j926L156K53k830K156J504l478L00K784k828j769
$$ plain form
1550 -1504 -4004 1053 438 -3663 687 2914 -1901 161 4428 -184 -1204 3825 697 -3165 1641
1565 1641 1125 -4377 -814 1926 -3483 -2246 3024 -763 -2345 3410 1887 -1952 2534 3054 -2191
1580 -2191 357 2857 -2580 -2319 2070 -1838 -3709 1554 199 -3353 1552 2618 -2140 1021 4220
1595 4220 -1148 -899 4028 -317 -3395 2096 748 -4526 -311 1986 -3378 -1611 3057 -831 -1718
1610 -1718 3419 1276 -1759 2697 2243 -2545 609 2460 -2937 -1992 2234 -1811 -3418 1816 467
1625 467 -2883 1435 2525 -1637 793 3403 -862 -734 2806 -492 -2527 1388 -67 -3373 211
1640 211 1038 -2801 -394 2558 -1112 -807 3422 661 -1659 2496 1777 -2435 181 1849 -2423 -1880
1656 -1880 1393 -1296 -2385 1217 297 -1629 1527 1780 -1050 1106 2610 -868 -568 2216 -612 -2381
1672b381L207p87k793K380J292k494J049K228j769n0K119j304j004J816r30j870
1688a291J669O9k510J250J588k393K11K796j393j351K813K38k511J337J497k316
1704b97m86J765j128j285J243j09r64J062K23q77J208O98j342N42J492j487q58
1721f00J700m69j824Q70P47j428MJ128n35j85R23j30j24P49l21m88Q38k91j156
1740e92P26M05j552J17J360j035p86J681K01j367Q92J197j113l08J134l36q63
1757b39L41Q0m77N6k14j70N40q5o48Q79O58j042M3J369n17j056Q96M25j148j32
1777d41O83l63m39K76P4O7J02k73K55P12n63m99J034O2j226M21R22j071n60J122
1797B95p8r74N90N47o52L3O34k20k24L00p7q1J04l18l8M03m50l65Q11qr23N70
$$ plain form
1672 -2381 826 39 -2754 -374 918 -1576 -527 1701 -68 -118 2001 697 -307 1509 579 -1291
1688 -1291 378 447 -2063 -813 775 -1618 -1407 1389 -4 -1355 1458 1696 -815 522 2019 -297
1704 -297 -783 982 -146 -1431 -188 -297 -1261 -199 24 -853 355 1053 -289 253 1745 258 -600
1721 -600 1100 631 -1193 -323 424 -1004 -1000 128 -407 -592 331 201 77 826 505 17 855 564 -592
1740 -592 134 539 -1013 -896 464 -571 -1357 324 525 -842 50 1247 134 -174 960 624 -239
1757 -239 102 182 -295 -239 -453 -623 -83 -168 -816 63 721 -321 -278 1091 574 -482 414 839 -309 -441
1777 -441 242 -121 -560 -284 -210 -143 -41 -314 -59 653 90 -409 625 687 -539 -118 804 -267 -827 295
1797 295 217 -757 -167 380 -272 -239 395 175 -49 251 174 93 197 -121 -159 244 -206 -571 240 232 -691 -121
1819a21Q27q89k89J034j23q21M13L76m49j46Q9rK63k98m85P81M18j129O2J411
1839I15o34j129J168O37j397lJ111n49o60N91Q5m14K62n2j53M64j84m32O72J88
1859D86r45M29P44r88k01J074n03q56J022K70j210M77Q50r01k04R60l72n73P18
1878B77j27n39O63n9q66P97N13j283K12J360r08r31J418J85j419N14Q65q72j68
1897c68O73m42j00N50n11j97R49m80q13J208K45j513N93J217j250n80J519k90
1915D10j307Q77O49j063L7P94m11k88N26j94j60M31l43j85O65l00p01P66L22j119
1935e94K09J098p49o88J110J36j054L89P19o51k63O54j89m36L40J63l33QJ88o8
1955a1Lj4j5Q0K9j11K0J08Jr2r5J13J48k35k54M48J76n88M9O41k34n70M86M05
$$ plain form
1819 -121 706 -183 -472 562 439 -382 31 407 -42 -188 -99 -108 155 -143 -628 153 571 -558 -496 915
1839 915 281 -848 320 957 -440 -443 668 119 -541 50 135 -279 -17 -69 -222 242 58 -374 298 486
1859 486 -459 -30 714 -274 -475 599 96 -760 262 532 -678 -201 649 -252 -456 504 132 -441 277
1878 277 150 -389 274 215 -651 146 659 -624 -412 948 40 -891 527 712 -707 -193 672 -200 -368
1897 -368 305 -137 -237 313 -198 -395 554 74 -739 469 714 -799 -206 1011 -239 -819 700 410
1915 410 -897 -20 629 -434 -397 397 -14 -302 224 30 -130 301 -42 -227 438 138 -563 203 525 -594
1935 -594 -385 713 -36 -724 386 522 -532 -143 576 -75 -338 316 127 -309 31 194 -139 -131 57 -11
1955 -11 -8 -22 -37 43 72 -39 -19 89 90 -2 -97 16 164 -71 -325 123 299 -289 -240 401 167 -403 83 488
1979D88n95j74N18O6m12j47L01L03m55m53P41L76j131J5J339o33j104J279N67
1998H89j570L43J430j194p55J563j26j571R27R30j417r8J228n65o51Q89j9n27
2016b94N79p9n40P39M2r71O19O52j258k0J310r07q03J319p7j188J002N14j344
2035g05O44J145j492j60J772j028j422J873K77k196Q76J542j743m13J922o91j210
2052a009J493L08j455P37Q59j242P2R46q91l10R05n94m96J085l78q68J241K54
2070F57j473R02J109j591j65J762r98j357J618J77j770Q04J070j506R1J491r17
2087i6o41J585k79j269J198N01j572L43J123j194n23J226m15q86R04K49p56M86
2105a6N17o24K34N31o20o0O35n82m34P25k99p37O84K20q93M91P00p94J2J033m93
$$ plain form
1979 488 -107 -281 237 303 -109 -256 45 348 -107 -560 181 557 -574 -559 780 147 -957 322 889
1998 889 -681 -338 1092 -102 -857 706 580 -991 -64 866 -551 -649 579 14 -637 252 233 -294
2016 -294 285 206 -334 405 447 -524 95 747 -511 -531 779 -128 -931 388 311 -877 125 639 -705
2035 -705 -61 1084 -408 -568 1204 176 -1246 627 904 -1292 -416 1126 -617 -1030 892 201 -1009
2052 -1009 484 792 -663 74 933 -309 -237 709 -182 -492 413 -181 -677 408 30 -838 403 657
2070 657 -816 86 1195 -396 -561 1201 203 -1154 464 641 -1129 -325 745 -761 -670 821 -96
2087 -96 -737 848 569 -700 498 999 -573 -230 893 -301 -824 402 -13 -899 5 254 -502 -16
2105 -16 501 -123 111 642 22 -38 597 15 -419 306 7 -730 -46 174 -719 -228 472 -322 -310 723 230
2126B30o21R40M2j006M48N28r68q1Q20n40n01Q05R7o53M20N32m43j05M77o7l19
2147C5J0Q4m7k69j73L41L6n45K41O49m72l49Q52J38p95L13O40o35l46O19j69o28
2169d70L05J95l72R4K58k02J37K30j81J18L33k80k09L98p1n03J65J61l28n8J30
2190a50o3J23J6j80L65L02n59N7P84m27p24P99K90j169J15R82p45o86Q89K16q27
2211e92K96P19m67j83N96nl62K03J4j28J5j95j77L40j69m71M52L88o52J6Q61k36
2233B63n90N62L52n81q9L59j35k82rj23K23L3m89K00O97m27n49R35L39j013J44
2254a80J018n97q20P50K78q87l6O18k14m08L28K11p0j0O1K56R5l33m2M22k62n47
2276c69L90K30p13q8P09k07n70N51L79m15K6M30k1k15L6mN9j07m28J54L54n31
$$ plain form
2126 230 -391 549 591 -415 33 561 -407 -488 332 -208 -709 96 193 -460 -40 492 49 -56 421 354 35
2147 35 45 129 82 -187 -360 -19 17 -528 -287 362 -110 -459 393 531 -264 49 689 54 -292 327 158 -470
2169 -470 -165 30 -342 -248 10 -192 -55 175 -6 112 445 165 -44 354 283 -220 -55 106 -222 -280 -150
2190 -150 -213 -90 -74 -254 111 413 -146 -89 695 268 -456 343 633 -536 -421 561 -184 -870 19 235 -592
2211 -592 -296 423 -44 -227 369 364 2 205 219 91 106 -89 -266 74 -95 -566 -114 274 -378 -362 499 263
2233 263 -327 235 587 6 -83 276 141 -141 -150 -273 -50 -17 -506 -306 391 -36 -585 350 689 -324 -180
2254 -180 838 241 -579 171 449 -438 -474 144 -70 -478 -150 61 -9 -19 42 298 393 60 18 440 178 -369
2276 -369 21 251 -462 -550 159 -48 -618 -67 312 -103 -77 353 332 117 153 149 208 101 -327 -173 181 -350
2298c50l52P76J49q34L36R56n01o10Q12L53q47n2O20k45n51J04K63j18k95J8M03
2319C5J00m51J80O75k76n59N40M21p56k05O65k01p01L09L29l40j39L22J4k2O0
2340@N1J76N8l04N5L80l18m57M43J62p10L5P03l46n12N85L79n22j01O88ln30N7
2363c1M66j93n62L4N10k05o64L05O86n07n13Q18M56p76j37Q84k7p91J35N99l08
2384A79o19J88M90l52m88M26M95m51k83O17K25n09M4M85j77l60J47J61k57j76
2404b15Q2P4l8k12J32L45k23k41N19K23o52Q8P22l69p71O45L99q63j58P72j31
2425A28n81K05M40m5k16j06L45M14p23l48J059k6j353M86J232j082r18J455L13
2444F79j428L37J172o97n53P96Q1n36J94K8j80K37k57k78O69j23q25P10O64j198
$$ plain form
2298 -350 -702 74 223 -611 -275 681 180 -430 382 735 -112 -164 456 211 -340 -236 27 -91 -386 -368 35
2319 35 135 -316 -136 539 263 -296 244 665 -91 -296 369 168 -533 -224 105 -235 -374 -52 -38 -60 0
2340 0 51 227 285 -19 36 416 98 -359 84 246 -464 -429 274 -72 -584 1 380 -142 -243 445 442 -88 -31
2363 -31 435 242 -320 -286 224 19 -645 -340 346 -161 -674 144 600 -176 -313 571 544 -247 -112 487 179
2384 179 -440 -252 238 -114 -602 -176 319 -132 -415 202 427 -82 -38 447 270 -90 57 218 -39 -215
2404 -215 -133 -59 -97 -309 -177 168 -55 -296 223 446 -206 -118 604 235 -536 109 508 -355 -513 259 128
2425 128 -453 -248 192 147 -69 -175 170 584 -139 -487 572 546 -807 -321 911 -171 -1089 366 679
2444 679 -749 -412 760 63 -490 306 387 -149 45 73 -107 130 -127 -405 264 141 -684 26 690 -508
2464e08oJ458p31j181J443M90j702K49J441r53q67J086J43p85L55K17l59M55q0
2483A65p16Q20M82j407J86J577j048j241J671L98j785M64J387j119n56J203k41
2500B40p29O87j0n92O69m0p84P09M29j191L68J153j183n66J742m66j627J390R97
2519A196j993j8J918q95j325J406M81j311K52P49n16k1L09n11L23M91j025JJ376
2538H87q18j167J490M82j731L78J468j076p22J289p4r97P00K86p89L60M32p66
2556c68J98O80p52j59R79m89p22J072O0j209O70Q74j236l14J401m01j178R01O57
2575F64j010r2Q68k42m37K56J24k8J1l63J70N31n66n19R16J36j015K69R54o31
2595dn72Q55J11o54J95M14l65m8J67j73K5K07l17k7L85k31k67M57P0m68J81M20
$$ plain form
2464 -508 -514 944 213 -968 475 965 -737 -488 953 0 -867 219 362 -423 -68 149 -210 245 165
2483 165 -551 269 751 -656 -470 1107 59 -1182 489 887 -898 -434 953 -166 -722 481 240
2500 240 -489 198 188 -404 265 225 -559 150 579 -612 -244 909 -274 -840 902 436 -1191 199 1196
2519 1196 -797 -815 1103 208 -1117 289 770 -541 -289 460 -56 -77 232 -279 44 535 -490 -489 887
2538 887 69 -1098 392 874 -857 -479 989 -87 -809 480 406 -591 109 395 -394 -34 398 -368
2556 -368 -170 510 -242 -401 578 89 -633 439 499 -710 -40 834 -402 -716 685 284 -894 7 664
2575 664 -346 -438 430 188 -249 7 131 103 114 -249 -79 452 -114 -633 283 419 -596 -327 627 -4
2595 -4 -576 279 390 -264 -69 345 -20 -68 99 -74 -49 158 -159 -186 199 -32 -299 158 228 -240 -59 361
2617C61m18j81M50l9m19J35L26k69k12K78J51k40j63L04K11l56j34M74J5n97J46
2638a77N86l05n30M18L36n19j51N05J1l42O6K67j8j65l2J79O3l06o6K91o6l22
2660b77J67J96j52j02K01O0j11N2M0L3j3j04J1R7j40j65K32O0l87J74L39l29j71
2683b89N33J8n02K67M10m20k57M43K7l93lK21p0j26k1J11J25j29j05K97Q2l27
2705a08P1L25k14k74K47N0k58QJ80j45n6J99o9kJ25k6n6J77l6j73J50J0k43P0
2729d8K08l10j08L56q7l06K82K61k95p8L49j4k54N2J46j08j27kO2Pj52j7J89J6
2753B2k00J07K16j07p9K08m3j59O8N7j52K3Q5j60l6J70m6j38J34J08j15j0R8M3
2777I4n6k8K7N9kj67LJ64j06j92J02J75j35j23K12J12j94o0K30L1k17J4J45l3
$$ plain form
2617 361 -57 -238 212 173 -246 -111 215 -54 -266 12 163 -77 -240 64 275 -81 -215 259 274 -323 -177
2638 -177 409 104 -426 -8 328 -191 -342 163 174 -168 -102 165 147 -18 -50 129 192 -114 -180 111 45 -277
2660 -277 -110 86 -66 -168 33 93 -18 34 74 107 94 -10 1 98 -42 -207 25 85 -302 -128 211 -118 -289
2683 -289 244 262 -240 27 437 17 -240 203 230 -163 -166 55 -15 -141 -162 -51 74 -55 -160 137 219 -108
2705 -108 -37 288 74 -200 47 97 -161 -153 27 -118 -174 25 -44 -46 79 53 -3 174 138 -35 115 125 -118 -48
2729 -48 160 -150 -258 98 11 -295 -13 248 -47 -125 224 210 -44 8 154 46 -81 -83 -21 -14 -166 -183 6 22
2753 22 -178 -71 145 38 -41 167 124 -35 33 90 -62 -39 46 -114 -150 20 -26 -164 -30 78 -37 -47 51 94
2777 94 38 10 37 96 94 -73 -70 94 -12 -204 -102 73 -62 -185 27 139 -55 -115 115 146 -71 -57 88 55
2801E5j69P7O7q8n5J28j7o8Q2P9r0k6J03j9q0MR9k9j85P5J86j01k51K05K77l30
2827g1j55L89P1l97L2L59j55k97J91J96j90r7N7J37n2r8j8K49Nl52J69L39k85
2850B7l10M12J17m93P2M12k55k32L15O7k35O3J46j03K9j4l5R8j5k42K28J85m51
2873b14j0N26k74m79N63K99p28K7P64l72n54N59K56o13J4M54j52k69J77N0nJ5
2895C4j48J27K95l75k08N81j6p51L90N91p23k94Q71j38p07M40M28n52o9M59j89
2916D6j58K51j54j49L89k32l34N28Q0p09K86O38o54k83Q25j15o87M67L54n97K3
2937a85N21l19k44L65o5k13K31p3j57L30j34l94M84J93p71K21Q48p07o01J102
2957D32J01j175M04R45p80n26Q61J12p38J94L94k29r5P2r0K06K8l96K37M77n27
$$ plain form
2801 55 -114 -37 30 -58 -113 15 -2 -70 12 91 1 -25 78 59 -21 -17 82 53 -132 -57 129 28 -223 -18 259 -71
2827 -71 -226 163 234 -163 -131 228 73 -224 -33 163 -27 -124 -67 70 18 -80 -98 151 156 -196 -27 312 27
2850 27 -283 129 246 -247 -175 237 -18 -250 65 132 -103 -40 106 3 32 18 -17 81 66 -176 52 237 -214
2873 -214 -224 302 28 -451 112 411 -317 -290 474 102 -452 107 363 -250 -236 218 66 -203 -26 24 19 34
2895 34 -114 13 308 -67 -275 306 290 -461 -71 520 -203 -497 374 236 -471 -31 397 -155 -224 235 46
2916 46 -112 139 -15 -164 225 -7 -341 187 267 -442 -156 482 -172 -455 370 255 -432 35 389 -208 -185
2937 -185 336 17 -227 138 73 -140 91 18 -139 191 57 -337 147 340 -431 -210 638 -69 -670 432
2957 432 533 -642 -238 707 -73 -599 262 374 -364 -170 224 -5 -100 -28 -118 88 116 -280 -43 434 -93
2978i3k90P07j7p32M07M64o39p6N41k37m03M85N9m67L10J83l68J13K82l34K3L62
3000B80l39j87N54k42n09N22L04p32L2P44l33n83N47L50n18j24M03L7k99n6J74
3021B5K00k53l19M19K66n53j29P06j42o54M34M53n30k17N84j39l76J88K16k52
3041g3q6J62l2l6K8oP2K8j47R2K14k03j78K85K9l17M5K45j31j57R0J37j1j83J7
3066a16L20J8m23J27N17l43m77N22K65o76q4O64j88n42K97L76l37j88L90R2k10
3087Dj37K24J21k48j58K97P6m80P8M96k90l52M61K09n28O9N03k65k61L38%k36
3109g9R2Nj12J76o3k73L21K20n64P0O61l42n47O00K98o96n2O21k19m75K69K58
3131A69k30j50J38J80k1k57J03M27k58m46M87L16p25m4P58l73o51O57L39p78L1
$$ plain form
2978 -93 -383 324 307 -425 -18 446 -193 -269 272 35 -368 117 176 -291 19 202 -166 -53 229 -105 -82 280
3000 280 -59 -246 308 66 -443 79 383 -349 -317 427 94 -489 58 408 -110 -234 169 206 -93 -149 25
3021 25 225 -28 -347 72 338 -215 -344 362 220 -434 0 453 -77 -294 290 151 -225 -37 179 -73
3041 -73 -159 3 -29 -65 -37 -43 29 57 -90 2 216 13 -165 120 149 -168 -123 122 -9 -166 -76 61 50 -133 -116
3066 -116 204 222 -201 -74 443 100 -377 145 410 -266 -350 314 126 -416 -119 257 -80 -268 122 214 4
3087 4 -133 91 212 -36 -194 103 179 -301 -223 273 -17 -369 92 301 -227 -158 345 80 -181 157 157 -79
3109 -79 13 18 -94 82 19 -254 67 287 -277 -207 454 112 -435 165 463 -233 -285 336 117 -358 -89 169
3131 169 -61 -211 -73 107 86 -171 -68 359 101 -345 142 458 -267 -311 447 74 -577 80 419 -359 -328
3152c28O99l00m30M63J80l86P6J48j34N0ok21K28J47n10Q2N74l40m49N94K45o54
3174b72N7N88k67l78K87K11k41j01P0J11%k77O4M47k33m91N30L78p29p0Q30k76
3196B38p76O00M75p79j71P61j84n67L39L50l29k00L01R6j32j20P8K18j47k96K53
3217HK66m05k05M77L2m86J98M05k70k20K83J10k03o6J32P3k7k36P8K77k13l25
3239c17L73K02n04l3O11j70n44M30L99n19k04N38qn27J42L89k08l70K33K85k35
3260c7k30K28K98l05k31M11K00m65o6N03j20m58K20L25l09k39K78J53k62p7K29
3281D6J07j78o1J87P8k22q3K47Jk74O5K38j08k89K22K15k50j51K94O7k56OK79
3304A80n8l01J56J94k03j89K67J08l05pK83k0k26Q8K23j10j86J30J32j38j46J15
$$ plain form
3152 -328 371 71 -359 104 284 -102 -26 122 -12 38 32 -189 39 186 -324 -242 332 -8 -457 137 382 -272
3174 -272 -215 373 106 -272 15 226 -15 -116 -46 65 65 -212 -148 299 66 -425 105 483 -246 -316 514 238
3196 238 -538 62 537 -242 -413 348 164 -403 -64 286 -43 -243 58 154 22 -98 -20 198 51 -245 8
3217 8 274 -131 -336 141 173 -313 -115 290 20 -200 83 193 -10 -76 56 129 102 -134 -56 221 8 -317
3239 -317 56 258 -246 -279 332 162 -382 48 447 -72 -276 262 254 -273 -131 258 50 -320 -87 198 -37
3260 -37 -267 -39 259 -46 -277 134 334 -131 -197 306 186 -272 -52 273 -36 -275 3 156 -106 -183 46
3281 46 153 -25 -86 101 179 -43 -126 121 122 -152 -87 151 43 -246 -24 191 -59 -210 84 151 -105 -99 180
3304 180 122 -179 -23 171 -32 -221 46 154 -151 -158 125 105 -121 -33 190 80 -106 24 156 18 -128 -13
3326a3J42j78j47K17R7k23r7K82K6k44Q2K07q4j41P4R3l0j22j2J27K9k26oK45
3350I8r9k33K03K58k96j08L68j0l18J34K26k20j20K05n0j56P6M7o3J6L3lP6m2
3374B2m7J37oj82J04J60k67j11L22n0l82K11K96k90j07L05J3k03O9J53j11l7M3
3397D2r4Q6K1k14oL06j34k31K99J46k91m7L52r1k44J06J12p4j15oO7L1j46o5K61
3422G1L7k83J50K81k18j70L34j8l58J56K52l34j35L50n6l66K56K60k94p4L39j8
3444A62k31J00J33o9j08k8Q3J7j76o9K12J8k41J00K54j48j55K19J26k23K6J17
3466A19r1o6J1n5J8M7j39J1K34p1j98K63J72k72n1K89r3k59J53J56k69r5K42q
3490D8k34R8J55m8j16J44Q7r5o1J19O0j75n1J46l1k23P6J67j51j47K29R1j64J9
$$ plain form
3326 -13 129 -49 -196 21 118 -105 -202 80 106 -138 -56 151 67 -74 0 93 63 -59 -71 56 85 -141 -147 98
3350 98 -1 -234 -31 227 -69 -177 191 181 -137 -3 223 3 -117 88 38 -118 -42 5 -58 -42 -9 -12 64 22
3374 22 -25 112 106 -76 28 188 -79 -190 132 82 -300 -89 207 -83 -190 115 128 -75 -6 147 36 -1 42
3397 42 -52 34 55 -159 -165 141 7 -224 75 221 -70 -117 235 144 -100 6 118 44 -71 -77 -10 21 -125 -190 71
3422 71 108 -175 -25 256 38 -132 202 184 -174 -18 234 -100 -235 115 59 -307 -51 209 -85 -159 180 162
3444 162 -69 31 164 95 -13 -41 42 59 -117 -186 26 44 -197 -97 157 9 -146 73 199 -24 2 119
3466 119 28 -38 -27 -82 -64 -17 -156 -145 89 18 -180 83 255 -17 -68 221 128 -131 22 178 -91 -186 56 48
3490 48 -186 -88 67 19 -97 47 134 39 -22 97 157 -18 -69 77 46 -177 -101 66 -85 -232 -3 88 -76 -57
3514e7K01l2j52R6J16j23j20N7L2j05l3P5j0m5M6N8N5Nj4L2L1k2m4l4P9r6j28
3541a32J11K0j46J0J49o0m9J23N7p1MJ19n9n3K8o4l3L3p4kN9o1lJ38m0q0J71O8
3569A63j55K5J79j63j34J62l2k20J23J11k04PK19j06j00K22K7j67J48J16k36K1
3591FJ55j80j35J34k1j21P2N0n6Q1O5r3J21R9j24j3J75j33j93K03l5k42R0J82
3615H7k41k9K75j20p0J67P3j44J08O7j73J7J08j90m9J54j46j29K62Rk52J69K34
3638A87k25n9K96l3k19P8J01j16p8J0K0Op7l2J63L5j74J21K30j75j25K98Nl34
3662i7R6K06k62j40K44m3k25J23J64q9m7R3P6l3lQO4k0j53K2J03j55j63K03P2
3687D4k35O1K19l7j34J32J37j03n9N8M7n2j40J0J06j29j46J61J42k37l4L17k1
$$ plain form
3514 -57 144 112 -40 56 172 49 -71 -14 18 -87 -120 -45 -55 -100 -54 4 59 64 50 82 113 91 47 13 92 -4 -132
3541 -132 -21 -1 -147 -137 12 -48 -97 26 83 12 16 135 76 23 51 -13 -46 -13 -87 -89 -30 -91 -94 44 4 -76 95 163
3569 163 8 33 212 49 -85 77 45 -175 -52 59 -145 -138 81 -25 -125 97 124 -43 105 221 -15 6
3591 6 161 -19 -154 -20 -41 -162 -90 -40 -96 -15 50 -43 78 177 53 40 215 82 -111 92 57 -185 -95 87
3615 87 -154 -183 92 -28 -98 69 142 -2 106 173 0 17 125 -65 -114 40 -106 -235 27 36 -216 -47 187
3638 187 -38 -97 199 166 -53 25 126 10 -68 -58 -38 -32 -109 -141 22 57 -117 4 234 59 -66 232 237 -97
3662 -97 -1 205 -57 -197 47 4 -221 -98 66 -23 -70 23 99 66 63 71 135 115 -38 -16 87 -68 -231 -28 44
3687 44 -191 -130 89 52 -82 50 187 84 25 83 130 78 -62 -52 54 -75 -221 -60 82 -155 -189 128 107
3710A07k48J67K51k23j52K43Kk83L8J72o8j91M7J49k4j11P8K22j24j29J82J25
3732B30k27j10K36m8k44O5J70j20j50J85Q5j32qJ32O2q4m3J45Nj83n1J90l6k99
3756b30R2K10j49j50K32J26k28PK57j1k03M3J52o1j98N0J16o9j90P9K00j51j35
3779b11K62J11k06LK49n4k01Q0J26j69j18J43J0j14l8P5O6o7j6Q9J17j48m7K23
3803A65o8k24J26J83k44j43K36J8k59R1K29q6j52J54J22j10m8R5L8l8j41N9J02
3826A05j59j16K11L7k58P8K61j43j44K04J10k27J9J82j27j43J26Nq2KJ7l4N5j3
3850c4m0J34M5j41O9J26j41r4J90k2k05P8J12j56n7J69l7n9O4L2j5P8p2j4J19
3875A29m2j82R9J21k39l8K46j00k14K23J32k30pK28q0j31J38N0j15L1L8r9L9J1
$$ plain form
3710 107 -141 26 277 54 -98 145 147 -136 -98 74 6 -185 -138 11 -13 -124 -46 176 52 -77 105 230
3732 230 3 -107 129 81 -163 -98 72 -48 -198 -13 72 -60 -68 64 126 42 -1 144 149 -34 -85 105 69 -230
3756 -230 -138 72 -77 -227 5 131 -97 -90 167 156 -47 -4 148 87 -111 -61 55 -14 -204 -125 75 -76 -211
3779 -211 51 162 -44 -41 208 154 -47 33 159 -10 -128 15 25 -89 -127 -52 14 -53 -69 20 137 -11 -58 165
3803 165 97 -127 -1 182 -62 -205 31 49 -210 -119 110 24 -128 26 148 38 -10 85 123 85 -56 3 105
3826 105 -54 -170 41 78 -180 -102 159 16 -128 76 186 -41 -22 160 33 -110 16 21 -61 -59 -42 -76 -21 -34
3850 -34 -74 60 105 -36 33 159 18 -76 114 92 -113 -35 77 -79 -136 33 -4 -63 1 33 18 96 24 10 129
3875 129 87 -95 4 125 -114 -152 94 -6 -220 3 135 -95 -102 126 46 -85 53 103 -12 19 57 -42 -3 8
3899Hr3P0M7j24J02J03j44k1J99p7j66J69P0k06J0J58j51q0J93o5j27J44N3j51
3923g9M7J35j40MJ28p5j29J30kj06P9L6r4kR1n9L2O8n0nP1n0o5J08Pj39P9P7j80
$$ plain form
3899 8 -85 -15 32 -92 10 113 -31 -52 147 70 -96 73 143 -63 -53 105 -46 -126 67 2 -125 19 72 -79
3923 -79 -32 103 -37 -33 95 20 -109 21 19 -87 -8 28 -66 -68 23 -36 -4 64 14 9 80 30 -35 73 80 -59 20 97 -83
$$ [...]
8191c
##END NTUPLES=NMR FID
##END=
