##TITLE=1H_AM_NV89.1
 
 8 sc, 
 28.11.2023
##JCAMPDX= 6.0         $$ Bruker NMR JCAMP-DX V2.0
##DATA TYPE= NMR FID
##DATA CLASS= NTUPLES
##ORIGIN= UXNMR, Bruker Analytische Messtechnik GmbH
##OWNER= root
$$ XWIN-NMR		Version 3.5
$$ Tue Nov 28 15:49:42 2023 Russian Standard Time (UT+4h)  she@DPX200
##.OBSERVE FREQUENCY= 200.131
##.OBSERVE NUCLEUS= ^1H
##.DELAY= (6, 6)
##.ACQUISITION MODE= SIMULTANEOUS
##.ACQUISITION SCHEME= undefined
##.AVERAGES= 8
##.DIGITISER RES= 18
##SPECTROMETER/DATA SYSTEM= spect
##.PULSE SEQUENCE= zg30
##.SOLVENT NAME= Acetone
##.SHIFT REFERENCE= (INTERNAL, Acetone, 0, 15.7039)
##AUDIT TRAIL= $$ (NUMBER, WHEN, WHO, WHERE, WHAT)
$$ ##TITLE= Audit trail, XWIN-NMR		Version 3.5
$$ ##JCAMPDX= 5.01
$$ ##ORIGIN= Bruker BioSpin GmbH
$$ ##OWNER= she
$$ F:/spectra/data/she/nmr/H-F/1/audita.txt
$$ ##AUDIT TRAIL=  $$ (NUMBER, WHEN, WHO, WHERE, WHAT)
(   1,<2023-11-28 15:48:31.26 +0400>,<she>,<DPX200>,
      <created by zg, POWCHK disabled, PULCHK disabled
       configuration hash MD5:
       00 E9 B6 7A A2 85 ED C7 34 08 36 98 17 FE 4E 26
       data hash MD5: 16K
       00 8A 94 8C 10 27 AC 73 03 3E 8B DA 91 50 BC C1>)
$$ ##END=
$$ 
$$ hash MD5
$$ 6F 1B 4A 23 2B 81 B9 BE 70 B1 2C 6C 0E 25 65 89
##$RELAX= 
##$RELAX= 
##$RELAX= 
##$RELAX= 
##$RELAX= 
##$RELAX= 
$$ Bruker specific parameters
$$ --------------------------
##$DU= <F:/spectra>
##$EXPNO= 1
##$NAME= <H-F>
##$PROCNO= 1
##$TYPE= <nmr>
##$USER= <she>
##$AMP= (0..31)
100 100 100 100 100 100 100 100 100 100 100 100 100 100 100 100 100 100 
100 100 100 100 100 100 100 100 100 100 100 100 100 100 
##$AQSEQ= 0
##$AQ_mod= 1
##$AUNM= <au_zg>
##$AUTOPOS= <>
##$BF1= 200.13
##$BF2= 200.13
##$BF3= 200.13
##$BF4= 200.13
##$BF5= 200.13
##$BF6= 200.13
##$BF7= 200.13
##$BF8= 200.13
##$BYTORDA= 1
##$CFDGTYP= 0
##$CFRGTYP= 5
##$CHEMSTR= <none>
##$CNST= (0..31)
1 1 145 1 1 1 1 1 1 1 1 1 1 1 1 1 1 1 1 1 1 1 1 1 1 1 1 1 1 1 1 1 
##$CPDPRG= <>
##$CPDPRG1= <>
##$CPDPRG2= <>
##$CPDPRG3= <>
##$CPDPRG4= <mlev>
##$CPDPRG5= <mlev>
##$CPDPRG6= <mlev>
##$CPDPRG7= <mlev>
##$CPDPRG8= <mlev>
##$CPDPRGB= <>
##$CPDPRGT= <>
##$D= (0..31)
0 1.2 0 0 0 0 0 0 0 0.06 0 0.03 0 0 0 0 0.0002 0 0 0 0 0 0 0 0 0 0 0 0 
0 0 0 
##$DATE= 1701172110
##$DBL= (0..7)
120 120 120 120 120 120 120 120 
##$DBP= (0..7)
150 150 150 150 150 150 150 150 
##$DBP07= 0
##$DBPNAM0= <>
##$DBPNAM1= <>
##$DBPNAM2= <>
##$DBPNAM3= <>
##$DBPNAM4= <>
##$DBPNAM5= <>
##$DBPNAM6= <>
##$DBPNAM7= <>
##$DBPOAL= (0..7)
0.5 0.5 0.5 0.5 0.5 0.5 0.5 0.5 
##$DBPOFFS= (0..7)
0 0 0 0 0 0 0 0 
##$DE= 6
##$DECBNUC= <off>
##$DECIM= 32
##$DECNUC= <off>
##$DECSTAT= 4
##$DIGMOD= 1
##$DIGTYP= 9
##$DL= (0..7)
0 120 120 120 120 120 120 120 
##$DP= (0..7)
150 150 150 150 150 150 150 150 
##$DP07= 0
##$DPNAME0= <>
##$DPNAME1= <>
##$DPNAME2= <>
##$DPNAME3= <>
##$DPNAME4= <>
##$DPNAME5= <>
##$DPNAME6= <>
##$DPNAME7= <>
##$DPOAL= (0..7)
0.5 0.5 0.5 0.5 0.5 0.5 0.5 0.5 
##$DPOFFS= (0..7)
0 0 0 0 0 0 0 0 
##$DQDMODE= 0
##$DR= 18
##$DS= 0
##$DSLIST= <SSSSSSSSSSSSSSS>
$$ [...]
##$SUBNAM2= <"">
##$SUBNAM3= <"">
##$SUBNAM4= <"">
##$SUBNAM5= <"">
##$SUBNAM6= <"">
##$SUBNAM7= <"">
##$SUBNAM8= <"">
##$SUBNAM9= <"">
##$SW= 18.0517599122864
##$SWIBOX= (0..15)
0 0 2 0 0 0 0 0 0 0 0 0 0 0 0 0 
##$SW_h= 3612.71676300578
##$TD= 16384
##$TD0= 1
##$TE= 0
##$TE2= 300
##$TE3= 300
##$TEG= 300
##$TL= (0..7)
0 120 120 120 120 120 120 120 
##$TP= (0..7)
150 150 150 150 150 150 150 150 
##$TP07= 0
##$TPNAME0= <>
##$TPNAME1= <>
##$TPNAME2= <>
##$TPNAME3= <>
##$TPNAME4= <>
##$TPNAME5= <>
##$TPNAME6= <>
##$TPNAME7= <>
##$TPOAL= (0..7)
0.5 0.5 0.5 0.5 0.5 0.5 0.5 0.5 
##$TPOFFS= (0..7)
0 0 0 0 0 0 0 0 
##$TUNHIN= 0
##$TUNHOUT= 0
##$TUNXOUT= 0
##$USERA1= <user>
##$USERA2= <user>
##$USERA3= <user>
##$USERA4= <user>
##$USERA5= <user>
##$V9= 5
##$VALIST= <valist>
##$VCLIST= <CCCCCCCCCCCCCCC>
##$VD= 0
##$VDLIST= <DDDDDDDDDDDDDDD>
##$VPLIST= <PPPPPPPPPPPPPPP>
##$VTLIST= <TTTTTTTTTTTTTTT>
##$WBST= 1024
##$WBSW= 4
##$XGAIN= (0..3)
0 0 0 0 
##$XL= 0
##$YL= 0
##$YMAX_a= 1035718
##$YMIN_a= -191383
##$ZGOPTNS= <>
##$ZL1= 120
##$ZL2= 120
##$ZL3= 120
##$ZL4= 120
##$ABSF1= 10
##$ABSF2= 0
##$ABSG= 5
##$ABSL= 3
##$ALPHA= 0
##$AQORDER= 0
##$ASSFAC= 0
##$ASSFACI= 0
##$ASSFACX= 0
##$ASSWID= 0
##$AUNMP= <proc_1d>
##$AZFE= 0.1
##$AZFW= 0.1
##$BCFW= 1
##$BC_mod= 2
##$BYTORDP= 1
##$COROFFS= 0
##$CY= 11.3945322036743
##$DATMOD= 1
##$DC= 2
##$DFILT= <>
##$DTYPP= 0
##$F1P= 15.7292609196834
##$F2P= 12.9074282941183
##$FCOR= 0.5
##$FTSIZE= 0
##$FT_mod= 4
##$GAMMA= 1
##$GB= 0.15
##$INTBC= 1
##$INTSCL= 1
##$ISEN= 128
##$LB= 0.24
##$LEV0= 0
##$LPBIN= 0
##$MAXI= 10000
##$MC2= 0
##$MEAN= 0
##$ME_mod= 0
##$MI= 1.114404
##$NCOEF= 0
##$NC_proc= 0
##$NLEV= 6
##$NOISF1= 3.799351
##$NOISF2= 2.8
##$NSP= 1
##$NTH_PI= 0
##$NZP= 0
##$OFFSET= 15.70392
##$PC= 1
##$PHC0= -24501.2
##$PHC1= 16.4527
##$PH_mod= 1
##$PKNL= yes
##$PPARMOD= 0
##$PSCAL= 0
##$PSIGN= 0
##$REVERSE= no
##$SF= 200.130013532006
##$SI= 16384
##$SIGF1= 3
##$SIGF2= 2
##$SINO= 400
##$SIOLD= 16384
##$SREGLST= <1H.CDCl3>
##$SSB= 0
##$STSI= 0
##$STSR= 0
##$SW_p= 3612.71676300578
##$SYMM= 0
##$S_DEV= 0
##$TDeff= 0
##$TDoff= 0
##$TI= <>
##$TILT= no
##$TM1= 0
##$TM2= 0
##$TOPLEV= 0
##$USERP1= <user>
##$USERP2= <user>
##$USERP3= <user>
##$USERP4= <user>
##$USERP5= <user>
##$WDW= 1
##$XDIM= 8192
##$YMAX_p= 0
##$YMIN_p= 0
$$ End of Bruker specific parameters
$$ ---------------------------------
##NTUPLES= NMR FID
##VAR_NAME=  TIME,          FID/REAL,        FID/IMAG
##SYMBOL=    X,             R,               I
##VAR_TYPE=  INDEPENDENT,   DEPENDENT,       DEPENDENT
##VAR_FORM=  AFFN,          ASDF,            ASDF
##VAR_DIM=   8192,          8192,            8192
##UNITS=     SECONDS,       ARBITRARY UNITS, ARBITRARY UNITS
##FACTOR=    0.0002768,     1,               1
##FIRST=     0,             0,               0
##LAST=      2.2672688,     0,               0
##MIN=       0,             -191383,         0
##MAX=       2.2672688,     1035718,         0
$$ Real data points
##PAGE= N=1
##DATA TABLE= (X++(R..R)), XYDATA
$$ plain form
0 0 0 0 0 0 0 0 -8 0 -8 0 -8 8 -16 16 -25 26 -40 42 -58 65 -83 97 -118 133 -163 186 -220 248 -293 331 -382
31 -382 431 -494 555 -630 706 -799 890 -996 1110 -1238 1372 -1527 1686 -1868 2061 -2277
47 -2277 2508 -2766 3042 -3358 3695 -4078 4497 -4973 5503 -6115 6810 -7626 8586 -9745
61 -9745 11164 -12966 15323 -18572 23345 -31094 45862 -84532 420708 1035718 901182 982850
73 982850 916462 952487 920825 937785 905584 926915 898953 905475 889601 894685 872657 880612 864656
86 864656 862537 851527 853435 836883 838679 829340 825053 816017 816862 805512 803088 798154 794309 785364
100 785364 786196 778866 773203 770982 767524 758377 758949 753601 746063 744528 740820 731892 730768 726167 717986
115 717986 715096 711439 702791 699075 695221 687140 682358 678872 670675 665451 662097 654564 648885 645465 638629
$$ packed form
0@%%%%%%qQqQqJ6k4L2m1N1o6Q2j00J23j48J80k15K51k96L49m06M68n41O24p13
31c82Q13r25J049j185J336j505J689j886K106k348K610k899L213l554L929m338
47b277M785n274N808o400P053p773Q575r470J0476j1618J2925j4436J6212j8331
61i745K0909k4130K8289l3895M1917n4439P6956j30394N05240O15010j34536Q1668
73I82850o6388L6025l1662J6960l2201K1331k7962O522j5874N084k2028P955j5956
86H64656k119j1010J908j6552J796r339m287r036Q45j1350k424m934l845q945
100G85364Q32p330n663k221l458r147N72n348p538j535l708q928j124m601q181
115G17986k890l657q648l716l854q081m782l486q197n224l354p533n679l420o836
$$ plain form
130 638629 633113 629633 623743 618180 614702 610099 604593 601081 597629 592237 588918 586432 581050 577868 576154
145 576154 571030 567845 566447 561584 558386 557071 552587 549058 547666 543542 539649 537990 534094 529752 527997
160 527997 524244 519447 517479 513728 508845 506501 502782 497927 495317 491717 487069 483965 480677 476439 473001
175 473001 469980 466156 462555 460003 456520 452740 450585 447527 443920 441993 439189 435784 434070 431637 428404
190 428404 426645 424581 421524 419580 417856 414853 412798 411316 408253 406054 404634 401615 399380 397815 394787
205 394787 392502 390834 387919 385467 383515 380789 378261 376148 373659 370953 368793 366609 363815 361628 359605
220 359605 356885 354783 352916 350279 348224 346501 344101 342066 340468 338370 336355 334896 333008 330963 329664
235 329664 327955 325839 324715 323123 321039 319983 318417 316386 315314 313806 311899 310638 309163 307323 305924
$$ packed form
130F38629n516l480n890n563l478m603n506l512l452n392l319k486n382l182j714
145E76154n124l185j398m863l198j315m484l529j392m124l893j659l896m342j755
160E27997l753m797j968l751m883k344l719m855k610l600m648l104l288m238l438
175D73001l021l824l601k552l483l780k155l058l607j927k804l405j714k433l233
190D28404j759k064l057j944j724l003k055j482l063k199j420l019k235j565l028
205C94787k285j668k915k452j952k726k528k113k489k706k160k184k794k187k023
220C59605k720k102j867k637k055j723k400k035j598k098k015j459j888k045j299
235C29664j709k116j124j592k084j056j566k031j072j508j907j261j475j840j399
$$ plain form
250 305924 304552 302720 301157 299922 298133 296451 295209 293430 291704 290512 288724 286987 285793 284171 282375
265 282375 281124 279656 277886 276574 275313 273540 272118 271052 269351 267910 266929 265237 263872 262959 261276
280 261276 259941 259050 257513 256150 255182 253761 252426 251445 250136 248692 247681 246548 245002 243974 242911
295 242911 241355 240318 239295 237743 236698 235663 234193 233070 232035 230675 229457 228487 227173 225887 224973
310 224973 223782 222426 221547 220368 218980 218204 217088 215668 214878 213835 212516 211669 210649 209382 208485 207586
326 207586 206349 205387 204559 203386 202392 201649 200431 199446 198765 197576 196548 195915 194767 193776 193062 192034 191031
343 191031 190271 189357 188297 187563 186753 185674 184905 184157 183057 182325 181695 180527 179817 179152 178083 177342 176660 175644
361 175644 174875 174233 173333 172421 171826 171003 170079 169516 168685 167712 167200 166435 165463 164905 164161 163234 162684 161977 161029
$$ packed form
250C05924j372j832j563j235j789j682j242j779j726j192j788j737j194j622j796
265B82375j251j468j770j312j261j773j422j066j701j441r81j692j365r13j683
280B61276j335q91j537j363r68j421j335r81j309j444j011j133j546j028j063
295B42911j556j037j023j552j045j035j470j123j035j360j218r70j314j286r14
310B24973j191j356q79j179j388p76j116j420p90j043j319q47j020j267q97q99
326B07586j237r62q28j173r94p43j218r85o81j189j028o33j148r91p14j028j003
343A91031p60r14j060p34q10j079p69p48j100p32o30j168p10o65j069p41o82j016
361A75644p69o42r00r12n95q23r24n63q31r73n12p65r72n58p44r27n50p07r48
$$ plain form
380 161029 160411 159793 158893 158207 157604 156787 156037 155568 154683 153923 153495 152669 151879 151453 150621 149873 149437 148703 147918
399 147918 147427 146742 145998 145456 144860 144111 143577 143072 142231 141701 141197 140434 139835 139381 138619 138065 137613 136876 136302
418 136302 135839 135210 134607 134118 133555 132910 132469 131939 131221 130830 130304 129627 129192 128691 128005 127591 127145 126447 126029
437 126029 125594 124956 124468 124051 123440 122933 122548 121916 121378 120997 120417 119887 119528 118962 118377 118076 117520 116920 116558
456 116558 116080 115532 115147 114700 114157 113737 113353 112781 112322 111996 111442 110967 110677 110095 109652 109376 108817 108334 108037
475 108037 107531 107012 106706 106217 105682 105347 104923 104336 104020 103648 103049 102723 102344 101748 101361 101003 100473 100065 99717
494 99717 99192 98816 98430 97969 97514 97200 96737 96289 95974 95553 95091 94800 94372 93867 93593 93252 92748 92443 92145 91634
514 91634 91282 90985 90532 90158 89903 89416 89061 88788 88339 87946 87695 87251 86842 86628 86157 85777 85529 85113 84732 84464
$$ packed form
380A61029o18o18r00o86o03q17p50m69q85p60m28q26p90m26q32p48m36p34p85
399A47918m91o85p44n42n96p49n34n05q41n30n04p63n99m54p62n54m52p37n74
418A36302m63o29o03m89n63o45m41n30p18l91n26o77m35n01o86m14m46o98m18
437A26029m35o38m88m17o11n07l85o32n38l81n80n30l59n66n85l01n56o00l62
456A16558m78n48l85m47n43m20l84n72m59l26n54m75k90n82m43k76n59m83k97
475A08037n06n19l06m89n35l35m24n87l16l72n99l26l79n96l87l58n30m08l48
494I9717n25l76l86m61m55l14m63m48l15m21m62k91m28n05k74l41n04l05k98n11
514I1634l52k97m53l74k55m87l55k73m49l93k51m44m09k14m71l80k48m16l81k68
$$ plain form
534 84464 84103 83707 83411 83114 82695 82373 82084 81704 81426 81141 80749 80422 80177 79780 79503 79249 78862 78572 78353 77979
554 77979 77654 77443 77166 76761 76534 76279 75867 75650 75377 74946 74763 74491 74077 73863 73602 73197 72967 72693 72332 72029
574 72029 71798 71442 71155 70942 70609 70298 70065 69758 69398 69197 68917 68542 68356 68097 67758 67517 67285 66971 66686 66499
594 66499 66156 65868 65695 65348 65071 64939 64582 64246 64140 63840 63511 63364 63063 62742 62560 62299 61972 61802 61523 61240
614 61240 61002 60772 60445 60236 60018 59699 59484 59245 58962 58725 58504 58197 57959 57753 57521 57258 57041 56846 56517 56356
634 56356 56095 55816 55645 55405 55127 54948 54749 54460 54270 54080 53778 53590 53394 53115 52915 52702 52429 52213 52069 51748
654 51748 51510 51338 51071 50806 50653 50398 50142 49998 49705 49470 49280 49046 48792 48597 48353 48090 47861 47707 47433 47238
674 47238 47067 46806 46570 46401 46156 45933 45781 45558 45290 45177 44926 44684 44489 44293 44042 43863 43644 43374 43228 43025
$$ packed form
534H4464l61l96k96k97m19l22k89l80k78k85l92l27k45l97k77k54l87k90k19l74
554G7979l25k11k77m05k27k55m12k17k73m31j83k72m14k14k61m05k30k74l61l03
574G2029k31l56k87k13l33l11k33l07l60k01k80l75j86k59l39k41k32l14k85j87
594F6499l43k88j73l47k77j32l57l36j06l00l29j47l01l21j82k61l27j70k79k83
614F1240k38k30l27k09k18l19k15k39k83k37k21l07k38k06k32k63k17j95l29j61
634E6356k61k79j71k40k78j79j99k89j90j90l02j88j96k79k00k13k73k16j44l21
654E1748k38j72k67k65j53k55k56j44k93k35j90k34k54j95k44k63k29j54k74j95
674D7238j71k61k36j69k45k23j52k23k68j13k51k42j95j96k51j79k19k70j46k03
$$ plain form
694 43025 42789 42596 42384 42123 41949 41749 41490 41314 41120 40867 40659 40483 40252 40065 39878 39692 39452 39255 39094 38883
714 38883 38706 38517 38315 38154 37974 37790 37618 37491 37262 37092 36961 36767 36607 36480 36288 36081 35949 35824 35606 35468
734 35468 35288 35114 35010 34782 34619 34461 34279 34145 33997 33814 33626 33479 33301 33137 32978 32818 32643 32487 32318 32164
754 32164 32004 31832 31705 31518 31367 31219 31071 30949 30772 30644 30491 30362 30168 30073 29933 29782 29671 29539 29372 29266
774 29266 29121 28971 28870 28723 28600 28431 28351 28190 28035 27909 27800 27672 27548 27427 27247 27143 26983 26873 26742 26615
794 26615 26466 26346 26220 26067 25942 25843 25709 25593 25491 25311 25179 25116 24973 24819 24739 24595 24483 24353 24240 24151 24029
815 24029 23918 23789 23701 23578 23484 23361 23260 23157 23070 22954 22810 22718 22625 22506 22432 22302 22210 22073 22006 21858 21782 21669 21552
838 21552 21465 21340 21252 21125 21055 20929 20826 20734 20615 20496 20412 20315 20216 20128 19991 19865 19780 19696 19600 19481 19390 19285 19203 19115
$$ packed form
694D3025k36j93k12k61j74k00k59j76j94k53k08j76k31j87j87j86k40j97j61k11
714C8883j77j89k02j61j80j84j72j27k29j70j31j94j60j27j92k07j32j25k18j38
734C5468j80j74j04k28j63j58j82j34j48j83j88j47j78j64j59j60j75j56j69j54
754C2164j60j72j27j87j51j48j48j22j77j28j53j29j94r5j40j51j11j32j67j06
774B9266j45j50j01j47j23j69q0j61j55j26j09j28j24j21j80j04j60j10j31j27
794B6615j49j20j26j53j25r9j34j16j02j80j32o3j43j54q0j44j12j30j13q9j22
815B4029j11j29q8j23r4j23j01j03q7j16j44r2r3j19p4j30r2j37o7j48p6j13j17
838B1552q7j25q8j27p0j26j03r2j19j19q4r7r9q8j37j26q5q4r6j19r1j05q2q8
$$ plain form
862 19115 19013 18891 18821 18707 18577 18516 18398 18355 18245 18092 18031 17919 17830 17741 17625 17554 17434 17365 17257 17158 17060 16959 16860
885 16860 16782 16678 16601 16496 16412 16290 16188 16105 16010 15953 15867 15734 15677 15605 15491 15381 15356 15250 15134 15077 14980 14919 14829 14756 14654
910 14654 14570 14501 14398 14341 14279 14182 14114 14029 13966 13860 13797 13730 13639 13566 13473 13426 13335 13249 13174 13080 13034 12949 12873 12815 12708 12675 12586 12507
938 12507 12435 12334 12290 12198 12153 12068 12001 11953 11888 11809 11754 11682 11617 11551 11485 11438 11333 11273 11227 11187 11118 11062 10988 10923 10849 10787 10718 10671
966 10671 10601 10538 10482 10415 10367 10316 10262 10204 10136 10062 10004 9958 9926 9858 9770 9710 9678 9648 9551 9509 9422 9362 9359 9288 9195 9193 9105 9059 8976 8936
996 8936 8908 8844 8785 8738 8690 8633 8571 8525 8493 8431 8382 8330 8284 8235 8197 8135 8073 8033 7968 7922 7877 7847 7769 7737 7683 7595 7607 7536 7504 7414
1026 7414 7382 7334 7275 7243 7192 7150 7100 7033 6979 6947 6881 6850 6815 6747 6715 6640 6630 6562 6526 6471 6442 6365 6355 6286 6272 6214 6184 6154 6104
1055 6104 6061 6038 6018 5945 5897 5884 5853 5810 5773 5733 5682 5676 5595 5587 5564 5513 5487 5421 5396 5368 5323 5339 5275 5230 5191 5135 5102 5086 5083 5038 5021
$$ packed form
862A9115j02j22p0j14j30o1j18m3j10j53o1j12q9q9j16p1j20o9j08r9r8j01r9
885A6860p8j04p7j05q4j22j02q3r5n7q6j33n7p2j14j10k5j06j16n7r7o1r0p3j02
910A4654q4o9j03n7o2r7o8q5o3j06o3o7r1p3r3m7r1q6p5r4m6q5p6n8j07l3q9p9
938A2507p2j01m4r2m5q5o7m8o5p9n5p2o5o6o6m7j05o0m6m0o9n6p4o5p4o2o9m7
966A0671p0o3n6o7m8n1n4n8o8p4n8m6l2o8q8o0l2l0r7m2q7o0lp1r3kq8m6q3m0
996H936k8o4n9m7m8n7o2m6l2o2m9n2m6m9l8o2o2m0o5m6m5l0p8l2n4q8J2p1l2r0
1026G414l2m8n9l2n1m2n0o7n4l2o6l1l5o8l2p5j0o8l6n5k9p7j0o9j4n8l0l0n0
1055F104m3k3k0p3m8j3l1m3l7m0n1oq1qk3n1k6o6k5k8m5J6o4m5l9n6l3j6lm5j7
$$ plain form
1086 5021 4966 4934 4888 4880 4811 4811 4773 4756 4739 4678 4664 4650 4620 4570 4538 4561 4496 4484 4478 4430 4391 4392 4364 4336 4281 4291 4251 4201 4164 4178 4150
1117 4150 4088 4070 4056 4012 3976 3950 3935 3884 3870 3855 3818 3792 3769 3735 3699 3671 3649 3596 3592 3570 3529 3517 3471 3431 3428 3386 3370 3361 3317 3329 3278
1148 3278 3270 3236 3208 3189 3194 3173 3158 3170 3131 3091 3090 3034 3017 3005 3001 2981 2984 2929 2944 2876 2868 2881 2845 2843 2791 2774 2751 2745 2753 2693 2681 2664 2644 2628
1182 2628 2622 2613 2571 2536 2558 2479 2543 2502 2468 2456 2448 2408 2449 2442 2389 2393 2369 2355 2353 2334 2326 2299 2282 2296 2297 2279 2245 2226 2255 2225 2206 2210 2199 2141
1216 2141 2180 2132 2137 2132 2086 2087 2057 2084 2075 2045 1997 2024 1997 1975 1979 1979 1961 1942 1913 1917 1903 1889 1893 1843 1868 1833 1839 1834 1857 1811 1808 1796 1818 1803 1769
1251 1769 1766 1727 1752 1764 1746 1704 1707 1701 1658 1674 1648 1658 1637 1602 1618 1590 1580 1582 1579 1529 1523 1507 1474 1512 1457 1451 1457 1458 1417 1381 1391 1403 1351 1331
1285 1331 1349 1326 1318 1283 1280 1248 1229 1221 1207 1210 1194 1199 1179 1159 1143 1138 1115 1100 1098 1078 1048 1029 1021 1005 1011 971 948 921 944 917 894 879 865 835
1319 835 840 810 803 788 789 759 748 742 741 706 680 669 673 650 672 641 642 611 615 576 567 558 548 552 542 526 517 491 513 500 492 464 447 428 448 439 399
$$ packed form
1086E021n5l2m6qo9%l8j7j7o1j4j4l0n0l2K3o5j2om8l9Jk8k8n5J0m0n0l7J4k8
1117D150o2j8j4m4l6k6j5n1j4j5l7k6k3l4l6k8k2n3mk2m1j2m6m0lm2j6rm4J2n1
1148C278ql4k8j9Nk1j5J2l9m0jn6j7j2mk0Ln5J5o8qJ3l6kn2j7k3oQo0j2j7k0j6
1182B628orm2l5K2p9O4m1l4j2qm0M1pn3Mk4j4kj9qk7j7J4Jj8l4j9K9l0j9Mj1n8
1216B141L9m8Nnm6Jl0K7rl0m8K7k7k2M%j8j9k9Mj4j4Mn0K5l5OnK3m6lj2K2j5l4
1251A769ll9K5J2j8m2Lom3J6k6J0k1l5J6k8j0Kln0oj6l3L8n5oOJm1l6J0J2n2k0
1285A331J8k3ql5ll2j9qj4Lj6Nk0k0j6nk3j5kk0l0j9qj6Om0k3k7K3k7k3j5j4l0
1319H35Nl0pj5Jl0j1ojl5k6j1Mk3K2l1Jl1Ml9rrj0Mj0j6rk6K2j3qk8j7j9K0rm0
$$ plain form
1356 399 384 376 376 369 336 343 321 312 320 292 299 285 268 258 260 256 220 259 257 228 245 251 224 218 218 249 218 207 191 205 183 202 194 182 206 194 175
1393 175 168 166 163 151 169 159 146 146 122 122 140 133 121 129 129 134 128 128 130 101 71 109 118 89 97 104 121 81 95 97 98 71 102 82 106 78 80 82 78 54
1433 54 53 61 75 64 77 64 45 62 58 34 42 83 32 47 56 49 35 -6 29 25 26 46 28 36 1 13 8 2 28 4 22 15 37 11 -6 17
1469 17 20 -2 25 3 -16 16 -18 10 14 -13 -17 -6 -8 -34 -24 -6 -21 -37 -34 -40 -26 -48 -25 -34 -22 -36 -45 -44 -56 -40 -56 -38 -33 -57 -59 -61
1505 -61 -47 -38 -38 -28 -65 -46 -40 -36 -49 -87 -53 -67 -69 -74 -76 -70 -56 -91 -74 -78 -77 -77 -73 -89 -90 -84 -70 -74 -78 -76 -68 -70 -59 -92 -88 -37 -90 -45 -90 -54
1545 -54 -44 -50 -74 -78 -85 -51 -70 -55 -70 -54 -66 -26 -53 -83 -61 -69 -24 -65 -20 -28 -50 -49 -26 -18 -40 -12 -20 -28 -18 -9 12 -3 -2 10 21 -7
1581 -7 -2 14 -2 -10 6 18 16 17 5 17 31 24 23 39 25 14 34 68 35 31 49 15 49 44 46 51 65 73 39 62 57 60 68 85 93 77 88 92 104
1620 104 114 77 82 96 121 86 134 107 116 123 118 121 131 128 126 125 137 113 108 129 94 128 122 122 131 121 136 142 117 154 131 141 138 121 146 134 138
$$ packed form
1356C99j5q%pl3Pk2rQk8Pj4j7j0Kml6L9kk9J7Ok7o%L1l1j1j6J4k2J9qj2K4j2j9
1393A75pklj2J8j0j3%k4%J8pj2Q%No%Kk9l0L8Rk9QPJ7m0J4KJk7L1k0K4k8KKmk4
1433E4jQJ4j1J3j3j9J7mk4QM1n1J5Rpj4m1L5mJK0j8Ql5J2noK6k4J8pK2k6j7K3
1469A7Lk2K7k2j9L2l4K8Mk7mJ1kk6J0J8j5j6LoJ4k2K3rJ2j4rJj2J6j6J8Nk4kk
1505f1J4R%J0l7J9OMj3l8L4j4knkOJ4l5J7mJ%Mj6jOJ4mmKQkJ1l3MN1n3M5m5L6
1545e4J0ok4mpL4j9J5j5J6j2M0k7l0K2qM5m1M5qk2JK3Qk2K8qqJ0RK1j5JJ2J1k8
1581gNJ6j6qJ6J2kJj2J2J4pjJ6j4j1K0L4l3mJ8l4L4nKNJ4Ql4K3nLQJ7Qj6J1MJ2
1620A04J0l7NJ4K5l5M8k7RPnLJ0lkjJ2k4nK1l5L4o%Rj0J5Ok5L7k3J0lj7K5j2M
$$ plain form
1657 138 141 144 164 152 153 155 163 154 148 175 141 167 140 160 125 132 126 131 152 176 135 158 158 138 141 131 148 138 125 114 124 91 104 150 104 118
1693 118 111 105 94 111 87 89 97 117 119 77 112 72 107 90 71 100 94 79 81 89 86 82 89 63 49 64 36 32 55 41 37 14 47 39 49 32 49
1730 49 31 42 74 30 32 36 44 25 26 22 43 13 25 22 37 42 35 46 48 58 61 33 67 94 72 69 73 83 63 83 79 90 37 77 94 87 101
1767 101 106 86 65 93 79 104 103 94 94 115 109 104 117 122 93 133 129 112 117 149 108 124 126 150 155 144 150 137 144 160 150 157 168 153 155 158 159 149
1805 149 158 182 172 190 198 178 178 196 177 208 200 194 202 205 198 218 191 209 192 200 193 205 209 187 227 197 194 199 208 213 212 208 235 218 217 217 201 235 223
1844 223 225 210 233 225 217 230 223 238 246 225 219 229 257 245 223 243 222 234 263 248 223 225 228 237 247 247 234 196 233 214 234 239 225 234 232 248
1880 248 229 236 244 228 240 217 236 246 236 250 224 224 227 247 240 218 238 192 239 238 217 224 230 220 204 233 227 184 223 220 207 218 218 230 207
1915 207 187 215 191 200 180 202 198 175 194 177 198 212 238 172 174 208 180 175 193 182 170 176 169 173 150 149 164 190 173 169 165 178 153 161 147
$$ packed form
1657A38LLK0j2JKQroK7l4K6k7K0l5PoNK1K4m1K3%k0Lj0J7j0j3j1J0l3J3M6m6J4
1693A18poj1J7k4KQK0Km2L5m0L5j7j9K9oj5KQlmPk6j4J5k8mK3j4mk3L3qJ0j7J7
1730D9j8J1L2m4KMQj9JmK1l0J2lJ5NpJ1KJ0Lk8L4K7k2lMJ0k0K0mJ1n3M0J7pJ4
1767A01Nk0k1K8j4K5jr%K1onJ3Nk9M0mj7NL2m1J6KK4Nj1Oj3PJ6j0PJ1j5KLJj0
1805A49RK4j0J8Qk0%J8j9L1qoQLpK0k7J8j7QpJ2Mk2M0l0lNRNjmK7j7j%j6L4j2
1844B23Kj5K3qqJ3pJ5Qk1oJ0K8j2k2K0k1J2K9j5k5KLRJ0%j3l8L7j9K0Nj4RkJ6
1880B48j9PQj6J2k3J9J0j0J4k6%LK0pk2K0m6M7jk1POj0j6K9om3L9lj3J1%J2k3
1915B07k0K8k4Rk0K2mk3J9j7K1J4K6o6KL4k8nJ8j1j2OpMk3jJ5K6j7mmJ3k5Qj4
$$ plain form
1950 147 165 169 138 153 144 165 162 160 186 125 141 129 117 144 152 170 126 154 167 113 120 145 133 155 151 139 145 116 133 132 115 127 136 113 145
1985 145 121 126 127 140 151 125 134 118 137 118 124 136 123 127 150 139 157 146 145 134 150 153 144 134 142 154 159 114 154 139 129 115 165 144 133
2020 133 137 150 147 154 166 138 144 132 153 149 155 121 130 157 118 130 126 169 162 140 139 131 162 145 136 147 139 156 142 155 127 139 142 151 171 135 144 151
2058 151 130 129 138 132 134 109 145 138 111 135 157 120 166 123 131 122 139 156 121 135 107 127 119 140 138 110 118 137 106 132 121 130 143 89 125
2093 125 146 97 126 108 106 125 105 105 108 124 115 113 81 102 105 76 62 89 80 85 89 69 83 81 81 87 73 101 89 65 93 67 62 45 67 63 85
2130 85 66 65 64 58 87 70 69 70 47 78 69 52 49 24 22 70 43 64 47 39 70 68 81 21 25 48 37 35 5 55 52 45 13 47 56 61 69 25 50
2169 50 9 50 40 41 56 44 30 20 56 42 36 70 42 55 45 46 68 54 43 67 49 48 70 62 70 88 69 74 72 57 60 74 83 72 83
2204 83 55 92 71 77 109 95 74 101 106 83 55 83 101 95 92 119 106 124 87 121 99 81 103 82 101 73 105 126 116 86 127 115
$$ packed form
1950A47J8Ml1J5rK1lkK6o1J6j2j2K7QJ8m4K8J3n4PK5j2K2mj2Ok9J7jj7J2Rk3L2
1985A45k4NJJ3J1k6Rj6J9j9OJ2j3MK3j1J8j1jj1J6Lrj0QJ2Nm5M0j5j0j4N0k1j1
2020A33MJ3lPJ2k8Oj2K1mOl4RK7l9J2mM3pk2jqL1j7rJ1qJ7j4J3k8J2LRK0l6RP
2058A51k1jRoKk5L6pk7K4K2l7M6m3QrJ7J7l5J4k8K0qK1kk8QJ9l1K6j1RJ3n4L6
2093A25K1m9K9j8kJ9k0%LJ6rkl2K1Lk9j4K7rNMk0J4k%Oj4K8j2k4K8k6nj7K2mK2
2130H5j9jjoK9j7jJk3L1rj7lk5kM8k7K1j7qL1kJ3o0MK3j1kl0N0lpl2L4RNQm4K5
2169E0m1M1j0JJ5j2j4j0L6j4oL4k8J3j0JK2j4j1K4j8jK2qQJ8j9Nkj5LJ4Rj1J1
2204H3k8L7k1OL2j4k1K7Nk3k8K8J8olK7j3J8l7L4k2j8K2k1J9k8L2K1j0l0M1j2
$$ plain form
2236 115 120 130 87 112 99 133 131 123 139 113 119 129 122 104 95 110 125 115 145 128 128 120 132 117 116 121 122 121 129 130 105 112 131 138 149 117 119 116 105
2275 105 115 106 104 114 114 122 121 134 92 99 126 93 111 121 104 116 111 90 132 96 120 115 108 108 110 116 101 97 116 78 80 97 73 88 89 104 106 76
2313 76 103 95 90 71 75 103 85 106 95 64 69 75 71 73 56 77 97 77 92 83 69 49 55 75 63 68 75 77 51 72 51 47 83 51 77 62 56
2350 56 57 61 77 59 73 47 60 60 59 62 77 57 69 53 46 39 32 57 55 60 55 45 21 16 25 9 49 37 45 57 32 40 44 63 38 48 44 6 32
2389 32 30 49 41 33 9 0 47 14 22 48 29 -2 32 51 20 42 18 28 31 15 -1 14 13 36 15 11 28 30 24 38 -13 9 26 20 18 20 6
2426 6 17 30 11 29 22 18 30 -15 6 14 21 12 24 18 19 20 24 18 21 14 -1 25 15 -11 0 -13 9 9 44 32 12 27 7 28 -21 21 20 -12
2464 -12 -13 15 9 34 10 9 14 6 21 19 21 -11 21 4 -7 12 15 20 15 34 -26 -7 -30 -8 0 -6 -34 -4 -9 10 -7 1 -18 -18 -5 -19 10 -5
2502 -5 5 -1 10 -13 1 7 -24 16 13 7 -27 -16 -18 -5 -32 3 3 -8 11 15 -1 -17 10 -14 -2 3 8 -12 -2 -4 2 -11 8 -22 -7 -21
$$ packed form
2236A15NJ0m3K5j3L4kqJ6k6OJ0pj8rJ5J5j0L0j7%qJ2j5jNJjQJk5PJ9PJ1l2Klj1
2275A05J0rkJ0%QjJ3m2PK7l3J8J0j7J2nk1M2l6K4np%KOj5mJ9l8KJ7k4J5JJ5Kl0
2313G6K7qnj9MK8j8K1j1l1NOmKj7K1K0k0J5rj4k0OK0j2NPKk6K1k1mL6l2K6j5o
2350E6JMJ6j8J4k6J3%jLJ5k0J2j6pppK5kNnj0k4nRj6M0j2QJ2k5QMJ9k5J0ml8K6
2389C2kJ9qqk4rM7l3QK6j9l1L4J9l1K2k4J0Lj6j6J5jK3k1mJ7KoJ4n1K2J7okKj4
2426FJ1J3j9J8pmJ2m5K1QPrJ2oJJMoLpj5K6j0k6J1j3K2%L5j2k0J5k0K1m9M2jl2
2464a2jK8oK5k4jNqJ5kKl2L2j7j1J9LNnJ9o0J9k3K2Qok8L0nJ9j7Qj9%J3j4K9j5
2502eJ0oJ1k3J4Ol1M0lol4J1kJ3k7L5%j1J9Mj6j6K7k4J2NNk0J0kOj3J9l0J5j4
$$ plain form
2538 -21 10 -20 -6 -20 17 0 16 5 -6 21 -2 22 -2 25 17 25 -3 12 7 14 -9 11 7 -3 -9 11 -1 23 -15 -1 4 -9 17 37
2572 37 39 23 -3 9 18 20 11 -10 13 16 23 38 18 20 19 23 59 47 18 44 53 20 21 24 69 39 45 60 54 38 30 62 43 40 64 66 43 36 75
2611 75 48 37 50 52 46 41 66 71 69 66 70 66 44 59 41 44 50 76 52 59 70 71 80 87 82 80 25 80 64 77 45 70 68 78 79 74 71 52 77 35
2651 35 64 55 57 50 51 63 68 89 94 56 63 73 45 64 64 68 38 55 50 55 49 44 56 25 76 54 31 36 48 48 39 80 42 40 46 46 30 61 47 33
2691 33 61 45 39 35 44 57 40 28 26 19 42 47 25 52 56 47 9 31 16 33 26 20 16 4 7 8 10 28 55 11 45 43 40 14 18 41 -7 12 7
2730 7 34 19 20 0 24 16 -14 25 9 -22 -6 26 5 -5 -17 19 -9 0 7 -1 -1 -27 -22 -7 -1 -18 12 -11 -1 10 -25 -55 -13 -15 -17 -3
2766 -3 -32 -48 -7 -21 -17 -32 -44 -23 -14 -20 -18 -10 -34 -22 -24 -32 -39 -43 -32 -31 -32 -46 -45 -38 -65 -51 -47 -15 -48 -45 -38 -61 -16 -30 -42 -12 -44 -32 -43
2805 -43 -51 -38 -53 -39 -38 -24 -45 -53 -65 -58 -59 -31 -45 -57 -56 -60 -36 -70 -29 -55 -42 -43 -79 -39 -57 -40 -39 -41 -58 -34 -48 -66 -72 -55 -42 -55
$$ packed form
2538b1L1l0J4j4L7j7J6j1j1K7k3K4k4K7qQk8J5nPk3K0mj0oK0j2K4l8J4Nj3K6K0
2572C7Kj6k6J2RKrk1K3LPJ5k0KjML6j2k9K6Rl3JLM5l0OJ5oj6qL2j9lK4Kk3pL9
2611G5k7j1J3KonK5NklMmk2J5j8LOK6k4PJ1JRPnkn5N5j6J3l2K5kJ0Jnlj9K5m2
2651C5K9rKpJJ2NK1Nl8PJ0k8J9%Ml0J7nNonJ2l1N1k2k3NJ2%rM1l8kO%j6L1j4j4
2691C3K8j6omRJ3j7j2kpK3Nk2K7Mrl8K2j5J7pomj2LJKJ8K7m4L4klk6MK3m8J9n
2730GK7j5Jk0K4ql0L9j6l1J6L2k1j0j2L6k8RPq%k6NJ5Oj7L0k3J0J1l5l0M2kkJ4
2766ck9j6M1j4Mj5j2K1RoKQk4J2kqpmJ1Jjj4JPk7J4ML2l3LPk3M5j4j2L0l2J2j1
2805d3qJ3j5J4JJ4k1qj2PjK8j4j2JmK4l4M1k6J3jl6M0j8J7Jkj7K4j4j8oJ7J3j3
$$ plain form
2841 -55 -53 -68 -30 -55 -50 -40 -40 -62 -69 -40 -77 -76 -64 -77 -77 -73 -81 -57 -86 -63 -88 -38 -71 -92 -58 -66 -79 -72 -92 -92 -109 -85 -102 -98 -98 -113 -103
2878 -103 -87 -68 -97 -104 -87 -135 -75 -102 -96 -93 -111 -103 -111 -116 -131 -96 -113 -120 -127 -137 -141 -119 -125 -144 -127 -115 -129 -141 -125 -131 -143 -112 -146 -151 -120 -144
2914 -144 -119 -141 -122 -140 -166 -111 -144 -138 -155 -116 -127 -159 -168 -152 -125 -116 -124 -171 -122 -160 -126 -131 -138 -149 -156 -158 -140 -141 -143 -151 -152 -162 -157 -144 -159 -146
2950 -146 -159 -170 -164 -170 -132 -179 -139 -160 -141 -130 -162 -157 -139 -154 -154 -146 -115 -135 -158 -134 -127 -147 -147 -119 -136 -139 -152 -114 -141 -139 -156 -156 -141 -119 -127
2985 -127 -133 -146 -153 -152 -139 -142 -136 -150 -138 -146 -119 -139 -115 -168 -129 -134 -136 -152 -157 -117 -134 -120 -123 -116 -122 -132 -143 -74 -117 -133 -113 -121 -110 -121 -137 -100
3021 -100 -155 -105 -150 -106 -106 -118 -99 -74 -125 -137 -129 -109 -115 -115 -110 -121 -103 -103 -103 -77 -112 -79 -112 -114 -133 -107 -82 -108 -92 -99 -96 -109 -109 -104 -96 -78
3057 -78 -73 -95 -84 -107 -104 -103 -57 -88 -95 -74 -107 -101 -96 -101 -106 -107 -108 -101 -117 -74 -88 -110 -86 -101 -78 -117 -99 -114 -105 -85 -80 -88 -112 -112 -90 -77 -81 -91
3095 -91 -88 -84 -95 -115 -89 -105 -94 -75 -87 -118 -85 -60 -67 -89 -108 -86 -76 -85 -111 -104 -93 -86 -89 -73 -80 -106 -91 -92 -102 -91 -75 -65 -90 -72 -92
$$ packed form
2841e5Kj5L8k5NJ0%k2pK9l7JJ2j3%MqK4k9K3k5N0l3k1L4qj3Pk0%j7K4j7M%j5J0
2878a03J6J9k9pJ7m8O0k7OLj8Qqnj5L5j7ppj0mK2oj9J7J2j4j2J6oj2L1l4nL1k4
2914a44K5k2J9j8k6N5l3Oj7L9j1l2rJ6K7Rqm7M9l8L4npj1pkJ8jkqjj0NJ3j5J3
2950a46j3j1OoL8m7M0k1J9J1l2NJ8j5%QL1k0k3K4Pk0%K8j7lj3L8k7Kj7%J5K2q
2985a27oj3pJJ3lOj4J2qK7k0K4n3L9nkj6nM0j7J4lPoj0j1O9m3j6K0qJ1j1j6L7
3021a00n5N0m5M4%j2J9K5n1j2QK0o%Nj1J8%%K6l5L3l3kj9K6K5k6J6pLj3%NQJ8
3057g8Nk2J1k3LJM6l1pK1l3ONnnjjPj6M3j4k2K4j5K3l9J8j5RK0Nqk4%K2J3mj0
3095i1LMj1k0K6j6J1J9j2l1L3K5pk2j9K2J0rk6PJ1PlJ6pk6J5jj0J1J6J0k5J8k0
$$ plain form
3130 -92 -53 -83 -82 -91 -52 -79 -72 -75 -112 -42 -75 -60 -90 -99 -93 -95 -78 -99 -87 -81 -87 -64 -104 -87 -87 -77 -50 -81 -83 -71 -99 -70 -77 -94 -67 -64 -93
3167 -93 -90 -77 -92 -41 -100 -59 -76 -49 -72 -72 -69 -65 -53 -60 -46 -66 -59 -58 -69 -84 -43 -51 -63 -75 -83 -85 -66 -70 -88 -73 -36 -54 -78 -51 -66 -45
3203 -45 -36 -74 -48 -77 -62 -75 -78 -75 -61 -49 -56 -52 -62 -15 -68 -76 -30 -76 -59 -45 -64 -42 -44 -60 -62 -47 -53 -57 -64 -79 -55 -81 -61 -48 -80 -41
3239 -41 -57 -48 -56 -75 -97 -78 -50 -80 -46 -50 -68 -75 -44 -34 -75 -64 -57 -53 -64 -55 -36 -57 -95 -66 -53 -47 -71 -30 -83 -62 -58 -35 -77 -78 -49
3274 -49 -60 -77 -59 -71 -76 -65 -84 -68 -64 -79 -75 -89 -52 -66 -81 -68 -86 -104 -72 -89 -86 -82 -82 -56 -78 -72 -80 -91 -102 -77 -87 -78 -85 -74 -72 -74
3310 -74 -95 -81 -92 -81 -105 -76 -92 -85 -88 -116 -90 -115 -107 -97 -77 -107 -82 -111 -94 -105 -75 -73 -99 -98 -97 -69 -101 -83 -76 -105 -112 -105 -104 -95 -82 -93
3346 -93 -107 -81 -100 -97 -68 -95 -126 -70 -85 -85 -99 -108 -88 -105 -87 -64 -107 -85 -91 -75 -88 -96 -72 -98 -88 -99 -109 -107 -81 -111 -105 -107 -83 -111
3380 -111 -89 -111 -86 -105 -94 -82 -92 -94 -81 -80 -71 -80 -98 -87 -89 -85 -72 -84 -71 -96 -112 -71 -90 -77 -105 -66 -136 -81 -91 -117 -81 -84 -77 -61
$$ packed form
3130i2L9l0JrL9k7Pll7P0l3J5l0rOkJ7k1J2OoK3m0J7%J0K7l1kJ2k8K9pj7K7Lk9
3167i3LJ3j5N1n9M1j7K7k3%LMJ2pJ4k0PJj1j5M1qj2j2qkJ9mj8J5L7j8k4K7j5K1
3203d5Rl8K6k9J5j3lLJ4J2pMj0M7n3qM6m6J7J4j9K2kj6kJ5ompj5K4k6K0J3l2L9
3239d1j6Rqj9k2J9K8l0L4mj8pL1J0m1J1PMj1RJ9k1l8K9J3Ok4M1n3K1MK3m2jK9
3274d9j1j7J8j2nJ1j9J6Mj5Mj4L7j4j5J3j8j8L2j7LM%K6k2Oqj1j1K5j0RpJ1Kk
3310g4k1J4j1J1k4K9j6Plk8K6k5QJ0K0l0K5k9J7j1L0Kk6JJK8l2J8Pk9pPJRJ3j1
3346i3j4K6j9LK9k7l1N6j5%j4rK0j7J8K3m3K2oJ6j3qK4k6J0j1j0KK6l0OkK4k8
3380a11K2k2K5j9J1J2j0kJ3JRrj8J1kMJ3j2J3k5j6M1j9J3k8L9p0N5j0k6L6lPJ6
$$ plain form
3414 -61 -77 -100 -93 -85 -86 -79 -86 -94 -38 -63 -74 -66 -90 -94 -57 -97 -77 -78 -91 -78 -74 -81 -48 -105 -81 -71 -58 -76 -65 -62 -65 -65 -70 -62 -72 -53 -56 -82 -105
3453 -105 -62 -81 -57 -72 -74 -42 -62 -34 -59 -65 -83 -51 -65 -74 -34 -64 -70 -59 -55 -66 -59 -55 -46 -59 -46 -46 -57 -65 -63 -41 -42 -47 -69 -53 -74 -85
3489 -85 -69 -51 -67 -52 -57 -55 -56 -47 -26 -60 -52 -44 -52 -55 -76 -39 -47 -20 -45 -66 -46 -44 -67 -59 -40 -51 -34 -45 -50 -58 -42 -41 -53 -22 -26 -53 -66 -49
3527 -49 -51 -45 -39 -44 -41 -44 -29 -44 -41 -36 -68 -37 -26 -17 -30 -32 -56 -26 -23 -40 -65 -37 -33 -24 -18 -42 -13 -40 -22 -18 -12 -20 -40 -45 -57 -54 -35 -8 -37 -23
3567 -23 -31 -46 -38 -26 -35 -17 -37 -39 -35 -39 -16 -55 -45 -14 -35 -24 -39 -24 -15 7 -47 -32 -18 -41 -23 -30 -22 -33 -13 -20 -3 -32 -25 -29 -7 -33
3603 -33 -36 -10 -26 -17 -30 -30 3 -24 -9 -42 -15 -12 0 7 -2 -17 -24 -23 -25 -42 -13 -32 -43 -1 -11 -12 -34 3 -24 -8 -3 -14 4 -20 -37 -18
3639 -18 -12 -4 0 11 -5 13 -1 -28 -7 -1 -6 -9 -7 -21 -17 -9 4 -4 -45 -4 10 -7 6 -8 -4 -5 -7 1 -14 -11 4 -3 -17 -17 17 1 -21 2 -11
3678 -11 -13 7 -10 -2 -11 2 1 -4 -27 7 -25 -13 11 -15 -8 -31 -14 -25 25 -24 7 5 -30 -32 -3 -13 2 -8 18 -4 -45 -3 10 -2
$$ packed form
3414f1j6k3PQjPpqN6k5j1Qk4mL7m0K0jj3J3MpL3n7K4J0J3j8J1Ll%nQj0J9lk6k3
3453a05M3j9K4j5kL2k0K8k5oj8L2j4rM0l0oJ1Mj1PMRj3J3%j1qKK2jnk2J6k1j1
3489h5J6J8j6J5nKjRK1l4QQqlk1L7qK7k5k1K0Kk3QJ9j1J7j1nqJ6Jj2L1mk7j3J7
3527d9kOOnLlJ5j5LNl2L1J1Rj3kk4L0Lj7k5K8MROk4K9k7J8MOqk0nj2LJ9K7k9J4
3567b3qj5QJ2rJ8k0kMmK3l9J0L1k1J1j5J5RK2n4J5J4k3J8pQj1K0pJ7k9PmK2k6
3603c3lK6j6Rj3%L3k7J5l3K7LJ2Prj5pJkj7K9j9j1M2j0jk2L7k7J6Nj1J8k4j7J9
3639a8OQMJ1j6J8j4k7K1OnlKj4MQJ3qm1M1J4j7J3j4MjkQj5LJ5pj4%L4j6k2K3j3
3678a1kK0j7QrJ3jnk3L4l2J2K4k6Pk3J7j1N0m9L1kl5kK9j0J5j0K6k2m1M2J3j2
$$ plain form
3712 -2 -15 -2 -14 -10 -27 -5 -27 -8 18 -7 -25 -35 -29 -29 18 -6 -32 -25 1 -10 -10 15 -26 -9 -17 1 -2 -32 -30 -23 -20 -14 -51 6 -3 -29 -2
3749 -2 -1 37 -7 -34 -33 -29 -9 -18 -17 -2 -31 -29 -19 -2 14 -31 -22 -34 -17 -38 -19 -6 2 -13 -34 -22 -14 -4 -6 -27 -10 -2 -29 -15 -35 -7
3785 -7 -19 -24 -24 -14 -22 -36 -43 -6 -16 -58 -25 -4 -3 -6 -2 -7 -39 -12 -18 -7 -6 -8 -8 -18 2 -16 -29 -20 -19 -37 -17 -49 -23 -42 -33 -29 -10 -8 -19
3824 -19 -35 -28 -33 -24 -30 -13 -19 -22 -26 -36 -33 -8 -23 -11 -4 -34 -20 -5 -21 -6 -28 -12 -41 -11 -5 -8 2 -19 2 -2 -29 -12 -43 4 -15 -22 -15
3861 -15 -8 -20 -20 -21 -49 -8 -48 -14 -26 -37 -18 -16 -19 11 -3 -10 -16 0 -24 -6 -16 1 -12 -26 -1 -5 -22 -7 -10 -6 2 -28 -19 15 -18 -24 -17
3898 -17 -2 -16 -20 -20 -17 9 8 7 -13 9 -9 -24 -19 -14 -20 -17 -21 -20 -16 -25 -27 -11 -3 -38 -14 10 1 -19 5 10 -8 -18 -3 16 -32 21 1 -1 -3 -15
3938 -15 7 -2 -13 4 2 -14 -33 10 -29 19 1 -32 -23 4 -38 4 -29 6 6 -25 -14 -23 4 -19 -4 -12 -20 -6 2 -6 -14 24 -18 -3 13
3973 13 -1 9 9 -12 3 13 -18 -5 -16 -22 -2 -7 -12 -19 -20 -20 -8 -8 -34 -13 -37 3 -31 -9 -6 -3 -31 -10 -31 -42 2 -31 1 -14 22
$$ packed form
3712bj3J3j2Mj7K2k2J9K6k5j8j0O%M7k4k6PK6j1%K5m1J7qJ8ll0KPLOl7N7rk6K7
3749bJL8m4k7JMK0rJJ5k9KJ0J7J6m5Rj2J7k1J9J3Qj5k1J2QJ0kk1J7Qk7J4k0K8
3785gj2n%J0qj4pL7j0m2L3K1JlMnl2K7oJ1Jk%j0K0j8j3RJj8K0l2K6j9RMJ9Kj1
3824a9j6PnRoJ7olmj0LK5j5J2Pl0J4J5j6J5k2J6k9L0OlJ0k1K1mk7J7l1M7j9pP
3861a5Pj2%jk8M1m0L4j2j1J9KlL0j4poJ6k4J8j0J7j3j4K5mj7J5lMQl0RL4l3oP
3898a7J5j4m%LK6jjk0K2j8j5NNoLmJMrkJ6Ql5K4K4rk0K4Nj8j0J5J9m8N3k0kkj2
3938a5K2rj1J7kj6j9M3l9M8j8l3RK7m2M2l3L5%l1J1rK7k3J5qqJ4QqqL8m2J5J6
3973A3j4J0%k1J5J0l1J3j1oK0nnpj%J2%k6K1k4M0l4K2LLk8K1k1j1M4l3L2j5L6
$$ plain form
4008 22 11 7 -21 -44 -15 1 -16 1 -21 12 -19 -9 -8 -14 7 -9 12 1 -18 2 -4 2 -23 10 -22 -3 7 11 8 -35 -16 -5 -13 -4 2
4043 2 -5 8 -2 -22 -16 7 -21 4 -4 -28 -3 -10 0 -6 -35 -32 8 11 -7 -25 5 -39 -16 14 -40 -2 -5 -15 -29 -36 4 -11 -5 -32 13 -8
4079 -8 -25 1 -20 -35 -25 -42 -10 -5 -25 -7 2 -38 -5 0 -29 7 -16 14 -23 -2 -27 -11 -18 -13 26 -25 -6 -14 -25 -22 -24 -14 -11 -9 -13 -9 -35
4116 -35 -8 -18 -39 -26 10 18 -13 -15 -8 -11 -38 -13 3 1 -19 -11 -16 -12 -21 2 0 0 -18 21 -6 0 4 -8 16 27 21 -10 -11 -12 -7 12 6 5 -8 7
4156 7 5 -13 23 22 3 4 11 23 2 21 24 2 6 13 9 2 -17 -18 12 18 11 6 -5 -1 10 28 31 6 12 10 23 13 18 -2 20 -1 -1 -7 15 30 50
4197 50 26 4 4 17 26 10 -5 13 -9 23 6 4 38 38 15 39 21 24 38 13 12 16 31 12 31 50 10 34 34 23 13 42 9 6 22
4232 22 12 15 3 16 16 40 31 31 27 15 41 5 18 -2 0 14 43 3 7 35 8 22 20 16 28 20 29 7 48 35 4 16 6 32 32 20
4268 20 13 -4 24 49 36 43 27 22 33 -1 -5 10 15 44 6 24 -3 14 23 9 1 16 18 7 41 1 17 24 23 9 25 44 -8 -14 9 27
$$ packed form
4008B2j1mk8k3K9J6j7J7k2L3l1J0JoK1j6K1j1j9K0oOk5L3l2J9J0Mlm3J9J1qRO
4043BpJ3j0k0OK3k8K5qk4K5pJ0ok9LM0Lj8j8L0m4K3L0n4L8lj0j4pM0j5Ok7M5k1
4079hj7K6k1j5J0j7L2Nk0J8Rm0L3Nk9L6k3L0l7K1k5J6pNL9n1J9qj1LkJ0LKmMk6
4116c5K7j0k1J3L6Ql1kPlk7K5J6kk0QnMrK3k%j8L9k7OMj2K4J1ol1jjNJ9ojj3J5
4156Gkj8L6jj9JPJ2k1J9Lk2MPmpj9jL0Opnj1MJ1J8Lk5OkJ3j0Nk0K2k1%oK2J5K0
4197E0k4k2%J3Rj6j5J8k2L2j7kL4%k3K4j8LJ4k5jMJ5j9J9J9m0K4%j1j0K9l3lJ6
4232B2j0Lj2J3%K4r%mj2K6l6J3k0KJ4K9m0MK8k7J4kmJ2qRk2M1j3l1J2j0K6%j2
4268B0pj7K8K5j3Pj6nJ1l4mJ5NK9l8J8k7J7Rj4qJ5Kj1L4m0J6Pjj4J6J9n2oK3J8
$$ plain form
4304 27 -20 44 20 9 25 -3 20 10 22 -11 -2 -15 25 22 27 20 6 5 -26 20 14 6 3 1 15 -2 -16 1 10 -2 31 14 42 6 24
4339 24 11 22 17 35 19 33 9 31 37 38 34 -3 5 36 2 24 10 33 28 18 34 2 39 47 35 36 18 27 24 26 18 24 21 37 11 0 24
4376 24 21 31 19 32 25 2 20 11 18 36 32 26 16 4 23 34 25 19 26 6 23 27 16 34 54 26 1 24 27 20 42 29 39 29 15 21 61
4413 61 52 23 19 27 24 17 46 58 34 25 37 30 38 24 26 28 50 14 48 42 17 22 37 29 36 41 14 14 22 24 44 40 52 59 49 19 25 15 4 22 27
4454 27 29 22 14 40 34 27 50 25 25 39 23 34 20 40 42 20 11 42 5 28 31 12 12 14 14 37 -2 24 21 24 24 46 44 16 23 24 16 28 34 17
4494 17 40 13 29 9 9 16 -1 0 8 5 31 17 39 16 -5 12 7 28 -2 28 13 31 -18 17 24 19 17 33 29 -3 29 26 32 17 1 7 14
4531 14 9 18 1 11 15 -22 15 36 19 9 -15 18 11 3 14 10 8 20 14 14 22 13 20 41 25 -12 4 8 -5 -16 21 45 15 14 23 0 14 1
4569 1 1 25 28 29 9 8 9 5 -10 8 8 -17 5 21 -3 25 10 11 19 7 -18 3 25 37 12 29 10 -19 15 15 39 7 31 22 29 8 11
$$ packed form
4304B7m7O4k4j1J6k8K3j0J2l3Rj3M0lNpj4jl1M6oqlkJ4j7j4J7Rj2L3j7K8l6J8
4339B4j3J1nJ8j6J4k4K2OJml7QL1l4K2j4K3nj0J6l2L7Qj2Jj8RlKqOlJ6k6j1K4
4376B4lJ0j2J3pk3J8rPJ8moj0j2J9J1roPk0J7Mj1J8K0k8k5K3LpK2j3J0j0j4OM0
4413F1rk9mQlpK9J2k4rJ2pQj4KKK2l6L4ok5NJ5qPNk7%QKK0mJ2Pj0l0Oj0j1J8N
4454B7KpqK6opK3k5%J4j6J1j4K0Kk2rL1l7K3Lj9%K%K3l9K6lL%K2kk8PJqJ2Oj7
4494A7K3k7J6k0%Pj7JQlK6j4K2k3k1J7nK1l0L0j5J8m9L5PnkJ6ml2L2lOj5j6OP
4531A4nRj7J0Ml7L7K1j7j0k4L3pqJ1mkJ2o%QrPK1j6l7J6Mj3j1L7K4l0jRk3J4j3
4569A%K4LJk0jJmj5J8%k5K2J6k4K8j5JQj2k5K1K2J2k5J7j9k9L4%K4l2K4rPk1L
$$ plain form
4606 11 -15 21 24 7 -3 -19 17 49 -12 13 26 19 24 8 16 10 22 9 0 25 1 0 6 16 12 36 41 21 43 3 34 30 -6 20 35 12
4642 12 46 45 20 15 40 -8 -7 23 27 8 28 -13 17 8 16 8 36 13 -17 21 19 27 3 -9 12 51 22 27 44 -5 29 24 51 17 7 36
4678 36 48 23 5 42 39 62 49 17 25 26 31 15 -2 5 24 19 55 10 2 38 28 14 25 16 24 7 -17 14 -4 -4 -9 -5 37 42 19 6 4
4715 4 8 11 27 26 19 9 27 41 8 28 30 19 0 21 36 34 24 21 40 -20 23 27 33 18 2 23 42 25 26 12 8 8 21 32 0 31 -1
4752 -1 5 30 36 16 20 33 33 27 29 16 19 -2 10 1 24 0 37 22 10 19 18 8 -8 34 16 17 26 16 26 5 1 2 12 5 10 34 20 -1 6
4791 6 25 -2 9 29 4 1 34 23 0 12 29 -3 13 27 19 13 43 31 -3 22 34 25 26 17 3 24 23 39 32 18 -2 24 15 4 27
4826 27 17 26 -8 1 19 19 16 -11 3 24 13 15 16 1 15 10 45 12 -11 1 13 26 23 8 9 24 3 -5 29 5 0 7 16 21 -16 31 35 4
4864 4 -2 12 0 4 5 32 17 1 34 9 14 35 -5 19 19 44 12 11 38 18 10 -19 -7 16 6 13 -9 13 10 2 36 17 15 12 -1 25 33
$$ packed form
4606A1k6L6Lj7j0j6L6L2o1K5J3pNj6QoJ2j3rK5k4jOJ0mK4Nk0K2m0L1ml6K6J5k3
4642A2L4jk5nK5m8JL0Mj9K0m1L0rQqK8k3l0L8kQk4j2K1L9k9NJ7m9L4nK7l4j0K9
4678C6J2k5j8L7lK3j3l2QJNj6j7PJ9nL6m5qL6j0j4J1rQj7k4L1j8%nMM2Nk3j3k
4715DMLJ6jpj0J8J4l3K0Kj1j9K1J5kj0lJ9o0M3MOj5j6K1J9j7Jj4m%J3J1l2L1l2
4752aOK5Ok0MJ3%oKj3Lk1J2rK3k4L7j5j2Rjj0j6M2j8JRj0J0k1mJJ0pNK4j4k1P
4791FJ9k7J1K0k5lL3j1k3J2J7l2J6J4qoL0j2l4K5J2rJrj4K1jJ6pj4k0K6rj1K3
4826B7j0Rl4RJ8%lk7J4K1j1KJj5J4nL5l3k3J2J2J3lj5JJ5k1qL4k4nPRNl7M7Ml1
4864DoJ4j2MJK7j5j6L3k5NK1m0K4%K5l2jK7k0qk9J2K3j0Pk2K2lqL4j9klj3K6Q
$$ plain form
4901 33 5 17 9 13 2 -4 14 18 20 23 7 24 16 36 34 19 -8 -1 16 25 17 37 -17 6 6 9 38 18 2 33 17 21 30 10 -1 23 25 21 10
4940 10 37 4 -22 42 14 14 27 -3 -9 15 5 -7 6 31 25 -17 0 28 -2 9 17 8 -40 9 23 -2 -6 -5 3 9 5 41 -13 21 25 -11
4976 -11 6 2 15 15 27 -17 17 15 -9 -13 -9 -4 -8 13 -17 -19 5 -22 4 -36 -2 -4 -7 6 -15 -26 -3 19 14 -6 -18 25 5 28 -8 13
5012 13 19 4 9 -16 21 -20 17 -14 4 0 -1 13 -10 5 17 3 7 -19 1 8 -16 8 -12 -25 -26 -11 -46 -14 -8 -8 6 -7 -16 -18 21 8
5048 8 -9 -2 -22 -9 -8 5 -11 10 3 29 -14 -14 12 14 -10 8 10 -25 -15 -47 -10 -20 -25 -23 -32 -5 -26 -13 -13 -26 -3 -26 11 -6 -20 -3
5084 -3 -1 -18 -21 -6 -31 -10 -28 -2 -27 -18 -2 -19 -9 -8 -33 6 -13 -33 -5 -19 11 -15 -29 8 -16 -32 -10 -24 -14 13 -30 -15 -13
5117 -13 7 -42 -13 -16 -7 -16 3 9 -40 -13 -21 -25 -22 -15 -23 -25 0 -8 -17 -11 -8 -3 -26 -14 -24 -19 -11 -8 -28 -17 -23 -8 -6 -14 -16 -1 19 -18 -6 -4 -19 -17
5159 -17 -37 -33 -18 -2 -39 -58 -5 -17 -8 10 -4 -9 -8 -13 -30 -20 29 -15 20 -42 5 5 -3 14 -16 -6 0 -20 1 4 -12 3 19 -23 2
$$ packed form
4901C3k8J2qMj1oJ8MKLj6J7qK0kj5k7PJ7RqK0n4K3%LK9k0j6L1j6MRk0j1K4Kmj1
4940A0K7l3k6O4k8%J3l0oK4j0j2J3K5om2J7K8l0J1Qrm8M9J4k5mJQOmL6n4L4Ml6
4976a1J7mJ3%J2m4L4kk4mMNmK1l0kK4k7K6m0L4klJ3k1j1K3K2nk0j2M3k0K3l6K1
5012A3Oj5Nk5L7m1L7l1J8mjJ4k3J5J2j4Mk6K0Pk4K4k0j3jJ5l5L2O%J4j3rkL9j3
5048Hj7Pk0J3JJ3j6K1pK6m3%K6Kk4J8Kl5J0l2L7j0nKrK7k1J3%j3K3k3L7j7j4J7
5084cKj7lJ5k5K1j8K6k5RJ6j7J0Jk5L9j9k0K8j4L0k6j4L7k4j6K2j4J0K7m3J5K
5117a3K0m9K9lRrJ9Om9K7qmLPqkK5qrOLNk3J2j0NQLk0J1oJ5KqkJ5K0l7J2Kj5K
5159a7k0MJ5J6l7j9N3j2RJ8j4nJnj7J0M9m4L5o2M7%qJ7l0J0Ok0K1Lj6J5J6m2K5
$$ plain form
5194 2 -14 -19 -26 -45 -24 10 -25 10 -12 -18 -6 -10 17 -15 -12 14 14 -6 -5 -16 -6 -13 -25 -29 14 3 -10 11 -43 30 -3 -30 -2 -7 10 2
5230 2 4 8 -36 -2 -22 -3 -32 -18 3 -10 -6 1 -11 -18 3 -24 -16 19 24 -12 3 -17 -25 -16 -4 6 -8 0 -16 -4 -17 7 11 1 -2 -2 6 -7
5268 -7 9 20 0 -12 -15 -6 19 11 7 -4 -25 -5 -39 32 9 4 -14 21 5 -35 -16 6 -23 -13 6 -5 -13 28 13 5 -33 -14 -25 -3
5302 -3 19 -15 19 -12 -4 -30 -10 14 -3 16 3 -10 4 19 15 2 -16 -2 -13 -6 5 1 0 13 -12 -11 -10 -8 -20 -4 -2 -4 -18 -7 -19 -10
5338 -10 -5 -27 -13 -3 9 -6 5 -12 16 19 14 -9 10 7 -1 -12 4 -29 4 0 -2 -30 -10 -1 -26 -16 -4 -26 -17 -8 -22 -15 -17 0 -1 -17 -7
5375 -7 -16 -28 -26 -16 -3 -14 0 -10 16 18 -4 -15 -51 -46 -1 -9 -17 -15 -22 5 21 -9 12 11 -17 13 6 -3 -31 -8 8 8 -30 -2 4 -25 11
5412 11 -29 -25 -28 -53 -6 -9 9 7 -13 2 -11 -10 4 3 7 -3 -2 -10 -9 -27 -3 -1 -16 -10 -6 20 19 -9 -23 -21 2 -23 -6 4 -16 9 -7 -11
5450 -11 -9 -2 -13 -13 -38 -9 -20 -28 -28 -36 -21 -18 -25 16 -29 -11 10 -18 3 5 -14 -25 -14 -40 -22 -13 -13 -4 3 6 16 -7 12 -2 -3 -27 -1 -19
$$ packed form
5194Bj6npj9K1L4l5L5k2oJ2mK7l2LK6%k0Jj1J0pj2mM3j1j3K1n4P3l3k7K8nJ7q
5230BKMm4L4k0J9k9J4K1j3MPj2pK1k7QL5Nl6J5k0qRJ2J0j4Qj6J2j3K4Mj0l%Qj3
5268gJ6J1k0j2lRK5qmj1k1K0l4P1k3nj8L5j6m0J9K2k9J0J9j1qM1j5ql8J9j1K2
5302cK2l4L4l1Qk6K0K4j7J9j3j3J4J5mj3j8J4j1PJ1mjJ3k5JJKj2J6Kkj4J1j2R
5338a0Nk2J4J0J2j5J1j7K8Lnk3J9lqj1J6l3L3mkk8K0Rk5J0J2k2RRj4PkJ7jj6J0
5375grj2KJ0J3j1J4j0K6Kk2j1l6NM5qqKpK7J6l0K1jk8L0prk8K3J6%l8K8Ok9L6
5412A1m0Mlk5M7lJ8kk0J5j3JJ4jMj0JqJj8K4Kj5OMK6jk8j4KK3k5J7J0k0K5j6m
5450a1KPj1%k5K9j1q%qJ5LpM1m5J8K1k8K1Kj9j1J1k6J8R%RPLJ0k3J9j4jk4K6j8
$$ plain form
5488 -19 -45 -11 -23 20 -16 -37 -24 -16 -9 -11 -31 -2 -3 -22 -21 -14 -5 -14 -14 -40 3 -6 -18 -42 -11 12 -12 5 12 6 18 -39 9 -3 -19 4
5524 4 -5 -22 1 4 1 7 -31 -24 -9 -18 -30 5 -33 -50 -23 -9 -34 13 -18 -30 1 -4 -27 -23 -18 -18 1 -11 -4 7 2 25 -23 -33 0 -30 5
5561 5 33 10 4 -27 14 -12 -32 5 -35 -7 -29 -31 -32 -11 -27 -10 -14 -14 -23 17 -19 -26 10 -40 -7 -27 -24 1 -35 -19 1 -19 -10 -1 -2 -24
5597 -24 -22 -17 14 -22 3 -10 -6 4 -7 -39 -23 -31 -9 -11 -6 -26 -18 -15 -10 -34 31 7 10 -33 -5 -16 -19 -13 3 -19 -22 -2 -14 -14 -23 -8 1 -6 -8
5636 -8 3 22 -1 -17 -7 -4 10 -10 -22 15 -15 -16 -6 -11 -8 -13 -10 7 16 -26 -16 -6 -10 -28 -33 -6 3 1 -42 5 -15 -9 -11 4 -24 -17 -5 -30
5674 -30 -33 5 -11 0 -23 -19 7 14 0 -16 -9 -35 3 2 -19 -15 38 1 -27 9 -13 -24 -17 -13 -20 11 -14 -38 -48 -11 -10 -33 -17 -31 9
5709 9 -20 -15 -28 2 -7 -26 -5 2 -31 -16 -17 -22 0 12 -16 -11 -24 -7 8 -34 8 -19 -13 7 -13 -29 -16 -23 -25 -8 -19 -1 -37 -37 -35 -38 -21
5746 -21 5 -32 -13 -4 -5 -23 2 -30 7 18 13 -14 -30 -17 -33 9 -24 -3 22 -32 -8 -10 -11 11 -10 -5 0 0 -15 -10 8 -43 -25 -16 -37
$$ packed form
5488a9k6L4j2M3l6k1J3QPkk0K9jj9JPRr%k6M3rj2k4L1K3k4J7PoJ2n7M8j2j6K3
5524Drj7K3LlOl8PJ5rj2L5l8j7K7J4k5M7l1j2L1nk3MN%J9j2PJ1nK3m8j0L3l0L5
5561EK8k3ol1M1k6k0L7m0K8k2kjK1j6J7m%rM0l6pL6n0L3k0LK5l6J6K0k0RRjk2
5597b4KNL1l6K5j3MJ0j1l2J6qK2kNk0QLNk4O5k4Lm3K8j1lOJ6k2lK0j2%rJ5Rpk
5636hJ1J9k3j6J0LJ4k0j2L7l0jJ0nLnLJ7Rm2J0J0mj8nK7Rkm3M7k0OkJ5k8PJ2k5
5674c0lL8j6J1k3MK6Pj4j6Pk6L8jk1MN3l7k8L6k2j1PMpL1k5k4j0L7Jk3J6j4M0
5709Ik9Nj3L0rj9K1Pl3J5jnK2J2k8Nj3J7J5m2M2k7OK0k0j6J3pkJ7j1J8l6%KlJ7
5746b1K6l7J9Rjj8K5l2L7J1nk7j6J3j6M2l3K1K5n4K4kjK2k1NN%j5NJ8n1J8Rk1
$$ plain form
5781 -37 -13 -9 -42 -32 1 -17 -40 -22 -15 -23 -35 -2 -10 -20 -29 10 -24 -34 -8 -18 -6 -20 -6 -6 -28 -1 -20 0 13 -7 -4 10 -1 -34
5815 -34 -42 -9 -11 -33 -8 -20 -20 -15 -12 -12 -23 -24 9 -17 -13 -22 5 -19 -22 1 -45 0 -24 1 -25 -11 -12 -21 -23 7 -1 3 -12 -7 -5 -10 -5 -17 -26 -3
5855 -3 -1 -9 -16 -13 -4 -1 -1 -18 16 -34 -38 -25 -35 -24 -15 -38 0 -47 -7 -2 -22 -20 -1 -21 -5 -25 -18 -47 12 -5 4 16 -33 -16 -10 14 -15 -5
5893 -5 -4 -16 6 -29 -39 -12 -18 -33 -5 -3 -8 -19 -9 -23 -43 -3 -22 -32 -19 -14 8 -19 -26 -28 -20 -32 -30 -18 -25 -9 -18 -7 -26 -4 -22 6
5929 6 -15 1 0 3 -14 -3 -14 -29 -17 4 -25 -16 -14 -26 -14 8 -33 0 -16 -9 -31 -50 -21 -29 -27 -11 7 -35 -12 -4 -32 -22 -1 -22 -15
5964 -15 5 -22 -16 1 7 -20 1 16 -10 -11 -9 -1 -34 4 2 6 -18 -2 -3 2 -7 -2 21 -7 -1 -20 -17 -32 11 -22 -24 -32 -36 -13 -23 -18 -10 -32 -15
6003 -15 -18 -4 14 -30 -18 -11 -24 -27 4 -5 6 4 -52 1 -12 -22 1 -22 0 11 5 -22 -1 12 -20 -18 -8 -5 -26 -28 -1 -12 -12 -13 -6 27
6039 27 -25 -39 -30 1 -3 4 -4 -3 -5 -20 -25 -18 7 11 -27 -10 -13 -7 -14 -32 23 8 0 3 18 0 -21 -14 -23 -15 35 -9 16 -13 -17 -14 2 0 -15 -15 -33
$$ packed form
5781c7K4Ml3J0L3j8k3J8Pqj2L3qj0rL9l4j0K6j0J2j4J4%k2K7j9K0J3k0LJ4j1l3
5815c4qL3kk2K5j2%NL%j1jL3k6MrK7k4lK3m6M5k4K5k6J4jrkL0qMj5NKnNj2rK3
5855cKqpLRL%j7L4n0mJ3j0J1Rk3L8m7M0Nk0KJ9k0J6k0Pk9N9j7RJ2m9J7OK4k9J0
5893eJj2K2l5j0K7oj5K8Knj1J0j4k0M0j9j0J3NK2k7pkQj2KJ2pJ6rJ1j9K2j8K8
5929Fk1J6jLj7J1j1j5J2K1k9RKj2J2K2m1L3j6Pk2j9K9qKJ6J8m2K3Qk8J0K1k1P
5964a5K0k7OJ7Ok7K1J5k6jKQl3L8kMk4J6jNrNK3k8Oj9Lj5M3l3kqmK3j0NQk2J7
6003a5lJ4J8m4J2Pj3lL1rJ1kn6N3j3j0K3k3K2J1ok7K1J3l2KJ0Lk1kK7j1%jPL3
6039B7n2j4RL1mPqJkj5nPK5Ml8J7lOpj8N5j5qLJ5j8k1PrQN0m4K5k9mLJ6kj5%j8
$$ plain form
6080 -33 -13 -29 -3 -9 8 -20 12 0 3 -27 4 -20 2 7 -10 -6 -11 -14 11 9 -19 -9 -2 -13 10 -20 -26 0 -12 16 -29 -19 -23 -21 -24 5
6116 5 -14 -12 -11 -4 -12 4 -7 4 -5 -6 18 -15 -15 -7 -4 1 -8 5 20 3 -9 -10 8 27 18 -25 -14 8 -4 -6 2 -24 -9 12 27 -1 -9 -6 -1 15
6156 15 -3 -2 -4 -33 -28 4 1 -21 -4 7 8 -2 -3 -8 -27 -6 -10 3 -18 -2 -1 -6 12 -8 -17 -3 22 12 -15 -13 16 -16 16 24 21 28 -11 3
6194 3 16 -7 -20 7 -1 -23 -13 -17 -27 -11 -28 27 -14 -29 -20 -3 17 -19 -12 6 -8 -3 -2 7 0 7 -22 -16 4 -9 4 10 -3 3 -11 15 -7
6231 -7 2 10 15 -1 -18 12 -7 8 -28 16 11 5 1 -25 -2 0 -21 0 -16 -10 -16 -29 -24 10 -19 -10 -24 7 -6 8 -33 -4 -10 14 13 10 -14 11
6269 11 -7 -28 9 19 -8 -6 -10 15 -9 -3 -4 7 -24 -2 3 -39 18 -24 -3 -37 4 -2 -19 7 -14 23 -6 -3 -8 0 6 -7 17 8 19 1
6305 1 19 13 -30 -25 -10 -14 7 3 9 4 -11 -8 -11 4 1 -20 1 -16 4 -23 7 -14 9 -2 6 2 -9 15 2 -36 -14 -4 7 -27 -6 -19
6341 -19 -37 3 3 -10 9 -1 -14 20 3 -27 2 5 -25 -3 0 -6 -1 14 -16 -9 11 -11 -29 1 -2 -15 18 -13 -19 -22 -17 -19 -9 -22 -32 -9
$$ packed form
6080c3K0j6K6oJ7k8L2j2Ll0L1k4K2Nj7MnlK5kk8J0Pj1K3l0oK6j2K8m5J0mKlK9
6116Ej9KJPqJ6j1J1rjK4l3%QLNrJ3J5j7j2jJ8J9rm3J1K2j2kQk6J5K1J5k8qLNJ6
6156A5j8Jkk9NL2lk2J7J1Jj0jnj9K1mJ3k1J6JnJ8k0rJ4K5j0k7KK9l2L2QlPl9J4
6194CJ3k3j3K7qk2J0mj0J6j7N5m1j5RJ7K0l6PJ8j4NJRpPk9OK0j3J3Oj3Oj4K6k2
6231gRQNj6j7L0j9J5l6M4nomk6K3Kk1K1j6Ooj3NL4k9Rj4L1j3J4m1K9oK4jlk4K5
6269A1j8k1L7J0k7KmK5k4OjJ1l1K2Nm2N7m2K1l4M1oj7K6k1L7k9LnQOj3K4rJ1j8
6305AJ8om3NJ5mK1mOnj5LlJ5lk1K1j7K0k7L0k1K3j1Qmj1K4j3l8K2J0J1l4K1j3
6341a9j8M0%j3J9j0j3L4j7l0K9Ll0K2LoNJ5l0PK0k2j8L0lj3L3l1olNkJ0j3j0K3
$$ plain form
6377 -9 -9 -23 -9 20 11 -12 -1 19 -12 21 8 -3 -2 15 -14 -21 18 -9 1 -23 8 25 -38 20 -4 -15 -7 12 1 -16 -7 8 -5 7
6411 7 16 11 -1 -42 -17 -10 -12 3 -3 -12 -6 19 6 -9 -6 0 -11 -7 28 0 -12 5 14 27 19 4 0 -6 10 8 -17 -34 15 17 9 -6 -1 13 13 12 -10
6452 -10 -3 12 -2 6 -15 -1 1 -24 -6 -7 7 -29 -9 19 -1 -21 -7 15 -11 21 -12 14 -20 19 18 15 21 9 5 -10 -3 9 -18 20 11
6487 11 1 -1 0 -20 10 -7 -11 -21 -2 5 -6 2 4 15 -4 -11 -24 -25 12 33 -10 1 16 3 -2 -10 1 1 17 -5 27 -6 0 18 20 -9 -17
6524 -17 -17 -2 -8 -5 -10 -7 6 -9 -6 14 -5 5 25 10 -22 -14 2 -1 2 -6 -3 20 -6 18 26 -17 -16 4 -1 2 -4 -11 -2 23 4 28 26 1 10 1 9
6565 9 13 -16 7 -14 11 13 26 1 -8 2 -4 8 3 -5 -31 -6 -5 11 -3 -8 0 -30 -6 -16 -27 -7 -4 5 36 5 9 8 1 15 4 8 0 7 6 13
6605 13 13 11 36 15 -14 20 3 25 -10 16 16 -8 -20 9 22 9 -12 9 -9 -13 34 -8 0 25 9 -11 -19 0 38 -28 10 18 18 6
6639 6 -8 -2 3 12 0 20 29 36 13 11 -14 26 4 13 -6 19 -2 -18 13 0 -23 1 8 17 19 -13 7 -5 7 -40 -1 -24 -24 -16 -3 13 20
$$ packed form
6377i%j4J4K9rk3J1K0l1L3j3j1JJ7k9pL9k7J0k4L1J7o3N8k4j1QJ9j1j7RJ5j3J2
6411GRnj2m1K5PkJ5orOK5j3j5LOj1ML5k8j2J7RJ3qj5moJ6kk5j7M9Kqj5NJ4%jk2
6452a0PJ5j4Qk1J4Kk5J8jJ4l6K0K8k0k0J4K2k6L2l3K6l4L9jlOj2mj5PJ2k7L8r
6487A1j0kJk0L0j7mj0J9Pj1QKJ1j9pj3jL7K1m3J1J5j3nqJ1%J6k2L2l3OJ8Kk9q
6524a7%J5oLnLJ3j5LK0j9J0K0j5l2QJ6lLqLK3k6K4Qm3JK0nLopRK5j9K4kk5RrQ
6565IMk9K3k1K5KJ3k5rJ0oJ2nqk6K5JJ6j4nQl0K4j0j1K0LRL1l1MjpJ4j1MqPjP
6605A3%kK5k1k9L4j7K2l5K6%k4j2K9J3j3k1K1j8mM7m2QK5j6k0qJ9L8o6L8Q%j2
6639Fj4ONRj2K0RPk3kk5M0k2Rj9K5k1j6L1j3k3K4PRKl2K0j2J2m7L9k3%QJ3J6P
$$ plain form
6676 20 -5 -4 13 12 -5 19 -18 -1 -30 1 -31 13 9 0 11 -10 -12 14 3 15 32 0 -1 -29 -23 -18 -5 0 -19 3 -17 -44 -32 12 -9
6711 -9 -25 12 20 1 -1 0 23 1 6 5 6 9 10 11 4 19 4 23 21 23 8 -7 16 25 -15 25 22 10 -6 -30 -15 2 -3 -2 -8 -9 1 -11 7 32
6751 32 31 -42 -10 13 -23 -1 -2 -24 -2 23 -20 -17 -7 13 -27 18 0 19 -16 -6 8 20 8 24 7 36 6 23 -32 -7 24 -26
6783 -26 -14 4 -5 9 17 -12 -2 3 -12 12 -1 -9 15 -5 -7 15 5 13 1 4 -10 -8 -4 -7 14 -14 5 40 24 -6 15 -14 27 -21 -13 8
6819 8 15 12 12 11 7 3 0 1 -27 -15 -5 -21 12 -8 -5 -24 0 1 14 30 -2 8 -2 47 12 32 -4 14 0 14 9 -7 -3 -12 19 3 5 17
6857 17 13 3 -13 8 15 -9 22 10 -16 27 -6 -24 -8 12 6 -11 -24 6 -19 -7 -4 -8 -2 -25 -8 18 -6 -20 10 19 -17 -11 13 36
6891 36 -5 -17 27 -11 23 3 30 -5 28 -1 13 11 1 18 -12 13 -12 4 3 28 -8 6 26 -19 -14 -8 6 -20 -33 -22 -24 14 12
6924 12 18 -13 18 18 1 11 3 15 -3 -1 -7 23 24 12 13 29 -24 8 8 -14 9 12 -9 5 -25 -9 -8 22 -9 -6 6 2 -9 -11 -1 -13 -12
$$ packed form
6676B0k5JJ7jj7K4l7J7k9L1l2M4mrJ1k1kK6j1J2J7l2jk8ONJ3Nj9K2k0k7J2M4k1
6711ij6L7Qj9kJK3k2NjJLJJpJ5j5J9kKj5j5K3Rm0M0lj2j6k4J5J7nJojJ0j2J8K5
6751C2jp3L2K3l6K2jk2K2K5m3LJ0K0m0M5j8J9l5J0J4J2j2J6j7K9l0J7n5K5L1n0
6783b6J2J8rJ4Qk9J0Nj5K4j3qK4k0kK2j0Qj2Lj4KMlK1k8J9L5j6l0K1k9M1m8QK1
6819HPl%jmmlJk8J2J0j6L3k0Lj9K4JJ3J6l2J0j0M9l5K0l6J8j4J4nj6MrL1j6KJ2
6857A7mj0j6K1Pk4L1j2k6M3l3j8J6K0oj7j3L0k5J2LmOk3J7K6k4j4L0Rl6OK4K3
6891C6m1j2M4l8L4k0K7l5L3k9J4kj0J7l0K5k5J6jK5l6J4K0m5NOJ4k6j3J1kL8k
6924A2Ol1L1%j7J0qJ2j8KoL0Jj2JJ6n3L2%k2K3Lk1J4l0J6JL0l1LJ2mj1kJ0j2J
$$ plain form
6961 -12 4 -7 16 -14 -6 -9 -2 -11 -1 8 -22 -5 -8 16 6 11 10 10 19 -4 -8 -1 14 7 -25 18 12 -28 10 27 19 6 -34 15 -2 -2 -5 19 -14
7000 -14 -19 21 6 1 -4 -20 -18 17 13 1 3 4 25 7 -7 29 22 1 6 18 38 1 4 9 12 -13 -11 10 2 3 6 -9 25 -7 -24 3 0 -22 -16
7039 -16 -5 17 -23 -8 -19 7 -6 -17 4 24 -13 -14 0 7 27 -8 -23 3 27 18 -14 12 27 2 36 -19 -9 1 14 5 14 5 17
7072 17 1 11 -18 -14 -16 -11 8 -9 -20 -6 -16 -20 -14 -33 10 -10 4 11 -6 11 4 -2 30 2 -3 0 19 18 24 0 -11 7 11 9 -2 11 6 -8
7110 -8 2 2 -2 -22 6 9 -14 -1 25 -6 4 -19 -22 -21 -26 -5 1 -15 -2 6 5 5 22 -27 -3 9 12 3 4 17 13 -13 -3 11 14 -14 1 -12
7148 -12 14 2 26 -10 9 11 9 -19 -9 -20 -8 -20 14 4 -1 -14 -12 13 -16 -1 11 -14 9 1 -33 -1 13 16 -9 -6 11 18 -15 -27
7182 -27 6 13 -11 -14 16 3 -3 -11 14 -11 -14 -1 11 -19 5 25 -19 5 5 -28 -9 24 1 14 -8 -4 -15 7 7 12 -8 8 -24 17 -26
7217 -26 -2 26 13 -1 22 -17 -10 18 1 13 43 27 -4 -3 -5 -11 30 -17 -1 -11 -8 -20 6 14 -19 0 4 10 -9 2 -27 -10 -7 11 -22
$$ packed form
6961a2J6j1K3l0QlPrJ0Rl0J7lK4j0Nj%Rk3mPJ5pl2M3om0L8J7qj3m0M9j7%lK4l3
7000a4nM0j5nnj6KL5mj2KJK1j8j4L6pk1NJ2K0l7LNLk5KK1qJLj5L4l2j7K7lk2O
7039a6J1K2m0J5j1K6j3j1K1K0l7jJ4PK0l5j5K6K4rl2K6J5k5L4n5J0J0J3rRrJ2
7072A7j6J0k9MkNJ9j7j1J4j0mOj9M3k0J4Pj7J7poL2k8nLJ9jOk4j1J8Mkj1J3nj4
7110hJ0%mk0K8Lk3J3K6l1J0k3lJnK1Oj6J3Qj%J7m9K4J2LrJJ3mk6J0J4Lk8J5j3
7148a2K6j2K4l6J9Kkk8J0j1J2j2L4j0nj3KK5k9J5J2k5K3ql4L2J4Lk5LJ7Pl3j2
7182b7L3Pk4lL0j3oqK5k5lJ3J2l0K4K0m4K4%l3J9L3k3J3k2Mj1K2%Nk0J6l2M1m3
7217b6K4K8j3j4K3l9PK8j7J2L0j6l1JkoM1m7J6j0Lj2K6Ql3J9MOj9J1k9J7LJ8l3
$$ plain form
7252 -22 -10 25 4 -17 -41 -8 -26 -1 -12 -22 23 -18 -8 -7 0 12 2 19 35 33 13 7 15 5 7 1 -14 -7 -24 -5 -1 -5 15 -9 -18 -14
7288 -14 -17 -4 5 5 26 -26 9 15 13 15 14 9 -4 8 7 -7 27 22 -2 -4 19 -6 -13 38 27 0 -4 -17 -16 3 8 -1 -11 -18 -20 0 -1 -13 -1 -4
7328 -4 -19 7 27 1 -11 -11 -11 -23 -1 -4 6 4 -3 -19 -4 -4 6 -9 14 -8 -10 21 2 -10 9 17 9 9 -33 1 34 -21 9 -13 -23 2
7364 2 -15 20 0 -7 -13 1 19 -2 12 -2 7 -11 -33 10 -32 -3 -5 2 5 9 -1 33 5 50 14 14 16 11 -8 5 -9 37 0 -6 27 -2
7400 -2 19 23 38 -7 18 -23 -10 -20 -1 12 13 -21 -7 20 11 -20 -7 -10 -21 -11 -2 1 28 27 -4 5 -6 16 8 36 -15 13 13 1 21 8
7436 8 16 -1 -14 -1 1 -10 0 9 23 8 17 -8 -8 31 3 -2 5 17 10 -16 17 -6 11 -11 4 -6 7 1 -18 -11 -7 25 9 -2 2 25 5
7473 5 18 -15 -17 6 -11 5 4 44 9 8 -3 5 -9 -6 3 -11 -2 -4 1 5 5 -34 -6 -5 -24 -16 1 -12 11 -41 -11 -21 -1 8 9 1 -16 10 21
7512 21 -14 -24 11 12 16 19 0 31 5 -5 24 23 -5 0 0 -29 0 22 -38 -13 -8 12 -2 -26 -36 4 -1 22 -37 -28 3 -4 8 -29 13
$$ packed form
7252b2J2L5k1k1k4L3j8K5j1j0M5m1J0JPJ2j0J7J6kk0oQj0Koj5Pj7J9MmK0k4rM
7288a4lJ3R%K1n2L5OkKjnj3J2jj4L4nk4kK3k5pN1j1k7mj3JJ9Nrj0pkK0jj2J2l
7328dj5K6K0k6j2%%j2K2lJ0kpj6J5%J0j5K3k2kL1j9j2J9Qq%m2L4L3n5L0k2j0K5
7364Bj7L5k0poJ4J8k1J4j4Rj8k2M3m2K9kPLMj0L4k8M5l6%Knj9J3j4M6l7oL3k9
7400bK1MJ5m5K5m1J3j0J9J3Jl4J4K7rl1J3lj1J0RLK7jl1Rj1K2qK8n1K8%j2K0j3
7436HQj7j3J3Kj1J0RJ4j5Rk5%L9k8nPJ2pk6L3k3J7k2J5j0J3oj9PML2j6j1MK3k0
7473EJ3l3kK3j7J6jM0l5jj1Qj4LRj4RkNM%l9K8Jj9QJ7j3K3n2L0j0K0RJqj7K6J1
7512B1l5j0L5JMLj9L1k6j0K9jk8N%k9K9K2o0K5NK0j4k4j0M0nK3n9RL1pJ2l7M2
$$ plain form
7547 13 5 3 -26 -5 -9 15 6 10 -27 5 -4 -4 42 34 4 -11 -30 -6 26 -3 11 29 -14 -5 -1 5 11 4 11 -1 13 -34 -17 -31 14 -22 -10
7584 -10 8 3 16 11 5 -4 14 20 15 -10 0 -9 16 23 -5 18 -16 -8 2 12 -20 35 14 -1 -6 3 7 1 -17 -2 11 -12 -31 -18 14 22 -15
7621 -15 -25 -50 1 3 -15 -7 4 -12 -10 -19 0 -6 -4 -9 -9 18 -2 -3 -8 -6 -20 9 -29 22 0 -28 -7 3 -8 -1 -4 26 -10 14 -23 -5 -18
7658 -18 -7 -14 -16 5 -8 -16 -31 3 -22 -32 -10 -27 -28 -13 -38 18 -21 -3 20 0 -4 1 15 15 -39 -2 16 14 -29 23 -19 15 -8 -13 11
7693 11 -10 -20 17 3 -17 0 -2 -19 -36 -15 27 -12 14 1 -7 -14 -9 17 -22 -43 -2 16 20 8 12 4 -28 9 -14 -39 3 -14 22 -6
7727 -6 -38 11 18 -4 1 -13 0 -10 -22 -6 -13 15 -36 -2 -50 -6 -23 -16 -31 -19 -18 -7 -1 -14 3 4 7 -22 3 4 -2 10 -5 -10 6 -3 15
7764 15 11 9 -29 -4 11 3 -11 8 10 -9 -7 1 -13 3 16 -20 -25 -24 -27 -3 -27 -16 -14 19 15 4 10 -29 -16 15 -37 -39 -4 -4 10 -25 -1
7801 -1 -5 -8 4 -11 -25 13 -28 16 20 -9 12 10 6 26 22 7 12 -8 -8 -6 -8 -12 13 11 -15 -8 -10 7 4 -7 -2 7 -10 -11 -37 -4 21 -34 -18 -17
$$ packed form
7547A3qkk9K1mK4rMl7L2r%M6ql0j5j9K4L2k9J4J8m3RMOOpPj2J4m7J7j4M5l6J2
7584a0J8nJ3norJ8Onk5J0rK5Pk8K3l4QJ0J0l2N5k1j5nRMoj8J5J3k3j9J3L2Ql7
7621a5j0k5N1Kj8QJ1j6KrJ9oKn%K7k0jnKj4K9l8N1k2k8K1J0j1PlL0l6K4l7J8j3
7658a8J1pkK1j3qj5L4k5j0K2j7jJ5k5N6l9J8K3k0mNJ4%n4L7J8km3N2m2L4k3nK4
7693A1k1j0L7j4k0J7kj7j7K1M2l9K6j3qpNK6l9k1M1J8Mj2Mql2L7k3k5M2j7L6k8
7727fl2M9Pk2Nj4J3j0j2J6pK8n1L4m8M4j7Pj5J2JJ1Oj3J7JLk9K5JoJ2j5nJ6rJ8
7764A5mkl8K5J5qj4J9Kj9KQj4J6J3l6nJlK4k4J1KL3mj1Ol9J3L1n2kL5%J4l5K4
7801amlJ2j5j4L8m1M4Mk9K1kmK0mj5Nk0%KkmK5kk6PkJ7lj1NRj7jk6L3K5n5J6J
$$ plain form
7841 -17 8 -18 -1 11 -13 24 -20 9 3 -16 3 -14 -6 -15 15 -1 -7 -3 -11 6 -4 8 -4 -3 -4 -8 -6 -16 0 13 -9 -26 -9 -11 -11 -21
7877 -21 -12 -18 1 -30 -11 -12 -8 -18 -22 -9 7 27 -2 5 -19 1 -3 21 -11 12 -16 0 0 5 11 38 -6 -3 -26 -4 3 -7 -3 -24 -25 7 -12
7914 -12 3 -18 -49 -17 -26 -10 -16 22 7 -23 -3 -12 -24 14 -7 -9 8 3 -9 -17 5 23 22 14 -2 -12 10 -31 -23 -7 -11 -5 -11 -20 17 -9 -6
7951 -6 -14 -11 11 -3 -21 -27 11 -37 0 8 12 4 9 -7 -1 -28 8 1 6 9 3 -9 14 4 -1 18 -19 35 6 6 10 -22 -10 -13 -13 -25 1 11 -15
7990 -15 -32 -39 2 -25 -14 -27 28 -3 3 22 6 7 5 4 -12 -15 -10 8 0 -6 -11 -7 -7 6 6 0 -19 0 1 -10 23 3 -11 4 -17 12 7 -6
8028 -6 5 28 -5 -9 27 -20 -3 -7 0 -7 -3 24 -21 -21 -5 -21 -8 -16 8 -14 -9 -9 -25 26 -16 8 7 12 38 3 9 -5 13 -8 -26 2 -4
8065 -4 -2 0 -37 12 -9 -18 9 20 -9 -6 -18 -4 -11 -16 -32 -48 -8 1 -13 -9 -1 4 -10 -9 -1 -12 7 -16 29 -8 5 18 -5 7 4 -4 -2 26
8103 26 23 8 7 -6 15 -4 18 6 -15 11 9 2 3 -7 4 -17 -17 -27 -11 7 -10 -7 -11 14 0 5 4 -1 -7 -31 -16 11 16 5 0 11 -7
$$ packed form
7841a7K5k6J7J2k4L7m4K9oj9J9j7QrL0j6oMqJ7j0J2j2JjmKj0J6J3k2j7J7k%j0
7877b1RoJ9l1J9jMj0mJ3J6K0k9Pk4K0mK4l2K3k8J6%NOK7m4Lk3K2Pj0Mk1jL2j9
7914a2J5k1l1L2rJ6oL8j5l0K0rj2L8k1kJ7nj2qK2J8jqj6j0K2m1QJ6mOorL7k6L
7951fqLK2j4j8oL8m8L7QMqNj6Ok7L6pNLoj2K3j0nJ9l7N4k9%Ml2J2l%j2K6J0k6
7990a5j7pM1k7J1j3N5l1OJ9j6Jkjj6lNJ8qonM%J3%oj9J9Jj1L3k0j4J5k1K9nj3
8028fJ1K3l3mL6m7J7mPpMK7m5%J6j6J3qK4k2N%j6N1m2K4jNK6l5Oj4J8k1j8K8o
8065dKKl7M9k1rK7J1k9Lj2J4pnj6j6M0Rj4MQNj4JQj1J9k3M5l7J3J3k3J2lqKK8
8103B6lj5jj3K1j9K2j2k1K6kpJj0J1k1%j0J6J8j7LmK5j4Njnok4J5K7Nj1nJ1j8
$$ plain form
8140 -7 -24 -5 -12 37 6 -12 -12 -9 1 5 13 -15 -7 4 3 -9 4 -16 0 -40 -1 -18 -23 -9 -33 4 1 14 -20 -20 0 -9 -9 -5 -37 -3 11
8177 11 16 13 22 -23 -9 -6 -4 15 -16 -14 7 -16 11 -18
$$ packed form
8140gj7J9pM9l1j8%LJ0MQk8QJ1jj2J3k0J6m0L9j7nJ4k4L7lJ3l4%K0r%Ml2L4J4
8177A1NlRm5J4LKJ9l1KK1k3K7k9
8191a8
$$ Imaginary data points
##PAGE= N=2
##DATA TABLE= (X++(I..I)), XYDATA
$$ plain form
0 0 0 0 0 0 0 0 0 0 0 0 0 0 0 0 8 -8 8 -8 8 -13 16 -16 22 -24 30 -35 42 -46 54 -61 72 -81 91 -105 118 -134
36 -134 150 -167 188 -207 233 -258 285 -316 350 -386 426 -472 519 -572 630 -693 766 -843 931
55 931 -1032 1148 -1278 1432 -1613 1829 -2098 2435 -2882 3496 -4397 5867 -8668 16017 -80350
70 -80350 -191383 -153123 -170179 -164179 -162511 -157989 -167253 -154534 -157953 -158359 -155181 -150115 -155833 -149153
84 -149153 -147611 -148948 -147426 -141727 -145733 -142691 -139456 -140468 -140714 -135843 -137543 -137545 -134435 -133709 -136130 -132470
100 -132470 -131660 -134237 -131600 -129404 -133350 -130297 -128048 -131932 -129516 -126683 -130708 -128468 -125791 -129093 -127648
115 -127648 -124559 -127245 -126559 -123456 -125265 -125164 -121994 -123393 -123695 -120463 -121250 -122044 -119196 -119455 -120136 -117775
131 -117775 -117708 -118388 -116728 -115943 -116723 -115897 -114551 -115222 -115035 -113221 -114201 -114548 -112330 -113214 -113940 -111736 -112514 -113304
$$ packed form
0@%%%%%%%%%%%%%%Qj6J6j6J6k1K9l2L8m6N4o5P7q8J00j15J33j53J72j96K23k52
36a34K84l17L55l95M40m91N43o01O66p36Q12q98R91j091J202j323J459j609J774
55I31j963K180k426K710l045L442l927M533n317O378p893J0264j4535K4685r6367
70h0350j11033L8260j7056O000J668M522r264J2719l419m06L178N066n718O680
84a49153J542j337J522N699m006L042L235j012k46M871j700kL110P26k421L660
100a32470Q10k577K637K196l946L053K249l884K416K833m025K240K677l302J445
115a27648L089k686O86L103j809J01L170j399l02L232p87p94K848k59o81K361
131a17775O7o80J660P85p80Q26J346o71J87J814r80l47K218q84p26K204p78p90
$$ plain form
149 -113304 -111186 -111772 -112760 -110835 -110900 -112006 -110315 -110066 -111283 -109808 -109116 -110424 -109083 -108098 -109390 -108173
165 -108173 -107165 -108241 -107189 -106137 -106889 -106187 -105162 -105457 -105166 -104308 -104241 -104329 -103446 -103181 -103724 -102897 -102430 -103243
183 -103243 -102534 -102074 -102968 -102380 -101957 -102866 -102587 -102012 -102853 -102909 -102275 -103007 -103297 -102525 -103235 -103767 -102893 -103453 -103962 -103149
203 -103149 -103626 -104045 -103256 -103636 -103962 -103327 -103488 -103709 -103228 -103163 -103366 -103045 -102668 -102886 -102813 -102228 -102409 -102342 -101780 -101997
223 -101997 -101937 -101391 -101499 -101565 -101034 -100996 -101114 -100751 -100614 -100860 -100412 -100133 -100601 -100212 -99810 -100285 -99855 -99465 -99927 -99511
243 -99511 -99072 -99397 -99038 -98585 -98752 -98486 -98060 -98061 -97903 -97361 -97239 -97203 -96635 -96388 -96433 -95821 -95557 -95643 -95014 -94693 -94767 -94328
265 -94328 -93952 -93932 -93607 -93173 -93156 -93028 -92449 -92448 -92452 -91866 -91864 -91894 -91274 -91320 -91402 -90802 -90790 -90887 -90438 -90392 -90459 -90049 -89899 -90052 -89704
290 -89704 -89372 -89542 -89356 -88979 -89145 -88928 -88534 -88712 -88549 -88083 -88217 -88100 -87763 -87795 -87711 -87392 -87292 -87322 -87025 -86776 -86937
$$ packed form
149a13304K118n86r88J925o5j106J691K49j217J475O92j308J341R85j292J217
165a08173J008j076J052J052p52P02J025k95K91Q58O7q8Q83K65n43Q27M67q13
183a03243P09M60q94N88M23r09K79N75q41n6O34p32k90P72p10n32Q74n60n09Q13
203a03149m77m19P89l80l26O35j61k21M81O5k03L21L77k18P3N85j81O7N62k17
223a01997O0N46j08o6N31L8j18L63J37k46M48K79m68L89M02m75M30L90m62M16
243i9511M39l25L59M53j67K66M26jJ58N42J22L6N68K47m5O12K64q6O29L21p4M39
265i4328L76K0L25M34J7J28N79JmN86Kl0O20m6q2O00J2r7M49M6o7M10J50j53L48
290h9704L32j70J86L77j66K17L94j78J63M66j34J17L37l2Q4L19J00l0K97K49j61
$$ plain form
311 -86937 -86617 -86358 -86554 -86199 -85906 -86119 -85819 -85522 -85634 -85392 -85123 -85206 -84992 -84695 -84729 -84663 -84290 -84242 -84229 -83859 -83807 -83840
333 -83840 -83366 -83327 -83389 -82929 -82850 -82891 -82503 -82421 -82391 -82079 -81852 -81898 -81678 -81379 -81397 -81186 -80833 -80888 -80690 -80289 -80405 -80235 -79789
356 -79789 -79875 -79767 -79352 -79394 -79302 -78934 -78858 -78898 -78545 -78400 -78454 -78136 -77953 -78091 -77781 -77493 -77678 -77412 -77157 -77299 -77057 -76826
378 -76826 -76922 -76763 -76506 -76584 -76492 -76227 -76221 -76222 -75934 -75923 -75978 -75626 -75546 -75691 -75335 -75252 -75345 -75044 -74947 -75006 -74737 -74578 -74637 -74467 -74249
403 -74249 -74283 -74122 -73899 -73926 -73853 -73517 -73531 -73463 -73139 -73147 -73094 -72757 -72742 -72694 -72401 -72312 -72252 -72029 -71846 -71808 -71581 -71366 -71341 -71142
427 -71142 -70883 -70895 -70665 -70365 -70426 -70151 -69862 -69861 -69671 -69359 -69295 -69160 -68848 -68734 -68586 -68283 -68128 -68052 -67716 -67559 -67492 -67165
449 -67165 -67003 -66932 -66599 -66412 -66379 -66095 -65885 -65815 -65591 -65329 -65218 -65054 -64741 -64654 -64536 -64226 -64113 -64020 -63676 -63592 -63502 -63138
471 -63138 -63022 -62948 -62690 -62514 -62428 -62163 -61975 -61916 -61688 -61403 -61391 -61197 -60898 -60892 -60663 -60391 -60375 -60180 -59906 -59871 -59705 -59466
$$ packed form
311h6937L20K59j96L55K93k13L00K97j12K42K69q3K14K97l4O6L73M8J3L70N2l3
333h3840M74L9o2M60P9m1L88Q2L0L12K27m6K20K99j8K11L53n5J98M01j16J70M46
356g9789q6J08M15m2R2L68P6m0L53J45n4L18J83j38L10K88j85K66K55j42K42K31
378g6826r6J59K57p8R2K65OjK88J1n5L52Q0j45L56Q3r3L01R7n9K69J59n9J70K18
403g4249l4J61K23k7P3L36j4O8L24qN3L37J5M8K93Q9O0K23J83L8K27K15K5J99
427g1142K59j2K30L00o1K75K89JJ90L12O4J35L12J14J48L03J55P6L36J57O7L27
449f7165J62P1L33J87L3K84K10P0K24K62J11J64L13Q7J18L10J13R3L44Q4R0L64
471f3138J16P4K58J76Q6K65J88N9K28K85J2J94K99OK29K72J6J95K74L5J66K39
$$ plain form
493 -59466 -59377 -59241 -59010 -58907 -58806 -58565 -58412 -58346 -58150 -57941 -57913 -57735 -57521 -57522 -57318 -57115 -57088 -56938 -56734 -56682 -56541 -56330
515 -56330 -56268 -56161 -55889 -55786 -55745 -55471 -55368 -55286 -55014 -54899 -54841 -54522 -54384 -54335 -54106 -53931 -53843 -53586 -53389 -53306 -53098 -52866
537 -52866 -52747 -52596 -52346 -52217 -52061 -51850 -51707 -51588 -51335 -51254 -51157 -50867 -50767 -50658 -50402 -50273 -50216 -50013 -49843 -49794 -49600
558 -49600 -49405 -49383 -49187 -48959 -48931 -48761 -48537 -48511 -48337 -48113 -48061 -47906 -47648 -47614 -47472 -47246 -47168 -47063 -46823 -46702 -46607 -46392
580 -46392 -46274 -46225 -45994 -45825 -45804 -45610 -45459 -45385 -45272 -45088 -45011 -44923 -44723 -44658 -44596 -44400 -44329 -44283 -44092 -43963 -43941 -43736 -43619
603 -43619 -43616 -43420 -43318 -43270 -43056 -42934 -42907 -42723 -42578 -42494 -42336 -42152 -42079 -41978 -41732 -41700 -41548 -41369 -41289 -41168 -40985 -40891 -40793
626 -40793 -40634 -40499 -40381 -40256 -40131 -40067 -39889 -39775 -39733 -39590 -39409 -39424 -39296 -39088 -39062 -38937 -38793 -38717 -38636 -38448 -38405 -38317
648 -38317 -38113 -38052 -38011 -37811 -37735 -37640 -37434 -37361 -37297 -37092 -37004 -36928 -36765 -36656 -36553 -36459 -36285 -36193 -36111 -35951 -35888 -35764 -35639 -35565
$$ packed form
493e9466Q9J36K31J03J01K41J53O6J96K09K8J78K14jK04K03K7J50K04N2J41K11
515e6330O2J07K72J03M1K74J03Q2K72J15N8L19J38M9K29J75Q8K57J97Q3K08K32
537e2866J19J51K50J29J56K11J43J19K53Q1R7K90J00J09K56J29N7K03J70M9J94
558d9600J95K2J96K28K8J70K24K6J74K24N2J55K58L4J42K26P8J05K40J21R5K15
580d6392J18M9K31J69K1J94J51P4J13J84P7Q8K00O5O2J96P1M6J91J29K2K05J17
603d3619LJ96J02M8K14J22K7J84J45Q4J58J84P3J01K46L2J52J79Q0J21J83R4R8
626d0793J59J35J18J25J25O4J78J14M2J43J81j5J28K08K6J25J44P6Q1J88M3Q8
648c8317K04O1M1K00P6R5K06P3O4K05Q8P6J63J09J03R4J74R2Q2J60O3J24J25P4
$$ plain form
672 -35565 -35506 -35333 -35306 -35243 -35074 -35018 -35002 -34840 -34820 -34744 -34615 -34536 -34516 -34406 -34351 -34322 -34201 -34116 -34121 -34010 -33912 -33901 -33788 -33653 -33637
697 -33637 -33541 -33416 -33361 -33275 -33143 -33082 -33001 -32869 -32776 -32715 -32634 -32505 -32467 -32363 -32225 -32157 -32049 -31980 -31904 -31814 -31710 -31665 -31566 -31500 -31435
722 -31435 -31340 -31286 -31200 -31137 -31049 -31001 -30957 -30875 -30794 -30769 -30673 -30601 -30560 -30441 -30390 -30315 -30221 -30170 -30083 -30008 -29930 -29865 -29746 -29655 -29569 -29519 -29402 -29344
750 -29344 -29272 -29171 -29066 -28992 -28897 -28835 -28731 -28641 -28574 -28493 -28387 -28358 -28251 -28218 -28114 -28101 -28018 -27938 -27908 -27828 -27754 -27731 -27663 -27561 -27551 -27470
776 -27470 -27398 -27352 -27312 -27226 -27157 -27089 -26993 -26918 -26859 -26774 -26680 -26598 -26514 -26393 -26345 -26231 -26152 -26108 -26014 -25902 -25803 -25726 -25629 -25540 -25458 -25352 -25297
803 -25297 -25260 -25118 -25042 -25000 -24905 -24822 -24785 -24712 -24635 -24561 -24494 -24438 -24394 -24324 -24239 -24214 -24142 -24079 -24030 -23902 -23873 -23827 -23757 -23698 -23633 -23563 -23468 -23419
831 -23419 -23315 -23243 -23210 -23113 -23031 -22954 -22848 -22769 -22678 -22616 -22589 -22463 -22392 -22322 -22232 -22218 -22116 -22097 -21962 -21907 -21822 -21789 -21691 -21623 -21602 -21520 -21460
858 -21460 -21394 -21324 -21257 -21219 -21141 -21042 -21026 -20935 -20863 -20815 -20739 -20689 -20624 -20555 -20481 -20375 -20340 -20246 -20176 -20111 -20034 -19949 -19885 -19807 -19704 -19653 -19587 -19485
$$ packed form
672c5565N9J73K7O3J69N6J6J62K0P6J29P9K0J10N5K9J21Q5nJ11R8J1J13J35J6
697c3637R6J25N5Q6J32O1Q1J32R3O1Q1J29L8J04J38O8J08O9P6R0J04M5R9O6O5
722c1435R5N4Q6O3Q8M8M4Q2Q1K5R6P2M1J19N1P5R4N1Q7P5P8O5J19R1Q6N0J17N8
750b9344P2J01J05P4R5O2J04R0O7Q1J06K9J07L3J04J3Q3Q0L0Q0P4K3O8J02J0Q1
776b7470P2M6M0Q6O9O8R6P5N9Q5R4Q2Q4J21M8J14P9M4R4J12R9P7R7Q9Q2J06N5
803b5297L7J42P6M2R5Q3L7P3P7P4O7N6M4P0Q5K5P2O3M9J28K9M6P0N9O5P0R5M9
831b3419J04P2L3R7Q2P7J06P9R1O2K7J26P1P0R0J4J02J9J35N5Q5L3R8O8K1Q2O0
858b1460O6P0O7L8P8R9J6R1P2M8P6N0O5O9P4J06L5R4P0O5P7Q5O4P8J03N1O6J02
$$ plain form
886 -19485 -19440 -19371 -19264 -19223 -19127 -19078 -19018 -18974 -18860 -18796 -18729 -18659 -18633 -18575 -18508 -18399 -18398 -18312 -18254 -18209 -18156 -18066 -18075 -17970 -17894 -17833 -17762 -17718
914 -17718 -17647 -17594 -17471 -17415 -17385 -17271 -17258 -17171 -17100 -17049 -16970 -16864 -16819 -16779 -16700 -16622 -16557 -16501 -16438 -16401 -16350 -16291 -16239 -16210 -16146 -16081 -16045 -15981
942 -15981 -15966 -15903 -15821 -15821 -15759 -15720 -15681 -15654 -15556 -15535 -15502 -15406 -15403 -15332 -15287 -15196 -15164 -15108 -15031 -15021 -14927 -14851 -14800 -14746 -14679 -14664 -14552 -14518 -14451 -14376
972 -14376 -14322 -14268 -14220 -14162 -14129 -14086 -14023 -13961 -13969 -13885 -13874 -13818 -13767 -13729 -13725 -13672 -13624 -13596 -13571 -13525 -13524 -13466 -13421 -13360 -13342 -13274 -13248 -13232 -13173 -13115 -13061
1003 -13061 -12988 -12932 -12938 -12843 -12779 -12716 -12648 -12596 -12523 -12502 -12401 -12363 -12278 -12222 -12186 -12134 -12066 -12034 -11999 -11900 -11886 -11826 -11785 -11768 -11735 -11674 -11625 -11586 -11584
1032 -11584 -11538 -11497 -11475 -11436 -11385 -11378 -11344 -11308 -11280 -11242 -11186 -11177 -11095 -11068 -11022 -10975 -10917 -10890 -10829 -10773 -10728 -10663 -10640 -10547 -10482 -10475 -10366 -10299 -10270 -10226
1062 -10226 -10169 -10114 -10078 -10006 -9969 -9938 -9916 -9835 -9815 -9775 -9735 -9717 -9674 -9660 -9614 -9597 -9568 -9524 -9476 -9438 -9445 -9407 -9388 -9346 -9274 -9259 -9200 -9208 -9161 -9113
1092 -9113 -9060 -9050 -8975 -8966 -8877 -8855 -8797 -8751 -8668 -8635 -8640 -8533 -8485 -8437 -8398 -8313 -8282 -8236 -8201 -8150 -8108 -8072 -8014 -8002 -7923 -7915 -7872 -7827 -7806 -7776
$$ packed form
886a9485M5O9J07M1R6M9O0M4J14O4O7P0K6N8O7J09JQ6N8M5N3R0rJ05P6O1P1M4
914a7718P1N3J23N6L0J14J3Q7P1N1P9J06M5M0P9P8O5N6O3L7N1N9N2K9O4O5L6O4
942a5981J5O3Q2%O2L9L9K7R8K1L3R6LP1M5R1L2N6P7J0R4P6N1N4O7J5J12L4O7P5
972a4376N4N4M8N8L3M3O3O2qQ4J1N6N1L8MN3M8K8K5M6JN8M5O1J8O8K6J6N9N8N4
1003a3061P3N6oR5O4O3O8N2P3K1J01L8Q5N6L6N2O8L2L5R9J4O0M1J7L3O1M9L9K
1032a1584M6M1K2L9N1PL4L6K8L8N6RQ2K7M6M7N8K7O1N6M5O5K3R3O5PJ09O7K9M4
1062a0226N7N5L6P2L7L1K2Q1K0M0M0J8M3J4M6J7K9M4M8L8pL8J9M2P2J5N9qM7M8
1092i113N3J0P5RQ9K2N8M6Q3L3nJ07M8M8L9Q5L1M6L5N1M2L6N8J2P9QM3M5K1L0
$$ plain form
1122 -7776 -7767 -7727 -7728 -7692 -7648 -7627 -7569 -7578 -7559 -7516 -7491 -7478 -7452 -7419 -7401 -7372 -7319 -7286 -7288 -7254 -7206 -7150 -7128 -7103 -7072 -7039 -6985 -6978 -6920 -6900 -6841 -6830
1154 -6830 -6786 -6782 -6741 -6670 -6667 -6656 -6596 -6605 -6578 -6529 -6491 -6487 -6476 -6441 -6439 -6396 -6373 -6352 -6340 -6333 -6302 -6274 -6260 -6234 -6224 -6202 -6198 -6156 -6119 -6123 -6094 -6055 -6012
1187 -6012 -6011 -5984 -5949 -5917 -5884 -5870 -5830 -5798 -5764 -5750 -5725 -5701 -5706 -5649 -5586 -5573 -5533 -5483 -5501 -5489 -5437 -5405 -5365 -5348 -5338 -5299 -5268 -5252 -5221 -5228 -5160
1218 -5160 -5169 -5138 -5087 -5115 -5074 -5075 -5059 -5018 -5001 -5003 -4975 -4925 -4924 -4865 -4852 -4862 -4806 -4814 -4783 -4751 -4717 -4737 -4681 -4671 -4639 -4611 -4581 -4574 -4554 -4489 -4501 -4474
1250 -4474 -4443 -4390 -4374 -4332 -4345 -4313 -4284 -4240 -4231 -4212 -4180 -4179 -4136 -4124 -4101 -4094 -4039 -4032 -4005 -3969 -3983 -3957 -3939 -3925 -3907 -3904 -3881 -3821 -3846 -3823 -3808 -3784
1282 -3784 -3765 -3741 -3719 -3687 -3670 -3669 -3620 -3593 -3605 -3566 -3534 -3542 -3508 -3468 -3488 -3451 -3418 -3396 -3372 -3356 -3352 -3338 -3293 -3286 -3236 -3271 -3236 -3229 -3213 -3174 -3174 -3160
1314 -3160 -3140 -3129 -3118 -3114 -3077 -3089 -3068 -3034 -3037 -3007 -3006 -3024 -2978 -2984 -2954 -2949 -2911 -2909 -2899 -2882 -2865 -2821 -2810 -2822 -2782 -2775 -2759 -2751 -2746 -2701 -2717 -2697 -2682 -2659
1348 -2659 -2650 -2650 -2605 -2600 -2589 -2603 -2554 -2548 -2569 -2538 -2511 -2538 -2498 -2499 -2472 -2476 -2436 -2445 -2435 -2425 -2420 -2403 -2415 -2401 -2361 -2340 -2345 -2331 -2317 -2289 -2283 -2263 -2258 -2243 -2235
$$ packed form
1122g776RM0jL6M4K1N8rJ9M3K5J3K6L3J8K9N3L3kL4M8N6K2K5L1L3N4PN8K0N9J1
1154f830M4MM1P1LJ1O0rK7M9L8MJ1L5KM3K3K1J2PL1K8J4K6J0K2MM2L7mK9L9M3
1187f012JK7L5L2L3J4M0L2L4J4K5K4nN7O3J3M0N0j8J2N2L2M0J7J0L9L1J6L1pO8
1218e160rL1N1k8M1jJ6M1J7kK8N0JN9J3j0N6qL1L2L4k0N6J0L2K8L0PK0O5j2K7
1250d474L1N3J6M2j3L2K9M4RJ9L2JM3J2K3PN5PK7L6j4K6J8J4J8LK3O0k5K3J5K4
1282c784J9K4K2L2J7JM9K7j2L9L2qL4M0k0L7L3K2K4J6MJ4M5PN0l5L5PJ6L9%J4
1314c160K0J1J1ML7j2K1L4lL0Jj8M6oL0NL8KJ0J7J7M4J1j2M0PJ6QNM5j6K0J5K3
1348b659R%M5NJ1j4M9Ok1L1K7k7M0jK7mM0rJ0J0NJ7j2J4M0K1nJ4J4K8OK0NJ5Q
$$ plain form
1383 -2235 -2203 -2212 -2206 -2192 -2181 -2140 -2151 -2141 -2137 -2098 -2074 -2065 -2065 -2069 -2016 -2005 -2036 -2006 -1995 -1972 -1955 -1955 -1941 -1953 -1910 -1887 -1894 -1887 -1850 -1866 -1833 -1835 -1815 -1790
1417 -1790 -1807 -1759 -1748 -1743 -1712 -1735 -1686 -1691 -1647 -1663 -1641 -1616 -1631 -1603 -1570 -1559 -1556 -1536 -1541 -1511 -1493 -1472 -1495 -1469 -1459 -1435 -1408 -1428 -1413 -1417 -1372 -1363
1449 -1363 -1349 -1353 -1317 -1321 -1288 -1271 -1303 -1246 -1225 -1230 -1233 -1191 -1189 -1158 -1156 -1122 -1131 -1117 -1137 -1088 -1084 -1073 -1061 -1050 -1047 -1015 -1015 -982 -988 -1000 -985 -966 -933 -937 -921
1484 -921 -945 -919 -895 -871 -856 -885 -865 -854 -881 -802 -814 -822 -778 -806 -809 -779 -775 -742 -703 -735 -746 -709 -714 -719 -699 -662 -658 -655 -641 -659 -658 -645 -630 -604
1518 -604 -606 -609 -588 -588 -593 -588 -584 -594 -564 -549 -567 -569 -551 -522 -528 -536 -509 -509 -531 -504 -496 -515 -522 -471 -482 -483 -463 -458 -486 -474 -458 -461 -449 -426 -441 -431 -449
1555 -449 -431 -434 -415 -437 -428 -443 -406 -425 -430 -394 -428 -388 -430 -393 -401 -404 -382 -390 -383 -406 -388 -368 -388 -368 -354 -370 -366 -365 -346 -385 -366 -335 -344 -379 -343
1590 -343 -334 -337 -343 -363 -347 -353 -338 -369 -349 -358 -336 -340 -332 -338 -343 -345 -328 -355 -332 -319 -343 -323 -320 -331 -325 -329 -324 -314 -316 -310 -304 -328 -316 -292 -281 -290 -290 -301 -284
1629 -284 -283 -286 -266 -258 -246 -255 -274 -241 -282 -238 -256 -268 -269 -279 -245 -268 -249 -251 -242 -244 -230 -245 -248 -213 -240 -234 -234 -232 -225 -210 -216 -221 -195 -187 -168 -159 -156 -187 -154
$$ packed form
1383b235L2rOJ4J1M1j1J0ML9K4R%mN3J1l1L0J1K3J7%J4j2M3K3pPL7j6L3kK0K5
1417a790j7M8J1NL1k3M9nM4j6K2K5j5K8L3J1LK0nL0J8K1k3K6J0K4K7k0J5mM5R
1449a363J4mL6mL3J7l2N7K1nlM2KL1KL4rJ4k0M9MJ1J2J1LL2%L3oj2J5J9L3mJ6
1484i21k4K6K4K4J5k9K0J1k7P9j2qM4k8lL0ML3L9l2j1L7nnK0L7MLJ4j8JJ3J5K6
1518f04klK1%nNMj0L0J5j8kJ8K9oqK7%k2K7Qj9pN1j1jK0Nk8J2J6lJ2K3j5J0j8
1555d49J8lJ9k2Rj5L7j9nL6l4M0m2L7qlK2qPk3J8K0k0K0J4j6MJJ9l9J9L1rl5L6
1590c43Rlok0J6oJ5l1K0rK2mQonkJ7k7K3J3k4K0Lj1OmNJ0kOOk4J2K4J1r%j1J7
1629b84JlK0QJ2rj9L3m1M4j8j2jj0L4k3J9kRkJ4j5lL5k7O%KPJ5onK6QJ9RLl1L3
$$ plain form
1668 -154 -164 -152 -159 -165 -142 -139 -113 -124 -113 -111 -108 -109 -130 -127 -98 -110 -99 -125 -123 -109 -97 -100 -102 -107 -127 -80 -74 -90 -94 -92 -86 -95 -82 -69 -61 -92 -81 -92
1706 -92 -82 -83 -63 -73 -76 -78 -66 -73 -75 -93 -57 -80 -75 -77 -107 -91 -75 -85 -61 -78 -78 -66 -90 -108 -120 -101 -110 -106 -96 -111 -114 -137 -99 -132 -145 -128
1742 -128 -145 -147 -133 -133 -133 -122 -121 -124 -122 -126 -116 -141 -137 -128 -149 -138 -117 -120 -101 -137 -122 -118 -145 -123 -117 -155 -143 -135 -112 -151 -122 -153 -145 -140 -137 -93 -152 -171
1780 -171 -150 -131 -131 -146 -133 -120 -125 -157 -171 -134 -140 -123 -110 -124 -105 -98 -105 -106 -76 -77 -77 -98 -85 -64 -66 -63 -87 -70 -72 -74 -57 -72 -93 -41 -49 -59
1816 -59 -55 -62 -41 -44 -53 -45 -55 -45 -37 -24 -49 -35 0 -24 -20 -9 4 -15 1 -7 1 -3 38 -5 15 41 17 25 39 51 37 22 18 33 25 41 39
1853 39 17 61 65 44 59 32 97 53 54 43 79 75 64 63 87 90 61 68 112 93 92 82 130 74 83 92 111 81 100 116 107 107 125 98 120 98
1889 98 136 109 114 145 124 130 119 128 146 149 146 167 143 127 85 112 156 126 146 145 117 146 161 146 151 133 143 133 123 150 127 176 133 128
1923 128 150 160 147 184 162 144 174 121 151 169 158 135 117 135 151 131 139 144 149 137 141 151 130 127 146 132 130 130 153 138 127 125 138 124
$$ packed form
1668a54j0J2poK3LK6j1J1KLjk1LK9j2J1k6KJ4J2lknk0M7Oj6mKOrJ3J3Ql1J1j1
1706i2J0jK0j0lkJ2pkj8L6k3Nkl0J6J6j0K4j7%J2k4j8j2J9rMJ0j5lk3L8l3j3J7
1742a28j7kJ4%%J1JlKmJ0k5MRk1J1K1lJ9l6J5Mk7K2Ol8J2QK3l9K9l1QNLM4n9j9
1780a71K1J9%j5J3J3nl2j4L7oJ7J3j4J9PpjL0j%k1J3K1kLk4J7kkJ7j5k1N2qj0
1816e9MpK1lrQj0J0QJ3k5J4L5k4MJ1J3j9J6qQmM1m3K0K6k4QJ4J2j4j5mJ5qJ6k
1853C9k2M4Mk1J5k7O5m4Jj1L6mj1jK4Lk9PM4j9jj0M8n6RRJ9l0J9J6r%J8k7K2k2
1889I8L8k7NL1k1Oj1RJ8LlK1k4j6m2K7M4l0K0jk8K9J5j5Nj8J0j0j0K7k3M9m3n
1923A28K2J0j3L7k2j8L0n3L0J8j1k3j8J8J6k0QNNj2MJ0k1lJ9j4k%K3j5j1kJ3j4
$$ plain form
1957 124 121 134 95 113 118 112 121 146 92 92 101 151 103 119 120 104 103 89 129 94 96 107 118 91 79 98 51 87 85 85 58 62 50 61 36 35
1993 35 33 56 60 50 76 42 64 69 48 44 -3 55 29 31 32 31 41 54 16 24 17 32 -7 32 11 30 5 16 24 -2 16 28 19 11 19 16 27
2030 27 33 42 16 -8 6 9 9 1 18 -13 7 26 11 21 1 1 7 2 19 -17 4 15 -26 4 -13 -33 -28 7 -7 -11 -26 -18 -12 -9 -44 -49 -35
2067 -35 -18 -31 -13 -25 -14 -21 -28 -32 -24 -34 -48 -30 -37 0 -17 -11 -20 -18 -30 -14 -16 -31 -33 -4 -18 -32 2 -27 -11 -20 -4 -25 -9 -21 -16 -23 -36
2104 -36 -41 -25 -46 -35 -55 -57 -36 -19 -32 -34 -19 -28 -27 -27 -42 -28 -14 -43 -59 -28 -42 -45 -62 -17 -31 -42 -20 -27 0 2 -31 -17 -23 -35 -32 -31
2140 -31 -32 -22 -19 -2 -36 -34 -34 -41 -35 -66 -40 -35 -60 -36 -23 -59 -68 -52 -53 -59 -57 -54 -83 -70 -37 -61 -47 -50 -37 -75 -66 -62 -66 -64 -66 -45 -58 -62 -26 -67
2180 -67 -68 -78 -63 -66 -65 -78 -82 -67 -59 -71 -74 -76 -71 -83 -63 -74 -55 -72 -93 -67 -85 -76 -74 -66 -54 -44 -66 -77 -72 -95 -47 -46 -66 -42 -50 -38 -34 -72
2218 -72 -59 -47 -60 -49 -46 -48 -40 -70 -55 -53 -50 -43 -37 -55 -55 -34 -47 -34 -25 -37 -9 -9 -6 -36 -25 -37 -3 -10 3 -21 -16 -15 14 -15 1 -4 3 5 24
$$ packed form
1957A24lJ3l9J8NoRK5n4%RN0m8J6Jj6jj4M0l5KJ1J1k7j2J9m7L6k%k7Mj2J1k5j
1993C5kK3Mj0K6l4K2Nk1mm7N8k6KJjJ0J3l8QpJ5l9L9k1J9k5J1Qk6J8J2rqQlJ1
2030B7ORk6k4J4L%qJ7l1K0J9j5J0k0%OnJ7l6K1J1m1L0j7k0NL5j4mj5QOLl5nJ4
2067c5J7j3J8j2J1ppmQj0j4J8pL7j7OrKj2J6kj5kK9j4j4L4k9J6rJ6k1J6j2Npj3
2104c6nJ6k1J1k0kK1J7j3kJ5rJ%j5J4J4k9j6L1j4lj7M5j4j1K2pK7Kl3J4oj2LJ
2140c1jJ0LJ7l4K%pOl1K6Nk5K4J3l6rJ6joKLk9J3L3k4J4lJ3l8RMmKkK1j3mL6m1
2180f7jj0J5lJj3mJ5Qj2lkNj2K0j1J9j7k1K6j8RKQJ2J0k2j1Nk3M8Jk0K4qJ2Ml8
2218g2J3J2j3J1LkQl0J5KLPOj8%K1j3J3Rj2K8%Ll0J1j2L4pJ3k4NJK9k9J6nPKJ9
$$ plain form
2257 24 11 12 11 19 5 4 36 33 8 17 22 49 22 25 44 18 41 57 35 44 28 52 31 23 27 31 46 42 49 10 35 37 29 34 44 52 55 37 66 37
2297 37 57 46 50 41 43 64 26 53 25 49 74 32 28 51 33 84 36 39 47 23 36 53 37 52 46 29 30 25 22 50 8 11 65 25 32 31 27
2334 27 35 15 32 14 19 32 -2 28 48 49 56 39 44 19 17 8 26 7 3 21 11 12 6 34 15 22 4 -13 18 -5 11 16 -3 -3 -12 -16 24 0
2372 0 -7 10 -7 10 0 -23 -18 -11 -30 -19 -12 -16 -35 -27 -25 -20 -19 -5 1 1 -5 8 -36 -16 -23 -9 -24 -4 -40 -19 -15 -27 -27 -26 -26 -35 -35 -47 -67 -41
2412 -41 -28 -62 -39 -29 -22 -55 -26 -13 -35 -40 -26 -36 -44 -35 -36 -35 -50 -21 -26 -49 -23 -5 -36 -31 -47 -4 -61 -25 -16 -47 -49 -7 -27 -14 -15 -43
2448 -43 -67 -40 -30 -33 -52 -51 -25 -49 -45 -48 -35 -59 -58 -47 -42 -21 -31 -42 -12 -37 -24 -22 -60 -26 -4 -48 -43 -57 -25 -14 7 -44 -7 -21
2482 -21 -32 -51 -43 -22 -12 -28 6 -19 -44 -30 -28 -25 -52 -26 -30 -43 -30 -16 -18 -13 -20 -16 -26 -21 -21 -27 -25 -53 -17 -33 -44 -17 -49 -25 -10 -32
2518 -32 -31 -28 -44 -61 -29 -62 -41 -44 -49 -34 -31 -17 -18 -52 -27 -33 -44 -53 -55 -48 -61 -39 -35 -60 -34 -72 -52 -60 -48 -47 -43 -40 -62 -64 -69 -51 -58 -58 -47 -53
$$ packed form
2257B4j3JjQj4jL2lk5RNK7k7LJ9k6K3J6k2Rj6K4k1qMMJ5mPl9K5KqNJ0QLj8K9k9
2297C7K0j1MrKK1l8K7k8K4K5m2mK3j8N1m8LQk4J3J7j6J5oj7JnlK8m2LN4m0Pjm
2334B7Qk0J7j8NJ3l4L0K0JPj7Nk5krJ8j9mJ8j0JoK8j9Pj8j7L1k3J6Nj9%rmM0k4
2372@pJ7j7J7j0k3NPj9J1Pmj9QKNJJ4O%oJ3m4K0pJ4j5K0l6K1Mj2%J%r%j2k0K6
2412d1J3l4K3J0Pl3K9J3k2nJ4j0qRjJj5K9nk3K6J8l1Nj6M3n7L6Rl1kM2k0J3jk8
2448d3k4K7J0lj9JK6k4MlJ3k4JJ1NK1j0j1L0k5J3Kl8L4K2m4Nj4L2J1K1n1L7j4
2482b1j1j9QK1J0j6L4k5k5J4KLk7K6mj3J3J4kNpMj0N%oKk8L6j6j1K7l2K4J5k2
2518c2JLj6j7L2l3K1lnJ5LJ4jl4K5oj1rkPj3K2Mk5K6l8K0qJ2JMLk2knJ8p%J1o
$$ plain form
2558 -53 -55 -48 -67 -55 -74 -42 -78 -62 -42 -79 -71 -59 -67 -97 -40 -99 -66 -93 -103 -70 -105 -101 -78 -90 -82 -82 -66 -82 -71 -99 -82 -72 -71 -79 -87
2593 -87 -87 -90 -89 -112 -57 -87 -96 -88 -96 -97 -87 -84 -89 -83 -61 -73 -95 -76 -92 -106 -120 -85 -118 -83 -87 -97 -68 -87 -103 -99 -88 -75 -78 -75 -96 -81 -64
2630 -64 -70 -76 -56 -75 -65 -65 -71 -55 -89 -66 -62 -83 -62 -87 -37 -84 -65 -48 -42 -57 -58 -80 -44 -60 -105 -61 -71 -32 -76 -52 -67 -72 -74 -33 -69
2665 -69 -61 -35 -61 -52 -71 -81 -67 -51 -78 -51 -58 -51 -26 -60 -36 -39 -54 -39 -70 -76 -40 -77 -72 -85 -64 -70 -42 -59 -74 -52 -73 -78 -69 -74 -48 -75
2701 -75 -77 -57 -66 -71 -59 -49 -85 -53 -54 -57 -76 -31 -64 -73 -38 -53 -46 -37 -46 -53 -64 -72 -59 -98 -57 -55 -77 -63 -69 -25 -59 -74 -68 -60 -88 -53 -69 -74
2739 -74 -52 -75 -38 -73 -92 -73 -47 -56 -81 -52 -54 -66 -51 -55 -76 -77 -81 -62 -61 -51 -52 -56 -83 -57 -57 -72 -45 -54 -72 -66 -53 -90 -65 -68 -74 -89 -66
2776 -66 -63 -62 -89 -91 -83 -69 -94 -73 -101 -82 -78 -81 -84 -80 -68 -72 -55 -71 -85 -55 -69 -64 -77 -73 -69 -91 -48 -93 -94 -71 -72 -78 -77 -66 -83 -52 -74 -81 -59
2815 -59 -60 -95 -110 -86 -114 -106 -91 -105 -103 -85 -72 -43 -94 -99 -92 -72 -63 -82 -75 -93 -77 -41 -43 -60 -60 -42 -67 -40 -41 -70 -61 -49 -35 -58 -44 -59
$$ packed form
2558e3kPj9J2j9L2l6J6K0l7QJ2ql0N7n9L3k7j0L3l5MK3j2Q%J6j6J1k8J7J0Jqq
2593h7%lJk3N5l0rQqjJ0LnOK2j2k2J9j6j4j4L5l3L5mj0K9j9j6MJ1J3lLk1J5J7
2630f4ooK0j9J0%oJ6l4K3Mk1K1k5N0m7J9J7Oj5jk2L6j6m5M4j0L9m4K4j5nkM1l6
2665f9QK6k6Rj9j0J4J6k7K7pPK5l4K4lj5J5l1oL6l7Nj3K1oK8j7j5K2k1nRnK6k7
2701g5kK0rnJ2J0l6L2jlj9M5l3rL5j5PRrpj1qJ3l9M1Kk2J4oM4l4j5OQk8L5j6n
2739g4K2k3L7l5j9J9K6rk5K9kj2J5mk1jmJ9JJ0jmk7K6%j5K7rj8OJ3l7K5loj5K3
2776f6LJk7kQJ4k5K1k8J9MllMJ2mJ7j6j4L0j4Nj3MMk2M3m5jK3joJJ1j7L1k2pK2
2815e9jl5j5K4k8QJ5j4KJ8J3K9n1nPK0Rj9Pj8J6L6kj7%J8k5K7jk9RJ2J4k3J4j5
$$ plain form
2851 -59 -50 -44 -79 -60 -66 -33 -64 -52 -37 -51 -46 -60 -59 -56 -42 -65 -55 -54 -65 -45 -39 -46 -34 -43 -37 -51 -75 -60 -31 -51 -37 -18 -14 -39 -32 -87 -17
2888 -17 -31 -48 -44 -50 -62 -48 -8 -40 -45 -36 -68 -38 -46 -42 -12 -67 -58 -57 -70 -61 -47 -66 -55 -73 -64 -38 -82 -35 -76 -64 -48 -65 -76 -73 -71 -74 -68
2925 -68 -48 -63 -52 -49 -81 -71 -47 -19 -45 -59 -61 -71 -78 -52 -53 -94 -61 -71 -61 -68 -70 -58 -86 -60 -80 -83 -77 -63 -100 -77 -55 -65 -89 -89 -77
2960 -77 -72 -69 -88 -74 -42 -59 -79 -54 -60 -47 -58 -44 -59 -61 -75 -76 -46 -77 -60 -86 -89 -82 -61 -87 -68 -99 -97 -72 -83 -101 -73 -82 -97 -93 -85 -89
2996 -89 -91 -97 -90 -72 -67 -93 -87 -96 -75 -72 -86 -79 -103 -125 -77 -76 -93 -76 -76 -88 -90 -96 -93 -92 -82 -56 -97 -76 -70 -88 -86 -111 -94 -85 -81 -97 -86 -88 -91 -105
3036 -105 -105 -98 -110 -59 -83 -91 -74 -87 -62 -59 -54 -75 -46 -92 -53 -59 -54 -69 -68 -64 -47 -56 -66 -53 -50 -56 -81 -91 -62 -75 -49 -60 -53 -44 -70 -53 -44
3073 -44 -61 -70 -36 -57 -62 -32 -53 -38 -44 -35 -48 -21 -21 -34 -18 -34 -40 -40 -55 -54 1 -44 -8 -34 -39 10 6 -4 -25 -13 -22 -26 -12 -44 -35 -50 -39
3110 -39 -43 -44 -36 -24 -39 -42 -32 -20 -40 -41 -44 -23 5 -17 -56 17 -58 -14 -9 -17 -19 -41 0 -8 -28 -24 -6 -49 -23 -8 -30 7 -22 -12 -2 -32
$$ packed form
2851e9ROl5J9oL3l1J2J5j4Nj4JLJ4k3J0Jj1K0OpJ2rOj4k4J5K9k0J4J9Mk5Pn5P0
2888a7j4j7Moj2J4M0l2nRl2L0qML0n5RJj3RJ4j9J1j8RK6m4M7m1J2J6j7j1LKlO
2925f8K0j5J1Ll2J0K4K8k6j4kj0pK6jm1L3j0J0pkJ2k8K6k0lOJ4l7K3K2j0k4%J2
2960g7NLj9J4L2j7k0K5oJ3j1J4j5kj4jL0l1J7k6lPK1k6J9l1KK5j1j8K8rj5MQm
2996h9koPJ8Nk6OrK1Lj4Pk4k2M8Jj7J7%j2koLJJ0K6m1K1Oj8Kk5J7RMj6J1klj4
3036a05%Pj2N1k4qJ7j3K5LNk1K9m6L9oNj5JMJ7rj0J3Lok5j0K9j3K6j1PRk6J7R
3073d4j7rL4k1nL0k1J5oRj3K7%j3J6j6o%j5JN5m5L6k6nM9mj0k1J2rmJ4l2Rj5J1
3110c9mjQJ2j5lJ0J2k0jlK1K8k2l9P3p5M4Nqkk2M1qk0MJ8m3K6J5k2L7k9J0J0l0
$$ plain form
3146 -32 -32 -31 -36 -37 -33 14 -19 -43 -38 -46 -26 -24 1 -19 -9 -55 -11 -27 -21 -35 -30 -36 1 -31 -16 -30 -18 -10 -16 -26 22 -7 -27 -20 -11 -13 -14 -4 -25
3185 -25 -28 -43 -25 12 -21 -47 -28 2 -28 -42 2 -19 -2 -13 -20 -16 -26 -6 9 -19 -37 -19 -53 -11 -5 -41 -28 -6 -33 -15 -13 -17 3
3218 3 4 -18 9 -6 -19 -9 6 -12 -20 -15 -12 -17 -21 -8 -33 3 -10 3 -34 -18 -15 -34 -34 -12 -24 -23 -23 -41 -3 -43 15 -17 -21 -18 -9 12 6 3
3256 3 -9 -3 -17 -7 -10 -11 16 -9 -19 -15 5 -19 -8 -46 -9 -1 -7 -20 -21 -21 -36 -3 -25 -16 -18 -27 -12 -15 -24 0 -17 -8 0 17 5 -26 -26 -33 -8
3295 -8 -24 -6 -5 -2 -30 13 31 -5 -5 -13 -34 -9 -24 -8 -39 -15 1 -19 -20 -12 13 -34 -7 -12 -17 -21 -6 -26 -21 -17 -41 -28 -2 -19 -18 -17 -1
3332 -1 -5 -4 -29 -29 -29 -19 -23 -18 -22 -28 -16 -40 -6 -26 -28 -8 -10 -22 -4 -32 -49 -23 -14 -36 -18 -38 -26 -27 -19 -15 -29 -37 -19 -28 -35 -26 -27 -18 -8 -14 -20 -25
3374 -25 -28 10 -50 -11 -45 -43 -35 -15 -13 -28 -42 -34 -8 -17 -36 5 -23 8 -13 -6 -29 -22 -13 -40 -29 -17 -20 -23 -15 -31 -34 -2 -29 -35 -18 -36 -6
3411 -6 -17 -31 -30 6 -1 -38 -8 -8 -15 3 -14 -27 -2 -10 -33 3 19 -23 -19 -10 -31 17 12 -10 -9 -9 -11 -24 -25 -4 17 -10 -17 -24 -14 -16 -33 -13
$$ packed form
3146c2%JnjMM7l3k4NqK0KK5k0J0m6M4j6Oj4NoL7l2J5j4J2Qoj0M8k9k0PRkjJ0k1
3185b5lj5J8L7l3k6J9L0l0j4M4k1J7j1pMj0K0J5k8j8J8l4M2Ol6J3K2k7J8KmK0
3218CJk2K7j5j3J0J5j8qNLnmJ3k5L6j3J3l7J6Lj9%K2j2J%j8L8m0N8l2mLRK1ol
3256Cj2Oj4J0ljK7k5j0MK0k4J1l8L7Qoj3j%j5L3k2RkrJ5lrK4j7RQJ7j2l1%pK5
3295hj6J8JLk8M3J8l6%qk1K5j5J6l1K4J6k0jQK5m7K7nnmJ5k0NMk4J3K6j7JJJ6
3332amJk5%%J0mNmoJ2k4L4k0kK0kj2J8k8j7K6Rk2J8k0J2jQMj4qJ8rpRjRJ0oon
3374b5lL8o0L9l4KQK0Kj5j4QK6rj9M1k8L1k1Pk3PRk7J1J2llQj6lL2k7oJ7j8L0
3411fj1j4JL6pl7L0%pJ8j7j3K5qk3L6J6m2MRk1M8nk2J%kj3jK1K1k7ppJ0kj7K0
$$ plain form
3449 -13 -18 6 -17 -20 -20 -7 -3 10 5 4 -7 -19 18 -14 -10 -1 -14 13 8 -12 21 -18 -5 -5 12 -11 15 -12 -16 -21 -31 -1 10 6 -19 27 -7
3486 -7 -16 0 -19 -10 -6 49 -6 5 -8 7 -1 -14 -9 -5 -2 9 21 -6 8 -5 11 -13 6 -10 -1 10 -15 -28 18 1 -15 3 -19 -14 32
3521 32 3 2 -5 18 -26 26 31 -12 19 -6 12 19 8 11 -8 2 9 -18 12 -1 21 8 -7 -4 18 10 11 -6 12 10 25 3 1 15 52 47
3557 47 7 4 20 9 0 27 3 -4 -1 13 26 12 16 17 -1 -3 11 10 -4 -5 11 34 0 7 5 18 9 10 12 25 14 21 17 23 14 8 -15 2 28 11
3597 11 28 30 34 22 23 16 20 19 0 35 -2 17 4 3 24 -9 2 11 24 12 40 -7 -3 1 38 20 26 17 -5 -5 -7 14 -4 25 19 17 32 -1
3635 -1 12 47 15 19 7 25 49 36 36 18 14 32 28 5 17 5 19 30 18 11 27 6 8 18 30 4 16 42 30 33 15 1 9 9 22
3670 22 21 20 21 18 12 35 15 26 31 4 31 31 13 41 22 40 19 27 2 32 11 40 36 37 49 -2 15 24 24 12 35 12 43 -23 29 -21
3706 -21 -16 19 -4 11 38 23 12 40 9 26 -5 52 37 36 50 16 49 31 7 23 6 34 30 29 33 38 27 22 28 -1 33 20 31 4
$$ packed form
3449a3nK4k3l%J3MJ3njj1j2L7l2MRj3K7nk0L3l9J3%J7k3K6k7mnj0L0J1mk5M6l4
3486grJ6j9RMN5n5J1j3J5qj3NMLJ1J2k7J4j3J6k4J9j6RJ1k5j3M6j7j6J8k2NM6
3521C2k9jpK3m4N2Nm3L1k5J8Pj1Lj9J0Pk7L0j3K2j3j5LK2qJj7J8kJ5k2kJ4L7n
3557D7m0lJ6j1rK7k4pLJ4J3j4MJj8kJ4jj4jJ6K3l4PkJ3rJKJ3j1PmOrok3J7K6j7
3597A1J7KMj2JpMjj9L5l7J9j3jK1l3J1RJ3j2K8m7MML7j8Ork2%kK1j8K9okJ5l3
3635aJ3L5l2Mj2J8K4j3%j8mJ8mk3J2j2J4J1j2pJ6k1KJ0J2k6J2K6j2Lj8j4Q%J3
3670B2jjJloK3k0J1Nk7K7%j8K8j9J8k1Qk5L0k1K9mJJ2n1J7R%j2K3k3L1o6N2n0
3706b1NL5k3J5K7j5j1K8l1J7l1N7j5jJ4l4L3j8k4J6j7K8mjMNj1nOk9L4j3J1k7
$$ plain form
3740 4 -8 12 13 2 27 29 19 16 17 1 25 21 16 17 17 27 8 -1 8 21 8 18 21 54 8 13 17 28 12 28 23 12 19 12 33 15 17 56 2
3779 2 0 36 21 -1 27 11 -25 22 16 -2 3 -20 45 21 6 23 10 29 17 12 28 -2 7 12 35 34 34 24 7 -16 31 5 30 13 22
3814 22 23 16 32 31 21 23 10 11 52 34 34 32 41 16 12 27 17 37 29 33 53 2 22 31 28 34 49 39 42 34 18 33 17 45 44 16 34 17 49
3853 49 29 33 30 6 16 19 26 31 35 32 37 30 51 28 26 21 29 25 12 7 15 27 39 -5 38 12 12 24 -1 52 35 29 25 18 15 39 28 29 41 33 54
3894 54 41 -1 32 35 31 35 13 14 10 22 16 15 -2 37 30 46 42 19 15 24 55 43 7 39 18 47 48 37 40 28 29 11 44 20 54 46 54 41
3932 41 8 25 36 26 33 48 31 21 22 24 16 27 -3 11 11 31 17 22 28 34 8 10 13 26 13 16 13 -5 36 20 26 19 45 32 36 15 22 35
3970 35 16 49 12 13 25 15 9 1 37 32 38 2 1 18 4 32 22 0 28 52 25 15 24 17 -2 14 34 -3 47 8 14 54 13 23 8
4005 8 28 8 12 22 -8 49 6 23 21 24 35 30 37 30 23 -4 42 0 19 26 31 -2 28 20 13 8 18 29 -7 24 17 27 6 18 19 16 -1 28
$$ packed form
3740Dj2K0Jj1K5Kj0lJj6K4mnJ%J0j9rRJ3j3J0LL3m6NMJ1j6J6nj1PpK1j8KL9n4
3779BkL6j5k2K8j6l6M7oj8Nk3O5k4j5J7j3J9j2nJ6l0RNK3j%j0j7k3M7k6K5j7R
3814B2JpJ6jj0Kj3JM1j8%kRk5mJ5j0K0qMK0n1K0RlOJ5j0Lqj6J5j6K8jk8J8j7L2
3853D9k0Mlk4J0LPNMlNpK1k3knQmj3nQJ2J2m4M3k6%J2k5N3j7omplK4j1JJ2qK1
3894E4j3m2L3LmMk2JmJ2ojj7L9pJ6mk3mRL1j2l6L2k1K9Jj1Lj2Jj8L3k4L4qQj3
3932D1l3J7J1j0PJ5j7j0JKqJ1l0J4%K0j4NOOk6KLJ3j3Llj8M1j6OpK6j3Mk1PJ3
3970C5j9L3l7JJ2j0oqL6nOl6jJ7j4K8j0k2K8K4k7j0Rpj9J6K0l7N0l9OM0m1J0j5
4005HK0k0MJ0l0N7m3J7kLJ1nPppk7M6m2J9PNl3L0qpnJ0J1l6L1pJ0k1J2Jlj7K9
$$ plain form
4043 28 39 6 4 34 14 16 10 24 15 32 27 5 11 31 29 -3 30 17 9 12 2 -15 32 7 6 4 -17 4 45 -1 21 25 32 10 17 42 26
4080 26 -7 -12 6 0 11 29 -1 9 10 -11 36 24 -26 7 23 6 -5 21 16 16 30 13 -16 11 16 5 19 5 -13 -20 3 7 8 -2 2
4115 2 1 5 8 -9 -26 -7 -8 5 -12 30 -6 2 -2 -6 -16 -4 -10 7 -15 -14 2 -19 -25 20 -12 4 -1 -1 -15 -1 8 4 -17 -25 -32 -39 -23 -7 -17
4154 -17 -36 -18 -38 -15 -25 1 8 -20 5 -23 11 12 -40 -25 -11 -8 -13 -12 -30 9 3 -22 -9 -20 4 -18 -24 -3 -18 13 -11 -15 4 12 -6
4189 -6 -15 -5 -6 -13 -5 -16 1 -18 -10 -14 2 -8 -8 -7 -19 -2 -1 -8 -24 -11 -19 -21 2 -14 -4 -27 5 -15 3 9 16 5 -6 -21 20 20 -16 2
4227 2 -19 2 2 20 -3 -13 37 -24 21 24 -11 -14 11 -6 11 13 -17 13 -12 -2 -5 1 0 13 2 -4 -1 14 9 10 26 -13 1 17 4 29
4263 29 -12 10 18 -10 11 12 24 -5 -24 11 -19 -12 13 -4 14 -31 13 1 -6 14 -3 14 16 -14 9 2 0 7 -22 1 -1 -11 12 -5 12
4298 12 -6 1 -3 -14 -4 2 -8 -6 0 12 30 8 19 -29 16 -51 -19 -1 9 -4 -19 -18 6 -4 -25 -17 -3 -1 -17 -3 1 -16 -7 -7 -26 3
$$ packed form
4043B8J1l3kL0k0KoJ4rJ7nk2OK0kl2L3j3qLj0j7M7k5jkk1K1M1m6K2MPk2PK5j6
4080B6l3nJ8oJ1J8l0J0Jk1M7j2n0L3J6j7j1K6n%J4j7k9K7Nj1J4j4j8pK3MJj0M
4115BjMLj7j7J9jJ3j7M2l6Qmmj0J2oJ7k2JJ6k1oM5l2J6n%j4J4Rmk1qppJ6J6j0
4154a7j9J8k0K3j0K6Pk8K5k8L4Jn2J5J4LnJj8L9ok5J3j1K4k2oK1j5L1k4mJ9Qj8
4189frJ0jpQj1J7j9QmJ6j0%Jj2J7Jpj6J3qkK3j6J0k3L2k0J8OPj1j1j5M1%l6J8
4227Bk1K1%J8k3j0N0o1M5Ll5lK5j7J7Kl0L0k5J0lOjJ3j1oLJ5nJJ6l9J4J6j3K5
4263B9m1K2Qk8K1JJ2k9j9L5l0PK5j7J8m5M4j2pK0j7J7Kl0K3pkPk9K3kj0K3j7J7
4298A2j8Pmj1J0Oj0KOJ2J8k2J1m8M5o7L2J8J0j3j5JK4j0k1QJ4Kj6J4Mj7R%j9K9
$$ plain form
4334 3 7 24 5 12 2 -21 10 -10 -32 -24 -9 -27 -27 -15 -18 -34 -29 8 -6 -25 -10 -1 -7 24 -24 -33 -19 4 0 -36 -56 -2 11 -38 -49 -24
4370 -24 -8 -27 -21 11 -11 -13 -23 -32 -6 3 15 -17 -21 9 -4 -12 -7 5 4 -14 -42 -33 -19 -20 -27 2 -19 -24 -18 -22 -8 8 -13 -31 -26 -24 -31 15 14
4409 14 -35 -31 -12 -32 -41 -18 -39 -20 -28 -17 -22 -7 -12 -16 -4 -27 -22 -20 -34 -26 -8 -28 1 -12 -11 -14 -1 -12 -13 -36 -11 -17 -4 6 4 0 -12 -19
4447 -19 -26 -8 -12 -14 -10 -15 -25 16 -47 -12 -4 1 6 -32 -23 -3 -24 -12 -35 -4 -18 -21 13 19 8 -6 1 -5 -16 -23 7 -30 -13 12 -24 -11 36
4484 36 -22 -17 -20 -20 -29 0 -43 -14 -42 -10 6 -20 -5 4 0 -21 -6 -23 -30 -2 -28 -20 -43 -19 18 -14 -17 8 -5 17 -7 -16 33 -13 4
4519 4 -8 -11 -8 -25 -28 -10 -25 16 -7 -16 -6 -6 -15 -14 12 -8 -30 2 -20 -18 -8 -8 -24 -5 -29 -14 -32 -26 20 -22 -18 -16 -17 3 -12 -5 6 5
4557 5 -9 -36 -31 -4 -12 -2 0 17 -31 -36 -16 -21 -12 -30 -26 8 -22 -43 -9 -40 -25 -28 -37 -4 1 -23 -37 -15 -24 -24 1 -10 -7 -24 4 -29 -15
4594 -15 -9 -41 -22 -25 -15 1 -22 -8 -5 -26 -5 -27 -42 -17 -16 -27 -10 -39 5 -42 -9 -33 -52 -27 -27 -51 -41 -8 -16 -31 -27 -46 -28 -44
$$ packed form
4334CMJ7j9Pj0k3L1k0k2QJ5j8%J2lj6NL7j4j9J5RoL1m8rJ4K3ml6k0N4J3m9j1K5
4370b4J6j9OL2k2kj0rK6RJ2l2mL0j3qNJ2jj8k8RJ4jpK9k1nOmJ4J6k1j8NKpM6j
4409A4m9MJ9k0rK3k1J9qJ1nJ5nmJ2k3NKj4QJ8k0K9j3JlJ3j1jk3K5oJ3J0kmj2p
4447a9pJ8mkMnj0M1o3L5QNNl8RK0k1J2k3L1j4lL4Oj1j4Poj1pL0l7J7K5l6J3M7
4484C6n8Nl%rK9m3K9k8L2J6k6J5Rmk1J5j7pK8k6Qk3K4L7l2lK5j3K2k4rM9m6J7
4519Dj2lLj7lJ8j5M1k3rJ0%rJK6k0k2L2k2KJ0%j6J9k4J5j8OM6m2MKjK0j5PJ1j
4557Ej4k7NK7qJ0KJ7m8nK0nRj8ML4l0k1L4l1J5lrL3Nk4j4K2r%K5j1Lj7K8l3J4
4594a5Ol2J9lJ0J6k3J4Lk1K1k2j5K5Jj1J7k9M4m7L3k4j9K5%k4J0L3qj5Mj9J8j6
$$ plain form
4628 -44 -29 -23 -16 -12 -7 -24 -35 -8 -19 2 -10 -37 -10 -34 1 -36 -22 -43 -45 -41 -10 4 -21 -41 -11 -41 -10 -25 -29 -3 -18 -27 -20 -27 -23 -3
4664 -3 -32 -35 -6 -19 -8 8 -21 -31 -16 -12 -14 -35 7 -19 -14 10 3 2 7 -24 -3 -1 -12 -19 -23 -19 -12 -26 -8 -20 -9 -47 -8 -21 0 0 -29
4701 -29 -28 -18 -49 -23 -26 -44 -15 -22 -14 3 -9 -7 -10 -18 -4 -37 -31 -2 -6 -24 15 -1 -5 6 -11 -12 -25 -13 -33 -4 -2 -10 -26 -3 -42 -32 -16
4738 -16 -51 -20 1 -32 -12 -26 -10 -24 3 -23 -21 3 -28 -20 -25 -5 12 20 -15 -24 10 -23 18 2 -3 -31 -4 0 4 -2 -25 8 -17 -14 -4
4773 -4 11 -18 -18 -24 -24 -17 -2 -18 3 -10 -27 -26 -6 1 -19 -30 2 -2 -22 -25 -15 -29 -21 -4 -30 -9 -7 3 -4 -12 -11 12 11 4 -8 -21 -20 -15 -28
4812 -28 -9 -22 -1 -8 -24 -40 2 -11 -13 -37 2 -18 -13 -30 -34 4 -16 -35 -24 -15 -29 -1 -19 18 -8 -15 -23 10 -3 4 6 -38 -30 -11 -33
4847 -33 2 2 -14 -10 -6 -26 1 8 4 -6 3 -29 -3 2 16 -20 7 -17 10 -19 -16 -28 -7 -21 -35 -23 -24 13 -10 -10 -9 18 4 9 17 -27 -34
4884 -34 -35 -4 3 -5 -10 -20 -16 -10 9 -6 -1 18 -9 -11 -1 -42 4 -4 -23 -27 -16 -3 -14 -11 -19 -5 8 -28 21 -30 -20 10 9 -3 -31 -11 -1
$$ packed form
4628d4J5OPMNj7j1K7j1K1j2k7K7k4L5l7J4k1kML1J4k5k0L0l0L1j5mK6j5rPpMK0
4664ck9lK9j3J1J6k9j0J5Mkk1M2k6NK4pjNl1K1Kj1pmMPj4J8j2J1l8L9j3K1%k9
4701b9JJ0l1K6lj8K9pQJ7j2KlqJ4l3OK9mj8L9j6mJ1j7jj3J2k0K9Kqj6K3l9J0J6
4738a6l5L1K1l3K0j4J6j4K7k6KK4l1QnK0J7Ql5rL4l3M1j6nk8K7MMok3L3k5LJ0
4773dJ5k9%o%PJ5j6K1j3j7JK0Pk0j1L2mk0lJ0j4QJ7k6K1KJ0pqJK3jpj2j3JNj3
4812b8J9j3K1pj6j6M2j3kk4L9k0Nj7mL8k0j9J1Rj4K8j8L7k6pqL3j3PKm4QJ9k2
4847c3L5%j6MMk0K7Pmj0Rl2K6NJ4l6K7k4K7k9Lj2K1j4j4J2jL7k3%JK7j4NQm4p
4884c4jL1Pqnj0MOJ9j5NJ9k7kJ0m1M6qj9mJ1J3j1LqJ4J3l6M9n1J0L0jj2k8K0J0
$$ plain form
4921 -1 7 15 4 15 12 23 6 23 -19 18 -10 11 5 3 25 7 2 -28 20 -10 -14 -6 -18 -18 -19 -14 -9 10 -38 -15 -30 -3 -25 -9 -7 -24 -20 -37
4959 -37 13 -4 29 -2 12 -35 12 -10 -17 15 -27 -9 -7 -24 -16 -18 -30 1 -2 11 -18 6 6 6 -4 -10 -22 -19 -5 -18 -8 -22 -26 12 -24
4994 -24 -5 -10 -21 8 -9 -19 -19 15 1 -19 -14 5 5 -17 12 0 -4 -3 -22 21 -17 -7 9 -8 -18 -4 -32 -9 -19 1 -13 -17 -19 -24 -10
5029 -10 -28 -18 -6 20 -5 -14 -20 2 -34 -35 -57 -4 -18 2 -9 -41 -13 -17 3 -14 -25 -10 -8 -9 -11 -17 -18 -36 6 -20 -19 -6 19 7 -6
5064 -6 5 -3 29 -37 -26 -12 -32 -11 -10 3 -36 -15 -18 -12 4 -35 -23 -29 7 9 -14 -16 -15 -28 -23 10 -23 -31 4 -14 -19 0 -16 -31 -12 -3 0
5101 0 -15 -5 20 -20 -9 -28 -15 -46 -10 -13 -7 -9 -36 -10 -36 -10 3 -24 -4 9 -39 -26 -41 -12 -13 -17 -13 -23 -26 -13 1 -23 -4 6
5135 6 0 -27 -17 32 -20 -19 -21 -15 12 -12 -13 12 -11 -26 -25 -2 -6 -44 -12 -11 -34 -33 -16 -6 3 -5 -12 9 -13 -17 9 -2 -31 -2 -26 -1 -13
5172 -13 -13 -36 8 0 -18 1 -9 22 -44 -12 7 -6 2 -3 5 9 -10 -22 5 18 -28 -3 5 -18 6 6 6 -27 1 1 -20 -5 -53 -16 -20 2
$$ packed form
4921aQQj1J1lJ1j7J7m2L7k8K1okK2j8nl0M8l0mQj2%jNNJ9m8K3j5K7k2J6Kj7Mj7
4959c7N0j7L3l1J4m7M7k2pL2m2J8Kj7Qkj2L1lJ3k9K4%%j0oj2LJ4j3J0j4mL8l6
4994b4J9nj1K9j7j0%L4j4k0NJ9%k2K9j2mJj9M3l8J0J6j7j0J4k8K3j0K0j4mknJ4
5029a0j8J0J2K6k5roK2l6jk2N3j4K0j1l2K8mK0j7j1J5Kjkojj8M2k6JJ3K5j2j3
5064fJ1qL2o6J1J4k0K1JJ3l9K1lOJ6l9J2oL6Kk3kJj3NL3l3qL5j8nJ9j6j5J9RL
5101@j5J0K5m0J1j9J3l1L6lOkk7K6k6K6J3k7K0J3m8J3j5K9jmMj0lJ3J4k4J9J0
5135Fok7J0M9n2JkOK7k4jK5k3j5JK3ml8L2Jk3JJ7J0RqpK1k2mK6j1k9K9k4K5j2
5172a3%k3M4qj8J9j0L1o6L2J9j3QnQMj9j2K7J3m6K5Qk3K4%%l3K8%k1J5m8L7mK2
$$ plain form
5208 2 -28 -2 -30 -20 7 -35 -17 12 -3 -13 -5 -37 9 4 19 -9 -5 -7 13 -15 -5 -4 -16 0 -16 -6 -15 -11 -18 4 -5 -9 -18 9 -26 -7
5244 -7 -16 -11 -10 -4 -12 4 5 -11 2 18 -2 8 1 -40 -13 15 1 7 -2 -19 -7 2 0 19 8 25 -12 10 -22 -26 22 11 -23 -20 -2 -3 6 13 -11
5283 -11 26 29 14 -20 -10 -18 -18 -30 -11 -20 13 -11 -16 -1 -23 9 15 -5 12 0 11 -3 2 -10 11 17 -7 6 5 -6 7 -18 -11 12 -1
5318 -1 21 1 -22 4 -10 -23 2 -21 -40 10 -21 -35 -10 -9 -12 9 1 6 10 -23 22 -12 6 -6 6 -8 7 30 17 6 14 2 -3 -11 -3
5353 -3 0 9 -14 -24 -20 -19 -6 -18 -7 -11 1 7 -11 -3 -12 11 14 -15 -21 4 1 -10 13 -4 -12 -15 -3 3 -2 -7 4 14 5 5 3 13 -35 4 48 -5
5393 -5 18 23 10 -5 -7 6 -10 -41 5 1 -33 0 -26 -18 -10 -9 -30 -3 -7 -5 9 -12 -7 18 15 7 -18 -13 -16 -18 -3 -31 2 11 19 -9 -9 -5 -4 1 3
5434 3 -21 16 -6 0 -19 31 15 7 7 4 -33 -15 -26 -14 -13 -12 6 -22 -28 6 -23 14 -17 -26 28 -3 -11 14 -18 15 1 -33 15 0 19
5469 19 5 0 -7 1 -2 27 14 -1 12 8 9 16 -1 -8 -17 6 -10 13 -19 7 -22 -1 -5 23 -15 -28 -8 17 -14 12 -18 -22 -12 -31 3 -15
$$ packed form
5208Bl0K6k8J0K7m2J8K9j5j0Ql2M6nJ5k8MkK0k8J0Jj2J6j6J0rMpK2rmrK7l5J9
5244grNJOqJ6Jj6J3J6k0J0pm1K7K8j4Orj7J2RkJ9j1J7l7K2l2mM8j1l4LJ8jRPk4
5283a1L7Lj5l4J0q%j2J9rL3k4nJ5k2L2Ok0J7j2J1j4Nj2K1Ok4J3jj1J3k5PK3j3
5318aK2k0k3K6j4j3K5k3j9N0l1j4K5JlK1qNMl3M5l4J8j2J2j4J5K3j3j1Qj2nqQ
5353cLRk3j0MJJ3j2J1mJ2Oj8QrK3Lk9oK5lj1K3j7qlJ2OnnJ1J0r%kJ0m8L9M4n3
5393eK3Nj3j5kJ3j6l1M6ml4L3k6QQJk1K7mKJ4k1NK5lqk5NlkJ5k8L3RQk8%MJNK
5434Ck4L7k2Oj9N0j6q%ll7J8j1J2JJJ8k8oL4k9L7l1rN4l1qK5l2L3j4l4M8j5J9
5469A9j4npQlK9j3j5J3mJPj7prK3j6K3l2K6k9K1mK8l8j3K0K5l1K6l0mJ0j9L4j8
$$ plain form
5505 -15 -13 17 12 9 3 -21 2 -21 -3 26 -23 2 1 -8 12 -18 0 -17 -7 -11 -31 3 -18 -25 -12 -14 -31 6 -12 -18 -4 -19 -3 -12 -36 -5
5541 -5 -13 7 -40 -36 23 -1 -6 22 14 2 -12 -6 30 14 -4 0 -21 23 -5 3 16 -11 -25 -21 -1 -4 -10 17 -5 -20 4 -29 10 -9 14 -24
5577 -24 -7 -11 -5 -15 -36 20 8 -17 25 -21 -12 -4 22 3 -1 -21 11 1 -30 1 -18 -9 -7 -24 -30 1 5 -4 12 -21 14 -14 -13 16 15 -14
5613 -14 -40 -16 6 -30 0 -19 20 -20 10 -6 -17 2 3 -15 1 -2 -20 -13 11 4 -4 -8 -2 6 -5 -7 10 8 3 -15 -14 15 -4 -2 1 -30 -1
5650 -1 0 -37 26 13 -22 15 3 8 -31 -11 0 24 11 14 19 1 -14 5 26 21 24 7 -7 30 -23 -2 28 13 21 18 -4 -1 19 16 8 -1 -15
5687 -15 40 5 22 16 -4 -1 4 -22 15 15 23 -17 9 -10 2 -5 -6 -1 -9 23 9 3 -15 -15 18 9 8 14 -11 12 17 11 -5 0 12 24 -3 13 4
5726 4 -6 8 -5 -23 19 -15 18 10 5 15 -2 20 34 23 5 -24 19 0 6 11 7 -21 -8 -12 -6 4 13 -8 6 -11 -5 7 6 12 16 -23 -10
5763 -10 -8 23 26 4 -3 15 4 -14 2 2 20 23 4 8 34 -14 -16 -1 -26 -26 -6 -41 9 19 27 0 -15 17 -7 -1 -10 4 -20 12 -5 16
$$ packed form
5505a5KL0nlok4K3k3J8K9m9K5jrK0l0J8j7J0mk0L4k1pJ3kj7L7j8oJ4j5J6rk4L1
5541eqK0m7MN9k4nK8qj2j4OL6j6j8Mk1M4k8QJ3k7j4MK0loK7k2j5K4l3L9j9K3l8
5577b4J7mOj0k1N6j2k5M2m6RQK6j9mk0L2j0l1L1j9RKj7oL1MrJ6l3L5k8JK9jk9
5613a4k6K4K2l6L0j9L9m0L0j6j1J9Jj8J6lj8PK4pqmOQj1kJ7knj8JK9j9KLl1K9
5650aJl7O3j3l5L7j2Nl9K0J1K4j3LNj8j5J9K1nLj7j4L7n3K1L0j5Qlk2LK0lqrj4
5687a5N5l5J7ok0LNk6L7%Qm0K6j9J2pjNqL2j4oj8%L3rjOk5K3Noj6NJ2J2k7J6r
5726Dj0J4j3j8M2l4L3qnJ0j7K2J4j1j8k9M3j9ONmk8J3mOJ0Rk1J4j7OJ2jOMl9J3
5763a0KL1Lk2pJ8j1j8J6%J8Lj9MK6m8kJ5k5%K0l5N0J0Qk7j5L2k4OrJ4k4L2j7K1
$$ plain form
5799 16 11 11 4 1 -5 15 -1 18 18 -18 -3 8 0 22 1 2 6 -3 14 24 34 0 -3 9 -10 -22 21 -19 -21 -17 11 -30 -17 8 -21 -8 7
5836 7 -5 17 -6 22 -9 19 12 2 -5 18 17 -3 -19 16 25 -23 12 16 -3 9 9 -11 25 -3 2 -5 -3 -28 9 -25 9 -16 -19 18 1 -3
5872 -3 -9 21 -1 -7 -9 -16 -16 -10 -8 14 8 16 -9 -3 -11 -9 11 14 -11 5 19 -7 -24 -19 11 -15 -5 -3 -6 -8 1 -5 1 -11 -3 5 -28 -18 -18 -10 -9 -25 -10
5915 -10 14 20 13 30 7 4 3 -8 -14 -12 -18 3 9 -11 -7 -13 3 3 3 6 -7 -30 -12 -12 2 -14 14 -25 -14 -5 -3 -13 -19 -22 -6 -16 -24 -22 -18 0 -12
5956 -12 -8 3 1 1 -12 -14 12 -26 -1 4 -17 -1 -17 -24 17 21 26 -13 18 5 -7 10 5 -21 3 -7 -14 -21 -14 11 2 -16 -4 24 0 -4 -19
5993 -19 -17 -35 3 4 -9 16 -17 15 -10 -4 19 -7 -15 -26 -7 -1 29 -12 -9 5 12 18 -10 25 4 18 17 -3 -20 9 -3 -1 -12 -11 7 -9
6029 -9 14 -7 1 -9 11 29 -4 -6 -24 5 -25 -2 17 -19 -9 -15 20 -9 -11 -13 19 2 -2 4 -7 1 -4 8 8 -3 16 25 2 14 -1 -3 1
6066 1 9 0 21 -4 23 0 -5 4 -34 1 -2 -6 11 10 -1 -7 -5 -10 15 -15 43 17 -9 41 19 -12 9 31 -13 17 -7 8 8 3 29 7 19
$$ packed form
5799A6n%ploK0j6J9%l6J5J1qK2k1JMrJ7J0J0l4lJ2j9j2M3m0kMK8m1J3K5k9J3J5
5836Gj2K2k3K8l1K8pj0pK3jk0j6L5Rm8L5Mj9J2%k0L6k8NpKk5L7l4L4k5lL7j7m
5872coL0k2okp%OKK2oQk5OqKK0Lk5J6J4k6j7NL0k6J0KlkRoOj2QQl3J0%QJj6J5
5915a0K4OpJ7k3ljj1oKoK1Ok0MoJ6%%Lj3k3J8%J4j6K8l9J1RKj0olJ6j0qKMJ8j2
5956a2MJ1k%j3kK6l8K5Nk1J6j6pM1MNl9L1j3j2J7nk6K4j0ppPK5rj8J2K8k4mj5
5993a9Kj8L8Jj3K5l3L2k5OK3k6qj1J9OL0m1LJ4POk8L5k1J4jk0j7K9j2Kj1JJ8j6
6029iK3k1Qj0K0J8l3kj8K9l0K3J9l6J0oL5k9kkL2j7mOj1QnJ2%j1J9Rk3J2j5kM
6066AQrK1k5K7k3nRl8L5lmJ7jj1oKnK5l0N8k6k6N0k2l1K1K2m4L0k4J5%nK6k2J2
$$ plain form
6103 19 -21 36 11 -3 -31 -9 16 -12 0 32 13 13 26 -19 -25 17 -11 6 7 12 -5 14 -5 10 7 1 -10 14 30 1 20 -11 26
6136 26 12 -4 -4 11 -26 11 -26 19 1 5 18 10 -18 -13 19 5 -4 -5 -23 -27 11 -6 1 -17 7 -1 -1 -5 -19 -21 -31 14 31 11 14 1 -11
6173 -11 -8 14 11 -17 16 -2 0 -11 44 2 8 14 10 -10 14 15 16 13 -16 17 4 6 13 1 -18 9 -3 -31 13 -6 7 11 6 -3 1 23 3 -8
6211 -8 -1 1 15 21 17 31 33 16 16 -19 0 -17 16 5 7 13 13 26 11 -3 6 19 -13 10 7 10 -12 5 5 6 -1 -13 28 -4 -3 17 -10 19 -2
6250 -2 4 11 -30 -6 3 12 -16 -30 13 18 -5 13 17 4 -5 6 1 -13 1 17 -8 -8 -37 13 5 22 -12 -5 -13 16 -7 4 -37 7 14 -3 2 -26
6288 -26 13 6 2 15 21 27 -8 -5 -17 27 11 -23 -9 12 -12 -4 -8 -29 7 5 -3 14 1 8 -23 -22 20 24 -3 12 11 17 26 -2 -3 10 27 2
6326 2 -11 9 -2 -23 26 12 -3 11 21 8 3 22 -6 -2 8 -3 15 -1 18 10 34 -4 16 22 30 36 -9 0 8 18 -4 8 -3 17 27
6361 27 -7 18 -6 6 -20 10 -21 7 -21 32 0 -13 17 -4 23 -15 16 1 3 29 10 -16 -7 -18 0 -29 -5 29 2 7 11 30
$$ packed form
6103A9m0N7k5j4k8K2K5k8J2L2j9%J3m5oM2k8J7JNj7J9j9J5loj1K4J6k9J9l1L7
6136B6j4j6%J5l7L7l7M5j8MJ3qk8NL2j4rjj8mL8j7Pj8K4q%mj4kj0M5J7k0Lj3j2
6173a1LK2lk8L3j8Kj1N5m2OOmk0K4JJlk9L3j3KPj2j9K7j2k8M4j9J3MnrMK2k0j1
6211hPKJ4OmJ4Kj7%l5J9j7L3j1KO%J3j5j4RJ3l2K3lLk2J7%Jpj2M1l2JK0k7K9k1
6250bOPm1K4RRk8j4M3Nk3J8Mj3rJ1nj4J4J6k5%k9N0qJ7l4PqK9k3J1m1M4Pj7Nk8
6288b6L9pmJ3OOl5Lj2M4j6l4J4K1k4Qmk1L6kqJ7j3Pl1JM2Mk7J5jORk8jJ3J7k5
6326Bj3K0j1k1M9j4j5J4J0j3nJ9k8MJ0j1J8j6J9qK4l8K0OQOm5RQJ0k2J2j1K0J0
6361B7l4K5k4J2k6L0l1K8k8N3l2j3L0k1K7l8L1j5KK6j9k6Rj1J8k9K4L4k7NMJ9
$$ plain form
6393 30 2 5 -2 16 -11 -4 20 -4 8 -10 18 -15 -2 6 15 -26 -19 -3 3 12 21 9 -32 6 -15 2 -2 5 15 15 -14 20 -19 16 15 -19 2
6430 2 -19 18 32 0 -4 3 27 -11 10 5 1 -19 -15 3 1 30 -8 9 -1 8 1 -12 19 -7 10 26 -12 12 4 -16 0 -13 0 6 30 24
6466 24 -6 4 17 17 24 4 41 29 6 12 -1 1 5 -13 9 -21 -28 -9 -6 -5 11 -1 6 -18 18 -9 -11 11 11 8 -30 -23 -25 6 -13 12 6 14
6504 14 1 6 1 -13 4 17 36 3 13 20 -4 33 7 -19 20 -4 -4 21 -3 10 -9 5 -24 5 -10 3 0 23 2 -19 6 10 -15
6537 -15 -18 27 15 -1 -11 -14 23 -1 -2 28 44 -15 -28 -9 -27 17 3 16 12 20 4 4 -3 -11 -3 -4 -6 5 12 -9 -17 -18 30 17 -12 -16 3 16
6575 16 15 1 -6 2 2 4 -2 -17 -25 6 -11 4 -14 -20 14 7 12 7 13 5 -25 -8 6 26 2 -14 23 10 37 11 -6 -1 -7 -27 -22 -1 -9 -10 10
6614 10 -18 -11 4 -16 23 -10 -5 2 9 4 -15 -22 19 -4 -5 3 1 38 -24 24 -16 13 7 14 -20 13 -10 30 18 20 19 -11 -5 -2 -6 12 -3 -2 -4
6653 -4 12 19 10 -3 5 -6 25 -30 -20 -10 -16 6 -9 25 -9 -29 3 -1 18 28 -8 30 -6 11 -2 6 6 -3 13 27 22 2 -5 11 -21 19
$$ packed form
6393C0k8LpJ8k7PK4k4J2j8K8l3J3QRm1PJ6ORRj2m1L8k1J7mPJ0%k9L4l9L5jl4K1
6430Bk1L7J4l2mPK4l8K1nmk0MJ8kK9l8J7j0Rpj3L1k6J7J6l8K4qk0J6j3J3OK4o
6466B4l0J0J3%Pk0L7j2k3Oj3KMj8K2l0pJ9LJJ6j2Pk4L6k7kK2%ll8PkL1j9K5oQ
6504A4j3Nnj4J7J3J9l3J0Pk4L7k6k6L9k4%K5k4J3j9J4k9K9j5J3lK3k1k1K5Mk5
6537a5lM5j2j6j0lL7k4jL0J6n9j3J9j8M4j4J3mQj6%pqQjkJ1Pk1qjM8j3k9mJ9J3
6575A6jj4pQ%Koj5qL1j7J5j8oL4pNnOql0J7J4K0k4j6L7j3K7k6j7Nok0NK1qjK0
6614A0k8PJ5k0L9l3NPPnj9pM1k3jQkL7o2M8m0K9oPl4L3k3M0j2Kjl0OLmJ8j5Jk
6653dJ6Prj3Qj1L1n5J0J0oK2j5L4l4k0L2mJ9J0l6L8l6J7j3Q%rJ6J4nk0pJ6l2M0
$$ plain form
6689 19 18 -21 -17 2 7 -2 14 -1 -19 -14 -23 0 -1 -5 -11 16 -7 16 -2 25 -3 -7 20 -1 -17 6 11 11 -7 -20 -2 6 -2 13 -4 7 -4
6726 -4 -10 2 -10 28 -5 8 5 7 -12 17 -4 1 -6 -16 14 17 13 -7 -3 -10 15 7 -15 4 -16 -10 5 26 0 24 2 2 10 0 -5 3 34 -34
6764 -34 8 -22 5 14 3 -4 21 0 -12 0 6 -26 -14 -19 4 -6 -15 1 23 -27 -14 -25 -15 -7 -5 10 -19 5 -18 -29 -9 2 -18 14
6798 14 -25 22 -12 10 -25 1 -17 -9 -15 25 6 19 4 19 -9 -18 -1 -10 -4 0 5 -15 -23 -11 -29 -21 -14 -2 5 -25 -23 -4 -2 -21 -23 1 5 -5
6836 -5 36 10 -23 25 -3 8 2 -5 -32 -4 -2 8 15 5 -23 -12 12 -8 -16 17 -9 -18 -7 -12 -21 -10 3 8 -8 6 -13 28 0 -15 -13 24
$$ packed form
6689A9jl9MJ9NrJ6j5j8NrK3jmoK7k3K3j8K7k8mK7k1j6K3N%j8j3J8QqJ5j7J1j1
6726doJ2j2L8l3J3lKj9K9k1Npj0L0Lmk0MpK5qk2J9k0OJ5K1k6K4k2%Qj0nQL1o8
6764c4M2l0K7Rj1pK5k1j2J2Ol2J2nK3j0rJ6K2n0J3j1J0QKJ5k9K4k3j1K0J1k0L2
6798A4l9M7l4K2l5K6j8QoM0j9J3j5J5k8rJ7rOMNk0qJ2j8QPJ2Pl0KJ9Kj9kK4Mj0
6836eM1k6l3M8k8J1opk7K8KJ0Pj0k8J1K4k0qL3k6rJ1nrJ1J3Nj6J4j9M1k8j5KL7
$$ [...]
8191a8
##END NTUPLES=NMR FID
##END=
