##TITLE=1H_AM_NV89
 CDCl3
 8 sc, 
 24.11.2023
##JCAMPDX= 6.0         $$ Bruker NMR JCAMP-DX V2.0
##DATA TYPE= NMR FID
##DATA CLASS= NTUPLES
##ORIGIN= UXNMR, Bruker Analytische Messtechnik GmbH
##OWNER= root
$$ XWIN-NMR		Version 3.5
$$ Fri Nov 24 14:34:52 2023 Russian Standard Time (UT+4h)  she@DPX200
##.OBSERVE FREQUENCY= 200.1313
##.OBSERVE NUCLEUS= ^1H
##.DELAY= (6, 6)
##.ACQUISITION MODE= SIMULTANEOUS
##.ACQUISITION SCHEME= undefined
##.AVERAGES= 8
##.DIGITISER RES= 18
##SPECTROMETER/DATA SYSTEM= spect
##.PULSE SEQUENCE= zg30
##.SOLVENT NAME= D2O
##.SHIFT REFERENCE= (INTERNAL, D2O, 0, 15.7039)
##AUDIT TRAIL= $$ (NUMBER, WHEN, WHO, WHERE, WHAT)
$$ ##TITLE= Audit trail, XWIN-NMR		Version 3.5
$$ ##JCAMPDX= 5.01
$$ ##ORIGIN= Bruker BioSpin GmbH
$$ ##OWNER= she
$$ F:/spectra/data/she/nmr/H-F/1/audita.txt
$$ ##AUDIT TRAIL=  $$ (NUMBER, WHEN, WHO, WHERE, WHAT)
(   1,<2023-11-24 14:33:54.75 +0400>,<she>,<DPX200>,
      <created by zg, POWCHK disabled, PULCHK disabled
       configuration hash MD5:
       00 E9 B6 7A A2 85 ED C7 34 08 36 98 17 FE 4E 26
       data hash MD5: 16K
       4F 65 D0 52 E8 07 4B 92 AC DE AF D6 76 71 A0 00>)
$$ ##END=
$$ 
$$ hash MD5
$$ 58 C0 7A 36 4F 34 FD 2A 2D E1 F9 D9 A4 08 AC 4F
##$RELAX= 
##$RELAX= 
##$RELAX= 
##$RELAX= 
##$RELAX= 
##$RELAX= 
$$ Bruker specific parameters
$$ --------------------------
##$DU= <F:/spectra>
##$EXPNO= 1
##$NAME= <H-F>
##$PROCNO= 1
##$TYPE= <nmr>
##$USER= <she>
##$AMP= (0..31)
100 100 100 100 100 100 100 100 100 100 100 100 100 100 100 100 100 100 
100 100 100 100 100 100 100 100 100 100 100 100 100 100 
##$AQSEQ= 0
##$AQ_mod= 1
##$AUNM= <au_zg>
##$AUTOPOS= <>
##$BF1= 200.13
##$BF2= 200.13
##$BF3= 200.13
##$BF4= 200.13
##$BF5= 200.13
##$BF6= 200.13
##$BF7= 200.13
##$BF8= 200.13
##$BYTORDA= 1
##$CFDGTYP= 0
##$CFRGTYP= 5
##$CHEMSTR= <none>
##$CNST= (0..31)
1 1 145 1 1 1 1 1 1 1 1 1 1 1 1 1 1 1 1 1 1 1 1 1 1 1 1 1 1 1 1 1 
##$CPDPRG= <>
##$CPDPRG1= <>
##$CPDPRG2= <>
##$CPDPRG3= <>
##$CPDPRG4= <mlev>
##$CPDPRG5= <mlev>
##$CPDPRG6= <mlev>
##$CPDPRG7= <mlev>
##$CPDPRG8= <mlev>
##$CPDPRGB= <>
##$CPDPRGT= <>
##$D= (0..31)
0 1.2 0 0 0 0 0 0 0 0.06 0 0.03 0 0 0 0 0.0002 0 0 0 0 0 0 0 0 0 0 0 0 
0 0 0 
##$DATE= 1700822034
##$DBL= (0..7)
120 120 120 120 120 120 120 120 
##$DBP= (0..7)
150 150 150 150 150 150 150 150 
##$DBP07= 0
##$DBPNAM0= <>
##$DBPNAM1= <>
##$DBPNAM2= <>
##$DBPNAM3= <>
##$DBPNAM4= <>
##$DBPNAM5= <>
##$DBPNAM6= <>
##$DBPNAM7= <>
##$DBPOAL= (0..7)
0.5 0.5 0.5 0.5 0.5 0.5 0.5 0.5 
##$DBPOFFS= (0..7)
0 0 0 0 0 0 0 0 
##$DE= 6
##$DECBNUC= <off>
##$DECIM= 32
##$DECNUC= <off>
##$DECSTAT= 4
##$DIGMOD= 1
##$DIGTYP= 9
##$DL= (0..7)
0 120 120 120 120 120 120 120 
##$DP= (0..7)
150 150 150 150 150 150 150 150 
##$DP07= 0
##$DPNAME0= <>
##$DPNAME1= <>
##$DPNAME2= <>
##$DPNAME3= <>
##$DPNAME4= <>
##$DPNAME5= <>
##$DPNAME6= <>
##$DPNAME7= <>
##$DPOAL= (0..7)
0.5 0.5 0.5 0.5 0.5 0.5 0.5 0.5 
##$DPOFFS= (0..7)
0 0 0 0 0 0 0 0 
##$DQDMODE= 0
##$DR= 18
##$DS= 0
##$DSLIST= <SSSSSSSSSSSSSSS>
##$DSPFIRM= 0
$$ [...]
##$SUBNAM2= <"">
##$SUBNAM3= <"">
##$SUBNAM4= <"">
##$SUBNAM5= <"">
##$SUBNAM6= <"">
##$SUBNAM7= <"">
##$SUBNAM8= <"">
##$SUBNAM9= <"">
##$SW= 18.0517328524113
##$SWIBOX= (0..15)
0 0 2 0 0 0 0 0 0 0 0 0 0 0 0 0 
##$SW_h= 3612.71676300578
##$TD= 16384
##$TD0= 1
##$TE= 0
##$TE2= 300
##$TE3= 300
##$TEG= 300
##$TL= (0..7)
0 120 120 120 120 120 120 120 
##$TP= (0..7)
150 150 150 150 150 150 150 150 
##$TP07= 0
##$TPNAME0= <>
##$TPNAME1= <>
##$TPNAME2= <>
##$TPNAME3= <>
##$TPNAME4= <>
##$TPNAME5= <>
##$TPNAME6= <>
##$TPNAME7= <>
##$TPOAL= (0..7)
0.5 0.5 0.5 0.5 0.5 0.5 0.5 0.5 
##$TPOFFS= (0..7)
0 0 0 0 0 0 0 0 
##$TUNHIN= 0
##$TUNHOUT= 0
##$TUNXOUT= 0
##$USERA1= <user>
##$USERA2= <user>
##$USERA3= <user>
##$USERA4= <user>
##$USERA5= <user>
##$V9= 5
##$VALIST= <valist>
##$VCLIST= <CCCCCCCCCCCCCCC>
##$VD= 0
##$VDLIST= <DDDDDDDDDDDDDDD>
##$VPLIST= <PPPPPPPPPPPPPPP>
##$VTLIST= <TTTTTTTTTTTTTTT>
##$WBST= 1024
##$WBSW= 4
##$XGAIN= (0..3)
0 0 0 0 
##$XL= 0
##$YL= 0
##$YMAX_a= 128833
##$YMIN_a= -132631
##$ZGOPTNS= <>
##$ZL1= 120
##$ZL2= 120
##$ZL3= 120
##$ZL4= 120
##$ABSF1= 10
##$ABSF2= 0
##$ABSG= 5
##$ABSL= 3
##$ALPHA= 0
##$AQORDER= 0
##$ASSFAC= 0
##$ASSFACI= 0
##$ASSFACX= 0
##$ASSWID= 0
##$AUNMP= <proc_1d>
##$AZFE= 0.1
##$AZFW= 0.1
##$BCFW= 1
##$BC_mod= 2
##$BYTORDP= 1
##$COROFFS= 0
##$CY= 11.3945322036743
##$DATMOD= 1
##$DC= 2
##$DFILT= <>
##$DTYPP= 0
##$F1P= 15.7292609196834
##$F2P= 12.9074282941183
##$FCOR= 0.5
##$FTSIZE= 0
##$FT_mod= 4
##$GAMMA= 1
##$GB= 0.15
##$INTBC= 1
##$INTSCL= 1
##$ISEN= 128
##$LB= 0.24
##$LEV0= 0
##$LPBIN= 0
##$MAXI= 10000
##$MC2= 0
##$MEAN= 0
##$ME_mod= 0
##$MI= 1.114404
##$NCOEF= 0
##$NC_proc= 0
##$NLEV= 6
##$NOISF1= 3.799351
##$NOISF2= 2.8
##$NSP= 1
##$NTH_PI= 0
##$NZP= 0
##$OFFSET= 15.70392
##$PC= 1
##$PHC0= -24384.39
##$PHC1= 6.852691
##$PH_mod= 1
##$PKNL= yes
##$PPARMOD= 0
##$PSCAL= 0
##$PSIGN= 0
##$REVERSE= no
##$SF= 200.130013532006
##$SI= 16384
##$SIGF1= 3
##$SIGF2= 2
##$SINO= 400
##$SIOLD= 16384
##$SREGLST= <1H.CDCl3>
##$SSB= 0
##$STSI= 0
##$STSR= 0
##$SW_p= 3612.71676300578
##$SYMM= 0
##$S_DEV= 0
##$TDeff= 0
##$TDoff= 0
##$TI= <>
##$TILT= no
##$TM1= 0
##$TM2= 0
##$TOPLEV= 0
##$USERP1= <user>
##$USERP2= <user>
##$USERP3= <user>
##$USERP4= <user>
##$USERP5= <user>
##$WDW= 1
##$XDIM= 8192
##$YMAX_p= 0
##$YMIN_p= 0
$$ End of Bruker specific parameters
$$ ---------------------------------
##NTUPLES= NMR FID
##VAR_NAME=  TIME,          FID/REAL,        FID/IMAG
##SYMBOL=    X,             R,               I
##VAR_TYPE=  INDEPENDENT,   DEPENDENT,       DEPENDENT
##VAR_FORM=  AFFN,          ASDF,            ASDF
##VAR_DIM=   8192,          8192,            8192
##UNITS=     SECONDS,       ARBITRARY UNITS, ARBITRARY UNITS
##FACTOR=    0.0002768,     1,               1
##FIRST=     0,             0,               0
##LAST=      2.2672688,     0,               0
##MIN=       0,             -132631,         0
##MAX=       2.2672688,     128833,          0
$$ Real data points
##PAGE= N=1
##DATA TABLE= (X++(R..R)), XYDATA
0 0 0 0 0 0 0 0 0 0 0 0 0 0 0 0 0 0 0 0 0 0 0 0 0 -3 8 -8 8 -8 8 -8 9 -14 16 -16 17 -22 23 -25 29 -33 35 -39 44 -48
44 -48 55 -58 64 -71 79 -87 97 -106 115 -129 142 -157 175 -196 219 -246 282 -323 376 -447 550
65 550 -698 946 -1445 2847 -16858 -69964 -104544 -130049 -132631 -121901 -96827 -59615 -12310 32148
79 32148 71777 103518 122930 123510 109934 84969 49471 6457 -34242 -68689 -95552 -111255 -110682
92 -110682 -96716 -73386 -41670 -3565 32795 62708 85477 98916 98342 85500 64451 36662
104 36662 3319 -29050 -55515 -75415 -87320 -87439 -76122 -57716 -33668 -4730 23968 47485
116 47485 64879 75676 76793 67605 51669 31414 7003 -18191 -39100 -54377 -64333 -66644 -59605
129 -59605 -46397 -29808 -9427 12480 31163 44813 54353 57832 53098 42454 28837 11994 -7144
142 -7144 -24135 -36645 -45945 -50598 -48053 -39697 -28677 -14691 2008 17666 29564 38680 44279
155 44279 43718 37451 28513 16983 2507 -11852 -23099 -31903 -38205 -39250 -34917 -27876 -18600 -6172
169 -6172 6765 17299 25746 32331 34731 32067 26706 19419 9132 -2441 -12285 -20195 -26928 -30348
183 -30348 -29172 -25174 -19474 -11046 -875 8268 15582 22157 26278 26221 23242 18901 12100 3268 -5028
198 -5028 -11706 -17839 -22306 -23033 -20961 -17745 -12461 -5080 2351 8269 13806 18228 19679 18445 16074
213 16074 12234 6282 -164 -5347 -10093 -14426 -16282 -15768 -14212 -11680 -6960 -1708 2748 6798 10782
228 10782 13123 13194 12381 10910 7595 3161 -546 -4023 -7642 -10296 -10977 -10826 -10147 -8042 -4557 -1459
244 -1459 1417 4818 7710 9016 9342 9610 8412 5734 3103 701 -2341 -5428 -7154 -8070 -8852 -8617
260 -8617 -6758 -4545 -2555 229 3436 5524 6890 8128 8642 7477 5743 3974 1512 -1605 -4175
275 -4175 -5784 -7390 -8439 -7964 -6495 -5103 -3014 5 2735 4596 6367 7843 8009 6962 5804 4064
291 4064 1330 -1442 -3402 -5249 -6910 -7468 -6864 -5928 -4682 -2366 196 2167 4001 5752 6649 6322
307 6322 5764 4866 3076 828 -1044 -2563 -4306 -5482 -5548 -5289 -4755 -3533 -1675 -103 1286 2929 4191
324 4191 4572 4530 4452 3748 2316 1078 -99 -1596 -2951 -3503 -3794 -4008 -3779 -2787 -1718 -891 427 1819
342 1819 2638 3112 3549 3666 3106 2180 1539 482 -950 -1900 -2522 -3102 -3612 -3229 -2636 -2060 -1155 205 1310
361 1310 1992 2715 3365 3386 2855 2386 1633 355 -840 -1657 -2365 -3075 -3257 -2860 -2495 -1904 -775 445 1234
380 1234 1938 2778 3172 2899 2554 2127 1233 48 -763 -1501 -2332 -2818 -2787 -2543 -2320 -1654 -633 202 809 1722
400 1722 2374 2468 2473 2399 1981 1155 512 -100 -912 -1697 -2072 -2248 -2353 -2264 -1760 -1254 -692 -37 780 1442 1819 2264
422 2264 2472 2325 1937 1571 964 170 -706 -1274 -1954 -2564 -2728 -2615 -2396 -1973 -1112 -171 647 1558 2453 2941
442 2941 3106 3055 2741 2027 1072 49 -1035 -2148 -2957 -3399 -3525 -3417 -2765 -1771 -666 511 1820 2919
460 2919 3501 3896 3790 3329 2312 1203 -118 -1496 -2695 -3568 -3987 -4054 -3647 -2753 -1576 -321 1114 2463
478 2463 3424 4008 4177 3849 3064 1953 582 -826 -2242 -3283 -3920 -4148 -3952 -3279 -2081 -853 584
495 584 1977 3067 3860 4137 4032 3399 2399 1124 -297 -1705 -2908 -3739 -4102 -4063 -3586 -2594 -1388 21
513 21 1388 2624 3567 4057 4144 3699 2834 1623 266 -1078 -2433 -3367 -4017 -4157 -3879 -3118 -2024 -664
531 -664 741 2051 3138 3837 4111 3944 3388 2366 1064 -270 -1566 -2751 -3548 -3912 -3904 -3529 -2700 -1463
549 -1463 -260 1018 2225 3135 3706 3755 3526 2858 1868 751 -497 -1673 -2633 -3274 -3458 -3419 -2909 -2121 -1093
568 -1093 -118 1110 2038 2679 2995 3064 2864 2167 1393 490 -489 -1379 -2134 -2457 -2594 -2456 -2115 -1442 -773 -9
588 -9 862 1430 1891 2101 2165 1903 1457 983 369 -239 -907 -1285 -1627 -1768 -1707 -1416 -1106 -734 -125 400 735 1129
610 1129 1368 1441 1376 1219 941 548 81 -306 -645 -1034 -1217 -1343 -1229 -1141 -864 -551 -128 299 711 1035 1272
631 1272 1395 1439 1153 857 547 108 -471 -867 -1250 -1502 -1700 -1604 -1337 -960 -503 55 696 1145 1576 1857 1935
652 1935 1774 1476 988 390 -391 -1061 -1574 -2105 -2345 -2231 -1980 -1550 -811 0 875 1557 2277 2656 2709 2474
672 2474 2166 1407 522 -477 -1433 -2214 -2870 -3166 -3049 -2775 -2088 -1036 51 1090 2154 3056 3475 3547 3286
691 3286 2685 1694 481 -726 -1958 -2978 -3647 -3874 -3782 -3227 -2230 -978 330 1667 2881 3741 4144 4090
709 4090 3743 2765 1502 90 -1353 -2715 -3718 -4293 -4372 -4043 -3179 -1911 -397 1094 2579 3705 4374
726 4374 4592 4268 3438 2155 647 -860 -2386 -3679 -4473 -4770 -4481 -3740 -2513 -904 640 2294 3656
743 3656 4523 4889 4710 4018 2719 1203 -439 -2124 -3601 -4617 -5015 -4971 -4330 -3105 -1449 248 1991
760 1991 3606 4627 5204 5149 4551 3384 1811 -30 -1815 -3484 -4738 -5367 -5361 -4893 -3715 -2135 -316
777 -316 1585 3369 4599 5310 5510 5123 4098 2476 680 -1195 -2956 -4421 -5222 -5601 -5358 -4363 -2888
794 -2888 -1146 716 2616 4130 5113 5583 5433 4567 3218 1513 -364 -2210 -3751 -4864 -5467 -5443 -4729
811 -4729 -3504 -1896 -144 1701 3318 4538 5142 5311 4835 3733 2272 545 -1213 -2951 -4228 -4908
827 -4908 -5144 -4758 -3858 -2545 -838 807 2476 3780 4588 4950 4759 3915 2677 1202 -511 -2080 -3447
844 -3447 -4344 -4773 -4739 -3984 -2875 -1491 123 1774 3106 4066 4598 4657 4053 3073 1775 223 -1397 -2803
862 -2803 -3857 -4455 -4632 -4214 -3244 -1968 -529 1077 2554 3692 4362 4563 4307 3509 2335 881 -620
879 -620 -2166 -3349 -4165 -4558 -4397 -3701 -2579 -1313 232 1799 3051 3921 4443 4465 3911 2962 1720 213
897 213 -1341 -2693 -3765 -4356 -4512 -4124 -3292 -2100 -614 897 2344 3404 4153 4492 4228 3560 2500
914 2500 1134 -378 -1842 -3063 -3907 -4342 -4307 -3673 -2696 -1434 4 1498 2672 3572 4172 4141 3737 2880
932 2880 1713 310 -1096 -2395 -3362 -3977 -4085 -3713 -2989 -1930 -634 827 2127 3025 3764 3971 3695
949 3695 3008 2005 808 -568 -1795 -2794 -3509 -3815 -3610 -2977 -2076 -952 392 1691 2608 3354 3717 3573
967 3573 2968 2092 963 -318 -1506 -2502 -3257 -3624 -3538 -3006 -2161 -1107 66 1321 2302 3058 3505 3501 3028
986 3028 2246 1241 71 -1124 -2162 -2930 -3413 -3477 -3124 -2373 -1423 -282 936 1969 2754 3249 3413 3107
1004 3107 2412 1528 501 -663 -1649 -2477 -2962 -3177 -2985 -2418 -1642 -619 482 1421 2192 2705 2925 2807
1022 2807 2355 1649 767 -298 -1204 -1855 -2431 -2646 -2590 -2248 -1621 -797 143 1002 1656 2138 2364 2320 1995 1450
1042 1450 797 -62 -806 -1472 -1915 -2124 -2096 -1740 -1290 -704 66 751 1271 1676 1948 1847 1537 1030 457 -120
1062 -120 -765 -1309 -1500 -1723 -1671 -1402 -867 -333 207 823 1211 1504 1596 1571 1213 751 236 -292 -883 -1199 -1385
1083 -1385 -1518 -1416 -1129 -659 -103 320 881 1238 1389 1405 1266 999 492 27 -425 -866 -1175 -1304 -1277 -1163
1103 -1163 -886 -366 38 435 813 1140 1198 1172 1028 692 293 -119 -485 -805 -1018 -1070 -991 -757 -445 -74 300
1124 300 608 901 1004 954 746 550 240 -171 -487 -775 -925 -975 -938 -690 -377 7 412 716 902 997 1034 909
1146 909 558 241 -223 -603 -914 -1122 -1235 -1103 -930 -505 -145 368 826 1165 1384 1378 1304 1032 618 71 -374
1167 -374 -911 -1354 -1507 -1629 -1460 -1163 -716 -154 441 949 1444 1662 1719 1634 1348 726 205 -437 -1004 -1531 -1783
1188 -1783 -1837 -1688 -1383 -843 -247 345 991 1452 1786 1919 1675 1388 922 237 -397 -974 -1473 -1740 -1840 -1686
1208 -1686 -1379 -901 -270 361 1002 1526 1808 1855 1665 1361 811 159 -468 -1042 -1513 -1854 -1902 -1695 -1346 -830
1228 -830 -170 489 1014 1541 1767 1854 1697 1323 826 108 -482 -1102 -1565 -1817 -1897 -1670 -1353 -842 -180 524 1114
1249 1114 1592 1879 1968 1799 1424 877 182 -457 -1102 -1504 -1854 -1963 -1760 -1458 -968 -294 304 952 1468 1724
1269 1724 1891 1738 1451 1046 410 -181 -846 -1306 -1657 -1858 -1727 -1455 -1028 -511 142 724 1196 1488 1637 1688
1289 1688 1430 1024 540 -91 -556 -1030 -1301 -1474 -1485 -1264 -958 -496 -23 439 824 1171 1360 1315 1111 816
1309 816 506 41 -442 -779 -1017 -1209 -1222 -973 -739 -401 -5 276 755 963 1003 1039 874 644 376 -61 -346
1330 -346 -649 -792 -911 -862 -790 -566 -243 51 385 610 822 874 832 711 428 170 -113 -416 -646 -782 -825 -801
1352 -801 -637 -442 -222 53 371 546 676 698 739 656 459 130 -66 -265 -482 -626 -677 -642 -547 -359 -111 86
1374 86 245 423 563 605 548 420 339 108 -73 -173 -328 -439 -474 -408 -308 -234 -109 83 209 281 317 328 265 200
1398 200 88 -25 -142 -245 -272 -330 -248 -179 -121 43 200 274 387 379 297 291 184 28 -108 -231 -343 -372 -443 -371 -272
1423 -272 -190 26 197 371 414 531 493 443 358 120 -52 -344 -423 -589 -632 -601 -572 -497 -295 46 214 437 602
1446 602 691 703 701 500 334 96 -99 -435 -628 -715 -753 -744 -592 -443 -180 132 399 625 718 795 745 687 457 256
1470 256 -62 -323 -512 -730 -771 -792 -709 -536 -278 -14 301 439 735 863 829 763 595 292 14 -341 -531 -729
1492 -729 -817 -852 -804 -593 -368 -15 309 558 860 908 943 843 666 425 76 -241 -565 -784 -984 -1009 -938 -772
1514 -772 -466 -156 227 567 845 1073 1065 1002 894 612 204 -208 -573 -801 -1084 -1215 -1207 -998 -719 -373 72 539
1536 539 861 1182 1322 1309 1173 933 544 78 -363 -756 -1122 -1315 -1407 -1257 -1042 -712 -224 210 721 1063 1297
1557 1297 1452 1323 1154 816 415 -93 -589 -987 -1265 -1445 -1357 -1202 -846 -459 17 461 852 1075 1397 1304
1577 1304 1194 945 515 73 -349 -761 -1082 -1240 -1285 -1172 -1014 -603 -131 285 653 992 1209 1283 1179 911
1597 911 572 208 -206 -601 -967 -1129 -1265 -1140 -969 -636 -234 220 598 897 1163 1194 1105 972 634 312 -140
1618 -140 -511 -845 -1115 -1147 -1067 -937 -652 -323 120 479 783 1028 1127 1118 937 782 326 -34 -431 -727 -967 -1109
1640 -1109 -1122 -973 -813 -501 -114 259 632 858 1032 1057 963 791 568 194 -155 -490 -721 -894 -963 -971 -775 -569
1662 -569 -248 55 302 585 772 898 785 798 566 331 90 -141 -424 -676 -703 -740 -716 -556 -397 -188 66
1683 66 260 412 570 610 597 516 358 92 -5 -194 -348 -435 -484 -476 -410 -282 -153 20 50 275 362 372 345 383 284
1708 284 181 -16 -33 -99 -287 -252 -264 -257 -235 -156 -29 2 81 183 184 224 190 166 89 25 -13 -62 -104 -156 -230 -223 -142 -139 -50
1737 -50 5 -16 97 123 105 161 123 127 135 25 23 -18 -42 -141 -72 -39 -130 -68 -104 -87 -31 -4 58 -19 46 93 94 154 105 100 85 53
1769 53 56 -10 -40 -89 -134 -164 -128 -123 -100 -105 -74 11 86 58 165 218 229 215 265 174 117 -2 -20 -149 -250 -229 -292 -321 -346 -223
1799 -223 -146 -63 102 193 270 339 337 385 267 179 101 -8 -134 -214 -324 -413 -422 -396 -311 -200 -138 82 179 265 427 466 456
1826 456 395 360 158 -3 -138 -178 -345 -433 -490 -399 -336 -319 -179 32 173 301 411 417 414 383 305 141 30 -64 -196
1851 -196 -359 -479 -435 -456 -406 -271 -68 46 201 284 479 482 392 404 308 208 -31 -139 -234 -411 -463 -471 -420 -361 -173
1876 -173 -37 137 284 426 477 508 500 394 289 77 -31 -300 -368 -528 -569 -524 -530 -394 -184 -29 198 417 498
1899 498 654 600 585 399 230 107 -187 -356 -545 -619 -659 -650 -584 -398 -167 100 300 526 609 708 723 611 515 290
1923 290 10 -162 -421 -665 -746 -756 -752 -627 -405 -238 54 283 534 649 817 813 733 495 291 106 -202 -460
1945 -460 -600 -805 -855 -785 -657 -385 -196 125 371 624 795 936 852 706 557 274 26 -294 -511 -682 -827
1966 -827 -861 -734 -608 -362 -75 162 452 621 719 823 786 589 436 212 -102 -351 -602 -738 -829 -815 -668 -535
1988 -535 -227 50 272 517 707 825 833 676 548 296 52 -206 -411 -720 -754 -828 -723 -509 -449 -127 149 410
2010 410 552 732 789 777 646 487 214 -32 -306 -544 -660 -773 -817 -733 -568 -293 -89 199 462 712 779 796
2032 796 791 580 436 160 -77 -353 -543 -737 -836 -783 -733 -538 -304 -82 194 466 679 802 801 747 631 466 186
2055 186 -39 -302 -566 -679 -725 -802 -745 -592 -374 -209 142 421 598 741 815 825 656 460 251 59 -238 -445
2077 -445 -644 -755 -809 -771 -572 -380 -194 90 361 575 698 781 811 701 528 320 12 -188 -405 -645 -773
2098 -773 -843 -771 -664 -464 -197 46 375 584 741 827 833 680 521 289 27 -277 -511 -720 -872 -862 -798 -598
2120 -598 -444 -141 190 418 665 852 933 866 756 577 221 -79 -372 -689 -876 -1075 -994 -904 -688 -437 -29
2141 -29 321 619 893 1057 1085 966 804 506 141 -224 -561 -855 -1060 -1194 -1117 -908 -687 -269 153 496 853
2162 853 1087 1214 1199 1059 821 510 40 -421 -777 -1120 -1291 -1297 -1199 -966 -659 -136 288 651 1005 1229 1376
2183 1376 1308 1076 694 382 -132 -546 -1010 -1171 -1369 -1352 -1127 -878 -431 10 502 908 1167 1418 1400 1272 978
2204 978 599 152 -379 -730 -1103 -1259 -1386 -1265 -999 -658 -234 246 670 1070 1261 1401 1321 1037 709 285
2224 285 -145 -610 -948 -1269 -1329 -1286 -1096 -758 -376 114 541 917 1239 1319 1312 1161 899 447 57 -370 -873 -1106
2246 -1106 -1357 -1357 -1274 -965 -535 -126 402 766 1106 1298 1329 1192 1028 669 215 -242 -663 -1056 -1275 -1341 -1324 -1153
2268 -1153 -755 -362 67 497 916 1176 1320 1327 1170 879 443 60 -376 -767 -1129 -1252 -1285 -1193 -949 -575 -200
2289 -200 245 691 951 1193 1213 1240 1015 656 345 -137 -520 -898 -1083 -1178 -1179 -1031 -827 -379 3 389 686 919
2311 919 1064 1063 1014 850 467 139 -302 -563 -824 -976 -1117 -963 -797 -505 -250 158 440 763 917 1081 1021
2332 1021 850 584 318 -87 -396 -660 -837 -971 -983 -849 -667 -405 -134 273 577 782 838 956 873 696 452
2353 452 139 -136 -480 -716 -858 -930 -886 -723 -495 -256 80 320 606 749 935 912 787 622 343 74 -214
2374 -214 -507 -678 -900 -932 -868 -724 -488 -215 134 396 684 770 948 918 770 563 258 -2 -266 -553 -723
2395 -723 -869 -849 -824 -617 -451 -135 187 455 658 862 864 874 719 545 228 -20 -262 -565 -739 -786 -851 -767 -587
2418 -587 -340 -84 162 433 658 772 800 690 624 421 157 -103 -353 -658 -731 -817 -791 -690 -488 -184 70 310
2440 310 511 709 724 714 666 536 280 88 -175 -430 -645 -693 -731 -692 -521 -328 -54 196 388 586 704 757
2462 757 702 577 390 183 -137 -332 -554 -687 -668 -716 -634 -444 -219 -8 224 477 680 761 779 622 515 268
2484 268 44 -135 -473 -599 -730 -769 -661 -535 -322 -117 143 377 591 681 703 697 602 413 200 -72 -267 -537
2506 -537 -618 -690 -704 -637 -469 -270 -16 244 420 559 661 704 674 476 297 85 -93 -353 -506 -615 -700 -614 -532
2529 -532 -362 -126 45 320 467 606 610 676 512 410 157 14 -97 -354 -489 -581 -586 -544 -373 -289 -83 130 302
2552 302 408 548 503 492 391 237 67 -116 -303 -428 -450 -497 -477 -376 -267 -88 85 235 392 468 469 516 389
2575 389 247 139 -25 -172 -309 -409 -407 -465 -413 -265 -109 -21 132 329 336 378 417 322 254 162 -2 -139 -250 -335
2599 -335 -322 -372 -370 -316 -155 -44 81 173 284 323 315 346 255 188 120 23 -135 -180 -256 -222 -310 -274 -149 -94 -81 70 162
2626 162 209 287 296 252 201 133 14 -31 -137 -158 -195 -226 -199 -144 -143 -117 -58 28 112 146 149 112 106 47 74 -9 32 -5 11 -31 -100
2657 -100 -86 -63 -95 -12 -36 35 -17 -14 70 34 55 51 68 72 56 39 62 -35 11 27 -81 -30 -60 -70 -90 -61 -51 -57 -51 -55 19 54
2689 54 41 120 78 14 66 57 60 -20 -31 22 -107 -114 -63 -61 -42 -27 -4 49 78 104 132 60 74 96 2 -6 -31 -78 -55 -153 -84 -161
2721 -161 -119 -86 -14 -35 34 95 121 113 151 194 98 42 -18 -63 -106 -188 -134 -162 -155 -94 -84 7 57 100 226 183 210 198 161 88
2751 88 42 0 -106 -193 -230 -292 -231 -296 -171 -112 -24 53 149 215 252 286 268 278 176 60 -24 -158 -159 -292 -248 -259 -308 -222
2779 -222 -140 -85 71 170 262 378 377 377 321 200 88 3 -104 -206 -331 -362 -462 -327 -296 -199 -68 55 154 313 374
2804 374 375 345 313 182 122 -28 -234 -270 -357 -398 -386 -404 -214 -106 -26 178 255 316 493 456 410 285 208 102 -103
2829 -103 -215 -321 -443 -492 -437 -352 -257 -134 93 205 362 457 521 488 381 272 99 -23 -251 -339 -481 -501 -495 -424
2853 -424 -338 -184 -14 155 380 455 528 539 474 427 208 93 -118 -311 -460 -542 -626 -606 -469 -318 -115 95 218
2876 218 472 549 644 616 509 319 203 -30 -240 -419 -594 -602 -694 -592 -466 -258 -106 168 378 523 698 707 642
2899 642 553 332 82 -85 -289 -446 -600 -620 -638 -567 -459 -219 -17 207 443 619 648 668 596 420 332 21 -135
2922 -135 -378 -562 -665 -713 -653 -503 -460 -175 60 357 482 576 706 644 608 427 215 -99 -285 -441 -583 -670
2944 -670 -679 -641 -472 -233 30 193 398 566 682 696 617 472 308 117 -130 -361 -592 -675 -703 -689 -526 -377 -202
2967 -202 66 279 516 647 785 704 601 444 271 10 -275 -467 -622 -667 -724 -608 -516 -305 -71 197 463
2988 463 589 728 691 727 593 360 161 -116 -319 -570 -660 -719 -720 -634 -474 -207 -10 209 470 597 664 708 631
3011 631 496 357 58 -215 -357 -571 -672 -776 -655 -600 -379 -148 49 256 577 707 694 701 664 360 222 18
3033 18 -191 -412 -548 -648 -626 -619 -477 -316 -94 131 346 506 620 670 660 560 406 146 -71 -258 -454 -594
3055 -594 -608 -645 -576 -372 -240 -77 213 383 555 617 634 564 537 259 70 -123 -369 -484 -580 -695 -638 -518 -384
3078 -384 -141 113 303 446 587 647 655 521 394 215 -37 -255 -477 -555 -692 -676 -603 -462 -308 -81 122 342
3100 342 472 643 675 633 542 348 96 -74 -281 -486 -570 -660 -659 -566 -443 -229 -33 204 379 573 681 634 602
3123 602 492 320 137 -132 -332 -499 -579 -678 -653 -550 -362 -144 -12 214 428 558 570 610 492 329 258 67
3145 67 -132 -341 -503 -562 -611 -602 -435 -319 -119 118 286 447 538 577 572 501 272 196 11 -222 -392 -535 -544 -594 -542
3170 -542 -391 -221 -100 114 307 424 525 587 480 464 311 124 -59 -281 -417 -491 -525 -530 -451 -345 -174 21
3192 21 144 368 534 556 546 510 394 215 68 -117 -323 -419 -504 -505 -487 -416 -238 -110 85 201 385 470 520 504
3216 504 443 366 191 38 -219 -358 -472 -529 -527 -519 -396 -217 -104 134 331 419 517 575 531 510 306 108 14 -157
3240 -157 -374 -471 -527 -518 -504 -351 -254 -53 164 268 439 481 571 530 400 279 116 -61 -230 -401 -461 -537 -563 -481
3264 -481 -334 -223 -45 123 318 414 507 574 551 369 272 101 -56 -239 -413 -494 -526 -507 -466 -287 -178 25 236
3287 236 366 454 531 562 462 377 214 23 -146 -358 -467 -558 -596 -501 -422 -322 -81 72 296 446 537 583 558 404
3311 404 285 196 -17 -219 -434 -499 -553 -530 -470 -314 -129 11 139 406 496 520 611 518 389 240 8 -194 -377
3334 -377 -491 -588 -617 -567 -438 -321 -108 124 291 487 567 571 567 484 369 89 -71 -252 -453 -514 -612 -629 -543 -393
3358 -393 -167 30 204 411 475 542 635 538 362 288 38 -194 -376 -489 -531 -586 -510 -457 -278 -138 166 341 453
3381 453 568 576 533 370 279 90 -97 -309 -430 -521 -609 -564 -495 -325 -57 108 245 381 545 570 561 453 329 184
3405 184 -51 -216 -393 -550 -540 -553 -469 -359 -161 34 193 425 512 509 545 473 320 181 -46 -199 -383 -511 -583
3428 -583 -537 -458 -367 -157 -36 225 303 448 620 559 531 358 190 78 -142 -326 -441 -523 -535 -518 -382 -212 -68
3451 -68 155 338 451 548 539 477 405 166 70 -139 -285 -348 -513 -538 -481 -393 -255 -89 107 250 412 508 504 484 408
3476 408 262 88 -50 -236 -318 -475 -551 -445 -405 -259 -122 30 248 386 391 453 441 335 298 109 -50 -254 -322
3499 -322 -434 -483 -437 -432 -305 -191 23 158 279 407 413 444 391 261 70 -67 -182 -307 -406 -459 -376 -355 -321 -111
3523 -111 -25 181 312 337 419 404 371 275 153 -12 -126 -289 -291 -404 -379 -336 -338 -185 -73 93 240 315 369 391 345
3548 345 317 140 66 -124 -210 -329 -409 -400 -348 -309 -172 -48 107 189 294 412 395 370 327 136 62 -12 -196 -289 -345
3573 -345 -373 -340 -298 -186 -124 -8 190 261 290 354 312 237 205 89 3 -147 -233 -346 -353 -362 -316 -208 -60 10 135 289
3599 289 289 359 399 253 202 78 -73 -106 -305 -236 -373 -349 -310 -192 -133 10 138 257 274 325 282 336 247 107 -6
3624 -6 -61 -266 -299 -383 -369 -278 -237 -113 -47 121 188 286 286 372 322 171 153 -19 -75 -201 -339 -316 -321 -286 -236 -190 -51 58
3652 58 237 331 284 353 318 227 149 78 -55 -200 -254 -317 -332 -371 -267 -178 -57 12 168 212 283 292 285 250 169 28 -86
3679 -86 -177 -194 -283 -314 -270 -313 -180 -61 53 197 222 329 309 304 276 140 87 -108 -158 -287 -295 -299 -268 -220 -97 -65 58
3706 58 196 223 285 298 300 228 70 46 -86 -156 -218 -280 -397 -309 -176 -145 -24 21 170 291 279 320 332 191 187 75
3732 75 -45 -127 -219 -266 -332 -316 -274 -167 -28 35 142 242 273 297 282 275 154 29 -64 -167 -204 -310 -286 -269 -264 -177 -132
3759 -132 63 127 230 256 247 272 226 163 42 -95 -171 -151 -236 -284 -276 -218 -123 -7 62 108 223 223 240 243 214 171 62 -37
3787 -37 -97 -152 -277 -246 -207 -243 -134 -69 29 173 207 252 201 211 183 134 54 -71 -109 -236 -230 -257 -262 -186 -119 -16 71 208
3815 208 236 245 298 273 204 107 59 27 -87 -283 -261 -258 -196 -151 -124 -73 41 129 191 247 168 218 212 86 -13 28 -127 -151 -205
3844 -205 -239 -221 -226 -111 -66 -12 49 200 198 197 211 157 112 82 -22 -117 -112 -172 -255 -134 -197 -134 -61 0 88 113 162 259 164 144
3874 144 119 21 -2 -100 -100 -233 -205 -181 -163 -96 -95 23 65 105 137 159 205 141 105 25 48 -41 -109 -145 -165 -192 -141 -107 -37 -46
3904 -46 109 77 150 170 150 78 102 37 -19 26 -66 -121 -140 -80 -111 -111 -65 -23 -29 59 31 121 96 114 165 78 18 -40 -69 -102 -105
3935 -105 -59 -108 -85 -88 -22 -56 41 23 83 148 113 122 112 68 34 77 35 -19 -40 -88 -127 -30 -31 -64 28 -63 -10 8 81 82 7 58
3967 58 66 59 44 -1 -14 -20 -73 15 -110 -127 -78 -87 -21 13 17 26 71 54 112 127 -20 63 71 10 -35 -96 -62 -60 -137 -64 -86 -117 14
4000 14 10 6 22 63 95 97 79 77 51 -15 -25 -79 -137 -187 -134 -138 -87 -99 -60 48 94 145 158 163 143 133 51 51 11 -83 -122 -125 -197 -147
4034 -147 -150 -65 -77 88 58 151 107 207 200 111 99 -9 -20 -118 -186 -229 -225 -239 -198 -183 -115 -1 14 124 157 221 270 215 200
4063 200 108 54 -50 -97 -166 -236 -283 -253 -208 -166 -98 49 90 189 280 245 288 253 201 112 12 -74 -173 -277 -311 -309 -312 -265 -146
4092 -146 -25 44 80 261 269 277 281 216 185 114 -19 -89 -172 -315 -307 -304 -306 -185 -95 1 166 218 309 302 315 315 217 89 27 -84
4122 -84 -233 -299 -343 -387 -357 -281 -163 -62 82 133 278 351 389 323 313 153 18 -51 -178 -289 -365 -445 -396 -285 -184
4147 -184 -67 51 175 283 387 426 417 304 260 190 18 -130 -306 -346 -350 -402 -389 -246 -210 -42 150 219 268 391
4171 391 403 347 333 179 41 -71 -199 -346 -363 -428 -425 -366 -258 -51 68 175 324 434 466 428 362 245 151 -24
4195 -24 -201 -300 -391 -448 -435 -425 -317 -223 -24 158 275 392 446 445 419 327 128 80 -106 -286 -427 -470 -522 -454 -390 -240
4221 -240 -47 88 205 332 484 512 521 454 299 92 -99 -149 -321 -474 -535 -492 -475 -338 -114 12 123 391 496
4244 496 462 508 487 294 211 -25 -166 -359 -494 -566 -505 -522 -394 -206 -37 157 270 407 534 519 482 356 263
4267 263 67 -171 -295 -429 -548 -592 -522 -421 -316 -129 128 278 435 571 604 598 446 228 86 12 -237 -424
4289 -424 -518 -593 -587 -522 -395 -193 35 160 396 485 577 547 517 406 154 -35 -135 -367 -426 -544 -545 -506 -394 -228
4313 -228 -57 155 357 556 546 584 477 412 267 52 -123 -304 -458 -579 -569 -489 -421 -286 -92 108 244 432
4335 432 492 575 532 444 314 118 -115 -261 -395 -531 -573 -549 -506 -265 -140 52 233 381 520 567 546 463 303
4358 303 198 6 -205 -337 -489 -528 -539 -442 -339 -196 -87 203 403 428 527 507 469 292 184 44 -188 -339
4380 -339 -440 -497 -537 -494 -321 -252 -60 81 288 395 495 541 486 372 219 113 -69 -243 -347 -464 -528 -415
4402 -415 -397 -257 -140 75 255 279 345 450 509 398 276 175 7 -203 -342 -371 -391 -429 -367 -333 -179 -8 139
4425 139 260 340 398 431 354 331 188 9 -92 -248 -300 -370 -356 -326 -270 -162 -18 96 208 254 409 414 412 311 214
4450 214 51 -80 -182 -278 -348 -388 -313 -269 -200 -61 37 156 274 382 316 361 299 216 109 -26 -138 -272 -308 -335
4474 -335 -322 -270 -226 -109 -2 166 179 259 348 287 286 211 152 16 -50 -166 -292 -275 -286 -235 -236 -111 15 41 161 205
4500 205 166 245 213 213 114 35 -22 -176 -169 -181 -219 -206 -173 -130 -123 70 126 78 260 220 212 179 114 87 -67 -43 -138 -213 -179 -232
4530 -232 -138 -113 -104 47 31 132 117 115 81 128 137 22 23 -67 -117 -137 -207 -141 -153 -135 -82 11 33 76 93 123 127 175 141 21
4560 21 52 -27 -51 7 -157 -147 -120 -53 -100 -57 0 -8 47 73 52 39 91 12 43 62 -44 -2 -48 -105 -122 -45 -96 -64 -43 2
4590 2 69 48 80 -6 44 15 52 44 -7 -9 6 -21 -54 -42 30 1 -8 18 -38 -20 4 30 -13 8 9 -22 -4 -40 6 -11 40 -24 5
4623 5 -2 -14 27 -53 -8 -6 -46 -149 -15 -20 -48 -37 42 49 10 40 31 36 44 -47 -38 17 -15 -44 -87 -24 -42 -81 -35 -43 -11 -13 75 53 88
4658 88 92 104 49 15 -11 -13 -24 -79 -80 -156 -96 -58 -22 -47 -9 78 121 136 49 92 67 83 -41 -35 -43 -89 -148 -121 -49 -59 -41 43
4690 43 92 81 55 95 111 131 120 98 20 -18 -97 -145 -155 -240 -152 -138 -92 -70 -39 -39 125 110 182 107 182 100 51 -3 -57 -113
4720 -113 -184 -148 -213 -224 -161 -48 -19 44 131 171 121 217 163 124 102 21 -52 -113 -97 -138 -224 -200 -213 -142 -109 44 35 176 144
4749 144 139 250 141 148 120 14 -63 -105 -223 -224 -211 -249 -136 -60 -22 105 127 131 208 247 200 186 135 58 -47 -109 -134 -194
4777 -194 -233 -169 -214 -126 3 77 167 198 253 213 219 181 129 28 1 -144 -229 -226 -203 -212 -203 -133 -68 -8 76 133 234 254 213 222
4807 222 171 106 -10 -65 -141 -202 -237 -261 -175 -141 -106 -22 35 134 163 246 237 204 150 96 45 34 -134 -146 -217 -272 -268 -185 -128 -64
4837 -64 -22 69 153 192 222 188 196 130 43 16 -105 -165 -183 -228 -223 -188 -158 -77 5 107 129 227 204 208 203 140 99 26 -22 -73 -199
4868 -199 -186 -249 -244 -197 -115 -19 44 42 119 187 130 185 83 114 32 -54 -14 -90 -182 -149 -147 -157 -72 -22 7 62 99 177 189 184 100
4899 100 130 81 61 -27 -22 -88 -118 -138 -148 -112 -56 -66 10 84 113 93 123 48 58 38 9 12 -78 -89 -75 -102 -97 -92 -74 -54 -6 53
4931 53 92 61 67 122 23 19 60 8 -37 -6 -73 -73 -56 -35 -25 -34 -29 -5 8 18 53 26 -16 72 32 -21 50 47 12 -37 -45 33 -80
4964 -80 -72 -35 -66 -65 24 -45 -50 12 29 74 -21 20 70 47 85 6 70 55 51 -20 -81 -135 3 -31 -79 -73 -129 -42 10 47 66 93
4996 93 73 147 65 107 -1 32 -43 -86 -94 -158 -103 -183 -116 -92 -74 25 23 161 101 134 154 133 131 59 -23 -50 -78 -148 -121 -156 -128
5027 -128 -106 -37 35 47 97 183 178 175 178 153 117 -4 -4 -103 -213 -208 -253 -250 -141 -90 -27 -47 134 188 244 223 218 225 216 70 11 -109
5059 -109 -158 -213 -248 -233 -202 -190 -150 -40 48 162 184 236 282 247 175 86 6 -61 -193 -302 -321 -299 -302 -221 -163 -77 32 143
5087 143 221 280 295 260 224 173 109 -83 -110 -259 -299 -262 -271 -263 -219 -71 34 146 187 302 318 333 318 257 165 1 -48
5114 -48 -157 -287 -311 -321 -311 -282 -180 -74 42 165 253 294 338 311 320 149 109 -24 -198 -214 -296 -379 -367 -337 -224 -154
5140 -154 -4 75 141 343 326 366 282 284 193 19 -82 -174 -268 -311 -348 -341 -298 -192 -114 13 195 270 318 356 383 333 177
5167 177 88 -20 -174 -236 -361 -362 -306 -306 -227 -146 -36 104 232 327 362 372 376 298 195 54 -62 -189 -298 -348 -367 -327
5193 -327 -316 -162 -63 0 130 287 332 389 448 280 246 157 30 -178 -238 -333 -412 -409 -361 -267 -136 -7 55 262 304 349
5219 349 354 365 283 236 82 -63 -159 -297 -304 -363 -363 -339 -257 -111 38 154 310 309 380 354 348 191 153 8 -177 -236 -333
5246 -333 -399 -384 -343 -276 -149 -116 125 146 284 298 420 321 307 220 122 3 -182 -244 -385 -357 -344 -268 -231 -52 44 171
5272 171 278 256 329 360 288 246 116 -1 -76 -238 -330 -346 -292 -338 -208 -93 -39 72 192 278 278 370 290 261 150 99
5298 99 -21 -161 -297 -261 -344 -341 -289 -203 -63 30 116 232 275 385 335 264 189 114 49 -95 -161 -204 -247 -305 -268 -255 -107
5325 -107 -37 15 130 184 273 278 232 218 176 21 -91 -143 -207 -238 -296 -276 -283 -115 -21 -4 135 216 228 230 196 166 117 134 25
5354 25 -45 -98 -148 -237 -177 -195 -191 -149 -31 81 105 133 156 209 181 160 118 25 -43 -28 -142 -163 -110 -230 -166 -88 -87 -43 30
5383 30 59 148 133 166 149 125 55 55 1 -72 -108 -136 -131 -109 -145 -74 -43 4 67 91 97 171 165 132 63 98 46 -3 21 -94 -68 -160
5415 -160 -110 -91 -122 -61 -41 38 -15 54 99 116 102 127 98 86 13 4 32 -69 -111 -81 -128 -78 -82 -88 11 44 50 40 110 132 113
5446 113 76 50 53 70 -30 -50 -101 -149 -160 -141 -166 -98 -95 -5 -5 64 163 117 127 182 136 40 4 16 -109 -98 -166 -150 -146 -167 -134
5477 -134 -81 -14 67 130 117 175 210 208 151 86 27 -43 -102 -163 -182 -213 -171 -169 -127 -54 23 -3 112 179 190 179 173 125 38 9 -60
5508 -60 -117 -170 -194 -226 -213 -89 -48 15 82 151 208 239 230 168 195 149 39 -45 -100 -179 -236 -253 -230 -158 -142 -29 40 107 150
5537 150 233 247 198 203 90 44 -61 -120 -176 -170 -264 -300 -201 -175 -84 -31 104 152 242 278 286 259 193 65 -14 -68 -141 -187 -154
5566 -154 -201 -225 -195 -120 -45 54 98 175 249 262 225 135 101 38 -62 -137 -161 -222 -242 -251 -227 -154 -119 -25 95 147 232 209 291
5595 291 216 192 117 27 -69 -112 -250 -229 -182 -202 -116 -73 7 89 199 217 220 280 213 142 69 13 -54 -116 -184 -196 -247 -206 -200 -108
5625 -108 -49 11 119 136 208 241 178 162 83 34 -125 -95 -211 -159 -167 -196 -169 -51 -8 13 110 177 225 184 170 197 69 83
5653 83 16 -92 -69 -152 -230 -191 -230 -134 -90 22 109 103 145 194 193 159 140 34 9 -40 -151 -206 -190 -231 -148 -133 -60 -27 54
5682 54 79 128 171 194 176 64 67 77 -27 -75 -70 -171 -80 -141 -130 -89 -54 20 105 80 142 96 148 102 112 56 -10 -82 -134 -130
5712 -130 -150 -142 -149 -99 -47 24 58 94 109 191 182 216 55 46 -7 -23 -129 -101 -145 -176 -121 -95 -75 -35 49 75 117 135 90 151 122
5743 122 96 46 -56 -71 -104 -65 -111 -172 -120 -93 22 39 44 74 125 122 164 98 119 44 4 -55 -52 -168 -122 -107 -75 -62 37 5
5773 5 50 83 113 152 90 59 29 38 -57 -33 -145 -125 -80 -120 -119 -63 -111 2 44 97 112 151 85 49 110 30 11 -23 -54 -121 -112
5804 -112 -106 -39 -40 67 8 52 69 82 70 87 65 28 38 19 -19 -64 -67 -89 -93 -78 -34 -7 4 80 46 122 120 4 38 53 -10
5835 -10 -98 -124 -82 -106 -76 -72 -87 -16 -36 76 38 100 82 141 62 47 10 -10 -17 -87 -64 -89 -114 -103 -79 -7 3 1 94 86 26 124
5867 124 100 46 -5 -20 -50 -110 -124 -100 -135 -111 -92 -22 49 35 61 85 122 103 89 81 50 23 6 -70 -63 -84 -61 -79 -79 -65 -2
5898 -2 18 86 115 90 68 107 43 -4 19 -68 -114 -97 -80 -97 6 -67 -62 -14 26 104 85 63 67 112 58 -41 23 -71 -69 -146 -87 -136
5930 -136 -123 -65 5 63 55 91 155 181 152 149 104 70 -20 -8 -143 -128 -132 -133 -108 -123 3 -32 11 107 126 143 98 115 70 54 -13
5961 -13 -71 -126 -118 -236 -204 -144 -98 -8 2 73 76 138 182 173 215 117 64 -14 -85 -123 -146 -136 -173 -135 -122 -74 -22 47 58 124 169
5992 169 133 103 107 16 -24 -53 -98 -173 -233 -193 -130 -179 -32 -69 -19 131 110 186 230 175 192 54 19 1 -63 -106 -182 -208 -179
6021 -179 -167 -98 -57 25 138 168 164 175 231 164 188 72 -110 -95 -166 -197 -202 -198 -171 -142 -111 -31 36 140 177 226 189 177 151
6050 151 92 25 -38 -108 -199 -225 -176 -117 -135 -135 -67 61 106 165 169 240 195 199 129 69 -79 -80 -154 -142 -227 -259 -208 -156 -24 -37
6080 -37 18 105 204 157 211 137 162 30 -45 -14 -149 -170 -174 -216 -237 -167 -116 -21 10 150 142 238 233 243 202 183 24 -56 -31 -177
6110 -177 -200 -183 -175 -151 -119 -93 26 62 69 220 202 228 236 119 76 38 -41 -179 -199 -220 -197 -229 -159 -70 -28 -21 130 179 192
6139 192 234 178 185 124 87 -58 -121 -136 -208 -214 -203 -188 -136 -84 3 54 120 154 196 145 145 135 37 37 -82 -151 -186 -228 -219 -178 -177 -97
6171 -97 13 57 91 125 174 192 164 149 74 47 3 -87 -107 -157 -160 -190 -168 -131 -51 -6 37 117 166 107 153 149 96 84 24 -66 -115
6202 -115 -167 -149 -186 -202 -168 -103 -49 27 105 163 123 152 179 205 69 43 -17 -38 -125 -141 -139 -156 -134 -100 -24 2 60 125 90 162
6232 162 205 136 142 93 32 -101 -103 -171 -204 -155 -137 -164 -78 -103 -28 71 73 115 164 121 125 128 22 -10 -31 -109 -128 -111 -161 -107 -97
6263 -97 -68 -78 -12 75 136 173 232 129 151 136 100 31 -32 -133 -45 -181 -139 -171 -111 -86 -66 48 45 168 112 199 151 150 127
6292 127 -4 -40 -110 -125 -111 -171 -170 -111 -23 26 31 66 110 155 124 138 134 66 62 -10 -35 -58 -135 -167 -138 -160 -101 -95 -42 11 77 142
6324 142 122 165 176 154 118 16 -4 -73 -168 -138 -130 -142 -104 -71 -77 9 44 57 116 119 139 151 139 75 18 13 -40 -77 -104 -130 -125 -132
6356 -132 -27 -74 -17 91 93 121 141 156 70 53 4 -23 -88 -94 -120 -178 -167 -101 -133 -74 -27 4 78 132 181 118 130 130 67 2
6386 2 -4 -65 -72 -104 -131 -120 -150 -65 -89 45 74 50 101 85 124 160 104 39 38 -63 -90 -86 -113 -89 -136 -128 -97 -10 -35 34 133 170
6418 170 182 80 143 37 70 -46 -9 -45 -127 -149 -109 -84 -71 -22 45 50 133 65 156 148 90 110 47 27 -67 -46 -79 -86 -131 -131
6448 -131 -64 -83 -5 0 116 54 86 127 155 116 121 93 16 -67 -89 -109 -109 -123 -99 -87 -79 -9 54 118 151 125 165 156 125 132 -23 80
6480 80 -11 -94 -107 -97 -106 -94 -31 -59 32 95 79 162 102 118 161 92 -12 -10 -55 -56 -156 -167 -178 -112 -121 -94 26 -8 115 137
6510 137 165 163 170 120 52 -28 -59 -85 -152 -149 -134 -139 -109 -55 -4 53 56 123 109 116 116 125 90 -14 -31 -89 -91 -93 -158 -190 -87 -111 -55 -51
6544 -51 27 115 120 136 136 143 72 113 -6 -53 -71 -105 -100 -102 -146 -95 -78 6 107 163 111 126 248 98 130 71 7 4 -78 -116 -187
6575 -187 -195 -161 -154 -143 -48 32 67 198 118 184 146 94 97 45 40 -74 -87 -91 -172 -204 -169 -150 -96 -24 64 122 107 175 176 149 108 73
6607 73 22 -3 -113 -114 -177 -194 -137 -144 -100 -25 8 22 158 89 127 130 132 115 84 5 -66 -137 -160 -168 -196 -132 -104 -84 53 44 129 164
6639 164 237 221 170 142 96 10 -52 -88 -104 -168 -176 -164 -121 -85 8 22 85 132 206 202 167 151 91 47 -48 -17 -122 -171 -161 -129
6669 -129 -139 -136 -25 -5 104 179 191 209 136 181 184 104 -11 -28 -72 -150 -93 -200 -166 -151 -83 -13 82 81 156 152 197 147 99 78
6699 78 47 -13 -82 -159 -176 -195 -149 -126 -83 -39 -1 55 96 171 124 143 118 128 91 38 -7 -106 -135 -95 -92 -136 -105 -34 -4 85 133
6730 133 161 141 144 157 175 41 -1 22 -84 -147 -99 -133 -162 -125 -90 -64 24 43 89 120 160 145 124 100 31 10 -29 -113 -137
6759 -137 -139 -138 -74 -95 -84 5 24 88 115 182 129 140 134 112 -9 -55 -73 -134 -132 -113 -117 -108 -138 -34 31 17 55 73 133 147 115 -3
6791 -3 37 -19 -77 -57 -89 -131 -114 -93 -141 2 4 -35 41 129 113 113 140 80 131 36 9 -71 -114 -78 -64 -97 -137 -13 -36 -38 18
6822 18 141 117 139 73 162 97 22 2 -16 -62 -124 -102 -102 -129 -69 -45 -7 35 20 118 82 124 14 83 83 56 7 -22 -50 -85
6852 -85 -119 -68 -74 -27 34 64 47 47 108 42 92 47 64 50 72 7 -54 -117 -93 -79 -101 -52 -39 27 77 42 56 103 124 91 66
6883 66 108 20 -23 -70 -39 -27 -10 -38 -43 -15 34 7 60 35 79 59 67 57 23 50 -20 -3 -80 -39 -17 -100 -39 -59 56 -46
6913 -46 -6 8 30 6 72 33 -15 -11 -31 -68 -2 -41 -61 -9 6 8 -27 56 -11 79 63 39 36 5 34 -45 -62 -24 -63 7 -7 -86
6945 -86 9 -19 34 26 -18 -16 18 36 -28 -46 -5 -37 -64 -45 -24 -33 3 25 23 12 5 19 57 37 54 76 24 39 -42 -55 -64 -22 -22 4
6979 4 -23 57 71 61 11 18 0 14 43 -47 -86 -38 15 -69 -84 -64 6 -28 18 18 54 30 78 54 69 81 -6 -7 12 -44 -99 -17
7011 -17 -63 -30 -22 -8 12 26 35 77 93 56 100 84 113 40 -29 -21 -74 -42 -22 -86 -82 -69 -34 -38 70 35 60 29 110 109 29 47 37
7044 37 -2 -66 -108 -72 -113 -62 -32 -19 5 60 54 94 78 99 112 95 73 -4 5 -129 -93 -103 -118 -85 -80 -18 -37 5 20 101 141
7075 141 108 68 83 47 16 8 -86 -66 -119 -155 -86 -47 -15 -34 -34 57 80 38 117 136 135 118 23 28 -4 -44 -34 -120 -48 -137 -140 -121
7107 -121 -64 -22 60 42 90 120 143 98 90 77 1 -79 -57 -96 -71 -103 -65 -37 -82 3 6 44 86 129 164 129 137 60 68 -39 -18
7138 -18 -81 -80 -127 -78 -38 -51 -35 6 17 25 89 123 73 116 107 33 105 -10 -64 -81 -116 -160 -142 -124 -26 -49 -22 17 108 133 97
7169 97 57 136 88 109 10 -9 -70 -120 -63 -181 -81 -103 -123 -15 32 34 96 163 161 153 154 89 50 16 9 -82 -152 -161 -176 -115 -118 -7
7201 -7 -64 9 52 97 92 151 158 149 74 42 22 8 -33 -119 -123 -129 -108 -103 -22 36 77 102 128 120 174 126 106 99 74 -44 -127 -109 -150 -144 -180
7236 -180 -123 -94 -76 -5 65 119 136 174 155 87 165 165 8 -37 -87 -77 -130 -158 -172 -74 -13 -4 39 46 92 125 165 198 105 133 104
7267 104 45 -109 -71 -132 -155 -153 -152 -114 -97 36 37 114 151 136 107 176 126 15 31 -14 -92 -134 -141 -147 -145 -140 -75 -19 -16 112 92 155
7299 155 183 211 132 88 31 19 -25 -23 -114 -131 -125 -165 -95 -47 -10 55 99 144 126 170 169 82 81 24 -13 -117 -89 -163 -172 -162 -165 -104
7331 -104 -18 -7 44 75 118 147 262 157 72 104 30 26 -57 -23 -194 -119 -145 -115 -78 -25 -32 79 85 106 186 117 141 110 68
7360 68 -7 -90 -155 -92 -90 -112 -66 -85 -62 20 -27 2 56 110 81 112 118 114 47 -57 -74 -75 -115 -62 -85 -75 -64 -69 30 81 137 97
7392 97 92 101 105 133 63 8 11 -29 -113 -129 -158 -150 -120 -56 -12 -5 22 85 110 98 84 41 59 77 34 8 -71 -64 -138 -56 -135 -75 -44 -47
7426 -47 60 76 90 120 145 99 104 122 116 31 -39 -57 -111 -56 -86 -132 -92 -28 -63 -42 59 81 140 113 100 134 86 38 -54 -13
7456 -13 -53 -64 -138 -110 -46 -111 -66 -12 25 105 76 114 122 148 105 97 32 -20 -53 -55 -106 -118 -107 -84 -94 -55 -22 29 76 65 103 124
7488 124 62 30 32 6 -34 3 -160 -127 -184 -156 -106 -109 -31 27 45 71 177 105 130 167 116 47 -1 -8 -102 -68 -129 -164 -137 -120
7518 -120 -6 -14 6 82 117 148 123 116 80 60 20 -31 -77 -153 -148 -170 -176 -177 -59 -79 -32 99 97 139 108 155 128 126 81 -20 -20 -83
7550 -83 -124 -94 -153 -110 -89 -90 -69 -9 102 149 165 127 137 153 58 3 -38 -40 -145 -144 -131 -146 -177 -147 -94 25 -18 65 126 155
7580 155 134 109 109 125 -3 -80 -61 -109 -156 -168 -96 -117 -82 54 29 76 120 126 147 117 148 105 48 -20 -30 -98 -158 -146 -175 -154
7610 -154 -104 -51 -23 36 108 142 132 157 146 119 73 38 2 -77 -139 -126 -138 -158 -105 -61 -32 57 109 181 153 165 165 180 58 33
7640 33 48 -116 -39 -151 -182 -168 -167 -118 -93 67 30 148 164 165 99 81 73 15 -37 -19 -91 -91 -118 -146 -95 -121 -72 -24 98 71
7670 71 97 208 111 140 105 55 37 -44 -65 -106 -56 -135 -161 -136 -62 -3 43 49 37 128 167 129 98 102 42 33 -74 -127 -66 -190
7700 -190 -129 -86 -67 -32 2 12 78 134 96 137 145 69 64 15 -7 -19 -184 -118 -141 -78 -115 -63 -32 -30 100 86 113 126 129 86 103
7731 103 1 -16 -76 -94 -157 -100 -123 -153 -68 -25 8 6 98 125 106 67 99 36 50 38 45 -29 -162 -43 -102 -77 -41 -63 42
7760 42 -19 88 98 135 173 105 111 65 94 -24 4 -65 -52 -72 -91 -152 -65 -25 -7 52 67 71 49 120 48 82 12 5 -34 -90 -18
7791 -18 -93 -59 -59 -63 32 -46 62 89 44 134 123 85 66 55 -6 33 -31 -37 -54 -111 -40 -69 -72 -27 -14 47 64 26 41 42 29 55
7823 55 1 21 -64 -61 -70 -77 2 -36 -80 -23 54 15 -11 49 119 63 88 82 53 -56 4 -28 -65 -99 -56 -76 -44 -35 74 64 7 68
7855 68 19 54 61 48 22 -52 -11 -42 -71 -23 -13 -101 19 -33 10 20 34 19 23 82 53 33 1 -51 -7 -21 -4 -95 -17 -22 -72
7886 -72 49 57 30 49 89 65 22 10 26 16 -11 -36 -48 -49 -49 -68 -4 -6 -34 -54 15 2 38 60 76 35 -60 -15 -37 -74 -4 -8
7918 -8 -36 -19 11 -9 49 54 1 42 72 14 16 8 24 4 -18 -46 2 -14 -40 68 38 8 27 23 10 32 47 3 33 47 3 -43
7950 -43 -115 -35 -27 -65 -16 -18 16 57 13 58 135 57 80 57 23 12 4 -66 -34 -41 -122 -40 -4 -25 45 19 85 51 72 59 84 43
7982 43 -17 23 -57 -69 -56 -24 -101 -107 -107 -44 -3 26 47 62 69 37 32 56 71 -10 0 -44 -86 -75 -64 -78 -21 -8 19 34 57 123
8014 123 94 119 133 67 61 -43 -18 -29 -118 -120 -64 -174 -53 -79 -12 64 69 25 91 198 95 80 47 7 16 -101 -106 -113 -133 -96
8044 -96 -77 -55 11 -34 68 85 111 90 120 112 158 43 2 -1 -76 -126 -89 -92 -49 -132 -48 38 37 26 121 122 119 45 60 82 33 -14
8076 -14 -55 -43 -107 -147 -56 -45 -62 -2 -5 98 74 84 80 125 65 111 106 9 -37 -22 -129 -121 -157 -51 -31 -58 -4 8 61 91 116
8107 116 113 44 27 7 -7 -83 -56 -147 -158 -115 -165 -118 -92 -22 -14 59 30 80 133 106 100 106 104 11 -119 -88 -54 -122 -66 -29 -100 -42
8139 -42 -12 79 99 89 109 139 97 54 44 -20 -6 -19 -106 -123 -119 -24 -102 -73 -80 27 0 27 84 91 138 93 120 79 4 20 -46
8170 -46 -20 -145 -73 -90 -63 -34 38 43 75 84 94 120 60 97 37 61 41 -8 -50 -46 -64
8191f4
$$ Imaginary data points
##PAGE= N=2
##DATA TABLE= (X++(I..I)), XYDATA
0 0 0 0 0 0 0 0 0 0 0 0 0 0 0 0 0 8 -8 8 -8 8 -11 16 -16 18 -24 26 -32 35 -41 49 -57 65 -73 82 -92 105 -116
37 -116 131 -147 163 -182 199 -223 247 -271 301 -332 367 -404 445 -491 540 -595 658 -726 804
56 804 -894 995 -1114 1254 -1423 1630 -1893 2237 -2709 3402 -4526 6654 -12197 60575 128833
71 128833 75166 45821 -8106 -49683 -93972 -114752 -130507 -125091 -107224 -70758 -33185 11628
83 11628 53056 89230 108713 118454 112791 93838 60837 25138 -13628 -50519 -81554 -98659 -105049
96 -105049 -99655 -82235 -53007 -20546 13013 45459 72551 88051 93064 88400 73168 47723 18705
109 18705 -10667 -39060 -63090 -77345 -81858 -78005 -65358 -43769 -18143 7294 31818 53113
121 53113 66538 70811 68041 58182 40432 18302 -3583 -24466 -43392 -56172 -60729 -59135 -51984
134 -51984 -37810 -18940 -253 17804 34837 47100 52248 51898 47164 36135 20257 3924 -11719
147 -11719 -27207 -39302 -45251 -46156 -43298 -35033 -21765 -7446 6354 20398 32293 38946 40827
160 40827 39647 33787 22858 10444 -1701 -14270 -25704 -32861 -35667 -35723 -31879 -23308 -12614 -2083
174 -2083 8985 19729 27154 30645 31650 29605 23120 14126 5028 -4578 -14692 -22172 -26126 -27825
188 -27825 -27081 -22334 -14803 -6917 1390 10444 17883 21985 24093 24394 21068 14844 8173 1094 -6813
203 -6813 -13888 -18155 -20332 -21246 -19227 -14348 -8675 -2961 3831 10232 14336 16643 17993 17091 13296 8839
219 8839 4319 -1304 -6951 -10868 -13122 -14774 -14790 -12284 -8715 -5273 -924 4053 7761 10001 11828 12618
235 12618 11223 8599 6112 2808 -1412 -4898 -7182 -9316 -10698 -10250 -8593 -6748 -4360 -816 2492
250 2492 4824 6900 8923 9357 8486 7336 5744 2777 -359 -2742 -4960 -7293 -8533 -8266 -7759 -6724
266 -6724 -4414 -1530 900 3182 5791 7638 8021 7968 7513 5697 3071 695 -1622 -4411 -6566 -7499
282 -7499 -7786 -7743 -6589 -4201 -1934 291 2980 5500 6793 7285 7617 6885 4960 2834 882 -1638 -4195
299 -4195 -5682 -6420 -7007 -6760 -5345 -3483 -1751 378 2772 4405 5238 6042 6229 5227 3794 2471 808
316 808 -1382 -2992 -3999 -4830 -5384 -4877 -3827 -2830 -1624 224 1780 2690 3682 4472 4365 3784 3153 2365
334 2365 866 -651 -1596 -2498 -3509 -3848 -3581 -3304 -2823 -1696 -423 624 1492 2659 3363 3402 3306 3115
352 3115 2325 1097 164 -825 -1916 -2887 -3177 -3227 -3221 -2655 -1629 -665 233 1365 2496 2956 3124 3227 2898
371 2898 2019 1063 137 -914 -2071 -2659 -2917 -3176 -2989 -2242 -1393 -494 435 1533 2281 2641 2917 2947 2485
390 2485 1662 961 100 -989 -1798 -2236 -2605 -2758 -2507 -2000 -1354 -673 276 1116 1567 2069 2524 2573 2141 1774
410 1774 1379 538 -211 -853 -1425 -2016 -2294 -2285 -2226 -1989 -1429 -689 -92 593 1326 1972 2272 2434 2511 2246 1649
431 1649 1082 293 -599 -1492 -2135 -2556 -2934 -2936 -2455 -1946 -1197 -136 941 1797 2586 3240 3525 3234 2756 2064
451 2064 999 -265 -1453 -2437 -3283 -3663 -3704 -3343 -2670 -1603 -281 1043 2170 3153 3882 4053 3697 3102
469 3102 2109 738 -630 -1913 -3034 -3890 -4131 -3937 -3413 -2448 -1129 279 1665 2811 3717 4187 4083
486 4083 3606 2673 1405 2 -1347 -2671 -3549 -4099 -4079 -3621 -2861 -1684 -301 1144 2469 3383 3977 4149
504 4149 3821 3044 1872 511 -909 -2199 -3268 -3933 -4187 -3908 -3216 -2134 -847 561 1952 3100 3801
521 3801 4186 4005 3399 2464 1190 -233 -1631 -2748 -3681 -4106 -4120 -3604 -2754 -1562 -181 1206 2428 3371
539 3371 3942 4115 3765 2975 1940 657 -679 -1952 -2991 -3688 -3962 -3805 -3213 -2363 -1190 175 1413
556 1413 2434 3253 3626 3625 3234 2509 1468 350 -844 -1892 -2656 -3152 -3291 -3076 -2485 -1712 -743 336 1224
575 1224 2089 2679 2921 2769 2456 1858 1050 142 -689 -1418 -1989 -2296 -2319 -2205 -1844 -1222 -490 147 815 1350
595 1350 1764 1952 1870 1665 1295 754 193 -311 -820 -1174 -1418 -1477 -1552 -1268 -968 -514 -158 331 783 1037 1243
616 1243 1339 1311 1146 860 527 194 -362 -651 -911 -1269 -1353 -1270 -1065 -905 -545 -34 430 721 1114 1406 1496 1429
638 1429 1316 944 510 16 -457 -1001 -1346 -1621 -1666 -1642 -1456 -950 -439 164 854 1432 1841 2011 2089 1999 1476
659 1476 940 225 -468 -1279 -1897 -2288 -2565 -2519 -2083 -1418 -690 138 1118 1900 2515 2884 2968 2714 2091 1255 322
680 322 -812 -1850 -2614 -3101 -3378 -3246 -2706 -1911 -903 420 1587 2561 3333 3782 3738 3251 2466 1363 160
699 160 -1248 -2386 -3314 -3955 -4082 -3747 -2949 -1939 -619 863 2178 3280 3980 4346 4080 3380 2422 1022
717 1022 -513 -2013 -3145 -4052 -4497 -4334 -3767 -2761 -1391 255 1791 3103 4098 4677 4577 3998 3068
734 3068 1683 30 -1623 -2999 -4130 -4794 -4802 -4229 -3306 -1976 -239 1509 2976 4092 4869 4996 4557
751 4557 3518 2232 466 -1277 -2937 -4069 -5004 -5201 -4809 -3810 -2544 -783 1115 2729 4078 5031
767 5031 5350 5049 4121 2837 1158 -833 -2584 -4015 -5059 -5473 -5310 -4449 -3139 -1458 531 2367 3826
784 3826 4996 5600 5523 4731 3538 1864 10 -2027 -3602 -4779 -5554 -5569 -4971 -3835 -2248 -394 1540
801 1540 3178 4525 5409 5601 5028 4138 2671 792 -1113 -2819 -4182 -5123 -5464 -5028 -4239 -2919 -1212
818 -1212 639 2391 3787 4832 5271 5027 4377 3135 1622 -150 -1885 -3333 -4431 -5017 -4993 -4385 -3331
835 -3331 -1869 -170 1528 2930 4125 4729 4840 4388 3424 2081 491 -1129 -2561 -3781 -4511 -4708 -4433
852 -4433 -3556 -2324 -735 816 2294 3497 4327 4616 4399 3737 2625 1164 -464 -1951 -3207 -4184 -4564
869 -4564 -4416 -3882 -2864 -1491 135 1576 2977 3970 4509 4557 4034 3199 1863 228 -1235 -2606 -3806
886 -3806 -4418 -4531 -4182 -3390 -2195 -708 830 2217 3495 4232 4490 4347 3687 2665 1213 -360 -1745
903 -1745 -3102 -4003 -4464 -4362 -3825 -2934 -1573 -91 1356 2732 3746 4299 4424 3980 3166 1919 450
920 450 -920 -2308 -3425 -4080 -4250 -4029 -3278 -2255 -904 558 1900 3068 3847 4140 3955 3447 2410
937 2410 1117 -205 -1485 -2745 -3545 -3972 -3872 -3386 -2514 -1316 -3 1359 2537 3377 3771 3785 3415 2595
955 2595 1441 220 -1086 -2307 -3164 -3598 -3718 -3351 -2607 -1584 -309 965 2104 3017 3516 3616 3339
972 3339 2634 1661 478 -724 -1971 -2911 -3417 -3537 -3279 -2687 -1710 -515 608 1763 2729 3298 3467 3354
990 3354 2757 1897 797 -414 -1539 -2493 -3120 -3393 -3256 -2797 -1946 -913 224 1343 2264 2892 3223 3229 2773
1009 2773 2054 1075 23 -1004 -1988 -2710 -2996 -3018 -2727 -2096 -1131 -140 800 1724 2383 2802 2746 2587 1954 1208
1029 1208 319 -603 -1451 -2072 -2397 -2540 -2283 -1836 -1163 -334 453 1229 1843 2187 2225 2114 1656 1051 327 -423
1049 -423 -1073 -1659 -1932 -2011 -1898 -1487 -844 -260 498 1045 1492 1738 1800 1605 1250 742 106 -481 -984 -1391 -1620
1070 -1620 -1644 -1436 -1094 -525 35 627 1044 1391 1590 1527 1295 989 470 -80 -626 -1012 -1345 -1451 -1419 -1226 -831
1091 -831 -403 200 640 1038 1290 1400 1286 1068 731 261 -199 -648 -959 -1205 -1272 -1134 -872 -576 -106 333
1111 333 690 935 1097 1080 986 737 360 -29 -412 -711 -936 -987 -935 -800 -458 -156 171 602 806 903 926 859
1133 859 563 220 -71 -401 -729 -915 -963 -987 -710 -423 -47 360 684 924 1138 1155 973 739 384 -54 -511
1154 -511 -834 -1144 -1314 -1304 -1123 -821 -325 113 631 1065 1319 1555 1501 1212 865 429 -156 -732 -1155 -1497 -1684
1175 -1684 -1693 -1418 -989 -459 135 730 1254 1601 1818 1799 1514 1096 571 -58 -753 -1274 -1665 -1869 -1767 -1517 -1155
1196 -1155 -592 64 681 1293 1732 1856 1844 1568 1096 541 -74 -710 -1264 -1693 -1860 -1763 -1582 -1119 -529 130
1216 130 687 1252 1637 1829 1810 1556 1054 480 -182 -766 -1349 -1701 -1841 -1792 -1524 -1005 -449 152 802 1410 1761
1237 1761 1884 1894 1576 1079 466 -205 -823 -1398 -1766 -1867 -1831 -1610 -1168 -468 144 817 1337 1758 1894 1895 1609
1258 1609 1166 593 -40 -753 -1310 -1643 -1894 -1881 -1707 -1248 -678 23 655 1191 1563 1815 1878 1653 1212 757
1278 757 170 -467 -1023 -1441 -1637 -1754 -1526 -1247 -768 -210 312 908 1305 1541 1569 1506 1211 772 278 -199 -771
1299 -771 -1103 -1393 -1404 -1294 -1105 -705 -265 211 642 987 1225 1304 1191 968 648 234 -162 -522 -821 -1027 -1082
1320 -1082 -996 -864 -531 -148 206 490 838 978 1012 917 708 390 135 -183 -506 -781 -894 -913 -831 -651 -323
1341 -323 -45 245 597 783 790 865 750 532 341 37 -276 -459 -664 -798 -804 -634 -540 -258 20 221 444 629
1363 629 703 689 676 430 310 91 -83 -402 -532 -589 -649 -530 -429 -249 -85 133 362 469 461 525 468 340 167
1386 167 -13 -163 -282 -354 -374 -369 -328 -138 -114 91 142 262 336 287 282 221 129 -25 -158 -215 -276 -355 -244 -146 -146 5
1412 5 180 273 368 365 342 315 151 10 -86 -279 -388 -493 -433 -418 -387 -246 -28 135 327 453 626 630 547 493 294
1437 294 91 -126 -364 -576 -649 -658 -662 -584 -353 -168 93 255 562 715 758 738 665 499 178 7 -280 -519 -695
1460 -695 -776 -804 -734 -557 -277 -58 196 386 646 749 765 744 596 359 91 -120 -421 -657 -781 -818 -860 -637
1482 -637 -434 -142 154 416 629 794 833 805 694 430 165 -131 -437 -659 -808 -854 -845 -745 -536 -222 72 421
1504 421 701 865 947 944 790 566 226 -96 -442 -749 -902 -1026 -1023 -940 -663 -353 2 357 752 1005 1185 1169
1526 1169 1071 803 479 127 -333 -656 -1042 -1148 -1281 -1182 -1004 -593 -221 188 594 1011 1253 1402 1300 1124
1546 1124 739 375 -42 -550 -933 -1178 -1330 -1401 -1219 -926 -558 -83 392 878 1190 1346 1418 1285 1080 606
1566 606 179 -222 -719 -1047 -1291 -1387 -1318 -1020 -670 -312 165 662 976 1183 1356 1344 1116 711 377 -33 -570
1587 -570 -904 -1133 -1290 -1270 -1149 -786 -384 20 440 868 1078 1189 1224 1107 789 424 41 -390 -767 -1014 -1092
1608 -1092 -1123 -1017 -798 -419 -20 335 790 1028 1087 1175 1060 848 450 95 -300 -703 -1010 -1101 -1133 -1084 -797 -495
1630 -495 -159 237 612 832 1035 1146 1065 889 590 236 -163 -479 -790 -982 -1089 -1064 -895 -655 -359 94 453
1651 453 762 903 966 1027 928 715 415 99 -252 -477 -795 -826 -896 -860 -678 -477 -172 123 413 642 772 809
1673 809 821 608 432 266 32 -297 -485 -583 -657 -621 -545 -415 -224 -39 158 421 440 527 505 447 413 305 138
1696 138 -43 -301 -282 -404 -447 -392 -289 -218 -163 25 179 240 254 318 332 187 171 85 -30 -108 -196 -153 -196 -291 -183
1721 -183 -129 -79 4 113 120 156 226 217 199 95 122 55 -32 -87 -34 -77 -157 -116 -9 -89 -42 26 41 114 127 181 150 124 113
1750 113 72 73 -13 -52 -53 -107 -67 -117 -158 -153 -113 -72 -44 -59 -18 41 45 119 141 120 146 189 193 59 62 95 -26 -115 -157 -150 -136 -218
1782 -218 -168 -113 -101 -27 48 102 230 254 240 250 269 221 94 9 -88 -168 -247 -318 -349 -349 -274 -221 -112 -5 103 146 255
1809 255 344 361 409 364 281 94 -28 -120 -232 -296 -383 -376 -368 -340 -208 -72 27 130 321 392 408 412 403 264 148 106 -87
1836 -87 -240 -355 -375 -468 -393 -358 -207 -119 66 264 323 403 447 458 349 202 162 57 -126 -236 -345 -434 -458 -413 -331
1861 -331 -119 -80 147 276 280 443 504 491 372 192 161 -83 -283 -337 -413 -485 -553 -450 -304 -174 14 193 273 433
1885 433 526 558 489 330 281 54 -149 -325 -466 -571 -609 -508 -455 -306 -99 82 353 480 588 683 633 553 468
1908 468 202 27 -299 -422 -544 -693 -731 -656 -530 -366 -94 132 394 551 674 767 742 621 432 217 -50
1929 -50 -262 -459 -663 -744 -821 -698 -581 -328 -42 187 456 629 789 848 800 761 445 242 -71 -304 -510 -733
1951 -733 -857 -842 -755 -607 -347 -129 148 461 631 791 856 716 620 427 158 -66 -356 -585 -791 -829 -800 -756
1973 -756 -519 -298 -32 287 562 686 798 784 779 577 337 98 -203 -416 -628 -805 -840 -723 -612 -397 -164
1994 -164 65 438 607 774 773 761 709 461 182 -57 -341 -570 -718 -804 -771 -714 -557 -246 -42 214 501 638
2016 638 768 781 777 596 363 99 -174 -405 -614 -735 -804 -781 -632 -483 -239 -28 284 562 683 768 833 690
2038 690 567 370 121 -108 -434 -692 -723 -756 -803 -683 -455 -344 -42 241 466 748 777 860 718 595 450 149
2060 149 -94 -312 -555 -708 -808 -812 -639 -551 -296 -78 231 407 581 765 750 754 584 430 195 -89 -277 -483
2082 -483 -672 -792 -832 -717 -594 -369 -137 91 375 579 724 814 752 657 486 212 14 -229 -527 -672 -708 -810
2104 -810 -710 -595 -316 -83 159 466 697 770 860 809 684 498 247 -31 -407 -628 -812 -888 -964 -791 -560 -357
2126 -357 -148 266 590 773 943 946 871 736 463 159 -167 -545 -793 -932 -1037 -1003 -814 -591 -287 66 492
2147 492 778 1005 1169 1123 998 731 400 30 -349 -732 -1016 -1179 -1214 -1145 -860 -625 -147 277 616 1049 1168
2168 1168 1274 1217 997 726 362 -132 -602 -867 -1199 -1326 -1307 -1187 -913 -483 11 468 798 1123 1317 1460
2188 1460 1248 994 645 202 -246 -753 -1017 -1262 -1358 -1288 -1063 -760 -341 133 592 1006 1270 1413 1315 1141 805
2209 805 368 -43 -564 -990 -1204 -1399 -1364 -1178 -921 -482 -28 453 798 1124 1345 1373 1249 951 600 92 -368
2230 -368 -746 -1079 -1305 -1323 -1211 -968 -676 -237 265 740 995 1293 1369 1302 1064 765 337 -218 -644 -1016 -1247
2251 -1247 -1404 -1290 -1149 -832 -429 59 500 877 1239 1322 1293 1181 916 523 48 -404 -782 -1079 -1364 -1311 -1207
2272 -1207 -1004 -576 -207 237 687 1014 1223 1313 1260 1020 730 345 -122 -565 -850 -1178 -1292 -1240 -1042 -781 -494
2293 -494 -37 388 732 1021 1190 1207 1054 904 546 167 -227 -573 -892 -1121 -1148 -1095 -932 -607 -259 135 451
2314 451 795 1024 1139 1062 915 705 384 -25 -360 -690 -943 -1017 -1058 -905 -689 -411 -21 269 499 847 943
2335 943 1006 925 724 492 77 -150 -422 -742 -902 -933 -899 -745 -585 -303 48 336 612 895 988 892 862 635
2357 635 313 98 -266 -481 -730 -869 -917 -832 -652 -417 -168 133 423 750 778 880 877 750 523 262 -89 -314
2379 -314 -616 -843 -922 -967 -753 -590 -347 -82 149 449 760 835 918 842 719 510 235 -76 -289 -631 -786 -840
2401 -840 -915 -733 -559 -293 32 284 485 697 819 825 808 609 371 135 -101 -456 -645 -739 -815 -793 -710 -543 -286
2424 -286 11 315 597 662 788 819 729 554 356 75 -175 -455 -643 -732 -792 -704 -548 -363 -143 104 338 586
2446 586 728 777 846 622 461 188 -42 -335 -523 -676 -785 -746 -703 -471 -289 -27 222 481 568 768 793 683
2468 683 505 313 51 -175 -312 -562 -692 -729 -700 -514 -358 -80 91 399 542 684 769 748 615 432 190
2489 190 -57 -290 -451 -671 -723 -736 -620 -504 -284 0 185 387 613 679 774 709 546 355 142 -144 -323 -566
2511 -566 -628 -650 -679 -567 -412 -186 66 317 484 587 711 653 606 505 293 63 -176 -399 -567 -590 -668 -593 -451
2534 -451 -262 -62 128 328 433 534 574 529 449 301 108 -47 -256 -385 -531 -609 -566 -507 -319 -133 5 187
2556 187 367 486 559 523 482 304 143 13 -154 -370 -419 -531 -468 -380 -294 -234 32 144 240 411 439 464 445 312
2580 312 181 55 -73 -257 -380 -435 -429 -408 -356 -174 -97 67 204 231 396 416 359 289 264 100 -24 -116 -219 -319
2604 -319 -390 -341 -329 -264 -95 73 86 204 296 304 336 319 252 151 102 -57 -112 -268 -307 -261 -308 -222 -205 -113 -37 22 117
2631 117 150 248 266 216 136 64 20 -48 -52 -159 -165 -193 -112 -98 -65 -22 8 63 57 67 117 86 111 42 45 42 -3 -25 16 -50 -118 -91
2663 -91 -98 -34 -84 21 -60 -19 -22 29 60 21 9 75 93 36 54 75 37 17 -8 -25 65 -107 -33 -72 -84 -18 -3 57 41 110
2693 110 101 92 97 87 42 39 19 -2 18 -60 -94 -83 -114 -72 -51 -90 -33 -13 64 77 122 52 120 104 34 91 4 -36 -77 -124 -140 -91
2725 -91 -80 -69 -39 6 58 84 86 167 140 112 156 98 31 -16 -55 -169 -200 -151 -227 -183 -177 -90 -37 75 115 211 215 241 197 148 156
2756 156 20 -41 -120 -150 -245 -290 -299 -223 -211 -43 34 86 196 278 327 332 258 231 182 38 -29 -127 -226 -323 -367 -331 -313 -228 -136
2785 -136 -32 68 214 282 389 334 388 293 149 125 -97 -230 -263 -354 -416 -372 -344 -229 -122 27 142 255 353 380
2809 380 418 417 265 186 44 -44 -199 -306 -386 -394 -345 -312 -199 -61 59 210 332 377 440 433 300 265 141 -51 -196
2834 -196 -276 -385 -465 -443 -404 -358 -195 -31 173 288 414 472 481 496 370 206 61 -16 -289 -426 -481 -480 -503 -411 -318
2859 -318 -120 50 248 379 521 583 521 471 395 179 9 -243 -407 -501 -576 -567 -554 -396 -279 -52 159 386 512
2882 512 548 651 556 528 336 147 -44 -327 -490 -533 -643 -634 -563 -392 -195 12 235 395 577 700 647 667 449
2905 449 325 60 -151 -380 -580 -641 -683 -645 -564 -380 -157 62 316 493 601 693 630 583 456 266 -14 -259
2927 -259 -494 -544 -659 -703 -637 -458 -286 -65 204 409 535 628 699 653 535 297 96 -119 -334 -502 -645 -720
2949 -720 -668 -563 -370 -134 19 261 477 584 716 651 589 445 238 22 -277 -450 -606 -715 -715 -591 -519 -292
2971 -292 -63 207 389 621 722 738 724 566 426 184 -129 -360 -515 -677 -734 -711 -602 -410 -181 54 342
2992 342 507 661 709 734 645 483 287 57 -149 -438 -604 -722 -711 -686 -574 -423 -157 131 319 537 661 755
3014 755 700 610 508 244 -60 -240 -458 -639 -687 -685 -648 -446 -295 -75 167 335 510 721 703 663 523 361 172
3037 172 -98 -294 -498 -621 -731 -660 -603 -453 -263 -7 183 432 548 631 693 591 507 320 126 -194 -355 -543
3059 -543 -603 -637 -611 -541 -400 -146 98 322 450 589 684 627 562 399 191 -9 -194 -399 -531 -626 -669 -569 -475
3082 -475 -247 -77 165 330 439 661 647 580 514 327 168 -171 -321 -432 -620 -604 -651 -532 -400 -238 36 224
3104 224 397 560 586 693 604 449 273 66 -127 -317 -539 -650 -625 -695 -490 -360 -149 141 271 445 579
3125 579 676 659 515 469 202 73 -194 -404 -519 -592 -597 -544 -435 -290 -112 109 352 459 560 644 612 521 387
3148 387 179 34 -150 -417 -471 -608 -582 -488 -431 -299 -91 141 275 476 550 570 565 412 279 78 -58 -244 -405
3171 -405 -503 -597 -571 -403 -319 -143 35 236 352 473 588 586 486 348 202 33 -149 -313 -445 -524 -532 -530 -365 -250
3195 -250 -71 60 249 429 483 566 540 427 374 170 -53 -148 -333 -455 -556 -491 -398 -373 -271 -96 82 279 414
3218 414 533 537 530 439 299 163 24 -203 -373 -470 -569 -541 -534 -318 -184 -18 138 317 420 526 558 479 429 336 114
3243 114 -85 -264 -413 -493 -575 -546 -488 -355 -179 -50 87 319 453 580 614 436 425 321 48 -141 -317 -408
3265 -408 -496 -578 -507 -414 -299 -103 15 242 376 473 548 513 447 349 221 10 -176 -337 -444 -529 -578 -532 -384 -243
3289 -243 -115 94 286 424 467 560 505 413 253 161 -41 -173 -392 -485 -543 -549 -492 -349 -160 30 162 305 497
3312 497 551 581 555 471 223 49 -132 -333 -460 -517 -626 -566 -442 -309 -159 81 264 501 534 629 600 486 345
3335 345 161 -75 -259 -379 -483 -535 -604 -513 -373 -196 -5 192 418 484 614 605 549 451 295 57 -116 -275 -459
3358 -459 -498 -581 -565 -491 -295 -93 71 283 460 586 631 546 470 299 142 -83 -197 -411 -589 -539 -559 -524 -359
3381 -359 -173 35 241 422 509 544 603 534 393 241 61 -239 -335 -454 -610 -537 -538 -432 -238 -51 127 346 554
3404 554 571 570 497 416 311 58 -188 -265 -411 -539 -555 -556 -441 -245 -115 135 310 443 509 593 518 416 304 92
3428 92 -86 -239 -486 -549 -545 -559 -449 -275 -166 114 255 438 558 586 479 461 319 96 -45 -219 -397 -470 -510
3451 -510 -590 -493 -328 -145 63 145 326 501 480 517 475 369 175 -10 -163 -300 -461 -480 -569 -474 -292 -168 21
3474 21 146 311 471 534 494 419 329 146 30 -137 -304 -386 -475 -505 -441 -309 -196 -31 95 230 379 490 458
3497 458 417 344 228 59 -95 -250 -387 -468 -378 -385 -301 -207 -54 94 277 345 431 440 415 335 188 16 -103 -222 -325
3522 -325 -386 -460 -401 -327 -136 -71 114 265 309 365 414 342 365 177 101 -71 -223 -352 -420 -430 -359 -359 -275 -85 79 187
3548 187 257 409 412 377 303 247 86 25 -181 -233 -345 -417 -331 -275 -247 -162 22 120 236 305 372 383 277 229 164 32
3574 32 -117 -215 -272 -397 -339 -347 -238 -123 -56 90 176 287 385 336 268 176 129 37 -88 -182 -312 -301 -297 -260 -251 -163 -64 72
3602 72 232 262 326 356 287 272 133 44 -2 -209 -290 -357 -387 -287 -245 -175 -45 115 198 257 318 369 280 306 163 45
3628 45 -49 -128 -271 -337 -325 -331 -250 -214 -41 17 188 270 359 434 341 256 201 33 19 -133 -236 -343 -347 -323 -295 -226 -58
3655 -58 43 139 224 327 353 283 216 177 105 -5 -147 -255 -282 -354 -314 -263 -203 -147 5 132 214 282 330 353 269 192 102
3682 102 21 -105 -174 -261 -387 -278 -269 -241 -82 21 76 225 298 348 306 267 207 93 33 -93 -195 -245 -320 -306 -292 -225
3708 -225 -147 -15 156 238 288 255 330 293 182 76 -40 -126 -193 -309 -278 -264 -272 -177 -107 9 115 201 305 319 324 211
3734 211 199 75 5 -91 -243 -276 -279 -281 -286 -193 -122 -38 114 218 291 260 247 267 199 146 40 -96 -163 -276 -274 -270 -241 -220 -108
3763 -108 5 68 191 254 253 265 244 196 145 26 -108 -155 -271 -227 -261 -229 -205 -122 -87 39 165 244 300 265 237 138 40
3790 40 -23 -137 -168 -298 -267 -238 -220 -186 -83 40 109 196 260 235 240 277 236 60 41 -72 -98 -149 -245 -192 -218 -215 -113 35
3818 35 121 167 224 257 266 202 146 97 -41 -102 -233 -240 -253 -285 -241 -123 -45 60 113 131 220 289 203 220 120 56 32 -28 -147
3847 -147 -171 -195 -215 -163 -183 -48 13 99 103 194 206 185 169 132 104 13 -92 -138 -168 -233 -201 -192 -160 -95 1 69 69 192 193 193 201
3878 201 109 45 -1 -78 -82 -138 -146 -171 -187 -141 -52 5 66 89 165 183 207 168 71 64 62 -10 -127 -105 -106 -177 -154 -78 -79 30 68 75
3910 75 99 88 155 127 102 69 24 -10 -71 -76 -105 -147 -133 -110 -98 -80 12 73 71 103 134 139 69 144 93 34 -5 -39 -76 -84 -101 -90
3942 -90 -51 -62 -78 29 50 76 43 102 89 101 60 48 68 -64 -27 -47 -40 -41 -127 -29 -102 -34 -4 -9 25 -14 34 110 139 70 38
3973 38 37 11 56 2 -2 -48 -77 -22 -81 -58 -59 -49 7 62 26 31 46 82 70 82 68 57 83 -28 -64 -72 -45 -151 -98 -88 -85 -29
4005 -29 -55 -28 48 96 120 149 161 79 47 24 -84 -73 -120 -126 -105 -130 -92 -86 10 33 112 158 181 135 127 58 114 47 -83 -163 -118
4036 -118 -169 -226 -148 -198 -122 -79 54 73 136 201 264 226 230 89 60 -32 -72 -160 -205 -191 -214 -161 -165 -87 9 75 158 238 307 187
4066 187 268 207 117 26 -64 -107 -234 -246 -316 -254 -235 -167 -126 50 112 212 264 213 292 185 186 63 -44 -135 -170 -201 -257
4093 -257 -285 -262 -144 -120 6 66 94 311 346 318 330 319 105 56 -73 -130 -251 -234 -333 -301 -253 -132 -56 39 170 255
4119 255 279 373 319 251 230 99 -84 -149 -284 -350 -445 -350 -302 -237 -111 20 109 302 319 394 400 326 299 115 88 -99
4145 -99 -252 -325 -406 -415 -351 -271 -131 -62 124 227 310 374 420 462 313 221 84 -53 -234 -282 -360 -429 -402 -353 -189 -81
4171 -81 40 135 332 373 449 444 374 281 164 -14 -92 -281 -359 -421 -442 -339 -263 -125 -42 86 278 382 486 422 417 322
4197 322 219 71 -88 -228 -370 -462 -450 -476 -405 -281 -121 56 192 271 421 485 415 425 248 153 4 -195 -309
4220 -309 -439 -462 -452 -394 -308 -181 47 95 300 517 479 533 485 307 223 112 -173 -307 -415 -495 -512 -525 -370 -263
4244 -263 -39 122 239 384 485 512 510 451 258 137 -81 -247 -403 -519 -543 -467 -484 -312 -109 22 257 411
4266 411 533 557 555 532 363 203 -49 -229 -382 -522 -563 -528 -482 -426 -177 -3 126 337 489 538 541 475 415 249
4290 249 97 -98 -301 -408 -549 -574 -545 -413 -271 -81 106 298 403 540 557 542 471 303 109 -75 -212 -413
4312 -413 -497 -596 -596 -440 -344 -154 57 163 337 484 557 569 498 369 167 26 -177 -372 -514 -579 -551 -485 -417 -182
4336 -182 -22 177 315 463 576 612 517 374 202 36 -114 -310 -476 -555 -554 -526 -403 -254 -61 67 285 464
4358 464 489 554 491 357 257 15 -82 -256 -442 -499 -562 -526 -421 -331 -205 66 259 374 471 531 500 403 336 213
4382 213 -95 -174 -328 -468 -501 -541 -406 -326 -159 23 237 406 435 483 517 447 302 171 30 -148 -320 -487 -457
4405 -457 -507 -465 -338 -204 -39 86 263 333 442 399 407 332 219 75 -83 -224 -322 -418 -469 -412 -281 -233 -100 121
4429 121 226 295 347 403 386 305 252 73 3 -215 -257 -330 -383 -373 -293 -264 -138 23 201 297 304 375 306 309 241 76 -15
4456 -15 -126 -256 -298 -411 -358 -327 -266 -86 -28 93 217 298 327 295 341 264 213 63 -82 -99 -208 -244 -326 -294 -248 -166
4482 -166 -26 50 175 232 252 278 270 221 198 64 -78 -160 -226 -258 -264 -269 -222 -156 -145 -22 26 179 261 273 241 185 225 167
4510 167 22 -91 -88 -188 -185 -162 -191 -196 -90 18 82 152 141 186 196 162 139 109 41 -8 -143 -117 -244 -119 -153 -163 -141
4537 -141 -52 -20 54 117 121 158 126 94 60 41 35 -77 -141 -111 -128 -177 -101 -68 -86 7 72 86 183 136 79 141 101 75 9 -55
4567 -55 -62 -75 -187 -91 -94 -84 -66 -21 -18 47 87 115 23 62 102 61 31 -54 -42 -34 -63 -120 -67 -56 -18 5 -38 26 28 -5 41 40 75
4600 75 44 64 18 23 -58 -7 5 -25 0 15 -2 -40 -30 -23 -38 -28 -22 20 -15 -6 4 10 21 11 38 -22 3 -24 9 -36 12 -60 10
4633 10 -27 -57 -61 -36 -46 54 7 44 83 93 100 110 0 -10 23 -21 -17 -56 -27 -86 -72 -54 26 -3 -39 66 50 16 67 81
4663 81 62 44 53 -10 -61 -79 -20 -74 -47 -49 -98 -43 -12 -3 35 156 146 133 35 105 116 62 46 -55 -92 -122 -97 -103 -115 -75 -16
4694 -16 14 89 103 159 140 125 120 73 15 17 -60 -112 -77 -138 -129 -171 -158 -77 14 38 65 79 135 235 179 150 91 16 -21 -62 -141
4725 -141 -191 -205 -139 -156 -165 -45 59 126 171 155 181 257 156 83 61 0 -17 -79 -206 -229 -221 -223 -185 -108 -46 16 120 161 175
4754 175 245 216 227 117 22 -21 -125 -136 -237 -239 -215 -171 -150 4 8 121 215 171 235 181 185 132 -20 -8 -48 -100 -219 -241
4782 -241 -265 -242 -147 -119 -32 76 91 180 254 237 247 179 119 27 -57 -161 -219 -211 -239 -232 -137 -104 -64 54 130 184 289 257 244
4811 244 235 125 54 -39 -114 -157 -274 -209 -226 -206 -151 -112 31 74 182 209 270 232 171 188 131 -7 -90 -167 -164 -214 -271 -211
4839 -211 -194 -87 12 88 135 184 227 281 228 211 133 4 -6 -127 -171 -170 -323 -189 -191 -149 -94 -14 76 95 181 261 179 173 116
4868 116 62 74 -106 -137 -138 -207 -234 -196 -132 -93 -42 38 97 157 222 198 182 141 36 -7 -7 -75 -154 -119 -145 -148 -60 -88 -32 -26 53
4899 53 150 60 145 123 76 56 64 8 -51 -128 -103 -125 -129 -67 -75 -40 38 66 46 140 84 108 69 132 56 -2 -23 -37 13 -120 -98
4930 -98 -117 -105 -72 15 51 32 33 28 96 97 16 -32 12 -42 -22 -82 -23 -72 -141 -45 -46 0 -30 -32 -38 -11 34 25 27 77 64 23 48 33
4964 33 35 -17 54 -20 -53 -16 33 1 -25 -25 -29 -48 -6 39 17 79 30 42 83 31 80 96 31 -5 -11 36 -81 -119 -143 -83 -59 -78
4996 -78 -60 19 5 57 132 133 118 113 75 83 -8 -46 -95 -142 -153 -143 -134 -143 -64 -42 31 115 114 154 222 170 143 103 68 -40 -122 -169 -162
5029 -162 -132 -145 -100 -167 -50 5 82 129 135 170 178 245 119 126 -35 -99 -147 -177 -214 -228 -162 -160 -81 5 57 211 184 251 261 264
5059 264 185 107 53 -54 -113 -227 -305 -216 -268 -201 -183 -83 12 90 213 209 287 241 271 155 92 -18 -92 -179 -247 -288 -318
5086 -318 -292 -188 -114 -3 94 216 283 278 280 290 259 132 29 -59 -144 -280 -299 -353 -301 -275 -170 -86 8 142 221 291 331
5113 331 235 260 158 103 34 -133 -201 -265 -375 -302 -296 -280 -192 -16 124 175 241 322 358 341 310 194 66 -70 -164 -267
5139 -267 -309 -391 -320 -307 -181 -41 59 116 224 257 329 351 322 243 79 -25 -139 -204 -301 -344 -388 -321 -269 -160 -24
5164 -24 98 237 254 370 363 384 302 213 45 -21 -170 -286 -312 -340 -330 -243 -186 -69 46 166 285 341 385 355 361 269
5190 269 114 6 -116 -242 -397 -405 -408 -353 -291 -183 -20 85 209 274 370 424 412 277 209 92 3 -205 -231 -360
5214 -360 -380 -392 -382 -268 -136 60 151 323 304 366 422 317 237 182 0 -117 -229 -285 -338 -434 -400 -289 -206 -53 32
5239 32 215 273 343 366 353 290 244 147 -67 -158 -270 -267 -354 -334 -318 -186 -171 7 197 233 312 387 370 406 259 178 49
5266 49 -124 -191 -269 -384 -294 -349 -314 -215 -102 107 147 241 362 319 305 213 187 153 -34 -236 -266 -325 -333 -328 -266 -180 -128 -3
5294 -3 114 246 319 381 360 271 218 151 25 -92 -171 -291 -342 -337 -315 -231 -98 -25 66 140 258 220 290 356 217 169 57
5321 57 -27 -160 -184 -317 -321 -256 -261 -160 -102 -9 129 129 233 284 289 239 198 189 40 -43 -92 -157 -186 -234 -245 -168 -89 -23 79
5350 79 172 163 256 156 184 145 124 35 -6 -120 -133 -130 -211 -211 -115 -137 -43 -27 36 67 135 137 153 146 142 54 79 41 -124 -97 -130 -171
5382 -171 -153 -123 -97 -104 -57 -3 46 205 162 207 101 79 103 37 -71 -62 -82 -97 -160 -133 -140 -130 -64 -10 -4 36 152 72 144 188
5412 188 94 78 51 14 -12 -51 -72 -120 -153 -114 -67 -91 -27 -25 64 165 142 134 125 78 163 58 49 -6 -86 -84 -103 -137 -197 -83 -130
5443 -130 -83 -22 -17 60 83 81 141 136 158 110 30 48 -2 -126 -108 -136 -104 -137 -153 -127 -50 27 71 117 154 151 167 146 158 103 60
5474 60 -18 -149 -94 -188 -150 -206 -131 -70 -49 -29 50 116 127 151 217 110 74 64 33 -90 -149 -103 -192 -203 -189 -117 -66 11 103
5503 103 110 223 200 231 211 151 158 50 12 -71 -182 -180 -220 -158 -155 -173 -51 30 53 121 213 274 160 166 126 56 -6 -75 -148 -229
5533 -229 -285 -242 -183 -203 -59 3 13 156 168 265 269 223 141 138 66 -62 -127 -197 -214 -237 -208 -172 -142 -56 6 107 209 200 239
5562 239 216 201 176 81 -27 -96 -130 -183 -212 -278 -212 -157 -75 10 130 138 210 253 227 200 161 108 39 -8 -123 -206 -235 -225 -158
5591 -158 -177 -102 8 67 97 206 187 261 187 132 146 67 -14 -77 -168 -201 -225 -208 -236 -110 -55 41 80 154 209 245 240 154 110
5620 110 -4 -11 -113 -173 -200 -206 -223 -186 -99 -64 56 117 172 172 205 240 185 135 75 -33 -45 -164 -186 -203 -248 -160 -134 -107 -12
5649 -12 99 98 204 177 190 195 81 135 -1 -35 -92 -163 -183 -213 -182 -132 -124 -36 57 73 155 142 223 247 224 147 81 -38 -66
5678 -66 -99 -145 -210 -200 -184 -149 -20 18 99 117 153 190 166 147 151 35 1 -44 -116 -127 -148 -169 -130 -87 -37 25 10 83 186
5707 186 94 186 165 108 57 59 -39 -80 -132 -141 -184 -136 -109 -96 -22 41 69 118 160 183 108 94 73 33 -6 -81 -106 -137 -185 -160 -82
5738 -82 -83 15 -14 -4 127 104 167 129 118 99 34 -33 -60 -52 -172 -143 -89 -117 -74 -53 43 84 38 142 174 116 115 129 68 3
5768 3 -77 -81 -121 -81 -134 -117 -78 -74 -59 29 95 64 78 135 73 64 71 -37 -13 -54 -78 -89 -84 -125 -112 -53 5 96 60 107 94 101 155
5801 155 87 19 41 -28 -3 -108 -60 -69 -144 -82 -49 -27 37 73 74 126 129 45 67 72 -58 -46 -57 -116 -116 -149 -71 -50 -64 38 96
5832 96 100 100 81 90 78 81 4 -25 1 -87 -90 -70 -76 -102 2 2 -16 58 102 97 105 19 89 18 -17 12 -4 -90 -86 -120 -148 -60 -87 -9 18
5867 18 25 87 62 134 89 52 -25 0 -12 -9 -119 -77 -98 -93 -26 -12 -6 5 56 133 136 114 137 90 2 49 1 -121 -34 -149 -113
5898 -113 -153 -75 -130 17 57 90 41 117 132 110 70 69 -57 -48 -64 -153 -115 -72 -155 -98 -14 -23 66 11 71 141 156 121 139 62
5928 62 -10 -38 -87 -133 -97 -128 -71 -126 -59 -1 14 115 80 141 171 173 77 72 -48 -32 -117 -84 -149 -176 -185 -127 -120 1 28 116 129
5959 129 98 154 186 98 109 60 13 -61 -34 -155 -166 -145 -139 -95 -73 2 72 116 156 205 175 119 85 1 -23 -109 -103 -178 -184 -179 -186 -150
5991 -150 -72 -6 76 130 159 134 150 174 111 48 -27 -1 -115 -150 -157 -218 -159 -139 -108 31 87 130 174 147 173 184 141 89 -13
6020 -13 -84 -134 -150 -202 -254 -161 -106 -36 6 70 114 149 199 222 198 106 36 34 -30 -126 -180 -172 -203 -190 -116 -92 -54 -16 79 147 212
6051 212 278 216 239 162 70 9 -21 -187 -228 -196 -209 -178 -175 -90 -19 56 130 101 192 142 219 156 75 7 -24 -79 -153 -219 -191 -181
6081 -181 -152 -57 -71 66 110 157 191 221 217 166 130 98 -19 -40 -150 -182 -188 -189 -162 -170 -92 -45 18 175 177 153 212 253 85 58
6111 58 13 -53 -154 -179 -164 -218 -182 -160 -83 -66 28 83 182 190 186 168 133 144 41 28 -66 -139 -193 -227 -223 -206 -89 -58 63 33
6141 33 120 168 261 217 124 140 112 34 -71 -98 -159 -192 -213 -196 -182 -96 -36 25 101 121 185 185 133 174 111 67 -18 -76 -150 -124
6171 -124 -207 -162 -141 -102 -82 -23 24 81 150 206 233 233 142 107 18 -7 -86 -57 -160 -203 -207 -197 -107 -67 41 73 91 96 140 129
6201 129 151 105 51 3 -17 -81 -138 -167 -176 -180 -167 -78 -26 10 96 100 218 187 163 178 67 96 -26 -73 -102 -117 -172 -152 -140 -79
6231 -79 -35 40 54 78 138 203 142 176 124 82 -5 -45 -139 -143 -133 -167 -166 -150 -68 -24 39 131 115 146 179 202 157 85 66 39 -64
6262 -64 -95 -129 -193 -105 -161 -121 -87 -32 87 64 143 89 128 201 87 58 8 -25 -80 -84 -142 -70 -153 -198 -61 -50 -26 23 107
6291 107 167 123 176 114 142 78 46 -2 -19 -136 -130 -139 -108 -98 -94 19 22 21 85 173 164 150 128 95 77 -18 -88 -80 -143 -153 -178 -132
6323 -132 -103 -61 17 18 134 71 133 181 170 76 41 14 -12 -80 -100 -64 -138 -60 -130 -35 -13 11 124 109 113 131 158 135 104 30
6353 30 -49 -50 -64 -122 -161 -158 -152 -135 -63 38 56 48 164 126 164 145 75 115 5 20 -3 -90 -72 -84 -139 -142 -64 -13 -24 62 103
6384 103 105 108 165 89 55 55 40 -74 -107 -111 -121 -151 -164 -76 -54 -36 -15 99 66 136 136 177 83 74 71 -73 -71 -134 -70 -135 -119 -147
6416 -147 -89 -4 3 14 38 111 122 177 110 132 53 67 -61 -95 -103 -143 -164 -155 -86 -86 -27 3 -36 91 127 61 127 113 78 44 -22
6447 -22 24 -90 -100 -60 -142 -128 -159 -39 -26 9 107 93 139 133 146 77 94 -36 -12 -46 -121 -110 -172 -111 -82 -52 9 3 68 108
6477 108 143 110 166 132 55 78 -20 -106 -139 -113 -194 -102 -109 -154 -59 -29 44 123 104 123 178 159 87 92 33 -43 -73 -94 -96 -116 -159
6508 -159 -68 -129 -59 -21 40 109 136 181 138 136 121 52 -22 -31 -68 -132 -118 -184 -228 -116 -118 60 31 34 145 135 124 104 88 76
6538 76 -13 -74 -107 -87 -131 -96 -159 -87 -63 -54 75 99 127 149 184 156 108 52 9 40 -83 -81 -164 -191 -189 -148 -125 -29 21 66 109
6569 109 117 142 127 136 92 31 43 -66 -94 -116 -166 -115 -186 -129 -86 -39 47 123 149 232 161 205 166 117 18 -21 -126 -137 -177 -196
6599 -196 -116 -134 -130 -36 15 54 145 135 203 209 146 106 57 20 3 -79 -129 -161 -159 -148 -109 -45 -18 48 93 99 180 199 104 141 85 68
6631 68 -17 -75 -154 -171 -187 -142 -95 -132 -24 79 65 160 129 180 158 117 40 50 -1 -60 -89 -158 -122 -204 -156 -68 -16 8 61
6660 61 95 121 165 155 116 174 76 48 -45 -67 -136 -145 -166 -134 -88 -53 8 16 63 136 158 203 121 159 81 58 -45 -74 -137 -163 -154
6691 -154 -118 -131 -125 -58 23 99 171 132 171 189 141 76 91 -8 -73 -72 -148 -138 -189 -122 -130 -34 1 66 87 117 175 175 220 126 84 17
6723 17 -14 -42 -119 -143 -151 -200 -111 -113 -58 10 62 94 100 89 199 118 71 23 -1 -59 -35 -117 -140 -172 -105 -92 -32 -40 2 47 130 176
6755 176 106 188 137 23 34 46 -96 -163 -150 -144 -110 -128 -113 -50 79 42 102 79 110 138 137 80 0 35 -119 -46 -132 -169 -171
6784 -171 -112 -92 -29 5 -4 67 117 153 127 127 136 124 78 8 27 -110 -129 -158 -94 -108 -133 -52 -26 58 62 128 128 114 91 79 -4 -33
6816 -33 -61 -101 -55 -85 -126 -144 -120 -100 -41 29 85 78 120 78 125 113 67 31 32 -17 14 -118 -70 -104 -73 -73 -62 20 70 52 79
6847 79 111 130 76 48 26 -12 -24 -37 -43 -52 -94 -43 -112 -50 -10 -27 23 27 68 64 100 48 63 75 64 -87 -24 -97 -90 -56 -84 -68
6879 -68 -39 48 45 110 23 4 100 88 21 34 -8 -19 -74 -58 -54 -69 -89 -41 -45 8 72 -1 12 51 115 16 48 -7 22 15 -48 -51 -62
6912 -62 4 0 -48 10 -33 30 31 39 25 22 59 47 -5 -30 9 0 -35 -16 -20 -40 11 -13 17 -13 34 14 -8 20 -9 4 -1 -21 -3 4
6946 4 7 4 -15 -29 -32 -51 55 27 22 31 37 60 44 -4 -54 -39 16 -26 -10 17 30 22 57 7 119 59 64 20 4 -20 7 -61 -23 -30
6980 -30 -122 -27 -43 17 52 48 91 74 38 27 45 16 -10 -11 29 -24 -67 -18 -34 -49 -1 10 5 1 41 44 116 99 79 65 61 25 -36
7013 -36 -62 -59 -73 -37 -42 -43 -34 -10 6 33 76 106 52 93 25 46 2 -44 -62 -32 -74 -89 -45 -86 -81 28 62 63 46 51 53 134 77 44
7047 44 66 9 15 -89 -75 -92 -73 -26 -103 -16 26 30 82 109 32 139 106 58 35 -83 -55 -50 -86 -147 -126 -34 -117 -73 -13 -2
7077 -2 70 67 108 130 89 111 65 2 -17 24 -64 -97 -104 -85 -75 -71 -38 61 59 85 115 78 103 59 106 50 12 -1 -74 -139 -131 -160 -117
7110 -117 -63 -27 -20 -18 11 120 98 100 108 73 49 78 -28 26 -80 -104 -111 -69 -148 -43 1 10 77 48 80 87 154 120 127 53 -5 59
7142 59 -41 -107 -92 -144 -90 -120 -140 -53 -24 22 23 105 126 159 111 69 34 9 -10 -95 -127 -146 -126 -141 -51 -31 -16 47 52 121 128
7173 128 99 145 61 130 12 33 -40 -53 -102 -122 -154 -98 -118 -155 14 -46 97 129 33 101 78 130 120 32 -30 -73 -211 -128
7201 -128 -100 -161 -94 -57 -18 16 22 93 113 171 126 151 137 191 69 -36 -57 -191 -125 -160 -158 -141 -89 -37 25 5 60 141 139 144
7231 144 138 91 33 -36 2 -99 -98 -150 -145 -128 -77 -74 -21 12 89 132 128 156 134 141 122 67 -37 -81 -71 -95 -116 -131 -126 -122 -114 -78 71
7264 71 35 192 125 128 200 106 38 -9 -97 -70 -73 -163 -158 -189 -79 -89 -37 -12 95 93 123 158 143 113 106 10 -24 -29 -114 -121 -101 -158
7296 -158 -156 -111 -51 -102 37 89 103 140 170 100 104 96 12 -24 -133 -163 -181 -214 -189 -126 -64 -53 19 93 86 175 171 177 134 92 91 2
7328 2 -41 -44 -53 -118 -166 -125 -170 -2 -4 61 61 38 120 154 162 86 119 62 12 -68 -91 -121 -155 -158 -183 -148 -40 -23 22 85 91 130 116
7361 116 128 105 53 -8 -34 -52 -103 -78 -115 -122 -176 -33 30 -35 92 94 125 151 108 74 121 15 10 -37 5 -119 -160 -128 -84
7390 -84 -103 -97 -31 -39 42 111 135 105 123 87 77 42 -10 -74 -100 -98 -110 -142 -98 -60 -73 -81 71 77 115 84 140 133 109 69 41 56 18
7423 18 -6 -102 -125 -126 -66 -106 -100 -80 -29 49 50 97 86 114 78 19 39 -28 -40 -77 -139 -132 -158 -141 -78 -122 -84 9 129 69 91 143
7455 143 134 106 85 40 12 -28 -60 -85 -137 -111 -73 -56 -50 20 39 4 79 101 105 106 99 106 -3 -15 -68 -90 -100 -162 -132 -122 -68 -63 -3
7488 -3 28 121 76 53 100 119 166 60 -23 -49 -93 -131 -101 -98 -120 -69 -81 14 33 96 89 102 196 112 85 118 36 -7 -87 -162 -187
7519 -187 -156 -223 -126 -68 -11 -62 31 88 103 146 167 110 141 61 4 -30 -72 -125 -152 -148 -177 -123 -90 -75 63 110 149 172 139 195
7549 195 141 108 84 54 -99 -101 -163 -154 -161 -157 -123 -72 -14 38 68 77 186 134 145 92 54 15 -29 -59 -123 -172 -95 -145 -66 -92 -18
7580 -18 49 43 95 155 208 183 173 124 94 53 -82 -82 -75 -164 -151 -139 -118 -15 31 59 102 149 138 140 137 117 75 8 -44 -77 -150 -176
7612 -176 -118 -164 -127 -24 -24 60 72 143 156 133 124 131 80 48 45 -92 -113 -114 -152 -138 -168 -105 -84 22 16 96 120 180 161 129 135 52
7644 52 14 -51 -99 -151 -163 -160 -173 -96 -105 -10 -30 108 129 156 197 113 150 95 54 36 -99 -97 -122 -114 -179 -78 -113 -49 38 57 119
7675 119 98 188 179 132 109 38 30 -37 -100 -141 -96 -205 -157 -84 -76 39 -1 49 99 131 105 111 62 75 0 -53 -2 -124 -118 -150 -115
7706 -115 -32 -61 -30 -2 35 131 121 121 124 159 116 -7 -5 -20 -53 -83 -150 -121 -91 -80 -49 -39 51 37 100 124 169 89 58 81 14
7737 14 -43 -71 -74 -155 -94 -113 -149 -94 -15 12 39 90 117 148 122 83 98 2 51 -102 -177 -124 -148 -64 -111 -60 -75 33 -12 18
7767 18 36 53 85 103 67 24 0 -24 -21 -35 -47 -134 -139 -61 -55 -24 0 43 39 123 103 136 52 91 44 3 -34 -54 -35 -84 -37 -64
7799 -64 -66 -6 42 20 81 14 88 49 71 54 26 6 -63 -46 -57 -122 -112 -124 -22 -35 -58 41 67 98 129 112 102 89 49 0
7829 0 -3 -106 -79 -81 -43 -50 -11 -49 11 8 5 66 34 88 87 116 30 -6 -18 35 -20 -123 -62 -106 -69 -55 -4 -7 0 25 76 80 22 92
7863 92 12 78 -30 -34 -3 -49 -69 -50 -64 -32 -3 25 14 14 95 61 90 34 -17 -14 36 -10 -25 -108 -38 4 -16 12 22 -4 -1 10
7895 10 26 45 -33 -3 2 -20 12 -55 -41 2 -25 25 37 30 32 25 49 56 29 21 -15 38 -26 -19 -21 -11 0 0 19 -13 38 -24 13 69 78
7930 78 44 51 -31 -13 -55 -3 -55 -78 -66 -17 -17 -81 -51 30 38 52 9 50 84 64 23 -2 -11 -7 -90 -66 -63 -45 -45 -11 24 78 35 42
7964 42 48 85 39 46 44 -8 -85 -58 -86 -106 -111 -77 -90 -29 31 66 6 14 91 68 76 60 23 14 -47 -35 -90 -56 -64 -79 -77 -33 25 27 57
7999 57 117 81 115 75 36 26 10 -47 -60 -43 -60 -125 -74 -82 -104 -9 -11 0 129 55 123 103 36 25 -11 -69 -32 -14 -92 -181 -67
8030 -67 -149 -68 -59 -13 60 45 55 90 124 131 85 70 -5 -55 -47 -56 -95 -145 -50 -75 -26 -40 -35 46 73 86 117 144 84 0 51 9 -31
8063 -31 -98 -71 -134 -123 -124 -83 -113 9 27 65 107 141 114 92 120 91 -33 -37 -84 -91 -102 -110 -71 -107 12 3 98 104 76 120 112 81
8095 81 8 93 34 -52 -49 -73 -123 -122 -133 -96 -73 -24 -12 44 65 112 93 123 135 80 17 -13 -20 -47 -68 -94 -80 -28 -49 -89 -15 25
8127 25 100 108 42 133 76 97 50 -6 -4 -89 -68 -75 -75 -100 -86 -27 -94 -65 37 37 76 118 100 134 73 70 35 23 -42 -107 -85 -97 -112
8160 -112 -39 -53 1 45 42 94 66 89 121 108 82 38 24 -27 -36 -113 -132 -105 -116 -83 -28 14 -35 98 114 142 50 24 107 51
8190 51 -15
8191a5
##END NTUPLES=NMR FID
##END=
