##TITLE=1H_AM_NV88.1
 CDCl3
 8 sc, 
 28.11.2023
##JCAMPDX= 6.0         $$ Bruker NMR JCAMP-DX V2.0
##DATA TYPE= NMR FID
##DATA CLASS= NTUPLES
##ORIGIN= UXNMR, Bruker Analytische Messtechnik GmbH
##OWNER= root
$$ XWIN-NMR		Version 3.5
$$ Tue Nov 28 15:42:27 2023 Russian Standard Time (UT+4h)  she@DPX200
##.OBSERVE FREQUENCY= 200.1313
##.OBSERVE NUCLEUS= ^1H
##.DELAY= (6, 6)
##.ACQUISITION MODE= SIMULTANEOUS
##.ACQUISITION SCHEME= undefined
##.AVERAGES= 8
##.DIGITISER RES= 18
##SPECTROMETER/DATA SYSTEM= spect
##.PULSE SEQUENCE= zg30
##.SOLVENT NAME= Acetone
##.SHIFT REFERENCE= (INTERNAL, Acetone, 0, 15.7039)
##AUDIT TRAIL= $$ (NUMBER, WHEN, WHO, WHERE, WHAT)
$$ ##TITLE= Audit trail, XWIN-NMR		Version 3.5
$$ ##JCAMPDX= 5.01
$$ ##ORIGIN= Bruker BioSpin GmbH
$$ ##OWNER= she
$$ F:/spectra/data/she/nmr/H-F/1/audita.txt
$$ ##AUDIT TRAIL=  $$ (NUMBER, WHEN, WHO, WHERE, WHAT)
(   1,<2023-11-28 15:41:15.32 +0400>,<she>,<DPX200>,
      <created by zg, POWCHK disabled, PULCHK disabled
       configuration hash MD5:
       00 E9 B6 7A A2 85 ED C7 34 08 36 98 17 FE 4E 26
       data hash MD5: 16K
       1A D6 39 F9 7F 04 6B 71 94 3B 57 95 51 8B 7F 7D>)
$$ ##END=
$$ 
$$ hash MD5
$$ 98 0B 64 3A 2B 9C 98 E8 6F 6C 65 41 AA 1D ED 64
##$RELAX= 
##$RELAX= 
##$RELAX= 
##$RELAX= 
##$RELAX= 
##$RELAX= 
$$ Bruker specific parameters
$$ --------------------------
##$DU= <F:/spectra>
##$EXPNO= 1
##$NAME= <H-F>
##$PROCNO= 1
##$TYPE= <nmr>
##$USER= <she>
##$AMP= (0..31)
100 100 100 100 100 100 100 100 100 100 100 100 100 100 100 100 100 100 
100 100 100 100 100 100 100 100 100 100 100 100 100 100 
##$AQSEQ= 0
##$AQ_mod= 1
##$AUNM= <au_zg>
##$AUTOPOS= <>
##$BF1= 200.13
##$BF2= 200.13
##$BF3= 200.13
##$BF4= 200.13
##$BF5= 200.13
##$BF6= 200.13
##$BF7= 200.13
##$BF8= 200.13
##$BYTORDA= 1
##$CFDGTYP= 0
##$CFRGTYP= 5
##$CHEMSTR= <none>
##$CNST= (0..31)
1 1 145 1 1 1 1 1 1 1 1 1 1 1 1 1 1 1 1 1 1 1 1 1 1 1 1 1 1 1 1 1 
##$CPDPRG= <>
##$CPDPRG1= <>
##$CPDPRG2= <>
##$CPDPRG3= <>
##$CPDPRG4= <mlev>
##$CPDPRG5= <mlev>
##$CPDPRG6= <mlev>
##$CPDPRG7= <mlev>
##$CPDPRG8= <mlev>
##$CPDPRGB= <>
##$CPDPRGT= <>
##$D= (0..31)
0 1.2 0 0 0 0 0 0 0 0.06 0 0.03 0 0 0 0 0.0002 0 0 0 0 0 0 0 0 0 0 0 0 
0 0 0 
##$DATE= 1701171674
##$DBL= (0..7)
120 120 120 120 120 120 120 120 
##$DBP= (0..7)
150 150 150 150 150 150 150 150 
##$DBP07= 0
##$DBPNAM0= <>
##$DBPNAM1= <>
##$DBPNAM2= <>
##$DBPNAM3= <>
##$DBPNAM4= <>
##$DBPNAM5= <>
##$DBPNAM6= <>
##$DBPNAM7= <>
##$DBPOAL= (0..7)
0.5 0.5 0.5 0.5 0.5 0.5 0.5 0.5 
##$DBPOFFS= (0..7)
0 0 0 0 0 0 0 0 
##$DE= 6
##$DECBNUC= <off>
##$DECIM= 32
##$DECNUC= <off>
##$DECSTAT= 4
##$DIGMOD= 1
##$DIGTYP= 9
##$DL= (0..7)
0 120 120 120 120 120 120 120 
##$DP= (0..7)
150 150 150 150 150 150 150 150 
##$DP07= 0
##$DPNAME0= <>
##$DPNAME1= <>
##$DPNAME2= <>
##$DPNAME3= <>
##$DPNAME4= <>
##$DPNAME5= <>
##$DPNAME6= <>
##$DPNAME7= <>
##$DPOAL= (0..7)
0.5 0.5 0.5 0.5 0.5 0.5 0.5 0.5 
##$DPOFFS= (0..7)
0 0 0 0 0 0 0 0 
##$DQDMODE= 0
##$DR= 18
##$DS= 0
##$DSLIST= <SSSSSSSSSSSSSSS>
$$ [...]
##$SUBNAM2= <"">
##$SUBNAM3= <"">
##$SUBNAM4= <"">
##$SUBNAM5= <"">
##$SUBNAM6= <"">
##$SUBNAM7= <"">
##$SUBNAM8= <"">
##$SUBNAM9= <"">
##$SW= 18.0517328524113
##$SWIBOX= (0..15)
0 0 2 0 0 0 0 0 0 0 0 0 0 0 0 0 
##$SW_h= 3612.71676300578
##$TD= 16384
##$TD0= 1
##$TE= 0
##$TE2= 300
##$TE3= 300
##$TEG= 300
##$TL= (0..7)
0 120 120 120 120 120 120 120 
##$TP= (0..7)
150 150 150 150 150 150 150 150 
##$TP07= 0
##$TPNAME0= <>
##$TPNAME1= <>
##$TPNAME2= <>
##$TPNAME3= <>
##$TPNAME4= <>
##$TPNAME5= <>
##$TPNAME6= <>
##$TPNAME7= <>
##$TPOAL= (0..7)
0.5 0.5 0.5 0.5 0.5 0.5 0.5 0.5 
##$TPOFFS= (0..7)
0 0 0 0 0 0 0 0 
##$TUNHIN= 0
##$TUNHOUT= 0
##$TUNXOUT= 0
##$USERA1= <user>
##$USERA2= <user>
##$USERA3= <user>
##$USERA4= <user>
##$USERA5= <user>
##$V9= 5
##$VALIST= <valist>
##$VCLIST= <CCCCCCCCCCCCCCC>
##$VD= 0
##$VDLIST= <DDDDDDDDDDDDDDD>
##$VPLIST= <PPPPPPPPPPPPPPP>
##$VTLIST= <TTTTTTTTTTTTTTT>
##$WBST= 1024
##$WBSW= 4
##$XGAIN= (0..3)
0 0 0 0 
##$XL= 0
##$YL= 0
##$YMAX_a= 393538
##$YMIN_a= -428918
##$ZGOPTNS= <>
##$ZL1= 120
##$ZL2= 120
##$ZL3= 120
##$ZL4= 120
##$ABSF1= 10
##$ABSF2= 0
##$ABSG= 5
##$ABSL= 3
##$ALPHA= 0
##$AQORDER= 0
##$ASSFAC= 0
##$ASSFACI= 0
##$ASSFACX= 0
##$ASSWID= 0
##$AUNMP= <proc_1d>
##$AZFE= 0.1
##$AZFW= 0.1
##$BCFW= 1
##$BC_mod= 2
##$BYTORDP= 1
##$COROFFS= 0
##$CY= 11.3945322036743
##$DATMOD= 1
##$DC= 2
##$DFILT= <>
##$DTYPP= 0
##$F1P= 15.7292609196834
##$F2P= 12.9074282941183
##$FCOR= 0.5
##$FTSIZE= 0
##$FT_mod= 4
##$GAMMA= 1
##$GB= 0.15
##$INTBC= 1
##$INTSCL= 1
##$ISEN= 128
##$LB= 0.24
##$LEV0= 0
##$LPBIN= 0
##$MAXI= 10000
##$MC2= 0
##$MEAN= 0
##$ME_mod= 0
##$MI= 1.114404
##$NCOEF= 0
##$NC_proc= 0
##$NLEV= 6
##$NOISF1= 3.799351
##$NOISF2= 2.8
##$NSP= 1
##$NTH_PI= 0
##$NZP= 0
##$OFFSET= 15.70392
##$PC= 1
##$PHC0= -24387.04
##$PHC1= 11.8527
##$PH_mod= 1
##$PKNL= yes
##$PPARMOD= 0
##$PSCAL= 0
##$PSIGN= 0
##$REVERSE= no
##$SF= 200.130013532006
##$SI= 16384
##$SIGF1= 3
##$SIGF2= 2
##$SINO= 400
##$SIOLD= 16384
##$SREGLST= <1H.CDCl3>
##$SSB= 0
##$STSI= 0
##$STSR= 0
##$SW_p= 3612.71676300578
##$SYMM= 0
##$S_DEV= 0
##$TDeff= 0
##$TDoff= 0
##$TI= <>
##$TILT= no
##$TM1= 0
##$TM2= 0
##$TOPLEV= 0
##$USERP1= <user>
##$USERP2= <user>
##$USERP3= <user>
##$USERP4= <user>
##$USERP5= <user>
##$WDW= 1
##$XDIM= 8192
##$YMAX_p= 0
##$YMIN_p= 0
$$ End of Bruker specific parameters
$$ ---------------------------------
##NTUPLES= NMR FID
##VAR_NAME=  TIME,          FID/REAL,        FID/IMAG
##SYMBOL=    X,             R,               I
##VAR_TYPE=  INDEPENDENT,   DEPENDENT,       DEPENDENT
##VAR_FORM=  AFFN,          ASDF,            ASDF
##VAR_DIM=   8192,          8192,            8192
##UNITS=     SECONDS,       ARBITRARY UNITS, ARBITRARY UNITS
##FACTOR=    0.0002768,     1,               1
##FIRST=     0,             0,               0
##LAST=      2.2672688,     0,               0
##MIN=       0,             -428918,         0
##MAX=       2.2672688,     393538,          0
$$ Real data points
##PAGE= N=1
##DATA TABLE= (X++(R..R)), XYDATA
$$ plain form
0 0 0 0 0 0 0 0 0 0 0 0 0 0 0 0 0 0 0 -8 5 -8 8 -8 9 -12 16 -16 20 -24 25 -31 33 -40 44 -52 56 -66 71 -81 91
39 91 -100 114 -123 139 -152 168 -187 206 -228 249 -276 302 -336 370 -408 451 -499 554 -618 691
59 691 -777 885 -1011 1173 -1389 1682 -2120 2832 -4210 7941 -43064 -175582 -322238 -428918
73 -428918 -365972 -289970 -237603 -98561 108503 226285 287847 368164 393538 297323 176630
84 176630 74054 -64867 -225424 -315943 -338661 -339544 -300190 -184936 -38494 85562 193280
95 193280 298096 352917 325315 255512 176450 55034 -101140 -216440 -273816 -322091 -335172
106 -335172 -256498 -136139 -39047 74759 216563 298302 300603 293579 261426 145962 4235
117 4235 -92064 -183159 -284559 -318222 -272493 -216525 -146497 -20496 113387 194481 248987 293570
$$ packed form
0@%%%%%%%%%%%%%%%%%qJ3j3J6j6J7k1K8l2L6m4M9n6O4p3Q4r6J08j22J37j52J72
39I1j91K14k37K62k91L20l55L93m34M77n25N78o38P06p78Q59r50J053j172J309
59F91j468J662j896K184k562L071l802M952p042J2151n1005j32518j46656j06680
73d28918O2946P6002N2367J39042K07064J17782O1562Q0317K5374r6215j20693
84A76630j02576j38921j60557r0519k2718q83L9354J15254J46442J24056J07718
95A93280J04816N4821k7602o9803p9062j21416j56174j15300n7376m8275j3081
106c35172P8674J20359R7092J13806J41804Q1739K301p024l2153j15464j41727
117D235r6299r1095j01400l3663M5729N5968P0028J26001J33883Q1094N4506M4583
$$ plain form
129 293570 280443 201912 110449 19248 -92931 -199310 -254452 -264697 -253180 -204590 -106946
140 -106946 4728 96521 176696 246966 270911 235876 177057 107040 4546 -109664 -184938
151 -184938 -224899 -253975 -242939 -170028 -80340 -1647 92553 189395 234069 231693 219141 175216
163 175216 78842 -22224 -95448 -166930 -229838 -237694 -197547 -148914 -82093 18074 111740 167679
175 167679 205033 226074 200601 132960 59241 -15339 -101196 -173978 -205007 -203812 -184930 -135329
187 -135329 -52335 32920 99996 158943 203546 205734 167528 116979 54335 -31211 -112661 -160036
199 -160036 -185367 -197149 -170494 -104553 -35098 29415 103867 166493 186126 177003 157051 107702
211 107702 27983 -45534 -100432 -151683 -185806 -176855 -138339 -92945 -31972 46070 111154 147485
$$ packed form
129B93570j3127p8531r1463r1201j12179j06379n5142j0245J1517M8590R7644
140a06946J11674R1793Q0175P0270K3945l5035n8819p0017j02494j14210p5274
151a84938l9961k9076J1036P2911Q9688P8693R4200R6842M4674k376j2552m3925
163A75216r6374j01066p3224p1482o2908p856M0147M8633O6821J00167R3666N5939
175A67679L7354K1041k5473o7641p3719p4580q5857p2782l1029J195J8882M9601
187a35329Q2994Q5255O7076N8947M4603K188l8206n0549o2644q5546q1450m7375
199a60036k5331j1782K6655O5941O9455O4513P4452O2626J9633r123j9952m9349
211A07702p9719p3517n4898n1251l4123Q951L8516M5394O0973P8042O5084L6331
$$ plain form
223 147485 168530 171635 138868 79440 18793 -41289 -105174 -152465 -165408 -155090 -130848 -82018
235 -82018 -12366 51660 100312 141799 165870 154188 116751 72437 16686 -51819 -108049 -137390
247 -137390 -151933 -150804 -117613 -61473 -6731 46536 102886 141768 147961 135476 111248 63447
259 63447 -552 -55387 -96916 -132338 -148723 -132312 -96776 -55641 -2820 57622 103248 126402
271 126402 136745 130048 95454 44428 -4596 -52840 -100609 -130009 -131769 -117484 -91230 -45427
283 -45427 11662 59455 95022 123218 132889 114100 79315 39976 -8689 -62022 -99954 -117443
295 -117443 -123079 -112672 -77713 -30035 14257 57052 97821 120068 117434 101428 74663 30788
307 30788 -20561 -61608 -91550 -114034 -117984 -97066 -63979 -27018 17737 63942 94723 107476
$$ packed form
223A47485K1045L105l2767n9428o0647o0082o3885m7291j2943J0318K4242M8830
235h2018O9652O4026M8652M1487K4071j1682l7437m4314n5751o8505n6230k9341
247a37390j4543J129L3191N6140N4742N3267N6350L8882O193j2485k4228m7801
259F3447o3999n4835m1529l5422j6385J6411L5536M1135N2821O0442M5626K3154
271A26402J0343o697l4594n1026m9024m8244m7769k9400j760J4285K6254M5803
283d5427N7089M7793L5567K8196R671j8789l4785l9339m8665n3333l7932j7489
295a17443n636J0407L4959M7678M4292M2795M0769K2247k634j6006k6765m3875
307C0788n1349m1047k9942k2484l950K0918L3087L6961M4755M6205L0781J2753
$$ plain form
319 107476 109512 96216 61748 18438 -21104 -59147 -93284 -109166 -103716 -86980 -60189 -18718
331 -18718 26762 61864 87265 104834 104453 82752 51488 16948 -24035 -64283 -89258 -98558 -97965
344 -97965 -82645 -49287 -9794 25923 59801 88529 99789 92209 75017 48447 9637 -30967
356 -30967 -61421 -82863 -96218 -92567 -70514 -40965 -8637 28698 63583 83696 89990 87105 70329
369 70329 38131 2305 -29536 -59512 -83296 -90255 -81110 -63871 -37802 -1581 34110 60103
381 60103 78142 87682 81235 59113 31264 1024 -32853 -62619 -78455 -81985 -76784 -58862 -28214
394 -28214 4569 33261 59402 78571 82076 71294 53580 28044 -5507 -37357 -59412 -73836
406 -73836 -80040 -71242 -48982 -22634 5369 36131 61508 73421 74515 67660 48781 19563 -10105
$$ packed form
319A07476K036j3296l4468m3310l9542l8043l4137j5882N450J6736K6791M1471
331a8718M5480L5102K5401J7569l81k1701l1264l4540m0983m0248k4975r300N93
344i7965J5320L3358L9493L5717L3878K8728J1260p580j7192k6570l8810m0604
356c0967l0454k1442j3355L651K2053K9549L2328L7335L4885K0113O294k885j6776
369G0329l2198l5826l1841k9976k3784o959R145J7239K6069L6221L5691K5993
381F0103J8039R540o447k2122k7849l0240l3877k9766j5836l530N201J7922L0648
394b8214L2783K8692K6141J9169L505j0782j7714k5536l3551l1850k2055j4424
406g3836o204Q798K2260K6348K8003L0762K5377J1913J094o855j8879k9218k9668
$$ plain form
419 -10105 -35628 -58489 -73501 -73752 -62143 -44176 -19234 11619 39227 57834 69235 72003 61189
432 61189 39428 14466 -11562 -38742 -59663 -68294 -66906 -58094 -38747 -11200 15720 38147 57301
445 57301 68462 65910 52936 34989 11115 -17167 -41277 -56237 -64518 -64682 -52128 -30567 -7263
458 -7263 16543 40722 57852 63204 59992 49923 30221 4258 -19770 -39461 -55624 -63301 -58519
471 -58519 -45086 -27374 -4361 21071 41625 53890 59739 57302 43932 23234 1498 -20333
483 -20333 -41200 -54828 -57928 -52963 -41768 -22618 1329 22845 39771 52781 57703 51306 37427
496 37427 20153 -1145 -24184 -41574 -50962 -54457 -50375 -36254 -16285 3466 23164 41353 51876
509 51876 52535 46606 34816 15851 -6137 -25036 -39785 -50217 -52475 -44731 -30940 -14102 6037
$$ packed form
419a0105k5523k2861j5012k51J1609J7967K4942L0853K7608J8607J1401K768j0814
432F1189k1761k4962k6028k7180k0921q631J388Q812J9347K7547K6920K2427J9154
445E7301J1161k552j2974j7947k3874k8282k4110j4960q281j64J2554K1561K3304
458g263K3806K4179J7130N352l212j0069j9702k5963k4028j9691j6163p677M782
471e8519J3433J7712K3013K5432K0554J2265N849k437j3370k0698k1736k1831
483b0333k0867j3628l100M965J1195J9150K3947K1516J6926J3010M922o397j3879
496C7427j7274k1298k3039j7390r388l495M082J4121J9969J9751J9698J8189J0523
509E1876O59n929j1790j8965k1988j8899j4749j0432k258P744J3791J6838K0139
$$ plain form
522 6037 26403 40894 48167 49671 43825 29508 10797 -7752 -25414 -40574 -48478 -47490 -40323 -28075
536 -28075 -10014 10005 26650 38919 46870 47065 38334 24562 8587 -9852 -27764 -39653 -44593
549 -44593 -44412 -37515 -22960 -5432 11123 26727 39559 44917 42104 34339 22005 4598 -13486
562 -13486 -27691 -37863 -43642 -41784 -32233 -18858 -3501 13470 28836 38244 41452 39590 31497
575 31497 17130 808 -14315 -27909 -38070 -41239 -37353 -28698 -16209 55 16151 28456 36441
588 36441 39958 36662 26610 13364 -798 -16052 -29208 -36366 -37725 -34570 -25875 -11862 3148
601 3148 16520 28139 36242 37356 32261 23578 11309 -3860 -18023 -28145 -34445 -36358 -31745 -21533
615 -21533 -9107 4163 17957 28882 34148 34310 30205 21024 7768 -5956 -17888 -27876 -33977
$$ packed form
522F037K0366J4491P273J504n846j4317j8711j8549j7662j5160p904R88P167J2248
536b8075J8061K0019J6645J2269P951J95q731j3772j5975j8439j7912j1889m940
549d4593J81O897J4555J7528J6555J5604J2832N358k813p765j2334j7407j8084
562a3486j4205j0172n779J858R551J3375J5357J6971J5366R408L208j862q093
575C1497j4367j6322j5123j3594j0161l169L886Q655J2489J6264J6096J2305P985
588C6441L517l296j0052j3246j4162j5254j3156p158j359L155Q695J4013J5010
601C148J3372J1619Q103J114n095q683j2269j5169j4163j0122o300j913M613J0212
615b1533J2426J3270J3794J0925N266J62m105r181j3256j3724j1932r988o101
$$ plain form
628 -33977 -33850 -28174 -19196 -7419 6476 19064 27604 32308 32890 27646 17504 5640 -6555 -18716
642 -18716 -28027 -31842 -30906 -26274 -17142 -4463 7889 18440 26934 31602 30233 24230 15523 4182
656 4182 -8541 -19391 -26421 -29949 -29434 -23468 -13600 -2662 8673 19341 26774 29217 27562 22291
670 22291 12998 1330 -9782 -19006 -25981 -29029 -26802 -20396 -11677 -1066 10439 19820 25408 27687
684 27687 26076 19744 10124 -122 -10317 -19685 -25639 -26877 -24432 -18842 -9754 1199 11192 18978
698 18978 24792 26646 23510 17118 8753 -1302 -11641 -19449 -23942 -25333 -22849 -16227 -7202 2224
712 2224 11461 19393 23957 24225 21324 15441 6643 -3291 -12129 -18866 -23293 -23958 -20368 -13882 -5721 3469
728 3469 12637 19232 22547 22794 19760 12996 4272 -4357 -12540 -19264 -22581 -21969 -18386 -12396 -3875 5267
$$ packed form
628c3977J27N676Q978J1777J3895J2588Q540M704N82n244j0142j1864j2195j2161
642a8716r311l815R36M632R132J2679J2352J0551Q494M668j369o003q707j1341
656D182j2723j0850p030l528N15N966R868J0938J1335J0668P433K443j655n271
670B2291r293j1668j1112r224o975l048K227O406Q719J0611J1505R381N588K279
684B7687j611o332r620j0246j0195r368n954j238K445N590R088J0953R993P786
698A8978N814J854l136o392q365j0055j0339p808m493j391K484O622R025R426
712B224R237P932M564K68k901n883q798r934q838o737m427o65L590O486Q161R190
728C469R168O595L315K47l034o764q724q629q183o724l317O12L583N990Q521R142
$$ plain form
744 5267 12971 18533 21924 21629 17507 10885 3285 -5354 -13348 -18682 -21027 -20575 -16952 -10060 -1993 5855
760 5855 13091 18627 20844 19543 15641 9520 1566 -6656 -13342 -18030 -20219 -19139 -14703 -8300 -958
775 -958 6796 13743 17983 19429 18226 14198 7504 -49 -7115 -13479 -17944 -19237 -17313 -13117 -7128
790 -7128 455 7837 13508 17292 18717 16990 12313 6165 -666 -7826 -13781 -17055 -17861 -16310 -12032
805 -12032 -5554 1450 7859 13397 16989 17543 15323 11134 5182 -1746 -8359 -13369 -16348 -17119 -15001
820 -15001 -10302 -4392 1924 8336 13436 16125 16286 14276 9877 3891 -2579 -8339 -13047 -15880 -15916 -13426
836 -13426 -9180 -3547 2938 8788 13005 15282 15501 12920 8287 2838 -3106 -8908 -13100 -15020 -14715
851 -14715 -12383 -8011 -2125 3742 8805 12834 14889 14323 11538 7311 1912 -4041 -9145 -12625 -14349
$$ packed form
744E267P704N562L391k95m122o622p600q639p994n334k345M52L623O892Q067P848
760E855P236N536K217j301l902o121p954q222o686m688k189J080M436O403P342
775i58P754O947M240J446j203m028o694p553p066o364m465j293J924M196N989
790g128P583P382N671L784J425j727m677o148o831p160n955l274q06J551M278
805a2032O478P004O409N538L592N54k220m189n952o928o613n010k979p71K118
820a5001M699N910O316O412N100K689J61k010m399n986o470n760m708k833l6K490
836a3426M246N633O485N850M217K277K19k581m633n449n944n802m192j920L05
851a4715K332M372N886N867N063M029K055n66k785m227n399n953n104l480j724
$$ plain form
866 -14349 -13908 -11133 -6543 -1266 4146 9198 12663 13937 13136 10645 6195 760 -4572 -9053 -12363
881 -12363 -13754 -12682 -9767 -5630 -502 4860 9299 12058 13163 12385 9344 4859 -4 -4948 -9355
896 -9355 -12149 -12754 -11677 -8885 -4609 553 5310 9194 11847 12690 11267 8183 4113 -699 -5566 -9361
912 -9361 -11625 -12205 -11003 -7823 -3551 1062 5551 9332 11521 11810 10369 7466 3294 -1465 -5694 -9011
928 -9011 -11223 -11573 -9916 -6850 -2963 1571 5859 9106 10867 11031 9624 6469 2408 -1836 -5836 -9135
944 -9135 -10774 -10667 -9067 -6093 -2075 2247 6082 9012 10559 10502 8590 5586 1796 -2387 -6259 -8969
960 -8969 -10224 -10127 -8400 -5231 -1280 2642 6200 8945 10123 9718 7855 4937 1099 -2907 -6294 -8731
976 -8731 -9927 -9519 -7471 -4491 -816 2969 6447 8681 9600 9127 7197 4036 428 -3151 -6332 -8619
$$ packed form
866a4349M41K775M590N277N412N052L465J274q01k491m450n435n332m481l310
881a2363j391J072K915M137N128N362M439K759J105p78l041m485m863m944m407
896i355k794o05J077K792M276N162M757L884K653Q43j423l084m070m812m867l795
912i361k264n80J202L180M272M613M489L781K189K89j441k903m172m759m229l317
928i011k212l50J657L066L887M534M288L247J761J64j407l155m061m244m000l299
944i135j639J07J600K974M018M322L835K930J547n7j912l004l790m183l872k710
960h969j255R7J727L169L951L922L558K745J178m05j863k918l838m006l387k437
976h731j196M08K048K980L675L785L478K234R19m73j930l161l608l579l181k287
$$ plain form
992 -8619 -9437 -8674 -6784 -3870 -212 3462 6363 8436 9222 8518 6406 3467 54 -3517 -6461 -8337
1008 -8337 -8903 -8194 -6192 -3112 343 3659 6469 8263 8777 7822 5833 2987 -512 -3841 -6375 -8055
1024 -8055 -8564 -7687 -5492 -2623 673 3886 6472 8050 8227 7390 5260 2286 -931 -3965 -6464 -8008
1040 -8008 -8104 -6994 -4903 -2105 1185 4163 6407 7776 7908 6753 4537 1744 -1310 -4259 -6486 -7663
1056 -7663 -7584 -6472 -4293 -1394 1695 4340 6423 7539 7363 6065 3912 1145 -1889 -4492 -6372 -7355
1072 -7355 -7210 -5807 -3586 -888 2029 4562 6418 7204 6922 5603 3386 654 -2220 -4588 -6387 -7122
1088 -7122 -6746 -5312 -3136 -470 2350 4697 6277 6927 6515 5024 2862 236 -2415 -4655 -6245 -6716
1104 -6716 -6301 -4800 -2625 -38 2562 4699 6179 6596 6056 4518 2395 -117 -2676 -4720 -5998 -6463
$$ packed form
992h619q18P63J890K914L658L674K901K073P86p04k112k939l413l571k944j876
1008h337n66P09K002L080L455L316K810J794N14r55j989k846l499l329k534j680
1024h055n09Q77K195K869L296L213K586J578J77q37k130k974l217l034k499j544
1040h008r6J110K091K798L290K978K244J369J32j155k216k793l054k949k227j177
1056g663P9J112K179K899L089K645K083J116j76j298k153k767l034k603j880r83
1072g355J45J403K221K698K917K533J856P86k82j319k217k732k874k368j799p35
1088g122L76J434K176K666K820K347J580O50m12j491k162k626k651k240j590m71
1104f716M15J501K175K587K600K137J480M17n40j538k123k512k559k044j278m65
$$ plain form
1120 -6463 -5882 -4315 -2103 345 2687 4708 6005 6228 5640 4192 2019 -552 -2904 -4649 -5915 -6206
1136 -6206 -5376 -3868 -1821 643 2926 4681 5706 6050 5239 3620 1541 -704 -2920 -4701 -5701 -5748
1152 -5748 -5031 -3487 -1335 1017 3076 4621 5581 5639 4746 3166 1173 -1120 -3187 -4713 -5431 -5453 -4559
1169 -4559 -2976 -876 1216 3238 4672 5375 5246 4323 2770 795 -1347 -3261 -4643 -5379 -5166 -4178
1185 -4178 -2565 -638 1478 3342 4552 5179 4989 3960 2345 389 -1551 -3400 -4540 -5080 -4838 -3768
1201 -3768 -2183 -261 1754 3380 4436 4943 4585 3582 2017 171 -1757 -3418 -4438 -4777 -4478 -3433
1217 -3433 -1832 103 1877 3361 4456 4671 4211 3230 1668 -268 -1995 -3424 -4317 -4594 -4085 -2932
1233 -2932 -1418 329 2072 3444 4290 4418 3878 2784 1305 -522 -2199 -3467 -4261 -4325 -3744 -2652 -1103
$$ packed form
1120f463N81J567K212K448K342K021J297K23n88j448k173k571k352j745j266k91
1136f206Q30J508K047K464K283J755J025L44q11j619k079k245k216j781j000m7
1152e748P17J544K152K352K059J545R60N8q93j580j993k293k067j526p18k2Q94
1169d559J583K100K092K022J434P03j29r23j553j975k142j914j382p36K13R88
1185d178J613J927K116J864J210O27j90j029j615j956j940j849j140n40K42J070
1201c768J585J922K015J626J056N07l58j003j565j846j928j661j020l39K99J045
1217c433J601J935J774J484J095K15m60r81j562j936j727j429q93k77N09J153
1233b932J514J747J743J372Q46J28n40j094j479j827j677j268p94o4N81J092J549
$$ plain form
1250 -1103 666 2267 3441 4148 4198 3609 2470 935 -733 -2217 -3526 -4047 -4062 -3442 -2298 -782 784
1267 784 2281 3448 3975 3927 3333 2160 622 -926 -2294 -3407 -3867 -3770 -3165 -1961 -536 988 2409
1284 2409 3403 3860 3681 3026 1828 404 -1078 -2404 -3303 -3716 -3476 -2844 -1687 -265 1194 2386 3247
1301 3247 3613 3465 2735 1540 165 -1190 -2419 -3247 -3549 -3325 -2550 -1464 -36 1297 2382 3217 3433
1318 3433 3129 2431 1294 -25 -1418 -2451 -3114 -3318 -3026 -2248 -1136 106 1371 2402 3095 3302 2970
1335 2970 2195 1046 -250 -1379 -2434 -3005 -3084 -2753 -2003 -991 334 1457 2409 2987 3069 2632 1909 787
1353 787 -354 -1457 -2400 -2863 -2948 -2520 -1796 -741 493 1481 2353 2817 2891 2477 1703 661 -446 -1525
1371 -1525 -2338 -2777 -2759 -2434 -1605 -535 505 1511 2299 2626 2647 2195 1490 457 -544 -1506 -2239 -2645 -2624
$$ packed form
1250a103J769J601J174P07N0n89j139j535j668j484j309n21j5O20J144J516J566
1267G84J497J167N27m8n94j173j538j548j368j113m60R7O05J204J425J524J421
1284B409R94M57j79o55j198j424j482j326q99m13K40O32J157J422J459J192Q61
1301C247L66j48p30j195j375j355j229q28l02K24P75J086J428J333J085Q35K16
1318C433l04o98j137j319j393j033o63k04K92P78J112J242J265J031O93K07l32
1335B970p75j149j296j129j055n71p9L31P50J012J325J123R52N78Q2m37p23j122
1353G87j141j103r43m63q5M28P24J055J234R88Q72M64P4m14p74j042j107j079
1371a525q13m39J8L25Q29J070J040J006P88L27K1m52p05j033j001r62p33m06K1
$$ plain form
1390 -2624 -2143 -1372 -459 639 1553 2252 2514 2482 2076 1269 346 -677 -1510 -2136 -2434 -2343 -1902 -1204 -257 721
1410 721 1528 2154 2415 2352 1845 1120 178 -772 -1599 -2155 -2365 -2238 -1765 -972 -126 837 1520 2055 2279 2099
1430 2099 1651 914 -5 -809 -1552 -2072 -2216 -2093 -1566 -922 19 847 1596 2023 2192 1951 1526 761 -53 -873
1450 -873 -1585 -2005 -2095 -1936 -1404 -676 134 927 1572 1964 2083 1881 1344 593 -170 -940 -1559 -1907 -2000 -1810 -1252
1471 -1252 -528 236 942 1503 1892 1927 1688 1205 505 -306 -1026 -1539 -1858 -1909 -1648 -1113 -431 302 997 1507
1491 1507 1858 1830 1590 1089 406 -329 -1029 -1532 -1793 -1757 -1459 -1035 -320 411 1038 1526 1813 1719 1449 887 299
1512 299 -428 -1077 -1507 -1754 -1670 -1316 -859 -211 448 1058 1484 1623 1609 1336 767 149 -530 -1088 -1395 -1593 -1494
1533 -1494 -1248 -719 -43 551 1057 1399 1578 1523 1146 671 53 -548 -1071 -1397 -1519 -1419 -1109 -645 18 528
$$ packed form
1390b624M81P71R13J098R14O99K62l2m06q07r23j023q33o26k98R1M41O98R47R78
1410G21Q07O26K61o3n07p25r42r50q27n56k10J27M73P93Q46R63O83N35K24j80
1430B099m48p37r19q04p43n20j44J23N27O44R41Q28P49M27J69k41m25p65q14q20
1450h73p12m20r0J59N32P28Q10P93O45L92J19k02n37p51p63p70o19l48r3J90N58
1471a252P24P64P06N61L89L5k39m83p00q11p20n13l19n1K61N35O82P33O95N10
1491A507L51k8k40n01o83p35p00n03k61L6K98M24P15P31O27M88K87r4k70n62n88
1512B99p27o49m30k47Q4L54M57O48O59O10M26J39j4k73n69o18o79n58l07j98R9
1533a494K46N29O76N94N06L42J79n5l77m75o18o01n23l26j22J00L10M64O63N10
$$ plain form
1553 528 1055 1386 1535 1387 1028 537 -13 -566 -1101 -1387 -1482 -1306 -1011 -546 89 629 1018 1338 1491 1287
1573 1287 944 424 -96 -709 -1140 -1347 -1374 -1173 -840 -338 174 746 1152 1302 1346 1172 825 369 -233 -701
1593 -701 -1139 -1260 -1313 -1091 -740 -301 275 790 1041 1274 1249 1046 666 290 -308 -763 -1071 -1252 -1297 -1028 -613
1614 -613 -170 301 743 1122 1156 1216 961 604 136 -320 -732 -1065 -1200 -1148 -863 -566 -71 402 763 1024 1182
1635 1182 1089 880 500 42 -422 -770 -1080 -1096 -1022 -850 -457 -16 418 803 1027 1122 1061 744 365 -55 -473
1656 -473 -784 -1045 -1054 -973 -684 -345 -16 405 816 980 1044 918 698 361 -132 -422 -811 -952 -1029 -874 -607 -234
1678 -234 108 535 807 945 920 850 559 283 -91 -496 -817 -959 -929 -844 -589 -218 202 577 773 977 933 781
1700 781 505 153 -185 -564 -780 -900 -940 -785 -434 -127 222 510 797 900 880 731 481 74 -263 -531 -783
$$ packed form
1553E28N27L31J49j48l59m91n50n53n35k86r5J76K95M65O35N40L89L20J53k04
1573A287l43n20n20o13m31k07k7K01L33N02N12N72M06J50M4j74l47m56o02m68
1593g01m38j21n3K22L51M39N76N15K51K33k5k03l80l76n98m55l08j81m5K69M15
1614f13M43M71M42L79L4O0k55l57m68m56m12l33j35N2K85K97M95M73L61K61J58
1635A182r3k09l80m58m64l48l10j6P4J72L93M41M34L85K24R5o1l17l79m20m18
1656d73l11k61rQ1K89L39L29M21M11J64O4j26k20l37m93k90l89j41p7J55K67L73
1678b34L42M27K72J38k5p0k91k76l74m05l21j42L0Q5K55L71M20L75J96K04m4j52
1700G81k76l52l38l79k16j20m0J55L51L07L49K88K87J03k0j49k50m07l37k68k52
$$ plain form
1721 -783 -848 -876 -746 -409 -108 208 536 740 855 788 628 343 59 -275 -569 -816 -807 -737 -569 -363 -37 294
1743 294 567 772 795 732 572 323 -4 -239 -543 -741 -850 -675 -544 -233 3 307 522 743 755 682 521
1764 521 275 -87 -346 -580 -771 -743 -653 -476 -245 90 336 521 682 724 635 461 142 -69 -371 -568 -778
1785 -778 -715 -601 -381 -148 167 414 538 666 677 573 435 171 -161 -370 -539 -695 -673 -487 -394 -136 189
1806 189 380 543 653 650 443 317 78 -175 -376 -561 -594 -670 -521 -351 -28 146 418 586 598 598 499 333 40
1829 40 -155 -350 -503 -605 -582 -456 -236 -10 264 405 564 546 588 485 249 -4 -247 -427 -587 -590 -560 -401
1851 -401 -155 5 211 420 584 555 488 379 209 -8 -215 -410 -624 -575 -469 -361 -112 20 195 436 467
1872 467 593 458 397 202 -52 -275 -370 -529 -556 -453 -324 -136 122 213 364 540 528 414 331 125 -26 -266
$$ packed form
1721g83o5k8J30L37L01L16L28K04J15o7j60k85k84l34k94k47RP0J68K06L26L31
1743B94K73K05K3o3j60k49l27k35l04j98j09J75J31L11K36L04K15K21J2p3j61
1764E21k46l62k59k34j91K8R0J77K31L35K46J85J61M2q9j74l19k11l02j97k10
1785g78O3J14K20K33L15K47J24J28J1j04j38k64l32k09j69j56K2J86R3K58L25
1806A89J91J63J10lk07j26k39k53k01j85l3p6J49J70L23J74K72J68J2%r9j66k93
1829D0j95j95j53j02K3J26K20K26K74J41J59j8M2j03k36k53k43j80j60lL0J59
1851d01K46J60K06K09J64k9o7j09j70k17k07j95k14M9J06J08K49J32J75K41L1
1872D67J26j35o1j95k54k23r5j59k7J03J29J88K58R1J51J76j2j14q3k06j51k40
$$ plain form
1894 -266 -405 -524 -509 -424 -358 -118 100 334 394 479 482 412 315 91 -113 -280 -405 -520 -482 -405 -221 -114 53 345
1918 345 394 490 413 393 254 81 -110 -300 -413 -478 -451 -324 -184 -35 161 315 444 466 416 349 184 42 -188
1941 -188 -323 -403 -440 -399 -334 -212 -61 175 264 359 399 402 326 186 -24 -226 -314 -376 -384 -384 -274 -170 16 180 263 393
1967 393 411 324 249 115 -29 -183 -313 -420 -374 -343 -275 -136 92 176 329 396 331 333 182 89 8 -174 -319 -393 -358
1992 -358 -293 -260 -106 43 204 316 389 404 311 200 53 -63 -238 -297 -309 -359 -298 -157 -74 129 272 303 394 373
2016 373 345 201 37 -78 -188 -321 -330 -339 -237 -154 -62 103 196 324 331 325 256 122 21 -131 -209 -325 -350 -339 -198
2041 -198 -115 0 163 213 319 283 270 250 91 13 -125 -261 -308 -367 -327 -173 -131 53 130 301 279 290 256 221 69
2066 69 -53 -180 -322 -333 -332 -261 -238 -53 46 187 232 300 284 234 170 50 -49 -135 -238 -244 -308 -225 -175 -27 33 225 271
$$ packed form
1894b66j39j19J5Q5O6K40K18K34O0Q5Lp0r7k24k04j67j25j15L8P7J84J07J67K92
1918C45M9R6p7k0j39j73j91j90j13o5K7J27J40J49J96J54J29K2n0o7j65j42k30
1941a88j35q0l7M1O5J22J51K36Q9R5M0Lp6j40k10k02q8o2q%J10J04J86J64Q3J30
1967C93J8q7p5j34j44j54j30j07M6L1O8J39K28Q4J53O7o5Kj51r3q1j82j45p4L5
1992c58O5L3J54J49J61J12P3J5r3j11j47j16j75n9j2n0O1J41Q3K03J43L1R1k1
2016C73k8j44j64j15j10j33rrJ02Q3R2J65R3J28Poo9j34j01j52p8j16k5J1J41
2041a98Q3J15J63N0J06l6j3k0j59p8j38j36m7n9M0J54M2J84P7J71k2J1l4l5j52
2066F9j22j27j42j1JP1K3J85R9J41M5O8j6n0o4j20r9q6j03oo4Q3N0J48O0J92M6
$$ plain form
2093 271 256 255 202 114 3 -78 -189 -275 -278 -294 -263 -130 -61 65 215 271 314 238 181 119 26 -56 -190 -270 -314 -232 -198 -88
2121 -88 19 156 214 227 312 288 161 90 -21 -108 -190 -194 -266 -264 -145 -132 38 159 211 247 245 194 190 118 -66 -107 -202 -249
2149 -249 -270 -212 -125 -10 22 143 144 160 269 214 152 85 -72 -136 -224 -190 -298 -176 -153 2 86 197 211 257 229 197
2175 197 96 69 -96 -122 -202 -250 -266 -196 -104 6 42 132 165 179 173 165 82 -28 -65 -174 -174 -284 -206 -185 -119 21 3 185
2203 185 204 230 209 208 94 3 -71 -158 -170 -236 -133 -154 -79 2 70 159 174 241 203 128 91 -52 -119 -119 -215 -250 -239 -190 -122
2232 -122 -22 119 160 218 251 162 103 47 -41 -91 -133 -229 -236 -146 -116 -44 62 110 148 190 156 124 152 -8 -75 -89 -134 -154
2260 -154 -216 -130 -96 -87 29 73 120 181 197 132 120 23 21 -141 -181 -202 -198 -180 -75 -41 4 137 141 108 203 147 131 -9 -72
2289 -72 -97 -78 -130 -175 -122 -60 -19 105 105 165 140 178 109 84 -1 -79 -91 -141 -177 -150 -94 -53 0 57 117 123 165 93 65 4 19
$$ packed form
2093B71j5jn3q8j11q1j11q6lj6L1J33O9J26J50N6M3p6n7o2r3q2j34q0m4Q2L4J10
2121h8J07J37N8J3Q5k4j27p1j11q7q2mp2KJ19J3J70J21N2L6kn1mp2j84m1r5m7
2149b49k1N8Q7J15L2J21JJ6J09n5o2o7j57o4q8L4j08J22K3J55Q4J11J4M6k8l2
2175A97j01k7j65k6q0m8j6P0R2J10L6R0L3J4oqq3j10l7j09%j10P8K1O6J40j8J82
2203A85J9K6k1jj14r1p4q7j2o6J03k1P5Q1O8Q9J5O7l8p5l7j43o7%r6l5J1M9O8
2232a22J00J41M1N8L3q9n9n6q8n0m2r6pR0L0P2J06M8L8M2l4l2K8j60o7j4m5k0
2260a54o2Q6L4RJ16M4M7O1J6o5j2r7kj62m0k1MJ8J05L4M5J33Ml3R5n6j6j40o3
2289g2k5J9n2m5N3O2M1J24%O0k5L8o9k5q5p8j2n0l6K7N6M1N3N7O0OM2p2k8o1J5
$$ plain form
2320 19 -106 -145 -163 -110 -131 -67 -60 -27 37 179 148 217 174 104 51 2 -41 -106 -111 -133 -156 -150 -6 37 59 140 133 81 131 116 0
2351 0 -16 -47 -96 -109 -127 -162 -98 -53 -31 92 83 105 175 40 60 25 -61 -49 -132 -177 -134 -119 -99 -36 16 73 105 101 105 159 7
2382 7 28 5 -47 -118 -134 -124 -62 -19 -43 58 86 117 63 85 95 19 -20 1 -83 -141 -75 -86 -63 -25 10 4 118 113 134 93 46
2413 46 39 -13 -115 -101 -111 -82 -92 -107 13 10 96 71 106 128 116 50 33 -22 -26 -83 -88 -103 -47 -54 -14 -30 57 93 93 126 52 42
2445 42 21 5 -49 -132 -74 -55 -45 -69 7 8 101 41 50 117 64 0 46 -15 -76 -54 -95 -60 -17 -21 -21 63 27 16 41 73 52 36
2477 36 21 -23 -19 -86 -49 -44 -46 -7 11 41 5 94 120 78 35 16 24 15 -54 -19 -37 -21 7 -16 -35 14 78 80 133 49 24 61 -16
2510 -16 6 -40 -52 -28 -51 -20 -51 78 2 11 73 52 72 18 -4 -4 -46 -53 -93 -49 -34 -42 -9 44 48 113 103 73 41 63 12 -14
2542 -14 -6 -16 -38 -64 -45 -27 10 29 72 33 20 57 1 55 11 -17 -84 -45 -86 22 -59 -49 12 -30 7 31 61 82 33 30 -7
$$ packed form
2320A9j25l9j8N3k1O4PL3O4J42l1O9m3p0n3m9m3o5nk2k3OJ44M3K2Q1pn2N0j5j16
2351@j6l1m9j3j8l5O4M5K2J23rK2P0j35K0l5q6J2q3m5M3J5K0O3N2N7L2mMN4j52
2382GK1k3n2p1j6J0O2M3k4J01K8L1n4K2J0p6l9K1q4n8O6j1K3L8L5oJ14nK1m1m7
2413D6pn2j02J4j0K9j0j5J20lQ6k5L5K2j2o6j7n5mn7nj5N6pM0j6Q7L6%L3p4j0
2445D2k1j6n4q3N8J9J0k4P6JR3o0RO7n3o4M6o1o1K2m1L5M3m%Q4l6j1K5L2k1j6
2477C6j5m4Mo7L7NkL9J8L0l6Q9K6m2m3j9Qro9L5j8J6K8k3j9M9O4KN3q4k5L7p7
2510a6K2m6j2K4k3L1l1J29p6RO2k1K0n4k2%m2pm0M4J5qL3N3MO5j0l0l2K2n1k6
2542a4Qj0k2k6J9J8L7J9M3l9j3L7n6N4m4k8o7L9m1J08q1J0O1m2L7K4L0K1m9ll7
$$ plain form
2573 -7 -14 -16 -31 -27 -34 -21 -20 -24 49 81 39 74 70 89 20 5 -11 -28 -62 -53 -17 -59 4 -12 52 57 46 -8 70 15 16 8 -49 -22 -63 -51
2609 -51 -55 -32 -23 9 -17 65 39 36 20 82 35 22 -61 -58 -9 -63 -23 -13 -16 17 43 -17 77 52 51 50 32 -4 -9 -4 -28 -65 -88 -5 -25
2644 -25 36 50 34 95 37 7 23 -8 -55 -30 -66 -29 -84 -2 -14 -42 50 49 12 61 47 31 39 -1 56 -45 -25 -106 -43 5 -16
2675 -16 -29 13 33 56 76 13 48 35 24 -16 -69 -50 -26 -12 -22 -52 2 19 34 68 28 25 41 52 5 17 -14 -14 -7 1 -5 -9 -12 33
2709 33 -20 52 87 -4 41 -28 -70 -31 -36 -40 -21 -26 -31 35 -1 12 -32 27 -14 13 91 38 -14 -53 -26 -33 -59 -9 -58 -80 -64 4 5
2742 5 2 31 19 -29 54 -4 -9 -86 -8 -95 -32 35 2 -39 -16 52 9 28 26 32 -8 8 -22 -17 -14 -81 -17 -100 15 65 58 -6 7 -7
2776 -7 -35 9 57 -9 -3 11 -32 -27 -33 -59 -58 -14 27 -38 -10 -15 -17 12 40 28 -66 -56 -20 -7 -18 -48 -23 -73 7 -18 26 28 15 54
2810 54 10 -3 -59 -39 -3 -23 -21 -6 -72 53 -3 15 8 16 35 21 48 -30 4 11 -57 -104 -22 12 -26 36 10 6 37 65 -6 2 33
$$ packed form
2573gpkj5MpJ3JmP3L2m2L5mJ9o9j5j6j7l4RL6m2O3j6O4Nj1n4P8n5Jqn7K7m1J2
2609e1mK3RL2k6Q2k6lj6O2m7j3q3LM9n4M0J0lL3K6o0R4k5jjj8l6nNk4l7k3Q3k0
2644b5O1J4j6O1n8l0J6l1m7K5l6L7n5Q2j2k8R2jl7M9j4j6Qm0N7j01K0q1O3M8k1
2675a6j3M2K0K3K0o3L5j3j1m0n3J9K4J4j0l0N4J7J5L4m0lJ6J1m7J2l1%PQomlM5
2709C3n3P2L5r1M5o9m2L9nmJ9nnO6l6J3m4N9m1K7P8n3n2l9K7pk6N0m9k2J6O8J
2742ElK9j2m8Q3n8np7P8q7O3O7l3m1K3O8m3J9kOm0J6l0NLo7O4q3J15N0po4J3j4
2776gk8M4M8o6OJ4m3Nok6JM4M1o5K8nkK9K8j2r4J0L6J3j1l0K5n0Q0k5M4Kj3L9
2810E4m4j3n6K0L6k0KJ5o6J25n6J8pQJ9j4K7p8L4Po8m7Q2L4l8O2k6mL1K8p1QL1
$$ plain form
2843 33 -34 -5 -2 -18 -52 -53 -8 -27 -62 -16 64 14 18 -6 11 16 -3 -57 -26 -18 -59 49 -24 -18 22 10 49 31 92 37 42 41 -2 -7
2877 -7 -22 -58 -15 -31 -27 -2 23 23 -12 37 21 35 -7 -47 38 10 -34 -76 -45 -20 13 -33 1 13 12 11 -20 -62 39 3 21 15 -7
2910 -7 -51 -36 -32 -29 43 -14 40 67 -10 18 -12 58 1 -9 -46 4 -20 -27 -26 12 14 21 26 -58 36 18 -34 -27 -33 -25 -24 -91 -36 -21 22 0
2946 0 -40 55 -25 28 17 -1 16 17 -12 -9 1 -11 -36 -19 8 23 -6 41 22 -37 3 -10 42 29 25 11 3 5 14 -30 -11 -9 -4 28 48
2981 48 31 -28 -2 -31 -45 5 16 43 46 -23 -30 -24 -21 -28 -54 16 -14 18 4 -2 16 -27 31 -33 40 31 -19 -16 -29 46 8 -22 29 -21
3015 -21 3 -11 -51 -30 19 25 -61 6 -22 -64 -24 19 -1 -39 32 34 -6 -19 5 0 -15 23 29 18 -7 3 -4 -17 -54 -11 10 22 23
3048 23 9 32 -29 13 -4 -3 -72 -5 -32 -47 36 -4 -34 -15 -24 27 4 -63 -8 -16 -27 29 -34 -13 -5 -14 -6 21 -12 39 82 -7 40
3081 40 8 8 -50 37 36 12 2 44 2 -4 34 -5 47 8 33 64 36 17 -39 15 9 -29 21 -39 0 -2 -7 -21 10 -37 6 -22 32
$$ packed form
2843C3o7K9Lj6l4jM5j9l5M6Q0n0Mk4J7Nj9n4L1Qm1J08p3OM0j2L9j8O1n5Njm3n
2877gj5l6M3j6MK5K5%l5M9j6J4m2m0Q5k8m4m2L1K5L3m6L4J2jjl1m2J01l6J8ok2
2910gm4J5MLP2n7N4K7p7K8l0P0n7j0l7N0k4pJL8KPNq4R4j8n2PoQJo7N5J5M3k2
2946@m0R5q0N3j1j8J7Jk9LJ0j2k5J7K7J5k9M7j9n9M0j3N2j3mj4qKRm4J9KNL2K0
2981D8j7n9K6k9j4N0J1K7Lo9pOLpk6P0l0L2j4oJ8m3N8o4P3rn0Lj3P5l8l0N1n0
3015b1K4j4m0K1M9Oq6O7k8m2M0M3k0l8P1Km0j3K4nj5L8Oj1k5J0pj3l7M3K1J2J
3048B3j4K3o1M2j7Jo9O7k7j5Q3m0l0J9rN1k3o7N5qj1N6o3K1QrQK7l3N1M3q9M7
3081D0l2%n8Q7jk4j0M2m2oL8l9N2l9K5L1k8j9n6N4ol8N0o0L9knj4L1m7M3k8N4
$$ plain form
3114 32 -18 7 0 22 18 0 33 32 65 20 -30 33 -10 -12 -12 88 -9 10 1 6 -16 15 76 -36 46 2 -33 9 -6 21 -36 0 -31
3147 -31 24 -30 -15 -12 -64 -39 -42 -9 20 -69 -71 64 -39 17 -6 -19 14 -22 4 39 -13 -15 -11 41 -5 -18 -5 -2 -24 -5 11 41
3179 41 5 -59 26 -15 -35 8 22 44 28 20 8 -19 0 34 12 11 -21 -22 -20 -18 19 45 5 81 -52 -39 -19 -6 12 -5 -6 30 22
3212 22 -22 -55 -15 -34 10 39 -27 -18 -20 -39 -9 46 -22 42 -24 0 0 -22 -11 -22 -5 8 -71 24 55 46 -30 -30 -6 -4 6 -3 0 -12
3246 -12 -34 14 -18 -65 -19 15 20 55 -46 12 57 2 -32 64 18 -12 -3 20 -10 -16 -58 -39 -15 -4 -39 -22 57 -18 11 45 4
3277 4 -12 6 -4 47 -10 9 22 -1 -5 -6 26 -13 -36 -55 39 -1 23 11 33 37 17 1 17 -24 37 0 15 39 -1 30 -11 3
3309 3 -15 5 -57 13 32 6 -11 17 -5 -57 13 -13 3 -27 -6 -22 -19 -40 -21 -16 37 -3 0 44 13 23 28 28 -14 20 9 -6 -21
3342 -21 27 -46 24 3 56 2 -17 -11 -21 23 -30 26 -10 -46 -13 -58 -21 15 -20 -21 -17 81 -20 13 34 2 -4 -38 15 51 -44 27
$$ packed form
3114C2n0K5pK2mj8L3jL3m5n0O3m3k%J00r7J9rNk2L1O1j12Q2m4l5M2j5K7n7L6l1
3147c1N5n4J5Ln2K5lL3K9q9kJ35j03N6k3j3L3l6K6L5n2kMN2m6j3J3Lk2J9J6L0
3179D1l6o4Q5m1k0M3J4K2j6qj2k7J9L4k2jl2jKKL7K6m0P6j33J3K0J3J8j7jL6q
3212B2m4l3M0j9M4K9o6Rkj9L0N5o8O4o6K4%k2J1j1J7J3p9R5L1rp6%K4KJ0rLj2
3246a2k2M8l2m7M6L4NL5j01N8M5n5l4R6m6l0RK3l0om2J9K4J1l5J7P9p5K9L4m1
3277Dj6J8j0N1n7J9J3k3mjL2l9k3j9R4m0K4j2K2Mk0j6J6m1O1l7J5K4m0L1m1J4
3309Cj8K0o2P0J9k6j7K8k2n2P0k6J6l0K1j6Lk1J9NN3m0LM4l1J0N%m2L4j1j5j5
3342b1M8p3P0k1N3n4j9Oj0M4n3N6l6l6L3m5L7L6l5jMR8j01L3K1l2ol4N3L6r5P1
$$ plain form
3374 27 0 -37 39 55 -32 -5 35 -47 -3 7 6 -33 -17 -31 30 -9 -2 -14 -52 -18 32 2 22 13 63 9 -26 -46 -14 25 -48 40
3406 40 23 19 9 51 38 -1 78 40 -50 -12 -40 38 -27 -60 8 -29 25 -25 19 -15 -10 22 15 21 26 -29 25 -3 -23 -25 -10 -61 -32
3439 -32 19 -40 31 39 35 4 -36 -19 12 -22 64 -32 -22 34 45 -22 7 26 16 1 36 26 -37 -3 57 17 8 2 5 -34 -30 -46 -36
3472 -36 -4 15 1 -41 2 34 29 -44 -12 45 -45 -1 -41 -20 6 -4 -61 9 12 7 42 -1 40 -34 17 44 -36 -28 -16 31 -17 -6
3504 -6 -25 33 32 -17 12 23 7 -21 23 10 -59 15 31 -14 -27 35 -17 -2 51 -25 12 -19 -60 10 -19 -54 7 -11 -9 -26 13 7
3536 7 -38 -20 35 32 2 -6 10 -20 -53 0 30 12 23 11 3 32 28 27 32 4 43 7 12 -81 -30 -49 3 5 -44 26 52 23 72 14 7
3571 7 33 18 -3 -7 6 -12 37 -7 16 5 28 -6 -5 -15 5 57 -2 25 -39 -39 45 -7 -28 -51 -40 34 -6 25 64 50 -19 -18 22
3604 22 -20 48 -82 -11 -27 -73 38 5 -42 1 27 19 24 15 12 16 40 14 -9 -58 -35 52 3 -11 59 46 15 27 -2 18 -12 -25
$$ packed form
3374B7k7l7P6J6q7K7M0q2M4J0jl9J6j4O1l9Pj2l8L4N0l0K0rN0n4l5k0L2L9p3Q8
3406D0j7mj0M2j3l9P9l8r0L8k8P8o5l3O8l7N4n0M4l4NL2pONn5N4k8k0kJ5n1K9
3439c2N1n9P1Qml1m0J7L1l4Q6r6J0N6J1o7K9J9j0j5L5j0o3L4O0m0roLl9Mj6J0
3472c6L2J9j4m2M3L2np3L2N7r0M4m0K1K6j0n7P0LnL5m3M1p4N1K7q0QJ2M7m8J1
3504fj9N8jm9K9J1j6k8M4j3o9P4J6m5j3O2n2J5N3p6L7l1m1P0k9l5O1j8Kj7L9o
3536Gm5J8N5ll0qJ6l0l3N3L0j8J1j2qK9mjNk8L9l6Nr3N1j9N2Km9P0K6k9M9n8p
3571GK6j5k1mJ3j8M9m4K3j1K3l4Jj0K0N2n9K7o4%Q4n2k1k3J1P4m0L1L9j4o9JM0
3604B2m2O8j30P1j6m6J11l3m7M3K6qNrlMK4k6k3m9K3Q7m9j4P0j3l1J2k9K0l0j3
$$ plain form
3636 -25 -5 4 -16 -42 1 -9 -56 -19 -19 -20 26 -57 26 10 35 -34 -9 -13 -55 31 -44 -12 -18 6 -14 -23 19 20 56 17 -24 2 58 5
3670 5 -24 -14 11 -40 -7 -43 11 7 -24 10 12 -17 42 -15 -24 20 -13 -8 -50 1 1 -3 -58 -34 34 -30 -35 -24 7 -26 -25 -28 -26 2 9 -17
3706 -17 -41 -28 30 7 34 26 39 2 -14 3 -11 -38 -48 2 -20 39 -73 -39 12 13 48 16 -26 -49 3 38 1 -56 -14 -29 6
3737 6 7 -18 1 -29 64 39 51 -23 28 -48 33 -53 -22 -38 3 21 13 38 73 22 -1 -30 40 -25 57 22 -53 -12 13 27 -11 31
3769 31 -23 -28 37 0 -11 -32 -19 -28 1 28 -3 -75 24 14 -27 0 -5 -33 39 46 -15 31 40 -11 24 -26 33 -13 -47 30 35 -27 46
3802 46 59 -1 35 -25 15 -4 4 60 35 31 -44 -4 -57 -53 38 34 20 1 20 7 -47 36 -20 -63 23 36 -17 52 -11 32 -23 11
3834 11 40 -24 25 -7 0 -14 -25 -9 19 -8 -5 -63 -66 0 -25 -9 -41 -45 31 -40 28 -15 -24 -35 -16 -24 -29 30 -14 -18 51 -4 -1 -19 49
3869 49 63 -6 35 11 -19 -30 51 -8 20 -55 3 -19 -15 25 -23 39 18 19 -36 -29 19 -69 7 -101 17 -38 -15 -47 13 -10 -18
$$ packed form
3636b5K0Rk0k6M3j0m7L7%jM6q3Q3j6K5o9K5mm2Q6p5L2oK4k0rM2JL6l9m1K6N6n3
3670Ek9J0K5n1L3l6N4ml1L4Kk9N9n7rM4l3Nm2N1%mn5K4O8o4nJ1L1l3JlKK8Pk6
3706a7k4J3N8k3K7qJ3l7j6J7j4k7j0N0k2N9j12L4N1JL5l2m2k3N2L5l7n7M2j5L5
3737FJk5J9l0R3k5J2p4N1p6Q1q6L1j6M1J8qK5L5n1k3k9P0o5Q2l5p5M1K5J4l8M2
3769C1n4nO5l7j1k1J3rK9K7l1p2R9j0m1K7nk8P2Po1M6Rn1L5n0N9m6l4P7No2P3
3802D6J3o0L6o0M0j9QN6k5mp5M0n3MR1mj4j9J9j3n4Q3n6m3Q6J3n3O9o3M3n5L4
3834A1K9o4M9l2Pj4j1J6K8k7Ln8lO6k5J6l2mP6p1O8m3rj1J9qnN9m4mO9n5Lj8O8
3869D9J4o9M1k4l0j1Q1n9K8p5N8k2MM0m8O2k1Jn5PM8q8P6j08J18n5K3l2O0k3q
$$ plain form
3900 -18 -30 -7 -42 -28 -16 -28 27 -18 -16 3 -51 -9 30 -18 -36 9 5 18 13 -9 15 12 8 19 28 -73 0 33 -54 42 35 -67 -20
3933 -20 -37 -7 -65 -50 22 -33 -6 -8 0 -12 11 13 -3 -1 -36 -22 -5 -5 16 -45 -31 63 33 -9 -10 -24 -17 -7 14 -5 28 -28 -1 4
3967 4 41 64 -45 -13 -59 26 26 -57 -17 8 59 31 -9 -18 -5 36 11 -20 -38 -11 58 -1 8 4 18 -19 -12 0 3 -8 -33 37 16
4000 16 4 -8 70 9 13 25 -49 10 -2 -20 -9 11 -35 13 13 -2 -9 45 19 -8 -42 -69 -6 -8 -55 -47 0 40 16 -62 -2 11 9
4033 9 15 7 19 -16 7 23 17 -36 -23 52 8 55 88 -17 93 1 20 -63 -17 -42 -16 30 -15 0 15 -26 46 4 -18 6 -11
4064 -11 -24 -45 -9 -25 5 18 -6 -77 -2 2 43 -33 -8 -38 22 32 -2 -19 9 -27 12 2 -39 27 -4 -22 -12 -8 -63 -48 -32
4095 -32 -47 53 0 16 -55 49 3 -16 -1 30 34 -20 -25 -61 25 5 16 -26 -66 3 21 30 18 -21 -49 12 -64 -69 26 16 21 -9
4127 -9 -7 22 15 30 56 16 -17 -24 -26 48 7 -24 -28 21 10 -11 24 -1 -7 32 -11 23 57 2 20 -17 4 -7 37 10 7 15 -3 -7 39
$$ packed form
3900a8j2K3l5J4J2j2N5m5KJ9n4M2L9m8j8M5mJ3nk2K4lmJ1Rj01P3L3q7R6pj02M7
3933b0j7L0n8J5P2n5K7kQj2K3Kj6Kl5J4J7%K1o1J4R4l0m2jj4PJ0K1j9L3n6K7N
3967DL7K3j09L2m6Q5%q3M0K5N1k8m0rJ3M1k5l1j8K7O9n9RmJ4l7PJ2Lj1k5P0k1
4000A6j2j2P8o1MJ2p4N9j2j8J1K0m6M8%j5pN4k6k7l4k7O3km7QM7M0k4p8O0J3k
4033IOqJ2l5K3J6on3J3P5m4M7L3j05J10r2J9q3M6k5K6M6m5J5J5m1P2m2k2K4j7
4064a1j3k1L6j6L0J3k4p1P5MM1p6K5l0O0J0l4j7K8l6L9j0m1O6l1j8J0Mn5J5J6
4095c2j5J00n3J6p1J04m6j9J5L1Mn4nl6Q6k0J1m2m0O9J8Rj2l9k8O1p6nR5j0Nl0
4127iKK9pJ5K6m0l3pkP4m1l1mM9j1k1L5k5oL9m3L4L4n5J8l7K1j1M4k7lQj8mM6
$$ plain form
4162 39 3 44 23 -13 -36 -11 -88 25 -47 20 10 42 26 10 49 32 22 -24 -3 -22 38 -9 -27 -15 -4 -31 1 -6 14 7 -26
4193 -26 -28 56 -16 -19 16 24 7 11 -18 -23 14 -37 74 50 -27 -28 56 -40 6 5 38 20 6 68 -41 -2 6 32 25 19 13 0 21 1 26
4228 26 -51 24 -12 -38 -4 23 -6 -5 -31 60 21 -57 45 -49 22 28 19 39 43 -48 8 23 -29 -34 49 14 3 15 27 -31 -4 1 -3
4261 -3 -27 0 15 10 -14 -30 -41 17 -17 -11 25 51 -25 11 20 -9 0 -62 -1 26 -26 -6 17 -30 -5 20 -26 -14 -8 50 -14 19 12 18
4295 18 -8 34 9 0 56 -31 81 -7 -4 5 -24 -4 -6 45 11 -17 4 25 -13 14 11 -2 -43 11 1 -17 32 -14 38 17 -25 -2
4327 -2 -33 -52 40 10 29 12 -12 14 12 2 -33 59 -10 15 -9 47 5 -12 -27 -3 1 31 -6 2 -13 2 -63 -27 -26 -17 13 31 -30
4360 -30 -12 -7 -26 -11 28 44 24 -15 -49 27 -8 -23 13 -6 -19 31 2 1 17 42 -22 -29 -7 31 48 26 0 -13 9 33 -15 -1
4392 -1 -25 -3 21 -48 -15 -29 4 -33 45 11 -27 -40 9 -7 -34 2 27 -19 -10 -61 57 5 -28 8 -15 20 31 9 -6 -31 -30
$$ packed form
4162C9l6M1k1l6k3K5p7J13p2O7j0L2j6j6L9j7j0m6K1j9O0m7j8J2J1k7L2pK0pl3
4193b6kQ4p2lL5Qj7Mk9nL7n1J11k4p7jQ4r6M6jL3j8j4O2j09L9QK6pooj3K1k0K5
4228B6p7P5l6k6L4K7k9Jk6R1l9p8J02r4P1OrK0Mr1N6J5n2nQ3l5j1J2J2n8K7Nm
4261ck4K7J5nk4j6j1N8l4OL6K6p6L6Rk9Ro2O1K7n2K0K3m7K5K5m6J2ON8o4L3pO
4295A8k6M2k5rN6q7J12q8LRk9K0kN1l4k8K1K1l8K7lj3m1N4j0j8M9m6N2k1m2K3
4327bl1j9R2l0J9j7k4K6kj0l5R2o9K5k4N6m2j7j5K4ML0l7Qj5J5o5L6JRL0J8o1
4360c0J8Nj9J5L9J6k0l9l4P6l5j5L6j9j3N0k9jJ6K5o4pK2L8J7k2k6j3K2K4m8J4
4392ak4K2K4o9L3j4L3l7P8l4l8j3M9j6k7L6K5m6Rn1J18n2l3L6k3L5J1k2j5k5J
$$ plain form
4423 -30 11 23 -11 -41 -13 0 -27 -9 -35 37 -30 10 42 -45 -34 -2 -26 -44 -21 54 -5 -43 -4 35 23 -19 -84 8 9 -19 32
4454 32 30 -29 -34 26 -2 81 -2 42 39 22 54 17 55 -20 6 43 16 -7 26 -26 -73 16 2 -7 41 21 47 15 27 -49 -48 4 -30
4487 -30 -5 -3 6 -22 -17 34 -16 -16 68 8 20 -28 -28 -43 -20 26 4 -39 -28 -21 33 37 -26 -11 -14 -35 26 8 54 -30 -19 -20 1 13 -28
4522 -28 32 38 17 -17 -15 -7 33 -23 -66 37 -6 39 1 -43 -11 28 5 35 -3 4 -34 -33 -11 10 -18 15 16 -10 6 30 21 -26 24
4555 24 27 13 22 -16 17 -16 -45 -33 28 -7 16 -44 42 7 -35 -13 5 -23 8 34 32 15 59 -13 4 20 51 35 4 8 29 9
4587 9 8 3 -10 -39 -40 25 -36 -8 -44 19 11 -2 17 28 -33 -25 -19 -10 25 -26 34 -50 31 12 -24 47 5 -24 -33 11 38 -21 74 -19 -1
4622 -1 -33 -32 32 -29 -6 12 30 -19 -6 70 10 9 -6 -13 -12 4 35 -27 -45 16 41 47 -9 5 -28 -31 -13 -58 -57 -39 -27 10 7 -25 -11
4657 -11 22 16 -35 0 -14 -3 -8 46 63 -50 18 -1 5 -13 3 -23 -23 -11 -4 -7 16 -6 -16 -29 -38 -16 -27 -24 -54 -26 18 1 46 -19
$$ packed form
4423c0M1J2l4l0K8J3k7J8k6P2o7M0L2q7J1L2k4j8K3P5n9l8L9L9j2m2o5R2Jk8N1
4454C2kn9nO0k8Q3q3M4lj7L2l7L8p5K6L7k7k3L3n2m7Q9j4rM8k0K6l2J2p6JN2l4
4487c0K5KRk8NN1n0%Q4o0J2m8%j5K3M6k2m3J1PN4Mo3J5lk1O1j8M6q4J1jK1J2m1
4522b8O0Ok1l4KQM0n6m3J03m3M5l8m4L2L9k3L0l8Pl8JK2K1k8L3Jk6J6K4rm7N0
4555B4Lj4Rl8L3l3k9J2O1l5K3o0Q6l5m2K2J8k8L1K6kj7M4p2J7J6L1j6l1MK1k0
4587Ijnj3k9jO5o1K8l6O3qj3J9J1o1QORL5n1O0q4Q1j9l6P1m2k9rM4K7n9R5r3J8
4622al2JO4o1K3J8J8m9J3P6o0jj5pJJ6L1o2j8O1K5On6J4l3lJ8m5JJ8J2L7ll2J4
4657a1L3on1L5j4J1nN4J7j13O8j9Oj8J6k6%J2PlK3k2j0j3rK2j1Ll0K8M4j7M5o5
$$ plain form
4691 -19 2 -6 18 7 30 -23 -33 20 0 31 25 9 11 3 -39 33 0 32 54 -7 -13 2 -24 24 -32 -77 2 -9 20 -21 31 30 11
4724 11 -12 -6 1 -57 12 55 -21 14 7 33 5 45 -4 -18 27 24 -13 36 -9 40 -7 8 43 57 -17 -12 39 -21 -58 -11 15 -8 64
4757 64 -35 18 55 61 -12 12 -10 -57 -54 16 -14 32 25 -11 55 8 54 -13 -47 -25 -18 -54 37 -6 -23 -21 -10 14 -16 2 18 16 -3
4790 -3 -5 -13 -36 30 38 -20 -17 -5 8 20 -1 35 27 2 -58 -27 -2 -20 9 -27 -53 8 -28 -10 -13 42 -49 31 -12 0 -24 12 -6 -18
4824 -18 73 34 -5 -5 -41 -55 3 -46 48 42 5 -50 52 -79 15 45 37 -1 -6 -21 26 -4 -46 -68 4 8 -34 13 16 84 23 4
4856 4 28 -46 52 30 -14 31 -53 -35 41 7 36 26 -19 -10 -11 20 -58 -18 26 -27 -7 7 26 72 -48 -13 -10 37 38 13 -12 -32
4888 -32 4 25 20 -20 -33 7 43 17 -11 17 11 19 -26 -7 -31 17 13 8 -20 8 -109 -28 28 -32 23 -24 27 -19 -29 0 -26 -1
4920 -1 23 32 -30 -24 30 48 20 -10 -37 59 -9 0 35 41 -27 1 28 25 -9 -3 43 -14 -7 0 -3 27 -68 -70 -2 8 15 -29 31 2 37 -16
$$ packed form
4691a9K1qK4j1K3n3j0N3k0L1oj6Kqm2P2l3L2K2o1oJ5k6M8n6m5P9j1K9m1N2jj9
4724A1k3OPn8O9M3p6L5pK6k8M0m9j4M5ll7M9m5M9m7J5L5J4p4NN1o0l7M7K6k3P2
4757F4r9N3L7Op3K4k2m7LP0l0M6pl6O6m7M6o7l4K2Pl6R1m3j7KJ1K4l0J8J6kj9
4790ckqk3O6Qn8LJ2J3J2k1L6qk5o0L1K5j8K9l6k6O1l6J8lN5r1Q0m3J2k4L6j8j2
4824a8R1l9l9%l6j4N8m9R4ol7n5J02j31R4L0ql8nj5M7l0m2k2P2Mm2M7LO8o1j9
4856DK4p4R8k2m4M5q4J8P6l4K9j0m5RjL1p8M0M4n3K0J4J9M6j20L5LM7Jk5k5k0
4888c2L6K1nm0j3M0L6k6k8K8oQm5J9k4M8mnk8K8j17Q1N6o0N5m7N1m6j0K9k6K5
4920aK4Ro2ON4J8k8l0k7R6o8RL5Oo8K8K7ll4OM6n7PPlL0r5kO8J0Pm4O0k9L5n3
$$ plain form
4956 -16 1 46 35 -25 15 -2 -41 -44 -19 31 7 -20 7 -6 -39 7 33 16 -14 0 16 19 -51 -55 -32 -31 -36 -34 13 -29 -17 -21 -29 -18
4990 -18 26 -37 -20 44 5 -25 -11 34 28 28 2 4 -68 37 50 41 22 -8 -30 -26 -27 15 -21 -5 58 30 0 6 -12 -11 -39 -16 -22 53
5024 53 14 30 9 5 -16 20 -78 32 26 18 -32 -23 -28 30 -23 35 -51 -11 39 -28 -40 1 7 58 39 4 -12 -14 35 17 26 -20 25 -38
5058 -38 -59 -6 -20 28 -45 20 -41 17 2 -16 -16 10 7 -58 -8 -35 28 -12 34 20 -36 -58 40 -33 8 9 55 6 3 48 -45 -21
5090 -21 25 69 14 -10 23 27 22 -18 -44 43 -33 18 -33 35 21 -61 29 2 -2 -15 -3 -5 5 65 -26 18 -32 22 -17 -39 48 15
5122 15 -4 3 -63 33 -10 -10 4 -40 22 37 18 23 -31 4 -11 37 23 40 39 9 -15 -11 -23 -20 -2 -36 -40 -59 14 -69 -64 11 -13 40
5156 40 34 10 49 -15 0 -30 33 13 -1 69 35 -6 -19 -18 22 -3 -44 -32 9 15 -28 -10 -15 9 7 -60 -2 -36 12 7 -20 -27 57 -16
5190 -16 53 59 -24 -14 23 -54 -13 -36 -31 19 33 -10 -9 -24 -29 17 57 36 24 -36 35 -6 -45 13 9 -13 -41 7 5 -65 46 5 -39
$$ packed form
4956a6J7M5j1o0M0j7l9lK5N0k4k7K7j3l3M6K6j7l0J4J6Lp0mK3JnKM7m2J2mqJ1
4990a8M4o3J7O4l9l0J4M5o%k6Kp2J05J3rj9l0k2MjM2l6J6O3k8l0Oj8Jk8K3oP5
5024E3l9J6k1mk1L6r8J10oqn0RnN8n3N8q6M0N0o7j2M1ON1j9l5j6kM9j8Rm6M5o3
5058c8k1N3j4M8p3O5o1N8j5j8%K6lo5N0k7O3m0M6j4n6k2R8p3M1JM6m9lM5r3K4
5090b1M6M4n5k4L3Mnm0k6Q7p6N1n1O8j4q2R0k7mj3J2kJ0O0r1M4n0N4l9k2Q7l3
5122A5j9Po6R6m3%J4m4O2J5j9Nn4L5j5M8j4J7jl0k4Mj2LJ8l4mj9P3q3NP5k4N3
5156D0ok4L9o4J5l0O3k0j4P0l4m1j3JM0k5m1J2M1Om3J8nK4ko7N8l4M8nk7pQ4p3
5190a6O9Oq3J0L7p7M1k3NN0J4m3Jj5nM6M0k1j2o0P1m1l9N8mk2k8M8kp0J11m1m4
$$ plain form
5223 -39 1 19 -13 -32 -11 46 -49 -31 -19 26 5 4 -20 -24 33 17 4 57 1 -33 -1 -45 28 21 17 16 -25 28 32 23 30 25 42 6 0
5258 0 -5 -8 -24 25 -29 -27 -19 -8 31 -79 -43 19 14 8 38 -4 -21 -28 -47 34 -33 24 41 12 -30 -13 -1 -46 -23 5 61 7 14 -13
5292 -13 3 1 12 24 -5 4 16 -12 -3 46 -66 6 -30 73 2 -23 0 -1 1 11 38 -37 24 10 4 -18 37 -47 12 -21 7 11 9
5325 9 -20 34 -40 -23 14 -57 28 41 6 -96 -20 -55 -17 -33 -11 18 0 -43 -14 -30 -30 8 -42 -14 11 -19 21 1 55 -29 -23
5356 -23 -30 -31 -32 19 8 -2 -10 10 -36 3 -33 -12 41 -61 42 24 3 18 79 4 5 8 31 -1 -14 -4 -7 -17 -3 32 3 9 8 -69
5390 -69 -30 3 -25 -32 -12 -62 -9 15 -61 5 36 -13 -3 23 -26 -40 -35 31 -52 -53 6 41 -6 14 8 -39 0 -4 20 -8 -42 -10 -20
5423 -20 5 7 0 -36 -11 -24 -76 25 18 -49 34 2 12 -3 -29 -62 15 11 -11 6 -42 -10 39 47 27 0 11 8 -4 47 9 37 -44
5456 -44 9 2 -53 25 17 4 -20 47 61 74 -17 -31 9 15 -13 -12 -36 25 -10 -69 -87 25 5 37 -43 35 -45 -5 -27 14 -11 8
$$ packed form
5223c9M0J8l2j9K1N7r5J8J2M5k1jk4mN7j6j3N3n6l4L2m4P3pmjm1N3MrPnJ7l6o
5258@nlj6M9n4KQJ1L9j10L6O2noL0m2j7pj9Q1o7N7J7k9m2J7J2m5K3K8N6n4Pk7
5292a3J6kJ1J2k9RJ2k8RM9j12P2l6J03p1k5K3jKJ0K7p5O1j4ok2N5q4N9l3K8Mk
5325Ik9N4p4J7L7p1Q5J3l5j02P6l5L8j6K2K9j8m3K9j6%L8n0K8K5l0M0k0N4q4O
5356b3pjjN1j1j0qK0m6L9l6K1N3j02J03j8k1J5O1p5JLK3l2j3J0lj0J4L5k9Ojp7
5390f9L9L3k8pK0n0N3K4p6O6L1m9J0K6m9j4NO6q3jN9L5m7K0om7L9mK4k8l4L2j0
5423b0K5Kpl6K5j3n2J01po7Q3l2J0j5k6l3P7mk2J7m8L2M9Qk0k7J1lj2N1l8K8q1
5456d4N3pn5P8qj3k4O7J4J3r1j4M0Ok8Jk4O1l5n9j8J12k0L2q0P8q0M0k2M1k5J9
$$ plain form
5488 8 20 -9 -12 33 10 -71 27 45 -28 -15 79 26 43 7 -10 27 -18 21 15 -43 1 -25 42 -6 2 3 -11 19 -41 -9 5 12 32
5521 32 33 -51 -34 -9 -84 -4 44 14 -32 25 -12 -23 9 -43 19 14 -26 2 -54 16 -20 -1 5 -9 29 -15 28 2 16 37 -18 -18
5553 -18 -11 -52 25 -10 8 17 -49 24 39 39 5 14 43 5 -4 25 -6 -42 9 3 37 31 -12 33 38 38 -16 -16 -65 29 -102 -28 25 -48 -2
5588 -2 -11 27 6 -35 -16 -12 -57 -25 5 37 15 -45 -43 6 -47 -37 -48 -23 46 -8 -84 -34 -11 -8 -58 -39 3 -10 -35 3 33 19 6
5621 6 3 14 22 -30 -11 11 10 -22 4 26 12 -12 56 39 18 56 29 25 14 8 -2 1 56 28 4 -3 33 -41 -41 46 36 -11 -61 16 -34
5656 -34 -11 -28 5 -30 25 -43 18 -32 -13 -10 -21 -27 -4 -28 -26 -28 13 -22 -17 -12 8 -22 -11 -29 1 7 0 31 26 -5 -5 -4 36 -45 21 -77
5692 -77 -7 -58 -46 -10 11 -44 -19 23 -18 -24 -29 -17 -31 -7 -6 -33 -54 -7 -9 34 17 1 50 18 -58 37 -24 -10 3 -25 33 -30
5724 -30 16 9 61 11 -18 -20 -38 32 -8 12 -10 13 56 1 21 -48 -21 2 -34 82 36 -25 -27 4 7 -6 -40 9 0 48 35 -14
$$ packed form
5488HJ2k9lM5k3q1R8J8p3J3R4n3J7l6j7L7m5L9on8M4k6O7m8QJj4L0o0L2J4PK0
5521C2Jq4J7K5p5Q0M8l0m6N7l7j1L2n2O2nm0K8n6P0l6J9Oj4L8m4M3k6J4K1n5%
5553a8Pm1P7l5J8Ro6P3J5%l4RK9l8rK9l1l6N1oL4om3M5N%n4%m9R4j31P4N3p3M6
5588brL8k1m1J9Mm5L2L0L2k2o0KM9n3J0j1K5O9n4p6N0K3Ln0J9M2j3k5L8L0j4j3
5621FlJ1Qn2J9K2jl2K6K2j4k4O8j7k1L8k7mj1oj0LN5k8k4pL6p4%Q7j0m7n0P7n0
5656c4K3j7L3l5N5o8O1n0J9Lj1oK3k4KkM1l5NNK0l0J1j8L0OpL1nl1%JM0q1O6r8
5692g7P0n1J2L6K1n5K5M2m1onJ2j4K4Jk7k1M7kM3j7j6M9l2p6R5o1J4J3k8N8o3
5724c0M6pN2n0k9kj8P0m0K0k2K3M3n5K0o9K7K3l6J16m6o1kL1Lj3l4M9rM8j3m9
$$ plain form
5756 -14 53 36 60 12 16 -20 20 34 -4 -1 -20 -8 -59 22 -21 12 -20 6 -8 4 26 42 20 17 -8 -10 -33 16 -13 26 -14 -68
5788 -68 -6 -47 -18 -10 -8 21 -1 -27 -25 -19 20 -9 -79 56 -5 -42 -14 -32 34 -39 38 -24 0 10 -22 1 -36 0 -47 26 -5 61
5820 61 -9 76 9 -7 -65 25 -21 -18 27 -1 -65 -6 2 -5 80 -2 1 6 0 -51 -25 16 -16 4 -5 4 -32 27 -9 -45 -15 -27 25 -9
5854 -9 -36 28 20 50 -56 -7 -8 -5 -54 30 7 35 11 -29 -12 -44 30 11 2 14 63 -27 9 2 -31 -50 3 -2 -44 -10 10 -46 14
5887 14 -26 12 -58 32 -33 8 22 41 34 -24 -31 -43 0 -56 27 6 4 29 -1 -13 -73 36 12 10 6 52 7 4 -20 10 -39 -33 23
5920 23 -6 33 -54 25 0 -7 12 35 -24 18 5 46 -19 64 -32 10 3 11 19 8 -17 -23 -18 4 -10 18 11 -14 -6 -30 -27 -50 8 6 9 -5
5956 -5 16 -29 -15 1 56 -33 -42 1 39 18 42 -21 55 -13 -2 16 2 -25 29 -7 -16 -39 41 42 10 1 2 -25 1 47 42 7 -10 15
5990 15 35 -21 -15 40 -14 -34 -23 3 41 46 19 -2 -43 -8 -3 -15 10 65 -25 -16 -50 58 19 -2 0 -39 -27 -22 -30 -11 2 -23 -32 -26
$$ packed form
5756a4O7j7K4m8Ml6M0J4l8Lj9J2n1Q1m3L3l2K6j4J2K2J6k2lk5kk3M9k9L9m0n4
5788f8O2m1K9QKK9k2k6KOL9k9p0J35o1l7K8j8O6p3P7o2K4J0l2K3l7L6m7P3l1O6
5820F1p0Q5o7j6n8R0m6LM5k8o4N9QpQ5q2LNon1K6M1l2K0rRl6N9l6l6L0j2N2l4
5854ik7O4qL0j06M9jLm9Q4k3K8k4m0J7l2P4j9rJ2M9r0L6pl3j9N3nm2L4K0n6O0
5887A4m0L8p0R0o5M1J4J9pn8pj2M3n6Q3k1kK5l0j2o0J09k4kmM6m5lk4L0m9ON6
5920B3k9L9q7P9k5pJ9K3n9M2j3M1o5Q3r6M2pQQj1k5oNK2j4K8pk5Qk4Lk3N8kLj4
5956eK1m5J4J6N5q9rM3L8k1K4o3P6o8J1J8j4k7N4l6rk3Q0Jl2rJk7K6M6nl5j7K5
5990A5K0n6ON5n4k0J1K6L8Nk7k1m1L5Nj2K5N5r0Rl4J08l9k1Kl9J2NqJ9J3k5rO
$$ plain form
6024 -26 -4 2 8 -2 14 -31 -17 -19 17 -36 -14 46 -31 9 -16 11 -36 42 17 -40 37 -35 6 58 -2 -19 -2 -14 7 23 14 -2
6056 -2 17 -22 14 -31 16 -34 -58 5 26 -19 -35 -12 -45 -13 -40 -41 -13 -23 51 45 -18 18 -6 5 9 11 -17 -10 1 -4 24 -16 -18 19
6090 19 -28 -26 -21 -5 -6 -40 -15 -9 -19 11 -4 9 7 57 17 -17 -53 4 8 -9 -59 25 6 -17 -10 -22 -33 14 -13 5 -39 -3 -7 -8 -13
6125 -13 50 31 -5 44 -41 20 23 21 9 -33 7 12 -17 -7 -54 57 -41 -5 37 0 -6 -32 8 -10 23 -17 48 -1 10 4 -35 -6
6157 -6 -34 -18 -17 -38 -27 -21 -37 22 -6 34 -12 17 -61 -18 -22 5 15 -17 19 -7 34 -10 -11 -21 -14 63 -16 -22 8 3 -11 -19 -17 -15 -37 -53
6193 -53 4 -67 -10 -5 -19 6 -32 2 -39 -73 8 -18 43 5 15 7 9 1 -55 34 60 -72 6 15 -12 31 36 7 70 55 32 -18 43
6226 43 31 -4 -23 -34 4 -28 2 -31 -35 -4 15 22 27 14 -51 -2 -18 29 52 -27 -59 -12 -52 -2 20 7 17 -60 -25 2 8 -1 -12
6259 -12 -4 57 36 44 32 20 26 -52 12 -5 35 66 40 -2 -22 -18 -19 -29 -21 27 -6 -26 -33 7 -19 9 53 0 -16 37 41 5 52 -14
$$ packed form
6024b6K2OOj0J6m5J4kL6n3K2O0p7M0k5K7m7P8k5n7P7p2M1N2o0j7J7j2K1J6rj6
6056bJ9l9L6m5M7n0k4O3K1m5j6K3l3L2k7jK8j0P4oo3L6k4J1MKk8PJ1nK8m0kL7
6090A9m7KNJ6jl4K5Oj0L0j5J3kN0m0l4l6N7Mj7n0Q4j9k3Pj2j1M7k7J8m4L6mjn
6125a3O3j9l6M9q5O1Lkj2m2M0Nk9J0m7J11r8L6M2l7ok6M0j8L3m0O5m9J1ol9K9
6157fk8J6Jk1J1Oj6N9k8M0m6K9p8M3mK7J0l2L6k6M1m4jj0PP7p9oL0nj4qKKk2j6
6193e3N7p1N7Nj4K5l8L4m1l4Q1k6O1l8J0qKqn6Q9K6j32P8Rk7M3Nk9O3j5k3n0O1
6226D3j2l5j9j1L8l2L0l3mL1J9PNj3o5M9j6M7K3p9l2M7m0N0K2j3J0p7L5K7Orj1
6259a2QO1k1Qj2j2Op8O4j7M0L1k6m2k0Mjj0QM8l3k0pM0k6K8M4n3j6N3Ml6M7o6
$$ plain form
6293 -14 -1 7 68 10 18 24 -30 -8 -43 15 -13 -8 -32 59 -16 -15 23 39 32 -44 34 18 9 7 -3 39 1 9 -12 3 -101 38 0 -22
6327 -22 -35 -32 15 0 -9 -56 -26 -26 -5 -12 -28 30 68 55 17 29 45 29 1 -1 33 41 59 -11 12 -33 -5 -7 25 4 -51 -34 -18 -22
6361 -22 -3 -12 -15 -15 -12 -10 -33 -29 -14 -29 -15 5 -42 -21 36 58 21 15 40 21 -13 0 43 33 -22 32 27 19 63 -11 34 -13 30 -26 -22
6396 -22 35 -5 -22 -9 2 -54 -48 -17 8 41 -11 -34 -19 -58 -30 20 -27 34 1 24 0 -5 -15 -16 -9 24 9 27 -10 52 30 -40
6428 -40 3 15 32 -10 -30 -23 -1 -30 7 -27 22 -11 -51 17 -35 39 -30 -13 -41 16 40 -9 -22 11 42 -20 -40 1 32 5 4
6459 4 -26 -11 -12 29 21 -21 -53 -10 -13 3 -30 -43 7 6 21 -16 18 -27 10 -18 -17 38 28 -60 -35 12 5 -58 -60 -1 4 12 -19 -13 26 -37
6495 -37 -63 42 27 22 23 12 44 48 64 16 3 -31 -40 -34 21 -18 -2 -24 8 7 -15 6 -50 11 25 11 -54 2 27 4 -47 40 9
6528 9 -32 0 38 32 -1 -44 -26 21 4 58 7 -56 41 -17 -49 40 -35 -20 2 -9 41 28 36 34 11 19 24 2 5 -6 -18 -28 -36 -22
$$ packed form
6293a4J3QO1n8QOn4K2l5N8k8Nk4R1p5JL8J6pp6P8j6rkj0M2l8Qk1J5j04J39l8k2
6327b2j3LM7j5rm7L0%K1pj6N8L8j3l8J2J6j6k8kL4QJ8p0K3m5K8kL2k1n5J7J6m
6361b2J9rl%LKk3MJ5j5J4K0m7K1N7K2l7oK5j9l4J3M3j0n5N4nqM4p4M5m7M3n6M
6396b2N7m0j7J3J1n6OL1K5L3n2k3J5l9K8N0m7O1l3K3k4nj0jPL3j5J8l7O2k2p0
6428d0M3J2J7m2k0PK2k9L7l4M9l3m0O8n2P4o9J7k8N7K4m9j3L3L1o2k0M1L1k7j
6459Dl0J5jM1qm2l2M3lJ6l3j3N0jJ5l7L4m5L7k8JN5j0q8K5M7po3kN9NQl1OL9o3
6495c7k6J05j5nJj1L2MJ6m8j3l4rON5l9J6k2L2jk2K1n6O1J4j4o5N6K5k3n1Q7l1
6528Im1L2L8ol3m3J8M7j7N4n1o3R7n8l2Q9p5J5K2j1N0j3Qkk3QNk2Lj1j2j0qJ4
$$ plain form
6562 -22 26 -31 27 -1 -13 7 -23 14 -38 10 -28 41 5 -37 4 8 23 65 -36 -13 23 43 -5 -24 2 -5 8 -2 -9 42 58
6593 58 -45 27 -18 0 27 -6 6 27 7 -82 -44 -68 22 -5 -1 -37 -14 44 1 -33 -15 -9 -26 28 5 9 -27 -7 16 -8 33
6624 33 28 -5 -33 91 20 15 19 44 2 53 -54 -7 -9 -30 9 -8 43 -37 12 -27 -45 -48 4 0 -55 -27 20 8 7 -81 -12 -35 20
6657 20 18 -16 -46 -30 -36 -36 -35 -79 -15 8 29 -23 -78 -19 -27 15 7 -6 7 -11 -23 -41 -1 8 -15 -55 10 36 29 17 10 -33 -8 15 -23
6692 -23 61 15 -51 -63 18 -8 95 -19 -26 19 -32 31 -47 -47 -55 27 20 -46 27 -6 -8 -3 8 5 0 39 9 64 9 -38 7 37 -25
6725 -25 19 -45 -21 -5 -27 3 -13 -14 -30 -15 -15 2 -8 14 8 2 3 54 -7 -2 18 32 1 -39 -13 24 -27 -60 52 7 4 8 -30 59
6759 59 49 -56 -30 38 1 19 -11 28 -21 6 -20 41 32 4 -10 16 16 2 -36 -19 -14 -17 -57 -54 -22 -19 17 -65 25 41 27 -31 12
6792 12 -33 33 -48 -46 -4 -2 15 -31 -25 42 -2 53 -27 -46 -4 -21 -32 1 22 -17 -9 22 -10 -14 -12 41 24 -1 -6 -42 30 16 -3 32
$$ packed form
6562b2M8n7N8k8j2K0l0L7n2M8l8O9l6m2M1MJ5M2j01K3L6K0m8j9K6pJ3j0pN1J6
6593E8j03P2m5J8K7l3J2K1k0q9L8k4R0k7Ml6K3N8m3l4J8Oj7N4k3Ml6K0K3k4M1
6624C3nl3k8J24p1nMK5m2N1j07M7kk1L9j7N1q0M9l9j8lN2mn5K8M7j2jq8O9k3N5
6657B0kl4l0J6o%Jm4O4K3K1n2n5N9qM2qj3J3j8j2j8M0Rk3m0O5K6pj2pm3K5K3l8
6692b3Q4m6o6j2Q1k6J03j14pM5n1O3p8%qQ2po6P3l3kNJ1lnL9l0N5n5m7M5L0o2
6725b5M4o4K4J6k2L0j6jj6J5%J7j0K2ooJN1o1NK0J4l1m0K6L7n1l3J12m5lMl8Q9
6759E9j0j05K6O8l7J8l0L9m9K7k6O1rk8j4K6%j4l8J7Nlm0LL2LL6q2R0J6j4n8M3
6792A2m5O6q1KM2KJ7m6OO7m4N5q0j9M2j7j1L3K1l9QL1l2mKN3j7k5nl6P2j4j9L5
$$ plain form
6826 32 -23 -16 -50 -56 4 -1 79 -7 9 -44 5 69 1 -16 26 2 19 -29 45 -3 -51 37 -2 -24 -1 -7 -6 36 -28 -15 -73 2 -22
6859 -22 -10 16 -86 28 -10 -2 -38 -4 37 30 -8 28 -19 18 -73 -39 14 -14 21 -5 17 17 -38 17 -13 -24 12 36 -66 -14
6889 -14 15 35 9 -18 -18 18 -5 -14 10 -11 -37 13 -32 -17 -1 15 -48 -46 26 -15 1 7 -29 16 74 32 40 13 -16 31 7 -10 -39
6922 -39 -31 21 2 -36 12 -90 8 -25 -32 12 39 45 -17 21 -8 -15 31 -10 -66 18 -5 4 -44 33 -16 -11 21 9 -15 -34 -11 -16 -16 19
6956 19 -10 -49 -14 0 -6 33 -43 -14 10 8 -17 37 4 6 -31 11 18 29 -16 24 -11 -1 -20 -70 6 3 -16 -14 17 -21 60 -1 20
6989 20 -17 18 27 -81 -12 -32 11 21 1 -24 48 -5 6 -9 -13 27 -12 -11 54 50 -65 2 53 23 -27 37 -4 -25 -41 -100 -32
7020 -32 -30 -63 -26 12 -13 14 16 19 -35 2 -16 33 -19 -25 -8 -1 -75 7 2 -71 -41 33 14 1 -7 -34 -29 -24 44 10 23 -37 -10 32 55
7055 55 41 -33 53 -19 52 13 17 -19 23 -24 28 -23 -10 33 36 -36 -29 -12 -4 29 12 -3 -26 10 -56 -24 47 -1 -13 -55 -5 -1 27
$$ packed form
6826C2n5Pl4oO0nQ0q6J6n3M9O4o8j7M2k4J7m8P4m8m8Q8l9k2K3oJM2o4J3n8P5k4
6859b2J2K6j02J14l8Ql6L4M1pl8L6m7L7r1L4N3k8L5k6K2%n5N5l0j1L6K4j02N2
6889a4K9K0k6k7%L6k3rK4k1k6N0m5J5J6J6o3KP2m1J6Ol6M5N8m2Qk7k9M7k4j7k9
6922c9QN2j9l8M8j02R8l3pM4K7Oo2L8k9pM6m1n6Q4k3Rm8P7m9NL2j2k4j9K3n%L5
6956A9k9l9L5J4oL9p6K9K4kk5N4l3Kl7M2PJ1m5M0l5J0j9n0P6lj9KL1l8Q1o1K1
6989B0l7L5Rj08O9k0M3J0k0k5P2n3J1j5mM0l9JO5mj15O7N1l0n0O4m1k1j6n9O8
7020c2Kl3L7L8k5K7KLn4L7j8M9n2oJ7Pp4Q2np3L0P4j9j3qk7NNO8l4J3o0K7M2K3
7055E5j4p4Q6p2P1l9Ml6M2m7N2n1J3M3Lp2PJ7QL3j7j5k3L6o6L2P1m8j2m2N0MK8
$$ plain form
7088 27 -23 13 20 9 24 20 27 -6 2 67 51 8 -28 -2 -5 51 -22 -20 -18 -29 -36 -22 -8 27 -6 38 -44 11 22 -35 -21 1 22 16 42
7123 42 80 -16 -18 47 -19 7 -36 1 -9 27 -33 15 24 19 37 23 -18 18 1 15 5 26 -14 -37 -24 10 4 15 17 33 -11 15 -37
7156 -37 0 -48 -25 4 3 -5 -18 -2 37 -35 12 59 17 -4 28 30 -27 -12 -39 -21 29 22 -9 33 -5 44 -6 74 48 -62 -35 23
7188 23 0 -13 14 -14 -26 25 -2 -25 23 17 -15 -24 -21 -25 18 -5 8 32 8 13 42 7 -27 21 22 31 -10 -2 44 2 2 -28 -66 -27 -13
7223 -13 -12 14 -16 19 -30 -52 -70 42 60 -45 15 -19 38 -26 16 8 -33 12 9 12 2 24 -5 -8 41 -13 -42 49 33 46 17 93
7255 93 -21 27 11 41 18 45 17 -33 -2 -88 -33 -34 6 8 18 16 -23 34 13 41 -34 -32 -5 -12 -1 14 -1 13 5 -19 -36 41 -19
7288 -19 -31 25 -54 8 49 -20 -6 28 19 21 9 -15 28 32 6 4 -33 -19 -75 5 -12 -6 -51 -5 0 33 -3 16 -22 -76 -48 -16 -10 -36
7322 -36 -15 -36 -23 -17 60 -11 -12 -41 -33 -41 40 -22 37 -8 33 17 20 3 39 2 -1 10 -10 -24 -19 30 -52 27 -33 -36 5 13 6 15 4 2
$$ packed form
7088B7n0L6Pj1J5mPl3QO5j6m3l6K6lN6p3KKj1pJ4J4L5l3M4q2N5J1n7J4K2K1oK6
7123D2L8r6kO5o6K6m3L7j0L6o0M8RnJ8j4m1L6j7J4j0K1m0k3J3L4oJ1KJ6m4K6n2
7156c7L7m8K3K9jqj3J6L9p2M7M7m2k1L2Kn7J5k7J8N0pl1M2l8M9n0Q0k6j10K7N8
7188B3k3j3K7k8j2N1k7k3M8ol2rLmM3k3J3K4k4NK9l5l4M8JRm1QM6m2%l0l8L9J4
7223a3JK6l0L5m9k2j8J12J8j05O0l4N7o4M2qm1M5lLj0K2k9lM9n4k9R1j6J3k9P6
7255I3j14M8j6L0k3K7k8n0L1q6N5jM0KJ0kl9N7k1K8p5KK7pJ1J5j5J4qk4j7P7o0
7288a9j2N6p9O2M1o9J4L4rKj2k4M3Mk6kl7J4n6Q0j7Om5M6NL3l6J9l8n4K8L2Ok6
7322c6K1k1J3OP7p1jk9QqQ1o2N9m5M1j6Lj7L6l7lJ1k0j4NM9q2P9o0lM1QpRj1k
$$ plain form
7358 2 24 11 40 16 -18 -20 -18 -2 32 33 38 1 -9 -11 17 34 31 22 -12 5 -21 14 -8 -28 34 -22 -5 22 20 29 42 16 -36 32 36 -5
7394 -5 32 15 -23 41 -30 -30 -10 -15 32 7 -24 -11 53 -6 -14 -11 -21 -29 -35 -1 -13 -5 5 42 -23 -26 14 -16 -18 36 43 2 22 70 56 31
7430 31 -27 18 17 -31 -8 -49 9 -8 0 -25 23 -14 -44 -22 -25 -27 3 -6 4 -14 33 -5 -33 16 -20 -8 -52 -21 -15 7 -10 47 -2
7463 -2 -5 -46 -21 -7 84 -1 20 13 4 -45 42 -46 -28 28 2 -30 46 27 -17 -48 -31 28 -54 -31 -55 -37 -2 -46 23 5 -22 -18 29
7496 29 2 2 26 52 31 16 37 32 -29 -14 -7 28 17 5 28 -28 34 -18 27 -7 5 -26 -17 -48 -28 -2 -8 -31 -8 -2 -15 -21 32 -33
7530 -33 -52 -27 -53 -20 -31 -2 -5 45 -16 47 -11 -11 12 -12 -12 -25 -6 -28 60 -32 -21 22 48 -24 20 25 -63 -28 -67 5 -29 -50
7562 -50 -39 -3 20 10 20 -7 -32 58 32 25 46 -40 -78 5 14 -18 0 6 10 22 -20 -8 -2 48 25 45 68 45 1 -13 11 69 68
7595 68 56 7 8 23 4 -4 -38 -13 -7 -44 -35 2 -31 2 -22 -26 -20 24 16 -27 10 37 -19 -14 -17 -3 15 40 27 -15 45 -38 -25 34 -5
$$ packed form
7358BK2j3K9k4l4kKJ6L4JNl7j0kK8J7lrl4J7k6L5k2k0O2n6J7K7kRJ3k6n2O8Mm1
7394eL7j7l8O4p1%K0nM7k5l1J3O4n9qLj0qoL4j2QJ0L7o5lM0l0kN4Pm1K0M8j4k5
7430C1n8M5jm8K3m1N8j7Qk5M8l7l0K2lkL0rJ0j8M7l8k8M9l6J2m4L1OK2j7N7m9
7463blm1K5J4R1q5K1prm9Q7q8J8N6k6l2P6j9m4l1J7N9q2K3k4J8L5m4O9j8k7MM7
7496B9k7%K4K6k1j5K1no1J5PL5j1j2K3n6O2n2M5l4J2l1Rl1K0K6ok3K3Oj3oN3o5
7530c3j9K5k6L3j1K9lN0o1O3n8%K3k4%j3J9k2Q8r2J1M3K6p2M4Nq8L5l9P2l4k1
7562e0J1L6K3j0J0k7k5R0k6pK1q6l8Q3Rl2J8OMJ2m2J2ON0k3K0K3k3m4j4K4N8j
7595F8j2m9JJ5j9ql4K5Ol7RL7l3L3k4mOM4qm3L7K7n6NlJ4J8K5j3m2O0q3J3N9l9
$$ plain form
7630 -5 -32 -20 -37 4 -67 -21 52 37 17 -45 10 31 49 8 -22 -12 -12 -36 1 -12 -31 41 -9 -4 1 -8 -19 43 17 -45 16 3 75
7663 75 -6 -44 39 -1 37 4 9 20 9 -3 6 29 36 23 36 13 32 -52 -50 -16 -4 22 9 -1 2 -56 24 -20 -30 1 -36 10 1
7696 1 -58 -20 -33 15 -23 33 2 -45 -24 8 -42 40 25 -21 60 -5 40 -18 60 8 -64 26 21 19 38 -14 0 -13 -31 -39 -48 16 -54
7729 -54 -15 -10 8 -33 -84 73 -37 -48 22 7 -10 -12 10 -7 -70 29 -46 24 -19 -31 -10 24 48 -10 61 5 8 -48 50 15 35
7760 35 21 14 12 17 -11 24 7 -60 -54 -28 -22 -3 -38 62 13 47 -40 -1 23 -18 -27 -5 -12 38 -38 -10 -41 -9 15 4 34 26 13 -1
7794 -1 13 7 -2 -4 -17 17 38 13 56 15 14 27 67 36 -34 8 18 -45 40 17 23 32 14 2 -35 -40 -6 11 -37 -42 -35 17 -30 -9 37
7829 37 2 4 -35 -30 -21 18 15 -15 -38 -6 -39 -17 61 35 46 9 27 -3 24 18 19 -17 33 18 -7 -3 6 -24 11 36 -8 29 -25 -25 41
7864 41 -14 12 -38 -45 -1 51 36 -11 -1 17 -5 -32 13 -1 45 39 -31 -1 -6 61 15 15 -38 5 7 -10 -36 18 -36 -21 23 -104
$$ packed form
7630ek7J2j7M1p1M6P3j5k0o2N5K1J8m1l0J0%k4L7j3j9P2n0NNrj1O2k6o2O1j3P2
7663G5q1l8Q3m0L8l3NJ1j1j2RK3Pj3J3k3J9q4KL4J2K6j3j0Ln8Q0m4j0L1l7M6r
7696An9L8j3M8l8N6l1m7K1L2n0Q2j5m6Q1o5M5n8P8n2p2R0nkJ9n2J4j3j8qrO4p0
7729e4L9NJ8m1n1J57j10j1P0j5j7kK2j7o3R9p5P0m3j2K1L4K4n8P1n6Ln6R8l5K0
7760C5j4pkNk8L5j7o7OK6OJ9l5J00m9L4q7L9K4m1rK2pN0p6K8l1L2K4j1L0qj3j4
7794aJ4orkj3L4K1k5M3m1jJ3M0l1p0M2J0o3Q5k3ORj8j2l7nL4J7m8nPN2m7K1M6
7829C7l5Kl9NRL9ll0k3L2l3K2P8k6J1l7J8l0K7oJl6N0j5k5MRl0L5K5m4L7n4%O6
7864D1n5K6n0pM4N2j5m7J0J8k2k7M5j4M6op0L0nO7m6%n3M3Kj7k6N4n4J5M4j27
$$ plain form
7896 -104 24 35 -21 -3 0 9 37 -38 16 -14 -12 -52 -93 16 -31 -51 -34 -11 -45 18 18 -24 -2 -40 23 14 42 41 -21 -22 -6 17
7928 17 -20 -28 23 24 -33 -16 -60 -9 -22 66 -46 13 56 1 37 5 13 7 6 -15 7 -1 -38 -1 18 -15 37 7 41 -13 -31 15 19
7961 19 23 -52 9 -36 -8 -27 -20 -15 -95 -6 -17 -18 10 -10 -12 -9 -21 39 -56 -44 -24 -46 -44 -35 -5 17 -11 21 -10 37 10 -10 86 -37
7995 -37 -19 -9 18 -13 -7 37 20 3 -17 18 -45 22 -16 18 11 9 1 21 -47 29 -9 -1 -17 45 -49 3 -28 54 -83 -41 -26 11
8027 11 23 12 24 19 45 -1 33 -9 18 -65 25 7 0 -63 -88 -34 -28 13 15 22 19 -41 23 5 -16 24 -23 -4 5 13 12 -32 -14 23 18
8062 18 -10 -10 7 31 -8 53 -31 -31 -29 2 -34 -24 26 -4 31 -45 -5 -25 37 -26 -52 -33 45 30 10 -17 40 26 47 6 43 -66
8094 -66 0 -12 -9 -13 -21 19 -4 7 13 4 -31 17 24 16 25 5 -27 24 40 4 36 -7 16 9 8 34 18 -16 47 73 19 -58 15 -11 -13 2
8130 2 -5 58 13 5 -47 9 23 29 -8 57 66 12 -8 35 -42 2 16 28 23 14 25 11 47 -82 21 -21 -1 44 15 -11 16 -23 9
$$ packed form
7896a04J28J1n6J8LRK8p5N4l0Km0m1J09m7k0J7K3l4O3%m2K2l8O3rK8jo2jJ6K3
7928A7l7qN1Jn7J7m4N1j3Q8j12N9M3n5L6l2Qojk1K2ql7L7J9l3N2l0L4n4j8M6M
7961A9Mp5O1m5K8j9PNq0Q9j1jK8k0kLj2O0r5J2K0k2KRL0K2k8L2l1M7k7k0R6j23
7995c7J8J0K7l1OM4j7j7k0L5o3O7l8L4pkqK0o8P6l8Qj6O2r4N2l1Q2j37M2J5L7
8027A1J2j1J2nK6m6L4m2K7q3R0j8po3k5N4OM1KPlo0O4j8k1M0m7J9RQjm4J8L7n
8062A8k8%J7K4l9O1q4%KL1l6J0N0l0L5p6M0k0O2o3k6J9P8j5k0k7N7j4K1m1L7j09
8094f6O6j2LmqM0k3J1Orl5M8PqRk0l2N1J6l6L2m3K3pjK6j6l4O3K6n4p7P3k6kJ5
8130BpO3m5qn2N6J4Ol7O5Rn4k0M3p7M4J4J2nrJ1j4L6j29J03m2K0M5k9k6K7l9L2
$$ plain form
8163 9 49 -7 56 -1 -36 24 1 -6 4 -19 15 5 42 -4 46 -15 2 -9 30 -22 61 -38 30 2 16 7 -51 -27
$$ packed form
8163IM0n6O3n7l5O0k3pJ0k3L4j0L7m6N0o1J7j1L9n2Q3r9O8k8J4rn8K4
8191b7
$$ Imaginary data points
##PAGE= N=2
##DATA TABLE= (X++(I..I)), XYDATA
$$ plain form
0 0 0 0 0 0 0 0 0 0 0 0 0 8 -8 8 -8 16 -16 24 -26 32 -40 48 -57 65 -80 90 -105 122 -138 162 -185 211 -237
33 -237 269 -306 342 -386 431 -483 537 -600 666 -739 819 -903 1000 -1102 1216 -1340 1475
50 1475 -1626 1792 -1976 2179 -2409 2668 -2962 3301 -3694 4161 -4718 5407 -6275 7415 -8978
65 -8978 11272 -14979 21989 -40063 193578 377416 153940 101221 -47786 -227696 -359676
76 -359676 -343914 -362332 -340677 -217310 -34884 72972 190840 319025 383084 339727 283946
87 283946 203086 66828 -98986 -211487 -287925 -342946 -351988 -275734 -162081 -49094 72396
98 72396 212938 305810 324060 310398 276821 170401 20421 -95416 -185388 -289366 -342821
109 -342821 -301157 -231584 -164812 -41251 113892 209447 258574 312372 314740 226193 120497
$$ packed form
0@%%%%%%%%%%%Qj6J6j6K4l2M0n0N8p2Q8j05J22j45J70j95K27k60L00l47L96m48
33b37N06n75O48p28Q17r14J020j137J266j405J558j722J903k102K318k556K815
50A475l101L418l768M155m588N077n630O263o995P855q879J0125j1682J3690j6393
65h978K0250k6251L6968o2052K33641J83838k23476n2719j49007j79910j31980
76c59676J5762j8418K1655J23367J82426J07856J17868J28185O4059m3357n5781
87B83946q0860j36258j65814j12501p6438n5021r042P6254J13653J12987J21490
98G2396J40542R2872J8250j3662l3577j06420j49980j15837q9972j03978n3455
109c42821M1664O9573O6772J23561J55143R5555M9127N3798K368q8547j05696
$$ plain form
120 120497 33138 -85741 -214354 -274963 -280269 -277117 -232238 -120832 -1115 91199 183345
131 183345 265297 287210 252171 198301 122117 8996 -107500 -187682 -237990 -269323 -256541
142 -256541 -186581 -94453 -6583 91298 190843 245830 248715 232421 190030 95985 -14769 -97710
154 -97710 -169617 -238705 -258023 -216914 -162316 -97624 5580 113370 176333 213771 242758 223705
166 223705 149611 69878 -4884 -98461 -183480 -217381 -216776 -203377 -153489 -62905 26450 96889
178 96889 164352 215226 218233 182246 132942 65677 -25076 -109991 -163652 -195276 -209180 -184263
190 -184263 -119644 -46306 23643 101253 169665 197011 190157 169685 122310 40619 -40994 -101027
202 -101027 -154839 -195884 -192543 -152031 -104544 -43758 39816 113478 153364 176737 185322 153958
$$ packed form
120A20497q7359j18879j28613o0609n306L152M4879J11406J19717R2314R2146
131A83345Q1952K1913l5039n3870p6184j13121j16496q0182n0308l1333J2782
142b56541O9960R2128Q7870R7881R9545N4987K885j6294m2391r4045j10754q2941
154i7710p1907o9088j9318M1109N4598O4692J03204J07790O2963L7438K8987j9053
166B23705p4094p9733p4762r3577q5019l3901O05J3399M9888R0584Q9355P0439
178I6889O7463N0874L007l5987m9304o7265r0753q4915n3661l1624j3904K4917
190a84263O4619P3338O9949P7610O8412K7346o854k0472m7375q1691q1613o0033
202a01027n3812m1045L341M0512M7487O0786Q3574P3662L9886K3373Q585l1364
$$ plain form
214 153958 90258 26810 -35479 -105896 -159446 -174329 -165665 -143463 -92812 -18861 48567 100919
226 100919 147156 174487 164133 127054 81564 22758 -49139 -109340 -142932 -160020 -160278 -127983
238 -127983 -70425 -11971 44231 103820 147443 157249 145062 121089 73377 5988 -53883 -98377
250 -98377 -136963 -157858 -143511 -106653 -64519 -10174 55059 105628 131403 144321 140472 105982
262 105982 52551 1125 -49761 -101890 -135361 -139222 -126186 -100697 -53580 6396 57377 96004
274 96004 127616 140118 122668 87775 47359 -3249 -59803 -101644 -121927 -129742 -121038 -86500
286 -86500 -37017 9849 55265 99397 125298 124715 109338 82790 37774 -16574 -61005 -93529
298 -93529 -118888 -125600 -105532 -71387 -33273 13454 63285 97428 112406 116185 104223 69352
$$ packed form
214A53958o3700o3448o2289p0417n3550j4883Q664K2202N0651P3951O7428N2352
226A00919M6237K7331j0354l7079m5490n8806p1897o0201l3592j7088k58L2295
238a27983N7558N8454N6202N9589M3623R806j2187k3973m7712o7389n9871m4494
250i8377l8586k0895J4347L6858M2134N4345O5233N0569K5775J2918l849l4490
262A05982n3431n1426n0886n2129l3471l861J3036K5489M7117N9976N0981L8627
274I6004L1612J2502j7450l4893m0416n0608n6554m1841k0283p815Q704L4538
286h6500M9483M6866M5416M4132K5901n83j5377k6548m5016n4348m4431l2524
298i3529k5359o712K0068L4145L8114M6727M9831L4143J4978L779j1962l4871
$$ plain form
310 69352 23986 -17924 -58267 -95577 -114468 -110221 -93834 -66914 -24194 23995 61827 89376
322 89376 109270 110868 89442 57243 21644 -21257 -64266 -91970 -102849 -103589 -89127 -55134 -13829
335 -13829 23665 59602 90917 104340 97880 80889 54163 13973 -28860 -61742 -85115 -100543
347 -100543 -98490 -76549 -46140 -12604 26574 64079 86679 94389 92495 76361 43595 5799
359 5799 -27947 -59783 -85968 -95082 -86597 -69404 -43022 -5568 32601 60667 80360 91888 86708
372 86708 64532 36086 4959 -30778 -63017 -80846 -85809 -81874 -64462 -33060 1147 31393
384 31393 59476 80827 85985 76153 58560 32611 -2129 -35846 -59952 -76020 -83766 -76066 -53886
397 -53886 -26726 2446 34640 62309 76106 78267 72182 53867 23750 -7526 -34510 -59043
$$ packed form
310F9352m5366m1910m0343l7310j8891M247J6387K6920M2720M8189L7832K7549
322H9376J9894J598k1426l2199l5599m2901m3009k7704j0879p40J4462L3993M1305
335a3829L7494L5937L1315J3423o460j6991k6726m0190m2833l2882k3373j5428
347a00543K053K1941L0409L3536L9178L7505K2600P710j894j6134l2766l7796
359E799l3746l1836k6185r114Q485J7193K6382L7454L8169K8066J9693J1528n180
372H6708k2176k8446l1127l5737l2239j7829m963L935J7412L1402L4207L0246
384C1393K8083K1351N158r832j7593k5949l4740l3717k4106j6068p746P700K2180
397e3886K7160K9172L2194K7669J3797K161o085j8315l0117l1276k6984k4533
$$ plain form
409 -59043 -76212 -78052 -66717 -49006 -23791 8572 38235 58455 71551 76152 66207 44236 18686
422 18686 -8413 -37445 -60527 -70728 -70786 -62772 -43597 -15216 12987 37078 57935 70875 69770
435 69770 57418 39359 14945 -14442 -40333 -57128 -66790 -68172 -56554 -34804 -10614 14306
447 14306 39863 58951 65783 63385 53824 34377 7404 -18072 -38968 -56572 -66053 -62170 -48866
460 -48866 -31096 -7605 19370 41610 55093 62275 61057 47930 26837 4384 -18599 -41122
472 -41122 -56397 -60531 -56624 -45802 -26269 -1518 21298 39769 54228 60472 54938 41264 23532
485 23532 1482 -22604 -41648 -52507 -56983 -53745 -40051 -19666 1177 21779 41193 53439
497 53439 55077 49550 38181 19068 -4036 -24013 -39793 -51533 -55114 -47871 -34027 -17102 3745
$$ packed form
409e9043j7169j840J1335J7711K5215L2363K9663K0220J3096M601r945k1971k5550
422A8686k7099k9032k3082j0201n8Q014J9175K8381K8203K4091K0857J2940j105
435F9770j2352j8059k4414k9387k5891j6795r662j382J1618K1750K4190K4920
447A4306K5557J9088O832k398r561j9447k6973k5476k0896j7604r481L883J3304
460d8866J7770K3491K6975K2240J3483P182j218j3127k1093k2453k2983k2523
472d1122j5275m134L907J0822J9533K4751K2816J8471J4459O244n534j3674j7732
485B3532k2050k4086j9044j0859m476L238J3694K0385K0843K0602J9414J2246
497E3439J638n527j1369j9113k3104j9977j5780j1740l581P243J3844J6925K0847
$$ plain form
510 3745 25363 41260 49646 52213 47139 32730 13534 -5594 -24415 -41114 -50256 -50108 -43590 -31354
524 -31354 -12862 8111 25987 39506 48513 49765 41592 27682 11198 -7962 -27015 -40346 -46439
537 -46439 -46948 -40711 -26203 -7966 9519 25992 40054 46725 44701 37240 24946 7284 -11803
550 -11803 -27209 -38337 -45238 -44449 -35246 -21615 -6018 11738 28411 38993 43087 42074 34504
563 34504 20011 3057 -12793 -27492 -38970 -43097 -39725 -31596 -19000 -2173 14892 28227 37298
576 37298 41841 39227 29437 16047 1180 -14826 -29061 -37436 -39657 -37020 -28595 -14395 1317
589 1317 15563 28137 37227 39334 34688 25966 13637 -2068 -17351 -28331 -35361 -38122 -34100 -23887
603 -23887 -11084 2660 17129 29104 35191 35934 32392 23305 9662 -4632 -17248 -28144 -35102
$$ packed form
510C745K1618J5897Q386K567n074j4409j9196j9128j8821j6699r142J48O518J2236
524c1354J8492K0973J7876J3519R007J252q173j3910j6484j9160j9053j3331o093
537d6439n09O237J4508J8237J7485J6473J4062O671k024p461j2294j7662j9087
550a1803j5406j1128o901P89R203J3631J5597J7756J6673J0582M094j013p570
563C4504j4493j6954j5850j4699j1478m127L372Q129J2596J6827J7065J3335R071
576C7298M543k614r790j3390j4867j6006j4235q375k221K637Q425J4200J5712
589A317J4246J2574R090K107m646q722j2329j5705j5283j0980p030k761M022J0213
603b3887J2803J3744J4469J1975O087P43l542r087j3643j4294j2616j0896o958
$$ plain form
616 -35102 -35531 -30165 -21296 -9209 5317 18517 27982 33517 34556 29633 19443 7276 -5525 -18352
630 -18352 -28478 -33112 -32649 -28170 -19020 -6067 7085 18311 27441 32764 32136 26182 17358 5876
644 5876 -7474 -19265 -27039 -31142 -31256 -25538 -15603 -4199 7514 19015 27354 30514 29275 24313
658 24313 15003 2860 -8833 -18742 -26541 -30285 -28383 -22298 -13540 -2463 9572 19612 25915 28808
672 28808 27644 21501 11864 1130 -9619 -19525 -26250 -28151 -26010 -20434 -11313 39 10586 19200
686 19200 25476 27916 25298 18734 10178 -178 -11117 -19727 -24743 -26536 -24574 -18068 -8682 1143
700 1143 10812 19553 24878 25568 22879 17154 8125 -2299 -11570 -18961 -24049 -25267 -21833 -15431 -7256
715 -7256 2474 12146 19340 23277 24053 21218 14642 5780 -3296 -11978 -19307 -23260 -23175 -19816 -13771 -5159
$$ packed form
616c5102m29N366Q869J2087J4526J3200R465N535J039m923j0190j2167j2801j2827
630a8352j0126m634M63M479R150J2953J3152J1226R130N323o28n954q824j1482
644E876j3350j1791p774m103j14N718R935J1404J1713J1501Q339L160j239m962
658B4313r310j2143j1693r909p799l744J902O085Q758J1077J2035J0040O303K893
672B8808j164o143r637j0734j0749r906o725j901K141N576R121J1352J0547Q614
686A9200O276K440k618o564q556j0356j0939q610n016j793J962O506R386R825
700A143R669Q741N325O90k689n725r029j0424r271p391n088j218L434O402Q175
715g256R730R672P194L937P76k835o576q862r076q682p329l953Q5L359O045Q612
$$ plain form
731 -5159 4423 12685 18820 22655 22861 18910 12310 4403 -4521 -13161 -19134 -21803 -21772 -18435 -11528 -3123
747 -3123 5131 12851 18994 21759 20646 17013 10905 2602 -5960 -13149 -18378 -21072 -20332 -16106 -9614
762 -9614 -2065 6180 13549 18400 20254 19389 15462 8754 947 -6629 -13216 -18237 -20001 -18412 -14376
777 -14376 -8252 -466 7335 13567 17694 19467 18051 13401 7080 22 -7411 -13820 -17668 -18590 -17295
792 -17295 -13053 -6506 849 7602 13449 17523 18368 16290 12198 6084 -1183 -8151 -13434 -16838 -17953
807 -17953 -15939 -11327 -5284 1396 8078 13581 16647 17071 15281 10963 4641 -2069 -8140 -13209 -16459
822 -16459 -16677 -14331 -10115 -4343 2393 8604 13092 15791 16265 13971 9335 3605 -2518 -8586 -13266
837 -13266 -15517 -15474 -13337 -8969 -2966 3105 8524 12962 15383 15111 12469 8242 2636 -3504 -8957 -12823
$$ packed form
731e159R582Q262O135L835K06l951o600p907q924q640n973k669L1L337O907Q405
747c123Q254P720O143K765j113l633o108q303q562p189n229k694P40M226O492
762i614P549Q245P369M851J854q65l927o708p807p576o587n021j764J589M036
777a4376O124P786P801O232M127J773j416m650o321p058p433o409l848r22J295
792a7295M242O547P355O753N847M074Q45k078m092o114p267o968n283l404j115
807a7953K014M612O043O680O682N503L066M24j790m318o322o710o071n069l250
822a6459k18K346M216N772O736O211M488K699M74k294m636n730o123o068m680
837a3266k251M3K137M368O003O071N419M438K421k72k642m227n606o140n453l866
$$ plain form
853 -12823 -14798 -14698 -12068 -7429 -1970 3702 9022 12896 14518 13993 11478 7078 1420 -4170 -8995
868 -8995 -12627 -14296 -13532 -10668 -6499 -1196 4474 9217 12385 13712 13124 10189 5667 614 -4591 -9212
884 -9212 -12432 -13329 -12412 -9724 -5355 -18 4982 9170 12128 13173 11944 8969 4764 -130 -5299 -9368
900 -9368 -11875 -12688 -11635 -8556 -4131 590 5326 9336 11845 12332 10990 8161 3866 -1100 -5583 -9200
916 -9200 -11596 -12126 -10630 -7578 -3502 1190 5736 9273 11238 11629 10280 7119 2995 -1453 -5672 -9174
932 -9174 -11132 -11214 -9670 -6825 -2743 1881 5872 8970 10893 11016 9260 6157 2298 -1971 -6092 -9019
948 -9019 -10591 -10575 -8939 -5845 -1762 2267 6076 9055 10546 10205 8422 5467 1563 -2604 -6220 -8834
964 -8834 -10260 -9990 -8041 -5002 -1305 2706 6413 8816 9867 9609 7796 4618 891 -2922 -6278 -8805
$$ packed form
853a2823j975J00K630M639N459N672N320L874J622n25k515m400n658n590m825
868h995l632j669P64K864M169N303N670M743L168J327n88k935m522n053n205m621
884i212l220q97R17K688M369N337N000M188K958J045j229k975m205m894n169m069
900i368k507q13J053L079M425M721M736M010K509M87j342k829m295m966m483l617
916i200k396n30J496L052M076M692M546L537J965L91j349l161m124m448m219l502
932i174j958q2J544K845M082M624L991L098J923J23j756l103l859m269m121k927
948i019j572J6J636L094M083M029L809K979J491l41j783k955l904m167l616k614
964h834j426K70J949L039L697M011L707K403J051k58j813l178l727l813l356k527
$$ plain form
980 -8805 -9813 -9208 -7354 -4331 -603 3257 6335 8557 9573 9023 6900 3914 437 -3249 -6512 -8560
996 -8560 -9197 -8695 -6686 -3620 -16 3447 6414 8470 9039 8241 6323 3326 -182 -3660 -6388 -8283
1012 -8283 -8918 -8073 -5941 -3069 318 3729 6521 8219 8654 7765 5736 2777 -655 -3752 -6408 -8165
1028 -8165 -8446 -7403 -5405 -2580 803 4005 6352 7917 8253 7208 4957 2148 -939 -4072 -6512
1043 -6512 -7795 -7939 -6950 -4810 -1856 1270 4138 6456 7689 7723 6510 4431 1620 -1544 -4378 -6386
1059 -6386 -7523 -7519 -6268 -4015 -1256 1779 4475 6461 7468 7224 6016 3781 906 -1990 -4480 -6373
1075 -6373 -7401 -7031 -5652 -3533 -820 2108 4660 6335 7196 6883 5464 3201 487 -2239 -4639 -6408
1091 -6408 -7018 -6565 -5271 -3046 -296 2426 4579 6245 6883 6378 4942 2812 117 -2544 -4737 -6152
$$ packed form
980h805j008O05J854L023L728L860L078K222J016n50k123k986l477l686l263k048
996h560o37N02K009L066L604L463K967K056N69p98j918k997l508l478k728j895
1012h283o35Q45K132K872L387L411K792J698M35q89k029k959l432l097k656j757
1028h165k81J043J998K825L383L202K347J565L36j045k251k809l087l133k440
1043f512j283j44R89K140K954L126K868K318J233L4j213k079k811l164k834k008
1059f386j137MJ251K253K759L035K696J986J007k44j208k235k875k896k490j893
1075f373j028L70J379K119K713K928K552J675Q61l13j419k263k714k726k400j769
1091f408o10M53J294K225K750K722K153J666O38n05j436k130k695k661k193j415
$$ plain form
1107 -6152 -6628 -6193 -4674 -2431 34 2608 4778 6134 6501 5933 4474 2300 -268 -2725 -4704 -5999
1123 -5999 -6392 -5689 -4179 -2118 391 2809 4709 5911 6242 5475 3995 1874 -544 -2879 -4762 -5890
1139 -5890 -6071 -5291 -3795 -1640 788 2945 4685 5732 5978 5055 3547 1523 -793 -3013 -4699 -5622
1155 -5622 -5706 -4961 -3261 -1205 950 3083 4685 5593 5497 4636 3109 1038 -1194 -3205 -4627 -5471 -5409
1172 -5409 -4436 -2940 -836 1309 3289 4582 5318 5229 4307 2613 617 -1430 -3259 -4655 -5249 -4966 -4090
1189 -4090 -2527 -496 1593 3365 4597 5108 4878 3838 2273 354 -1676 -3387 -4524 -5002 -4742 -3715
1205 -3715 -2066 -199 1709 3371 4558 4842 4482 3554 1918 44 -1853 -3402 -4439 -4776 -4385 -3293
1221 -3293 -1702 133 1971 3489 4379 4617 4192 3146 1520 -375 -2000 -3454 -4284 -4529 -3969 -2934
$$ packed form
1107f152m76M35J519K243K465K574K170J356L67n68j459k174k568k457j979j295
1123e999l93P03J510K061K509K418J900J202L31p67j480k121k418k335j883j128
1139e890j81P80J496K155K428K157J740J047K46r23j508k024k316k220j686r23
1155e622q4P45J700K056K155K133J602R08r6q61j527k071k232k011j422q44O2
1172e409R73J496K104K145J980J293P36q9r22j694j996k047j829j396n94K83Q76
1189d090J563K031K089J772J232N11k30j040j565j919k030j711j137m78K60J027
1205c715J649J867J908J662J187K84l60r28j636j874j897j549j037l37L91J092
1221c293J591J835J838J518Q90K38m25j046j626j895j625j454q30k45N60J035
$$ plain form
1237 -2934 -1328 435 2164 3478 4231 4469 3857 2706 1182 -573 -2228 -3502 -4140 -4223 -3710 -2577 -1050
1254 -1050 658 2247 3439 4115 4117 3567 2359 925 -759 -2336 -3422 -4044 -3998 -3393 -2180 -735 795
1271 795 2327 3432 3934 3840 3207 2085 604 -961 -2348 -3389 -3865 -3746 -3058 -1887 -515 1045 2351
1288 2351 3299 3715 3627 2895 1764 322 -1082 -2416 -3373 -3636 -3506 -2781 -1696 -253 1205 2375 3257
1305 3257 3631 3359 2620 1509 140 -1263 -2407 -3170 -3454 -3277 -2445 -1294 -16 1354 2432 3196 3416
1322 3416 3128 2360 1237 -63 -1343 -2412 -3075 -3319 -2931 -2179 -1116 161 1418 2475 2975 3177 2849
1339 2849 2084 977 -232 -1477 -2398 -2945 -3079 -2779 -1977 -890 379 1479 2346 2961 2995 2633 1821 769
1357 769 -350 -1439 -2350 -2860 -2901 -2496 -1727 -709 428 1527 2305 2725 2772 2351 1704 594 -520 -1512
$$ packed form
1237b934J606J763J729J314P53K38o12j151j524j755j655j274o38q3N13J133J527
1254a050J708J589J192O76Kn50j208j434j684j577j086o22M6O05J213J445J530
1271G95J532J105N02r4o33j122j481j565j387j041m76J19O88J171J372J560J306
1288B351R48M16q8p32j131j442j404j334r57k63J30P25J085J443J458J170Q82
1305C257L74k72p39j111j369j403j144p63k84J77Q32J151J278J370J078P64K20
1322C416k88p68j123j300j280j069o63k44L88P52J063J277J257J057N00K02l28
1339B849p65j107j209j245r21n47j34L00Q02J087J269J100Q67O15L4l62q12j052
1357G69j119j089r11n10m1M05P69J018J137J099P78M20M7m21o47j110j114r92
$$ plain form
1375 -1512 -2273 -2699 -2721 -2261 -1547 -513 529 1476 2268 2552 2608 2182 1422 419 -614 -1546 -2254 -2612 -2515
1394 -2515 -2098 -1374 -332 625 1483 2168 2516 2446 1965 1202 313 -739 -1522 -2162 -2479 -2362 -1876 -1111 -217
1413 -217 760 1551 2130 2404 2206 1767 1039 83 -793 -1584 -2139 -2347 -2160 -1715 -982 -110 806 1627 2062 2264
1433 2264 2123 1606 871 22 -807 -1586 -2021 -2235 -1994 -1512 -832 77 837 1543 1992 2131 1991 1412 741 -65
1453 -65 -848 -1549 -1992 -2069 -1913 -1402 -664 122 965 1566 1947 2002 1817 1305 624 -198 -987 -1588 -1917 -1930 -1705
1474 -1705 -1217 -563 242 956 1530 1894 1921 1683 1140 480 -272 -1015 -1544 -1842 -1893 -1535 -1093 -466 338 1023
1494 1023 1471 1807 1818 1518 960 342 -362 -980 -1483 -1744 -1771 -1433 -960 -332 425 1019 1482 1725 1697 1384 882
1515 882 229 -482 -1057 -1445 -1687 -1608 -1303 -772 -204 478 1055 1493 1675 1594 1274 763 137 -530 -1041 -1529 -1601
$$ packed form
1375a512p61m26k2M60P14J034J042R47P92K84N6m26p60j003j033r32p08l58R7
1394b515M17P24J042R57Q58O85L48p0m81p63q89j052p83o40l17J17M86P65Q94
1413b17R77P91N79K74j98m39p28r56q76p91n55k08J87M45P33Q72R16Q21M35K02
1433B264j41n17p35q49q29p79m35k14K41M82O80R09P60P06M49J39j40n79o71q06
1453f5p83p01m43p7J56N11P38P86Q43O01L81N5j85n12o81q22p89o01l29j3K25
1474a705M88O54Q05P14N74L64K7k38n43o60p52p43n29k98n1L58M42O27Q04O85
1494A023M48L36J1l00n58o18p04o18n03k61k7L38M73O28P57N94M63K43k8l13n02
1515H82o53p11n75l88k42P9L05N31N68O82N77M38J82q1l20n11o26o67n11m88p2
$$ plain form
1536 -1601 -1465 -1255 -691 -91 587 1098 1425 1578 1411 1119 665 60 -563 -1098 -1415 -1538 -1378 -1089 -608 44
1556 44 571 1115 1351 1521 1327 1020 524 -37 -669 -1097 -1347 -1408 -1271 -909 -435 157 672 1087 1352 1379 1195
1577 1195 856 409 -141 -663 -1088 -1319 -1419 -1224 -870 -348 198 785 1077 1267 1297 1114 822 318 -265 -744
1597 -744 -1128 -1338 -1302 -1129 -745 -221 261 706 1060 1262 1267 1027 599 167 -308 -770 -1063 -1280 -1222 -959 -595
1618 -595 -134 316 772 1105 1210 1154 914 567 126 -366 -776 -1039 -1210 -1117 -858 -577 -80 395 814 1090 1128
1639 1128 1068 842 507 2 -423 -778 -1038 -1107 -1054 -839 -450 19 466 816 1032 1084 1018 756 417 -34 -461
1660 -461 -829 -1006 -1009 -994 -767 -414 35 482 779 1047 1034 885 613 242 -13 -525 -796 -978 -983 -874 -637 -296
1682 -296 98 480 766 971 970 807 636 187 -125 -472 -748 -996 -941 -783 -537 -187 158 575 743 889 913
$$ packed form
1536a601J36K10N64O00O78N11L27J53j67k92m54o05o23n35l17j23J60K89M81O52
1556D4N27N44K36J70j94l07m96n61o32m28k50o1J37L62M74N92N15M15K65K7j84
1577A195l39m47n50n22m25k31j00J95L54N22N46N87K92J90L0j83k92n04n83m79
1597g44l84k10L6J73L84N24M82M45L54K02Nk40m28m32m75m62k93k17N8K63L64
1618e95M61M50M56L33J05n6k40l47m41m92m10k63j71R3K59K81M97M75M19K76L8
1639A128o0k26l35n05m25l55k60o9N3K15L89M69M47L50K16N2o6k62l39m51m27
1660d61l68j77lJ5K27L53M49M47K97K68j3j49k72l71k55n12k71j82nJ09K37L41
1682b96L94L82K86K05jj63j71m49l12l47k76k48N5J58K46L50L45M17J68J46K4
$$ plain form
1703 913 742 522 171 -199 -577 -786 -907 -952 -726 -510 -182 134 517 800 872 848 653 375 121 -191 -589
1724 -589 -792 -832 -815 -611 -389 -35 303 629 767 867 784 657 340 110 -291 -574 -751 -784 -708 -630 -326 -33
1746 -33 274 565 733 812 703 597 258 -5 -289 -566 -720 -804 -719 -540 -246 14 322 595 740 777 677 512
1768 512 220 -103 -359 -628 -659 -677 -621 -419 -186 95 417 604 669 752 635 433 175 -68 -302 -512 -675 -704
1790 -704 -597 -357 -185 150 440 531 610 585 567 343 130 -146 -343 -605 -643 -686 -536 -335 -126 92 389 523
1812 523 641 711 568 415 37 -169 -367 -564 -612 -616 -465 -308 -57 100 453 519 591 595 430 265 92 -175 -422
1835 -422 -567 -598 -573 -474 -222 -49 219 375 489 610 577 440 258 -56 -225 -399 -507 -597 -519 -366 -233 -14
1857 -14 218 422 526 609 566 383 226 -40 -253 -393 -515 -558 -488 -353 -170 55 288 403 491 557 466 297 150
$$ packed form
1703I13j71k20l51l70l78k09j21m5K26K16L28L16L83K83P2k4j95k78k54l12l98
1724e89k03m0J7K04K22L54L38L26J38J00q3j27l17k30m01k83j77l3P6P8L04K93
1746c3L07K91J68P9j09j06l39k63k84k77j54q4Q5J79K94K60L08K73J45L7j00j65
1768E12k92l23k56k69l1j8N6K02K33K81L22J87O5Q3j17k02k58k43k34k10j63k9
1790g04J07K40J72L35K90R1P9k5j8k24k13k76j97k62l8m3J50K01K09K18K97J34
1812E23J18P0j43j53l78k06j98j97m8mJ51J57K51J57L53O6P2Mj65j65j73k67k47
1835d22j45l1K5R9K52J73K68J56J14J21l3j37j82l14j69j74j08r0P8J53J33K19
1857a4K32K04J04Q3m3j83j57k66k13j40j22m3P0J35J83K25K33J15Q8O6r1j69j47
$$ plain form
1880 150 -106 -302 -399 -524 -559 -409 -341 -182 61 301 442 504 463 411 306 134 -83 -282 -402 -500 -499 -375 -320
1903 -320 -50 140 285 413 481 495 425 270 39 -111 -274 -365 -467 -464 -386 -259 -76 106 256 429 415 511 389
1926 389 246 41 -88 -308 -399 -476 -413 -306 -190 -1 101 356 447 479 459 362 184 43 -124 -336 -392 -445 -386
1949 -386 -350 -164 -19 142 318 411 402 386 394 125 -4 -179 -354 -390 -383 -309 -302 -154 14 216 319 371 409 319 273 190
1975 190 -45 -220 -316 -349 -342 -297 -300 -107 65 247 328 377 404 386 229 76 -39 -190 -292 -384 -350 -357 -220 -51 84
2000 84 173 379 359 325 341 216 28 -148 -224 -316 -392 -333 -291 -123 -31 151 265 257 358 329 257 192 51 -102 -219
2025 -219 -299 -352 -310 -230 -97 -6 162 268 327 333 315 248 102 -25 -173 -215 -334 -299 -310 -251 -162 96 128 248 247 313
2051 313 336 208 66 -50 -143 -246 -261 -302 -290 -208 -63 82 165 241 299 325 292 168 53 -13 -145 -256 -267 -274 -301
$$ packed form
1880A50k56j96r7j25l5J50O8J59K43K40J41O2m1n2j05j72k17j99j20r8JJ24N5
1903c20K70J90J45J28O8J4p0j55k31j50j63r1j02LP8J27J83J82J50J73j4R6j22
1926C89j43k05j29k20r1p7O3J07J16J89J02K55R1L2k0r7j78j41j67k12n6n3N9
1949c86L6J86J45J61J76R3rj6Qk69j29j75j75l6PP4PJ48J68K02J03N2L8r0m6q3
1975A90k35j75r6l3PM5lJ93J72J82Q1M9K7j8j57j53j15j51j02r2L4pJ37J69J35
2000H4Q9K06k0l4J6j25j88j76p6r2p6N9M2J68R2J82J14qJ01k9p2o5j41j53j17
2025b19q0n3M2Q0J33R1J68J06N9Oj8o7j46j27j48m2j19L5j1N9Q9K58L2J20jO6
2051C13K3j28j42j16r3j03j5m1J2Q2J45J45Q3P6N8K6l3j24j15o6j32j11j1pk7
$$ plain form
2076 -301 -189 -49 87 234 310 250 308 285 184 65 -92 -213 -259 -272 -260 -270 -134 -84 69 164 285 312 279 158
2100 158 119 -47 -116 -160 -249 -273 -295 -196 -93 -15 124 223 232 287 266 152 86 -24 -90 -180 -253 -219 -268 -210 -111 13 119
2127 119 183 262 259 272 174 97 -3 -150 -254 -209 -291 -266 -177 -78 0 132 187 273 216 238 215 -20 -45 -167 -220 -290 -212
2154 -212 -251 -140 -32 45 139 234 243 262 216 80 31 -124 -134 -215 -179 -238 -225 -119 -48 25 111 223 216 293 204 106 47 -110
2182 -110 -92 -215 -267 -205 -174 -116 -54 60 198 229 251 257 143 117 30 -35 -139 -194 -218 -217 -156 -134 -5 88 164 152 250 161
2210 161 120 95 -18 -69 -169 -198 -237 -181 -186 -100 7 69 164 164 223 145 192 41 36 -73 -124 -189 -193 -109 -113 -33 4 132 141 164
2240 164 229 194 126 55 0 -97 -140 -172 -170 -106 -150 -84 -10 116 164 211 178 153 110 -22 -78 -93 -133 -181 -200 -172 -149 29 -2
2269 -2 122 151 189 150 129 59 28 0 -45 -77 -137 -122 -114 -94 -39 6 92 163 111 170 123 79 51 -60 -110 -151 -149 -162 -192 -76
$$ packed form
2076c01J12J40J36J47P6o0N8k3j01j19j57j21m6j3J2j0J36N0J53R5J21K7l3j21
2100A58l9j66o9m4q9k4k2R9J03P8J39R9RN5k1j14o6j10o6r0p3L4m9N8R9J24J06
2127A19O4P9lJ3r8p7j00j47j04M5q2K5Q9R9P8J32N5Q6n7K2k3k35k5j22n3p0P8
2154b12l9J11J08P7R4R5RJ9m6j36m9j55j0q1L6n9J3J06P1P3Q6J12pP7q9r8n9j57
2182a10J8j23n2O2L1N8O2J14J38L1K2Oj14k6q7o5j04n5k4JO1K2J29R3P6j2R8q9
2210A61m1k5j13n1j00k9l9N6nQ6J07O2R5%N9p8M7j51nj09n1o5mQ4mQ0L7J28RK3
2240A64O5l5o8p1n5r7m3l2KO4m4O6P4J26M8M7l3k5m3j32n6j5m0m8j9K8K3J78l1
2269bJ24K9L8l9k1p0l1k8m5l2o0J5QK0N5M5Q6P1n2N9m7m4k8j11n0m1Kj3l0J16
$$ plain form
2299 -76 -20 42 91 133 126 151 125 38 40 8 -101 -129 -166 -121 -130 -66 18 73 104 135 171 150 133 40 29 -40 -13 -193 -167 -92 -101
2330 -101 -26 21 60 40 131 87 69 95 53 -45 -20 -129 -92 -156 -162 -57 -10 48 78 103 126 154 120 108 21 -57 -57 -126 -65 -91
2360 -91 -112 -79 -25 46 59 100 148 103 79 91 25 -5 -124 -97 -143 -96 -94 -70 -18 16 61 81 78 140 86 51 12 -51 -132 -86 -127
2391 -127 -133 -77 -8 -46 36 110 91 132 132 93 84 5 -13 -60 -77 -141 -64 -102 -8 0 66 54 167 55 56 35 10 -3 -119 -62 -107
2422 -107 -71 -84 -76 -75 24 58 -12 97 102 71 95 26 26 -44 -89 -113 -38 -101 -10 -18 19 36 86 96 149 87 16 -6 -32 -46 -97 -61
2454 -61 -76 -4 -42 -1 46 10 115 73 72 39 58 -29 -79 -77 -59 -83 -63 -109 -59 -26 16 34 94 78 96 1 3 -2 -17 -18 -61 -86
2486 -86 -78 -62 -59 -18 24 70 45 103 91 38 49 -53 -48 -44 -73 -81 -93 -72 -11 14 38 51 64 41 81 42 54 16 -14 -64 -87 -46
2518 -46 -51 -23 -11 58 35 67 63 59 12 -15 21 -41 -7 -36 -56 -50 -66 -66 -7 12 28 125 55 14 29 42 22 14 -68 -76 -81 -25 -57 -90
$$ packed form
2299g6N6O2M9M2pK5k6q7Kl2j09k8l7M5rO4Q4N5L1L1L6k1j7r3j1o9K7j80K6P5r
2330a01P5M7L9k0R1m4j8K6m2r8K5j09L7o4oJ05M7N8L0K5K3K8l4j2q7p8%o9O1k6
2360i1k1L3N4P1J3M1M8m5k4J2o6l0j19K7m6M7KK4N2L4M5K0lO2n4l5l9o3q1M6m1
2391a27oN6O9l8Q2P4j9M1%l9rp9j8m7j7o4P7l8R4QO6j2J13j12Jk1k5j3j16N7m5
2422a07L6j3QJR9L4p0J09Nl1K4o9%p0m5k4P5o3R1qL7J7N0J0N3o2p1k2k6j4n1L6
2454f1j5P2l8M1M7l6J05m2jl3J9q7n0KJ8k4K0m6N0L3M2J8O0j6J8r5Knj5jm3k5
2486h6QJ6LM1M2M6k5N8j2n3J1j02NMk9qj2K1O1K5K4J3J3k3M0l9J2l8l0n0k3M1
2518d6nK8J2O9k3L2mmm7k7L6o2L4k9k0Oj6%N9J9J6R7p0m1J5J3k0qq2qnN6l2l3
$$ plain form
2552 -90 8 -22 -6 46 53 87 39 32 -16 -65 -45 -62 -57 -83 -9 -32 -10 -2 47 26 34 50 74 7 -48 35 -14 -33 -87 -60 -68 -71 -9 -5
2586 -5 13 16 13 -15 -2 0 -48 -59 -92 -59 4 -8 -32 25 -39 6 -2 48 -1 73 57 21 33 -110 -80 -50 -9 14 -24 -6 -10 16 -8
2619 -8 30 32 74 -29 28 -47 -26 -63 -30 -55 -12 -18 -3 -42 13 59 33 45 29 24 -3 9 8 -59 -34 -26 -33 -27 47 58 8 32 97 49
2653 49 -4 42 -10 -1 10 -11 24 -5 -28 -40 -48 54 15 10 42 48 36 -10 40 -25 -28 -20 -75 -61 -74 -45 -22 -14 29 94 86 57 -12 10
2687 10 58 5 -9 2 -11 -34 -60 -6 -16 43 25 43 55 -2 44 -2 -6 -21 -73 7 -23 -6 -54 -30 38 -4 14 39 -5 20 -51
2718 -51 25 3 -69 -48 -85 -78 -77 -39 35 -38 -11 64 36 5 -9 -3 36 1 -21 -6 22 -24 -75 -4 14 -15 28 6 64 27 46 -15
2750 -15 -16 -3 2 -2 2 -36 -48 14 -18 7 -4 57 51 11 30 -1 -20 -1 -16 -26 -29 -29 -22 34 -23 -2 21 6 13 24 53 37 26 -42 5
2785 5 2 -48 -37 -47 -19 -57 2 7 4 44 17 51 6 -4 -9 -39 -24 28 -12 -71 -34 -33 1 -19 3 62 92 49 -5 -56 -19 2 -31
$$ packed form
2552i0R8l0J6N2PL4m8pm8m9K0j7Nk6P4k3K2QM9k1QJ6K4o7n5Q3m9j9n4K7qlO2M
2586eJ8Llk8J3Km8j1l3L3O3j2k4N7o4M5qN0m9P4j6l6J2j43L0L0M1K3l8J8mK6k4
2619hL8KM2j03N7p5K1l7L3k5M3oJ5l9N5M6k6J2j6nk7J2jo7K5QpOP4J1n0K4O5m8
2653D9n3M6n2RJ1k1L5k9k3j2qJ02l9nL2Oj2m6N0o5lQn5J4j3K9K3QM3O5qk9o9K2
2687A0M8n3j4J1j3k3k6N4j0N9j8J8J2n7M6m6mj5n2Q0l0J7m8K4O8m2J8K5m4K5p1
2718e1P6k2p2K1l7PJL8P4p3K7P5k8l1j4OL9l5k2J5K8m6n1P1J8k9M3k2N8l7J9o1
2750a5jJ3NmMl8j2O2l2K5j1O1om0J9l1j9J9j5j0l%PN6n7K1K3j5PJ1K9j6j1o8M7
2785Eln0J1j0K8l8N9NlM0k7L4m5j0nl0J5N2m0n9L7JL4k0K2N9L0m3n4n1L7K1l3
$$ plain form
2818 -31 17 -21 -71 -14 -9 -10 -15 34 65 51 -7 50 -3 4 -39 -55 -36 -102 -50 -25 -38 -44 -6 1 9 47 16 0 15 24 -43 -5 -59 -51 32
2853 32 45 -2 -10 29 74 44 39 -38 -23 16 -24 3 -49 -57 -64 -30 -31 55 4 33 -38 14 44 32 -9 7 14 -93 -14 -54 -42 -60 -45
2886 -45 -8 -4 -5 30 -21 -41 9 42 -2 -5 -41 -19 -31 35 -40 -74 -42 -18 -18 32 46 2 -17 2 -22 -18 -12 -9 -9 13 -15 -59 -32 -31 -1
2921 -1 34 -2 19 14 -17 69 -10 -36 -7 -3 -4 6 -39 30 9 50 25 -2 -39 64 7 1 13 -10 44 24 24 11 2 -28 -68 13 51
2954 51 10 13 -16 -3 -38 -6 -53 15 3 -33 39 -21 10 -9 16 53 34 -22 36 42 -34 84 7 -54 -10 11 17 43 5 20 15 52
2986 52 58 -44 11 -13 22 -65 -17 -39 -47 -1 -51 15 10 -8 4 39 21 3 -51 20 -8 30 11 -27 -2 -60 42 -67 -37 8
3016 8 49 -32 74 7 51 41 -14 3 -23 -14 3 23 -14 26 -3 -7 2 -65 -10 24 -19 21 -47 -21 -41 20 15 -60 4 22 -15 -20 24
3049 24 30 22 -27 0 22 7 -23 13 -34 -9 -31 1 -4 51 -32 -38 -35 44 31 20 72 -44 -20 10 -11 35 -17 -23 -25 -43 -21 23 4
$$ packed form
2818c1M8l8n0N7NjnM9L1j4n8N7n3Pm3j6J9o6N2K5j3oL8PQL8l1j6J5Ro7L8n4QQ3
2853C2J3m7qL9M5l0np7J5L9m0K7n2qpL4jQ6n1K9p1N2L0j2m1J6Pj07P9m0J2j8J5
2886d5L7MjL5n1k0N0L3m4ll6K2j2O6p5l4L2K4%N0J4m4j9J9k4MOL%K2k8m4K7JL0
2921aL5l6K1nl1Q6p9k6K9MjJ0m5O9k1M1k5k7l7J03n7oJ2k3N4k0%j3rl0m0Q1L8
2954E1m1Lk9J3l5L2m7O8j2l6P2o0L1j9K5L7j9n6N8Op6J18p7o1M4K1OK6l8J5nL7
2986E2Oj02N5k4L5q7M8k2qM6n0O6nj8J2L5j8j8n4P1k8L8j9l8K5n8J02j09L0M5
3016HM1q1J06o7M4j0n5J7k6RJ7K0l7M0k9mRo7N5L4m3M0o8K6k0O1np5O4J8l7nM4
3049B4Oqm9K7K2j5l0L6m7K5k2L2nN5q3oLP9j3j1N2j16K4L0k1M6n2okj8K2M4j9
$$ plain form
3082 4 48 2 40 -8 16 -13 -13 18 -26 2 2 -28 -14 -5 5 -5 44 -5 28 -21 1 29 -41 -25 35 28 14 -45 -30 22 27 27 6 35
3116 35 -33 -10 -15 22 35 -1 -29 37 -28 -12 5 -32 -16 -66 -43 -23 -13 -18 -24 4 -36 40 29 14 -83 -23 -58 4 23 5 -12 34
3148 34 -13 -5 77 19 56 8 -12 -25 20 11 14 9 6 26 -19 26 46 -12 -18 -15 48 -60 -53 -2 24 -10 -17 -20 -67 22 13 -10 -17 47 -4 -26
3184 -26 -9 2 -27 22 -17 5 -18 -4 24 19 12 45 22 8 21 30 26 -14 -83 -24 3 -38 33 4 14 -53 -23 -56 35 -61 25 2
3216 2 24 -63 -40 12 -5 10 -31 47 2 1 70 -32 23 43 -15 -12 -8 29 -4 11 -28 -24 12 -11 13 -43 51 31 -51 -35 34 17
3248 17 16 21 -35 18 -32 -27 -8 -55 14 -3 -6 -11 -5 9 17 -12 40 -68 8 -26 -28 -12 -37 -9 2 -15 17 23 54 45 22 -6 14 30 -21
3283 -21 13 -12 4 -29 27 12 37 27 43 -8 -6 -23 -11 -51 -1 -60 24 -6 -35 -21 -69 20 11 17 -55 2 19 -7 -36 -25 57 44
3315 44 28 47 23 20 43 9 -5 1 -12 48 26 3 -50 -12 -50 -26 -20 -54 19 27 -21 -12 64 -19 56 -39 -17 -34 14 14 -28 -34 -40 -15
$$ packed form
3082DM4m6L8m8K4k9%L1m4K8%l0J4RJ0j0M9m9L3m9K2K8p0J6O0pj4n9J5N2N%k1K9
3116C5o8K3nL7J3l6k8O6o5J6J7l7J6n0K3K0J0noK8m0P6j1j5r7O0l5O2J9j8j7M6
3148C4m7QQ2n8L7m8k0j3M5rLnlK0m5M5K0n8oLO3j08PN1K6l4plm7Q9rk3pO4n1k2
3184b6J7J1k9M9l9K2k3J4K8npL3k3j4J3Rmm0o9N9K7m1P1k9J0o7L0l3R1r6Q6k3
3216BK2q7K3N2j7J5m1P8m5jO9j02N5K0n8LML7l3J5l9ML6k3K4n6R4k0q2J6O9j7
3248A7jNn6N3n0NJ9m7O9j7lnOJ4Qk9N2j08P6l4kJ6k5K8J1j7L2OL1rk3k8K0J6n1
3283b1L4k5J6l3N6j5K5j0J6n1Kj7J2m0N0n9Q4l0k9J4m8Q9rOp2N7J7k6k9J1Q2j3
3315D4j6J9k4lK3l4j4Oj3O0k2k3n3L8l8K4Ol4P3Qm8RP6q3P5r5K2j7M8%m2ooK5
$$ plain form
3349 -15 -29 -64 14 5 8 31 54 35 -8 49 11 36 29 -1 8 -9 10 8 11 12 20 5 15 -18 2 -39 -13 -36 5 -8 -4 -10 57 18 -42
3384 -42 2 60 52 11 23 -33 22 26 22 20 13 -35 2 16 55 -36 22 -25 8 6 52 -19 -14 -17 9 2 23 -35 15 -13 -25 17 -4 -3 6 -41
3420 -41 -50 -64 41 -27 -23 -9 21 21 -8 16 35 23 -19 -20 47 46 30 43 11 -11 18 -53 -20 15 8 25 -57 -5 52 8 28 24 -23
3453 -23 -7 -27 28 -44 3 -12 -23 -26 -18 11 36 6 -44 -28 -10 -34 28 -2 -10 24 7 -25 -18 36 69 32 -2 28 -11 27 19 58 19
3486 19 -16 17 -53 45 -12 -43 30 12 -37 -2 6 6 12 44 -1 9 -34 -26 -57 -5 41 -42 18 10 27 19 16 44 12 17 60 -70 -29 -13
3520 -13 8 34 -26 44 12 -8 -46 -17 -3 -8 85 -23 -39 -8 -60 -2 10 -7 15 -15 57 -21 -30 -49 -6 2 13 -10 -43 -31 -28 25
3552 25 39 17 -33 -11 20 8 -5 -7 46 15 -1 25 1 -30 9 11 -15 21 10 65 26 -6 34 -1 28 -20 11 -52 28 43 -14
3583 -14 -64 -20 -42 29 7 0 -16 -6 76 57 -8 3 19 4 -12 9 -21 31 26 0 -23 36 5 32 55 -6 7 -13 62 -3 -5 26
$$ packed form
3349a5j4l5P8rLK3K3j9m3N7l8K5pl0Rj7J9kLJQj5J0l3K0m1K6k3M1j3MoO7l9o0
3384d2M4N8qm1J2n6N5Mmkpm8L7J4L9r1N8m7L3kM6p1NlK6pK1n8N0k8j2M2k1JRm7
3420d1rj4J05o8MJ4L0%k9K4J9j2m2jO7jj6J3l2k2K9p1L3L5pJ7q2N2N7m4K0mm7
3453b3J6k0N5p2M7j5j1lQK9K5l0n0J6J8k4O2l0qL4j7l2PN4L3l7l4L0l9L8qL9l9
3486A9l5L3p0R8n7l1P3j8m9L5Q%OL2m5J0m3Ql1N2M6q3O0qJ7qlK8l2NM3j30M1J6
3520a3K1K6o0P0l2k0l8K9J4nR3j08j6L1n2N8J2j7K2l0P2p8rj9M3QJ1k3l3J2LN3
3552B5J4k2n0K2L1j2j3kN3l1j6K6k4l1L9Kk6L6j1N5l9l2M0l5K9m8L1o3Q0J5n7
3583a4n0M4k2P1k2pj6J0Q2j9o5J1J6j5j6K1l0N2nk6k3N9l1K7K3o1J3k0P5o5kL1
$$ plain form
3615 26 49 4 19 -18 7 12 26 1 -27 5 7 7 -24 -13 -13 48 59 26 -25 -48 8 28 0 10 -23 7 1 -40 28 -24 -6 42 -1
3648 -1 2 5 16 -18 -26 17 -2 5 -9 33 -27 -18 -19 -43 -40 -9 4 -16 28 -24 20 -23 48 44 30 -15 10 4 -32 -27 -19 -31 7 5 17 18 -1
3685 -1 -11 -41 -13 9 11 28 -32 -20 -75 5 41 -22 61 -18 68 -22 -25 7 15 -24 7 -2 -17 17 -17 33 -29 24 23 15 -56 34 26 -19
3719 -19 18 -15 -51 -61 -21 -98 7 32 -11 -17 -18 5 20 7 13 -22 16 36 62 18 -9 16 -11 45 -5 37 -14 29 16 33 35 -20
3751 -20 -35 9 -10 -38 -9 24 -9 14 -1 7 -3 16 13 39 22 12 -37 -38 62 33 1 34 43 -22 -27 44 88 43 16 61 65 11 12
3784 12 -40 4 -17 51 -12 1 -37 -20 20 28 5 21 41 2 -26 5 -41 -11 -42 11 -8 -2 38 38 21 41 41 63 20 1 17 -1
3816 -1 21 -15 -4 4 55 27 9 1 26 18 28 -19 0 -5 4 -24 -51 -39 -38 -14 -14 16 29 9 8 -14 5 -15 17 64 -34 -17 -1 -49 -3
3851 -3 4 -41 -12 36 -7 -29 2 39 15 -7 30 -18 42 53 -4 -1 27 -33 25 26 19 30 26 20 10 -12 -11 -21 11 -54 -10 -16 -20 19 -4
$$ packed form
3615B6K3m5J5l7K5NJ4k5k8L2K%l1J1%O1J1l3n1k3N6K0k8J0l3L0om1O8n2J8M8m3
3648aLLJ1l4qM3j9Pj4M2o0Rjk4LL1J3k0M4n2M4m3P1mj4m5K5ol6NQj2L8kJ2Jj9
3685aj0l0K8K2KJ7o0J2n5Q0L6o3Q3p9Q6r0lL2Ql9L1rj5L4l4N0o2N3jqp1R0qm5
3719a9L7l3l6j0M0p7J05K5m3ojK3J5j3Ol5L8K0K6m4k7K5k7N6n0M2n1M3j3J7Kn5
3751b0j5M4j9k8K9L3l3K3j5Qj0J9lK6j7j0m9jJ00k9l2L3Ro5nP1M4m5k7M5Mn4J
3784A2n2M4k1O8o3J3l8J7M0Qk3J6K0l9k8L1m6L0l1N3j9OM0%j7K0%K2m3j9J6j8
3816aK2l6J1QN1k8j8qK5qJ0m7J9nRk8k7J2JK4%L0J3k0jk2J9k0L2M7r8J7J6m8M6
3851cPm5K9M8m3k2L1L7k4k2L7m8O0J1n7LK8o0N8JpJ1moj0k2Jj0L2o5M4omL9k3
$$ plain form
3886 -4 18 41 8 12 -2 -4 13 3 -35 23 31 19 7 37 -19 -9 44 68 26 -3 27 -18 9 -21 32 -10 -12 4 23 -21 -1 22 -4
3919 -4 -53 4 -20 13 -15 27 2 20 -45 -1 6 23 14 -43 48 54 31 15 59 12 -42 11 44 -19 57 -25 7 -15 -8 49 -5 2 -16
3952 -16 39 -11 1 36 -33 7 4 -65 -4 56 21 -61 -32 -6 -9 55 20 23 40 -24 54 9 -22 -1 -10 -23 -28 -18 -20 -5 -22 10 -9
3985 -9 2 70 12 26 -16 52 4 71 16 -21 -12 -37 15 6 -19 27 -37 -35 -34 33 13 25 3 -37 -14 19 -31 13 36 -34 23 -21 36
4018 36 30 1 -36 42 36 21 -13 42 6 -16 -16 0 14 21 13 11 72 -58 14 13 59 -22 -12 -1 43 -77 -27 8 1 4 -5 4 -27 19 5
4053 5 10 -25 -9 -23 8 49 -39 -69 1 -27 16 23 33 -73 -48 20 -26 -38 9 -11 -26 -34 -44 -21 19 13 12 40 -17 27 -7 22 45
4086 45 2 -39 22 -10 -6 46 -8 17 -36 69 -27 2 18 -4 4 -5 54 23 -6 6 55 19 25 38 20 4 -7 28 6 26 18 8
4118 8 17 33 16 11 -23 18 -9 -21 19 -3 6 -7 -34 -16 -18 28 63 23 -28 14 -13 -15 -18 -17 -12 21 18 11 40 12 -66 -91 29 -5 -12 -10
$$ packed form
3886dK2K3l3Mj4kJ7j0l8N8Qj2j2L0n6J0N3K4m2k9L0m5K7l0N3m2kJ6J9m4K0K3k6
3919dm9N7k4L3k8M2k5J8o5M4PJ7rn7R1Ok3j6M4m7n4N3L3o3P6q2L2k2PN7n4Pj8
3952a6N5n0J2L5o9M0lo9O1O0l5q2K9K6lO4l5LJ7o4P8m5l1K1rj3nJ0kJ5j7L2j9
3985iJ1O8n8J4m2O8m8O7n5l7Rk5N2rk5M6o4KJO7k0J2k2m0K3L3n0M4K3p0N7m4N7
4018C6ok9l7P8oj5l4N5l6k2%J6J4PqkO1j30P2jM6q1J0J1M4j20N0L5pLrRl1M6j4
4053ENl5J6j4L1M1q8l0P0k8M3PJ0j06K5O8m6j2M7k0j5qj0K3M0ojK8n7M4l4K9K3
4086D5m3m1O1l2MN2n4K5n3J05r6K9J6k2QrN9l1k9J2M9l6OJ3j8j6j1L5k2K0qj0
4118HRJ6j7nl4M1k7j2M0k2Rj3k7J8kM6L5m0n1M2k7klJNL3lpK9k8p8k5J20l4pK
$$ plain form
4154 -10 21 -3 -1 54 22 -56 28 -19 -16 1 -8 -33 -31 1 -15 -45 -38 -52 7 15 26 -15 -19 9 19 -3 -16 37 36 18 23 17 4 18 29
4189 29 18 -3 26 36 -11 -37 22 -6 5 38 -20 10 -37 -6 -27 -16 -25 8 9 22 -37 -15 -45 37 61 -14 -35 26 18 -30 -19 18
4221 18 1 -12 103 -34 -21 -14 -6 72 -7 -15 14 21 -20 -3 25 38 38 58 2 -20 -55 17 -4 -1 48 -17 7 -18 -38 -10 36 13
4253 13 47 -12 14 -65 12 -2 -2 10 31 -49 -23 16 -16 68 44 -15 19 -32 3 11 32 -4 12 -29 16 -3 7 15 -18 50 11 49
4285 49 -25 -3 -36 -28 -24 -7 -20 -7 -78 -5 7 -25 23 -23 29 -16 29 29 -18 -18 24 -54 -18 -5 53 20 -15 -24 -6 57 -12 -25 43
4318 43 -5 -3 -31 -29 37 20 8 11 25 23 -9 12 26 29 -1 21 -35 50 16 -25 13 6 14 -23 15 22 -38 -20 30 -34 -9 -2 -39 -34 -29 -10
4354 -10 22 -24 51 50 4 8 -35 45 -40 -44 -71 -38 32 1 -25 30 10 1 68 8 5 15 30 30 0 -3 -4 11 48 -62 -8 -43 -3 -10
4388 -10 3 28 16 -8 -7 -26 9 49 -4 -23 34 32 -22 -34 -13 45 11 -50 36 9 32 -55 -25 -23 -36 -44 -61 -40 12 -22 17 33
$$ packed form
4154a0L1k4KN5l2p8Q4m7LJ7rk5KL2j6l0Pj4N9QJ1m1mK8J0k2j3N3jj8Noj3J4J1
4189B9j1k1K9J0m7k6N9k8J1L3n8L0m7L1k1J1rL3JJ3n9K2l0Q2K4p5k1O1qm8J1L7
4221A8j7j3J15j37J3PQP8p9qK9Pm1J7K8J3%K0n6k2l5P2k1LM9o5K4k5k0K8M6k3
4253A3L4n9K6p9P7j4%J2K1q0K6L9l2Q4k4n9L4n1L5QK1l6J6m1M5j9J0Ql3O8l9L8
4285D9p4K2l3QMJ7j3J3p1P3J2l2M8m6N2m5M5%m7%M2p8L6J3N8l3l5rJ8O3o9j3O8
4318D3m8Kk8KO6j7j2LJ4kl2K1J4Ll0K2n6Q5l4m1L8pQl7L8Po0J8N0o4K5Pl7NNJ9
4354a0L2m6P5jm6Mm3Q0q5mk7L3P0l1k6N5k0rO7o0lJ0J5%l0ljJ5L7j10N4l5M0p
4388a0J3K5j2k4Jj9L5M0n3j9N7kn4j2K1N8l4o1Q6k7K3q7L0Kj3qj7K1N2l4L9J6
$$ plain form
4420 33 -53 14 -39 6 -13 -17 -40 19 -55 16 22 2 32 -7 19 -5 -8 45 -46 -8 20 -38 13 -5 91 -54 -7 21 3 59 43
4451 43 -23 31 29 23 -4 17 -14 -20 -14 8 -20 29 58 22 -28 -68 24 16 31 28 45 -37 -10 1 0 60 39 -43 45 -43 3 -11 -12 13
4485 13 19 4 10 35 61 44 -13 15 54 14 -28 -25 -26 -5 38 -6 -35 -50 23 51 -10 -22 23 18 28 8 6 25 7 -13 31 41 42 -3
4519 -3 47 -8 -26 -7 -18 84 20 51 -43 0 8 30 64 -30 -24 11 -62 -47 -13 -33 32 -10 9 13 -20 -2 -19 -27 3 9 -40 -34 -49
4552 -49 -11 -1 -55 37 -58 64 -3 -47 -49 -4 6 -50 11 -1 8 8 7 -28 11 -9 7 7 -29 -1 13 5 -19 4 -28 1 7 27 -4
4585 -4 -14 24 -23 -22 -7 0 -17 30 23 8 33 -4 -44 36 31 -26 -45 -21 -34 1 30 -16 -59 2 -8 35 6 12 78 32 56 -7 30
4618 30 -35 32 -61 -42 -29 -11 14 -34 -27 -15 -69 -2 -24 12 27 -26 -16 -6 -2 51 -44 5 19 6 0 -18 34 11 -22 36 -67
4649 -67 2 -12 15 21 18 9 -27 26 2 14 -36 23 -12 20 -29 -15 -60 -12 -14 -53 -2 -15 -30 -36 -8 4 -27 9 -20 26 -18 63 23
$$ packed form
4420C3q6O7n3M5j9mk3N9p4P1Ok0L0l9K6k4lN3r1L8K8n8N1j8R6j45M7K8j8N6j6
4451D3o6N4kok7K1l1oOK2k8M9K9l6n0m0R2qJ5lJ7q2K7J1jO0k1q2Q8q8M6j4jK5
4485A3Oj5OK5K6j7n7K8L9m0m2LjK1M3m4k9j5P3K8o1j2M5nJ0k0kJ9j8k0M4J0Jm5
4519cN0n5j8J9j1J02o4L1r4M3QK2L4r4OL5p3J5L4k0O5m2J9Ml3J8j7qL0Om9Oj5
4552d9L8J0n4R2r5J22o7m4kM5J0n6O1j2R%jl5L9k0J6%l6K8J4qk4K3l2K9OK0l1
4585dj0L8m7JJ5Pj7M7pj5K5l7m0Q0nn7j9K4j3L5K9m6m3O1j0M3k9OO6m6K4o3L7
4618C0o5O7r3J9J3J8K5m8PJ2n4O7k2L6J5n3J0J0MN3r5M9J4j3oj8N2k3l3N8j03
4649f7O9j4K7Olrl6N3k4J2n0N9l5L2m9J4m5M8kl9N1j3j5oK8J2l1L6k9M6m4Q1m0
$$ plain form
4682 23 -22 10 -44 -10 62 16 48 12 -20 -6 8 37 10 -29 -19 16 11 19 33 -8 2 -21 8 -37 -7 -27 -45 15 23 1 22 -19
4714 -19 -3 35 -12 0 8 19 19 9 15 19 7 27 2 5 2 19 -15 18 -27 -13 14 13 -63 -54 30 -31 6 8 -43 23 41 32 -35 -12 -32
4749 -32 -21 22 -51 29 -40 1 -12 -30 -10 -17 -71 -19 -37 11 -4 19 7 5 -1 -21 56 8 11 29 35 44 31 -35 -23 -74 13 -1 1 25
4783 25 49 -20 -32 2 55 -17 -39 -29 -75 -24 -34 -35 2 21 -61 -29 36 13 -50 -24 42 23 -11 -19 20 47 -7 15 26 -88 16
4814 16 20 -30 20 -25 26 76 60 -17 -19 19 -30 29 -1 10 10 -3 -41 -50 4 -7 -16 0 -50 -17 14 -10 1 -36 27 12 -46 -17 -1
4847 -1 -3 -24 3 -11 -6 16 10 -9 17 -1 -23 11 21 -7 -26 29 -48 -42 -9 -3 8 -8 -23 -32 -3 15 -2 -16 -13 -6 31 -39 25 -37 -54
4882 -54 -54 -29 -6 -34 -6 -32 -10 18 -34 -18 -39 -11 -16 19 -40 25 3 -9 33 -4 -1 -32 -9 20 63 28 -5 17 -39 22 33 42
4914 42 -35 12 -35 33 -1 -5 -2 28 -46 -3 20 -1 -4 -56 -30 -7 23 -53 -25 8 17 1 9 -38 -41 15 -20 -5 3 -9 -3 37 -35 -1
$$ packed form
4682B3m5L2n4L4P2m6L2l6l2J4J4K9k7l9J0L5nQJ4m1J0k3K9m5L0k0j8O0Qk2K1m1
4714a9J6L8m7J2QJ1%j0OMj2K0k5LlJ7l4L3m5J4K7jp6RQ4o1L7Kn1O6J8ro7K3k0
4749c2J1M3p3Q0o9M1j3j8K0pn4N2j8M8j5K3j2kok0P7m8LJ8ORj3o6J2n1Q7j4KK4
4783B5K4o9j2L4N3p2k2J0m6N1j0jL7J9q2L2O5k3o3K6O6j9l4qL9K7n4K2J1j14J04
4814A6Mn0N0m5N1N0j6p7kL8m9N9l0J1%j3l8rN4j1rJ6n0L3L1k4J1l7O3j5n8K9J6
4847akk1K7j4NK2oj9K6j8k2L4J0k8j9N5p7OL3OJ1j6j5rK9J8j7j4LPL7p0O4o2j7
4882e4%K5K3k8K8k6K2K8n2J6k1K8nL5n9O5k2j2M2l7Ll1K3K9M3l5l3K2n6O1J1R
4914D2p7M7m7O8l4mLL0p4M3K3k1ln2K6K3L0p6K8L3Rj6Qm7lN6l5J5Qj2OM0p2L4
$$ plain form
4948 -1 -44 7 7 -30 7 9 37 5 29 2 38 18 -13 -34 9 -35 -16 4 -59 -14 -38 -5 -81 -36 23 -15 5 1 20 7 5 -15 -14
$$ packed form
4948am3N1%l7L7KK8l2K4k7L6k0l1k1M3m4J9K0o3M5k4L3p6M5N9l8K0mJ9j3kk0J
$$ [...]
8191B8
##END NTUPLES=NMR FID
##END=
