##TITLE=1H_AM_NV88
 CDCl3
 8 sc, 
 24.11.2023
##JCAMPDX= 6.0         $$ Bruker NMR JCAMP-DX V2.0
##DATA TYPE= NMR FID
##DATA CLASS= NTUPLES
##ORIGIN= UXNMR, Bruker Analytische Messtechnik GmbH
##OWNER= root
$$ XWIN-NMR		Version 3.5
$$ Fri Nov 24 14:28:56 2023 Russian Standard Time (UT+4h)  she@DPX200
##.OBSERVE FREQUENCY= 200.1313
##.OBSERVE NUCLEUS= ^1H
##.DELAY= (6, 6)
##.ACQUISITION MODE= SIMULTANEOUS
##.ACQUISITION SCHEME= undefined
##.AVERAGES= 8
##.DIGITISER RES= 18
##SPECTROMETER/DATA SYSTEM= spect
##.PULSE SEQUENCE= zg30
##.SOLVENT NAME= D2O
##.SHIFT REFERENCE= (INTERNAL, D2O, 0, 15.7039)
##AUDIT TRAIL= $$ (NUMBER, WHEN, WHO, WHERE, WHAT)
$$ ##TITLE= Audit trail, XWIN-NMR		Version 3.5
$$ ##JCAMPDX= 5.01
$$ ##ORIGIN= Bruker BioSpin GmbH
$$ ##OWNER= she
$$ F:/spectra/data/she/nmr/H-F/1/audita.txt
$$ ##AUDIT TRAIL=  $$ (NUMBER, WHEN, WHO, WHERE, WHAT)
(   1,<2023-11-24 14:27:30.31 +0400>,<she>,<DPX200>,
      <created by zg, POWCHK disabled, PULCHK disabled
       configuration hash MD5:
       00 E9 B6 7A A2 85 ED C7 34 08 36 98 17 FE 4E 26
       data hash MD5: 16K
       6B 4C 02 03 A1 B1 6E 5A 05 36 72 49 AA AD 1A 31>)
$$ ##END=
$$ 
$$ hash MD5
$$ 3F E3 40 EB 14 81 90 52 56 AB 3E 56 A6 B8 51 87
##$RELAX= 
##$RELAX= 
##$RELAX= 
##$RELAX= 
##$RELAX= 
##$RELAX= 
$$ Bruker specific parameters
$$ --------------------------
##$DU= <F:/spectra>
##$EXPNO= 1
##$NAME= <H-F>
##$PROCNO= 1
##$TYPE= <nmr>
##$USER= <she>
##$AMP= (0..31)
100 100 100 100 100 100 100 100 100 100 100 100 100 100 100 100 100 100 
100 100 100 100 100 100 100 100 100 100 100 100 100 100 
##$AQSEQ= 0
##$AQ_mod= 1
##$AUNM= <au_zg>
##$AUTOPOS= <>
##$BF1= 200.13
##$BF2= 200.13
##$BF3= 200.13
##$BF4= 200.13
##$BF5= 200.13
##$BF6= 200.13
##$BF7= 200.13
##$BF8= 200.13
##$BYTORDA= 1
##$CFDGTYP= 0
##$CFRGTYP= 5
##$CHEMSTR= <none>
##$CNST= (0..31)
1 1 145 1 1 1 1 1 1 1 1 1 1 1 1 1 1 1 1 1 1 1 1 1 1 1 1 1 1 1 1 1 
##$CPDPRG= <>
##$CPDPRG1= <>
##$CPDPRG2= <>
##$CPDPRG3= <>
##$CPDPRG4= <mlev>
##$CPDPRG5= <mlev>
##$CPDPRG6= <mlev>
##$CPDPRG7= <mlev>
##$CPDPRG8= <mlev>
##$CPDPRGB= <>
##$CPDPRGT= <>
##$D= (0..31)
0 1.2 0 0 0 0 0 0 0 0.06 0 0.03 0 0 0 0 0.0002 0 0 0 0 0 0 0 0 0 0 0 0 
0 0 0 
##$DATE= 1700821649
##$DBL= (0..7)
120 120 120 120 120 120 120 120 
##$DBP= (0..7)
150 150 150 150 150 150 150 150 
##$DBP07= 0
##$DBPNAM0= <>
##$DBPNAM1= <>
##$DBPNAM2= <>
##$DBPNAM3= <>
##$DBPNAM4= <>
##$DBPNAM5= <>
##$DBPNAM6= <>
##$DBPNAM7= <>
##$DBPOAL= (0..7)
0.5 0.5 0.5 0.5 0.5 0.5 0.5 0.5 
##$DBPOFFS= (0..7)
0 0 0 0 0 0 0 0 
##$DE= 6
##$DECBNUC= <off>
##$DECIM= 32
##$DECNUC= <off>
##$DECSTAT= 4
##$DIGMOD= 1
##$DIGTYP= 9
##$DL= (0..7)
0 120 120 120 120 120 120 120 
##$DP= (0..7)
150 150 150 150 150 150 150 150 
##$DP07= 0
##$DPNAME0= <>
##$DPNAME1= <>
##$DPNAME2= <>
##$DPNAME3= <>
##$DPNAME4= <>
##$DPNAME5= <>
##$DPNAME6= <>
##$DPNAME7= <>
##$DPOAL= (0..7)
0.5 0.5 0.5 0.5 0.5 0.5 0.5 0.5 
##$DPOFFS= (0..7)
0 0 0 0 0 0 0 0 
##$DQDMODE= 0
##$DR= 18
##$DS= 0
##$DSLIST= <SSSSSSSSSSSSSSS>
##$DSPFIRM= 0
$$ [...]
##$SUBNAM2= <"">
##$SUBNAM3= <"">
##$SUBNAM4= <"">
##$SUBNAM5= <"">
##$SUBNAM6= <"">
##$SUBNAM7= <"">
##$SUBNAM8= <"">
##$SUBNAM9= <"">
##$SW= 18.0517328524113
##$SWIBOX= (0..15)
0 0 2 0 0 0 0 0 0 0 0 0 0 0 0 0 
##$SW_h= 3612.71676300578
##$TD= 16384
##$TD0= 1
##$TE= 0
##$TE2= 300
##$TE3= 300
##$TEG= 300
##$TL= (0..7)
0 120 120 120 120 120 120 120 
##$TP= (0..7)
150 150 150 150 150 150 150 150 
##$TP07= 0
##$TPNAME0= <>
##$TPNAME1= <>
##$TPNAME2= <>
##$TPNAME3= <>
##$TPNAME4= <>
##$TPNAME5= <>
##$TPNAME6= <>
##$TPNAME7= <>
##$TPOAL= (0..7)
0.5 0.5 0.5 0.5 0.5 0.5 0.5 0.5 
##$TPOFFS= (0..7)
0 0 0 0 0 0 0 0 
##$TUNHIN= 0
##$TUNHOUT= 0
##$TUNXOUT= 0
##$USERA1= <user>
##$USERA2= <user>
##$USERA3= <user>
##$USERA4= <user>
##$USERA5= <user>
##$V9= 5
##$VALIST= <valist>
##$VCLIST= <CCCCCCCCCCCCCCC>
##$VD= 0
##$VDLIST= <DDDDDDDDDDDDDDD>
##$VPLIST= <PPPPPPPPPPPPPPP>
##$VTLIST= <TTTTTTTTTTTTTTT>
##$WBST= 1024
##$WBSW= 4
##$XGAIN= (0..3)
0 0 0 0 
##$XL= 0
##$YL= 0
##$YMAX_a= 93776
##$YMIN_a= -95241
##$ZGOPTNS= <>
##$ZL1= 120
##$ZL2= 120
##$ZL3= 120
##$ZL4= 120
##$ABSF1= 10
##$ABSF2= 0
##$ABSG= 5
##$ABSL= 3
##$ALPHA= 0
##$AQORDER= 0
##$ASSFAC= 0
##$ASSFACI= 0
##$ASSFACX= 0
##$ASSWID= 0
##$AUNMP= <proc_1d>
##$AZFE= 0.1
##$AZFW= 0.1
##$BCFW= 1
##$BC_mod= 2
##$BYTORDP= 1
##$COROFFS= 0
##$CY= 11.3945322036743
##$DATMOD= 1
##$DC= 2
##$DFILT= <>
##$DTYPP= 0
##$F1P= 15.7292609196834
##$F2P= 12.9074282941183
##$FCOR= 0.5
##$FTSIZE= 0
##$FT_mod= 4
##$GAMMA= 1
##$GB= 0.15
##$INTBC= 1
##$INTSCL= 1
##$ISEN= 128
##$LB= 0.24
##$LEV0= 0
##$LPBIN= 0
##$MAXI= 10000
##$MC2= 0
##$MEAN= 0
##$ME_mod= 0
##$MI= 1.114404
##$NCOEF= 0
##$NC_proc= 0
##$NLEV= 6
##$NOISF1= 3.799351
##$NOISF2= 2.8
##$NSP= 1
##$NTH_PI= 0
##$NZP= 0
##$OFFSET= 15.70392
##$PC= 1
##$PHC0= -24385.43
##$PHC1= 8.652691
##$PH_mod= 1
##$PKNL= yes
##$PPARMOD= 0
##$PSCAL= 0
##$PSIGN= 0
##$REVERSE= no
##$SF= 200.130013532006
##$SI= 16384
##$SIGF1= 3
##$SIGF2= 2
##$SINO= 400
##$SIOLD= 16384
##$SREGLST= <1H.CDCl3>
##$SSB= 0
##$STSI= 0
##$STSR= 0
##$SW_p= 3612.71676300578
##$SYMM= 0
##$S_DEV= 0
##$TDeff= 0
##$TDoff= 0
##$TI= <>
##$TILT= no
##$TM1= 0
##$TM2= 0
##$TOPLEV= 0
##$USERP1= <user>
##$USERP2= <user>
##$USERP3= <user>
##$USERP4= <user>
##$USERP5= <user>
##$WDW= 1
##$XDIM= 8192
##$YMAX_p= 0
##$YMIN_p= 0
$$ End of Bruker specific parameters
$$ ---------------------------------
##NTUPLES= NMR FID
##VAR_NAME=  TIME,          FID/REAL,        FID/IMAG
##SYMBOL=    X,             R,               I
##VAR_TYPE=  INDEPENDENT,   DEPENDENT,       DEPENDENT
##VAR_FORM=  AFFN,          ASDF,            ASDF
##VAR_DIM=   8192,          8192,            8192
##UNITS=     SECONDS,       ARBITRARY UNITS, ARBITRARY UNITS
##FACTOR=    0.0002768,     1,               1
##FIRST=     0,             0,               0
##LAST=      2.2672688,     0,               0
##MIN=       0,             -95241,          0
##MAX=       2.2672688,     93776,           0
$$ Real data points
##PAGE= N=1
##DATA TABLE= (X++(R..R)), XYDATA
0@%%%%%%%%%%%%%%%%%%%%%%%%%kJ0j6J6j6J6j6J6j9K5l0L2l3L8m5M9n4O0o6P3
$$ 0 0 0 0 0 0 0 0 0 0 0 0 0 0 0 0 0 0 0 0 0 0 0 0 0 0 -2 8 -8 8 -8 8 -8 8 -11 14 -16 16 -17 21 -24 25 -29 31 -35 38
45C8q1R0j00J10j19J31j46J62j78J95k17K41k67K99l36L81m37N06n94P16q94J180
$$ 38 -43 47 -53 57 -62 69 -77 85 -93 102 -115 126 -141 158 -178 203 -234 272 -322 394 -500 680
67F80j713L051j4032l5943k5236j9636k412N179J3824K4053L2881L0541K8952
$$ 680 -1033 2018 -12014 -47957 -73193 -92829 -95241 -90062 -76238 -52185 -19304 11237 40189
80D0189K6417J8882N697l445j1647k1345k9218k9703k7808k5601j9512q288J574
$$ 40189 66606 85488 91185 87740 76093 54748 25530 -4173 -31981 -57582 -77094 -85382 -83808
93h3808R209J7800K6185K8209K6470K4787K0306J0247O40o712j4888k3108k6318
$$ -83808 -74599 -56799 -30614 -2405 24065 48852 69158 79405 80045 73333 58445 35337 9019
106I019k5534k4229k0445j2066k924M661J2220J9884K4283K4529K3082K0124J3809
$$ 9019 -16515 -40744 -61189 -73255 -76179 -71518 -59298 -39414 -15131 9398 32480 52604 66413
119F6413M921l036r369j6544k2185k3100k1365j9639j5044o483J065O641J3486
$$ 66413 71334 68298 58929 42385 20200 -2900 -24265 -43904 -58948 -65431 -64366 -57725 -44239
132d4239J9794K1323J9963J9125J5848Q040Q04m299j0627j7341j9787j8911j8513
$$ -44239 -24445 -3122 16841 35966 51814 59854 60658 56359 45732 28391 8604 -10307 -28820
145b8820j6371r867k503K342P970J4902J8473J7921J7787J6913J1304M182m45
$$ -28820 -45191 -55058 -57561 -55219 -47249 -32347 -13874 4047 21834 38747 50051 54233 53788
158E3788n487j2660j6818j6665j7031j7041j2321n759j494L234J0135J4728J5515
$$ 53788 48301 35641 18823 2158 -14873 -31914 -44235 -49994 -51488 -48254 -38119 -23391 -7876
171g876J6071J6527J3069P502L019j149p507j2454j4169j4922j5842j3826q797
$$ -7876 8195 24722 37791 45293 48312 47163 39656 27202 13033 -1889 -17731 -31557 -40354
184d0354m552o54M945J0410J2742J3787J5076J4171J0027N875K339k819q374j1366
$$ -40354 -44906 -45560 -40615 -30205 -17463 -3676 11400 25571 35598 41473 43812 40993 32619 21253
198B1253j2755j4214j4145j0980o826l650P93O344R997J1685J3029J3803J1626
$$ 21253 8498 -5716 -19861 -30841 -37667 -41317 -40524 -34180 -24183 -12498 531 14334 25960
211B5960P691M553R35m447q680j0366j1880j3202j1852q198n355k334K708P331
$$ 25960 33651 38204 39139 34692 26012 15646 3766 -9436 -21288 -29486 -34841 -37175 -34467 -27136
225b7136R150J0628J2483J1888Q627N885L457j110n914q046r589j1624j1728r047
$$ -27136 -17986 -7358 5125 17013 25640 31525 34982 33872 27958 19912 10323 -1301 -13029 -22076
239b2076o338m307k65M594P049Q526J0755J1427R238O707M982J435l231o165p475
$$ -22076 -28414 -32721 -32986 -28392 -21343 -12817 -2062 9365 18603 25310 30292 31727 28496 22331 14856
254A4856r746j1021r360o954n385k470J948N043O667Q691J0333R302P173N789
$$ 14856 5110 -5911 -15271 -22225 -27610 -30080 -28132 -23089 -16422 -7731 2602 11904 19077 24866
268B4866L284p45m013n639p639r564r162p308o074m045m33K997M720O586Q647
$$ 24866 28150 27405 23392 17753 10114 550 -8612 -15920 -21994 -26039 -26472 -23475 -18755 -12169 -3522
283c522R008P323O127M723J481j893l910n485p747q558p318o178n050k490R08
$$ -3522 5486 12809 18936 23659 25140 23247 19337 13852 6105 -2453 -9771 -15949 -20999 -23489 -22581
298b2581L072M555O690P993P176O069N268L209N9k275l635n581p349o926n842
$$ -22581 -19509 -14954 -8264 -271 6905 12974 18242 21451 21510 19235 15600 10019 2670 -4256 -10098
313a0098n264l918q16J503K736M561O608O559N633N273M203J632q89k048l721
$$ -10098 -15362 -19280 -20096 -18593 -15857 -11296 -4688 1871 7504 12777 16980 18612 17723 15675 11954
328A1954n699o161n424m986m482k208K26J589K748M941N842N043M772M519K751
$$ 11954 6255 94 -5330 -10316 -14798 -17006 -16780 -15191 -12443 -7502 -1660 3383 8155 12674 15425
343A5425J87r86k179m067n313m925m468m475l030q08O42J538L449M848M565M307
$$ 15425 15612 14626 12447 8380 3067 -1858 -6326 -10801 -13831 -14639 -13997 -12459 -9010 -4162 403 4710
359D710M319L313J229k30j073k761m304m460m025m103l531j600j73P33K086L824
$$ 4710 9029 12342 13571 13341 12268 9507 5203 743 -3282 -7385 -10916 -12516 -12689 -11956 -9870 -6046
375f046M176L870L918L601K009M33l44j617l278l883l563l691l700k273p85J28
$$ -6046 -1870 2000 5918 9519 11528 11961 11617 10000 6722 2839 -724 -4415 -8115 -10388 -11173 -11045
391a1045J017K647L655L400L423L550K621R43J85o04k132l268l097l156l382k708
$$ -11045 -10028 -7381 -3726 -326 3097 6647 9268 10211 10396 9792 7660 4392 1295 -1861 -5243 -7951
407g951j259l85J98J594K851K869K801L157K802J420N83N2j074k375k614k494
$$ -7951 -9210 -9595 -9397 -7803 -4952 -2083 718 3875 6677 8097 8680 8732 7658 5283 2669 175
423A75k830k703j632o69k68O85J924K315K112K533K626J659O92L99k97j499k049
$$ 175 -2655 -5358 -6990 -7659 -7927 -7242 -5318 -3003 -891 1642 4268 5927 6619 7018 6721 5222 3173
440C173j850k136k384j725p37m63K5J131J732J759J740K154J756P20M00J86q06
$$ 3173 1323 -813 -3197 -4922 -5659 -6122 -6097 -4966 -3234 -1475 265 2419 4175 4895 5295 5481 4675
457D675j559j502j475j976j663p41m12k43M84J407J335J275J725J621P97M20K53
$$ 4675 3116 1614 139 -1837 -3500 -4241 -4653 -4896 -4412 -3005 -1670 -395 1330 2951 3748 4168 4421
474D421l17j123j272j162j456j565q71l54k34R9R62J162J017J221J518R68L25
$$ 4421 4104 2981 1709 547 -909 -2474 -3345 -3699 -3933 -3834 -2872 -1710 -693 528 2046 3014 3339
491C339L02j2p57j105r12j083j381j025l55k65j54N70J045P94Q92J281R71M38
$$ 3339 3641 3629 2872 1767 855 -228 -1609 -2634 -2989 -3254 -3408 -2838 -1793 -999 -107 1174 2145 2583
509B583L41J94l48q72p89p63j076j010n33k53k69K04P32P55N66R26R76M79J82
$$ 2583 2924 3118 2770 1898 1109 346 -730 -1740 -2273 -2526 -2795 -2591 -1859 -1104 -538 388 1364 1843 2025
528B025L57k7o17p61l87q04r07m96j21k02p8N15O17M07N64P86M82L7J27N9l47
$$ 2025 2382 2355 1738 977 590 -214 -1121 -1617 -1738 -1940 -2018 -1503 -886 -479 85 871 1353 1390 1517 1576 1229
549A229o28k86m23o34m11J0o7q7L22N78L99K68N22L68j3r7J8l02n82l88l36k85
$$ 1229 601 315 -108 -742 -1153 -1143 -1210 -1297 -975 -397 2 270 792 1160 1147 1050 1068 766 184 -204 -540 -825
571h25l75N4J78L4K30O60M38J70L61L52j8k45j11k78n69n11k19k81l39KK11J76
$$ -825 -1200 -1146 -968 -934 -704 -44 394 564 925 1277 1259 1014 903 625 56 -455 -674 -955 -1294 -1292 -1081 -905
593i05K22N63N23L26K04L68O2k49k08j38n42n56l15k39l55j55J84K75J27L95N78
$$ -905 -683 -120 403 729 933 1301 1363 1114 906 768 226 -330 -645 -884 -1239 -1394 -1210 -935 -808 -413 165
614A65L56K22L10K24j74j85j47l47m28m23k15k76k49J52J41J39K30N47L28J79
$$ 165 521 743 1053 1277 1103 918 771 424 -4 -427 -642 -918 -1167 -1015 -874 -735 -505 42 370 549
634E49K60K50m8k28r6j76m51m13j70k55j96n7K12J59K02M44L79K51J12K18O9k03
$$ 549 809 1059 1011 783 687 511 60 -353 -523 -778 -974 -1031 -819 -660 -458 -14 365 616 728 946 1015 812
656H12j54k73l32m48k20k31k05q9J78K43J89L88N27L87J78K36R2r7l16k67l27
$$ 812 658 385 53 -395 -615 -846 -1051 -1140 -962 -719 -530 -142 385 772 950 1186 1278 1181 865 598 271
677B71n34m41l01k85j86P1L21K06L77O12M72L69L66K52j1k15j93l91n65n92m63
$$ 271 -263 -704 -1005 -1290 -1476 -1405 -1084 -878 -501 111 583 952 1318 1570 1559 1344 1151 760 195 -397 -860
698h60l81l85j31J05K20L81N10P10M86M96M43J97o1j20k79n54o51n42m89n41l54
$$ -860 -1241 -1626 -1757 -1652 -1432 -1051 -541 169 655 1151 1594 1791 1730 1610 1331 777 126 -416 -905 -1446 -1800
719a800m6J31K56M08O14O25N53N61L65J77k8j79l74o05n74n88n40m95k23J5J45
$$ -1800 -1846 -1715 -1459 -1051 -437 188 741 1302 1667 1844 1816 1637 1263 658 84 -504 -1044 -1539 -1762 -1747 -1602
740a602K60M94O41N11N38N59K36NJk14n39n12n41n95n12l16j38O0K37M41M78N66
$$ -1602 -1342 -848 -207 304 842 1401 1637 1642 1643 1429 890 378 -163 -758 -1270 -1586 -1724 -1664 -1427 -986 -508 58
762E8N09O03L61J42Nj55m11n30n67n53n96l54k34j0J46K83N60O02N45N72N39K27
$$ 58 567 1170 1531 1673 1678 1523 1112 582 15 -538 -1134 -1488 -1722 -1732 -1586 -1303 -743 -141 404 976 1515 1742
784A742O9j9l93m48o45n57o75n18k87j56J4K21M67N55O28O77O20M49K36L6j85
$$ 1742 1811 1792 1399 951 306 -251 -926 -1444 -1731 -1887 -1873 -1652 -1185 -630 -2 675 1295 1744 1980 2016 1831
805A831m15n28n92o53p13n27k70k12J05K81M73N84O93O90N58M08K72N3j07m24
$$ 1831 1416 888 296 -357 -1070 -1597 -1867 -2079 -1974 -1693 -1220 -636 57 747 1305 1713 1985 2038 1931 1507
825A507n37o72o90o09n15l49k10J03K42N13M92O94O73O23M13K55P8j41l49n57
$$ 1507 970 298 -392 -1001 -1516 -1865 -2075 -1972 -1730 -1217 -725 -31 642 1265 1678 1933 2011 1870 1521 964
845I64o38o37n81n81l82j00N3K43N01N73O35O57N21M20K10Lj37l74n38o69o04
$$ 964 326 -311 -892 -1473 -1855 -1955 -1902 -1659 -1158 -585 50 707 1228 1648 1858 1861 1724 1350 812 143 -461
866d61o01m36k84m3M8L13M81N16P66M65N27M11R1m2j75m55n45n54o78m83m38k18
$$ -461 -1062 -1498 -1782 -1825 -1777 -1464 -983 -467 299 764 1291 1702 1793 1751 1576 1121 576 22 -656 -1139 -1577 -1795
888a795rJ47L35N41N98N92O36M41K49J48p3l19n47n31o66o39n30k84k50NK85M05
$$ -1795 -1804 -1657 -1322 -781 -183 409 1045 1486 1735 1883 1810 1491 944 413 -253 -892 -1422 -1706 -1956 -1951 -1666 -1261
910a261N53N38Q68M99N01K81P3j42l79n57n90p53o55n44l37k20K6K96M86N75P33
$$ -1261 -708 -170 698 1197 1698 1979 2052 1910 1531 974 384 -369 -1024 -1568 -1905 -2125 -2099 -1803 -1317 -742 -9
931iO87P12M51K75M1j28l53n43p11p59o90n67m66k16R3K48N23O06P29P33O57O09
$$ -9 678 1390 1841 2116 2157 2029 1676 1133 422 -337 -1027 -1594 -2060 -2276 -2183 -1935 -1412 -806 -77 656 1313 1922
953A922K66Q8r7m33n68p26p35p04o37m84j73M1L37M10O83P89P08O67N41L00N8
$$ 1922 2188 2276 2179 1746 1178 452 -283 -987 -1624 -2108 -2281 -2240 -1903 -1493 -810 -21 687 1354 1895 2195 2253
974B253j64l68p24o51p08o75o79l48j46N7K79N45O82P41P77O39M61K29l6j74m61
$$ 2253 2089 1721 997 346 -362 -1037 -1716 -2064 -2210 -2153 -1874 -1329 -647 94 871 1510 1971 2200 2164 1990 1529
995A529o97o88p09p23n62k89r1J77M34N46P03P86P57N62L75J71m8l02o40o71p92
$$ 1529 832 144 -565 -1288 -1850 -2139 -2230 -2053 -1619 -1073 -370 416 1173 1735 2110 2281 2233 1931 1291 620 -172
1016a72o97p27m68j94m1J84N84P11P06Q21P78N18K96J56k24m74o23p37q85p20
$$ -172 -869 -1596 -2064 -2258 -2299 -2115 -1531 -820 -114 707 1485 2003 2299 2455 2231 1757 1134 397 -488 -1208
1036a208o77l71k28L3L98O08O99Q46Q08Q20N08K76L4k55n53o40p98q96p96o51
$$ -1208 -1885 -2256 -2484 -2451 -2053 -1445 -746 100 908 1728 2236 2512 2546 2291 1738 1098 300 -596 -1392 -2043
1056b043l80j64J19M71O03P17R23Q24O56M96L47k6l27m88p14q41q74p05o08m19
$$ -2043 -2423 -2587 -2468 -1997 -1394 -677 246 1070 1726 2222 2569 2543 2216 1728 1014 173 -701 -1406 -2014 -2433
1076b433j55J79M49O06P45R14P91O45N21K39n7l47m63p59q58p62o84n94l89j9
$$ -2433 -2588 -2409 -1960 -1354 -609 305 1096 1741 2262 2501 2444 2097 1634 875 17 -745 -1429 -2023 -2412 -2431
1096b431K30L82O79P37P90P47O25M17J59q0l85m74p39p87p75o08n10k19L9K05
$$ -2431 -2201 -1819 -1140 -403 387 1134 1759 2176 2335 2255 1870 1396 657 -130 -905 -1513 -2023 -2242 -2203 -1998
1116a998M86O63P19O91P14N75K54J17k08l55n19p27p16p20o35l93j12N9K62M53
$$ -1998 -1512 -849 -130 561 1275 1850 2104 2221 2013 1658 1139 412 -304 -1024 -1659 -2052 -2164 -2105 -1843 -1390
1136a390P82P28O36P10N22J62k0j65m00p14o84p20o29o19k76j21J37L25O00O66
$$ -1390 -608 120 756 1466 1988 2150 2130 1965 1565 851 167 -553 -1182 -1801 -2077 -2198 -2061 -1736 -1136 -470
1156d70O67P96N82M21J64qk00n64n86p14p34o75n01l06m7J10M01N33O69P95O50
$$ -470 197 993 1575 1996 2160 2152 1952 1388 802 88 -646 -1321 -1822 -2128 -2175 -2065 -1664 -1131 -462 333 983
1177I83O40L22K10M9l17m77n94o80p80o34n12k43r4J63L53N30O96O54O40N79L53
$$ 983 1623 1945 2155 2204 1887 1410 816 136 -644 -1278 -1790 -2033 -2127 -1964 -1611 -1081 -385 269 909 1488 1841
1198A841K32j9l48m30n38o34o46o03m89k73j12K17L20M87N80O68N98M42M29J20
$$ 1841 2073 2054 1706 1276 738 104 -542 -1145 -1634 -1907 -2019 -1802 -1482 -995 -415 253 851 1293 1722 1842
1218A842l3k20l67n33o20o25m89m38k64n3J55L48L76N60N96N55N07L14R3k9j93
$$ 1842 1809 1589 1222 689 69 -556 -1045 -1483 -1747 -1800 -1645 -1297 -921 -361 235 790 1297 1611 1704 1675 1482
1239A482l56o13n14n70m54m73j75m1K49K34N06M96O10N39L70L00M1j3k29n11m92
$$ 1482 1126 513 -1 -571 -1025 -1498 -1673 -1714 -1465 -1231 -725 -229 381 920 1290 1590 1631 1618 1389 878 386
1260C86n30m88n16l17j83mJ80L97M52N49N21N51M38K22O2n9l08m51n77n89n75
$$ 386 -144 -632 -1148 -1465 -1648 -1652 -1472 -1075 -623 -74 447 998 1436 1658 1720 1661 1353 902 325 -264 -839
1281h39m32l01j54k2K19M36M98N12O03N61M00K21P0r0l70m00n34o04n76m72l06
$$ -839 -1271 -1572 -1726 -1748 -1529 -1093 -595 -83 520 1081 1481 1702 1772 1682 1312 912 378 -226 -802 -1274 -1580
1302a580k25O2K21L98M66N39O13N73L50K28J44j08l48l38n73o39n52l91l26k25
$$ -1580 -1805 -1743 -1522 -1124 -658 -119 494 1067 1417 1645 1789 1681 1333 995 422 -217 -769 -1160 -1486 -1711
1322a711L4K26L03M51N10N93N15M13K25J21j00k98l22m83o03n38l74l61k01J23
$$ -1711 -1677 -1451 -1148 -697 -187 406 921 1334 1559 1680 1580 1282 960 477 -126 -664 -1038 -1399 -1600 -1477
1342a477R7K51N05N48N08L81M03K48J17j69k61l00n46m41m62l96l64l6PJ59K58
$$ -1477 -1380 -1129 -624 -76 432 813 1216 1464 1581 1412 1151 851 305 -136 -598 -994 -1358 -1394 -1387 -1228 -970
1363i70M44N10M62M08L24K38N2j58j91l96n23l92n14l81k88j08J37J59L20M23
$$ -970 -526 -16 446 854 1178 1416 1468 1310 1119 723 200 -192 -706 -1087 -1375 -1483 -1346 -1187 -867 -444
1383d44N41M22M13L50J28J04j97l04l97m68m75m49m11k53n5M2K15M19M91M84M72
$$ -444 97 519 932 1282 1410 1514 1317 1013 616 148 -327 -776 -1187 -1440 -1495 -1453 -1238 -819 -328 156 628
1404F28M64K58J71J0j53l47m35n03m95n42k98k70kK0K02N06L81N54N44M10L17
$$ 628 1092 1350 1521 1531 1378 1031 596 93 -402 -944 -1242 -1512 -1514 -1494 -1292 -786 -405 149 693 1103 1420
1425A420J08O4k52k96l83m67o07m98l86k29p8R7L17L18M74N82M41M46L01K46m8
$$ 1420 1528 1592 1340 1044 661 194 -413 -911 -1297 -1526 -1604 -1507 -1190 -872 -398 184 625 1071 1372 1618 1570
1446A570j89k91m28n43n27m59l52k44p2Q8K72L30M46O02M48L84K89J39k2j44l08
$$ 1570 1381 1090 662 119 -408 -867 -1219 -1463 -1535 -1447 -1175 -845 -399 203 651 1035 1324 1463 1441 1297 989
1467I89m01n38m82m02l31j99m5R4K53L64M49M88M36L64K25K28j43k20k27m94m50
$$ 989 588 50 -432 -834 -1165 -1364 -1409 -1315 -1062 -698 -249 239 675 1039 1264 1492 1349 1129 902 408 -42
1488d2m32l80l59j35j6J67K49L78M78M66L67L81J94N0r8k16l76l97n08l26m43
$$ -42 -474 -854 -1213 -1348 -1364 -1197 -948 -570 -92 374 741 1122 1316 1366 1268 1052 676 279 -229 -555 -998
1509i98k32j62P0K07K61M32M58M33M20L63J30Nn7l23m10m39n24m52l20k52j8M7
$$ -998 -1230 -1392 -1322 -1115 -854 -422 36 469 889 1252 1382 1387 1330 1007 597 158 -366 -818 -1138 -1390 -1408 -1361
1531a361K11L09N03M65M51M57K48J12L3j19l03m14m90m53m82l75j90p3P4K67M01
$$ -1361 -1150 -841 -338 127 578 1035 1283 1395 1428 1309 1006 592 102 -351 -833 -1208 -1398 -1471 -1397 -1130 -729
1552g29M19M70M68L58K41J89K4k21k81m08m68m54n05k61j51j06J23K68L78L67
$$ -729 -310 160 628 986 1227 1416 1440 1219 938 530 62 -392 -897 -1158 -1309 -1415 -1292 -1024 -646 -279
1572b79N02M15L58J92J83j8k21k93l60n14l81l10l45j86n1J48K12L79M23M94L04
$$ -279 223 638 996 1188 1371 1353 1132 839 479 -35 -416 -726 -1071 -1257 -1308 -1160 -948 -569 -146 348 652
1593F52K55K92K7n3k14k42l69m67m31l47j57j57P7J05K57L70L90M20K92L22J41
$$ 652 907 1199 1226 1173 959 717 348 -119 -550 -897 -1054 -1211 -1134 -1029 -772 -402 -12 408 700 1022 1163
1614A163L8j64j24l75m02m50l20l18j53j08R8K12K72M02L64M21L36K24J31l3j91
$$ 1163 1201 1037 913 538 136 -314 -634 -952 -1105 -1213 -1115 -903 -631 -229 135 556 892 1116 1247 1214 1023
1635A023k79l48m48m17k91l15j31l0J60J92L07M91M17L57L18K14N7j03j66l25
$$ 1023 744 396 -52 -469 -760 -1075 -1206 -1236 -1076 -884 -577 -86 331 688 1006 1220 1277 1174 1008 683
1655F83m73m04m23k80k56j99K1K03K83M15M45M13L48L22J79N1j22k38l38l88m82
$$ 683 210 -194 -617 -897 -1153 -1352 -1331 -1128 -845 -430 15 428 776 1098 1277 1328 1206 968 630 242 -240
1676b40l85l24k94p2J9K61K59L97M70L43L96L45Q4kj21k87l25m62l64m20l45n8
$$ -240 -625 -949 -1243 -1315 -1296 -1035 -776 -379 91 434 830 1175 1259 1257 1136 849 524 62 -302 -722 -1067 -1125
1698a125p6L2J96L19M45M33L67L17K33N5n0j72k79l61m01l72l50k85j10J9J53
$$ -1125 -1201 -1169 -973 -654 -209 224 591 908 1141 1196 1146 974 695 334 -67 -439 -789 -1074 -1184 -1165 -1012
1719a012L41K36M20L71L49K37K08rp9j88l92m02l16m30l23j21k9Q4J52L44M14
$$ -1012 -671 -435 -15 356 705 942 1150 1141 1062 874 482 80 -236 -666 -989 -1110 -1139 -1055 -903 -559 -145
1740a45L26L72M10J20J11k3k78k50l58m02l87l25l04j23N6J53K57M01L31M30L88
$$ -145 181 553 963 1083 1194 1171 893 643 285 -117 -504 -829 -1133 -1256 -1200 -1047 -790 -389 -58 372 760
1761G60L10J45M3j42k23l01m12m83l91l46j86m0KK15L59M18L94M89L03K18J77
$$ 760 1070 1215 1258 1116 893 592 180 -303 -694 -1040 -1226 -1266 -1264 -1049 -690 -272 122 611 914 1132 1309
1782A309Jj74k81m03m37m21l85l16q7j52K36K14K86M22M48M65L04J69J08o8j98
$$ 1309 1310 1136 855 452 15 -406 -791 -1107 -1194 -1346 -1110 -896 -610 -188 260 725 1029 1198 1306 1238 1040
1803A040l12l74n14m12l40k00j61K2J60L07L28M44M81L45K87J52K9j86k52l15
$$ 1040 728 354 -160 -572 -912 -1112 -1273 -1251 -1091 -784 -456 -12 469 814 1101 1253 1282 1096 844 529
1823E29m32m16l89l21j85j29J98K30L61M12L39M95K77K53O4k5k39l00m30m48m18
$$ 529 97 -319 -708 -1029 -1214 -1343 -1145 -915 -554 -142 197 692 969 1222 1286 1261 1022 722 292 -156 -574
1844e74m04k08r0N2J85K39L56N07M50L51L08J72K2j85l43l36m65m74l95l60j78
$$ -574 -978 -1186 -1276 -1224 -1039 -800 -444 63 513 864 1172 1344 1366 1181 838 502 37 -437 -832 -1192 -1370
1865a370k4J03K96L31M28N55M34L00L65L8m9j60l99n50n12m24m04l12q3pJ78L23
$$ -1370 -1394 -1291 -995 -664 -236 319 753 1053 1418 1456 1407 1247 848 298 -214 -638 -1042 -1354 -1437 -1444 -1266 -943
1887i43M09N20M84N30K96J77K2j40k65m03n00m88m86l98k41r5M1K71L19N43N27
$$ -943 -534 -14 470 1000 1296 1473 1495 1355 1090 687 187 -301 -787 -1185 -1426 -1521 -1480 -1209 -890 -347 180
1908A80M80M24K96K03q5j86l13m89n32m94l89l72k10K3P2L02L73N70M90M39L87
$$ 180 660 1084 1380 1583 1498 1312 999 510 -22 -516 -905 -1277 -1487 -1464 -1392 -1090 -717 -147 343 782 1169
1929A169L07M4m1k94l74n16m93m74m15l05j23N4K14L95M67M33M95M57L45J67k
$$ 1169 1476 1520 1479 1185 811 295 -198 -672 -1087 -1392 -1515 -1461 -1247 -852 -385 48 543 1000 1345 1512 1510
1950A510r9l99l95o09m60m44l85k66j6J59J92M49N82N01N18M23K62R6j47j85l69
$$ 1510 1411 1012 617 8 -452 -896 -1281 -1547 -1563 -1404 -1212 -763 -181 320 838 1261 1523 1619 1472 1287 918
1971I18n52n65m89n08l02j33jJ96L54N29N82N52M92M35J41l4Jl98n36m88n42n72
$$ 918 366 -199 -688 -1196 -1498 -1631 -1632 -1436 -1082 -553 29 581 1073 1508 1649 1615 1616 1218 682 194 -348 -920
1993i20m55k58j36J54K62M37N31N62N57N48L28R7O3k72m10n05n41o25m81l96k62
$$ -920 -1375 -1633 -1769 -1615 -1353 -916 -385 177 734 1282 1610 1707 1770 1498 1088 583 42 -583 -1064 -1460 -1722
2014a722l6J61K68M70N54P07N58L74L32J18q5k89m14n78n76n38m79m17j08n7K51
$$ -1722 -1758 -1597 -1329 -859 -305 402 960 1334 1666 1784 1699 1410 996 418 -158 -696 -1175 -1592 -1700 -1757 -1506
2035a506M61M72N32O02N42L68J96N4j40l51m89n03o52n26l49l20n2J2L37M17N19
$$ -1506 -1045 -573 -41 561 1103 1471 1667 1721 1581 1230 741 238 -414 -940 -1289 -1609 -1661 -1649 -1312 -895 -376
2056c76N82N83M03L41J85j11j58m18n32n32o10m39l88k08MJ67M00M18N32O15N39
$$ -376 206 789 1192 1533 1718 1607 1449 1031 499 -33 -643 -1082 -1470 -1678 -1674 -1507 -1107 -689 -157 458 997
2077I97L92K76R3q7l21n12m85o60n51m32k91j81O9K99L81N17O48N57M03M53J20
$$ 997 1389 1665 1758 1671 1350 838 353 -307 -858 -1290 -1581 -1762 -1693 -1394 -1013 -496 152 709 1112 1565 1685
2098A685M7k22l94m72n95n75m90l90k78m0J24L40M78M74O29M61M70L77J05j15
$$ 1685 1732 1510 1116 644 49 -526 -1016 -1406 -1684 -1724 -1600 -1260 -782 -308 321 782 1252 1629 1734 1619
2118A619k07l83m42o03o60m40l42k54J7K01M00M69M94N76N17L58K94N5j19l49
$$ 1619 1412 1029 587 -16 -676 -1116 -1458 -1712 -1695 -1494 -1094 -625 -131 445 962 1320 1614 1669 1550 1201
2138A201m21m60n67n30m36k89j24j8L09L67N18N35N21M42K88K26j0j74k77m72
$$ 1201 780 320 -247 -777 -1213 -1502 -1626 -1644 -1335 -968 -450 85 606 1048 1336 1562 1552 1378 1101 629
2158F29n53n18m17m02k79j9J66K44L95N09N62L95M00K95J29j39k11k89n04n24
$$ 629 76 -442 -859 -1261 -1540 -1559 -1393 -1149 -754 -245 317 712 1112 1407 1536 1397 1186 897 393 -131
2178a31m78m17k94j13K6J36L19M57M77M97L77L89K10m0j24k55m25m75n12m08l51
$$ -131 -609 -1026 -1320 -1433 -1407 -1271 -952 -495 -18 479 856 1245 1455 1415 1291 1036 611 136 -376 -784 -1135
2199a135k17l3K9K64L60M64M29M90M02K81M2K7j71l66m57m32m63l64k84k15lJ07
$$ -1135 -1352 -1385 -1356 -1092 -732 -268 161 651 1053 1334 1376 1403 1232 866 409 -23 -486 -850 -1134 -1349 -1352 -1245
2221a245L03L30M64M67L58M28J45N7j7k10l32m29m41m11l64l03l1K5K6L52M36
$$ -1245 -942 -612 -148 319 677 1105 1250 1307 1290 1080 748 319 -122 -533 -897 -1200 -1231 -1206 -1180 -828 -392
2242c92L98L55M73K60J27K6r6k47m09l05m26l59l15j74p4oK28L39L19L55L41L29
$$ -392 6 361 834 1094 1221 1247 1151 904 495 190 -236 -595 -910 -1084 -1158 -1164 -936 -597 -278 77 418 747
2264G47K96P3oj88k61k77m44k81l17k17p8p2J13K24L11K46M02K65K79J20N1l6
$$ 747 1043 1116 1110 922 661 384 -60 -341 -658 -875 -953 -1025 -912 -688 -377 -131 271 536 815 935 986 950
2286I50k14k76k54l51l18k51r0q2o3J63K56K17L21L65K72J69J1L4o9k77j51k86
$$ 950 736 460 206 -145 -463 -714 -804 -886 -949 -786 -530 -313 8 373 645 814 825 859 790 513 362 76
2308G6l34k45j90j55p8P8K01K05K72L24L12J90P6P8j4j38k27j84k14l96j63j98
$$ 76 -258 -503 -693 -848 -926 -848 -647 -442 -170 154 466 656 732 810 796 658 431 247 33 -363 -526 -724
2330g24n9MJ47J55J59K70K42K29J78J96m7o4j37j78k51k28j95j94q8j32L1N9J92
$$ -724 -783 -779 -632 -477 -318 -48 194 423 601 797 750 686 549 371 120 -108 -303 -497 -585 -717 -686 -627 -435
2353d35J83K13K88J56Q8J26Kp6j38q3k42j58k22q7j93mJ3Q0J85J36J50J62K06
$$ -435 -252 -39 249 405 493 619 621 545 407 324 82 -76 -298 -385 -578 -582 -569 -489 -304 -168 -18 144 350
2376C50J08J0L9j09j09m2j88j91q3j09r5m0K1J24P2J75Q4J20J10P5R9q0J9q5j06
$$ 350 458 468 507 398 289 247 59 -132 -215 -324 -419 -459 -438 -314 -242 -67 17 137 247 322 421 341 360 275 169
2401A69r9j21j74o0l9J5K1K9R7R3J55L2J28N0K8r1M4p5j35q2n7j19n9k0P9j5M4
$$ 169 70 -51 -225 -285 -324 -309 -288 -259 -162 -69 86 118 246 296 324 233 277 202 67 -15 -72 -191 -250 -270 -191 -206 -162
2428a62Q0K1Q4O9P3O1JK7j7p7j09k7q1j19J1n0K0o6Q4J17m2J19L7J20K3lO5p9
$$ -162 -82 -61 23 92 165 226 227 254 237 160 51 24 -57 -176 -165 -215 -195 -261 -177 -60 -102 17 54 174 197 194 259 180
2456A80l0j9n7p2n1p1rp9k3N3J6J6MR6Q2Q0N5L7J1k8K3o7j07m9Jq7j03K4n6J6
$$ 180 150 131 74 2 -49 -120 -129 -208 -231 -178 -162 -146 -142 -46 36 116 171 208 219 191 214 147 40 -9 -8 -95 -198 -174 -230 -214
2486b14rJ3M0J66NJ28M0K5K1P8n7p1kp7o0j23j13l2j8K8l6P3J34L9J25K9R3N6
$$ -214 -223 -210 -170 -4 1 129 169 194 215 293 236 165 163 86 26 -97 -210 -242 -260 -232 -268 -195 -61 -22 103 132 225 281
2514B81J4j4m2o1j49l4n3j32n9j4o1M8QQ5J18P7J44J32N3n0M3k5r8p7q0j49j64
$$ 281 295 281 239 178 29 -5 -58 -190 -249 -263 -324 -276 -268 -183 -65 12 156 288 341 291 334 309 211 134 54 -95 -259
2541b59Jl4n2L9MJ54M6J69R2J84QK2j5m0j64q8j11j90j00j5j20L1Q9J26P9R8K40
$$ -259 -258 -292 -344 -305 -301 -147 -101 68 160 344 352 374 359 319 155 67 -44 -234 -334 -349 -469 -438 -349 -223 -144 -46 194
2568A94J19Q2RP7k7j02j94r4k00j09j62n3rj3J23O7J77J56K30J52K7R9P8j27j03
$$ 194 313 395 404 481 454 352 158 64 -136 -245 -407 -460 -469 -482 -359 -292 -115 41 271 423 450 549 627 500 397
2593C97j75j34k71j63j54q3J4L7Q1J70J34K25K10J46J27N0mp7j00k15k21k44j75
$$ 397 222 88 -183 -346 -500 -583 -569 -532 -451 -281 -147 78 288 434 561 611 607 530 430 215 -6 -250 -425
2616d25r9j65J8Q4J00J67K19K40K19R8K06J1m8r1j29k09k61k11j79j68o3lP5J43
$$ -425 -524 -689 -671 -587 -487 -320 -101 139 358 456 662 673 625 534 405 196 -65 -276 -455 -623 -686 -689 -614 -471
2640d71K43K08J97J94K11J82j06kj04j20k38k69k36j90j90p2P4L6K17J94K39K92
$$ -471 -228 -20 177 371 582 764 658 656 552 432 194 -75 -311 -501 -691 -763 -689 -653 -436 -242 -3 289
2662B89K30J31J11J1j12j42j71k21l15k01k27r2j7J4P2J95K58K89K75K13J76p
$$ 289 519 650 761 772 660 518 347 126 -189 -390 -617 -709 -726 -712 -640 -445 -187 102 377 590 766 759
2684G59Jr1j72k91k33k59k63j86p2j0L9K07K54K59L13K04K74J35j0J0j95j65l15
$$ 759 760 669 497 206 -27 -286 -549 -735 -807 -817 -778 -571 -317 -58 255 459 733 868 858 868 673 508 193
2707A93k91l21k41j81l2l4J43K19K65L06K57L24J70J13N7o8j51l17l04l58l03
$$ 193 -98 -419 -660 -841 -873 -907 -764 -545 -280 26 283 607 777 890 947 879 728 411 107 -251 -554
2728e54j92j04j29Q0J00K64L76K45K91L34J54J15k3j09k17k34l22l36l55k12j16
$$ -554 -746 -850 -979 -899 -799 -535 -159 86 377 711 865 980 957 848 631 397 75 -261 -616 -828 -944
2749i44o9J81R2K71K73L30L68J82K08J49m6j93k25k92l19l42k90k11o8j01J69
$$ -944 -1013 -832 -740 -469 -196 134 502 684 892 1041 995 802 577 285 -34 -376 -666 -877 -945 -1046 -877
2770h77J76K12L22M79L23J44J68J27j27k37j85l24l78l36k35j56j76J27O2K14
$$ -877 -701 -489 -167 312 635 779 947 1074 947 710 525 201 -177 -513 -748 -904 -1080 -953 -891 -677
2790f77L13M51L25K73J78J94J6j12k48k96l49l54l51k59j06n8J03J32K88K67M72
$$ -677 -364 87 412 685 863 1057 1073 961 713 417 68 -286 -637 -896 -1002 -1060 -957 -825 -537 -270 202
2811B02L00K71K09J41j25j39k02k98l58m01k49l11q9m9J07K02K75L79L98L36K56
$$ 202 502 773 982 1123 998 859 657 359 1 -400 -649 -960 -1049 -1098 -991 -789 -514 -135 263 599 855
2832H55K27O7o9j70k98l63m21k97l56k14q6k5K14J83L18L81L80L00L18J46P0r5
$$ 855 1082 1149 1080 910 612 249 -172 -469 -825 -1039 -1125 -1150 -936 -753 -435 -54 326 626 944 1090 1160 1065
2854A065j91k98l80l97l84k42k48j9PJ09L33L65L65L27L06K54J27ko8k17l70l83
$$ 1065 874 576 196 -201 -585 -827 -1075 -1094 -1087 -978 -645 -280 85 412 718 972 1099 1097 1029 812 442 59
2876E9l45l22k50k71oQ8J94K37L58L69L64K77K66R0o1j04k85l37l28l66l26k14
$$ 59 -286 -608 -858 -1129 -1135 -1047 -853 -616 -258 111 475 752 1018 1108 1047 943 658 321 -7 -373 -699 -913
2898i13j98P2K1K24L63L02L97L14L16J53J1l2j86k94l34l22m20k88j79j21K2J60
$$ -913 -1111 -1039 -1018 -794 -431 -129 268 582 898 1051 1062 1030 844 550 216 -106 -526 -814 -993 -1114 -1092 -932
2920i32K48K83M61K77L58K36J12P0l8l02l47k40l96m74k00j58o7P5J43L11L38
$$ -932 -684 -401 60 337 695 931 1043 1113 1075 773 426 186 -210 -684 -884 -1042 -1109 -1034 -891 -580 -242
2941b42L91L79K65K28P2j03n2k25k69m34l91k93k91j48n4J06K49L19L78L40L21
$$ -242 149 528 793 1021 1093 990 938 713 444 10 -381 -674 -965 -1113 -1167 -1061 -812 -493 -115 225 546
2962E46K94J92M1j8j63k99k57l71m06l16j88j17L1J45J70L45K88M07K81J99K17
$$ 546 840 1032 1073 1055 892 593 336 -35 -441 -757 -945 -1062 -1031 -886 -716 -371 -83 324 605 804 1021
2983A021R1j28k30l04l01l30l08k63j90p6K9J88K01K98L39L57K38K48J03Lj53
$$ 1021 1112 984 754 450 149 -181 -489 -752 -942 -1018 -989 -801 -600 -302 37 394 632 880 983 986 833
3004H33j88j97l85k74k74l01j00p5Q0J99K26K95L21K45K93J16J01j0j96j67k86
$$ 833 645 448 63 -211 -485 -786 -886 -961 -881 -682 -456 -161 160 405 698 814 915 905 709 542 256
3025B56l20l00k31k04q8O5O2K47K66J86L47K51K17J54n8j34r7j86l10k72k99j24
$$ 256 -64 -364 -595 -799 -887 -822 -760 -513 -247 -61 286 537 754 908 850 716 619 433 123 -149 -448 -572
3047e72j76l4OQ8J95K70L08K41J44K58N1K3k06n5k43k80k17k03k36q6L4j7J33
$$ -572 -748 -782 -776 -688 -493 -223 85 326 470 728 779 802 596 541 298 18 -199 -402 -638 -724 -690 -707 -574
3070e74J73K68K63J99K02K18Kk9j38j11k32k39k51j93j50r7j5R0J36J63K26J99
$$ -574 -401 -133 130 329 531 749 751 722 584 473 241 2 -249 -442 -592 -689 -704 -614 -478 -315 -89 110
3092A10K05J63J33L1o1l3j93r8l72j33j34j72n3J9J07J06J91J44K36J94J07N4
$$ 110 315 478 611 642 581 548 355 257 -115 -248 -382 -554 -607 -588 -481 -375 -184 -40 196 390 497 551
3114E51j2l1r0j70j52k01r6j60j07m1P9P4P1J48J36J76J18J03J2pmp4j83j15j42
$$ 551 539 508 418 248 96 -105 -201 -361 -468 -509 -430 -356 -285 -137 -1 175 293 396 408 401 397 323 140 25 -117
3139a17j29j69Q4q7L4J87N7J05J11J54L4Q8L1j01K4j41p1j25j59j7k2j17mM5J62
$$ -117 -246 -415 -331 -418 -384 -197 -140 -35 76 230 264 352 383 282 306 165 94 -31 -190 -207 -229 -346 -350 -305 -143
3164a43R3M2J32M9Q6lN5n4o1r4o3j27n9k3o6pL6P6LR5L9J08L7O9Ml6l0k9r4l9
$$ -143 -50 -8 124 173 259 256 311 257 196 102 39 -88 -147 -170 -236 -243 -207 -131 -128 -33 6 114 151 220 224 188 158 129 35 -4
3194dn3J2j45N3M3j5P5J6nN7M9l6K0J0np9M8k6n2J0J3n3K3J9j4O2p1M2L1o1P2
$$ -4 -57 -45 -190 -137 -94 -109 -34 -18 -23 34 83 47 67 77 72 -7 41 15 -37 -27 -14 -67 -44 -25 -39 23 -48 -6 25 -36 36
3225C6l7nrj8NK7m7M0N2J5J4L1%m7k1j2r0lpl5nl5N7j5R4M6J5K3N9M8Ol1o3%l2
$$ 36 -1 -6 -15 -33 -28 -1 -48 -8 44 59 73 104 104 57 36 24 -66 -69 -76 -111 -116 -151 -94 -109 -15 31 46 69 128 176 182 151 88 88 56
3260E6r0q6j3n4q6Q2lM9M2J70N8N8k2R9L1m0o5n2j73o4o2n5m6nL9N1K7J31K02
$$ 56 -34 -120 -133 -187 -273 -191 -194 -145 -103 67 125 183 161 260 291 251 186 134 -39 -103 -165 -220 -266 -271 -232 -181 -154 -23 179
3289A79k9J06M0K3rn0j0k39l5j43j37m0l2l6J65k8J72J30J45R9J17pM4L4j83p6
$$ 179 150 256 296 319 310 260 250 11 -24 -167 -304 -344 -376 -412 -247 -275 -103 27 172 271 388 381 425 459 276 200
3315B00j71j61j11j50o7N2k7R5J06J78J67P8K03J02j6N0j33o6j61k23j61j80p2
$$ 200 29 -132 -243 -393 -460 -408 -435 -340 -234 -56 111 189 392 494 478 528 395 329 168 -55 -216 -396 -468
3338d68j30O2N1R0K17J76J47K02J19J28j4m2j08j05k60j89k04j22j34l3M6K1J68
$$ -468 -598 -536 -485 -395 -178 -2 145 347 466 594 580 538 430 325 65 -124 -328 -450 -584 -617 -571 -550 -382
3361c82K07J85K31J94J15P2O2p6j72j27k16k28k32j85j43NJ4J91J22J65K77K69
$$ -382 -175 10 241 435 550 622 684 608 436 309 93 -135 -367 -552 -695 -690 -676 -485 -363 -198 79 348
3383C48K11P4Q6Kr5j74k37k22k59k43j35p6PM3Q8K73K08K56K49J80J10N7l2j44
$$ 348 559 633 719 721 626 452 215 -7 -266 -509 -644 -720 -713 -670 -582 -309 -101 155 404 584 694 751 719 575
3407E75j95k31k13k33k64j12m4q4J56J55K43K42K35K78J07J51J6o0k31j29k71
$$ 575 380 149 -64 -297 -561 -673 -717 -801 -645 -490 -247 -5 230 508 615 766 782 722 491 362 91
3428I1l14j88k35j21n4K8J31K54K41K77K63K06J83Q8j7j35j49k84k30k98k96j41
$$ 91 -223 -411 -646 -767 -821 -793 -662 -408 -167 110 373 579 762 850 833 698 549 265 35 -263 -559 -700
3450g00j24l7P7J51J63L58K90L23J88J83J8k2j46k67k32l15k66k63j77q0K4J04
$$ -700 -824 -861 -784 -633 -470 -112 178 501 689 872 890 868 722 455 223 -92 -358 -621 -798 -878 -854 -750
3472g50J58K24L43K84K97K14J32K5q2k07k19k88k95k71k33k04om5J98J96K25L52
$$ -750 -592 -368 -25 259 556 770 902 927 845 638 419 131 -164 -435 -668 -872 -878 -923 -725 -529 -304 48
3494D8K74L32J50R5K7p7k13j84m00k62l03k26j83K%J87K52K13L73K88K65K30m
$$ 48 322 654 804 899 926 849 636 452 52 -210 -513 -739 -922 -920 -920 -733 -481 -268 105 393 658 888 884
3517H84O9j97j75k77k79l38l35j62j14j4Q6J76K78L14K94K25L17K12Jm5j51k22
$$ 884 953 756 581 304 25 -313 -648 -810 -924 -938 -852 -676 -398 -84 210 435 752 964 965 920 769 547
3539E47l29k54m06j83k35j04L0J34K27K44L04K74K88K45J61Pj05k04j42l26l53
$$ 547 218 -36 -442 -625 -860 -964 -934 -800 -573 -329 -25 249 537 782 943 950 845 641 499 173 -180
3560a80k47l42j52l3lJ80K18K55L81L09K15K70Q5K2j08k20k25l75l23k74k64j33
$$ -180 -427 -769 -921 -954 -957 -777 -559 -304 77 386 601 871 956 978 870 650 425 50 -273 -547 -811 -944
3582i44m8P7J56K44L00L27L62K17J82R5N2k41j56k74k86m28k32k66j27j7N7K11
$$ -944 -992 -915 -759 -515 -215 112 474 691 873 968 1020 779 623 349 63 -365 -597 -863 -990 -1007 -950 -739
3604g39K53L16L30L73J90J84J23n3j67j96k66m04l62k08k42j23j5J28J96K60L49
$$ -739 -486 -170 160 533 723 907 1030 977 810 614 348 -56 -418 -626 -868 -991 -1006 -878 -682 -422 -73
3625g3L56K71K50J69l7Jk48j65l14l42l31k35k18p8K9J37K52K63L05L45K63K23
$$ -73 283 554 804 973 936 937 689 524 210 -132 -463 -698 -916 -994 -965 -828 -576 -313 -8 337 600 823
3647H23J59j8m4k42k30l97k02l59k64j66o3P1J21K24L01M33K72L29J66J19q0p4
$$ 823 982 964 920 678 448 51 -151 -510 -774 -940 -1003 -932 -811 -587 -286 147 419 748 914 1033 953 879
3669H79j94l07l06l30l06k95q0j37J32K05K84L07K82L81K36K25L2m5j32k24l37
$$ 879 685 378 72 -258 -564 -859 -939 -1076 -944 -739 -455 -148 134 515 751 976 1008 963 831 607 270
3690B70l24l40k78k27j25lJ34K09K38M01L27K68K53J83J7o7j10k81l19l68k69
$$ 270 -54 -394 -672 -899 -1024 -1027 -893 -684 -446 -45 282 550 803 986 1003 936 826 545 226 -142 -411
3711d11l26k05q3J5J53J69L17L57L09K67K91J88k3o9j94l12l12k99l91k02j79
$$ -411 -737 -942 -1025 -1010 -857 -688 -371 -14 295 562 853 1041 1018 949 755 443 131 -168 -559 -761 -940
3732i40q2L6J97J58L21L12M03K63K07J75q9p0k19k78l42l28l22k65n4j59J32J78
$$ -940 -1022 -986 -789 -631 -310 2 405 668 875 1050 961 891 672 394 52 -276 -598 -863 -917 -1076 -944 -766
3754g66K58K86L98K84L11J52J23m2j50k28k82l65l83k14k85j11QQ2K19K59L71
$$ -766 -508 -222 176 460 771 923 1046 1004 854 626 344 -21 -404 -618 -903 -1014 -1006 -924 -705 -446 -75
3775g5L42K78L02J14P9j06j67k10l30l64l18k68k60n3K1J27K70L00L05L45L09
$$ -75 267 545 847 961 1040 934 767 557 227 -137 -455 -723 -983 -1036 -1015 -888 -618 -318 -13 332 641
3796F41K04J89l9p9j56l09l84l13l09k75j53o7N8J19K91K84L83L10L48K12M6M6
$$ 641 845 1034 995 916 760 451 67 -246 -555 -830 -983 -1050 -992 -873 -582 -298 85 395 743 955 1001 1047
3818A047j34j79l62l17l77k95k31j62n7R6J89K55L39L57L14L21J51M6K3k12k34
$$ 1047 913 734 372 55 -322 -617 -848 -1010 -1067 -971 -782 -527 -188 169 483 804 955 1001 1024 812 578
3839E78l01l89k81k88k55j23jJ66K24K69L05L90L14K15J84M0m7k19k60l33k95
$$ 578 277 -112 -393 -681 -936 -1059 -1060 -894 -670 -401 -96 294 608 823 1007 1047 1000 781 521 188 -107
3860a07l50l18j99r0N1P4L43L24L00L45L67J68J37kq2k79k11l77l36l65k48r4
$$ -107 -457 -775 -974 -1064 -1013 -939 -596 -272 28 373 740 908 1045 1043 961 682 471 94 -242 -607 -855 -949
3882i49j06J11K27J38M00L25L19L08J53J00p8q8k54l17l11l38l21j79j25j2P7
$$ -949 -1055 -944 -717 -579 -179 146 465 773 926 1026 948 860 606 289 -22 -360 -681 -860 -985 -997 -920
3903i20J58L14M32K78L29J81J90N9r4j53k64k64l97k92k84j50j49J1J55K55L21
$$ -920 -762 -448 -16 262 591 772 962 1021 927 774 510 246 -151 -443 -727 -877 -1026 -1015 -860 -605 -284
3924b84L40K97L05K54N1L9r1j74l37l23k82k75l38j50r4J45J99K28K67L40L30
$$ -284 56 353 658 912 963 1002 911 737 400 77 -205 -480 -818 -968 -1062 -917 -718 -490 -223 117 447
3945D47K76K32O3l3j12k96k86k96l34l03j74j97K2Q0K05L01K91L63K67K39K04
$$ 447 723 955 1018 985 873 577 291 -5 -339 -642 -816 -1013 -991 -911 -706 -405 -114 249 516 755 959
3966I59K7j26j29k29k78l38l62k05k53K0K2J11K18K48L64L39K50J80J34j3p2k19
$$ 959 986 860 731 502 224 -114 -476 -681 -934 -914 -892 -781 -563 -315 49 388 638 818 952 939 867 648
3988F48k38l28l50j95k44k37N7K3J41K81K18L29L36K06J84R5k7j74j56k89k68
$$ 648 410 82 -268 -463 -707 -944 -887 -864 -723 -442 -224 105 441 647 831 926 899 725 569 280 12
4009A2l40k54k09j54O5J28J22K48L45K71K74K45J19k0l6j74k10k84k89l32j84
$$ 12 -328 -582 -791 -945 -880 -752 -630 -382 -37 234 508 753 872 852 816 642 432 148 -141 -473 -657
4030f57j19o9J5J38J70K81L27K25K77Q6J62qj29j18l02k10l20k72j63j39n6J34
$$ -657 -776 -845 -830 -692 -522 -241 86 311 588 674 836 828 699 581 279 69 -251 -523 -686 -825 -881 -747
4052g47Q3K17L42K42K61K08J36L0P7j82j96k53k08l55j74j29j19RQ8J04K44K64
$$ -747 -664 -447 -105 137 398 606 742 772 849 667 471 218 10 -345 -519 -648 -767 -758 -670 -566 -322 -58
4074e8K43K56K13P5ko3r5j92k69k15k72j99j47K2l0J52K09J77J83K32K86N7J33
$$ -58 185 441 654 729 727 664 569 377 108 -107 -379 -578 -725 -703 -733 -581 -372 -195 -12 220 506 563 696
4097F96j6n5j29k37k36k38j25k60n7j4O7R6K81J57K40J72K07J9O2L4j50j45j84
$$ 696 680 625 496 259 23 -215 -340 -600 -657 -671 -604 -508 -227 -70 170 342 549 568 630 664 514 369 185
4120A85k20j91j74j77p9R1LJ39K16K10J43K13J46P4K9j07r8j09k33k32q7j77j30
$$ 185 -35 -226 -400 -577 -656 -565 -562 -423 -207 3 146 359 505 579 608 501 403 294 61 -171 -258 -435 -565
4143e65k5Q0J06J15J48K18J52J83O3N5J1r0q7j84j87j34j99j04n3j3L0J28J11
$$ -565 -590 -510 -404 -289 -141 77 229 412 475 530 541 451 364 180 -7 -141 -340 -444 -497 -510 -480 -352 -241
4166b41J95R9J90R5J39Rl6m2j39j60j83j02j34j27k2jP2O0J70J01K06R0Q7M2P0
$$ -241 -46 53 243 338 477 486 450 408 269 109 -74 -176 -310 -437 -459 -460 -388 -328 -158 -57 149 239 326 368 438
4191D38j01p1r7j50q6q2r4j34%JM3J19P4K26P7P2Q4K5L7q8o3n8j64j58j6j29j9
$$ 438 337 266 169 19 -67 -149 -243 -377 -377 -376 -333 -214 -140 86 163 235 319 344 381 293 230 172 8 -150 -166 -295 -314
4218c14k8O1K8J02J05J19O5J14M9PK3r4r2n7j55o3o2o4k3M2L2R1j9J33J62M1K0
$$ -314 -342 -281 -253 -151 -46 73 138 252 301 308 331 237 145 88 -67 -130 -192 -256 -279 -237 -205 -114 -133 0 162 203 223
4245B23J0L7j03oo5j02p6n9m2m7K3N2o0J02Q2M7P3P0K4N9n0o6mo2p0k1p2n2Nk7
$$ 223 233 270 167 161 96 -6 -82 -141 -183 -230 -207 -155 -215 -113 -31 16 89 159 183 242 192 126 122 60 -10 -31 -103 -155 -150 -177
4275a77L0P2j0J09K7RPJ26l8k3j03k3J1j5p5k7k3J6J2L1K0L4QLN5N7Mn1pm5Nm9
$$ -177 -147 -75 -85 24 51 60 67 193 155 132 29 6 17 2 -73 -100 -123 -107 -95 -64 -44 -10 -2 1 56 113 117 66 59 14 19 -30
4307c0k3L5J4o2J5K0o3N5N6K2Qml5O2k4k8l1M9p3J1PK1p2R3nj9JM1k8j6L3j03
$$ -30 -53 -18 -4 -66 -51 -31 -94 -39 17 39 47 43 8 70 46 18 -13 36 -37 -26 -19 2 -70 23 18 -1 0 41 13 -3 30 -73
4339g3O8j2K3q8O2roO6M1k0J7J7q0R7p3l4l6k7l5lL4kJ7Rj1Q9K0L6L4j4J3K5j04
$$ -73 -5 -17 6 -82 -20 -29 -35 31 72 52 69 86 6 103 30 -4 -40 -67 -102 -105 -71 -73 -56 -47 -58 31 51 87 121 107 120 145 41
4372D1l3J6p1k1kj1q0R4J9rK5R6J4QM4N9k6j04K9k2j24q6N8n1nJ7M0M0j2R6P3
$$ 41 8 24 -47 -68 -70 -81 -161 -67 -48 -57 -32 64 78 86 130 189 163 59 88 66 -58 -144 -86 -137 -142 -125 -85 -45 -57 39 112
4403A12k0pN1j9lJ7r9l2p7j6n8k7k5P3L1O0M4R5K0RO6j7L7r0m6m6j19J2o8k5r5
$$ 112 92 85 136 117 114 131 32 0 -77 -93 -151 -178 -203 -130 -99 -39 5 100 120 129 195 178 215 125 79 33 -86 -74 -142 -167 -262
4434b62R6L9kQ1R9O1R1K0PJ1j7j07rp2n5j61k1n7k0M4L6P5R1J15N6L3L4K5L8q4
$$ -262 -166 -127 -129 -48 51 112 203 223 230 241 224 117 108 36 -19 -180 -201 -258 -278 -234 -198 -123 -32 83 139 172 206 231 269 185
4464A85q0n8o7o5r0n4m2L0nJ0J20Q3J00Q5R4O3j1Kq6q7j06j06Np1j06p2M8R7J7
$$ 185 105 47 -20 -85 -175 -229 -271 -241 -246 -236 -116 -33 67 152 246 309 298 300 214 127 21 -85 -80 -151 -257 -329 -281 -184 -167
4493a67J12O7Q5R1K7M5M1k6n9j27q1q6n6r4m7n2N3Q3N9L5J56R1N5P0P0o0n6J2
$$ -167 -55 12 97 188 215 260 301 275 216 89 8 -78 -134 -228 -275 -327 -274 -191 -132 -97 59 150 205 275 345 285 229 241
4521B41j21j61m6j50Lj3k0J1N5J28O3J42J8J34N3n6Ll0j43r3r4o1j16q2M8m4Q5
$$ 241 120 -41 -87 -237 -234 -247 -267 -256 -201 -73 -10 132 150 284 337 281 284 254 111 18 -76 -137 -253 -335 -287 -331 -246
4548b46O6O4J48R2R0J04J7k3k0j03j26k4j21j04n7o2K3%Q8P8K3J61J17M1J41N
$$ -246 -180 -116 32 124 214 318 335 312 292 189 63 39 -82 -186 -243 -305 -282 -282 -194 -116 -93 68 185 226 367 372
4574C72r4l1m1p4j44o6j36q9l5K7K2J03Q3P6L2J23J43M5%k9p1%j36k12l7r1o6
$$ 372 278 247 206 132 -12 -78 -214 -303 -338 -311 -289 -186 -103 -27 5 128 271 316 316 287 216 216 80 -132 -169 -260 -326
4601c26OO0kP8J06J15N3J20P5K4L7k1j09j33j06o6q4p0ok2L9k3P1J08Q1K00L1
$$ -326 -320 -260 -262 -184 -78 37 90 210 285 309 346 325 216 83 -23 -89 -173 -243 -249 -271 -232 -255 -184 -76 5 205 236
4628B36L3j0J18q3j22m8j54j01r3p6mJ9L4L4J28J06J09L2Q5K5J4k6o8m0q1j58
$$ 236 269 259 377 294 172 124 -30 -131 -224 -300 -304 -285 -251 -217 -89 17 126 158 243 268 282 256 188 148 67 -91
4654i1k9m4j23RnM0M4J30P9J18P7J7J17k7j6p0j35r3q6j14p0J4p4N4O9P9J18J39
$$ -91 -120 -164 -287 -278 -283 -243 -199 -69 10 128 205 222 339 312 296 226 91 -2 -88 -202 -272 -258 -332 -278 -209 -130 -12 127
4682A27N6N1N7Kmm4o8o0k14o0n7p7J7n6O6Q1Q7J1J47O9J01L8K2r6K6o8j09m2j48
$$ 127 183 234 291 293 289 245 177 117 -97 -157 -214 -291 -274 -330 -264 -183 -96 -85 62 131 232 270 292 196 222 154 45 3 -145
4711a45o8j2r3R2l2Q2R9Q7P6J23P2rl2J1qj27j51n9r6rl3m1L4k6R9J85K9J05P8
$$ -145 -213 -225 -318 -226 -258 -176 -77 10 86 209 281 272 240 251 243 116 -35 -94 -190 -199 -232 -273 -239 -265 -166 19 48 153 231
4740B31k9Q9n2j02Kq5p2p9r8j1q7M6N0P1P4K5J01O6Q9L8n2q7mj8j30j3r5o4M4
$$ 231 202 291 239 137 139 54 -18 -97 -195 -206 -293 -247 -197 -126 -52 -27 74 140 229 267 215 128 124 106 -24 -37 -132 -196 -152
4769a52o7l4J04M3Q6P4Q9P2J1M5k7l0o6n9j09o6j22j9p4N1J7P6J07L0J46P8l2
$$ -152 -219 -253 -149 -106 -20 54 143 215 226 271 244 214 148 89 -20 -86 -208 -227 -301 -250 -233 -157 -50 -20 126 204 172
4796A72O0ll4l8p2j17m2j3j34Jol1J13R4J4J26K7P7K2L0p4O0n7r0j02r9K3j57
$$ 172 232 229 195 157 85 -32 -74 -87 -221 -220 -226 -257 -144 -50 -36 90 117 194 216 246 172 232 175 85 -17 -116 -93 -250
4824b50L3j2M9N9N6Q4N4N3N2N2l7L3j01p3p3p0j4o8ql0J7mJ40N0k5K01k5P8KJ5
$$ -250 -217 -229 -180 -121 -65 19 73 126 178 230 193 226 125 52 -21 -91 -105 -173 -181 -211 -194 -198 -58 -8 -33 168 143 221 223 238
4854B38n3j10Lr5n1p1j5n3N9n1R4k9J65N1rR1N5jL1q1r9r1k4n6n4j7Ol0Q8K9J7
$$ 238 185 75 78 -17 -68 -139 -154 -207 -148 -199 -105 -134 31 82 73 164 219 218 249 168 69 -22 -46 -102 -156 -173 -167 -197 -109 -80 -63
4885f3Q6P1N8K2K9j6p6%n5o9j01k7j6k3J7m2N9N2J25N9L4Q0J5Oo6j1p2pj75op9
$$ -63 23 94 152 174 203 187 111 111 56 -13 -114 -141 -157 -180 -163 -205 -146 -94 31 90 124 204 219 225 159 148 76 69 -106 -112 -191
4916a91L8n5qJ36PqN6R9N6M5M4j8r6kp8k6r7j15M4j3k0P1J4N1R1M1N9K6N5Lm2
$$ -191 -153 -208 -216 -80 -73 -81 -25 74 130 175 219 201 105 103 25 -1 -98 -213 -169 -182 -202 -131 -117 -66 25 66 125 151 206 209 167
4947A67q2o8m7o8n9l2jN2j8j4J30L4J13M7mR4k4o9p4Jj6j05q9Rp4K6kM8Q7M0L1
$$ 167 85 17 -30 -98 -157 -189 -190 -138 -156 -170 -40 -6 107 154 150 244 220 151 77 78 62 -43 -132 -123 -197 -171 -173 -125 -38 2 33
4978C3Q5J8N2oJ5o4j7n3r4r5mj9o5J2nJ20M0M1J01M3rQ9o0L8r5n3p1J6j72O2n5
$$ 33 118 136 188 182 197 133 116 63 -31 -126 -130 -149 -214 -202 -207 -87 -47 -6 95 138 129 218 158 196 101 48 -23 -7 -179 -117 -172
5009a72m7N7L8M3K4N6R8O7L0m1l5K4n3p1o1p1o5K4Nl5L2M0O1L5J11K8M6J3j1j7
$$ -172 -219 -162 -124 -81 -57 -1 97 164 194 153 118 142 89 18 -43 -114 -179 -155 -150 -185 -153 -113 -52 -17 94 122 168 181 170 153
5039A53l7l5j55Pl2q3j6j3O3ML1J04N8O6RL6K9l5m3o8rr4n6L7m4k6j6N4KJ39k1
$$ 153 116 81 -74 -67 -99 -182 -198 -211 -148 -144 -113 -9 49 115 124 160 189 154 111 43 34 -60 -116 -79 -123 -149 -165 -111 -109 30 9
5070IL1J37j1K5r4O7r3n2k6o5q7J1k9k1Q2J3J12L7Q1m3L7P7p6J3j44M7k8j12o
$$ 9 40 177 166 191 97 164 71 19 -7 -72 -159 -148 -177 -198 -116 -103 9 46 127 84 121 198 122 135 -9 38 10 -102 -108
5099a08j4m6QQ3OK4L2Q8lM6j2QO1o6j0q7n3j23M7l6l8N0J2M8O1kP9K7M1M4m5k6
$$ -108 -122 -168 -160 -77 -71 -47 -15 73 70 116 104 112 173 107 97 10 -43 -166 -119 -155 -193 -143 -131 -83 -22 -24 55 82 123 167 122 96
5131I6jo8l3p9mRq6K2M3J0J2R7J27j6N7n6j4l1j7k6m9l5m5m9N3j5m2O1K3P5K2
$$ 96 95 27 -6 -85 -89 -80 -166 -144 -101 -91 -79 18 145 129 186 130 116 85 68 42 -7 -42 -87 -136 -83 -98 -140 -79 -56 19 41
5162D1j2Q8l0P6j08k1pp8O9j00r4M5k3K7O5l1J18K7K7K8K7j1k0n9K2r3n2k5M3
$$ 41 29 117 87 163 55 34 27 -51 18 -82 -176 -131 -154 -127 -62 -93 25 52 79 107 134 123 103 44 66 -27 -79 -104 -61
5191f1q2l2N5K0J6J18KM1K5mO2m0k1l5l9n6q2m0l9M8m4R7M2M3L3M0N5J1P2j08
$$ -61 -143 -175 -120 -100 -84 34 36 77 102 98 160 120 99 64 25 -31 -113 -153 -192 -144 -188 -91 -49 -6 27 67 122 133 205 97
5221I7J0o2j5o8o7q3M0l9L8L6L0M4Q9L8qP6m2J8l3po3q4Lj03J7j4RK2O4K0O0O5
$$ 97 107 45 30 -38 -105 -188 -148 -187 -149 -113 -83 -39 50 88 80 156 114 132 99 92 29 -55 -52 -155 -138 -152 -143 -121 -57 -37 23 88
5253H8J6R8n2Lk6m1n9l9r1m2j5lj1K1J10rJ11L7j7R2n3O3j6j40P8r4p0j15qPq
$$ 88 104 202 150 153 127 86 27 -12 -103 -145 -160 -163 -174 -153 -43 -52 59 96 79 171 118 181 165 25 103 9 -61 -176 -184 -177 -185
5284a85L0N4P4K0N4O7N8j3OO6j44k0l8l2j76M9p2M0l4L5Q3Q4K1O7Q6J1J6l4rp1
$$ -185 -155 -101 -27 -7 47 114 172 159 165 231 87 67 29 -3 -179 -130 -202 -162 -196 -161 -78 6 27 94 180 191 207 173 164 93
5314I3n7p0n9q3l2K0m8N0NJ59N2Q1LQ7O4o1k5j3j19n1q1p8j1r8N2L0J3J17J06
$$ 93 36 -34 -93 -176 -208 -188 -236 -186 -181 -22 30 111 114 201 265 204 179 166 47 -4 -85 -163 -174 -272 -220 -190 -177 -60 46
5343D6O1O3k4R1k7j9r3m0r1oq2p2m0J0K9j2J10N4J03O8K8R1mn0M2j15n6m2j63
$$ 46 107 170 146 237 210 191 98 58 -33 -39 -121 -193 -233 -223 -194 -206 -96 -42 61 129 157 248 244 194 236 121 65 23 -140
5372a40K4j17l9L5L6K7J18Q0R5L6Q2M8nn2m6l7j02j36o0n5m4j2j0K6J40J6J74
$$ -140 -116 -233 -272 -237 -201 -174 -56 24 119 155 237 285 280 228 182 145 43 -93 -153 -208 -252 -264 -274 -248 -108 -92 82
5399H2O0O8O0j7J12j36o5q8j31%j88l6j5j3M1N7J45O5J04O4J00L6l0kl3j44r1
$$ 82 142 210 270 253 365 229 164 76 -55 -55 -243 -279 -294 -307 -266 -209 -64 1 105 169 269 305 275 273 240 96 5
5426Eq3q9n1Rn0l6O0P6Q9J06Q8J13mpM6K8j30j12q6n7j44p0L8k7J3L4Q3J41R0
$$ 5 -78 -167 -218 -209 -259 -295 -235 -159 -70 36 124 237 233 226 272 300 170 58 -28 -85 -229 -299 -261 -288 -275 -241 -158 -17 73
5455G3P9J28K5k7L3q9j05o2j31j19k9p6L5m5M2Q3N8J47J03O5J08K0n5K8q9r1q7
$$ 73 152 280 305 278 311 222 117 55 -76 -195 -224 -300 -265 -310 -268 -185 -127 20 123 188 296 316 261 289 200 109 22
5482B2p7j59r8mj2J0P4P9J16R1L7J88lQ5j7j01j3j51j41l9j12j03l5mQ8J20L6
$$ 22 -55 -214 -312 -316 -328 -318 -244 -165 -49 42 79 267 264 349 332 231 218 67 -74 -113 -225 -328 -363 -367 -279 -159 -123
5509a23J56P3M2J43j4J2Jor1j53q5j47q9k8p1M4N8J25N9J31J17J04K3K9K6m3n3
$$ -123 33 106 148 291 277 289 290 284 193 40 -45 -192 -281 -309 -380 -336 -278 -153 -94 37 154 258 281 310 336 293 240
5536B40j74n8j26q9p6l6K0NJ05O9R3J33Q0M5L3O9K2o5j54n9p8r3q0r0j15Q9RP2
$$ 240 66 8 -118 -207 -283 -319 -299 -294 -189 -120 -27 106 186 231 264 333 355 290 136 77 -1 -94 -174 -264 -379 -290 -281 -209
5564b09Q8J74O1L5J33N3Rj12K0j22j28j18j12o8k1kO0k6L7J78J36L7J29O4O6j6
$$ -209 -121 53 114 149 282 335 344 232 252 130 2 -116 -228 -296 -317 -319 -259 -285 -248 -70 66 103 232 296 362 346
5590C46o1j00j02q9j42p4q8p2N2J9J53oP7J98P5J43n4M9po0o4q2j65j20o7q8R
$$ 346 285 185 83 -6 -148 -222 -310 -382 -330 -311 -158 -164 -87 111 186 329 275 324 317 257 193 111 -54 -174 -241 -329 -320
5617c20j2M3J00J02J06J14J05K5J18n3j9n4j41j12j25k2j28o1j3M2k2J23J27J53
$$ -320 -332 -289 -189 -87 19 133 238 263 381 328 309 255 114 2 -123 -145 -273 -334 -347 -305 -327 -204 -77 76
5641G6J20LJ33L9p9J8r2r5j33j23q0p9p9mM3J12P8R1Q6J39Q1J28m4k9m2o9j51
$$ 76 196 199 332 371 292 310 218 123 -10 -133 -213 -292 -371 -375 -332 -220 -142 -51 35 174 255 383 339 310 268 199 48
5668D8q8r5j14k3q0K6M1P1J21O9J61P5P5N5jK0j11j04j06q2j45k7r8n4M6P0J5
$$ 48 -40 -135 -249 -272 -352 -326 -285 -214 -93 -24 137 212 287 342 341 361 250 146 40 -42 -187 -214 -312 -366 -320 -250 -235
5695b35J53J21J37O2O3M3j9k1r5j05j38j24j01o7l8L6oJ32Q8J01J12J07P8N8K
$$ -235 -82 39 176 238 301 344 325 304 209 104 -34 -158 -259 -326 -364 -328 -334 -202 -114 -13 99 206 284 342 344
5720C44om4j17j26o2j48o6j21L0K3kR9P1J36R0J60K7L7J2qj09j24k4j52j01m8
$$ 344 338 294 177 51 -11 -159 -225 -346 -316 -293 -295 -196 -125 11 101 261 288 325 337 329 220 96 72 -80 -181 -229
5746b29j19M1m6J06O2J31N1J27J33P6J7J7r7o5l4j23j13j67l0o0J4K0Q0L7J37
$$ -229 -348 -307 -353 -247 -185 -54 -3 124 257 333 350 367 270 205 171 48 -65 -232 -262 -322 -308 -288 -208 -171 -34
5771c4J55K2R8J19o0M2m6j22m3j60n4j03j05o6J9OQ0J17J21J25J23M0O5j7j1o3
$$ -34 121 143 241 360 300 342 296 174 131 -29 -83 -186 -291 -357 -338 -332 -252 -135 -14 111 234 274 339 322 311 248
5797B48p2j21r1j23q4q0j9P2jQ4Q8R1J18J26P0J7rl0r8o2j02j45j03r2m0PM4L9
$$ 248 176 55 -36 -159 -243 -323 -342 -270 -271 -187 -99 -8 110 236 306 323 314 284 186 124 22 -123 -226 -318 -358 -351 -307 -268
5825b68P5R8J53R8J27PP1k9r2nk09l1j40l0r1n7p7J08O8R3Q4J32J04N6J00J1J5
$$ -268 -193 -95 58 156 283 290 361 332 240 235 26 -5 -145 -175 -266 -323 -400 -292 -224 -131 -47 85 189 245 345 356 371
5852C71j49oj72j24j36j8p7l0n4Q4J38L2J30Q2J66M0K8J02j14k8j31j10j19q6
$$ 371 222 216 44 -80 -216 -234 -311 -341 -395 -311 -173 -141 -11 71 237 277 305 407 293 265 134 24 -95 -181
5876a81j02n6l1NJ41Q5J12J03R2O0J12M2o1kj23r7n8j42j20k3q9n2K1J90Q2P5
$$ -181 -283 -339 -370 -365 -224 -139 -27 76 168 228 340 382 321 319 196 99 41 -101 -221 -244 -333 -385 -364 -174 -92 -17
5902a7R5R7Q0O1RJ0n1j40r0q9j16n3j47j3oP4J22N3J28J33K5J37M9k7K8m4j44
$$ -17 78 175 255 316 325 335 284 144 54 -35 -151 -204 -351 -364 -370 -296 -174 -121 7 140 165 302 351 324 352 308 164
5929A64j11q1j40j00l0k7j6N7R2K1J73J64J2J39J7j2j2p1r2j73m2j27j08lj4L1
$$ 164 53 -28 -168 -268 -298 -325 -341 -284 -192 -171 2 166 178 317 334 322 310 239 147 -26 -68 -195 -303 -306 -320 -289
5955b89K3P3J54J21J04Q9J1M6k9l2l4j24j37j13j08p5n0N2QR2J02Q7R2J46J24
$$ -289 -266 -193 -39 82 186 275 286 332 303 271 237 113 -24 -137 -245 -320 -370 -318 -310 -218 -116 -29 63 209 333
5980C33L1%n0k7r5j50j08j16j05oo6N3j9J57R5J04R9R8J24l9J5j4n0o7j98n5j40
$$ 333 364 364 314 287 192 42 -66 -182 -287 -293 -359 -306 -325 -168 -73 31 130 228 352 313 328 314 264 197 -1 -56 -196
6007a96p8l4n5N8K4J47P0J29J31O0QJ19k8r8J1j69j42j21m3j29NL7L6L4R5Q9J29
$$ -196 -274 -308 -363 -305 -281 -134 -64 65 196 256 264 383 355 257 268 99 -43 -164 -207 -336 -331 -294 -258 -224 -129 -40 89
6034H9M6J89Kk9K7j02p7p6j01j88m3K2j00LJ26L1O9J22J61M0P4M7J8o7o0q5q7
$$ 89 135 324 326 297 324 222 145 69 -32 -220 -263 -241 -341 -338 -212 -181 -112 10 171 211 285 332 350 283 223 138 51
6061E1j62p0p6p8j5M3N7R4J32P6J32qQ4J12q9kj36k9j64o4m0j46L7j1J6Q4L8P6
$$ 51 -111 -181 -257 -335 -350 -307 -250 -156 -24 52 184 176 260 372 283 281 145 116 -48 -112 -152 -298 -261 -272 -256 -172 -134 -58
6089e8J15J12Q2M4K5n6n5l7p4j24j13k3l7j25K4O1N1N8J58lJ87PO4J5Kl6j47o5
$$ -58 57 169 251 295 320 264 209 172 98 -26 -139 -162 -199 -324 -300 -239 -188 -130 28 25 212 219 283 298 300 264 117 52
6117E2j36j3r8j20PL6P8OJ02J18P8N7R1N7k8p8k9n4j03q8j01l1n7K9l1J1J13M8
$$ 52 -84 -97 -195 -315 -308 -272 -194 -188 -86 32 110 167 258 315 287 209 180 126 23 -65 -166 -197 -254 -225 -256 -245 -132 -84
6145h4J31N5N4O8K3lj22J7m0p4j24l8k3o8M%P3N1Q5O2N3J05K7M5o3l0k2j05o8
$$ -84 47 102 156 224 247 244 122 139 99 25 -99 -137 -160 -228 -224 -224 -151 -100 -15 47 100 205 232 277 214 184 162 57 -11
6174a1j06m2K1j25N4k2O9Q2P3K5J82J0k2K9J8q3n4o1o8K3j71j5n8L2M7K4O2N1
$$ -11 -117 -159 -138 -263 -209 -231 -162 -80 -7 18 200 210 188 217 235 152 98 37 -31 -8 -179 -194 -252 -220 -173 -149 -87 -36
6202c6J18j0Q4N6K4q8L2m9q6j22j8np0m0J6K2L3P7Q6N7QO7L0J6p6Qk7q9J6j18
$$ -36 82 72 156 212 236 148 180 131 45 -77 -95 -100 -170 -210 -194 -172 -139 -62 24 81 89 156 186 202 126 134 107 18 34 -84
6232h4k7qm4JK6lP6P8O4L0P1K1J5j17J9n0n5n3j9j2jk1rl2M7K7K5N5K0M1L6K8
$$ -84 -111 -119 -163 -162 -136 -139 -63 15 79 109 180 201 216 99 118 68 13 -40 -59 -71 -72 -93 -102 -134 -87 -60 -35 20 40 81 117 145
6264A45Pk4o4j3j01m9Ql4%l5N9K7P1K4j6M9M9qK8rK4n3n2j09O9r1L7J1j37R6N
$$ 145 152 128 64 51 -50 -99 -91 -125 -125 -160 -101 -74 -3 21 5 54 103 95 123 114 138 85 33 -76 -7 -98 -61 -50 -187 -91 -86
6295h6J3L5N4J5N5k2O2J0m0jr1K7q1lp5kRL5nL5J7j3J37K4Mk2N2jo3j1j4r0n4
$$ -86 -73 -38 16 31 86 64 126 136 96 95 4 31 -50 -53 -128 -130 -121 -86 -91 -56 -39 -52 85 109 113 91 143 142 79 68 54 -36 -90
6328i0K7o7O2q0N7n1O2P4P8j2L3PM3j2n6J0k0o3q1j0K1m5l7M4j7J9R1K2O4L7l9
$$ -90 -63 -130 -68 -148 -91 -142 -80 -6 72 60 93 100 143 131 75 85 65 2 -79 -89 -68 -113 -150 -106 -123 -104 -13 9 73 110 71
6359G1N2L2l8n3mn9k8q6K9n1l0rN1M9N9M6Q5l8O1j6L0Op2l0q9K2k2r3l9K4NNL2
$$ 71 123 155 117 64 60 1 -27 -113 -84 -135 -165 -174 -123 -74 -15 31 116 78 139 123 153 159 87 57 -32 -10 -32 -125 -164 -140 -135 -130 -98
6392i8O2N9M3M5n1P7k4Nn4n3j1n4j9l3m4k9L5%J6R2K8R6J9N9j1J2n0n2J8r3J3
$$ -98 -36 23 66 111 60 137 113 118 64 11 0 -54 -73 -106 -150 -179 -144 -144 -128 -36 -8 88 107 166 155 167 117 65 83 -10 3
6423Cj10k5j5j10P4K5P1J7L1Q2O9P7j9J4o0m4m8n7j3n5r2l5P2j2P5%J3J33n1R4
$$ 3 -107 -132 -147 -257 -183 -158 -87 -70 -39 43 112 189 170 184 124 80 32 -25 -38 -93 -185 -220 -148 -160 -85 -85 -72 61 10 104
6453A04Q3l2O2j02k3l6l4o3j11Ol2n1Q5j4M5Q9N3P3O9j9R1r9j3J1n4p2j36L0j10
$$ 104 187 155 217 115 92 56 22 -41 -152 -146 -178 -229 -144 -158 -113 -24 29 102 171 152 243 144 131 142 88 16 -120 -90 -200
6482b00J0m1L7L7P8N4J11K4O5J5K9j6m0Lj23p4o1p9k2o7N2L9N8JN2R1M6J25j6
$$ -200 -190 -231 -194 -157 -79 -25 86 110 175 190 219 203 163 166 43 -31 -92 -171 -193 -260 -208 -169 -111 -110 -58 33 79 204 188
6511A88Jk1Mq1m3n2j07l1l9m6K4m2J40m0J45M5Q3OJ13k7j7n0p7m5m1j32m2k2j5
$$ 188 189 168 172 91 48 -4 -111 -142 -181 -227 -203 -245 -105 -145 0 45 128 134 247 220 203 153 76 31 -10 -142 -184 -206 -221
6540b21O0p2J10K8Q3P9J13O4j6qm6Kr8Rj34o9m7l5m5K3J4Q2J4J33P7L9N1Q0k9
$$ -221 -161 -233 -123 -95 -12 67 180 244 228 220 174 176 78 87 -47 -116 -163 -198 -243 -220 -206 -124 -110 23 100 139 190 270 241
6569B41k3o7j0j06j06m7j05NJM1j5O6N4O6P9J58L2JrM4j33q8q6j01rj16Kj5K4
$$ 241 218 151 141 35 -71 -118 -223 -218 -217 -176 -191 -125 -71 -5 74 232 264 265 256 300 167 79 -7 -108 -117 -233 -231 -246 -222
6598b22M8O4J05%J07K7J63r9jJ0l6n9j21j12n0m2K4p7K3O2J25P7O0Q5P0rO7o5
$$ -222 -174 -110 -5 -5 102 129 292 193 192 202 166 107 -14 -126 -176 -218 -194 -271 -248 -186 -61 16 76 161 231 222 289 224
6626B24n8nj20p3j09m1J4m1q1Q9P3N9R7M5M3J38o1L2J3q9p7q9q6k1p1j12K4J1
$$ 224 166 161 41 -32 -141 -182 -168 -209 -290 -201 -128 -69 28 73 116 254 193 225 238 149 72 -17 -103 -124 -195 -307 -283 -272
6654b72L3J10Q0N6J11O2j2J17k1m1m5J6k08q0k7r1r6M7OJ4J18O6J41K7Q6P0K5
$$ -272 -239 -129 -49 7 118 180 168 285 264 223 178 194 -14 -94 -121 -212 -308 -261 -255 -241 -123 -57 84 111 197 267 292
6681B92L8r7p0j05q2j44Oj03l2L8JM5J22N8R4N7Q9P4k6Qn1p3m7j04j22r9j0j0
$$ 292 330 233 163 58 -24 -168 -162 -265 -297 -259 -258 -213 -91 -33 61 118 207 281 255 263 212 139 92 -12 -134 -233 -243 -253
6709b53k0P8mP6Q5R9P6R7K1K6p5m2k8r2q7p0j01j1p2N2L9M6P2J29M0R8J17pK8
$$ -253 -273 -195 -199 -123 -38 61 137 234 255 281 206 164 136 44 -43 -113 -214 -225 -297 -245 -206 -160 -88 41 81 179 296 289 317
6738C17k9j29p0j17p1q0n9m5k2R9k8R9P9R5L9J20K9O6j4n6r7k1j10o1j18q5n1
$$ 317 288 159 89 -28 -99 -179 -238 -283 -305 -206 -234 -135 -56 39 78 198 227 293 279 223 126 105 -5 -66 -184 -269 -320
6765c20O3K7j8J21N8P5J04Q1O7l6L4j26rp3q6n9r6l6q9O6J2O6L6J36N4Q7J14L0
$$ -320 -257 -230 -248 -127 -69 6 110 191 258 222 256 130 121 48 -38 -97 -193 -229 -318 -252 -240 -174 -138 -2 52 139 253 283
6793B83J6l5o7p8l9j63p8m7m8k1LO6M6J06NJ41J30R2Pn2J9r4n0j57n1q9o6k4k1
$$ 283 299 264 197 119 80 -83 -161 -208 -256 -277 -274 -208 -162 -56 -51 90 220 312 319 267 286 192 142 -15 -66 -155 -221 -245 -266
6822b66rL5J15J15M5J35N2N4L0n5k7q8p0m9j23j7m7q3mL8P4L8J20J01JP4L8O3
$$ -266 -275 -240 -125 -10 35 170 222 276 306 251 224 136 66 17 -106 -123 -170 -253 -257 -219 -145 -107 13 114 115 189 227 290
6850B90l7j8j10q0j17n0j34L4r7J02K2K8J22M0J13J00J4N8j9l0q4r7o0o8r4o2
$$ 290 253 235 125 45 -72 -122 -256 -222 -319 -217 -195 -167 -45 -5 108 208 222 280 261 231 147 50 -10 -78 -172 -234
6876b34j7rQ3N1M4O2R2P1L8J9L9J8j20k4l0j19m5l0j10mk3M1L6R1N6J26O3K6K0
$$ -234 -251 -260 -177 -126 -82 -20 72 143 181 200 239 257 137 113 83 -36 -81 -111 -221 -225 -248 -207 -171 -80 -24 102 165 191 211
6905B11K0K4n7n3j20j08l6q3o0L0M0J8J6J27M7R4O2P9K6o2n0J2r4p8l9j13n4j9
$$ 211 231 255 198 145 25 -83 -119 -202 -262 -232 -192 -174 -158 -31 16 110 172 251 277 215 165 177 83 5 -34 -147 -201 -220
6933b20JpO4J2J44O0K9J22NRRk7r0q0k9r9q0k8k4J2L6K9O4R9Q3L4P3K4j3l7m1
$$ -220 -219 -226 -162 -150 -6 54 83 205 210 219 228 201 111 31 2 -97 -177 -205 -229 -217 -181 -152 -88 11 94 128 201 225 212 175 134
6964A34j7o8j10j03l1j3NN2j4jJ45k3J29Q4KK1j8j7o5J6j64j9l5o5j8K2m4P1Q1
$$ 134 117 49 -61 -164 -195 -208 -203 -151 -165 -166 -21 -44 85 169 171 192 174 157 92 108 -56 -75 -110 -175 -193 -171 -215 -144 -63
6993f3Q9Q3j3O1L4m1L5m4o6n8o2J0j25O5m3pk7M8Q6N2P5O2Ql4J8Qj08J1j5j85
$$ -63 26 109 96 157 191 150 185 141 75 17 -45 -35 -160 -95 -138 -145 -172 -124 -38 14 89 151 159 125 143 151 43 54 39 -146
7023a46Q7r0J5Mm1N7K7O8O2M6KM1K0J4n6k3o0Oj26Rk7j7m1O0M3L9l6J23K3J5L9
$$ -146 -59 -149 -134 -130 -171 -114 -87 -19 43 89 91 132 152 166 110 87 27 33 -93 -84 -111 -128 -169 -109 -66 -27 -63 60 83 98 137
7054A37Ql2oo7m9m6j2m2k5K3J2j6P2k9L4M8NN1N3l8ml1m9P3p8j61J10J5j0p1Q3
$$ 137 145 113 107 40 -9 -55 -67 -109 -134 -111 -99 -115 -43 -72 -38 10 15 66 119 81 77 46 -3 70 -8 -169 -59 -44 -54 -125 -42
7085d2k4P3N2K0k2K0J4l7l6L9n4j26N7j0K5K0n6P4m1NQ1j3K8K3J5m9l0J4j9l2
$$ -42 -66 7 59 79 57 77 91 54 18 57 3 -123 -66 -76 -51 -31 -87 -13 -54 -49 32 19 47 70 85 36 6 20 1 -31
7115c1M2n3J2j1%NM3M2o6K3K2M1j4k6J5l7K6o4l6K6QJ7j7rL6%M6J3p9J07n2P8
$$ -31 11 -42 -30 -41 -41 -36 7 49 -17 6 28 69 55 29 44 7 33 -31 -67 -41 -33 -16 -33 -42 -6 -6 40 53 -26 81 29 107
7147A07j39P3k5j6k3j8nL8j5k5K6J0Q5m5L0m5K8n0Pm6P8m4JL1o7M8%J1MP5n4J
$$ 107 -32 41 16 0 -23 -41 -46 -8 -23 -48 -22 -12 73 28 58 13 41 -9 -2 -48 30 -14 -13 18 -49 -1 -1 10 14 89 35 36
7179C6mj5l7J0%m8j0O4o4jj4K5N1J2O5M1%l6K3m5k0j9n8Mj8j6qK2mK2P5pJ6L9
$$ 36 32 17 -20 -10 -10 -58 -68 -4 -68 -69 -83 -58 -7 5 70 111 111 75 98 53 33 14 -44 -40 -58 -74 -82 -60 -64 -42 33 26 42 81
7213H1k8%K4Jl5k6l2m4j0n9K6J2J3PN6N6j5j3J13k0N4m4o2m8q6%nj8rLm1P8N2
$$ 81 53 53 77 78 43 17 -15 -59 -69 -128 -102 -90 -77 -70 -14 42 27 14 127 107 161 117 55 7 -79 -79 -84 -102 -111 -108 -149 -71 -19
7246a9N1K2L3O0M5p8J1j4l8j05j1l2j2j6k0J0%L8P6J5J21k9k1J8L5k9l5Qj40j9
$$ -19 32 54 87 147 192 114 125 111 73 -32 -43 -75 -87 -103 -123 -113 -113 -75 1 16 137 108 87 105 140 111 76 84 -56 -75
7276g5p8QL8n9M0J02n8L8O5J03K8J3l3J2l0Jj04mj06o3L1j9n1R2K5N0jJ63Kk9
$$ -75 -153 -145 -107 -166 -126 -24 -82 -44 21 124 152 165 132 144 114 115 11 7 -99 -162 -131 -150 -201 -109 -84 -34 -35 128 130 101
7306A01J12l9M4j26m6q3j8q4k8p6P5m6O8P1O5O3M5J63r2N6n1n1J3j20j7q5p6j8
$$ 101 213 174 218 92 46 -37 -55 -139 -167 -243 -168 -214 -146 -75 -10 53 98 261 169 225 174 123 136 16 -1 -86 -162 -180
7334a80L2n1KM3R4O0O2P2RO5P%o4q4p7m5o3o7l8%%R8k4J33K5J10O2O1J2l3k6n1
$$ -180 -148 -199 -197 -154 -60 0 62 134 143 208 215 215 151 67 -10 -55 -118 -185 -223 -223 -223 -125 -149 -16 9 119 181 242 254 221 195 144
7366A44pj61p6n2l3l4O8q9J15P0Q1N5M1P3O6m8jk8m8j38r0q1J6j01l5J0Q7O1M3
$$ 144 137 -24 -100 -152 -185 -219 -151 -240 -125 -55 26 81 122 195 261 213 212 184 136 -2 -92 -173 -157 -258 -293 -283 -196 -135 -92
7395i2Q1J32J15MM7k4o2o0o7q1l7p9j12k1K9L9m5Q8J76N9O8N4k8M4L5m3r2m8j09
$$ -92 -11 121 236 240 287 263 201 141 74 -7 -44 -123 -235 -256 -227 -188 -233 -145 31 90 158 212 184 228 263 220 128 80 -29
7424b9p9r2n5J4l8N6J3J13R2O5J13M8ML0kl4j20j00j06J5j24n6k4L6J5R1J10J17
$$ -29 -108 -200 -255 -241 -279 -223 -210 -97 -5 60 173 221 225 255 253 219 99 -1 -107 -92 -216 -272 -296 -260 -245 -154 -44 73
7452G3PJ21P4k0j2J6o8r6q7p8q0j22k7K6K2%P1R8J21J09M9J7P5k0n9q7q2p8r8
$$ 73 80 201 275 255 243 259 191 95 8 -70 -150 -272 -299 -273 -251 -251 -180 -82 39 148 197 214 289 269 210 123 41 -37 -135
7481a35p2n1j8RRO0J29O9J4J39Q2O7l8P6j55l2j73n5r0l4q1%mN1N7R7J57O1J20
$$ -135 -207 -258 -276 -267 -258 -198 -69 0 14 153 235 302 264 340 185 153 -20 -75 -165 -199 -280 -280 -284 -233 -176 -79 78 139 259
7510B59K0M5j14L2m2q4j08j83J02j59o5p4J08P1P6Q1Q3J38M0L5qO5m6m2j62q2
$$ 259 279 324 210 242 200 116 8 -175 -73 -232 -297 -371 -263 -192 -116 -35 48 186 226 261 253 318 272 230 68 -14
7536a4r0m6o9k2n9PJ28L2J15J00R2P1K6mK7j14K3j12j53q4p7k6n5M4J1J16L4J31
$$ -14 -104 -150 -219 -241 -300 -293 -165 -133 -18 82 174 245 271 267 294 180 203 91 -62 -146 -223 -249 -304 -260 -249 -133 -99 32
7564C2Q1O1R5J8l1%j6j39n6r8r5j14j1J0%R7O8O8M6Q7J08L0M6jn5n6j31L0j28
$$ 32 113 174 269 287 256 256 240 101 45 -53 -148 -262 -273 -263 -263 -166 -98 -30 16 103 211 241 287 286 231 175 44 74 -54
7593e4o1j37j4M9J0J1J13P2R6M1N5L4O8m2o4Pj03j12p0m3p9l3J1K7O4R3P5P7Q1
$$ -54 -115 -252 -266 -217 -207 -196 -83 -11 85 126 181 215 283 241 177 184 81 -31 -101 -144 -223 -256 -245 -218 -154 -61 14 91 172
7622A72P5k0O5n8n1j4j37q7p8j08K6q5R2n0J00J00P4P8O0L9L9J5m0j1j02j03n2
$$ 172 247 227 292 234 183 169 32 -55 -133 -241 -215 -300 -208 -258 -158 -58 16 94 154 193 232 247 207 196 94 -9 -61
7649f1j05l5l6pO1l3J54N4L3P7M4J21J8m0l2j41J7r6m0j30lm0J3KQ0J4J08M8M9
$$ -61 -166 -201 -237 -244 -183 -216 -62 -8 25 102 146 267 285 245 213 72 89 -7 -47 -177 -180 -220 -207 -205 -125 -111 -3 45 94
7678I4J00J7N5n1m6k9j31l0j33k5m9k9M7Q8K7L7M5P0P4O3MK8l5m3o1j15k8j20
$$ 94 194 211 266 215 169 140 9 -21 -154 -179 -228 -257 -210 -122 -95 -58 -13 57 131 194 198 226 191 148 87 -28 -56 -176
7706a76L5q3L1N1k2Q5J6O7P2J07j8L3O2r9Oo2q0j00q9m4K8m3N4K6K2R7J09K0N4
$$ -176 -141 -224 -193 -142 -164 -79 -63 4 76 183 165 198 260 161 167 105 25 -75 -164 -208 -180 -223 -169 -143 -121 -24 85 105 159
7735A59K0k6L1J1q1q5m9J0j18o3m6O1OO0M0M9N0J24n5J02j1k4Jq4q8j3o8m5n1
$$ 159 179 153 184 195 114 29 -20 -10 -128 -191 -237 -176 -170 -110 -70 -21 29 153 98 200 189 165 166 82 -6 -19 -87 -132 -183
7764a83p4P8M2K0O2K2R0J7Q3J0k9M6p9j2j20K0n9m5l2j5J4L3j7J03L0L7J09L7
$$ -183 -257 -179 -137 -117 -55 -33 57 74 157 167 138 184 105 93 -27 -7 -66 -111 -143 -158 -144 -111 -128 -25 5 42 151 188
7792A88qm1Nj6o3qq6q4k6kJ0l2N1K3M2O6K7L2O4P5l0p7j3j00M5m4p2r7O2l4L5
$$ 188 180 139 144 128 65 57 -29 -113 -139 -141 -131 -163 -112 -89 -47 19 46 78 142 217 187 110 97 -3 42 -2 -74 -171 -109 -143 -108
7823a08j1M3kR6M7L4K6K6J9n4l4o5o3j5J7j18N9q6R1L4k4Q4M5J7P3J5m3k3K4r9
$$ -108 -119 -76 -78 18 65 99 125 151 170 116 82 17 -46 -61 -44 -162 -103 -189 -98 -64 -88 -4 41 58 131 146 103 80 104 5
7853EM3j07l1O2j21mPO5L2L9RO9L9jJ1ln3L0p2j7jr3J9k4pk4M8K0N2Q0L4o0M4
$$ 5 48 -59 -90 -28 -149 -153 -146 -81 -49 -10 -1 68 107 106 117 114 61 91 19 2 1 -92 -73 -97 -104 -128 -80 -60 -8 72 106 46 90
7886I0M0om0jk1o0pqo7n1J0L1J8J9L5j2R9l0J0O4k2L5j5l5n9Rp8l3J5NOl6O0O6
$$ 90 130 124 84 83 62 2 -5 -13 -80 -131 -121 -90 -72 -53 -18 -30 69 39 49 113 91 126 111 76 17 26 -52 -85 -70 -65 -59 -95 -35 31
7920C1j4J2L2m0P0L0o8j9r2O3J2r8mN9l5o0M5L1OK7O4PJ9J5rl0L2q6J0j7o7M6
$$ 31 17 29 61 21 91 121 53 34 -58 5 17 -81 -85 -26 -61 -121 -76 -45 -39 -12 52 59 78 93 84 54 86 0 10 -7 -74 -28
7952b8o1K8Qj7KP7J9LJ1K3l4M4j5k8M7j11%m2l4mN7Q0q0M9j5L5N8n4L1J0Rj4K
$$ -28 -89 -61 -53 -70 -68 9 28 31 42 65 31 75 60 32 79 -32 -32 -74 -108 -112 -55 25 -55 -6 -21 14 72 18 49 59 68 54 56
7985E6m4j7J9m2m7J0M5j6L0n3J05ml4L2M3k0N3o3On3K6k9j20R1jj2ORQm7O3K9
$$ 56 12 -5 14 -28 -75 -65 -20 -36 -6 -59 46 42 8 40 83 63 116 53 59 6 32 3 -117 -26 -27 -39 -33 -24 -16 -63 0 29
8017B9n5N4L1j8k7QL3l8qk9k3J5MJPqO3p9M4L5J1J7k4J6j1rl4k5k6L8%m1J6K9
$$ 29 -26 28 59 41 14 22 55 17 9 -20 -43 -28 -24 -23 -16 -24 39 -40 4 39 50 67 43 59 48 39 5 -20 -46 -8 -8 -49 -33 -4
8051dj1j2RK5M7p5M7L6k3P0o3l2l8N3p0lj9kKM9k1J6M9N0m0%oJ0L4m5N2j6r5j0
$$ -4 -15 -27 -18 7 54 -21 26 62 39 109 46 14 -24 29 -41 -44 -63 -65 -63 -14 -35 -19 30 80 40 40 34 44 78 33 85 69 -26 -36
8085c6k5K8l8L4k3K4K2O3j9m7O8p4P8J6o4M5m8j1on1P0m8j8L5j9M5K0P0p2J3L3
$$ -36 -61 -33 -71 -37 -60 -36 -14 49 30 -17 51 -23 55 71 7 52 4 -7 -13 -64 6 -42 -60 -25 -44 1 21 91 19 32 65
8116F5QM0q6L7l6j0l1j8q4k5Q9n0K0O5M2j7J2O0l3j7J7Qn3K1q0m1J5k2L0K1l5
$$ 65 73 113 27 64 28 18 -13 -31 -115 -140 -51 -101 -81 -16 26 9 21 81 48 31 48 56 3 24 -56 -97 -82 -104 -74 -53 -88
8147h8N6%M3N9k0M3k3R4j42j4ql9P4q5j1j1L9k3%L9lL0O3n3J08m9J2J3o4L7j21
$$ -88 -32 -32 11 70 50 93 70 164 22 8 0 -39 35 -50 -61 -72 -33 -56 -56 -17 -20 10 73 20 128 79 91 104 40 77 -44
8178d4QJ4n3nj1l0Q3lQL6N4J9M1
$$ -44 -36 -22 -75 -80 -91 -121 -38 -41 -33 3 57 76 117
8191A17
$$ Imaginary data points
##PAGE= N=2
##DATA TABLE= (X++(I..I)), XYDATA
0@%%%%%%%%%%%%%%%%jRj6J6j6J6k4L2l2L4m2M9n7O6p5Q9r9J10j25J42j60J79k02
$$ 0 0 0 0 0 0 0 0 0 0 0 0 0 0 0 0 0 -1 8 -8 8 -8 8 -16 16 -16 18 -24 25 -32 34 -41 48 -51 59 -66 76 -84 95 -107
39a07K25k50K79l12L46l82M23m67N14n64O21o86P57q33R18j016J125j246J385
$$ -107 118 -132 147 -165 181 -201 222 -245 269 -295 326 -360 397 -436 482 -534 591 -655 730
58G30j548J737j963K240k584L028l626M480n815Q203j3825N3464M9255l8311j7886
$$ 730 -818 919 -1044 1196 -1388 1640 -1986 2494 -3321 4882 -8943 44521 93776 55465 37579
73C7579l6909l0221l2281j5848j5194j280Q839K2380K3186L0872L1342K9524J9095
$$ 37579 670 -29551 -61832 -77680 -92874 -94154 -85315 -62935 -39749 -8877 22465 51989 71084
86G1084J4284M114o637j8190k2105k7354k9650k8511k0347j4291o490L768J4956
$$ 71084 85368 89482 82845 64655 42550 15196 -14454 -42965 -63312 -77603 -84093 -80325 -65369
99f5369K0008K4453K7952K7456K1041J5081Q271j302j1647j7777k2198k5882k6161
$$ -65369 -45361 -20908 7044 34500 55541 70622 78893 77591 65944 48167 25969 87 -26074
112b6074k1671j5810r257j226Q399J5669K0000K3061K4779K1912J5836J0092L561
$$ -26074 -47745 -63555 -72812 -74038 -65639 -49970 -29970 -6909 17870 39782 55618 65710 69271
125F9271n446j3344j7396k0383k3071k1480j5875j0894n625K781J0912J4875J8081
$$ 69271 63825 50481 33085 12702 -10369 -31849 -47724 -58618 -64243 -61462 -50550 -35675 -17594
138a7594K1325K0894J6142J1613P260k81q370j2951j5818j9658k0384j6520j2262
$$ -17594 3731 24625 40767 52380 59640 59359 50989 38038 22220 2562 -17822 -34342 -46604
151d6604q694k157O081J0960J3790J7959J9764J6617J2738J0002M226l806q858
$$ -46604 -55298 -57455 -51374 -40414 -26624 -8665 11099 27716 40454 50456 54682 50876 42018
164D2018j1704j6014j8624j6449j3198j0798n961J334O594R734J3912J7106J5970
$$ 42018 30314 14300 -4324 -20773 -33971 -44769 -50730 -49396 -42802 -33068 -19156 -2050 13920
177A3920J3514J1335P558J047m430p900j1726j5425j5605j3579j1752q849l186
$$ 13920 27434 38769 46327 47374 42944 35044 23318 7893 -7712 -21291 -33043 -41892 -45078
190d5078K509O041R837J3755J4966J3546J1960R872M933o24m486p929j2035j4185
$$ -45078 -42569 -36528 -26691 -12936 2030 15576 27536 37408 42341 41717 37231 29302 17267 3082
204C082j3335j2028j0358o457j027L077O297J0183J3231J2902J1710J0498P668
$$ 3082 -10253 -22281 -32639 -39096 -40123 -37046 -30749 -20566 -7335 5567 17277 27775 35443
217C5443K408j770m669q496j1990j2399j1153j0606q454l621N88L239O944J0761
$$ 35443 37851 36081 31412 22916 10926 -1473 -12626 -23232 -31686 -35307 -34719 -31480 -24536 -13775
231a3775J1628J0751J0419Q983M796M55k182n370r476j1066j0272j0136r337n667
$$ -13775 -2147 8604 19023 28006 32802 33257 31075 25705 16229 5163 -5109 -15245 -24582 -30249
245c0249j407J175M116Q089J0265R904R755R420O403K335k36k936o846r341r370
$$ -30249 -31656 -30481 -26365 -18276 -8011 1893 11648 21068 27471 29806 29570 26634 19788 10447 1077
260A077r318r287p007l200n85J878N561Q264Q820Q816Q986P463L979J351q97m148
$$ 1077 -8241 -17528 -24535 -27735 -28320 -26442 -20881 -12617 -3797 5019 14005 21468 25447 26798 25901 21753
276B1753p295q264q164q628p751m722k031L1K896O150P414P733Q184P803N381
$$ 21753 14458 6194 -1970 -10598 -18349 -23071 -25102 -25071 -22175 -16025 -8611 -878 7306 15109 20490
291B0490K596P78j773m967o710p102p537p694n814l145j389O84L776O012O366
$$ 20490 23086 23864 22091 17124 10414 3312 -4225 -11919 -17733 -20878 -22267 -21583 -17807 -11795 -5429
306e429O878P374O102L571J912K24k746n071n712o090o975o241l953k318q91J663
$$ -5429 1449 8823 14925 18496 20408 20632 17886 12815 7103 1013 -5962 -12203 -16156 -18474 -19365 -17702
322a7702M268N057N442O427O158M268K553J491q06l392m495m791n946n999m343
$$ -17702 -13434 -8377 -2935 3492 9650 13918 16471 17962 17156 13764 9269 4478 -1468 -7467 -11810
337a1810k762j835K8K622L921M289N233N742M452K949K100O11j921l407l764m701
$$ -11810 -14572 -16407 -16379 -13757 -9836 -5547 -314 5428 9880 12829 14929 15540 13619 10212 6448 1747
353A747n448m527l050k204j081J178K848L448M133N039M533L139K427J446o42
$$ 1747 -3701 -8228 -11278 -13482 -14563 -13385 -10537 -7089 -2956 2083 6616 9755 12182 13628 12986
368A2986k412k976l599m650m583l208k405j765J5J900K695L132M218M403L362
$$ 12986 10574 7598 3999 -651 -5234 -8442 -10847 -12612 -12597 -10697 -8002 -4870 -652 3751 7113
383G113K455K020M84j462k294k723l693m276l484k449k140r06R52J986K278L280
$$ 7113 9568 11588 12072 10610 8316 5593 1900 -2376 -5860 -8309 -10449 -11355 -10403 -8417 -6139 -2859
399b859L963L388K473K209J227m03j620j993k725l612l370k376k079j656K4J308
$$ -2859 1104 4492 6965 9174 10401 9998 8378 6385 3660 48 -3322 -5698 -7777 -9433 -9409 -8101
415h101J665K185L189L253K340J977J789L25r67j299j820k718l063k178j836j809
$$ -8101 -6436 -4251 -1062 2191 4531 6508 8297 8622 7655 6356 4536 1818 -1245 -3423 -5259 -7068
431g068o20N95J083J430K247K753K222J566J672R10l47q97j174j768k475j954
$$ -7068 -7688 -7093 -6010 -4580 -2333 420 2642 4208 5880 6790 6443 5546 4372 2604 129 -1825
447a825j565j539r84J29P67Q43J465K154J875J414J299J174L5o75o88j211j820
$$ -1825 -3390 -4929 -5913 -5784 -5017 -4174 -2709 -555 1320 2734 4033 5207 5242 4567 3879 2668 848
464H48j817j242j238j028k31N04O18Q93J612J714J182J072J069L25m24n51o95
$$ 848 -969 -2211 -3449 -4477 -4708 -4204 -3586 -2693 -1081 633 1815 2887 3956 4281 3857 3306 2611
481B611j379j622j113j040r69m41L02M95N30J224J454J145Q47J041N33j98m41
$$ 2611 1232 -390 -1503 -2543 -3512 -3953 -3651 -3156 -2626 -1402 52 1197 2044 3085 3618 3420 2979
498B979m57r02j381j139p45r01p08L3M03M14O86J213J094P12P86P50Q8l12k95
$$ 2979 2522 1620 239 -900 -1645 -2546 -3254 -3221 -2818 -2404 -1718 -505 589 1301 2087 2837 2925 2613 2318
517B318n12j120r83o29p13p45k27K99K12L89R10R23N52O38O56L05l58j49k44p16
$$ 2318 1806 686 -297 -926 -1639 -2384 -2611 -2312 -2100 -1711 -801 122 674 1312 1968 2273 1915 1766 1522 806
537H06q43m93m21n95l13J95K55J58N72P76L94L27M69K88j63l42j01m81o47m13
$$ 806 -37 -530 -951 -1546 -1859 -1664 -1409 -1251 -679 97 491 818 1287 1575 1412 1070 969 488 -159 -572
557e72k43l09k62K58K94J97L00O49M79L6K24J96j92m62k69k12n50m20j67Qk65
$$ -572 -815 -1124 -1386 -1128 -834 -637 -337 312 791 827 1051 1247 1055 593 324 112 -438 -858 -1025 -1017 -1282
578a282J91N39K62K95N22M63J38qJ38j07n12l90k82m89m63k19L3j18J18M42L61
$$ -1282 -1091 -552 -290 5 527 990 1128 1120 1258 1151 639 249 -33 -522 -985 -1204 -1171 -1289 -1171 -729 -368
599c68L65M22M99K39O7O7n5l61n18l16l30m73l40J1j09m6K98N04K62L20M67L65
$$ -368 -3 419 918 1157 1224 1291 1236 875 357 41 -289 -762 -1102 -1091 -1200 -1246 -948 -444 -182 138 605 970
621I70N9O6M4k36l80k69l09n17k83m9j17o6K05L66L27K45L31M06R0J4J4j02k83
$$ 970 1029 1095 1139 903 523 254 -55 -572 -855 -904 -1021 -1087 -882 -516 -189 56 387 793 883 897 911 809 526
644E26l39k54k90m39j43N6n6J64L02L09K06M01L77J08Nj4J5l48l89k94l11m31
$$ 526 187 -67 -357 -796 -939 -883 -939 -775 -473 -164 42 443 820 928 933 919 934 586 197 -97 -408 -839
666h39k35o8M9Q0K55M39L40L88M73L01N2J3k7k51n18l42m55m73m11k36j9l2K61
$$ -839 -1074 -1142 -1093 -1013 -758 -319 21 409 882 1183 1235 1248 1221 970 452 110 -345 -818 -1229 -1465 -1484 -1516 -1255
689a255N18M35N32M66N20K54Q7R3j26n04m63m72o12n68l21j73j60M4L75N56M01
$$ -1255 -737 -302 230 696 1216 1470 1557 1650 1524 1020 557 85 -527 -1095 -1416 -1589 -1749 -1705 -1330 -774 -373
710c73N89O84M59K55K12j9k54m04n00n91o79n24m17k45o2K52L62L33N84O94N59
$$ -373 216 900 1359 1614 1826 1807 1553 1149 649 58 -621 -1145 -1562 -1807 -1869 -1617 -1255 -922 -338 356 915
731I15M58L45J35j48k43m98m29o86n97m66l54k56O5K75L22M75O15O42N10M11K06
$$ 915 1373 1718 1853 1705 1462 964 535 -151 -748 -1214 -1568 -1824 -1759 -1484 -1162 -687 -72 570 1080 1491 1697
752A697N1k23l33m53n59o05n38m20k08j67J78L05M03N55O43O05L81L31Q5p1l10
$$ 1697 1748 1525 1192 739 180 -425 -963 -1383 -1591 -1758 -1580 -1275 -872 -317 326 931 1312 1643 1728 1657 1347
773A347m48n44o03o18m50l63j73J05J96M12N62O59O36M46M92K47K5k64k77n63
$$ 1347 899 355 -248 -866 -1316 -1679 -1852 -1747 -1551 -1139 -577 82 718 1164 1656 1903 1928 1664 1387 824
793H24o33p08n48m97l10n2O0L55M33N95P12O60M86M57J76j5k56l94o24n92p30
$$ 824 191 -517 -1065 -1562 -1872 -1924 -1864 -1509 -1076 -481 231 891 1377 1834 2010 1995 1739 1345 721 129 -601
814f01n43n52k59q2P3L56M85O61O52O79O08L19K20L1k22m19o25o46o87n74m98
$$ -601 -1144 -1696 -1955 -2037 -1964 -1608 -1123 -462 190 869 1477 1796 2016 2047 1825 1406 781 135 -552 -1126 -1624
835a624l39jJ6L44M56O69O51O54N94L49K44l2k24m33n48o54o56n56m56k70j84
$$ -1624 -1963 -1964 -1948 -1604 -1148 -479 172 826 1420 1769 2013 1981 1757 1324 776 122 -534 -1090 -1546 -1816 -2000
856b000J53L57M83N99O17N86M88M07J40L0k68n01m75o45n48o03l80k29n6J83M05
$$ -2000 -1847 -1490 -1007 -408 209 795 1283 1690 1830 1860 1592 1091 616 -29 -577 -1180 -1560 -1789 -1845 -1662 -1257
877a257M79N42O62N72M86K29J85j66l13m58n59o78n72m74m03j57K8K79M45N40
$$ -1257 -778 -236 426 998 1484 1713 1898 1732 1419 961 402 -276 -848 -1322 -1725 -1882 -1854 -1575 -1130 -590
897e90O03O55N16M24K13Q2j62l54n30o30o79n91m82l48j43J13K79M57O53O21P19
$$ -590 13 668 1184 1608 1821 1903 1741 1387 857 227 -452 -1043 -1525 -1873 -2016 -1903 -1624 -1167 -514 107 826
918H26N46M75K38L5k32m32n75p40o75o34n60l50p2L5L35N35O87O58P17O39M52
$$ 826 1372 1847 2085 2120 1888 1456 881 141 -534 -1168 -1728 -2078 -2150 -2115 -1780 -1245 -558 100 817 1456 1908
939A908K83N5k26m92o17o64p38o80n92l52j58N0L42N85O26P72P61O89M11K70R5
$$ 1908 2191 2246 2020 1528 911 247 -491 -1171 -1763 -2115 -2273 -2223 -1881 -1296 -670 102 863 1552 1963 2233 2328
960B328k46m65n65p94p37p20n55l66j94Q4L90N66O30Q02P60N42M43L08K9k60m69
$$ 2328 2082 1617 1052 258 -479 -1199 -1754 -2120 -2314 -2230 -1840 -1274 -644 158 918 1460 1903 2211 2240 1980 1511
981A511o38p39p68o36n70l25r1J82M05N70O89P98P00N71M29J06l8l24m78p41p69
$$ 1511 873 134 -634 -1270 -1840 -2165 -2256 -2074 -1669 -1099 -410 388 1088 1659 2088 2194 2156 1832 1354 613 -156
1002a56p15o19m68l00jL62L89O37P57P66P12N16L38Q4k24l69o63p77p71o76o52
$$ -156 -871 -1490 -1958 -2258 -2259 -1897 -1508 -871 -114 652 1364 1880 2218 2302 2078 1709 1046 269 -502 -1178 -1830
1023a830m56j43J68L30N32P68R15O58O81N62L16p6k78m78o61q64p93p88o21l44
$$ -1830 -2286 -2429 -2261 -1931 -1399 -631 284 942 1623 2185 2501 2425 2147 1669 1008 144 -649 -1437 -2058 -2402
1043b402j12K03L46O55Q12R31O94P16N21J35m0l09n14q47p59q51p17o94l24k6
$$ -2402 -2514 -2311 -1965 -1310 -498 433 1127 1843 2364 2499 2459 2150 1636 789 30 -821 -1538 -2232 -2556 -2582
1063b582J57M79P62P36Q56Q13O93M77J39o4l37o29p07p99q80p24n20l25l4K27
$$ -2582 -2425 -1946 -1184 -448 408 1221 1914 2391 2530 2466 2129 1500 793 -6 -886 -1610 -2130 -2455 -2489 -2262
1083b262N07P06P33Q06P98O34M04J00j03l85n76p41p31q91o23m48k72k9L21M77
$$ -2262 -1755 -1049 -316 490 1288 1922 2326 2426 2323 1938 1362 621 -110 -1001 -1624 -2072 -2344 -2373 -2052 -1575
1103a575O78P42P73P79M41L93L7j70m67n16p23p56p32n88l37k06M8L81N30N73
$$ -1575 -897 -155 618 1397 1838 2231 2268 2098 1631 1115 392 -364 -1096 -1684 -2021 -2227 -2179 -1798 -1268 -695
1123f95P82P89N98M34K68J7k46m62n64p57p70o67m54l90j57J82L75N68P27P13
$$ -695 87 876 1474 1908 2176 2193 1947 1485 921 164 -606 -1273 -1727 -2117 -2274 -2092 -1717 -1149 -422 291
1143B91P36N56L92K34o1k98n38o37p04p98n40n47l26L0J95L93O08P61P73O37N55
$$ 291 1027 1583 1975 2209 2148 1850 1312 675 -29 -827 -1367 -1914 -2240 -2210 -2015 -1622 -1014 -253 520 1157 1712
1164A712L86J44j16l48m57p44p35o42n82n32k90J3K44M02N79P21P01O23N68L85
$$ 1712 2098 2242 2126 1778 1321 577 -158 -800 -1382 -1914 -2204 -2191 -1947 -1545 -966 -245 456 1079 1647 2032
1184B032R4q7k96l79p85p02o96o11m23k40k3J48M93N57O58O88N88N36L72L1l2
$$ 2032 2126 2039 1743 1364 579 -123 -819 -1430 -1853 -2093 -2116 -1968 -1475 -918 -260 428 1016 1552 1924 1955 1923
1205A923k33n31o03o18o46n47m04j73q2J97L69M98O10O07N83M79L42P3o7l18m35
$$ 1923 1690 1159 556 -62 -708 -1255 -1659 -1832 -1914 -1717 -1348 -850 -240 367 950 1429 1771 1844 1777 1459 1024
1226A024n45n82n97m95l54j40p1J89L51N21N07O55N02M05K08J21m5l91l65n08
$$ 1024 479 -103 -700 -1195 -1549 -1689 -1760 -1571 -1220 -699 -192 463 965 1370 1578 1699 1654 1263 898 390
1246C90n95n46m37l54j62L4K45L98M28N57N45N33L61K50N8j19l90l92n02o22o01
$$ 390 -205 -751 -1188 -1542 -1704 -1670 -1425 -1027 -599 -42 503 1036 1397 1647 1705 1586 1196 804 302 -320 -921
1267i21l76k92j83Q3K61M16M75O01O02M34L86K53q2j00l59l84o68n35n37m18l30
$$ -921 -1297 -1589 -1772 -1689 -1428 -1012 -537 64 666 1100 1486 1739 1657 1557 1198 814 146 -389 -926 -1344 -1674
1288a674q3Q2K41M13M52P05N25M94M28K11k0j43l81m37o22n77m98n31l07n2N4
$$ -1674 -1757 -1675 -1434 -1021 -569 136 661 1155 1583 1794 1774 1631 1250 813 191 -386 -884 -1415 -1722 -1774 -1720
1309a720K95L93M92O27M94N09M20J72Q3j59l54m52n72m94m95n62l17l9O6J08M74
$$ -1720 -1425 -1032 -540 87 581 1090 1510 1682 1765 1606 1252 800 228 -266 -761 -1323 -1640 -1679 -1613 -1505 -1031
1330a031N75M43M94N46L47K04L7j19l20m32m80n15m60m58k55j15J5K24L30M53
$$ -1031 -456 -13 481 1027 1374 1578 1615 1496 1176 744 264 -251 -711 -1169 -1424 -1539 -1524 -1300 -970 -517
1350e17M61N61M61K73J98Q6k22k55l61m53n56m37l18k99j16R8K39L44L75N16N03
$$ -517 -56 505 966 1239 1437 1523 1301 1046 685 232 -324 -761 -1079 -1378 -1494 -1396 -1157 -813 -438 78 581
1371E81M06K36J95L5j69l27l79m57n58l74l40k70j5J01K20L11M70N77M91L26K48
$$ 581 987 1223 1418 1453 1284 957 578 121 -437 -811 -1151 -1421 -1436 -1335 -1115 -804 -334 243 734 1060 1308
1392A308J97p2j57l72l88m80n76m30k92k07p9J71K44L75N21N36M85L42L08J35
$$ 1308 1505 1433 1276 904 516 36 -540 -970 -1262 -1469 -1548 -1377 -1133 -758 -237 299 784 1126 1434 1569
1412A569l9k10l62m34n43n09m21m34j37q6J75K71M18M55N66M04M68L88J5l3k40
$$ 1569 1530 1320 958 524 -19 -528 -949 -1383 -1520 -1606 -1431 -1160 -742 -287 279 683 1151 1539 1554 1521 1281
1433A281l30m15n16n03n07m06j02q8J84K08M59M82M95M62M33L06O3O9k91l20m56
$$ 1281 951 536 20 -483 -990 -1396 -1498 -1586 -1402 -1194 -735 -253 242 704 1137 1443 1506 1575 1284 964 508
1454E08m73n09m79l26k08nJ24K64L67N25M81M54L96K31Q2qk36l65m24m70m80m09
$$ 508 35 -474 -953 -1279 -1487 -1492 -1368 -1104 -737 -212 269 723 1119 1350 1432 1424 1188 823 399 -71 -551 -960
1476i60k52j77o4J99K89L69M58N10M25K98K53O1p4l22l38l69m41n30m08j82p9
$$ -960 -1212 -1389 -1453 -1254 -965 -596 -138 372 797 1095 1348 1409 1335 1013 675 306 -135 -665 -1073 -1255 -1334
1497a334J8K25K34M40M57N13L48K34J83M7j31k84l84n07m32m15l04k06j45J39
$$ -1334 -1316 -1091 -857 -417 40 553 901 1135 1318 1365 1234 950 566 59 -373 -788 -1092 -1298 -1443 -1304
1517a304J54M02M25N18M26M10K07J62o1j66k62m04n23m46l71k86k52l2Q8K57M21
$$ -1304 -1150 -748 -323 195 621 1031 1238 1400 1339 1173 911 507 -16 -462 -833 -1119 -1371 -1403 -1315 -1058 -637
1538f37M40M37M03L93K57J70m0k30k68m58n44m55l84l07k65Q5J01K54L66M80M68
$$ -637 -197 240 643 1036 1293 1463 1423 1193 925 467 -77 -532 -916 -1223 -1488 -1403 -1302 -1048 -682 -202 266
1559B66M62M05K19N4n9j63l72m64m17m37m05l31j39j9J66K91L62M24M54M09L77
$$ 266 728 1133 1352 1406 1347 1184 812 348 -69 -506 -911 -1242 -1381 -1400 -1234 -943 -581 -157 297 706 1083
1580A083J43L7j7k19l65l71l66m50l70k51q0P7O4K63M15L43M19M01L21L3J04j06
$$ 1083 1226 1263 1246 1027 662 291 -75 -525 -895 -1146 -1226 -1149 -1085 -822 -407 -64 355 756 1077 1110 1214 1108
1602A108k40l19l93m45l79l24j33r9N3J74M22L31L54L79L46K81O5L7k67k03l65
$$ 1108 868 549 156 -289 -668 -992 -1125 -1224 -1171 -997 -575 -244 110 489 835 1116 1181 1218 951 748 383
1623C83l77m36l85k16r8j03J05K68L27M24M36L50L14J38J07o2k46l41l24l98m91
$$ 383 6 -430 -815 -1031 -1129 -1232 -1127 -859 -532 -108 328 678 992 1130 1237 1175 929 588 264 -134 -625
1644f25l59j86j30M8J62L01L22M70M30L33L54J20M4j41k47k60m88m09m09l43j69
$$ -625 -984 -1170 -1300 -1252 -1090 -789 -467 3 433 766 1120 1240 1284 1143 896 636 148 -261 -670 -1013 -1182
1665a182j28R1J83K74M36M46M20L05L08J80oj82k60l10n07m26l34l33k40j4O7
$$ -1182 -1310 -1219 -1036 -762 -326 120 540 845 1153 1333 1327 1145 885 575 68 -358 -692 -1025 -1265 -1279 -1212
1686a212K05L58M13M20M19L16K69Q4j00j15k59l61m52m37l39k32j82J5J37K29
$$ -1212 -1007 -649 -236 184 603 919 1188 1272 1172 1057 798 437 -15 -452 -791 -1023 -1205 -1190 -1053 -824
1706h24L30L95M71L03K48K41N9j41k03l72l33m45l69k98j92m3N0K04K64L72M20
$$ -824 -494 -99 372 675 923 1164 1223 1082 879 507 174 -271 -640 -938 -1130 -1173 -1123 -919 -655 -283 137
1727A37L52K87K63P0j7p9l12l48m24l89l64j99j02p0J94J89L82M24L81L43K91
$$ 137 489 776 1039 1109 1092 1013 701 353 -71 -460 -824 -1023 -1125 -1195 -1001 -812 -430 -6 375 718 1009
1748A009K11k6j36k27l19l71m54l78k79k68qJ07K15K81M13L91L92L38K50J15m2
$$ 1009 1220 1194 1058 831 512 141 -313 -691 -970 -1238 -1246 -1139 -924 -643 -230 161 553 891 1141 1256 1214
1769A214k04j62m26m69l61m08k74j36l0R6K50L20M42L70M77L13J62J85j23j56
$$ 1214 1010 848 422 -47 -408 -816 -1090 -1226 -1256 -1160 -910 -590 -148 222 699 1012 1174 1359 1236 1080
1789A080l69m05m13m33l79k68r9OJ16L47L46M52M57L38L26J88J2j50j64m77l26
$$ 1080 711 306 -107 -540 -919 -1187 -1286 -1280 -1164 -817 -471 -19 438 776 1102 1290 1302 1152 988 511 185
1810A85m41m34l59j86l3L5K75K95L64L75N23L35K24J03pk16k62l83m63l73m07
$$ 185 -256 -690 -1049 -1235 -1268 -1233 -958 -663 -299 76 599 934 1158 1261 1254 1038 776 393 -70 -443 -850
1831h50k92r9pJ66K98L37M81L80L67L31J62M6j28k68m00m71l82m50k78j83j22
$$ -850 -1142 -1241 -1248 -1082 -784 -447 34 414 781 1112 1274 1320 1192 924 524 53 -329 -779 -1057 -1240 -1362
1852a362J48K05M06M09M63M10L45K40J23m8k10l23m66m43m80m11l38j15K9J94
$$ -1362 -1214 -1009 -603 -194 269 679 1024 1264 1387 1339 1129 806 340 -103 -583 -994 -1332 -1447 -1418 -1224
1872a224K99M06M55N98L75L08K38K2j13l24m05m86m76m58m34k00o0J6K33L96M89
$$ -1224 -925 -519 -64 534 909 1217 1455 1477 1364 1040 635 149 -327 -785 -1219 -1419 -1479 -1463 -1230 -834 -345
1893c45N30M36M54K61J82Qk33k95m52n02m74n77k67k06n0J64K52M97M37N07N42
$$ -345 185 621 1075 1336 1518 1526 1293 998 546 44 -430 -1007 -1274 -1480 -1530 -1366 -1114 -617 -180 327 869
1914H69K69K33J05k8k33m00m55m81n87l63l02j79J9K19L78M74M60N12N25K70K25
$$ 869 1138 1371 1476 1448 1215 815 360 -121 -708 -1071 -1373 -1552 -1533 -1314 -936 -462 -2 510 1035 1305 1530
1935A530kj45l19m56m93n09m93l20k85k6J53J82M44M59O01M46M09K54J32p4k45
$$ 1530 1528 1383 1064 608 115 -394 -887 -1207 -1492 -1518 -1365 -1183 -739 -280 321 767 1176 1430 1562 1488 1243
1956A243l81m24n68n59m43k68j75PK06L10N09N04N66N49K30K65N8j81l19l95n61
$$ 1243 862 438 -130 -689 -1132 -1400 -1575 -1568 -1362 -1052 -543 -39 527 1076 1306 1571 1629 1448 1129 734 173
1977A73n51n59l64k82r0J04K33M31N05O62N24M61L34J66o7k11m01n05n84n54n14
$$ 173 -378 -937 -1301 -1583 -1673 -1569 -1336 -905 -400 262 786 1247 1581 1747 1680 1469 1068 563 -21 -575 -1089
1998a089l39l06kJ95L13M26N78O15N14M62K58J89j47k60m29m98o72n96l99l59
$$ -1089 -1428 -1734 -1736 -1541 -1228 -802 -224 391 905 1367 1625 1814 1667 1407 978 480 -192 -788 -1187 -1546
2018a546j83J6K52L52M81O13N77N22L86K60J5k01k71m90o21n51n27m02l19j18
$$ -1546 -1729 -1713 -1461 -1109 -628 -15 562 1084 1470 1730 1745 1544 1273 783 162 -389 -916 -1318 -1637 -1755
2038a755J56K44M30N88M92N00N78L13J97p4l15l22m75n92n66n22l54k71O3J37
$$ -1755 -1599 -1355 -925 -337 155 655 1233 1546 1743 1669 1354 1032 557 -35 -601 -1123 -1477 -1748 -1685 -1548
2058a548L01N27N64N99M70M55K99L6j44k53m53n73n86m97m78k17j91Q2J37M87
$$ -1548 -1247 -720 -156 443 913 1368 1667 1703 1559 1306 853 280 -306 -803 -1281 -1498 -1689 -1607 -1470 -983
2078i83N78N25N33M48M12J66nj95k96n73n66n57m71m80k33qP9L35M40N76N93N36
$$ -983 -405 120 653 1101 1513 1679 1674 1479 1183 610 44 -513 -984 -1464 -1697 -1705 -1626 -1291 -851 -275 318 854
2100H54M44L03J63j62k08l93n15n80n71m58l62j38m2J63L35M82N29O40N37M18
$$ 854 1298 1601 1764 1602 1394 1001 486 -94 -665 -1123 -1485 -1623 -1665 -1502 -1167 -685 -156 484 1021 1439
2120A439K09P1q4l19m77n27n99n09n38k12q3o4K74M05N29N09N50N06L67J77j9
$$ 1439 1648 1719 1635 1316 839 312 -287 -796 -1334 -1546 -1629 -1693 -1419 -1014 -485 24 574 1080 1447 1624 1605
2141A605j49l53m48m90n69n64l74j91n1J00K14M90M83N09N64L94K52Q8j1k26l35
$$ 1605 1456 1103 655 165 -404 -968 -1342 -1533 -1584 -1484 -1270 -780 -297 212 776 1170 1422 1510 1499 1273 938
2162I38n29m41n49m69k60k05mK35K48M67M73N05N40K68J77P0j52k61l95l97n70
$$ 938 409 -32 -581 -1050 -1310 -1515 -1519 -1284 -1036 -569 -96 409 949 1217 1394 1464 1312 1051 656 259 -311
2183c11m71k99k60j25R4K66K74M91M76M74M02K98J44j1j90m19l45m91m65m29l17
$$ -311 -782 -1081 -1341 -1466 -1372 -1106 -832 -341 135 609 1011 1309 1453 1442 1252 833 488 -3 -468 -897 -1214
2204a214j21r6J64K75L40M58N17M87K36K85Q2j29k29l39l98m86m87l52j95j50
$$ -1214 -1335 -1431 -1267 -992 -652 -194 323 810 1046 1331 1413 1284 1055 716 318 -168 -655 -1007 -1202 -1352
2224a352K2J96L00L89M16N27L20L30K05j5j29l04l08l75n39l60k43k45j12R4K36
$$ -1352 -1330 -1134 -834 -445 -29 498 818 1148 1353 1338 1209 905 597 222 -317 -677 -920 -1165 -1277 -1183 -947
2245i47K11M04M79L65L59K15J39l6j11k92l36l92m34l03l10j50l7J69J76L30L26
$$ -947 -736 -332 147 512 871 1086 1225 1189 1078 786 450 58 -376 -679 -989 -1139 -1176 -1007 -831 -501 -175
2266a75M13L74J76K55O7j16j23k83l82k88l11k99j79q9k4K35J45K98L40L22L02
$$ -175 238 612 788 1043 1110 994 871 588 206 -82 -393 -692 -871 -960 -984 -749 -604 -306 34 356 658
2287F58K34O2l8o6k16k14l88k95l20j79j66K9Q9N6K88K80L10K70K76J28O1m3j20
$$ 658 892 954 916 850 634 420 32 -263 -583 -762 -928 -899 -810 -754 -466 -186 124 394 670 798 859 816 696
2310F96k15k61k84j96l20j69m5m9J32J50K07L50K05K68K03J15N6j13j59k04k29
$$ 696 481 220 -64 -260 -580 -749 -794 -843 -711 -561 -354 -4 201 469 672 787 843 730 571 367 138
2331A38k65k22k35j48Rk6M4K10K38K76K37K54J47ON4j26l8k69k25j11l41j41j22
$$ 138 -127 -349 -584 -732 -723 -749 -705 -495 -257 19 256 510 657 663 717 591 553 284 59 -52 -393 -534 -656
2354f56M6K9P6Q3J83L01J90K20M4J17o2L2j44k74j00k59j37j17o8j1M7L2J72J66
$$ -656 -610 -581 -505 -422 -239 62 252 472 516 633 571 603 459 185 85 -174 -311 -428 -496 -507 -460 -428 -256 -90
2378i0R3J78J17J16O3Kq6j57j07j07j59j36o1p5L9j6J25P2J13J05J38J24L4O8
$$ -90 3 181 298 414 477 479 393 236 129 22 -137 -273 -334 -409 -370 -386 -261 -189 -76 29 167 291 325 393
2402C93k8j02m9o0j44j14j15m4p2M8QP7Q2Q2J24Q3MO3K8p5nr5m4j26m8l4qj02
$$ 393 365 263 214 154 10 -104 -219 -263 -335 -287 -279 -202 -120 -38 86 169 173 236 264 189 184 89 45 -81 -129 -163 -171 -273
2430b73mM9J6P4J29M1L2R4M7M3k6j8m4l6j21m1q1p1qJ5j4NN2Q9N7L2J33mM0k7
$$ -273 -277 -228 -212 -138 -9 32 64 158 205 248 222 204 160 124 3 -38 -119 -190 -198 -183 -197 -192 -140 -51 6 38 171 167 207 180
2460A80j9L6p3q7L3j37l4p1N2j45L9P4J2M5M3Q8M7L6P7N1o2J4J8p7j06r4p5k1
$$ 180 161 197 124 37 70 -67 -101 -172 -120 -265 -226 -152 -140 -95 -52 36 83 119 196 247 185 199 217 140 34 -60 -135 -156
2488a56m2J0k8J5J8N4J51j9J24N8N5PL2m1r1Rp1j37o7o6p4k0l7M4Q3P9M0J49J41
$$ -156 -198 -188 -216 -201 -183 -129 22 3 127 185 240 247 279 238 147 156 85 -52 -119 -185 -259 -279 -316 -272 -189 -110 -70 79 220
2517B20Q9k3J4J9q9l9j32Kj71j33k4n1K8LP2Q2J03J44J05N6L5M2j2q1p5r8j15
$$ 220 309 286 300 319 230 191 59 61 -110 -243 -267 -318 -290 -287 -215 -133 -30 114 219 275 310 352 340 259 184 86 -29
2544b9j22p0j53lj5M2R5J29J61R4Q5Q6J42p4Kl9q3k16j23j10j11j02lM3j4J72
$$ -29 -151 -221 -374 -377 -392 -350 -255 -126 35 129 214 300 442 368 370 331 248 32 -91 -201 -312 -414 -417 -374 -388 -216
2570b16Q2K21J49J15J11PJ1k4j03k39j74q5k01q9m2r1P2N5J70J54K24J53J18J38
$$ -216 -134 87 236 351 462 469 480 456 353 114 -60 -145 -346 -435 -477 -568 -496 -441 -271 -117 107 260 378 516
2594E16kN9j12j18j94k06j41j99k01o3O7O3J00J67J56L00J60K26L0NM4j23j64
$$ 516 514 573 461 343 149 -57 -198 -397 -598 -661 -594 -531 -431 -264 -108 192 352 578 608 613 657 534 370
2617C70j97k30k69j27j56p0M9P5R7K33J15K40K84J58M6Q2q3q1k56j61k32k86j09
$$ 370 173 -57 -326 -453 -609 -679 -630 -555 -458 -225 -110 130 414 572 618 700 617 536 280 119 -113 -399 -508
2640e08j65qj7J12J28K50K24L10J81J07J15k0n8j63j83k54k42k35j50j38k3P5
$$ -508 -673 -681 -698 -586 -458 -208 16 326 507 614 729 709 651 488 305 51 -191 -426 -576 -714 -737 -662
2662f62J01J93K35K55K43J93J08J32m8r5k19k03k55k95k21j80o2MM7K10K02K18
$$ -662 -561 -368 -133 122 365 558 666 798 750 655 436 233 -22 -317 -538 -718 -780 -776 -729 -519 -317 -99
2684i9L73J89K16L6J42j21j06k09k66l04k54k48j19j04M7J69J74K33K84K75K44
$$ -99 274 463 679 715 857 736 630 421 155 -149 -403 -651 -770 -874 -827 -658 -484 -251 33 308 552
2705E52K11P6P0j79j12k53k84l22l43j82j05p3J12J32K05K68L13L00K35K62N3
$$ 552 763 839 909 730 618 365 81 -241 -584 -766 -871 -944 -832 -700 -495 -227 86 386 621 883 936
2726I36Jj85j65k48l55k53l22k25j77J2J16J52K00L99L76K37K67J21J30o8j13
$$ 936 937 752 587 339 -16 -269 -591 -816 -993 -981 -865 -713 -513 -114 262 499 766 887 1017 949 836
2747H36k36k86l77l09l23j93j35J1J57J26L55L46K73L29K35J77n1lj98k26k74
$$ 836 600 314 -63 -372 -695 -888 -1023 -1012 -855 -729 -374 -28 245 574 809 986 935 932 734 508 234
2768B34l87k93k76j54j55L6J78K44K95L06L08K73K47J50j3q5j95l36l18k75l81
$$ 234 -153 -446 -722 -876 -1031 -995 -817 -573 -278 28 336 609 856 1006 993 908 713 377 59 -216 -597
2789e97j99k11K4L1J04L94K02L78L31K95J80N2J9r7k73k86m08l15l03k73l7q6
$$ -597 -796 -1007 -983 -952 -848 -454 -252 126 457 752 932 984 1003 906 633 347 -61 -376 -679 -952 -989 -1075
2811a075P6K61L05L12M01K60L46J63N1m0k13k98k97l22m61k59k37r1mJ64K50L94
$$ -1075 -999 -738 -433 -121 280 540 886 1049 1100 1060 847 549 252 -70 -531 -790 -1027 -1118 -1122 -958 -708 -314
2833c14L20L57L19K86J23j3p2k39k63l66l69l78k66j50j31K1K62K10L57M24L49
$$ -314 6 363 682 968 1091 1078 1006 767 504 138 -231 -609 -875 -1025 -1156 -1135 -873 -663 -306 118 467
2854D67L18K14J69J4j54k28l12l82l47m25k14k15q4J65J64K84L41L75M03K51J90
$$ 467 785 999 1168 1182 1028 800 488 106 -241 -666 -880 -1095 -1179 -1014 -850 -566 -225 150 553 804 994
2875I94J19pj88k66k90l60l97l99j27j84k7J13K15L60L06M65L05K28J90P7n0k22
$$ 994 1113 1106 918 652 362 2 -395 -794 -921 -1105 -1132 -1019 -804 -444 -138 327 632 860 1050 1127 1077 855
2897H55j91m21l31m22k80k32j01Q9J45K30L55L18M60K29K51J63l1r7k23k10m55
$$ 855 664 243 -88 -510 -790 -1022 -1123 -1034 -889 -659 -304 14 474 703 954 1117 1086 989 766 556 101
2918A01l81l12k38k22q0Q6K18K61K85M79K74L08K31P0Mj44k24m04l29l63l39k00
$$ 101 -280 -592 -830 -1052 -1132 -1046 -828 -567 -282 197 471 779 1010 1080 1084 940 716 312 -17 -380 -719 -919
2940i19k09J4R6K22L07M08K89L70K69K58M9j13r2l55l30l72l55l83j26r8j2J41
$$ -919 -1128 -1114 -1018 -796 -489 -81 208 578 847 1105 1154 1041 949 594 264 -108 -463 -846 -972 -1070 -1082 -941
2962i41K21K98M43K76L78K09J84p2j2k29k76l51l16l02l05j43q6P4J10K48L26
$$ -941 -720 -422 21 297 675 884 1068 996 984 755 479 128 -188 -490 -795 -938 -1024 -950 -840 -592 -266
2983b66L17L40L66J87P9J5j07k67k78l97k14k97k98j15m2R2J65J56M11K50L13
$$ -266 51 391 757 944 1023 1038 931 664 386 -11 -225 -522 -820 -935 -977 -885 -720 -564 -153 97 410
3004D10L03J60N6p5q8j92l25l03l06k82k14n0j0J30K27J96L21K65L10K25N4N7
$$ 410 713 873 929 854 766 574 249 -54 -360 -642 -856 -906 -916 -786 -559 -363 -42 223 533 758 812 869
3026H69Jk13k44k51k55l49j99j76l5K4J11J97L12K63K57K48J08J06pp4j92j93
$$ 869 870 657 413 162 -93 -442 -641 -817 -852 -828 -717 -520 -208 55 312 560 668 774 767 693 501 308
3048C08k94k44k28j98j27j4OJ73K60J77K73K96K25J46J9k2j04j22k86k68k77k00
$$ 308 14 -230 -458 -656 -783 -797 -791 -618 -358 -181 92 388 613 759 778 756 652 530 244 -24 -301 -501
3070e01j24r9j9Q6J28J92K74K45K20J67J12kM6j24k32j84k96k22j67o9j56N9N3
$$ -501 -625 -724 -743 -657 -529 -337 -63 182 402 569 681 679 725 601 369 185 -111 -333 -500 -569 -725 -666 -613
3093f13J89J78K09K48J54J80R2m8n6r8j59j68k53j90o2j56m2l7K40J22J56J74
$$ -613 -424 -246 -37 211 365 545 637 589 533 435 276 108 -145 -335 -397 -553 -595 -632 -392 -270 -114 60
3115F0J35J32J50N2l4j08m7j68j87j49j80m4j06M6M5M2R6J68J72J03J46J30Np3
$$ 60 195 327 477 529 495 387 340 172 -15 -164 -344 -388 -494 -448 -403 -361 -265 -97 75 178 324 454 459 386
3139C86q0j01j36j94o7q5j16m7M7R7M9J27J09J54N6O5N5j3M2j35q4q1j32r6q6
$$ 386 306 205 69 -125 -192 -277 -393 -440 -393 -296 -247 -120 -11 143 199 264 319 306 348 213 129 48 -84 -180 -266
3164b66o3m8J45nQ3Q2P2R4P3R4m3K9k6j25m6j19n4Mj42M8J3J5L0J42k7J13L4N0
$$ -266 -329 -377 -232 -237 -154 -72 0 94 167 261 218 247 221 96 50 -69 -123 -119 -261 -213 -200 -185 -155 -13 -40 73 107 157
3192A57N8o4M9q3o4l8p1j8oq6P2Kl5LJ10m9K9Q8kJ6n0L5L8r8k4M8o4lN0J3m5Q9
$$ 157 215 151 200 117 53 15 -56 -74 -80 -166 -94 -92 -127 -124 -14 -63 -34 54 52 68 18 53 91 -7 -31 17 -47 -50 0 13 -32 57
3224E7k5j8lj6j3J5j1lm1K8QM8k5P4O0m4Rlk1j5m7L9r6m6or9P9q2M6R6P7kO3M6
$$ 57 32 14 11 -5 -18 -3 -14 -17 -58 -30 -22 26 1 75 135 91 100 97 76 61 14 53 -43 -89 -95 -194 -115 -197 -151 -55 22 20 83 129
3258A29j7P8j8Mo0m2o2q0n8p5l8L0JQ0K7P4R0Q3P1P3no2O7j18j47n1j20j03m5
$$ 129 112 190 172 176 116 74 12 -68 -126 -201 -239 -209 -208 -128 -101 -27 63 146 217 290 285 223 290 172 25 -26 -146 -249 -294
3287b94j04P3K7L9J51Q3J27J11R3PJ4M4j41r1j26l5j73j00q8l9LM5K11Q9J20K12
$$ -294 -398 -325 -298 -259 -108 -25 102 213 306 313 327 371 230 139 13 -22 -195 -295 -383 -422 -419 -374 -163 -74 46 258
3313B58R0K2P8k9p9m4j73r0k09j88r6pm6N0J46J03J62J90J91Q2Q3L0n5o7j70j57
$$ 258 348 370 448 419 340 296 123 33 -176 -364 -460 -467 -513 -463 -317 -214 -52 138 329 411 494 524 469 402 232 75
3339G5k29j45j66k1q0O5J4J10J86K19K79J15J56J3N1j36j34j55j66k26k10j15
$$ 75 -154 -299 -465 -486 -566 -501 -487 -377 -191 28 307 422 578 591 642 506 372 217 51 -175 -385 -500
3361e00j38o1R7J01J38J80K94K26J27J65L3Nj16j94j42k56k31j35k35o4p1J99
$$ -500 -638 -699 -602 -501 -363 -183 111 337 464 629 662 667 551 357 215 -41 -272 -407 -642 -706 -777 -578
3383e78J25J44J98L09J90J65J13L2Lj44j50k22k91j90j93j22j98O4J09J20L08
$$ -578 -453 -309 -111 198 388 553 666 698 701 557 407 185 -106 -296 -489 -611 -809 -745 -636 -516 -208
3404b08K04K43J97K01J41K1j10j61j69k81k33k82j42j38j35J26L4K60K62L21J91
$$ -208 -4 239 436 637 778 799 689 528 359 78 -155 -437 -579 -717 -852 -726 -692 -432 -170 151 342
3425C42K02K08M2Kj32k08j82k72l12j79j66j70K5O7J78J99K70L00K05K61J84k4
$$ 342 544 752 794 796 664 456 274 2 -310 -489 -655 -825 -800 -733 -555 -356 -86 214 419 680 864 840
3447H40m7k02r1k91l16k86k20j81o0OK5K23K71L10K83K85K06J43J9j38j35k53
$$ 840 793 591 500 209 -107 -393 -613 -794 -854 -848 -823 -600 -329 -19 264 549 755 898 917 779 644 391
3469C91l04k94k60k35j26j11K7J65K15L07K80L23K65J64J57J3r7k34k66l57k21
$$ 391 87 -207 -467 -702 -828 -939 -912 -747 -532 -225 55 378 643 807 964 977 880 646 380 23 -198
3490a98l57k41j23j5P0J62K20K72L35K87K94J36Q8J9r8k84k72l03l04k21l04j19
$$ -198 -555 -796 -919 -934 -864 -702 -482 -210 125 412 706 842 930 949 851 567 295 -8 -312 -533 -837 -956
3512i56L0Q4J76K58L20L78K40K30J40O2p0j32k23l02l36l30k68j19j18l5J70K28
$$ -956 -926 -842 -666 -408 -88 290 530 760 900 962 892 760 537 235 -101 -431 -699 -818 -936 -971 -801 -573
3534e73K53K37L93K91J52J58K1m8j75k61k65l27l05k43j77j10O2J57J92L18L06
$$ -573 -320 -83 310 601 753 911 932 884 709 448 183 -144 -449 -692 -869 -979 -917 -760 -568 -250 56
3555E6L42K86K05J1P6j29j83l11l20k74k72k67r7j42J09J99K07L11L31L15K44
$$ 56 398 684 889 900 976 847 664 353 33 -241 -513 -780 -877 -1019 -910 -711 -504 -193 138 453 697
3576F97K52L8o6j50k06k55l11l47k74k92p1j7R8J86L23K93K97L13L55J06L4k6
$$ 697 949 987 921 771 565 310 -1 -348 -622 -914 -985 -1002 -904 -718 -395 -102 195 508 863 969 1003 977
3598I77j53k74k49l72k97m11j24p5j3Q8K38L10K97L08L54K12J70K9p3j94k38l43
$$ 977 824 550 301 -71 -368 -779 -903 -978 -991 -903 -665 -355 -58 250 604 816 986 1015 942 748 510 167
3620A67l82k60k38k52k1k4J53K49L13L11L51K88K19J59n0n9k73j81l07l78l22
$$ 167 -215 -475 -713 -965 -986 -1010 -857 -608 -295 16 367 655 874 1033 983 924 651 470 163 -215 -537
$$ [...]
8190d7L
8191d4
##END NTUPLES=NMR FID
##END=
