##TITLE=1H_AM_NV77.1
 CDCl3
 8 sc, 
 27.10.2023
##JCAMPDX= 6.0         $$ Bruker NMR JCAMP-DX V2.0
##DATA TYPE= NMR FID
##DATA CLASS= NTUPLES
##ORIGIN= UXNMR, Bruker Analytische Messtechnik GmbH
##OWNER= root
$$ XWIN-NMR		Version 3.5
$$ Fri Oct 27 16:43:41 2023 Russian Standard Time (UT+4h)  she@DPX200
##.OBSERVE FREQUENCY= 200.13135
##.OBSERVE NUCLEUS= ^1H
##.DELAY= (6, 6)
##.ACQUISITION MODE= SIMULTANEOUS
##.ACQUISITION SCHEME= undefined
##.AVERAGES= 8
##.DIGITISER RES= 18
##SPECTROMETER/DATA SYSTEM= spect
##.PULSE SEQUENCE= zg30
##.SOLVENT NAME= D2O
##.SHIFT REFERENCE= (INTERNAL, D2O, 0, 15.7039)
##AUDIT TRAIL= $$ (NUMBER, WHEN, WHO, WHERE, WHAT)
$$ ##TITLE= Audit trail, XWIN-NMR		Version 3.5
$$ ##JCAMPDX= 5.01
$$ ##ORIGIN= Bruker BioSpin GmbH
$$ ##OWNER= she
$$ F:/spectra/data/she/nmr/H-F/1/audita.txt
$$ ##AUDIT TRAIL=  $$ (NUMBER, WHEN, WHO, WHERE, WHAT)
(   1,<2023-10-27 16:42:28.48 +0400>,<she>,<DPX200>,
      <created by zg, POWCHK disabled, PULCHK disabled
       configuration hash MD5:
       00 E9 B6 7A A2 85 ED C7 34 08 36 98 17 FE 4E 26
       data hash MD5: 16K
       03 28 86 A4 00 F2 6E 17 25 85 FC 83 3F 39 73 60>)
$$ ##END=
$$ 
$$ hash MD5
$$ C2 83 88 0C 5F E1 F3 8D FA 4B A3 15 04 6F 8F 27
##$RELAX= 
##$RELAX= 
##$RELAX= 
##$RELAX= 
##$RELAX= 
##$RELAX= 
$$ Bruker specific parameters
$$ --------------------------
##$DU= <F:/spectra>
##$EXPNO= 1
##$NAME= <H-F>
##$PROCNO= 1
##$TYPE= <nmr>
##$USER= <she>
##$AMP= (0..31)
100 100 100 100 100 100 100 100 100 100 100 100 100 100 100 100 100 100 
100 100 100 100 100 100 100 100 100 100 100 100 100 100 
##$AQSEQ= 0
##$AQ_mod= 1
##$AUNM= <au_zg>
##$AUTOPOS= <>
##$BF1= 200.13
##$BF2= 200.13
##$BF3= 200.13
##$BF4= 200.13
##$BF5= 200.13
##$BF6= 200.13
##$BF7= 200.13
##$BF8= 200.13
##$BYTORDA= 1
##$CFDGTYP= 0
##$CFRGTYP= 5
##$CHEMSTR= <none>
##$CNST= (0..31)
1 1 145 1 1 1 1 1 1 1 1 1 1 1 1 1 1 1 1 1 1 1 1 1 1 1 1 1 1 1 1 1 
##$CPDPRG= <>
##$CPDPRG1= <>
##$CPDPRG2= <>
##$CPDPRG3= <>
##$CPDPRG4= <mlev>
##$CPDPRG5= <mlev>
##$CPDPRG6= <mlev>
##$CPDPRG7= <mlev>
##$CPDPRG8= <mlev>
##$CPDPRGB= <>
##$CPDPRGT= <>
##$D= (0..31)
0 1.2 0 0 0 0 0 0 0 0.06 0 0.03 0 0 0 0 0.0002 0 0 0 0 0 0 0 0 0 0 0 0 
0 0 0 
##$DATE= 1698410548
##$DBL= (0..7)
120 120 120 120 120 120 120 120 
##$DBP= (0..7)
150 150 150 150 150 150 150 150 
##$DBP07= 0
##$DBPNAM0= <>
##$DBPNAM1= <>
##$DBPNAM2= <>
##$DBPNAM3= <>
##$DBPNAM4= <>
##$DBPNAM5= <>
##$DBPNAM6= <>
##$DBPNAM7= <>
##$DBPOAL= (0..7)
0.5 0.5 0.5 0.5 0.5 0.5 0.5 0.5 
##$DBPOFFS= (0..7)
0 0 0 0 0 0 0 0 
##$DE= 6
##$DECBNUC= <off>
##$DECIM= 32
##$DECNUC= <off>
##$DECSTAT= 4
##$DIGMOD= 1
##$DIGTYP= 9
##$DL= (0..7)
0 120 120 120 120 120 120 120 
##$DP= (0..7)
150 150 150 150 150 150 150 150 
##$DP07= 0
##$DPNAME0= <>
##$DPNAME1= <>
##$DPNAME2= <>
##$DPNAME3= <>
##$DPNAME4= <>
##$DPNAME5= <>
##$DPNAME6= <>
##$DPNAME7= <>
##$DPOAL= (0..7)
0.5 0.5 0.5 0.5 0.5 0.5 0.5 0.5 
##$DPOFFS= (0..7)
0 0 0 0 0 0 0 0 
##$DQDMODE= 0
##$DR= 18
##$DS= 0
##$DSLIST= <SSSSSSSSSSSSSSS>
$$ [...]
##$SUBNAM2= <"">
##$SUBNAM3= <"">
##$SUBNAM4= <"">
##$SUBNAM5= <"">
##$SUBNAM6= <"">
##$SUBNAM7= <"">
##$SUBNAM8= <"">
##$SUBNAM9= <"">
##$SW= 18.05172834244
##$SWIBOX= (0..15)
0 0 2 0 0 0 0 0 0 0 0 0 0 0 0 0 
##$SW_h= 3612.71676300578
##$TD= 16384
##$TD0= 1
##$TE= 0
##$TE2= 300
##$TE3= 300
##$TEG= 300
##$TL= (0..7)
0 120 120 120 120 120 120 120 
##$TP= (0..7)
150 150 150 150 150 150 150 150 
##$TP07= 0
##$TPNAME0= <>
##$TPNAME1= <>
##$TPNAME2= <>
##$TPNAME3= <>
##$TPNAME4= <>
##$TPNAME5= <>
##$TPNAME6= <>
##$TPNAME7= <>
##$TPOAL= (0..7)
0.5 0.5 0.5 0.5 0.5 0.5 0.5 0.5 
##$TPOFFS= (0..7)
0 0 0 0 0 0 0 0 
##$TUNHIN= 0
##$TUNHOUT= 0
##$TUNXOUT= 0
##$USERA1= <user>
##$USERA2= <user>
##$USERA3= <user>
##$USERA4= <user>
##$USERA5= <user>
##$V9= 5
##$VALIST= <valist>
##$VCLIST= <CCCCCCCCCCCCCCC>
##$VD= 0
##$VDLIST= <DDDDDDDDDDDDDDD>
##$VPLIST= <PPPPPPPPPPPPPPP>
##$VTLIST= <TTTTTTTTTTTTTTT>
##$WBST= 1024
##$WBSW= 4
##$XGAIN= (0..3)
0 0 0 0 
##$XL= 0
##$YL= 0
##$YMAX_a= 172931
##$YMIN_a= -125524
##$ZGOPTNS= <>
##$ZL1= 120
##$ZL2= 120
##$ZL3= 120
##$ZL4= 120
##$ABSF1= 10
##$ABSF2= 0
##$ABSG= 5
##$ABSL= 3
##$ALPHA= 0
##$AQORDER= 0
##$ASSFAC= 0
##$ASSFACI= 0
##$ASSFACX= 0
##$ASSWID= 0
##$AUNMP= <proc_1d>
##$AZFE= 0.1
##$AZFW= 0.1
##$BCFW= 1
##$BC_mod= 2
##$BYTORDP= 1
##$COROFFS= 0
##$CY= 11.3945322036743
##$DATMOD= 1
##$DC= 2
##$DFILT= <>
##$DTYPP= 0
##$F1P= 15.7292609196834
##$F2P= 12.9074282941183
##$FCOR= 0.5
##$FTSIZE= 0
##$FT_mod= 4
##$GAMMA= 1
##$GB= 0.15
##$INTBC= 1
##$INTSCL= 1
##$ISEN= 128
##$LB= 0.24
##$LEV0= 0
##$LPBIN= 0
##$MAXI= 10000
##$MC2= 0
##$MEAN= 0
##$ME_mod= 0
##$MI= 1.114404
##$NCOEF= 0
##$NC_proc= 0
##$NLEV= 6
##$NOISF1= 3.799351
##$NOISF2= 2.8
##$NSP= 1
##$NTH_PI= 0
##$NZP= 0
##$OFFSET= 15.70392
##$PC= 1
##$PHC0= -24034.35
##$PHC1= 16.25271
##$PH_mod= 1
##$PKNL= yes
##$PPARMOD= 0
##$PSCAL= 0
##$PSIGN= 0
##$REVERSE= no
##$SF= 200.130013532006
##$SI= 16384
##$SIGF1= 3
##$SIGF2= 2
##$SINO= 400
##$SIOLD= 16384
##$SREGLST= <1H.CDCl3>
##$SSB= 0
##$STSI= 0
##$STSR= 0
##$SW_p= 3612.71676300578
##$SYMM= 0
##$S_DEV= 0
##$TDeff= 0
##$TDoff= 0
##$TI= <>
##$TILT= no
##$TM1= 0
##$TM2= 0
##$TOPLEV= 0
##$USERP1= <user>
##$USERP2= <user>
##$USERP3= <user>
##$USERP4= <user>
##$USERP5= <user>
##$WDW= 1
##$XDIM= 8192
##$YMAX_p= 0
##$YMIN_p= 0
$$ End of Bruker specific parameters
$$ ---------------------------------
##NTUPLES= NMR FID
##VAR_NAME=  TIME,          FID/REAL,        FID/IMAG
##SYMBOL=    X,             R,               I
##VAR_TYPE=  INDEPENDENT,   DEPENDENT,       DEPENDENT
##VAR_FORM=  AFFN,          ASDF,            ASDF
##VAR_DIM=   8192,          8192,            8192
##UNITS=     SECONDS,       ARBITRARY UNITS, ARBITRARY UNITS
##FACTOR=    0.0002768,     1,               1
##FIRST=     0,             0,               0
##LAST=      2.2672688,     0,               0
##MIN=       0,             -125524,         0
##MAX=       2.2672688,     172931,          0
$$ Real data points
##PAGE= N=1
##DATA TABLE= (X++(R..R)), XYDATA
$$ [...]
375h283P763P434j769n431m349j715N257Q305k59p366m752j09M163O773R79p561
391i20n660J756M309M629K211n179p384P03O525M094j56m112o135q23O345M997
407E200q15m105m764j124N603O106j062n376l856m09L829N679L55n733m742M81
423d733M563M874J12n055m347N86L881M342O57m882n073P26M677L621L31l944
439C36m913K51N056L533l64l354m616q25N218M479j478l818k741q04L318N255
455D533j12n106l170O95K867L841P19m783m122J358L655K557Q43l116m840L39
471c842N002K690r67k545l432j037M116M113j153l578k335k97K965M198j41m325
487e68k808Q51K449K939O03l637l918Q86L784K398k58k504l308k02L810L076q94
$$ y = [-8283, -520, 6914, 5145, -286, -4635, -6350, -1093, 7212, 6953, -413, -5165, -5274, -1111, 5662, 6641, -920, -6580, -4824, -515, 4114, 6325, 1146, -6238, -5535, 990, 5084, 4928, 816, -5319, -6142, 203, 5200, 4385, 280, -4484, -5608, -5, 6101, 5039, -337, -4193, -4602, -773, 4906, 5261, -472, -5214, -4733, -170, 4704, 4816, -239, -4586, -4000, -119, 4223, 4880, -2, -5075, -4349, 328, 3949, 4280, 336, -4577, -4326, 730, 4263, 3899, 545, -4071, -4896, 322, 4801, 3323, -495, -3236, -4040, -722, 4533, 4421, -685, -3855, -3160, -293, 3548, 4267, -516, -4638, -3280, 375, 2932, 3775, 659, -4181, -3842, 1160, 3850, 2883, 338, -3094, -4131, -15, 4098, 2945, -633, -2968, -3265, -300, 3898, 3757, -568, -3376, -2525, -76, 2863, 3466, -171, -4089, -3203, 581, 2979, 2721, 217, -3091, -3293, 517, 3593, 2699]
504B699l024k522j29K894L248l63l400k394N10K612K810J12l172k945N71L031
520E38K182k16k629k777K2L078K759o31k760k240K09K642K653l30k802k258L47
537b213K368K413p1k764k495N76K583K030k17k297k529J95K804K172n06k308k036
554b295K7K462K300l92k491j950K54K178K163p0k484k072N52K182J800j24k099
571e9k182K13K457J773l60k139j857K35K139J902l21k125j678K67K070J814k69
588A880k147j803L44J999J570k53k004j710L63K098J569k47j858j608K42J897
604C32J682l81k038j478L78J697J587k48j833j466M46J725J361k77j672j558K87
621a456J770J316l70j635j369J98J794J478m30j601j123J94J436J440j44j757
$$ y = [2699, -325, -2847, -2976, -82, 3166, 2803, -597, -2991, -2481, 131, 2941, 3053, -119, -3064, -2493, 538, 2720, 2504, -125, -2902, -2880, 198, 2957, 2326, -434, -2674, -2465, 177, 2830, 2500, -302, -2560, -2213, 155, 2568, 2497, -267, -2762, -2186, 397, 2427, 2210, -87, -2616, -2421, 383, 2555, 2049, -259, -2295, -2268, 194, 2494, 2102, -389, -2339, -2085, 93, 2256, 2186, -298, -2370, -1818, 364, 2164, 2040, -59, -2241, -2028, 429, 2202, 1842, -297, -2154, -1919, 220, 2122, 1801, -324, -2002, -1735, 335, 2149, 1880, -267, -2070, -1726, 273, 1843, 1590, -414, -2124, -1761, 337, 1906, 1659, -199, -1807, -1565, 332, 2014, 1633, -405, -1883, -1505, 192, 1779, 1531, -302, -1768, -1322, 403, 1764, 1487, -185, -1743, -1456, 314, 1630, 1260, -375, -1744, -1546, 248, 1726, 1296, -305, -1428, -1234, 202, 1642, 1498, -259]
637b59j435M46J511J242k25j541j332M30J529J036k24j265j382J60J621J214m57
654A069j435j090L26J363J221l11j470j021L43J234J164j88j451j210L67J410
670C21R32k08j317j055L30J412Q43l38j123j060J80J288J132l27j410r01L44J215
688B58R95l36j202q45K36J133Q57j55j162j000K95J265Q75l53j187p37K04J128
706B69Q34k28j133q12J88J095Q44k18j139q57M03J089O70k56r63q22K82J011Q04
725A061l96r36p51K40J043Q01l81r60o65L16Q84P08k01r90p64L45Q90O45k24q54
745a89p37K28R72N75k10q68o33K38Q28O11k19q61o07K23Q41O66k49q11o47K88
765e61P95N54j54p95o52K09Q65N31k73p80n29K41Q24M83k76p01n21K28P00N58
$$ y = [-259, -1694, -1248, 263, 1505, 1280, -261, -1593, -1163, 366, 1402, 1178, -87, -1469, -1309, 312, 1526, 1069, -366, -1456, -1130, 233, 1454, 1143, -327, -1348, -1005, 229, 1393, 1205, -246, -1456, -1089, 321, 1253, 1045, -272, -1327, -997, 415, 1258, 920, -203, -1263, -1083, 205, 1337, 1010, -400, -1301, -957, 258, 1253, 917, -285, -1130, -894, 239, 1096, 941, -221, -1221, -926, 339, 1214, 861, -326, -1063, -859, 269, 1103, 875, -258, -1070, -882, 213, 1057, 839, -300, -1157, -754, 335, 1005, 749, -214, -1036, -754, 257, 1061, 665, -271, -1022, -782, 261, 1062, 681, -279, -944, -628, 256, 964, 763, -227, -991, -646, 244, 889, 665, -189, -926, -698, 274, 849, 639, -229, -862, -624, 204, 815, 596, -265, -872, -649, 192, 858, 609, -202, -849, -561, 234, 788, 634, -161, -813, -604, 261, 792, 519, -261, -790, -549, 275, 758, 482, -219, -740, -512, 188, 746]
785G46k02q54m43K25O97O02k48p40m84K44P35L73j93o12n27J66P07M48j44o60
805a64m64J39O58N11k35o69m19K67N81M48k57o35m15K43O36L60k18n41m20J82
825d12O22L87j97o44l14K11N74L74k80n11l48J56N33M04j49n72m56K83N30L47
845E38j81n71l05J80N63L08k22m87l05J74N18L39j82n81l63L14M82L25k12n50
865b18k33J90M54K81k00m15l05J13N27K67k45l46l62J98N05K04j15m42k95J15
885c22N03K76j80m66k58J32M14L16j36m59k43J74M13K35j40l97k74J40M61J92
905C81j96k83k11Q1L93K20j33l78k46J60L51K64j59m03k19J92L60J67j49k97k16
926c21Q4L96J80j49l04k09J02L79J82j18m06j22N7M31J59p9l68j76P9L24K46k02
$$ y = [746, 544, -310, -753, -528, 169, 771, 523, -217, -701, -457, 278, 651, 458, -154, -681, -515, 192, 640, 496, -164, -628, -489, 169, 680, 445, -224, -643, -376, 205, 653, 396, -239, -654, -411, 225, 585, 367, -174, -594, -412, 210, 597, 400, -244, -558, -347, 227, 601, 321, -190, -538, -382, 151, 555, 406, -166, -622, -339, 191, 538, 357, -214, -519, -339, 224, 532, 310, -177, -482, -308, 210, 549, 367, -214, -577, -263, 219, 544, 332, -218, -451, -261, 193, 474, 274, -141, -446, -333, 194, 461, 216, -130, -492, -294, 211, 415, 300, -142, -437, -322, 181, 457, 277, -189, -447, -315, 99, 415, 279, -180, -423, -249, 164, 399, 259, -138, -412, -272, 189, 381, 185, -98, -309, -228, 165, 385, 252, -126, -372, -212, 139, 403, 244, -159, -378, -186, 174, 341, 192, -105, -321, -237, 159, 339, 190, -114, -323, -221, 158, 340, 222, -184, -306, -249, 182, 341, 262, -106, -282, -203, 121, 367, 165]
948A65l35j58J52K64K25q7l56j40N2L46K22j46k57k91J84K83J66r9l72j55J51
969a86K89J47p8k81k01J14L12J70j53k93j20J30K49K12j60k54j22O9K68J55l2
990B35l64r7Q7K12K51j17l05j48Q5K80J62r8l10q9N4K42J80j13k16j80J23K27
1012A01J55j33k15j70J44K33J42j16k41j81J74K54R0l4k69j65J14K42J28m4l11
1033a02r1Q1K17J17n0k90j08R3J89J62r6k34o9O1K21R9j6k95p4P8J76J25l8k62
1057a06p7J11J46J07j17j68j18J22K38M6o0j83r1R5J40O2l2j53j54R6J34J51j01
1080H8j29j38K6K11J32q4j90r5P4J93N4n7r6j75J65Q6J19q1j50j46Q0J87M2l8
1104G8j58p7Q8P6J47j03j19j10J11J70Q6m3k09r0J32Q0Q0k8j18q0M5R0Q8r1j23
$$ y = [165, -170, -328, -176, 88, 313, 226, -130, -270, -218, 128, 350, 204, -53, -344, -160, 123, 289, 190, -182, -337, -186, 103, 250, 172, -109, -310, -196, 116, 286, 133, -160, -280, -150, 99, 311, 151, -103, -225, -156, 112, 267, 235, -129, -226, -139, 73, 324, 207, -98, -246, -161, 119, 281, 183, -127, -216, -162, 80, 260, 147, -69, -249, -126, 101, 256, 123, -92, -262, -118, 115, 257, 141, -100, -281, -107, 147, 237, 203, -66, -231, -117, 125, 253, 209, -102, -193, -112, 105, 222, 172, -118, -226, -133, 56, 218, 122, -112, -181, -120, 101, 200, 184, -111, -185, -107, 69, 194, 156, -106, -183, -72, 74, 181, 64, -104, -222, -100, 138, 184, 124, -59, -150, -55, 85, 147, 115, -38, -192, -96, 38, 189, 88, -41, -179, -153, 58, 190, 106, -84, -179, -105, 88, 142, 85, -11, -186, -21, 65, 184, 103, -47, -193, -113, 74, 116, 78, -80, -157, -69, 7, 154, 51, -68, -178, -67, 103, 189, 146, -63, -153, -21, 59, 139, 111, -7, -87, -42, 48, 136, 45, -78]
1129g8m9J6J90P8j08j18p5P7J47J63j93j26n6O5J21J01q6j25l6pJ12P7l8p9o9
1154i6N9Q5Q3q7o1j52J18J40N8m6j20j18J08P9O1k7j20p6LJ86L1o6l3r3J8J41
1180G5K1l1j38m9Q5N1N7L6j53n4K3J07R2r9n7o1j4J35J22j15p9m7K1J84rm2q3
1207b2o5O1P0K2j6r0j7J4Q1M7l5q9m1PJ00O9p6r4l4N8J39J3p9q0j0K8P4J2Ql2
1237B3j11J0J44J0kq1o8N9N5k7K5q6k5O1P4L9oj08j12J02L6L9Pr1l9l9J64l3J2
1266C2l2o4O0M9M9mr3o5L0R0J5o8l3l0j3J08Q4q5l4l2l3J09M1q3J9r3OQ8O3l0
1296E1o5k3k2R7nK8p5p3K9N6M5J4n1k1k8M4Q5o9j0o9N2N4J2k6q8L2K8L0O7n7n7
1327a5n1R2L9M6n0p4j5L8QMnj05O5j3N1K6o9l2nQ0k4Q1m2r5klP0O0n6ll4K7oM0
$$ y = [-78, -127, -111, 79, 157, 49, -69, -144, -67, 80, 243, 50, -76, -132, -67, 54, 155, 69, -56, -92, -99, 13, 90, 52, -27, -96, -37, 48, 131, 44, -17, -169, -51, 89, 147, 101, -19, -137, -29, 50, 111, 84, -36, -112, -109, 77, 108, 42, 9, -84, -66, 75, 96, 65, -73, -122, -37, 14, 71, 107, -46, -100, -77, 30, 122, 23, -34, -95, -109, 26, 148, 33, -46, -93, -72, 112, 103, 61, -22, -87, -26, 44, 66, 50, -40, -57, -43, 38, 85, 50, -39, -80, -73, 27, 96, 20, -74, -108, -50, 89, 102, 23, -57, -67, -39, 35, 47, 55, 23, -88, -78, 66, 76, 74, -7, -75, -16, 39, 12, 37, -49, -74, -13, 61, 100, 94, -14, -126, -24, 12, 51, 58, -33, -72, -111, 53, 20, 32, 0, -64, -4, 45, 94, 90, -3, -68, -38, 52, 67, -1, -34, -64, -77, 31, 115, 30, -4, -36, -69, 40, 81, -2, 17, -76, -70, 18, 81, 51, -14, -37, -59, 38, 33, 61, -14, -87, -58, -2, 43, 57, 6, -15, -43, 1, 86, 17, 7, -62, -10, 44, 56, 30, -58, -26, 2, 32, 99, 42, -15, -66, 26, 65, 111, 61, -13, -28, 10, 18, 22, 17, -88, -23, -36, 15, 41, -28, -60, -65, 15, -9, 72, 30, -65, -67, -70, 0, 60, 4, 1, -33, -6, -12, 28]
1361B8j3kp1P9M2Rq1rl7KJ05K3p5m5j7K1Q1M8q0Rr3P6J0J8m6k7OK8K1K8K7j34
1393f9qJ2O4P6l4n1j9%J08lm5K2p4J3P0j3Pn1k9%P1j0o2L6o9K6J3O6K9r7K4j4
1425a1L3kJ8j3r8R8n5P0nn7Pk8LQ3n0K0p7L3J6qQok4qN8M5lk4p5J3L8J02m3l4
1459B4l3kO8j5o0Ql0M6NKJ1mj05J02k9O3k7p3N7mj1O8n2o2L1L3j9N1lj6j1o2N1
1492BK6nk0k3K9kJ35j44K2lqQM7p1J6KnN3Rq3l1L5k0N3l4L6ll8L4JK9n6l5k1N
1527f0Q4K4n5l1J9M2MOj6l1O3l8j6rJ4K7n5K0J5K2m5K8K8p4P1Kk2j6j0M0j07R4
1559A8l7J3K3%k7QM4l4k0pPLK6l0j0l1N8LK2l0K3m9M4J2l9o7J04nK7J9k0n5k5
1592c2K1kK1Lj4m6N8kJ5kro0M3J8j4N6r0qM3kJ7q7J7K7%N7J0o3RL8J7q7O9l0K
$$ y = [28, 15, 13, -58, 21, 63, 72, -9, -18, -55, -53, 52, 75, 0, -45, -62, -41, 40, 88, 8, 17, -76, 0, 10, 28, -18, -45, -39, -11, 10, 38, 65, -69, -77, -65, -1, 75, 41, -10, -29, -29, 79, 76, 31, 53, -21, -8, 62, 49, 56, 5, -24, -24, 47, 37, -25, 11, -58, -32, -19, 47, 76, -21, 3, -11, 22, 20, 38, 25, -73, 25, -30, 40, 35, -22, -15, -43, -40, 43, -7, 13, -64, -31, -15, -23, -15, -21, -45, -53, 5, 50, 47, 23, -52, -39, -1, 101, 58, 24, -9, -11, 57, 42, -18, -10, -40, 6, 11, 13, 24, 20, -85, 17, -12, 51, 24, -49, 8, 4, -7, 61, 9, -53, -22, 11, -8, 43, 40, 24, 13, -49, 2, 28, 23, 3, -20, 9, 7, 142, -2, 20, 17, 9, 17, 64, -7, 9, 11, 6, 59, 68, -15, -46, -11, -31, 22, -12, 24, 21, -17, 17, 18, 47, -9, -44, -65, -60, 24, 48, -7, -38, -19, 23, 27, 33, 17, -14, 49, 11, -5, -14, 0, 27, -28, -8, 7, 29, -16, 12, 40, -34, 37, 39, 17, 1, -9, 31, -76, 18, -19, -6, 17, 17, -10, -2, 42, 8, -12, -19, -12, -9, 17, -13, -23, -54, 4, 7, 29, -1, 22, -27, 17, 29, -10, -77, 27, 22, 49, 68, 48, -7, -32, -11, -13, 8, 11, -3, -49, 9, 7, 22, 20, 11, -49, -6, 12, -2, 54, -36, -44, -1, -3, 14, -73, -56, -29, -29, 28, 38, -25, -16, 22, 39, -48, 21, -9, -7]
1627gJ0m2P4oo4L9J7K6jmp1nJ8j2K1L7l2K5p9Q1J8oPl6m8K6N3j9J5k3J8k8LL7
1661D2K6j02o3P3J8m8N7n3N3Jk7O5J2l6r1P6j7Q4m4Qj0n9J8K5N7q6K9K6j6m7O3
1692C4k4o1P2k2L4oj4n1J4K7K1L4n6L4k6j2J4K0m7nM2k7O2pn6L5k3k5O2m6kK4
1724A9j8N2Kk6k2k8KK4M7po1mJ9jj8O7l0j0J3Omk8M5j06M6NN0n1j0K1L9l3l4N7
1758B3j3j2K1k7J8Mj2J4Mj8QLjN0n8j8L5jjomRk5%J9m5KJ04o5K5m6nN3m5kj0j6
1795c8M4K2MK7n4p1K0J2O0l7K7O0j16K5jj4L9n5O8o6J1ON2m5oL1QJ8k5k2K3k0
1827a3L7K1j2m6j8M9l9L8j0Kk8k6MN7jJ3p4M1l4L1L0K6n3K3K3o0L6l7M5p5N1j5
1859a4K7n8M1K5j0k6L1K1m0LL9m3LJ2M4l1l2k6N1jol9Q5om5j1K0K5q2R4r7O2k1
$$ y = [-7, 3, -39, 35, 29, -35, 4, 21, 47, 46, 42, -29, -34, -16, -28, -7, 30, -2, 23, -56, 25, 43, 37, 44, 8, -40, -14, 39, 20, 35, 12, 30, 2, 5, 42, 68, -34, -97, -24, -6, -54, 3, -50, 3, 4, -23, 42, 54, 18, -73, 3, -14, 70, 26, 34, 24, -35, -17, 8, 65, -21, 8, 34, 18, -29, 34, 10, -51, 21, -1, 33, 27, 13, -38, -24, 3, 24, 58, 2, 36, 10, -2, 12, 32, -15, -20, 22, -5, 57, 50, -6, 29, 6, -19, 43, -3, -5, 19, 1, 53, 55, 29, 7, -21, -19, 5, 52, 45, -16, -20, -1, -2, -20, 47, 17, 7, 20, 26, 22, -6, 39, -67, -21, -16, 34, -17, -27, -6, 33, 0, -34, 23, 10, -2, 19, -8, 10, 14, 2, 16, 20, 2, 10, 13, 12, 62, 4, -14, 21, 20, 19, 13, 9, 18, -7, -7, 12, -33, -31, 73, 8, 33, -13, -18, 35, -10, -12, -22, -38, 6, 28, 32, 59, 5, -66, -46, -34, 26, -11, 16, 76, -40, -15, -16, -30, 9, -46, 22, -44, -33, -27, 25, -20, -26, 5, 13, 31, 6, -16, 7, -13, 24, 45, 33, -13, -31, 18, -21, 17, 7, 9, -19, -45, -41, 16, 15, 28, -46, -5, -39, -8, 22, 48, -5, 18, 41, -19, 17, -20, 25, -50, 1, -14, 13, -45, -4, 21, 11, -15, 16, 37, -3, 0, 39, -4, -1, 11, 55, 24, -8, -34, 17, 16, 10, -29, 56, 50, 5, -6, 14, 39, -43, 51, -46, 16, -5]
1892em6M5l1M1o1K8J3Ll9Q8k6j9mM5n5K4K1Ljl9M9J0k5j2Qj3nJ4%m5RJ8Rk0pj4
1928c9J9K7j9J0K0n5L3k3M5K0q9M7Knm6M8no8R6l7%L0O8j54M6O6k5NOj3j3K0N
1961B2pm3J6L7j0j0k7N2m8M8p4O6p0M7k6M8m1lO1l8k6M4jprJ0Jj9n6N9N6m3K2
1994C1n9L0ql9M2k2J9K9l4rJ3PM6p3J4N5n3K5K6p9M3K6L0n6n1O7o7L8K6l4mK6
2026Ej0l5N6K9k2k9l7nN9k9O2k7j7j9k9K9L7j2j5N0n5L7kK1j7r7K8K5M0Jk5J4
2058A1l5K4J6l2%J2P%L5l7qm8PQ9m3j6P2p0M5l4M5j8l4lK4l8N8K0p5N1o0P7k2
2091B0j7Rm1K2K7l8L3l4PL3l0mK9Nk9j2M8o7L9L5j1l0p3L0M4l5Q3l8m0j5Qk4M6
2124b0j1R2n6k0Lj9N0m7JM9Lk7Mk1N9n9J6Oj1%ml8RO5m1j9k1L2J2k7J4oM2p4P3
$$ y = [-5, -51, -6, -37, 4, -57, -29, -16, -13, -52, 36, 10, -9, -13, 32, -23, 1, 22, 25, 24, -15, 34, 44, 19, 7, 15, 2, -3, 11, 11, -34, -25, -7, 2, -18, -25, -39, -20, 7, -12, -2, 18, -37, -4, -27, 18, 38, -51, -4, -2, -7, -53, -5, -10, -78, 18, -19, -19, 11, 79, -75, -29, 37, 12, 17, 23, 10, -3, 17, 22, 15, -28, -12, 25, 15, 5, -22, 30, -18, 30, -44, 22, -48, -1, -27, 21, -20, -23, 38, 0, -26, 18, 17, 10, 1, 11, 12, -7, -63, -4, 52, 9, 31, -28, 2, -6, -45, -3, -25, -6, 23, -11, -20, -7, 0, 46, -27, -13, 42, -11, 14, 40, -39, 4, 30, 60, 4, -47, 20, -47, -9, 17, -17, -21, 5, -5, -40, 16, 45, 23, -6, -43, -48, 11, -18, 44, 17, 0, -19, -48, -19, 18, 6, -9, 41, -14, 23, 21, 42, 25, -72, -44, -19, 21, 22, -3, 11, -24, 0, 16, -16, -16, -4, 3, 3, 38, 1, -7, -55, -48, 41, -2, -18, 54, -16, 29, -5, 40, 22, -12, -15, 9, -29, 29, 49, -26, 25, -35, 42, 20, 3, 12, -29, -7, 20, -18, 15, -19, -12, 21, -9, -13, 16, 21, -8, -20, 28, -39, 0, 35, 24, -6, -79, -49, -5, -40, 43, 5, -35, -50, -42, -66, -20, -31, 61, 5, -15, -12, -31, 19, -28, -27, 22, 25, -2, 2, -19, 40, -19, -3, 3, -8, -8, -12, -50, -41, 24, -17, -36, -57, -25, -13, -40, -26, -32, 10, -64, 9]
2159Il0K2JJ4Ol7L2J2P2o9o4JN6m4K5M6k3o0K5J6k2K9m1K6oJ5J2k8JK0n6M9n0
2192d1k9P4J3mrK0l4Jl0RM0J9l1L7q8P1o2N9K9j10M5K6M7m8rm1O8l5Pk6L4N1l6
2225A7L4l2l5N4o6l7J1J2M5K4l8N8p1J4J1k8J7m1L8mrl1M3N4p0J8RM8m4m0L3K2
2257A6rn7M5LL6lo5J2K4Ol2J4P5m2o2J4m2L6O0j2k1N3p3k1Q4n3K0J0j8j2o9O9
2289a4J0k3N6j7Rk4L0k7L0rlm8J8J8L6n4Rk5lL1j7NK9K6o9%M0p4J04qn3o1N4O0
2323C6k3%l6J6m7L4JM0l5jjOj7J5K8Rml7J4PJ3JqRnl5M4Rj5K4p0l3N4n8O4l5k
2360c8mN8J9o1J5Ok1J5J2jjJ2j9k4L5L6k2J9n6J6j3K9j3N2l4k5qj0N0k2l1K7j7
2393a9J6K9K3p1mL3K9j2j1l9KP6l8k5l7Q0j7m9M0k0QJ7J6K6%p8J0L0Mm0j9M5p
$$ y = [9, -21, 1, 2, 16, 22, -15, 17, 29, 101, 32, -32, -31, 25, -19, 6, 52, 29, -31, -6, 10, -12, 17, -24, 2, -4, 11, 23, -5, -4, 16, -40, 9, -41, -70, 4, 17, 13, 4, 24, -10, -9, -39, -30, 10, 29, -2, 35, -53, 18, -44, 15, 44, -66, -21, 5, 52, 4, -5, -46, 22, -13, -6, -32, 2, 53, 17, 51, 19, -16, 38, -28, -65, -54, -42, 3, 27, -11, 47, -24, -10, 1, -27, -10, -51, -13, -17, -26, -57, -14, 40, -30, -12, -3, 45, 1, -39, -6, 16, 7, -50, -5, -2, 34, 31, -34, -22, 2, 8, -24, -10, 65, 23, -39, -25, -67, -31, 29, 17, -4, 49, -24, -45, 39, -14, 6, 16, -2, -14, -83, -14, -4, -27, 29, 12, 21, -3, 27, 0, 30, 21, 18, -30, -12, 6, 42, -12, -3, -28, -31, 0, -17, -12, 17, 43, -26, -26, 14, -60, 44, 36, -17, -78, -24, 36, 13, 13, -23, -7, -54, -20, -19, 21, -14, -15, -16, -10, -27, -12, 16, 25, 21, -16, -2, 5, 18, 19, 11, 20, 15, -20, 24, 33, 18, 42, -28, -61, -7, -65, -1, -36, -38, -42, 16, 35, -26, -11, -5, -26, -11, 1, 0, -1, 11, -8, -32, 3, 39, 17, 36, -20, -4, -17, 12, -1, 51, 17, -8, -16, -26, 24, 2, -29, -2, -19, -3, 26, 49, -22, -26, 7, 36, 24, 13, -26, -24, 52, 14, -11, -48, 32, 15, -34, 6, -14, -6, 11, 27, 53, 53, -25, -15, 15, 19, -21, -40, 5, -2]
2426bJ0jJ9j5K2l2mj2Mo1J8J02j9m0N9ro2L4m0O7l2KM2q1J2J8j4O1n5NK1l5J0
2459hMm5J6M9j5M3l5J1j4l6L6J0M5j15Q8r4P6N1lo4QM3o3L1m1j7P8K0k7n7PO2
2491D4o5j0M6M6q0J4J6n9M8j4J0m8M8KM1J0l8J2m6P2l2Lq4N0K0L2j6k0pj6k9L2
2523a8J3J4l8l0N6J9k3mJ5k3O9j1q2M6qN1k7j2j2k4K7k0O4p1K7J6rJ1j8j8N6n3
2555a7OK3j5LrM6J2k1m0j2K6K3qn8J7lJ3j8K2J0Qk2j7K7M2m1RPk6K2J5l9N1qj2
2590A6Mk2N1o5J3ML6m2k5O3l6j2M6n9J3JJ2KM2k2m2M2m5K9%j6J7J6ql0k2K5m8
2623f2M6J3k5K7j0K1l5J6k2%P0n4LkM7K8p6L1j3nk8K1K4J0j4j9L1j8j9L5k3J9
2655A7rk1J9K5k7j3k0L7m0J1L4l1K6j1k2L4mK9l5p5J14o3N4K9l4l9k7R6q5kM3
$$ y = [-2, 8, 7, 26, 11, 33, 1, -3, -15, -11, -72, -54, 48, 29, -11, 48, 39, -23, 11, -29, 38, 6, 8, 50, -31, -19, -1, -15, 46, -9, -4, 17, -18, -8, -4, -49, -33, 16, 1, 44, 9, 20, 6, -30, 6, 16, 61, -54, 34, -60, 16, 67, 64, 0, 8, 51, -12, 19, -22, -39, 39, 59, 32, -25, -18, 44, -21, -31, 15, 61, -19, -5, 11, -48, 0, -14, -4, -52, -4, -2, 39, 49, 11, 23, -23, 49, 17, 20, -64, -14, 6, 38, 22, 2, -5, -21, -50, -18, -5, 9, -29, -59, -3, 16, -7, -11, 4, -19, 50, 39, -43, 3, -5, 46, 19, 7, -5, -29, -2, -22, 42, -29, -2, 14, 5, 16, -2, -20, 36, -17, -11, 12, -3, 0, -9, 37, 49, 28, -12, -24, 2, 25, 17, -41, -24, -27, -14, -32, -10, 0, 8, -14, -31, -4, 38, -3, 6, 13, -13, 9, 24, -15, 36, 28, 16, 20, -2, 49, -16, -3, 1, 37, -5, -30, 33, -3, -15, 31, -28, -15, -14, -2, 0, 42, 20, -22, 20, -25, 4, 4, -12, 5, 21, 13, -17, -39, -14, -62, -16, -3, -28, -1, -11, 10, -25, -9, -31, -31, 39, -15, -12, -14, 33, 61, -15, 16, 3, -2, -30, -9, 15, 25, 11, -8, 23, 5, -14, 21, -2, 17, 8, -13, 6, 31, 4, -9, -29, 8, -32, -21, 13, -18, 8, -3, -25, 9, 5, 34, -1, -76, 38, -25, 29, 58, 24, -15, -42, 54, -31, -33, 10]
2686A0J7m8K3J6J5k4k5J3jK5J1j4l5MK6m3Jj8Q0m1J5k0N4p8M6JJ5j0mj7P4m6l4
2719a2l0N2m5N3J5o2M3n0oM2J1k4J2kRkk2L1K7j01J12m4rQJ0j4ok4M8m7M4Ok3
2752@K8Ll8K1j3n2K9L0K1nn2NK8j3K9J8m1k9L6mL2m6j1O1Rk5k0K8o6M0%lL7j02
2786f5K7L3j4K9LQnk7J6K6q3L0J4M5l7rnL8Ol9l4J08j01K4K9N3p4k6M8j2j1L7
2818C2j0k5L2k0J3j1Kl8L5l2N1Mp2N6om3N2J0l2k5K5Jj5L4k7L1j8j1J6Rm9J2L0
2851A1k1L4l4l0K7J0j5P2l5j6rNJ1p1Q4m8O1J0k2m2L2K1k6Ll0RJ0k4N0j3m6K2
2883a0L8o0lO6l8J5qk4J3%L0m9N0p1O5J4l1k3N1j4j0k1K5J1p7M7L7o6J5l0R3k1
2915A4m0j8R8p9QL7m5nPQL4p1N4K1m9NJ8j0mL8m7L0rOpk2M4n4Q0p2K6m7L1J1j3
$$ y = [10, 27, -21, 2, 18, 33, 9, -16, -3, -4, 21, 32, 18, -17, -13, 13, -30, -29, -47, 33, -8, 7, -13, 41, -37, 9, 10, 25, 15, 11, -6, 68, 22, -12, -42, 10, -35, 18, 33, -29, 14, -36, -42, 0, 11, -13, -1, -3, 6, 4, -18, 13, 40, -61, 51, 7, -2, 6, 16, 2, -4, -28, 20, -27, 17, 23, 0, 28, 31, -7, 14, 1, -51, -22, 8, 29, 24, -28, -23, 5, -8, 21, 39, -2, -31, 5, 1, 33, -13, -24, 37, 46, 21, 1, 29, -37, 3, 3, 0, 37, -65, -38, -5, -19, 10, 13, 21, 16, -11, 5, 31, -52, -22, -8, 37, 0, -9, -14, 24, 30, -9, -43, 65, -36, -12, 17, 70, -4, -30, 18, 6, -5, 32, 22, -3, 29, 9, 22, 11, 13, -25, 10, -22, 29, 33, -39, 17, 11, -32, 20, 30, -2, -27, -2, -1, -16, 18, -9, 22, 4, -7, 9, 18, -31, -19, 11, -10, 24, -10, -40, -13, -3, -18, 54, 19, 3, -6, -1, 10, -61, 23, -25, 36, 46, 24, -18, 14, 35, 9, 12, -18, -9, 1, -23, 27, 14, -32, -10, 28, -32, -35, 31, -7, 8, 0, -24, -11, -11, 19, -30, 20, -51, 14, 28, -3, -26, 25, 11, 1, -20, 5, 16, -61, -14, 23, -43, -28, -58, 35, 14, -26, -44, 54, -25, -17, 20, -25, -30, -23, -15, 19, -52, 2, 23, -26, -21, -3, -13, -17, 21, -26, 4, -5, 1, -6, -28, 16, -38, 42, -30, -4, -51, -20, -9, -22]
2950b2oJ8N7j9n8klnO6m3j4K8K8j0k8K3Okm5J1m6Q0J2J3l4j6l5M8J6nJ6l4j9j2
2984c6N9Ml2k6nP1kn3Q1p3K1k9L8J3o5K6j4J7j3j0L7m6%j4N4L1Mol4K9Kk1j4k5
3018c1N9n3NO3o6k8Q7k6Rk1K1q1R8n8KoK0qK0k4QKJ2j9k4K2kj1K5K0q7Q4p3P9
3052A8k5K8l0M2m4J8o5K0O4k5j3R8q0j1L4o3O3j4J3j2j6j1O2k7j3mmk8k4K4KQ
3084a5L0M5o3k8R8j05K5K0mp3J01r8RJ08k5j8Pk1m3J6M6J1l8j5jj4R0o3K3k5L2
3115A2m7Rk5O7J4n9O8l3%j7Kj1O8L0o7j7K2n0L8M1jj7J6p3M2l1Q7n3m7PJ0J4J
3148@m7L2L7l4K6pJ6j4j5j0J1l1N0n1L8Jj3j1K8KK8r9N1QK2l5l6N1K9l8j7P1k8
3181A5j4jj1mM8m1K9o6L3K0K2m5Jl0Q8n9N1j1j1Jo3L5J6l3qk2N0L4Nk8nm3J9R
$$ y = [-22, -28, -10, 47, 28, -30, -32, -35, -40, 26, -17, -31, -3, 25, 15, -13, 10, 16, 14, -31, -20, -66, 14, 26, 39, 5, -11, -46, 2, 18, 13, 29, -5, -24, -36, 23, 27, -5, -31, -36, 35, 33, -20, 61, -12, 9, -20, 18, 31, -34, -8, -22, -5, -18, -28, 9, -37, -37, -51, 3, 34, 38, 32, -2, 27, 29, 8, -6, -31, 28, -25, -20, 43, -23, -51, 36, 10, 19, -2, 19, -62, 36, -22, -20, -26, -6, -14, 6, -18, -10, -8, 4, -15, -39, -17, -19, -30, -5, 15, -72, 12, -61, 18, -7, 21, -9, 33, -11, 7, -58, -38, 26, 1, -12, 86, 6, -5, 29, -34, 29, 15, 28, 16, 0, -11, 51, 24, 11, 7, 3, -25, -49, -25, -23, -15, 15, 60, -3, -31, 67, -38, -13, 7, 3, -70, 31, -67, -58, 50, 25, 7, 14, -7, -50, -34, 12, 23, -15, -30, -31, -45, 45, -18, 5, -20, 12, -35, -26, -51, 16, 30, -29, 39, 6, 6, -11, -9, -20, 48, 78, 11, -6, 16, -34, 4, 45, 44, 27, 43, -30, 12, -19, 68, 15, -32, -25, -15, -1, 0, -47, -15, 22, -12, 14, 7, 23, 9, -6, -16, -5, -36, 14, -37, 1, 2, -11, -22, 6, 8, 36, -63, -12, -4, 18, -17, -53, -2, 27, -11, -28, 43, 15, 1, 0, -11, -15, 33, -8, 21, -45, -12, 8, 30, -15, -14, -44, 44, -15, 36, 25, 14, 15, -48, -13, 3, -30, -38, -60, -10, 24, 29, 1, -4, -47, -28, -19]
3215a9K1m6K2M2p2M3K6On5J01k7m3l3Q7n3j8mN0l3J6Qn2Q5k6k8j9kj7P7m5pN2
3247C7o0O5n0QJ7L2l7k4qkL6l6M1j8n2jKO7n4O1l0J2K8oK8j0o9M7m9M3l8K0Qk5
3281a7L3m3m8N3kJ2j7j9L4K4K5o7M1l5j6K7J09o7n1KP5m3k7K5k2j3M0J2Pj5o2
3312d5L5j7N7r0JR1n6M8n2L8Oj0j8J6m4K2K1M4m4l0L4Kk9K6j3J3k5LM2k3l3L3
3344CnKJ9K4j4m0j0N8rm2N0p4NL7N6o5j4M5m4%l9N7L7k4p3M9kK2jj2J6J9m3L3
3378B1K0j0l5OL0p9j6J11j10O8Ko1N6l6P9j8n8PrN3j2l9L8J5Lm3m9M0K6J0mj4
3410hn1Q5j1pl0P7o7j0K2J1k4M9p2J0Q6n5OLll0PP8p4n4P7Rj5j4O4l5k4PJ4j5
3444Fj7nK9m3k7K5M9l5m5N3M1o6P3j2k1rm5j2M0N9n8j4P2k3o3O3M0o8K7J2m8m
$$ y = [-19, 2, -44, -22, 20, -52, -9, 17, 23, -32, 69, 42, -1, -34, 53, 0, -18, -22, 28, -5, 11, 19, -33, 52, 26, -2, -21, -23, -40, 37, -8, -15, 37, -23, 42, -8, 0, 17, 49, 12, -12, -20, -22, 14, -22, 19, 1, -51, -52, -50, 17, -37, 24, -6, 6, 34, 28, 56, 46, -23, 24, -25, 18, -20, 0, 8, -17, 16, -27, -75, -22, -24, -12, -29, -48, -14, 10, 35, -32, 9, -26, -42, -15, 94, 27, -24, -22, 53, 10, -17, 8, -14, -27, 13, 25, 32, 17, -45, -10, -27, 30, -60, -59, 32, -24, 24, -28, 10, 16, 6, -12, 4, -40, -18, 3, 47, 3, -27, 7, 9, -20, 6, -7, 6, -19, -16, 26, 3, -30, 3, -2, 0, 19, 43, 29, -11, -21, 37, 28, -14, 36, -38, -33, 4, 60, -5, -19, 26, -18, -18, -57, 0, 37, 13, -60, -11, -13, 9, 8, -4, 12, 31, -12, 21, 41, 31, -4, 2, 32, -47, -63, 48, -62, 6, 8, -53, 3, -33, 46, 28, -30, -23, -32, 21, 9, -30, 8, 23, 26, -17, -66, -26, 0, 10, 6, -8, -59, 26, 15, 8, -22, 55, -12, -22, 0, 11, -13, 36, -36, -26, 60, 5, 11, 14, 11, -19, -12, 66, -8, -62, 15, 24, 9, -5, 59, 24, 0, 7, 21, 6, -11, -16, 13, -30, -57, -32, 17, -18, -63, -10, 31, -35, 38, 26, 5, -4, -49, -61, -21, 38, -20, -34, 38, 15, -48, 15, 55, -13, 14, 26, -22, -26]
3476b6J9K3RK1n2M1K7n8k4L7l9lK8kj4m8Q1K9%o1K2K0m0K3k8j9KL1Rk4oJ4j2K2
3510BJ6r3P6J7nJ7k1L1p2mO4k7K2m9O4p2nj6N7ml0O5l2J0o5Q1m3M7lm9J6j4j0
3543b9J7k9N7l0L1op7M0M2L3n1Rk3L7rj3j6j7N2m3LJ5J4j9O1o2m5N8L2mm8N2l
3576B9n6K2j0l%K0mj3Jk0J4P2m9k9K0K5l6k7O4l9J6qJL7j7J0lpJj5N5o1jNKJ7
3612A3j8rJ7m3MO8nk5k1K3J4qm9O1mm7L9k4QJ2j0j3%k8O9j0k6K3m0J2MJ9J1l9
3646b2j6L8l7J0J5MJ3L4o7N8n8RM4k1J0PK2k0k3n9jJ2P0n3P0k6RN0o1K7q4l9J40
3679E5l9k7K7rj7kO1m8kln0R2o9N5m4rL9l7L2l2PK1j7K2Lmk6L8k9nM6m1k1M4o
3714EK6m3mJ1nqK9oJ3k4QNK1j8lN3r5J8RJ0kJ7L8k7J1l9rK6n1M3m2J1J0j2Jm4
$$ y = [-26, -7, 16, 25, 46, -6, 35, 62, 4, -20, 17, -22, -25, 3, 1, -13, -61, 20, 49, 49, -12, 10, 30, -10, 13, -15, -34, -32, -1, 8, -16, -22, -8, -20, 2, 18, -75, 1, 18, 13, 30, 9, 40, -32, -36, 28, 1, 23, -26, 38, -34, -39, -55, 2, -2, -32, 33, 1, 11, -54, 27, -16, 31, 28, -21, -5, -19, -29, -12, -41, 16, -14, 17, 11, -66, -26, 16, 49, -2, 7, -16, 21, 12, -1, -17, -34, 18, -25, -22, -7, 7, -12, 49, -13, -58, 0, 32, 28, -20, 32, 29, -27, -5, -15, -18, -18, 2, -2, -15, -14, -34, -20, 52, 3, -26, -6, 19, -17, -44, 20, -19, -3, -11, -10, 27, 10, 20, 17, 10, 11, -4, 51, -10, -11, -6, -4, 13, -5, -14, 3, -40, -36, 32, 27, 2, -19, 4, 18, 10, -39, 22, 18, -29, 10, -14, -6, 6, -4, -17, -17, -45, 24, 14, -12, 11, -29, -17, -13, 6, 17, -22, -38, 0, -37, -27, -12, -8, 5, 39, -28, 30, -28, -19, 25, 4, 14, 21, 43, 23, 0, -59, -60, -48, 22, -31, 39, 13, 22, 72, 11, 38, -46, -85, 55, 16, -11, 16, 7, -10, -12, 49, 1, -1, -4, -54, 38, -31, 24, -20, -29, 10, -27, 5, -27, -20, 1, -16, 6, 9, 5, -21, 17, -12, -17, 29, -12, -33, 11, 5, 31, -12, -16, -5, -10, -18, 11, 5, 18, -6, 2, 7, 28, 10, 7, 60, -35, -17, -8, 2, 0, 17, 55, 28, 39, 0, -9, 17, -34, 9, -33, -22, -12, -24, -23, -67]
3750f7Q2j0m1O1L3p6L2l7Kk7J0Q3nk1Qnj9j9J2ML5rom1MLL7m0M0J5o7O8n1P5n9
3785Do8Q4k2l1K0N8k2Mj1k7O6n7M1j3j1j3K5o1M7Mj5J9l3J9pJ4k4L0K3k4Lrl2
3818a9K3l3P5j0Jl3N2o8KL1m2O5l8L6k0M0o7M5k1Oj6l1K0qJ2J6k1J2j1ML0o3N3
3851B2l2K3Pl2lok4L3N1ql4O2k1n7l6N1k0P4l9m9P1j2j8n2M4j3J8K8r1N7M1n5
3883b0L6l6M9j0p8N3kJ4mN3l7k5k6OJ9J4L7l5j1K0j3K0j5J9m5K0K5L0pjo2j6N2
3916B4m6k0k1K3J46j40L5J4jo4L9L9l6J6l0P2m2RqkJ4n2O9j13Q9M1k9m9M9k7r
3947a0K7J3q7R5q5O2M2l0l7J2J3RJ7m1kl4M8PJ6J5o0pj8nK2j1L5Nj2K0K0m1l5
3980c7K0jM1j1rM4pp9O4L1q5qJ3K2K9l3J6k6M3l7l0LJ2N0o8J4N8j8k9J3L8o4K2
$$ y = [-67, 15, 5, -36, 25, 58, -18, 14, -23, -21, -48, -38, 45, 40, 19, 27, 22, 3, -16, -4, 0, 35, 26, 20, -21, -17, -14, 23, -17, 23, 38, -29, 39, -12, 63, 4, -64, 20, -2, -33, -13, 45, 23, 27, 16, -11, 55, -2, 39, 26, 15, 2, 27, -34, 13, 17, 2, 21, -12, 7, 0, 14, -10, 20, 43, 19, 22, 13, -19, 4, -29, 46, 36, 37, 4, 56, -12, -10, 21, -21, 44, 6, 42, 22, 62, -5, 40, 19, 25, 9, -22, -2, -10, 2, 18, -3, 9, -2, 2, 32, -31, 22, -10, 13, 20, -12, -15, -21, -45, -12, 39, 31, -3, 59, 38, -19, -55, -4, -24, 50, 11, -38, 33, 21, 3, -49, -5, -18, 0, 28, -63, -6, 35, -20, 16, -20, 29, 19, -59, -6, -8, 6, 2, 55, 18, -7, -33, -27, -8, 6, 43, 8, -3, 17, 4, 24, 9, 28, -17, 3, 28, 58, 51, 50, -12, -28, 24, -22, -42, -63, -40, 106, -34, 1, 15, 14, -50, -11, 28, -8, 8, -22, 50, 8, 17, 9, 7, 21, -31, 38, -75, 14, 55, 26, -23, 26, -1, -10, 17, 30, -57, 38, -47, 15, 57, 27, -10, 2, 15, 24, 41, 0, -2, -36, 12, 19, 35, 50, -10, -17, -35, -40, -18, -29, 6, 11, -1, 19, 39, -2, -37, -17, -18, 23, 12, 3, 47, 40, -39, 25, 56, -29, -37, -24, -2, 27, -6, 10, -16, 27, -10, -40, -37, -25, 25, -43, -29, 29, 11, -18, -5, 33, -31, -9]
4013ij9Q6k6J2p1J1J5NkJ8J0l5jO0l0m3J3j5M3J4k5lj0%J2jmk0L9o4K0kJ7K5k8
4048hm3M6j8l6K5KJ3%k0j6N5j1l0J2K3J1mL0k4Pnk9m3N1j4O1m8rL0mJ8K8j9m5
4082a4k0M7JN1o9m6P7m0J0k3M3j2k3K7n2Q9l3lJ7n2L8p2P8J4%l0Jk4L7k0k8N0
4114A9nl1M2K2m4K2n5N1l8k3N6M0p7k1Q2l8L6n1j3l4R0n1L6j4k0N5l6Q6q4q3J8
4145f3N3k8rK7L2o5O4J6k8k6K7j6PRK5pK0j7l2K6j4J3mlK4o4L3j9j4O8k3j8l5
4178d1P1ol1M8o3nM1j6K8K9o5O8n6j2k0QK6ON8n7k1njK8K7k5j1jj4j6M5l1N1o2
4212b5M0k7Pm6P0o1mJ7%J9M1m1jK2M5m2K3n3lJ8K8n2K2Rl7K1M8J0m1k7L0Qj5r
4246fL2k9j3M9q6O1j2K1J5k9L4kn4K4l8J9rmJ6J1%RJ1p8L4MM1q0L2J4K4m5RM3
$$ y = [-9, -28, 58, 32, 44, -27, -16, -1, 4, 2, 20, 30, -5, -6, 54, 24, -19, -6, -21, 22, 36, 11, 8, -2, -2, 10, 9, 5, -15, 24, -40, -20, -22, -5, 20, -8, -51, -5, -23, -59, -34, -32, -19, -19, -39, -55, 0, -11, -41, -29, -6, 5, 1, 31, 7, 14, 9, -20, -63, -12, -26, 35, -13, -22, 8, 4, 22, 50, 31, -14, -34, 13, 14, 65, -4, -50, 27, -13, -3, -26, 17, 5, -18, 9, -43, 46, 13, 10, 27, -25, 13, -59, 19, 33, 33, 3, 4, -20, 17, -3, -31, 19, 14, -17, 25, 47, 3, 25, -30, 21, -17, -40, 16, 56, -21, -42, 40, 2, 38, -13, -26, -60, 30, -21, 15, 1, -19, 36, 0, 86, 2, -81, -63, -10, -38, -47, -20, 12, -53, 11, 27, -1, -27, 0, -16, -9, 0, 25, 18, 38, 21, -11, 15, 1, 14, 10, 7, 31, -33, 0, -19, -33, 35, 12, -6, -41, 30, 24, -7, 41, -22, -27, 14, -2, 26, 55, -10, 58, 2, -10, -30, -22, 4, 10, 68, 11, -10, -15, -16, 12, 39, 14, 3, 2, -12, -28, 17, -14, 37, -25, 15, -12, -5, -51, 19, -42, -46, -29, -29, -10, 31, -10, -11, 11, 56, 14, 37, -16, -19, -1, 27, -25, -3, 6, -31, -10, 38, 48, 7, -20, 10, 18, 3, -6, 26, -3, -16, 33, -53, 8, -4, 17, 32, 3, 37, 35, -19, 5, -33, -14, -23, -27, -11, 0, 0, 9, 20, -58, -24, -20, 21, -59, -27, -13, 11, -34, -25, 18]
4280A8o2N8l4M2l3k1Q6n1pk0L6m0M2k8N3rn3L8rm3nJ6L3Nl2JJ0KQm2J0kL7mM2
4315D2j8n5N1oJ2k2j3K0mp8P1k7L1mj1rkL7j8L5l4j4K6L8m7J1Lj0oJ2J8m1J1j
4349bj2O4j36Q9n8P3l4K6Pk9J6nK7k4K1k5Rn8L4K6K2n6O2o5L7l9M6qJ3Qkp3K8
4382a8M1m2K3J1po5P9j8l7L9m4L6%qmN5p6OJ2J7K7oRj3Oj8m1NM4k3N2l3K3k6j2
4417fLpK6L6k0K9p3Nj0rL5m4nL0n4N5L1K3o7L4l3l9R2k7k8pj7%Q1m2k0N5k0j3
4451fL3lj4m0lO7m3L2pJ7nq5N3k4J9LN0n0mn3O1Q7j37M5j9J4J2lj2K4j3k7P9n8
4485a0On6M1l8N9j8K5n7O6k2K8l1l6K0l6Q8m6K4J1j9kn2L3K1j5pKJ2J6j6m7N6
4517@J9k2k1L3%j3OJ8n5K2L5Oq7M4j4K4k9MN5k1L2o0N2o3M6pnj3%RJ8J0r5P7m4
$$ y = [18, -44, 14, -20, 22, -11, -32, 54, 3, -4, -24, 12, -28, 14, -14, 39, 30, -23, 15, 6, -37, -42, -26, 7, 12, -20, -19, -9, -7, 1, -41, -31, -33, 4, 0, 42, 24, -31, 20, 14, 26, 4, -9, 11, 7, -71, 0, -27, 4, 0, -11, -20, -22, 15, -3, 32, -2, -16, 10, 48, 1, 12, 15, 5, -1, 11, 29, -12, -1, -2, -14, 50, -86, 3, -55, 18, -16, 10, 17, -12, 4, -1, 26, 2, 23, -2, 7, -51, -17, 9, 31, -25, 37, -28, 9, -30, 16, 8, 21, 29, 27, -46, -18, 23, -19, 4, 15, 8, -57, 22, 4, -33, 6, -38, -2, -2, -10, -14, 41, -35, -29, -17, 0, 27, 21, 30, 17, 23, 5, -36, -31, 13, -10, 42, 9, 32, 6, -6, -3, -10, 16, 52, 32, 61, -12, -7, -17, -26, 9, -35, -40, -10, -64, -9, 22, 45, -22, 12, -21, -60, 32, 5, -23, -30, -47, -47, 34, -8, -28, 27, 7, -6, 27, 24, 10, -30, -33, 34, -9, 23, 16, 33, 28, -57, -4, -28, -9, -6, 44, -6, -10, -63, -2, 85, -52, -7, -26, -12, 0, -3, -15, 9, -4, -31, 48, -10, -4, -60, -19, -57, 2, -16, 9, -48, 18, -4, 24, -7, -43, -23, -59, 29, -17, 7, 18, -1, -3, -55, -22, -1, -16, -23, -21, -9, 7, -9, -56, 0, 19, -3, -24, 9, 9, -4, 2, 20, -35, -13, 22, 28, -59, -15, -29, -5, -34, -30, 25, 4, 36, -24, 28, -35, 11, 4, -1, -14, -14, -5, 13, 23, -72, 5, -39]
4552c9J6PRk0K3L5j1QJ5o3onP0n2nKK9k1%Jl7P0o5M3l1O0Lj9p1O6M3q6L1j8K5
4587Gm3K3J5j8R7o6m9M8jk2L0l1J9o3P7o6K6j9PL3K8l1Qm2PM9l1l6M8n1Q3l3m
4620akl2O8on2Mk5O1k9qM1m0%N0Kk9J4k7K2n6K5L7n0K2K4n7O5k7L2k2r7R4%L3
4654C4l4L6m2L2Pq1N5M9k4n2kJ7J2k4j2K2J1m7R4n6n4K1l7O6rL3k7J2j8K3o7P0
4686HJJ1l8JL3No4R2o3n3Q1j3nJL9n9J9PK2k2lj%m7P9Qn7j6K0pL3Kk4J3j3J1J7
4723A8k9No6Q5M7l4m1J1Ok5nO1o7jk8N9J1J5Oj9j2j1P7k0m9j2K2J8m1ml0J06p1
4756a8L2lk4N7o3L2k7pL2kJ0K6m1k0LRk7K5L7k7K3n9P4m8O8r4K6K8Mk3O3n7Op
4790Hl7L6j9%lP0j3k2M0n2K%M3j08O5J4m9Q1k8m1mnK4N3j6o7k5j5M2OK6j4Pl7
$$ y = [-39, -23, -16, -7, -27, -4, 31, 20, 28, 43, -20, -26, -31, 39, -13, -18, -16, 13, -8, -8, -7, -44, 26, -39, 4, -27, 33, 36, 17, -54, 12, 55, -31, 0, -18, 7, -36, -13, 2, -16, 81, 15, -34, 14, 13, -9, 21, -10, 9, -54, 23, -43, -17, -36, -29, 4, 32, 1, 9, -33, -26, 23, -8, -44, 4, -47, 36, 3, -1, -3, -35, 33, 27, -25, -21, -46, 15, -14, -22, 19, -21, -21, 29, 31, 2, 16, -11, 11, -45, -20, 17, -33, -11, 13, -44, 21, -6, 26, 4, -93, 1, 1, 34, 0, 36, -6, 26, 33, -48, 7, 56, 32, -20, -22, -5, 7, -17, -29, -7, 4, -43, 51, -5, -59, -38, -75, -9, -18, 15, -12, 0, -18, 5, -62, 8, 9, 20, -18, -17, 16, 21, -43, 49, -14, -67, 14, 1, -4, -3, 36, -23, -4, 3, 25, 3, 0, -1, -1, -48, 31, 39, -18, -34, -14, -21, 12, 14, -10, 3, -10, 1, 18, -11, -6, -72, 13, 60, 26, -15, -4, 2, -23, -28, 33, -34, -35, -63, -4, 7, 22, 28, 9, -3, -14, 63, 43, -6, -18, 4, 22, -19, -23, -53, 53, -18, 14, 11, -13, 44, -19, 13, -14, -21, 11, 9, 19, 45, 4, -16, -13, -4, -31, -6, 31, 4, 27, -32, 42, -6, 62, -32, -6, 22, 26, 3, 66, 9, 15, 8, -29, 7, -12, -12, -15, 55, 42, 20, 60, 8, 10, 10, 53, -55, 10, 24, -25, 56, 28, -13, -17, -22, 2, 55, 39, -28, -53, -68, -26, -20, 6, -8, -1, -38]
4824c8K8N4m7mJ0pL2l4L9p1M1l9L0j5PM0j7N0pq1M9Qm7J6j1j8L2l6O1j9ok5K%
4858b3L4o4N2m1N7j0RJ5m1P0n1L1n1MM3m9k9J8LM4n3O0l5nM1J2o3NJ9O1j07NJ6
4891b3K0qj2J09m1p4J5N7p0O2k3mj6K4j5l1P7j3k0L0m8pJ1j2L9o2L4Kj5k9J3K5
4923eO0l7l6J2omJ7m2M1Ol3jM0prKPK6L0o9kL6j7J3n5K5M9np7J4k0N7J5nPk3L
4960Gk0OK8n1Rl4Q9m2mM1k4j0O0j01R2L1n9k2L4n0J2j6K2K8p2N4J4o5N7j3J8o6
4992d7O5k8RQLJ0j1jKlMp5%O5k1k6LM4K1r0J29l4l4M8m3J9k7M3n1K4l9KN2m1K0
5027@l3O8om8j3N5M1j14P2kl3P5p4K6kPk0JL2j3m0M1L0n0m7L5k1M4M0j00Q2j7
5059A6m7OK5Rj1k6M2l3J0Nj8k0mNM7l0J4J2K2Ln2K4L7l3L1l3k3J4Qj9L0k8L7J1
$$ y = [-38, -10, 44, -3, -7, 3, -4, 28, -6, 33, -38, 3, -36, -6, -21, -14, 26, 9, 59, 52, -29, 20, 28, -19, -3, -14, -32, 0, -36, 25, 6, 0, -25, -23, -23, 11, -53, -1, -42, 15, 5, 14, 29, -12, 58, 7, 38, -13, -9, 34, -15, -44, -26, -23, 21, -32, 28, -7, -12, 29, 41, -22, -17, 2, 63, -44, -39, -23, -3, -11, -23, 86, 45, -29, -14, 43, -27, 35, 12, 8, -8, 16, 1, -30, 47, 34, 14, 44, -4, -11, 0, -12, 27, -35, -1, 1, -14, -43, -30, -5, 55, 18, -18, -6, -12, -16, 1, -41, 0, 6, -27, -28, 12, 5, -4, -2, 5, 31, 61, -8, -10, 26, 9, 22, -33, -8, 41, 36, -41, -27, -47, 10, 25, 20, 27, 4, 7, -13, -7, 21, -30, -21, -55, 34, -8, -12, 29, 5, -5, 55, -46, 46, 77, 18, -4, 30, -20, -8, -24, -2, 26, -46, 8, 22, -43, 14, 1, 19, -47, 18, -10, -1, 7, 10, 20, 9, 8, 10, 7, 11, -64, -64, 1, -20, -46, -43, 1, 22, -68, 61, 27, -7, 41, -2, 17, -10, 33, -18, 6, -33, -31, 21, -20, 0, -33, 35, 29, -19, -32, 23, 64, -50, 22, 20, -13, 62, -12, 14, 12, 19, -1, 0, 32, 19, -21, 20, 50, 0, -47, -12, -33, 11, 51, -49, 33, 16, -31, -25, 0, 9, -2, -28, 14, -19, -9, -4, -22, -42, -46, -41, 6, -24, -10, 2, 24, 27, -25, -1, 36, 3, 34, 1, -22, -8, 0, -19, 11, -17, 20, 31]
5093C1p2N1rQPj6j4kK4J6o1RL0j4j4JL4j9n3M1qj0J06p5L9j9j1K1n8K9m8P0k1
5126gPM0l9Mlo6K0K3O8p4M6m4L4j7J4rj5j9L6j1K5K5k0nQK5n4%jq1R7l2Lk4L8
5161hj0oJ18j31M9J5K6q2M1K7o7oK9L6kn9O6n2Mk3J2K9k7M5j3j6rj0j2N8J5q3
5193d6K1lKk1K2O8j25M0N5l1L1k2k1MJ9qM2j5o6M8rJ7O0o7k9N7k1n3R1p1L8k8
5225b1LPK9k5OJ5Pm2N2N3j22M7k3k6K4J7Rk8K6J2j8j7R2n5k3l4L7PO3n4j6J1%
5258A3j9j7O2mmK3p1QJ7m2O1l6j5K9L3n7MM2Kk4jk0NM1m7PK5lL6p9RO2n5n2L7
5293c0jJ7J6o2K6L2L4l5rJ5k3M2K1l2oj5j2mN7p4LO8rl0K6Pk0l9K1K9k8m3N3j6
5327b1K8M7J9o8n0K1MM1l6lM6l3j1K9m0J2mk1Q2k6k0k0OP1n0RoK5k2%n0P9l2O3
$$ y = [31, -41, 10, 1, 9, 16, 0, -14, -16, 8, 24, -37, -28, 2, -12, -26, -25, 9, -10, -63, -22, -30, -40, 66, -9, 30, 11, 0, 21, -37, -8, -56, 14, -7, 0, 40, 1, 5, 2, -64, -44, -21, 47, -27, 19, -25, 9, -8, 6, -3, -18, -37, -1, -12, 13, 38, 18, 13, 21, 46, -8, -8, -9, -90, 7, -25, -22, -46, -8, -18, -24, 94, -37, 12, 27, 53, -29, 12, 39, -28, -34, -5, 31, 29, -30, 36, -16, -12, -35, -23, 6, -21, 24, 11, -5, -14, -24, -36, 22, 37, -46, -25, -28, -26, -47, -25, 43, -82, -42, 13, -18, 13, -9, -30, -26, -7, -15, 27, 12, -54, -6, -15, 2, 62, -5, -34, 23, 2, -51, 40, -31, 7, -21, -18, -11, 18, -7, -1, 14, 21, -21, 31, 84, -38, 9, -14, -40, -16, 1, 10, -18, 8, 20, 2, -15, 77, 22, -1, -35, 2, 9, 72, 18, 2, 13, 13, -6, -23, 39, 35, 31, 54, -17, -9, 8, -34, 27, -9, -24, 5, 38, -19, -15, 27, 29, 5, 4, -16, -11, 30, -17, -10, 15, 12, 48, -31, -22, 40, -15, -67, -30, -31, -14, 2, -60, -34, -2, 32, -3, -12, 3, -20, 22, 43, 11, 5, -10, -22, -26, 31, -43, -40, 28, 19, -11, 15, 22, 2, -37, -16, 13, -15, -58, -5, -21, 7, 54, 73, 5, -45, -24, -20, 21, -15, -18, 28, -5, -16, 13, -27, -15, -19, -40, 42, 16, -4, -24, -18, 53, 3, 12, 6, 31, 9, 9, -41, 38, 6, 69]
5361F9m3o2L1j3%K1n8O0j5j6N0j0k6M9n5M6l1K0p0JRN9j3O0p2L6n0%L3k4K2K6
5393C4n5QJ6J5k8K9k5K5q2N4j9J5Pk9N1o6M6m6L0J7J3j9RkrJN5n4k3L4k3J1KN4
5427D6o4PJ1j8K8k3j5M3n3O3n2L3m2k0M5oj4NO4m7N5m3m7J5O2L8p9N2o9kJ6ql3
5460e2R8o8L7L3l7l5J5K9l5O7l9l2P6k8n1O3n9M5L1r5O2l2Jk5RRJ6Oj3j8j8O1
5492B1k3m5K7k8Q0p1P2nm4K7J0k9K3lL9o7Kk3j7M4M9l2rj5RLNJ1J4k0n1J5J5R
5526gpK3l3L0m3K7RL8l4Ll4O7n1M8n4MQnK4j3LmM7n1k2K4n0M4nk9L5j5nj0N5q3
5562f6O2No0L5N1n7j8R9j17K0J9K0k5QP2m6J0o5L5L6K2j7NRn3OkK8Op8Q2k3j6
5595a3N5l4Oj1L3n1j2L1k6qK2nkk1P3l2K9k2k1Q1r3L2LJ3k2r1J85r1j0N3l3l7
$$ y = [69, 26, -36, -5, -18, -18, 3, -55, 5, -10, -26, 24, 14, -12, 37, -18, 28, -3, 17, -53, -52, -43, 16, 3, 63, -9, 27, -23, -23, 10, -14, 8, 34, -21, -13, 3, 18, -10, 19, -6, 19, -63, -9, -28, -13, -6, -35, 16, -50, -4, -50, -20, -3, 10, -9, 0, -2, -11, -10, 45, -9, -32, 2, -21, -10, -8, 46, -18, -11, 0, -18, 10, -13, -28, 15, -38, 25, -27, 6, -36, -56, -11, -17, -31, -26, 38, -9, 46, 3, -44, -29, 33, 71, -8, 44, -25, -27, -11, -19, -52, 46, -22, 15, 48, 11, -24, -9, 20, -15, 52, 13, -19, 57, 29, -22, 41, -18, 27, 58, -37, 25, -7, -6, -31, -22, -13, 3, 9, -4, -22, -40, 21, -2, -47, -20, -48, 32, -39, 33, 28, -16, 11, 21, -8, 15, 12, 51, -16, -14, -37, -54, -10, 39, 7, -2, -17, -8, -5, 0, 11, 25, 5, -46, -31, -16, -7, -14, 9, -24, 6, -37, -10, -1, 37, 3, 6, -28, 39, -12, 36, -18, -14, -6, -11, 13, 0, 3, -1, 46, -5, -27, -3, -53, -9, -14, -43, -8, -23, -28, -38, 17, -66, -4, 1, -59, -24, 27, -30, -48, 51, -66, -46, -27, -7, -32, -24, 48, 2, 12, -53, -18, 18, 40, 23, 28, 37, -16, -10, -12, 16, 22, -56, 26, 3, -13, 42, 8, 14, 3, 36, -15, -27, 4, -22, -30, -8, -13, -15, -36, 37, 5, 34, 12, -9, 72, -21, 11, 14, 27, 5, -86, 99, 8, -2, 51, 18, -19]
5627a9k6N5l7LL1k1omQR6o1l0L4k2l5M9qNLNk0J5l7N8m0J1M5p0L6k6mRl9M5J2
5662A5n7MR3r1RRL6nm6K5LLKN6n3k1rQ2l6ppl0K8l0L8M5q3nMN1n3M2M6p5K5N8
5698F6r9L8j3nL8l6M2l8m5R1j1j1l4K3J4j9J7qJ3o1N2qMj0J5J3nj6K5l3JL4J6
5731E0j8n2k1R5k9L2j12J6K6j5P3k4Mn3M9l3ql8J04m9K8kjl8N3n0J3n4Q4k0m5
5762c5N9lQk1l5j0M4j2j9J9j9Q1j02M7oK2L7p8LK9J2j7Rl0k1N9l5P7n8M8n8K2
5794A7k4j0L2J3q1N6k6JL8l5J8J7kn8L6L6Qo7LL6J1k8mN5q9L1M2om9L9j7LJ9n2
5828c7J5K9k6OK2l2J3mm1J00k4PK9j02N4L7k8l1N3p5L0m0P7j9l1J5o1L9J7k7J2
5859b3J1M5m7K0Mj8L4l6j2MJ8ok8lL8k3oK1K7j8j0J5q4O7K5o1M3KK3l4L7l4k4
$$ y = [-19, -45, 10, -27, -24, 7, -14, -20, -24, -16, 80, 19, -11, 23, 1, -34, 15, 7, 12, 15, 20, 0, 15, -22, 36, -4, 7, 52, -18, 18, -8, -12, -3, -42, 3, 15, -42, -38, 55, -36, -27, -18, 18, 13, -33, -8, -5, -2, 0, 56, 3, -18, -27, 55, 19, 12, 5, -25, 3, -27, 11, 56, -27, -32, -28, 23, -30, 12, 58, -17, 8, 66, -33, 5, -8, -13, 25, -11, 31, -7, -52, 39, 28, 17, -17, 6, 20, 1, 18, 10, 23, -38, 14, 6, 10, 0, 15, 28, 23, 7, 32, -1, 0, 34, 50, 32, -20, -41, 54, 25, 57, -55, -39, -13, -28, 45, 21, 25, -28, 21, -12, -20, -58, 46, -3, 25, 23, 22, -16, 37, -13, 0, -54, 30, 10, -35, 24, 21, 29, 8, -27, -37, 7, -5, -24, -5, -24, 57, -45, 2, -4, 18, 55, -23, -20, 9, 21, 4, 13, -17, -38, 21, -14, 63, 5, 53, -5, 17, -7, -17, 15, 28, -53, 3, -23, -22, 16, -19, -1, 16, 14, -44, -8, 28, 36, -31, -28, 8, 19, -9, -13, 42, -47, -16, 26, 20, -29, 10, -7, -4, 15, -37, -22, 7, -19, -13, 9, -23, -10, -14, -55, 45, 21, 28, 57, -45, 9, 46, 18, -13, 40, -35, -5, -45, 32, 13, -18, -3, -64, -25, -8, -35, -23, -12, 33, -14, 6, 10, -8, 26, -10, -22, -18, 0, -6, -34, -37, 1, -22, -28, -7, 20, 2, -8, 7, -77, -10, 15, -46, -3, -1, 22, -12, 25, -9, -33]
5892c3L3l4P4p1O1r4O3k3M3m3kM8j6j6j3K1%K5o3O0Jmk8j6M9m5J01m6p6Q9l4q
5924CP%m8K6N1j1l4J3j0J8L4k1rk6MPJ0nK2Nq3P3l8RJ2j1J6Rk8QoL1l0l2OOL4
5961A2l3K6J6ql2l2M2pM1j3L2q5N6j3j6Q1o0L0J9m3j0k8MM1J1n1j6qM5rpK4j9
5994a0M2m7N9J1q4LN9n4K6j5Nj5J1J9j1n0J0O7Nj3l4j0k6M7o8L2Lj1J0N6k4j6
6026b3J1kK1k9Rj9K7m4N1l1j6J9L5L9p5M1lj6L5j1m5k0P4k9L0k6l6OK3M3k8k5
6058a4lK0M7q3N5k0KPl5l0R2j03j0J18j3q0R3l0o7O2%j1K9k8N5l0l5J5lpPj2p4
6091h6J6O4K8pL1n6K2ol0M1L8l7mJ3k8j5MJ1k1k4K4J9Pj2K9m9J1J5J9k6M0n7J1
6124a5L4j5j4L3ol6l1M5Kj7KO7j02M9Jnomk5M1k2O3n8j2RM7n4k8L9k7O9kk2j6
$$ y = [-33, 0, -34, 40, -31, 30, -64, -1, -24, 19, -24, -26, 22, 6, -10, -23, -2, -2, 23, -40, 20, 21, 17, -11, -27, 22, -23, 78, 32, -44, 45, 11, 3, 10, 10, -38, -12, 39, 28, -6, 7, -3, 15, 49, 28, 19, -7, -3, 4, 14, 9, 31, 36, -47, 26, -12, -3, 9, -2, 14, 23, -5, 3, -3, 28, -2, -34, -28, -22, 12, -21, 5, 21, 13, -19, -51, -9, -16, 25, 12, 44, -41, 15, 2, -14, 67, 7, 37, 56, 13, 3, -25, -21, 20, 31, -20, -36, -44, 1, -8, -15, 9, -10, 32, -15, 44, 55, -29, -26, 33, -21, 5, -10, -5, -20, -9, 10, -1, -51, -41, 26, 31, 18, -16, -26, -52, -5, -73, -41, -38, -49, -39, 17, -7, -23, -12, -14, 7, -22, -13, -32, -5, -49, 2, -29, -45, -26, 9, 48, -27, 14, 11, -5, 30, 19, -26, -46, 28, -1, 29, 3, -33, -27, -4, 39, 11, -14, -17, 3, 50, -33, 22, 2, 4, 11, -24, -54, 38, -65, -75, 43, 30, -50, 43, 13, -54, 8, 8, -3, 26, -2, 53, 23, -12, 3, 0, -7, 0, -12, -86, -70, -6, 22, 15, 46, -10, 12, 6, -24, 17, 55, 18, 14, 27, -1, -16, -12, -1, -22, -46, -22, -3, 4, -8, 21, -28, -17, -2, 17, -9, 31, -26, -15, 19, 4, -10, 23, 17, -19, -50, -5, -3, -20, -18, 49, -53, -4, -3, -8, -14, -18, -43, -2, -24, 39, -19, -31, -22, 25, -29, -57, -18, -45, 24, 22, 0, -16]
6158a6M9k8pLqLJ2l4M9K7p7kk5M9L1J4pl3KoN5j1k1m9J3K7ojMPrj8M2j0n2K7N3
6195D7l0o7M3K4n7L6m1K7Jj0M9j3o0N5j3jk7P9r2kK2L5j9j2M8jm9N6p5K5L7K9
6227D4j6m9L9Kn2L4O1j03O5j9j7k3M5Rk2l3K4k9Q6o8L0kk3j4j6M7l5J00o7k1K
6258b1J8o4R0K6p3K1K2n8QR0r9L4M9n6k0L0L5p5%K4N1q0jK4j6O9o3M7K9k6mm4
6290c3N9m2L8k4K9m4K3l1m1O4Qn1K4lO0qn8J01r0KK1l5L7nM8q5L6%k1l1K2Pk9
6323e2O8k2k2J5K4k7M2Jm6J4k2J6K2K6n9L5jJ0J9p7K4L6K4l3j0L3p3J7L4m8Q9
6354E7l8Ll3rqkNL4p2K0M9POk2K7m1M3p2k8R9j9m4K8j7pL8P5j14N3o2O7m1k3O4
6388B3l5J3K8Nl0K4m5K9ok7L4K4m9pO1Mo0M0rJ7k8n8P3l1pK2nj9J1j3K4n2qP4
$$ y = [-16, 33, 5, -2, 1, -7, -4, 8, -26, 23, 50, -27, -29, -54, -5, 26, 40, 33, 0, 2, -4, 51, 40, 19, -30, -17, 10, 4, 3, 7, 14, 5, -13, 29, 19, -33, -6, 47, 17, -50, -7, 17, -40, -4, -45, -18, -17, -27, 22, 9, -51, 4, -9, -10, -37, 42, -50, -52, -30, 5, -14, -26, 22, 21, -28, 28, -47, -22, 15, 44, 28, -21, 18, 20, -32, 2, 63, -40, 25, 6, -11, -34, 11, 20, -2, -35, -11, -40, 46, -22, 8, 6, -17, -31, -47, 0, -35, 65, -2, -23, -21, -3, -67, 23, 49, -24, -3, 19, -39, -31, 59, -40, -6, 43, -13, -33, -3, 32, -43, -43, -19, 32, -48, -49, -25, -41, 28, -35, 12, 41, 15, 11, -33, 26, -16, 22, -2, 27, -17, 6, -25, -66, -2, 6, -45, -21, -24, 36, 28, -30, 71, -19, -17, 4, -31, 6, 1, 49, -36, 0, 0, -21, -52, -30, -23, -52, 16, -6, -28, -13, 11, -16, 26, 27, -19, -5, -27, -11, 11, 37, -22, 13, 12, 22, 41, -36, -12, 24, 48, 15, 5, 38, -35, -18, 16, -32, 57, 19, 22, -11, -20, -28, -30, -25, 9, -63, -43, 6, 13, 19, -3, 24, -17, 26, -46, -74, 25, 6, -38, -10, -27, -34, 4, 79, -35, 18, -44, 23, -18, -41, 23, -12, 1, 29, 34, 4, 28, -17, 12, 6, -21, 13, 37, -12, -19, 42, 46, -14, 26, 17, 34, 6, -52, 21, -10, -17, 5, 0, -19, -8, -21, 3, -49, -57, 17]
6422A7j6m7L9J0q7N1K7L1k1LjQ3j14k7O4k5k1K9j9J2K8k8JL5l8k1L4LL1k0lk2
6454a2K9r1L8J3j3Q3k1m7M5p3O1j4m4N3qkm7J16m1q6M9k5LJ7P8o7O4q7MN0l4K1
6486A2j4j3Ql0J4J9j9j6L3k5MM9o0J2P5o5L2k0P6p7k5J8L8J8m7q9J56q5pM2m6
6517c2J0O0k8MJ0k3J3J5k5l4J4K3%Jl4lqK0j6J5N5l8Po6P7Kp1M5kJ0M8q2N9K4
6551E0j8j8j6m5N0K6o0L1kRJK5n3j7L6M7k2qm0M4l8l5J9K6J4NoJ5k7n4K3QMK2
6585dj4K7kq3P9J7o1M3K8k7j3l3J2K9M0k2om5K5K9l8Ml0K1j3P9n3Pk6O8n2P0m0
6618A6Oj3rM7o6PO4k8r0M4lK7l5M2m0J0J3NJ4j5L4o2L3K2k6Lm4O7n2l4R0l6n6
6651f5N7Mj0pL7n1K0j5Rj0NN3Qn9J3j4J0J6pLj4L6n1lN2n2j3Q1k6l4Nj5M2j0j6
$$ y = [17, 1, -46, -7, 3, -84, -33, -6, 25, 4, 7, 6, 89, -25, -52, 12, -13, -34, -5, -24, -12, 16, -12, -11, 24, -14, -35, -1, 2, 33, 13, 10, -12, 17, -74, -36, -23, -36, 47, 26, -21, 24, -49, 12, -2, -46, 7, -1, -3, -50, 66, 25, -61, -12, -37, -34, -17, 61, -6, 58, -29, -25, 25, -9, 12, -2, -15, -7, -37, -23, -4, -23, -39, -6, -31, -27, 22, -38, -26, 49, -16, 16, -4, 72, -5, -30, -12, 26, 44, -3, -92, 64, -21, -28, 14, -32, -22, 38, 10, 14, 24, 1, 14, 29, 4, -30, -16, 7, 7, 8, -26, -29, -37, -17, -33, -18, 37, -1, 6, -60, 17, 19, -52, -7, -9, 1, 49, -33, 26, 50, 32, 14, -2, -47, 3, 29, -31, 0, -2, 7, 8, 33, -20, -37, -1, 46, 24, 16, -24, 20, -18, -53, -34, -8, 6, 11, 5, 20, -7, -61, -38, -30, -26, -4, -18, 9, 7, -76, 3, 20, -41, 2, 30, 3, -10, -43, -31, -2, 38, 16, 10, -35, -10, 19, -19, -15, -45, -24, -37, 42, -11, -4, -30, 38, -14, 56, 16, 22, 9, 0, 47, -19, -12, 52, 24, -66, -22, -25, 2, -33, 9, -31, -21, -8, -3, 11, -4, 30, -32, 1, 23, -3, 0, -44, 23, -29, -63, 27, -9, -65, -8, -4, -14, -21, 16, -35, -15, -30, -21, -31, -26, 27, 35, -24, -11, -25, -15, 1, -6, -3, -17, 19, -32, -35, 17, -35, -48, 33, 7, -27, -22, -37, 5, -5, -21]
6686b1K8J5m8O8m3k1K6J4j5k1J0Kk2mN4j9nj7K4m1O8m3jJ9J9o4K7jKj9J5L2m9
6719c1P5j6l6M6kq4k7M7J1l9N4k7QO0q2MK5M9p2KL0Q4o2K6k8l6N6n5J1K5l3M2
6751B5j6k2k8M9l2N2l1nMP0p5jj4Q0n6m5L7L0l5jk5P3m6j%l1k4Q3l1JL7k8nl0
6785d1J8M5KJ9n0PJ5rJ5n8M1mK0J4j7KJ6k9J7j4J8jj9L2m3j3K9Lj7L3m1L0l5J7
6819BqqLN5j03M5M5l9RJ8k5m5M2o6O8km9M3K1m0J9mK2nM3m1K5J8o1L5j0k0rL0
6853Hn6O9K7l6j2m0M5%n4M7j7O4m7J3mk7K9j4J8ql5N9k8L9r0N8l7l6M9j7J01q4
6885a6n6P5%l4K7j2QN3j1o5M3mn5L7N3l6l2mrNL1k7K4j1L1l6jn2O3nK6L6m9jM1
6920C7n8k0N3Km0nk6J5K9O7l4j7k9j8M8K4k8N3p1j6P5j3K5n1m7L2j7N5p0K2O1
$$ y = [-21, 7, 22, -26, 42, -1, -22, 4, 18, 3, -18, -8, -6, -28, -32, 22, 3, -2, -19, 5, -36, 32, -11, -12, 7, 26, -38, -11, -12, -10, -29, -14, 18, -31, 44, 28, -8, 38, 36, -48, -75, -28, -17, -56, -2, -29, -21, 39, -43, -39, -14, 35, -37, -35, -5, 79, 17, 43, 15, -21, 35, -20, -9, 16, -17, 25, 9, -13, -41, 8, -24, 28, -3, -8, -4, 66, -9, -10, -24, 56, 0, -45, -8, 22, -13, -14, -39, 34, -12, -13, -13, -44, -68, 15, -16, -15, 22, -6, -11, -41, -23, 22, 24, 43, -7, 0, 15, 6, 21, -37, 4, 0, 20, 34, 17, 19, 35, 6, 23, 9, 27, 26, 7, 39, -4, -17, 12, 15, -2, 31, -10, 20, -15, 2, -6, -14, -11, 44, -59, -14, 31, -8, 1, 19, -6, -51, -9, -75, -7, -9, -58, -15, 6, -34, -15, -19, 3, -2, 41, 0, 25, 43, -18, 17, 7, -13, -22, 8, -48, 21, 48, 12, 0, -40, 5, 5, -49, -2, -19, 45, -2, 11, 7, -20, 9, -5, 13, 5, -30, 29, 1, 40, -50, 8, -29, -65, -16, -33, 68, -16, -72, 3, 3, -31, -4, -16, -8, 45, 34, -31, 12, 8, -47, -10, 43, 7, -25, -29, -38, -33, -2, -29, -5, -16, 15, -21, -22, -74, -11, -16, 10, 46, -3, -4, 37, -21, -41, 12, 14, -26, -31, -57, -42, -13, 54, 20, 3, -26, -44, 4, 28, 0, 53, -18, -34, 41, 28, 53, 2, -45, -13, -30, 25, -45, -23, 38]
6951C8o7J3O8j14M8J8j5j4m2O5qJ2l1K3K2k6Ol7J08p2rM4l6J5l0k3O3k6N6m4k1
6982a6l8M9l4mQ6l5J0lj0J7%Ln2K1rPk9pL0l6K1PjK1J3mm6M7Kp3L2K9K0J6k5L
7018A2m0M1%L9m6j5M1k0K6k6j4m0L7N2k8Km0kl1K1Q4l6j5J2j7L5j6n0N0j0nj2
7050a1j8pK9J7j0l1J1O0nm6K2Nl8P4o6K2k2OO8p1Ml6O7l6RL5k3M6l2Mj9k2j1N8
7084C3n8j2M7l6J7K9o7P9j9J1o0L1k2k9P8k4K3m8L2K2K6o2K3m2KK8N0n7j0J3k0
7115b2L1p9N4lN9p4K0K0K2m4N5q8N8Pk4MK5K8p6j3K4J9N1n2l8K3L9k3k8j7J8P
7147a7JJ9J9j5L3k0m1J0l4M7k3L5o2N3L6r9K8n%N8n3qNL4k3j9ml1K1K4j6M8k0
7180a9L4L9l0j6qK9n4O2m4k6K5J3J8L3n4k2nM3q%J0m6L4K7m9pK3L1o5J8JJ1M7
$$ y = [38, -29, -16, 52, -62, -14, 4, -11, -25, -67, -2, -10, 2, -29, -6, 16, -10, -4, -41, 67, -5, -14, 30, -6, 9, -21, -44, 19, -7, 49, 5, -16, -54, -5, -39, -43, 43, 8, 18, 15, 5, 22, 22, 25, -27, -6, -15, -8, -37, -44, -14, -50, -29, -22, -23, -2, 11, 7, -39, 8, 10, -63, -31, -2, 18, 34, 9, 12, -28, 13, 13, 52, 6, -9, 32, 12, 38, 12, -2, -42, -5, 47, 19, 21, -19, -21, -52, -31, 53, 17, 2, 14, -3, 32, 16, -34, 16, 6, 1, -11, -29, -36, -7, 10, 0, -31, -20, 40, 35, -11, 11, 16, -22, 52, -14, 8, -14, -8, 60, -11, -7, -43, 24, -12, -3, 32, 9, 55, 23, 27, 8, -14, -25, 33, -25, -37, 10, -26, -9, 20, -47, 32, 13, 24, -36, -5, -27, -56, 22, -2, 21, -27, 5, 27, 53, -9, 14, -28, -26, 2, 52, -5, -15, -2, -22, 9, -70, -16, -19, 40, -34, -14, 6, 28, -16, 39, -49, 9, 16, -8, -4, 21, 49, -27, -40, -16, 3, 54, 2, -36, -13, 26, 3, -25, -42, -24, -17, -16, 3, 22, 7, 40, 20, -21, -11, -45, 2, -21, 14, -48, 5, 41, -58, -30, -35, -35, 23, -30, -38, -33, 1, -22, -41, -45, -76, -55, -31, -47, 1, -19, 15, 54, 24, 8, 0, 29, -25, 37, -7, -33, -8, 5, 23, 56, 2, -20, -25, 18, 10, 10, 20, -26, 8, 35, -14, -21, 2, 33, -32, -14, -13, -2, 45]
7213D5o2L1l6pM1j3j8O0m5n8N5J3onL6l1Mj5M8o1M4j2jm1K8L2J2m5P0n1l2j5N2
7246A7J2p4N5p4K5K1Ml9R6l6jJ6o5J13k0j06j0M3k1M5l3J8mN0l0l3J2Lk4J0k7
7277e7N8M3l6K0k2l8QK8j6K1Qk8RL5j7j7k2Qk5N4k7K0j3l5O6m8J8Jk7J6j7O5o5
7310c2N7o0N0oKk7jkM6n4m7J05p1JL1l0N7NK0m8J5Jj5j0K7Rl8J4K6l1J9k3nj0
7344b5L4L5p0jJ6j0j5M4o5J02l1K8p1J5l2O8j7k8O8o8K9k6L1m0J6L8o0NPN3j27
7375i7P7O0n7J5j6J7j1j3N4r0L9J7K4l8L1j6K7l1k7lK5nK9rL0K0p7K6J2l2K5p1
7407f5O3j9L0Rl7K0kMl2pN3m6L5j6l2mN0oMOMQqj6k5j8N0j6J6N3m6rkl4M8j3l0
7444c0O3M5j13O6mn6J6L0n3L4L6k2Ll%m2N6mq6Q2JoPLl5%k5L8J1j4j3K0O2o7O3
$$ y = [45, -17, 14, -22, -29, 12, -1, -19, 41, -4, -62, -7, 6, 0, -5, 31, 0, 4, -11, 37, -24, 20, 8, 7, -34, -6, 26, 38, -7, 63, 12, -20, -35, 17, 29, -45, 10, -64, -39, -18, -14, -53, 43, 7, 6, 22, -43, 70, 50, -56, -66, -23, -44, 1, -32, -14, -18, 32, 2, -31, -19, -16, -40, -30, -57, 1, 44, 8, 28, 6, -32, -24, 4, -12, 9, 17, -11, -2, 33, 16, -1, -23, -15, -40, 14, -13, 7, -6, -41, 25, -23, -5, -4, -31, -15, -32, 33, -32, 25, -35, 15, 9, 11, -16, -17, -19, 27, -27, -74, 31, -40, -39, -8, -38, 19, 24, 44, -4, 11, 12, -3, -13, 14, 23, -15, -1, 25, -6, 13, -10, -15, -25, 9, 44, -26, -27, -11, -21, -36, 8, -57, 45, 14, 42, -29, -14, -46, 22, 5, -23, 45, -23, 6, -20, 11, -29, -13, 25, -35, -30, -23, 30, -97, -20, 40, -17, -2, -18, -1, -12, -25, 29, -61, -22, -5, 19, -19, 12, -4, 23, -8, -35, -38, -13, -18, 11, 2, 32, 52, -25, 1, 13, -19, 6, -65, -2, -21, 9, 18, -19, 1, -1, 3, -29, -36, 17, -29, 6, -10, -42, -46, 4, -2, 2, 8, 12, 20, 12, -4, -29, -47, 3, -13, 3, 56, 10, 1, -1, -35, 13, 0, -30, 33, 78, -35, 31, 27, -29, -13, 17, -36, -2, 34, 12, 15, 12, 12, -30, 26, 22, -64, 18, 19, 13, 20, 23, -12, -12, -37, 1, 12, -2, -15, 5, 67, 0, 63]
7479F3p3lRK4l6oN3q0O9k3J5n5QP7m4j4J9j6l9L0L0k2p0O1N0m8J6m5J3J5P3k4
7511B7m2J7j6N7o7K2o9M8j1M2pL9m3M2o1L1rJ1j3N2k2k6K4j3n9L7L6k7l3K6N3
7542D6p4J8k0L2l1O0o%j4n1N9n1lK6k2M1k3k0J3k0P8p2K5OJ6Jl8L1m4M4J0pj3
7575cjl1J5P9n1K0no6N4m4JpN8J1n7M2j6Rm1J6L8L2q0M7K1l5mNLoJ7j2l3K1M8
7610D5j6n0PM6m9K3J2J1k0oK3Kn9N5j6okk2L4Mj1l2J5K2o9O7kl1pM1j4jj2J8K7
7645B7K8j09L2J02m6n2K8k9Lj8O2j4qN5o0K4o1P7m0l5M4j0l0R9j07J02m8J5m1
7674a0K9k4kJ9j9J9j6Nl3L4n1M5M3n4J1MK4j2k0M8K4o4pK0n9P3m2J1M8n4J2l8
7706c6L4M1r4R3q3L5K2k1L0m1J0P4n1l3KK7nK0j0j8Nj2N1j5lj6nJ4J6p9oQ4l1
$$ y = [63, -10, -13, -4, 20, -16, -22, 31, -49, 20, -3, 12, -43, -35, 42, -2, -16, 3, -13, -52, -22, 8, -14, -84, -23, 27, -21, -5, -50, -37, -22, 51, 27, -15, 2, -14, 43, -24, -2, -71, -23, -34, 8, 1, 40, -3, 39, -22, 9, 0, 11, -2, 50, 28, 2, 26, 13, -46, -9, 27, 0, -33, -7, 46, -28, -10, -30, 2, -29, 31, 25, 25, 11, -40, 19, -32, -35, -9, -31, 10, -13, -33, -20, -40, 38, -34, -9, -3, 13, 14, -24, 7, -37, 7, 17, 10, -3, -4, -35, -20, 59, 8, 28, 23, -43, 11, -33, -32, -39, 19, 30, -27, 15, -1, 8, -33, -17, 21, 53, -27, 20, 41, 6, 2, 7, 10, 4, 21, 9, -24, -3, 45, 29, -21, -14, 32, -17, 6, 18, 29, 9, 3, 26, 28, -31, 24, 8, 2, 0, -22, 12, 16, 5, -27, -12, 10, -59, 8, 6, -25, -32, 9, -5, -6, -18, 0, 27, 55, -54, -22, 80, 34, -18, 10, -19, -16, -34, 28, 14, 6, 61, 1, 25, -36, 41, 1, -34, 10, 0, -30, 69, -38, 64, 16, 31, -10, 19, -5, -7, 12, -7, 12, -4, 1, -32, 2, -49, -4, 39, -15, -4, 0, 24, 12, -8, 40, 64, 0, -7, 13, -46, 27, -15, -4, 44, -10, 2, -36, -2, 39, -55, 38, -45, -10, 12, -9, 21, -20, -10, 64, 13, -20, -18, 9, 4, 24, 14, -4, 1, -11, 40, 25, 22, 6, 1, 15, 31, -48, -54, 30, -1]
7739am9J13m9m6L1L2J5m6L8j04J22p3J8k1rKJJ2mj2J6o1O7L4n0PK2k5j8N7o5k1
7771f7M8L2j7L6K4j06Q9rJ5q2J8Mj4L6Om1j9Q1J8j8p9O2k3K5J7m5L2m5k8J08j01
7802d3N7j3l9M4k4No3N7mL1o3M6JjJ5%qkj7K1M5r8R9k7QL5m0k9rN3m1L9o7M9M
7837B1J9r0N4L0o1MjpM7n0N5n2J5l1oP3l6K0o2P1pjJ9rk5pK8ko4L5NqK9j9j5J7
7873a1L9p3O2k3Nn1O8n6L5J7j6K7l4k8K2N4nj5J4o5k6M7L0j6K4k4k4j9N8Krj1
7905bOpJ6Klkl0K7M3n0Rj8k1L8J2l1j4K6M2j5m7k6O6p2J8K1K0m3K5N0n9M9k7J0
7939A3k1qJP8p6K4n2P7lom2O2o5NORMm3K4PK2l8QK0K2Kl4M6J0j12J2N4l7K4Qp
7975fJ4l5RnM2o4L8j4K1J0p0N1J5l7K3L2Pj1n6L1J6l3PO9o1k4L7m9J2K1lJ2j8
$$ y = [-1, -50, 63, 14, -32, -1, 31, 46, 0, 38, -66, 56, -17, 1, -20, -29, -27, -26, -14, -18, -30, -14, -75, -8, 26, -24, -17, 5, -20, -38, 19, -46, -67, -19, 13, -4, 32, 56, -50, 39, 30, 45, -37, -19, -15, -29, 7, 13, -28, -47, 34, 52, 34, -45, 17, -6, 19, 36, -9, 23, -22, -50, 58, -43, 14, 1, -38, 6, -18, -13, -76, -19, -23, 8, -55, -9, -8, -9, 6, 6, -2, -4, -21, 0, 45, -53, 46, 19, 27, 62, 22, -7, -16, 37, -4, 35, -32, 17, 21, 40, -50, 4, 34, -27, -23, -24, -31, 16, -34, 21, -31, -16, -47, -53, 20, -16, 4, -58, 13, 6, 5, 24, 15, -10, -17, 11, 9, -55, -20, -15, -23, 6, -13, -28, -11, 28, -45, 17, -6, -1, -52, 16, -40, -5, 12, -4, 23, -11, -39, -17, 37, 32, 17, 31, -34, -60, -13, 17, 1, 25, 1, -23, -42, 16, 18, 9, -2, 4, -3, 13, 15, 12, 10, -20, 7, 50, 0, 9, -9, -30, 8, 20, -11, -25, 1, 43, 28, -19, -45, 21, -51, -33, -12, 8, -35, -10, 40, -19, 30, 3, 13, -8, -16, -15, 63, -13, 11, -41, 36, 33, 27, -15, 47, -18, -13, -7, 2, 6, -37, -13, -6, 16, -22, -14, 6, 28, 30, -4, 42, 52, -60, -48, 6, -31, -7, 1, -6, 8, -27, -18, -23, 19, -45, -7, -21, 0, 10, -60, -9, 6, -31, -8, 24, 31, 20, -36, -5, 11, -22, -15, 54, -7, -31, 6, -43, -31, -10, -13, -1, -19]
8008a9J2l0J7K0lM1n9mk0K5O3m5l9LK3K2l0N1m6j3jO9rk9j0K7k8k7K7M2Mo6O7
8041C5o0P2m2k1N3l6l1j9N6Kl9K1K0m2K0j2K1%l6O0l4L9l9K3L2p2N5l5J1j7K1
8072Fk8PJ9j9qK2mLj7lK5J6p7N1jK9n8Q6l3n3J6nM1o0O6kk6rL3m7N7o4O0J0k9
8107DqJ1mO0n8J6m3N0k0J3k7j8J7l8R7kn0K4ml5kJ4rj7M3j9m1K2K7l2L7L1j2n3
8141b6J5pL6j5M2m0K2j8n%J8nk0j0MqN0m8J2J4k5K3K8j8o0L3K4MLm4j8J6J3n7
8175f7N1olQ3o2k9Q8p1P1j9l1pk7j2lM5
$$ y = [-19, -7, -37, -20, 0, -3, 38, -21, -25, -45, -20, 43, -2, -41, -38, -15, 7, -23, 28, -18, -31, -32, 37, 28, -1, -11, 16, -12, -39, -12, 30, 34, -32, 35, -25, 47, 5, -16, 37, 1, -30, -49, 7, 9, -30, -9, 11, -31, -11, -23, -2, -2, -38, 22, -12, 27, -12, 11, 43, -29, 26, -9, 2, -15, 6, -22, -15, 4, -15, -23, -1, -5, -2, -19, -22, 3, 19, -58, -7, -8, 21, -37, 49, 16, -37, -21, -26, 15, -45, 21, 19, -7, -16, 17, -30, 27, -37, 23, 33, 4, -4, 7, 3, 63, 5, 21, -22, 28, 8, 21, -6, -24, -7, -45, 52, 50, 0, 24, 20, -15, -17, -3, -12, -29, 14, -5, -46, -24, 3, -29, 8, 39, 27, -26, -11, -18, 18, 3, 45, 5, 27, 9, 4, 4, 22, 17, -3, -13, -9, -17, 33, -15, -3, 11, -14, 9, 37, 19, -41, -8, 16, 20, 23, -21, -39, -23, -10, -67, -16, -22, -25, 58, -4, -33, 55, -16, 55, 36, 5, -2, -29, -41, -44, 1]
8191A
$$ Imaginary data points
##PAGE= N=2
##DATA TABLE= (X++(I..I)), XYDATA
0@%%%%%%%%%%%%qJ6j6J6j6K4l2M0m8N6o5P3q8J04j21J39j62J86k12K44k76L15
34A69l57M00m49N04n66O32p03P82q67R59j064J178j300J434j580J738j915K112
52A107k326K564k834L136l479L868m315M847n481O253p215Q451j0114J2482j6139
67i195K2581l7242J30169N957k37794Q8598O7748l1746J6395L9708j02879m3791
79i1491N2205L5767L1386M6700q0875p9924P4964P7652l9354O04P344r2306l9216
92i6544J16228O0408o6676n2416j695R601N1263M4200k4896m3357k2712j4679
104d1275M0113O4777k9105q3897o662L6317J3655K8542K2703m5804m9873K1501
116b9008N4957L3038j5849o1900l1816L7584L1761l157N036j7058n3242K787O6845
$$ y = [0, 0, 0, 0, 0, 0, 0, 0, 0, 0, 0, 0, 0, -8, 8, -8, 8, -8, 16, -16, 24, -24, 32, -33, 40, -48, 56, -65, 74, -88, 98, -114, 130, -146, 169, -188, 212, -237, 267, -299, 333, -370, 412, -455, 504, -560, 618, -682, 752, -828, 910, -1005, 1107, -1219, 1345, -1489, 1647, -1832, 2036, -2279, 2568, -2913, 3340, -3875, 4576, -5538, 6944, -9195, 13386, -23856, 106313, 112270, -125524, -36926, 30822, -924, 15471, 55179, -47700, -91491, -39286, -3519, 27867, 74567, -6308, -86232, -11268, 66384, 27030, 27634, 34978, -57328, -96544, 19684, 80092, 13416, -39000, -40695, -31094, 20169, 64369, 39473, -3884, -26596, -41275, -1162, 63615, 34510, -49387, -56049, -19732, -6077, 22465, 45168, -636, -50509, -29008, 25949, 58987, 43138, -18762, -50578, -12994, 18767, 15610, 20646, 3588, -49654, -46867, 19978]
129A9978K5455k7912k6388k2308J832M5802K3564k7764j9743j0433j8667L0462
141f122N9617j7090o2893o755K4453J3152K6510L516n3786k7048L6261K3186q8
154A2913Q725k1215m1087J7214M7100K701j4774p935k7834q765M4086K6268k5608
167A1789k2703p865m424K7198L4791j6843l7725n634Q351J2908K5662k215m0979
180a7689j7694K1950J9986J0748J924k3344k1760J4720K5529Q386l059j9844k6516
193b6663P385L2046Q014j5318j3310j2364r2K5749K0032j1239k0761j0834L418
206a3937K2076J7721j3946k3826n664M429J2450J9947k454k7650j0788J4611J4423
219G392J0240O49k2318j8982J2451K0377M812m711j5639j7850R276K5485M705
$$ y = [19978, 45433, 17521, -8867, -31175, -29343, 16459, 40023, 12259, -7484, -17917, -36584, -6122, 53495, 36405, -26488, -33243, -8790, 4362, 30872, 34388, -19398, -46446, -10185, 13001, 12913, 21638, 423, -40664, -23450, 23650, 26351, 11577, 3642, -24192, -32957, 11129, 37397, 11789, -10914, -18779, -23203, 3995, 38786, 21943, -15782, -21416, -13065, -157, 25505, 23290, -17689, -35383, -13433, 6553, 17301, 19225, -4119, -25879, -11159, 14370, 22756, 19697, -147, -26663, -19278, 12768, 20782, 5464, -7846, -20210, -20302, 5447, 25479, 14240, -6521, -17355, -13937, 8139, 25860, 11914, -11912, -17576, -13147, -697, 19250, 16796, -10854, -21642, -7031, 7392, 17632, 18281, -4037, -23019, -10568, 9809, 14621, 9910, -5729, -23579, -14303, 11182, 15887]
232A5887j0101o869j0861k714K2126J6218j4280j7793l997J529J2032J6251o640
245A0788k1744o170Q600J1935J2796l178k1810q144J3598J0074L445J749j3334
258a395j7440P732K0314M401p448r817j0726L579J8658P481r330r890p474K91
272a1064J6657J2133j2235j5230j78L590O186J2152o33j7722q819Q955J2142O955
286A2889l601j4640p767Q746J0348L221j771j0524j1359N905J5679L549o792p121
300c238o000J565J2323P924n793j0420p081K261J3203Q262q965j1686j097L565
314e177O762R242k321j3985n380P657P937L994j992j0678p328O142R221L331j567
329E858q373q880N354J3347K472o563n668m784M14J0199O799o374r022l084K524
$$ y = [15887, 5786, -1083, -11944, -14658, 7468, 23686, 9406, -8387, -12384, -10855, 1177, 17428, 10788, -10956, -17126, -8526, 3409, 16205, 13027, -8783, -16927, -3329, 6745, 10190, 11939, -1395, -18835, -11103, 9211, 13612, 6164, -3653, -14379, -10800, 7858, 15339, 6009, -3881, -11355, -11064, 5593, 17726, 5491, -9739, -9917, -6327, -141, 12011, 11378, -6344, -15163, -6208, 5934, 12889, 9288, -5352, -13119, -4373, 5975, 9196, 7425, -3099, -14458, -8553, 7126, 10675, 3883, -3238, -9238, -7673, 4650, 12574, 6781, -3639, -10720, -8459, 4744, 13006, 4041, -7645, -8742, -5177, 1585, 10827, 8506, -5479, -10859, -3202, 4735, 8729, 6737, -3941, -11269, -5127, 4094, 7425, 5858, -2515, -11395, -6041, 7306, 9778, 3215, -2453, -7237, -6823, 3376, 10175, 3801, -5221, -8305, -5781]
344e781Q396P041m710r750k293L785N827O165k134j1100m905O195O836K703j556
359D719p572o196M950Q892K580l069o386n863L033R394K723m888n268l860R40
374e871Q732N701n229p255j667K187N747N603l253q888k758L982N259L945j853
389D382q135l758N209N876J875j331n808n431L368P809J937l728m913l417J942
404d123P120L357l872n324k318J883N997M013l762o560j823K770M647L469k139
419C335o376k938L527N503K503k500n732k651L157M759K192j968n331l262L159
434b623N628J735k484m390k969K406N742J877l058m129k446J594N605L022l667
449A843m788q37J822L571L435k024n891j824L187L500J815j268m835k857L429
$$ y = [-5781, 2615, 9656, 4946, -4804, -7097, -3312, 2515, 8680, 6546, -4554, -9459, -3264, 3572, 6275, 4719, -2853, -9049, -4099, 4793, 7373, 4304, -2082, -7945, -4912, 4482, 7205, 2317, -2951, -6811, -5871, 2861, 8562, 3333, -3922, -5589, -3402, 2345, 7948, 4695, -4193, -6951, -2969, 2290, 6235, 4382, -3753, -7511, -2302, 3574, 5449, 4118, -1690, -7121, -3753, 4056, 5993, 2265, -2648, -6065, -4123, 2997, 6354, 2482, -2842, -5160, -3277, 2720, 6733, 2971, -3589, -5412, -2642, 2005, 5474, 3335, -3041, -5979, -2452, 3051, 5554, 3054, -2678, -5329, -2172, 2587, 4779, 2811, -2520, -5782, -2623, 3005, 4740, 2256, -2134, -5103, -2697, 3045, 4922, 1864, -2265, -4711, -3117, 2488, 5510, 1843, -2945, -3782, -1960, 1611, 5046, 3022, -2869, -4693, -1506, 1994, 3809, 2541, -2294, -5151, -1722]
464a722M568Q08j625l351l259J991N522J393l298l124j489R60M409K879k895m330
480b563q00J970L153K477j845m913j546K894L074J207j141l795k452K501M392
495B613R22k189k934j819J412M087J786k633l496j050J692L070K054j881l775
510b141j198K278K986J357j501l446j750K081L426R17j906k840j398J501L420
525A786J531k058l082j029J635K860J423j704l176j170J873K636J195j400k986
540a666j359J906K963Q62j637k511j339J460L032J155j872k590r11J372K580J293
556B738j589k814r02J508K476J023j307k640j049J653K453P89j395k283j135J379
572a095K553R41j594k304p92J306K401J009j468k282p78J289K174R03j348k296
$$ y = [-1722, 2846, 3654, 2029, -1322, -4581, -2590, 2932, 4325, 1027, -2097, -3586, -2626, 1783, 4662, 1767, -2563, -3363, -1393, 1760, 4237, 2392, -2521, -4067, -1173, 1901, 3108, 1967, -1828, -4280, -1779, 2613, 3535, 1346, -1588, -3407, -1995, 2092, 3878, 1245, -2251, -3301, -1609, 1461, 3515, 1634, -2141, -3339, -1061, 1925, 3282, 1781, -1665, -3415, -1334, 2092, 3009, 1103, -1737, -3135, -1634, 1786, 3317, 1259, -1823, -2852, -1217, 1643, 3066, 1362, -1814, -2984, -1111, 1525, 2720, 1320, -1666, -3025, -1119, 1844, 2706, 1069, -1442, -2781, -1321, 1711, 2866, 994, -1596, -2507, -1135, 1445, 2738, 1149, -1665, -2567, -1059, 1417, 2440, 1133, -1507, -2556, -903, 1550, 2339, 944, -1339, -2474, -1095, 1458, 2399, 805, -1499, -2291, -985, 1416, 2425, 957, -1325, -2103, -814, 1360, 2263, 915, -1381]
588a381r58J460K176P31j316k004q41J302K208P09j270k067p37J184K058P81j339
605F96k080o52J348J947O97j100j979p35J247J959M85j199j740q22J162J929N89
622A752j266j700n12J095J778P41j268j782m42J064J541O48r49j861o74J224J727
639A116M38r88j576o19J146J608N13j121j362o91Q86J702N48j187j499l87J000
656d73J412N41r29j627l56J027J242N18p79j509n63J002J488L40q69j337n03R60
674d15J441L53j047j214m07P69J404N16r76j293m14Q93J290L77q92j319l54R31
692c57J164L15p22j249l92Q03J287L28q09j203k70Q27R98M16p57j172l80Q34J059
711G20M12p76j110l48P94J145J95p42r88l04O70J050L06q18r65k98O81J072L43
$$ y = [-1381, -2339, -879, 1297, 2028, 712, -1292, -2133, -831, 1377, 2086, 816, -1251, -1988, -804, 1254, 2035, 696, -1384, -2036, -688, 1259, 1956, 856, -1123, -1858, -611, 1348, 1833, 634, -1106, -1928, -766, 1163, 1752, 486, -1214, -1726, -631, 1147, 1888, 620, -1162, -1604, -540, 1001, 1649, 700, -1161, -1835, -611, 1116, 1554, 566, -1010, -1629, -483, 1125, 1638, 517, -845, -1536, -650, 1052, 1600, 413, -1086, -1473, -473, 939, 1480, 551, -1076, -1432, -405, 837, 1355, 576, -933, -1496, -494, 994, 1334, 465, -872, -1375, -415, 1026, 1379, 332, -882, -1289, -520, 884, 1400, 424, -869, -1283, -390, 900, 1277, 385, -934, -1288, -357, 807, 1122, 400, -849, -1241, -438, 849, 1177, 368, -835, -1105, -278, 720, 1136, 379, -793, -1173, -339, 720, 1132, 356, -754, -1102, -308, 837, 1032, 290, -698, -1002, -332, 718, 1024, 206, -759, -1057, -376, 696, 1039]
730A039p40j058k62P96R68K18o76r52l10P13R34K31o05r78k40P08R24J98p18q16
750f26k42O25P95L53o94q58j91N96Q70K11n71q89j67O25Q36J27n45q77k59O62
770b19Q71J96o40q22j60O21P67J28n79p31j29N05P05K25n51p64j52N37P74J31
790G13n76o99j09N57O11J41n54n96k18N53O62J22m78o00j62M71O76K02m91p43
810e18j24N19N98J86n78n94p8M56O10Q2m54n63j80M60N91J54m55n49j24M88M96
831D23J64m95n01j09M46N25P3l97n49j83M76N72J02m83m65r7L84N52Nl70m59j09
853d95L99M78J54l98n04j49M34M49P3l51m66k7L20M32M6l43m19l8L03M61J08m17
875E0m34q0L77M53K9l20m07n8L61L20J26l79m22j4L20L85L9k64l90j07L91L57
$$ y = [1039, 299, -759, -1021, -225, 743, 961, 285, -667, -977, -264, 670, 901, 296, -682, -922, -214, 710, 908, 190, -626, -868, -243, 552, 905, 211, -647, -838, -242, 628, 839, 268, -621, -788, -163, 673, 800, 255, -622, -881, -219, 652, 848, 208, -614, -774, -153, 614, 742, 163, -568, -697, -192, 513, 738, 187, -577, -729, -192, 582, 713, 137, -562, -671, -114, 497, 638, 84, -512, -730, -177, 485, 607, 129, -471, -633, -162, 514, 716, 225, -518, -642, -123, 475, 661, 83, -511, -589, -133, 477, 559, 105, -458, -638, -178, 413, 567, 112, -437, -561, -73, 423, 587, 92, -409, -518, -72, 453, 526, 129, -420, -603, -127, 445, 547, 64, -401, -498, -114, 438, 443, 73, -386, -495, -96, 382, 536, 138, -366, -515, -81, 368, 441, 90, -376, -403, -83, 349, 395, 52, -367, -405, -102, 359, 467, 50, -384, -464, -87, 366, 395, 75, -332, -390, -29, 291, 417, 38, -384, -398, -78, 307, 346, 82, -308, -415, -24, 333]
897C33N0l25l79k7K47M11N3l45k73q9L51K72O5k42l98n4K58L43Q0l07l46j6K84
920e4L45P2k89l49m2K94L04K5k95l19l1K90L26L6k69k77o1K58K79N9k40l28p6
943c42L54K37K9k56k83m0K66K27R9k09l47n5K74K73O4k32l30l7K48L43o1k35k63
966b76lL17J44J22k91k47n8K72K50M2k31k79JK45J91N1k61k16l7K07L57j16j54
989C0k71m8K85K13L5k11k62NJ91K12K1j74k59m5K69J76J18k30k14p0K15K25K5
1012B36k21k07NJ24K75n2j60k23j2K43J56P0k30k10K0J86J55P8k10j57m4J60J71
1035A53O0k19k01j6J85K05L7j58j92k0J49J60pj13k17j3J69K02rj45k11k6J46
1058h1K24O5j39k34OJ74J13O1j13k11l7J51J89l1j60j61K5J53J72Nj59j63K7J07
$$ y = [333, 383, 58, -321, -348, -101, 310, 363, 18, -255, -344, 7, 279, 344, 102, -296, -350, -92, 251, 331, 24, -322, -338, -54, 291, 363, 74, -275, -317, -23, 281, 306, 11, -308, -339, -49, 277, 313, 44, -233, -294, -36, 243, 302, 62, -266, -342, 12, 249, 278, 22, -261, -301, -35, 192, 291, 82, -265, -320, -46, 227, 291, 59, -271, -308, -60, 283, 222, -13, -276, -279, 38, 182, 304, 13, -234, -292, -20, 230, 272, 41, -238, -237, 8, 199, 250, -11, -227, -264, -57, 300, 184, 30, -241, -289, -4, 209, 244, 33, -229, -224, -33, 179, 200, 26, -233, -278, -9, 167, 285, 55, -159, -229, -14, 211, 236, 15, -192, -187, -63, 212, 160, 0, -223, -235, 8, 164, 234, 4, -206, -186, 0, 155, 233, 23, -134, -178, -18, 153, 213, -6, -207, -223, -38, 167, 204, 46, -146, -166, -17, 143, 136, 23, -194, -207, -38, 164, 155, 10, -201, -227, -81, 143, 208, 69, -165, -159, 15, 128, 189, 76, -135, -172, -21, 168, 137, -23, -184, -159, -6, 166, 171, 12, -151, -124, -17]
1082a7J56L2r1k07q2J62J78mn5k36pJ89J32l6j11j23n1J87J12L4j65j19l8J15
1106d5J26K2j03j30%J54J52m9j08j29l4J68R5O9k06j31RJ56P8J4q0j24J0M2J53
1131A09K2j47o6o9J01J43J7j19r9n2J44J44L1j38j26k8Q3J89l1j6j70l0J59QQ0
1156A39j43j16K5N3J95p1o6j03n2P8J86Kj07j16jO4J46j4n6j60K9Q2J14o0l8j51
1182a41N2J28Q5l0j35n2mJ24Q7J7p6j62j0J00Q4M1j58n1J8R9J02l3j02m6m3Q1
1208b5R5O2j14j18N6pM8R6j08o8l7J01J24J5j16j36M3O6J19l7m7j04j1Q6R4km4
1235C1j10N6L1P9J8j03q2K0J5J25j2l7q0j8Q1O2k4k0q6o4J55J1J3o3p8qJ04Q4
1263A00m9j0p7MJ07K9j22Op5J6R7L8L0j25k3lJ16N4m2o0j17N6K5R8o8m0J6j1L1
$$ y = [-17, 139, 171, 80, -127, -209, -47, 131, 127, 72, -164, -171, 18, 150, 114, 3, -120, -171, 16, 128, 162, -3, -122, -160, -45, 81, 103, 0, -130, -130, 24, 176, 127, 19, -110, -144, 24, 119, 188, -18, -149, -140, 16, 94, 108, 28, -96, -86, -44, 109, 131, -16, -82, -151, -50, 93, 110, -9, -108, -160, -16, 128, 159, 21, -105, -133, -50, 139, 108, 92, -78, -108, 51, 59, 139, -4, -120, -95, -42, 153, 82, 16, -87, -139, -61, 125, 127, 20, -96, -97, -33, 113, 99, 43, -117, -88, -6, 108, 48, 10, -141, -89, 39, 124, 94, -41, -93, -97, 27, 114, 131, 55, -107, -117, -17, 67, 108, -50, -101, -83, 16, 118, 85, -17, -63, -106, -25, 70, 132, 18, -100, -44, -51, -3, 93, -15, -83, -120, -19, 105, 120, 4, -132, -89, -23, 96, 59, 12, -92, -103, -17, 77, 75, 31, -79, -23, 8, 87, 105, 2, -80, -60, -45, 80, 68, 31, -49, -67, 14, 76, 52, 32, -54, -118, 37, 48, 61, -2, -80, -88, 16, 100, 51, 41, -36, -32, 75, 104, -18, -12, -87, -71, 26, 64, 94, -31, -54, -57, 59, 113, 71, 11, -106, -50, -25, 73, 5, -35, -19, -30, 1]
1292AP0Qj04m3k6N3M9L7m9p9K0N1K7j6on6NK9Q5m8j9m3jL9L7J9o6Qn8O6P6l5j4
1325A7n8m7N0J17n8o4J0k8N5R3n6n2MkK5N9m0r4JK3L5N8om0r1K1J09m0N1lj16
1356f7j1Q7qL6m7n4L3N5J9K7m7m2pK5O5kmj36kR9L3ko7m7J1NQ2Pl6Rl2qL7N6o3
1391Dr8N1M4rM5m5l2K7l1P6N1r2K9k4L8Nj5Nq0L9M6l0J2j1m4lM0jK4n9M3j05R6
1424dpM9k3m6n2P4L6j0j7m7NO3j8L6L6j16N4KOlJ0o2kR2j7l2jml2pM0K2K2o2k3
1459c8K1L0K4rp8M7K5l9M9n4K1l6O9k9N5r2pO4Rj5n6R0r5LK9J8k8M4j5r8O7N6
1491C2Jq0PlM0K0k0J2J2k3l0L4k1O4j22K2L9j3N2k3L7l9nJ6J6j3m1J7l2P3n1O2
1523D0r1J3JJ3O8q5K4rN7J0n6J1j5j8O7Ln0L0n5K1N3J2n1l1K1L6p1P7mJ4m8MJ4
$$ y = [1, 71, 79, -25, -68, -94, -41, 8, 45, -4, -83, -63, -12, 15, -1, -7, -63, -58, -29, 56, 8, -11, -54, -55, -16, 21, 40, -26, -18, -76, -10, 66, 31, 17, -41, -88, -38, 79, 21, -43, -33, -61, -6, 87, 31, -21, -17, -19, 6, 65, 25, -69, -68, -45, -10, 48, 42, 2, -89, -68, 41, 1, 52, 49, -67, -78, 9, 1, 37, -10, -64, -31, 24, 43, 70, 23, -19, -26, -1, 64, 62, 58, -78, -80, 19, 52, 50, -17, -64, -53, -48, 34, 41, 5, 14, -18, -26, 11, 67, 4, -94, -43, 1, -8, 37, -8, -40, -13, -44, 32, 83, -9, 20, -4, 34, 39, 24, 29, -51, -12, 34, 4, 16, 5, -39, -42, -2, -3, 21, -38, 5, -100, -4, -11, 38, 15, -31, -83, -9, 27, 17, 0, -47, -42, 21, 3, 39, 75, -41, 13, 15, 21, 18, 28, -34, -36, 56, 39, 7, 6, 2, -30, -37, 3, 25, 47, -15, -38, -17, 13, 37, 28, -50, -3, 22, -17, 32, -22, -1, -37, 32, 3, 58, -34, -41, 23, 32, 17, -39, 51, -44, -41, -12, 6, -22, 22, 7, -91, -24, 32, 33, -47, -40, -43, -3, 17, -3, 9, 21, -2, -32, 2, -19, 45, -77, -55, -16, -29, 23, 0, 37, -2, -7, 9, 25, 12, -29, -12, -44, 29, -22, 40, -51, -38, -37, -24, 44, -41, -17, -26, 31, 41, -15, -4, -19, -37, 30, 33, -17, 13, -42, -21, 32, 44, -7, -38, -17, 19, -52, 25, 21, 35, -13, -9, 5]
1556Ek1O7m0m5k8Q9MK1p7K9k1RL7%J4j5o6M9MK7NJ3Oo9K1K2r4J3N8l5L2n8L2n1
1590f3M8k5K1K0L8n5j4j4L1L8l6m2L3L8j2ql9L9k0rP6l3l1%M2k9M8mnl1l8M8l6
1623b4N3n5M1l8K9l4O3o6RLJ0JM2p0K7K0q0M8K8k7k9N6o0N4J2Mk0j0J3k2N9o2
1655b5L9j0J9p8N4L4o4N2Jk3mk3l0L2J7L4QRn7nOK6l4L7L7r6J2N7m4j3N2lo8N1
1689@k9K7n3J6L5L1p7M8j3l4N8qj8K8J2m7N6j4l0M3r6K5j4L9N7n9Qk9NN9n7OO
1722a9l5L5Qj8KK6NL8j3k3K5n9O1k8jL4o4L4m0Q7K1p6N2q9Q4o1K6M8k3k6l2oL8
1755A1pL1j8m3NL9rRk8jk6P5l7j1l7Q5m1J0M6o3L9n5K4L5k8JM7n5L2n2L8j2nk2
1789b3MM4omKO4o7m2j0L1n5M1L4J6rlm0N5l0J1l2N4o3Q0n5K2Jq7M4k6Q3Nn6N3
$$ y = [5, -16, 51, 11, -34, -62, 27, 31, 52, -25, 4, -17, -8, 29, 29, 43, 28, -38, 11, 15, 42, 47, 60, 66, -3, 18, 40, -54, -41, 17, -18, 14, -44, -12, -63, -15, -40, -19, 1, 39, -16, -30, -44, -13, 25, -11, -53, -20, 18, 6, -2, -41, -2, -22, -31, 45, 12, -19, -19, 23, -6, 42, 38, 33, 2, -36, 12, -24, 29, -26, 15, -23, 6, -28, 35, -31, -22, -19, -9, -8, 34, -36, -9, 11, -69, -21, 7, -20, -49, 7, -53, 1, 13, 17, -3, -13, 0, -22, 37, -25, 14, 4, 23, -55, -1, 33, -31, 21, 22, -1, -5, -28, -58, -26, -9, 25, 33, 42, -15, -20, -14, 12, -22, 15, 52, -44, -32, 25, -19, -32, 20, 17, -51, 0, -29, -2, -55, -39, -4, 27, -50, -2, -15, -49, 9, 1, -17, 11, 23, -24, 32, 18, -12, 31, -65, -40, -54, -15, 42, -17, -9, -38, -33, 26, -31, -25, -19, -54, -19, -11, -29, -27, -1, 4, 42, 29, 6, 31, -28, 33, 5, 4, 38, -26, 8, -32, 55, 76, 0, 52, -37, 47, -14, 12, 60, 37, 11, -21, -27, 11, 4, 35, 17, -26, -21, 18, 9, 18, -10, -11, -37, 38, 1, -10, -47, 38, -3, 7, 53, -10, 29, -26, -2, 33, 5, 6, 53, -2, 30, -22, 16, 4, -1, -23, -19, 25, 19, 15, 17, 81, 14, -28, -38, -7, -62, -21, 13, 29, 20, 17, -23, 32, 2, 13, -19, 35, -28, 52, -3, 19, 20, -67, -23, -49, 34, 39, -17, 36]
1823C6K7pJ7k2pk6N4q7kM7J1pm3MJ8K8p0KL9K5n7rj0N2n4M9k7L4MK8k6j5nN4k0
1858C5p0JM4K3m9J0K0l5j2rK4M6n0K1j9j6N4k2K6p1Q1j2n7O4o0K2j5K7ok0L9j0
1890Dl3M9pk0J8n4J5O2o9O9j5n6%O9k7J3j9Lj2J5J8kM4n4N4n5m9O3k7J3k3L3m2
1923b2KM0Pk1M3m5l3K4K4l4O4q5P8m5j5J7pK4j2qkl4K7J6k1K7oOJ1j4p4P3J6q4
1957f3J11k6k9L0m7L4M5m4l7L1l3j5J0k3P3l2l3M8MJ5p3K7J1oO1j13L9Q0k9k9
1987a3L2j5N0m7l4N8o3k6N0K6p4MpN5nLl1O2k8K5k3KL8j6j2qk2Nm2JP8k4M2k2
2021A9j4oOj9kL2k9p1R2K7j8Qn7O1ql7kK2oK5qk7kL6kk2rJ2j8Nk1RJ5M1j6j5j8
2058a7K3Qj0OnMq4N4M1j8o5O2p9R1J6l1Rj2pRJ3Oj1Mk2n5Q9lj1J6J8n6O1q3N7
$$ y = [36, 63, 56, 73, 51, 44, 18, 72, -15, -17, 30, 41, 34, -9, -5, 13, 41, -29, -27, 12, 37, -20, -29, -39, 13, -41, 8, -19, 15, 19, 47, 21, 6, 1, 55, 35, -35, -34, 10, 33, -16, -6, 14, -21, -33, -42, -18, 28, -22, -1, -20, -36, 18, -4, 22, -49, 32, 20, -37, 27, -33, -11, -26, 1, -5, -25, 14, 4, -29, 20, 13, -7, 11, -43, -28, 34, -35, 34, 19, -37, -37, 32, 5, 18, -1, 2, -10, 5, 23, 21, 65, 11, 65, 10, -39, 24, -3, 10, -13, 20, -22, -20, 20, 27, 6, 49, 4, -29, -5, 19, -15, 49, -36, 42, -3, -18, -1, -8, 16, 4, -4, -6, -40, -13, 3, -18, 9, 3, 9, 20, 6, -68, 5, 21, -63, 48, 22, -7, 23, -24, 10, 55, 11, -26, 5, -28, -43, -33, -56, 17, -15, -48, 0, 4, 19, -54, -27, -16, -22, 39, -74, -35, 45, 16, -13, 19, 4, 54, 7, -27, 31, -32, -58, -8, 18, -56, -52, -59, -4, -9, -6, -37, 25, -3, 22, -1, 1, 39, 23, 11, 3, -19, -14, -56, -55, 23, -1, 41, 19, 5, -1, 5, -14, -16, 16, -13, -84, 8, 35, 17, 25, -32, 29, 21, -16, -18, 4, -2, 23, 15, -12, -14, 22, 20, -2, -11, 1, -17, -12, -33, -24, -9, 32, 16, 1, -17, 6, 14, 4, 10, 5, 9, -75, -21, 20, 2, -63, -1, -80, 11, 27, -4, 5, -7, -14, -5, 8, 14, 3, 7, -15, -70, 19, 16, 5, 21, 39, -17, 44, -39, 18]
2093A8K0m6P6o3JOm9L2K4j8J9%mj1L3k9%L1l4j1Jk5PK0j3L7L0n2Ll0L7l8Nj5K9
2128ik6M1J0Qn8L3Ok0K4J8q8K8K8j7LlMK9l4K7m2K2lM6nk6K5L4p4L3j1L0l5j9
2162b1P6j7j8K4j10O7m6R4m9m8R1l5oJ3ok5K4k0O4k1o4M3Rm1%K4k4QO7r8K9k1
2194c7M0k5K0Km2J1R3p4O0j8l6J0J7L9r4KO2j4o3J3P9j1nj7k3Jk9M3j7mpkP0m8
2228dJ1Q7j24L0K7n2m8J10l1l4N5p1Q7k9k8K2Qj6M9p0N3l5J8qJ9n0jM0k3lL7n
2260B1j3L1qn9k7K2k%P6p7N6k6K2Rl7M8L6j17P0nJ6k7j5K3Po2K3O2q4L0RRk7J7
2294AjM2p1K6J5l8Q4o5jmk2L3rmK2LPk5k3J2m3M1OqJ1P0r4M2lL2ojK0n6N7n8J5
2331Gj5%N3m4k2J0Rj9NK7j1Knj3M7j4pJ3l7O3k5o7L8J7K5n4jlNNL1l3K4M9j9l9
$$ y = [18, 38, -8, 68, 5, 6, 12, -37, -5, 19, 1, 20, 20, 16, 5, 38, 9, 9, 40, 6, -5, -4, -29, -22, -2, -15, 22, 52, 0, 3, -27, 10, -28, -23, -38, -9, -35, 6, 16, 24, -34, -1, 5, -15, 9, 27, -61, -33, -5, -22, -19, -22, -18, 11, -23, 4, -38, -16, -19, 27, 22, -4, 21, 55, -19, 14, 3, 33, -2, -21, 55, 38, 20, 44, -66, 1, -45, 49, 0, -48, 43, 8, 2, 15, 9, -16, 8, -12, 52, 31, -33, 10, 19, -22, -22, 2, -22, -14, 53, -45, -16, -37, 3, -22, -2, 0, -42, -31, 62, -12, 48, 30, -6, 4, 21, 60, -34, -32, 30, 16, -47, -34, 45, 34, 29, 12, -11, -10, -39, 4, -13, -17, -24, -26, 44, -4, 7, 94, -30, 0, 27, -25, -73, 37, 6, -28, 27, -44, 43, 14, -14, 8, 16, 0, 49, -21, 32, -3, 15, 7, 26, -24, -25, 15, -8, -11, 26, 21, 8, 39, 31, -28, -55, -33, -35, -35, 41, -36, 20, -6, 16, 25, -12, 36, 72, -45, 25, 20, 36, 9, -6, 17, 24, -38, -15, 47, -37, -7, 2, 11, -16, 1, 0, 42, -29, -3, 12, -26, 58, -7, -8, -12, -34, -1, -10, -14, 8, 11, 18, -7, -30, -18, -61, -20, -14, -22, -11, 59, -35, 7, 4, 36, 30, 29, 49, -7, 50, -8, 7, -8, -8, 45, 1, -21, -11, -2, -21, -16, 11, 0, 2, -3, -16, 31, 17, 10, 23, -14, 49, 24, -43, -5, 12, 37, -17, -18, -21, -16, -11, 20, -13, 11, 60, 41, 2]
2367BJ9J5l6j0qML8n2%O1JJ0q6L5M7p3lJ02o3J3%pkk8O9j3No4N2J2j5j2rK4n3
2402b5L3j3K6n3O2k4O0o4N1l5j3L3n4M4RL4pp6O6j5n5K2k3K5Rqn2L5L5Krn9N1
2435A2j7Lk8J6k7k7P3l5O6j2j2j0k4L5kl3j1P7k3m0L5KL5l4J2n0L0l9PJ2pQ9j05
2468c2J0K5pJ4QJ6l6J7M9m1j3%O7j8m4Rk8n8N4N7p9K3N0j02P9Rk5j7J3j5J4QJ
2501HL2l9j7mN3k9L1K1l8Oj8L3nK5q7L4pj6M0l2%jRL6M5o3rk2L1ol8N1Jl3p6O7
2537a7M4m8nO3l1m3L6l1P0l5j9L0K1k2j8L1po8j2O8j1j9L5j6oK1J0K4k3k5o3M0
2569b6M4J6p5K8P8m7JJ4qn3K4QQJj9K9J6m2Ok4L2j5L9k7J3l9%J2j0MPM0j8j9P
2604Ejo1J8P0m0K0J8o1K3J0j4N1Po0m2K8J7M4j3k9Nkk9P8m0j1K6k9N0n8l2N4j5
$$ y = [2, 21, 36, 0, -10, -18, -14, 24, -28, -28, 33, 34, 44, -42, -7, 40, -33, -36, 66, 3, 16, 16, 9, 7, -21, 48, 35, 40, -24, 28, 40, 25, 13, 4, 28, -25, 8, -5, 21, -32, 30, 6, 66, 2, 53, 18, 5, 38, -16, 28, 37, 71, 64, -12, 54, 39, -16, 6, -17, 8, 17, 9, -43, -8, 27, 29, 20, -39, 12, -5, -2, -30, -14, -41, -68, 5, -30, 36, 24, 12, 2, -22, 13, 11, -22, -33, 44, 21, -19, 16, 18, 53, 19, 31, -19, 11, -28, -21, -9, -16, 73, -32, -22, 3, -4, 10, 18, 34, -2, 15, 64, 23, 10, 10, 77, 59, 15, 24, -4, -62, -8, 49, -30, -7, 43, -59, 20, 29, 4, -13, 0, -15, -1, 7, 8, 40, 1, -16, -20, 33, 4, 35, 56, 18, 24, 6, 39, 34, 59, -28, 6, -1, -17, 23, -9, -9, -10, -1, 35, 80, 17, 8, -14, 17, 11, -27, 24, 25, -8, -84, -17, 27, -21, -26, 37, 6, -37, -1, -32, 38, 3, -16, 14, 35, 13, -5, 26, 19, -49, -61, 7, -4, -23, 12, -4, -10, 11, 21, 45, 22, -3, -66, -26, 18, 34, -41, -13, 65, 18, 19, 33, 25, -28, -4, 4, 12, 13, -6, 23, 39, -3, 3, -21, 11, -4, 35, 8, 21, -18, -18, -6, -16, -12, -5, 35, 17, -2, 5, 4, -57, -39, 31, -9, 11, 29, -32, -9, 1, -13, 38, 45, -15, -57, -29, -12, 32, 19, -10, -5, -7, -36, 42, 2, -9, 17, -12, 38, -20, -52, 2, -13]
2637a3L9K0m7l0M2N2p7N5l2j3rL8l5KK1j4m6P4k7KKPp3J07k3m0M3j3M5%l6k3%
2670bm3P6l4Pj3J0rK9j5j2oM0M3n6k3k0N4o2k3Q2l8L7M8j02J7m0MJ9QM5p6L3K5
2703Ck7j7M9O0l4J0k1n8k0K4O3m8M5J0oj7l1N9k6Pj8n3P2J5o5K3K6n4K6N5q9L3
2735dK1k1pJ5L3%m8LkL9k7prL6n5K5j2J8jppJ0Oomj0pk2N4P4k8Nk5k8P0r0M1k0
2773CN1l9J8m0LRk8n7P5J6k7J0J3m4K1O1j02K6K0J0NJ3nk4L1l4P7n0L5o9M3j6
2805En7N2PMJ3Jj4j9L1J2j7J7Jl0K1l8mJ3JkMQRk6Q7p0j8O1p4L6K1k2L2k8j8j3
2841a4l1O3mK8m8QL0m9j2l6M0K0k5K7j7J1J5J1nj3k9L3rL1pm9l5P5l2K5L%%OJ1
2876B2k0Q0j01m8P8%K4K5k8m7M0k4L0k7l8nM7k6j0K0Rj5j0N5j2l3K5o1L7K1m6
$$ y = [-13, 26, 46, -1, -31, 11, 63, -14, 41, 9, -4, -13, 25, -10, -8, 13, -1, -47, 27, 0, 2, 4, 11, -62, 45, 22, -18, 25, 12, 57, 57, 21, -2, -2, -45, 31, -3, 4, -9, 1, -8, 21, 6, -6, -12, 28, 71, 15, -8, -28, 26, -36, -59, 23, -15, 22, 70, -32, -15, -55, -51, -32, -24, 21, -55, -22, 3, -24, -41, 8, 68, 34, 44, 23, -35, -55, -31, 32, -16, 29, 39, 33, 16, -15, 44, 18, 25, 7, -46, 26, 41, -24, -1, 25, -29, -3, 52, -37, -4, 17, -4, -11, 4, 37, 37, -11, -8, -10, 29, 2, -5, -14, 22, -33, -8, -20, -2, -3, -10, -17, -7, -1, -7, -11, -21, -28, -50, 4, 78, 50, 55, 30, 2, 72, -18, 23, 3, 54, 15, 33, -7, -4, 5, -23, -80, -5, 11, -16, -6, 7, -37, -16, 45, -57, -31, -11, -1, 4, 17, 12, -12, 19, -15, 62, 12, 47, -22, 21, 5, -52, 0, 7, 11, 24, 25, 11, -8, 23, 35, 18, 35, 36, 6, 27, -11, -15, -2, -1, -3, 1, 9, 18, -8, 79, 9, -9, 52, -22, 14, 35, 13, 45, 17, -1, -14, -45, 18, 14, 42, -6, 2, 32, -17, -29, -65, -25, -5, -30, -3, -20, -9, 6, 17, 12, -1, -30, 3, -6, 25, 18, -31, -66, 9, -23, 2, 5, 5, 5, 11, 22, 2, 82, -19, -67, 11, 11, 35, 60, 32, -15, 25, 1, 31, 4, -34, -39, 8, -18, -28, -8, 1, -14, -24, 31, 19, -14, 11, -50, -13, 8, -38]
2907c8R3n4L4j4ol3J8O%m5N4K3k6J0l3N5n8%K0kJ1k1j2J04r7PL1p7Q0l3%l6mQ6
2941D3m6RJ7j4n0M2oj6O2m6qlM5k5k1nL5o9Rm0R2OJ4Lk3oJ2o5K7J5M3l1N6o4J
2976gL7n3M1m4K8Lj7L5m1J6j6LL3K1J1l1nk4N2k9n9L7P0r3N4rL2l8l1rM1j6M4
3009C6k4m9K1kO6k4jk9K2k0N0o1L3Lm2L9j9m6M2J5J4m8j1L9m3N1k3Jl2J4M7K2
3041D1j4m8j4L5L6j3k6L4J0J4p3j0K1j8k0O9ml9L9k6K0o1N0qk9L0J3j9l7J4L9
3072Fj4K0l2M9o7M5j2l6N3M6m7o5O0K1k4J5J6m9j0L6o1O6k5j3rP9p5N3m3O1k3
3103B1m4l4j2N7l7K0M7l3j2K4l6K6O1n7qNM1p9M7M9l6nj4M6j1m4M9Kn1M9j8k4
3135a1J6j7k6L1K1K0j5j4LK4m1j7nK6M5l0oQJ2K3r1O9L2n2m7M9j0M2l0J5j2k6
$$ y = [-38, 55, 1, 35, 21, 15, -18, 0, 6, 6, -39, 15, 38, 12, 22, -11, 44, -14, -14, 6, 4, 15, -6, -18, 86, -11, -4, 27, -50, 30, -3, -3, -39, -43, 43, -3, 6, 23, 9, -41, 1, -5, -21, 41, -5, -13, -16, 29, 4, -17, -22, 13, -56, -47, -87, 5, 11, 25, 28, 5, -1, 11, -54, -27, -12, 31, 0, 56, -8, -7, 30, -23, 18, -26, 2, 5, -12, 23, -18, -2, -18, -15, 18, 39, 50, 19, 14, -10, 42, 13, -46, -9, 61, -32, 22, 13, 45, 7, -24, -33, 8, -8, 36, 12, -37, -16, -18, 48, 24, 23, -6, 16, -4, 46, -15, 18, 21, -21, 18, -1, -47, -5, 10, 24, -24, -35, 4, -39, 12, -11, -10, -42, -28, 19, 41, 27, -21, -35, 0, 36, 23, -3, 31, 41, 55, -18, -28, -7, -25, -45, 24, 20, -19, 20, -6, 14, -47, 3, -5, -34, -4, 9, -10, -47, -33, 6, -8, 12, -20, 29, -38, 7, -5, -41, 12, 58, 11, -54, 6, 27, 3, 18, 34, -15, -25, 11, -50, 16, -9, -22, -31, 48, -27, 26, -17, 44, 21, -23, -57, -69, -12, -49, -29, 18, -15, -27, -3, -39, -13, 48, -9, -17, -12, 29, -50, -3, 46, 10, 5, -9, 37, 26, -18, 31, 33, -18, 31, 13, -11, 5, -12, -38, -7, 14, 34, 19, 5, 8, 32, -9, -26, -31, -5, 40, 10, 4, 12, 24, 47, -44, 25, 57, 5, -42, 7, -3, 39, 9, 24, 12, -14]
3167a4J3kK0nK3l6M1lm2J9j5l2K7K4kj3j5k0M0J9N5m4j0Mk9j1Rrj7K0JnON7n6
3202blm5O1j8J2l7J02q3j4M4J5p6L3K7Om7M0j1J9n5N5J1L3j11P7l5Jj8L0o8J9
3233c8M7lm7O1M1j09Q8o8J8K0kj2j1j8jK2nJ9N6q1L5oK9m0M2m4JKO2l9lk4J7k2
3267a3q3Q8Mon4O6K1j9jL1j5J1m7jL1K2l8LK2o4N7m8M0J0j8J5L0j4j5k6jpO7j07
3301e9O6mk1N9m1M6j03M3L0l7M6k6k5M5n7R0p2N1o5LL0K6j4n3RL6J0k4N0l7l8
3332c6J01r1nRnL8k6j3O1k7Np7R0K3m4J9q6Q6J7n9J4O2j09L6PL1m%J6m7j4j9k7
3365g4L6N5M1n4k1NK8M6k1o6M3K3q5L6K5k3n7R0k0l5J2j6J0O1k4L6n5k3O6l6J9
3396B2j4JrNjL2o3L7l8K0M4k0pL3p8L1K0n2K9J7k6QK2j1L9ro2K3K0j9j3J4L6k3
$$ y = [-14, -1, -3, 17, 12, 35, -1, 40, 37, -5, 14, -1, -33, -6, 18, 16, 3, -12, -32, 8, 27, 82, 38, 28, 32, 3, -8, 1, -8, -25, -5, -4, -9, -3, 54, -2, -5, -50, 11, -7, 5, -32, 70, -13, -27, 17, 32, -44, -11, 16, 22, -25, 15, 4, 23, -32, 23, 34, 67, -44, 33, -2, -1, -19, 11, -57, -38, 9, 6, -41, 20, 61, -48, 40, -28, -10, 10, 8, -4, -15, -33, -34, -12, -17, 2, 58, -23, 12, 6, 35, -5, 37, -7, -6, -4, 58, 19, 16, -8, 9, -13, -96, -8, -4, -10, -64, 2, 23, 4, 3, 34, 19, 30, -17, -18, 13, 35, -3, 0, 22, -42, 15, -33, 7, 17, -1, 14, 44, 30, 15, -11, -12, -19, 48, -59, 7, 3, -18, 41, 0, 46, -57, -14, 16, -21, 25, -1, -26, 19, -38, 52, -20, 31, -34, -31, -1, 25, 11, -42, -33, 3, 13, -11, 39, 2, -36, 65, -26, -31, -22, -27, 11, -15, -28, 33, 6, 11, -66, 24, 47, 3, 22, -64, 22, 39, -20, -6, 56, -53, -17, -10, 21, 17, 17, 33, -14, -28, -47, -74, -38, 17, 58, 4, -17, -12, 16, 62, 41, -25, 18, 41, -44, -8, 17, -6, -63, 27, 7, -28, -16, -32, -22, 39, 15, 51, -4, -27, 39, 3, 22, 8, 9, 0, 5, 4, 36, -27, 10, -28, -8, 36, 16, 9, 42, -36, -5, 15, -37, -8, 9, -17, -9, 13, 2, 41, 32, -30, -7, 13, -6, -19, -5, 31, 8]
3430HJ4J4m4J6m6N9k0l1P3l3p7R2k1M0k5qj8M9m7j0L5L7n6m3jK1O0k2Ml2J3n5
3462e4N4j6M0Rn1K2J2l4J8Kk1N0l4lL2m1k9O8m1K9j5m6P5Kjk8J7p3J4J5N2l1M
3495cJJ5j2j9NJ2qK5m2P9o6L4o8N2j3L1k6NKk7%K4kM1m7LjJ3j0J6k2j2jN9p1J0
3531b3k3O7n7J4OO9o3j2j7MO2Qp0KP0JJ6q3J3JJ03j05L9k0j3lK0L8k9j5K3Ll6
3564a0M6l0j1k7RJ0K3l6J6rM0L3l3k8jL0k9RL0q1P7n7K9K7k8K9k0j6K0LJ9o5J8
3597a3J8L2k8l4N5pk4K5m5O3l1prj4l6K1J2M8rm3M6ll5M5J3p5k3N8Npk0m0N4R
3631Aj5j7K3O5rk7Mo7M5j3M1k4l9M2j5K1qO7q9P4l0k0L0j8j1m8L2o9Q3k2k6j2
3663e1Q9m5N1pnm1n2J34o9%j4Kj1M9nlJl1rM6m8RK3l9j7OO3m4j0K9O4J5q3n3L2
$$ y = [8, 22, 36, -8, 8, -38, 21, 1, -30, 43, 10, -67, 25, 4, 44, 19, 11, -7, 42, -5, -15, 20, 57, 1, -42, -43, -22, 38, 16, 20, -12, 1, -54, 0, -16, 24, 33, -18, 4, 16, -18, 0, 2, -19, 31, -3, -6, 26, -15, -44, 24, -17, 12, -3, -49, 26, 28, 27, -1, 16, -57, -43, -28, 24, -7, -3, -2, 13, 1, -18, -13, -1, -9, 16, -26, 53, -13, 21, -47, 5, -8, 23, -3, 2, 4, -23, -23, 1, -1, 40, -7, -4, -5, 8, -2, 14, -8, -20, -21, 38, -33, -23, -46, 21, -36, -22, -16, 53, -10, -22, -39, -35, 27, 35, -35, -33, 37, 38, 54, -29, -16, -15, 88, -17, 22, 2, -11, -14, 6, 44, 15, 0, 23, 26, -10, 36, 6, -5, -32, -23, -13, 10, -26, -10, -19, 21, 54, 21, -7, -8, 22, -7, 2, 32, -49, 28, -29, 0, 27, -1, 28, 8, -8, 12, 15, 34, -31, -13, 5, 37, 9, -25, 30, 23, -1, 24, -21, 42, 11, 4, -5, -19, -55, -34, -22, 26, 17, -26, 20, 17, -18, 27, 40, -35, -58, 0, 5, -2, -22, -62, -8, 1, -14, -31, -8, 57, 48, 21, 25, -42, 3, -10, 31, 7, -32, 10, -5, 16, 8, 75, -14, 60, 30, 10, 40, 22, 11, -37, -5, -74, 9, -13, -39, -51, 38, -7, 44, 37, 32, -9, -61, 73, 4, 4, -10, -8, -19, 30, 25, 22, 23, -8, -17, 29, -19, -10, 13, -26, -43, -37, 26, -18, -28, 1, 65, 80, -3, -56, -24]
3698b4lK0J8j7j2j8J1MK9l5J5j0N3oK9l1n7N1l0J9l4K7k7J7O3j11Q3m0M0k8j5
3729a9j3O4j9Pl5kM3l0LMKl3K3lN5o1l4L8Nl0J4J5L4Qm6M0j5l8RQ1j22O4K5l9
3763eK4jm1kN0K7o4pk9N2j1L8M6j03J1K3rQm3P8j0lJ5m1N0m2k9K3J4k0j5k1M7
3796A0K1j1jk8m2P3m6Qm5J11p6N4k8j4K3J1K2m1j8K5KK5Pj6k9K6n1NmJ9j4J6L2
3829B6nl4j2Ll1N6j7j0j7K7P5n5Jjl3L5m0L8o8R6o0N5N1j41L5LJ9j3PK4n5J1R4
3862F4o3qN3p6K5mL5J5j20R7Kj4k5K5k7M0l5K5nJ6Kk7N1l8j0J0l9K4OK0K6n6M4
3895C3p6O3j6K6l3N4o0M8j4k3N6j19L5L3j4K1Nj1j5Rn3M4K6Jj8Rk5j4N5q7O4j1
3927gQK1n3M8n2M6k9N5k1j8OQlj7J7rlJ9J0j5k0j6L4o5N3J6qo0L4J4M7m1J6n9
$$ y = [-24, -27, -7, 11, -6, -18, -36, -25, -21, 8, -27, -12, -22, 31, 25, 54, 23, -34, 17, -13, 6, -28, -1, -28, -11, 52, -59, 24, -16, 24, -4, -19, -32, 32, 13, 20, -15, -17, 26, -4, -1, 3, 5, -28, -5, -8, 47, -14, -48, -10, -5, -35, -21, -6, 28, 36, -10, 30, 15, -23, -14, 67, -55, 9, 34, -5, 19, 18, -23, -25, 25, 52, -12, -19, -48, 4, -7, 31, 77, -26, -15, 8, -1, 7, -36, 42, 32, 29, 44, 3, 53, 11, -18, 5, 19, -1, -16, -37, 10, 31, 20, 19, -9, -51, 22, -24, -16, -61, 50, -26, 28, 0, -14, 9, 20, 42, 1, -17, 8, 10, 35, 42, 26, -3, 23, -28, -23, -27, -8, -22, -6, 26, 21, -13, -25, -22, -53, 3, -14, -24, -41, -14, 61, 6, 7, 6, -27, 8, -32, 6, -62, 34, -26, 29, 80, -61, -26, -23, -4, -17, -10, 14, -41, -30, 64, 1, -7, 46, -30, -5, -9, 26, 41, -79, 18, 20, 6, -19, 6, -21, 19, -16, 9, 4, 20, 22, -5, 46, 8, -2, 8, -31, -7, -1, 19, 45, -11, 33, -43, 20, 4, 30, -3, 51, -9, 39, 25, 2, 58, -61, -26, 7, -7, 14, 19, 8, -7, 2, -51, -7, 19, 20, 2, 11, -14, -28, 27, -60, 4, -7, 1, 22, -31, 17, -35, 11, -18, 37, 16, -2, 4, 12, 9, -8, 9, 0, -3, 16, 26, 11, -9, -25, 9, -56, -3, 13, 5, -55, -21, -7, 40, -1, 15, -44]
3961d4O6l4J8K4J0m8L3m9JK1j8jK9j0L7n6K2J6K6o6N7p0J0M4l3J8J2Qj2NqM0n8
3994a0NJ6mo3J9K3pK4M0l9KkO9m3m8P8n7J7Rj1j1MqoNRk3J7Jj5rk5Q6l4J1J6j5
4031B1j3K2K0q5N9n7j7L7nO0j9n2J7J6N4p5K4M2o5K8jL9j01K0j3P7m9K7l5L7L2
4062D5mRn4J3J6J1n9l9J00j4l0j7j1K9J5Lk4J4K2k1ljk9O8n9QK2M3m0J0mj2j6
4095ikm7M8L2k3j4k1K7Nj1oL5k9K6j4N2l0p6P1KJ8Pm1N1n1kk1mK3K6om1K1nnK8
4131A4Jl5Nl4M5JQlM3p3O6o1L2L0m8k7%Q8j1l8M2o6K3Nk8N9k3k4jojL1o9L9j3
4166b9M8j2n4N0j0Jj9O0l7j1j3QN1n9O7o4M7n1M8k5QK0Jj9OKJ5p1L7K9m7O5m2
4199@L0Qn2%K5j2K3On9j0P8l3ok0lJ6L3j2LJ9jl6pj2K0K3p0N0K1Nj0j6K0Qo4L9
$$ y = [-44, 22, -12, 6, 30, 40, -8, 25, -24, -23, -2, -20, -21, 8, -2, 35, -21, 1, 17, 43, -23, 34, -36, -26, 18, -15, 3, 15, 23, 11, 16, 8, 48, -10, -5, 11, 7, -56, -37, -14, -21, 3, 43, 4, 6, 4, 73, 30, -18, 60, 3, 20, 29, 18, 7, 11, 3, -3, 2, 11, -12, 5, 6, -9, -18, -43, 43, 9, 20, 36, 21, 8, 30, 50, -35, 24, -33, -50, -13, -18, 42, 23, -29, -12, 4, 58, -17, 7, 49, -16, 12, 11, 50, -51, -31, -44, 33, -16, 11, -24, 13, 45, 41, 50, -4, 9, 25, 36, -23, -62, 38, 24, -6, -23, -34, -5, 10, 13, -11, 3, 25, 4, 1, 0, -29, 39, -20, -12, 10, 53, 13, 23, 19, 7, -9, -11, -58, -10, 22, -1, -15, -36, -9, -4, -15, -21, 14, -15, 11, -3, 49, 19, -57, 14, 16, 34, 41, 0, 51, 0, -2, -23, -27, -4, 22, 16, -25, -4, -9, -14, 14, 15, -20, -15, -49, -4, -3, 5, 2, 45, -28, 38, -23, 9, 39, -9, -36, -36, 52, 41, 3, 45, -21, 2, 7, -21, 38, 15, -9, -10, -16, -17, 14, -55, -16, -29, 19, 7, -47, 3, -7, -6, -25, 35, -2, -13, -26, -18, 33, -26, 41, -23, 24, -27, 21, -4, 4, 24, 25, 6, 12, 14, 29, -42, -5, 24, -23, 42, 0, 30, 38, -14, -14, 11, -1, 22, 28, -31, -41, 37, 4, -2, -22, -25, -9, 24, 12, 15, 34, 33, -3, -10, -22, -2, 21, -49, 1, 22, 27, 17, 1, 21, 29, -35, 4]
4235DL8n8L1QJ5l2K0m0K4l4j0M2p1M7l1O6nl9K6RJ8j6k4M6Km4J5k0L2pk1k8M8
4268A1rol3j0N5l1M7L5o9M5m9P4n2k5L9o4P2j6k3k1L1m1N9j7k4k9NQ1n2L6jK7
4300D5o2j8L2J5KpkK0l2K8k6K9o8Q2m9L7%j7J2J3p6M7l8K5LK4j0OK3n9N2l5om7
4334e7O7j5MK3k5m9L1llJ1mJ6J1ok6J6j8L2j1K5J0l5N2n1K5k3M0k5l1J6lLLJ5
4368A5l4nJ8Lk9J4J8j7J9m5K5j4j7M5k1J6nRnJK7l8M7m6m7P8l0JMK2l8K4KpnJ2
4404cl5j0P7m0K5k8K3rk6O8n5m7N6j2M5m3L4m3L8j7k1M0n6K1OJ0L6q5J63j34L
4435a9j5L4k3N5j0j18J16m3K2l3J4Qk5J1K4K3l3OO7m0l2L0l2j3K1j4K6lO%jL3
4467D2kk7K9r0Q2k9K7kj7J2j1k2l9L3JJ9J2rk4M0k7l3R9q4L7Mol4J8Moq%m5J6
$$ y = [4, 42, -16, 15, 23, 38, 6, 26, -14, 10, -24, -34, 8, -63, -16, -47, 19, 14, -25, 1, 10, 28, 12, -12, 34, 36, -8, 7, -13, 19, 12, -9, -37, 11, 2, -4, -37, -47, 8, -23, 24, 59, -10, 35, -14, 60, 8, -17, 22, -42, 30, 14, -9, -30, 1, -40, 19, 2, -22, -51, -46, 35, -17, 19, 18, 45, -17, -35, -3, 12, 14, 7, 5, 25, -7, 21, -5, 24, -44, 38, -11, 26, 26, 9, 21, 34, -42, 5, -33, -8, -5, 19, 9, 15, 38, -21, 31, -4, -10, -57, 10, -5, -1, 22, -3, -52, -21, -24, -27, -16, -20, -4, 7, 1, -25, -9, -27, 5, -6, 19, 29, -6, 46, -5, 20, -3, 37, 12, -19, -3, -6, -3, 0, 15, -19, -24, -6, -3, -32, -18, 0, -17, 2, -43, -18, -32, -49, -4, -25, -9, -14, -5, -10, -9, 18, -20, 27, -19, -66, 12, -18, -17, -13, 9, -29, -5, -3, -10, -15, -3, -38, -48, 29, -11, 14, -14, 9, 0, -26, 42, -13, -60, -4, -16, 29, -14, 20, -23, 15, -2, -23, 17, -39, -18, -12, -2, 34, -51, 112, -22, -19, -34, 0, -23, 32, 22, -96, 20, -23, -1, -34, -20, -12, -37, -26, -2, 21, -12, -6, 61, 21, -11, 19, -13, -26, -5, -19, 7, 4, 10, 10, 9, 42, 40, 13, 42, -48, 34, 5, 32, 30, 13, 25, 14, -8, -47, -14, -13, 6, 18, 9, -15, 25, -2, -35, 64, -20, 17, 21, 15, -19, -1, 3, -3, -11, -11, -56, -40]
4502d0O4k3m2oQ2K4k3n4L1l4Lk9O5J1j9lL2m9J1M4l3J1k6J1M7o3J5J0j4N1n4j6
4534a6kjK4K1k3J6p2K1J5m6K6K1L9qK4jm1lm6K4N6m5PK4lj1K3lln9N1l8M0k3j6
4569b8J4J5j7M5k0QKk2lK4j3M5n6J6L4p9K2k2N9%j1J1j3J6l9M0j6mj0J2L3n4l2
4602d3Q8m5%M7m4j1N1m1k2MM6j4K0m5M1l5K3Mk8mN2K0p1J4j8j9KL5l9K8O0k2m8
4635a4L4l2K6J4l3k5K0J3K0k4Kk9k1N6KLN0m9l3M0k8j9rnJ9Pj7N7m5L1k9j3K1
4668a0j1M0j3L3m7n3J11m1oK6k4j6k4L9K7k8p2O3k0P8k9Jk0oL7l4j0L6n7N4j2
4699A2J9j1K1j9k7m1R7l6J5n3j3M2J2kk9j1oQ3o9J8Jl7M5k0J0M9o0K2K3m4j6K2
4731cNJ0k0J1Ql1K0m9M3J4K6nm1pNrO6o8J3Jj0j0O3m4m7O0j7J4J4j9K0K2NOo3
$$ y = [-40, 24, 1, -41, -47, 35, 59, 36, -18, 13, -21, -18, -47, 18, 29, 10, 7, 39, -10, 1, 45, 12, 23, -3, 8, 55, -8, 7, 17, 3, 54, 0, -16, -18, -19, 5, 26, 3, 19, -53, -32, -17, -63, -37, -16, 23, 15, 39, 38, -3, -6, -52, -28, 28, -17, -10, 14, 11, 0, 23, 20, 17, -42, 9, -29, 11, -12, -28, -14, 1, -16, 29, 9, 17, 19, -3, -6, 18, 5, 50, -6, 10, 44, -35, -13, -35, 24, 24, 13, 24, 11, 27, -12, 28, 12, 8, -2, 10, 43, -11, -43, 45, 0, 0, 47, 3, -8, 43, 2, -20, -16, 30, 16, 36, -9, 32, -3, 20, 24, -4, -8, 44, 64, -7, 7, -11, -30, -28, 7, -32, -4, 56, 34, -14, 20, -12, 14, 28, -5, -30, -10, 3, 23, -1, 1, -28, -49, 7, 9, 12, 62, 13, -20, 20, -8, -27, -36, -41, -22, -15, -32, 25, -20, 11, -18, -31, -10, -21, 19, 6, 39, -8, -61, 50, 9, 3, 29, 5, -11, -35, 4, 31, 3, -69, -6, -26, 52, 23, 24, 4, -2, 35, 1, -9, 27, -30, 24, 12, 31, 20, 41, 22, -5, -46, 51, 15, 30, -23, -36, 6, 18, 16, -13, -24, -30, 53, -16, 2, 3, -34, 11, -9, 1, 50, -10, 12, 35, -9, -25, -3, 2, 12, -8, 3, 11, -20, 0, -49, -6, 8, 34, 29, -12, -19, -14, -23, 43, -25, -12, -11, -21, -31, 32, -12, -59, 1, -16, -2, 12, -7, 13, 35, 40, 46, -17]
4766a7J4M6mm7K9M2o8K0L2r9R9n4l7O0l4j5J04m7j0j1N3q4J2K1J9L0n2k4M9rk1
4797cJ8k3L1m7L1oJ1L2n2RJ1Rl1m3N0Nj2J3LmL5J2n1k4P2J1p2J8RrJ2k7QJ0j4
4832hjoJ3qj0K5n9L6k3K9l7N8l1k1M8K2qrj1K6m8j5N5l1J5nK0NLrl4nP2kl1p6
4868f1Q9o5M9l8N9l4Ok3j0P2j2n1J4M7o1L1k8j4QLJ0lNqL9l8j3O2n2K4k2L8k1
4901BJ0oO0p8J4k8MJ5M5n8J8kpLM6l0QqJ8l3Nj7N4p0L4nQLJ2k8P0m1j5Pj5K3K5
4938D3J1p4k9K0K8Nm2O6n0J2l0M8Mj4MKJk2J7NOl9K8K7l2l1M8J7nj8J7m2o7J03
4972A7l3oK8k0MnL5r3J13m5MNJ4K2m9j1kk3P1J5k3j1N2n1k8l1M4L7j2j5mj6M0
5005B3l7J5rM6l4k2J9k4mM7Ro2j7K1kJ0K9J6k1J8j5Jm7M6j0k6J9l0K2K1Lk2m%
$$ y = [-17, -3, 43, 39, -8, 21, 63, -5, 15, 47, -52, 47, -7, -44, 16, -18, -33, 71, 24, 14, 3, 56, -28, -16, 5, 24, 54, 2, -22, 27, 18, -3, 15, -8, 23, -24, 7, 1, 12, 44, -8, 1, 12, 21, -10, -53, -3, 2, -10, 3, 6, 2, 37, 49, -2, -26, 46, 57, -15, 3, 12, 3, 15, -12, -4, 6, -8, -9, -15, -2, -10, -20, 5, -54, -18, -41, -12, -49, 9, -22, -43, 5, 27, 19, 10, -1, 25, -23, -38, 17, -14, 1, -4, 16, 21, 24, 15, -19, -24, 48, 46, 15, -61, 28, -37, 12, -26, 33, -1, 5, -18, -28, 44, 32, -19, -5, 42, -19, 12, -16, -30, -22, -19, -9, -12, -7, -15, 24, -14, -27, 35, -17, 7, -15, 23, 2, 12, 6, 66, -12, 2, -26, -22, -7, 38, -20, -2, -4, -11, -8, 38, 8, 16, 8, 26, -7, -2, -19, 35, -35, -1, -6, 2, 5, 17, -11, 59, 18, 3, 10, -5, 18, 43, 54, -20, -49, -29, -1, 4, -38, 28, -22, -10, -40, 8, 12, -2, 2, 4, 5, -17, 0, 5, 11, -28, 0, 27, -5, -36, 12, 29, 24, 6, 23, -19, -86, 17, -16, -22, 6, -14, -10, -15, 20, -73, 40, -5, -1, 4, 18, 40, -9, -20, -22, -45, 26, 41, 18, 7, 59, 8, -20, -51, -7, 30, 18, 3, -1, -17, 23, -14, 1, -8, 38, 4, -18, 1, -23, -27, 20, 29, -33, -50, -29, -31, -21, 8, 24, 3, 21, 6, 7, -40, 6, -4, -30, -11, -41, -19, 2, 5, -17, -21, -21]
5039b1K0k9mJ9J0qJ4J2l1LK0l4PN1%l8kQ4j08M3L6j8k0O3k2j4J3k9Qj8J1Nl3N1
5073D1J1o2N8n5J6l5lJ6Pl6O5l3l3M3J2J7J0l4K6l7K7k3jJ5k9K9KK4o1RJ0l8O2
5106B0L3m8JL9o4QN2np9O8JQo0L5j0J2j9j1L6Pj3K0Ro1k3M5j8P2o5M8p1L8Ro3
5140d9P4m4j4P6p4j1K3l1O4J1rj9Pj9jK7K9l2j5MNj0Q%l3M2NJ2m4J3l0K1K2l6
5174b8K9l6K2M7k5m5RQ9j1p7ok5N1O2o4Ok6K0N2l1j6j1O2%jm9k1NK3l8L9K2m4
5207a6k1OM9n7L7lj1L8j1l0J8j7K2j4k3O4l1m5L3QJ8j4lm1L7J2L0p4N7j0JKMj1
5241Dk9J9L3j8K5jp9K8j4J6j0k6J7M4m7NOK4Knj1%M0k7J2L0n4J2j6J9L2lk8J8
5275A8q7O6J2L8o2j0l0P7qo3K6j0nM0l0O1o9J3LJ2mnj0k2N2KMl8N1n4O7l6J8m4
$$ y = [-21, -1, -30, -34, -15, -5, -13, 1, 13, -18, -15, 5, -29, -22, 29, 29, -9, -11, 73, -35, 8, 44, 26, 6, 69, 47, 33, 46, 17, 25, 7, 18, 23, -10, 41, 52, -10, 48, -7, 9, -26, -29, -13, -6, -42, 23, -10, -43, 0, 12, 29, 39, 5, 31, -6, 21, -2, -3, 12, -17, 12, 14, 38, -23, -14, -4, -42, 20, 53, 5, 6, 45, -19, -11, 41, 36, -43, 25, 26, 34, -26, 9, -1, 11, -8, -19, 17, 24, 11, 31, 40, -21, -44, 1, -17, 55, -10, 38, -33, 5, 14, -49, 25, -19, -33, 43, -31, -42, -19, -50, 14, 25, 16, -3, 4, -15, -16, 11, 40, 8, -7, -3, 2, -8, 0, 0, -33, 9, 14, 26, -18, -5, -35, -14, 8, -28, 1, -35, -13, 34, 9, -36, -27, 62, 51, -26, -32, -57, -6, 56, -8, -2, -28, -8, 44, 13, -3, -14, 48, 48, 47, -2, -23, -18, 5, -33, 6, 28, -16, -37, -31, 18, -39, -2, -5, -16, 22, 11, -19, -1, -18, 4, -10, -33, 31, 0, -45, -12, -4, 14, 0, -3, -44, -7, 5, 35, -39, 18, 8, 9, 11, 15, 4, -25, -6, 27, 9, 34, 33, -46, -18, -32, -16, -26, -52, -35, 9, -38, -33, -27, -3, -1, -6, -17, -17, 23, -4, 8, 38, -16, -4, -20, -1, 31, 28, 0, 18, -69, -3, 9, 47, -15, -25, -55, 22, 14, -49, -23, -33, -38, 2, -28, 33, -36, -23, -20, -8, -12, -17, -27, -49, 3, 5, 9, -29, 22, -32, 35, -1, 17, -27]
5309b7K3n9P7l9j1M2k2M0m6kk1N2N4o1J7n1P3j9j4L1m7K9Kl1Nkk0M2l9rPJ4L4
5342B2l0q0P4M7k4j1oj0RK9j0j5OjN9n7n8O5N8J7r3J3qk3L6L3k8J2m4R%N3l8l4
5376b8lP1p6L8m2m3O9J4k0kJ3M5l2O7J2q5J8k9N7k5j7J1L1lk2qj2PK9j07O8J5
5408A1LK7j04N9J6QJ5n2k8M9L0j7l2m8OJ5P0k4J5K2l0rK4l3k6QL8m6P3o5N1l6
5440a0L8J0p0L5j2O3l1K2p8k6P7k8j6L9Qj6K2Rjk0j4N6n5k3N7m0MoqK2l1N1n8
5473c0O6n6K4l4K8k3%O2l1m3n1J14m4M2l7n3Q0j3qqK6oj4J6J0On4RM6l7j1RqO
5507a7M2Jm3k6O0j9k9L0j6J3l4O0%k9Qm1M6NkkJ4j7OK0k6J6m5P5n1J3k2K3lMk4
5542a0rN0j0l6L9l9J9Nmkp2N1K0J2m7Q0l6k9Lj9J6P3k6k1ppPjK3J8l2k1J5jj5
$$ y = [-27, -4, -63, 14, -25, -36, 6, -16, 24, -22, -24, -45, 7, 61, 0, 17, -34, 39, 20, 6, 37, -10, 19, 21, -10, -5, -7, -27, 15, -24, -33, -26, -12, 22, -8, -88, -14, 33, 9, -2, -8, -18, -9, 20, 10, -5, 1, 0, 59, 2, -56, 9, 67, 84, -9, 4, -4, -27, 9, 42, 14, 26, -18, -9, -9, 44, 6, -28, -31, 40, -36, 2, -40, -83, -14, 0, -20, -22, -9, 36, 4, 71, 83, -2, 16, -13, 44, 19, 2, 13, 44, 41, 19, 11, -1, 6, 35, -72, -4, 11, 14, 41, -63, -4, 12, 20, 35, -17, -45, 4, 34, 17, -15, -63, -57, -42, 28, 4, 19, 41, 11, 2, 26, -7, -33, -25, 13, -33, 40, -25, 26, -10, 28, 38, -32, 3, -9, 54, 23, 45, -33, -59, 18, -10, -26, 13, 21, 5, 27, 36, 35, 15, 1, 57, 2, -21, 36, -4, 0, -6, -14, 8, -23, 28, -30, 36, -20, 4, -30, -2, -25, -25, 37, 6, -37, -88, 26, -18, 24, -13, -66, 14, 1, -7, -15, 11, 5, -9, 7, 17, 23, -31, -22, 24, -13, -24, -15, -23, -17, 25, 26, -17, -43, 17, -2, -31, -1, -17, -4, -38, 22, 22, -7, 1, -40, 6, 11, 9, 7, 21, 4, 10, 30, 4, 20, -25, 50, -1, 12, -10, 13, 10, 14, -10, -19, 31, 21, -15, 24, -15, 4, 9, 5, 3, -69, -18, 2, 14, -33, 47, 11, -18, -15, -34, -18, 55, 29, 8, 1, -6, 1, 0, 23, 41, 9, -12, 3, 2, -13]
5577a3J1j2J1K1nJ2lj6K3k2J5m9N0k2K5m1K1m3RO5q4L3K4J0L2m1klj0k9N5oM7
5610F3r2M5J4Jk9l3L1l8jM6J2j3Ppj1k4L3jJ7k8m1O4l6J2J0lkj1O5r3jQ3o1K0
5644bMn4M8jL9M1p7M4m7NJ3J4L6q6J9rKM2m3Lj8M0k6MlJ8o4N7ML3K8p9kn9N9J
5680a6J4NNlk3K9n3M2PK4o3j9O9l9LL7k3j3j5P5p7J4M9l6M8l6Qk6m2J0N0o7O7
5713Ek9O6p1L8l2L3%j6l0M0j1m2N5NNn7NK0J3k3Nj0K4QN4n1j8O6k7k7JJ4j6M6
5747D3j0o7R5n3M3j08L8O9n2Lm5LO0j7K4p6L8pO2o8K6JM8l6pJ3j3j1Q0j00j4L1
5779gnNJ1m1L7K0o2Q7k8l7k3M7j7K6mJ5l3J5j3lL0Om4j8L2K9jj4J2qj6K3mn5M5
5814GqO1q3J1L1j4oK7j8Km6N2k4J0Km2N4Mk8J8L2p7Q1j4l4K2lJ8m0l8Rj0P0m1
$$ y = [-13, -2, -14, -3, 18, 13, 25, 22, 6, 29, 7, 22, -27, 23, 1, 26, -15, 6, -37, -28, 37, -47, -14, 10, 20, 52, 11, 9, 6, -4, -33, 22, 16, 63, -29, 16, 30, 31, 2, -31, 0, -38, -39, 7, 19, 6, 13, 6, -5, -29, 4, 3, 20, -8, -49, 15, -21, -9, 1, -2, -4, -15, 50, -43, -44, 39, -22, -2, 2, -52, -4, -5, 34, 75, -2, 42, -5, 0, 13, 27, 63, -23, -4, -13, -11, 31, -12, -9, -27, 13, -13, -9, -12, 6, -58, -1, 3, 36, 64, -15, -17, -76, -17, -16, -2, 3, 8, 5, -18, 11, -42, 0, 7, 31, -32, -51, 18, -21, -18, 19, -4, -17, -32, 43, -34, -20, 29, -7, 41, 5, 13, -13, -55, -45, 5, -62, 5, -24, 42, -29, 9, -23, 10, 10, -6, -36, 4, -7, -49, 6, 11, 16, -41, -36, -16, -3, -26, -21, -31, -7, 1, 55, 4, -14, 52, 25, -2, -1, 13, -3, 43, 33, -34, 61, 8, 51, -57, -19, 50, -2, 1, -44, -41, 19, 2, 26, -50, -12, -19, 43, -25, 1, 2, 50, 14, 7, 20, 7, -4, 76, -24, -38, -7, -12, -7, 4, -37, 0, 20, -42, 45, 17, -20, -43, 4, -13, 13, 9, 24, -9, 6, -7, -10, 20, 26, -18, -36, -4, 25, 24, 10, 22, 14, -2, 21, 17, -38, 7, -1, 60, -23, -12, 19, 5, -1, 26, 8, 10, -36, 16, -8, 2, 4, -38, 16, 20, -8, 10, 42, -35, 46, 32, -2, 20, 17, 35, -5, -43, -34, -44, 26, -15]
5848a5J6l5L2k0l5P2k6L0%J6%l7l4j6J3k1M8M1l9L0J1o2QL3m9K2M7n6kN5k1Nj4
5881cj8K9Oj7j7Qk7L7Q1p4k6J1mO2m0Mo3K0j5N9l9K6M6p4L5j5J3pL0m8J9N0n9
5914a0N0k4n2M4j4K0k6N6m3L9k0QK2l4l7P%K1n9M1jk6RkN1j6j1j9Jl7N4k8N0j1
5948Cm6O8n0JL8L4k4m8M1K8m3l3qO4m3J3N4p6L0n7J41o6Ko4L0J1q2P9M7o0ML6
5980B4ok3N4o5J8n1R4o9J6M3k9k5K6j4J0rj4K2j7JO4j11K0R2l6l9rJ7%M9m0L2
6012B5k9k5j4L2j5K1L7j4k9RPK0L5o8j6L5m9M0kJk3RJK5j0j2K0m4JM1k8J8l3Q6
6046E2n5m5P2l1N4n5J1l8nO1QoRk4LK3p4M2Ol1Q4m4Ol0J9l2K8m8R1l5k8R0q0L4
6080C2q4N5k8L9jj3M3m6L6Nm9Nk9N2K5l7oJ8j1pkK3p4oJ06n2J5k6J3l1M1nkQM6
$$ y = [-15, 1, -34, -2, -22, -57, 15, -11, 19, 19, 35, 35, -2, -36, -52, -39, -60, -12, 29, -10, 20, 31, -31, -23, 10, -39, -17, 30, -26, -28, 27, 6, 11, -3, -21, 8, 14, -3, -20, -12, -39, -2, 79, 5, -21, -10, -14, 48, 8, 12, -51, -31, -46, 13, -26, 0, 46, -28, 7, -8, 5, -2, 28, -20, -1, 49, -10, 40, 16, -36, 8, -6, 14, -12, 44, 1, 40, 20, 28, 50, 16, -21, -14, -14, 7, -52, -11, -12, -38, -29, -31, 20, 4, -7, -26, -25, -62, -8, -36, 14, 3, -43, 25, -25, -24, 14, 48, 24, -24, 17, 45, 2, -31, -39, 25, -18, -5, 49, -27, 3, -54, 87, 21, 23, -41, -11, 0, -82, -3, 44, -16, -12, 24, 18, -5, 49, -16, 2, -49, 45, -24, -8, 35, 6, -19, 7, -7, 3, -6, -20, 2, -15, -14, 50, -61, -41, 51, 15, -24, -33, -16, -16, 33, -7, 25, -4, -29, -43, -11, -26, -5, 32, 18, -11, -2, 5, 25, 60, -8, -24, 11, -38, 2, 0, 1, -22, -13, -12, 13, 3, -9, 11, -33, -32, 9, -19, -1, -34, 52, -3, -48, 24, -7, 47, -8, 3, -35, -40, 21, 29, 23, 32, 8, 11, 34, -40, 2, 8, -23, 61, 17, 23, -7, 12, -20, 8, -40, 51, 16, -12, 78, -2, 32, -52, 3, -25, 14, 13, 0, 43, -3, 33, 38, -11, -6, -35, 17, 42, 5, -1, 17, 6, -1, -3, 20, -54, -60, 46, -6, 9, -17, -4, -35, 6, 1, -1, 7, 53]
6115E3p5M0k6L1j6QQK1j2m7M3o1J1L8j1%L8j8m0NJ6K0rk1Kk0mK3j1J5Q%K2Nk8
6150HpK4m4L1m8O7klk7k8M7m9nM6mqj1L4n0O8j0l3J4qL1lk4j5k6O8k9Pm2K3jJ9
6186A0M5n1j6J5M3m4k7O2n1RJ4j7QK6Oj0j7Qk1PK3m6M4q0O5Lk3L9k8j5L0qL3m
6220C2k8k5J0J3klqM4m7O5o3KK2j2PM0l6qj9M8j9n8K5M2n8P8j9j4k1Kl0O1nj9
6254cL1k0RJ2o4Q4q6N1L1n8qO4p0m3O2j1LJ0M5n3JN3n6L7l8N2l2j0K0ML1p5K3
6287dKK2J0K8j07J1N6o3K7M8K0p0KPrN6j7k3j9j3N9L9p0ML5j6m6K8J8l9j3L6j2
6320a3jnO3n3L6l5j5K3j9kLj5L1j8K4j0K1Rl5L2l9MpN5j04J06j7j6l3K4k1L3j7
6353a1m2N4opJ7K4n3k2P4Lm2pM9m9j0M2n0L6m2J4M2L7o6j8K9J4K5q5K5L8m0K3
$$ y = [53, -22, 18, -8, 23, 7, 15, 23, 44, 32, -15, 28, -33, -22, 16, 5, 5, 43, 25, -15, -10, 6, 26, 17, -4, -2, -22, -26, -3, -14, 1, 9, 9, 31, 36, 8, 1, 25, -19, 12, -36, 31, 29, 26, -1, -29, 18, -31, -36, 10, 6, -2, -13, 21, -29, 39, 29, -4, 10, 2, 33, 30, 6, -9, -35, 33, 4, 11, -31, -8, -9, 10, 55, 4, -12, 3, 46, 2, -25, 37, -14, -5, 9, -8, 0, 26, 32, 22, 5, 13, -8, -1, 22, -24, 20, -60, 5, 8, -15, 24, -4, -19, 11, 3, 36, 32, 4, -21, -11, 2, 0, -3, -11, 33, -14, 51, -12, -10, 12, 0, 7, 47, 11, 3, -16, 32, 13, -45, -20, 22, -36, 42, 23, 9, -12, -10, -40, 21, 16, -3, 28, 8, 17, 29, -35, 49, -37, 14, 45, -13, -21, 43, -27, -70, -8, -19, -16, -6, 39, -14, -13, 40, -16, 21, -17, 35, 3, -7, 13, 17, 48, -27, -4, -2, 20, 30, 58, -49, -38, 18, -45, -18, 30, 50, -20, -18, -11, -20, 36, 19, -4, -23, -36, 23, 62, -8, -4, 31, 15, -31, -3, 15, -24, -37, -1, -13, -14, -19, 44, -9, 27, -8, -23, 0, -19, -21, -18, -33, -2, -20, 4, -6, 15, 24, -11, 21, -18, -14, -21, 34, -70, 36, 19, 3, -30, -6, -27, 6, -11, -53, 1, -5, -12, 5, 29, -24, -46, 28, 31, -11, -18, 31, -18, -28, 14, -36, 0, -42, -28, 14, 51, -15, -33, -4, 10, 35, -50, -25, 13, -27, -4]
6385dJ8L4m9l4K8k4J6K5J0p0K5MQ9m9k2K5m0L6m0QJ9QJ5%j9j6pm5N4j1K4J0k7
6418iNPj3K5J9k1L9n8j4N5q0OP5n1J4pJ0K4Jm4KK0J7k6j5M4j0m8mM8m4L5J5J7
6452C4Mp9N9k6K1mk6J2j9M4n1jL2L1j5n2M7j5j0K1j6QL6j3l7k0L8KN9m6l3nP5
6485E5n1Oj8jL3l9Qj2Nk3K0K4J8k7j7L0M5o1J8j9QM4q8Q7m2L3l4j3P1o2mRl3K8
6519bl4J2R4o3JJ7no9J04k6j5j4k3j9k2R9k2j4m8P6l1M0l1j1m1L6L8j1j7M6m7
6550bRl4K4j1k3M8r3M7K9k1mMj1LNN9n5J8j6pQ1rk0j2K0m2J4l6mK4L2Jj1J1J5
6585C3m7RL8m0j1J2K0j8ON3m2l3M1n2j2J5M9o3K9O4l8n6Q2l2Pj2j0m6Q7m4mJ3
6617bL5l6k4L7n4L1MJ8K7m3j8N5k9LM1rm9L0m5J9Rj4j5P2j2jn1K5q6J05RL5n1
$$ y = [-4, 14, 48, -1, -35, -7, -31, -15, 10, 20, -50, -25, -21, 68, 19, -3, 22, -18, 18, -22, -14, 5, 13, 28, 28, 9, -7, -14, -59, -5, -16, 8, 18, -9, -4, 3, -10, 15, 34, 13, 52, -6, -20, 35, -45, -39, 36, -15, -1, -8, 2, 26, 27, -17, -15, 5, 22, -4, -19, 25, 15, -33, -37, 11, -33, 2, 17, 34, 38, -41, 18, -8, 13, 9, -17, -5, -24, 20, -31, -32, 0, 31, 16, -36, 11, -4, -14, 7, -9, -1, 35, 22, -15, -35, 3, 5, 64, 18, -15, -20, 55, 4, 10, -8, -9, 24, -15, -7, -19, -14, -37, -17, 7, 25, -2, -19, 11, 56, -5, 13, -6, 2, 46, -42, 45, 3, 36, 2, -11, 60, -2, -6, 3, -30, -2, -36, -24, 70, 7, 8, 25, 20, -49, 55, 29, 14, 0, -23, -42, -64, 35, 13, -1, -49, 27, -4, 36, 5, -6, -47, -11, 27, 16, -1, 45, -2, 7, -27, -3, -14, -37, 11, -82, -35, -6, -27, -31, -27, -38, -35, -30, 29, -26, -8, -24, -31, 50, 41, 21, 9, 29, -13, 1, -35, -39, -15, 17, 18, 7, 18, 33, -14, -5, 33, -7, -18, -6, 14, -4, 2, 55, 13, -20, 21, -31, -43, -28, 21, -42, -13, 51, 13, -43, 39, 7, 14, 2, -8, -54, 33, -11, -15, -2, 33, -3, -27, 10, -44, -13, -9, 9, 36, -7, -25, 30, 1, 4, 45, 36, -13, 17, -28, -9, 0, -14, -29, 43, 31, 30, -21, 4, -82, 23, 32, 67, 16]
6650A6m2Q0p2K5L5m2K7j6Ml6P5n7l2L9j3lJ4K8o2Q7l9j0K3j7N7l3k2L1o0Lm0M2
6682a0K3k4N7m6qrN8l9J1m1J1L2j4k2Lj0L4m6K8N9k6p3M5k5N5k7k0O6k2Q%j5j9
6715fnO2j6l2j4L4l1k1M1K2m9l2P0Mn6N9m9j4J2J1oL1l9OJM7K0l8%L2jp5NL7j3
6750cJ5m8Lm0J14k4K6l3nN%l8OL9j4J6mNn9O0m1M3n0K0N6n1oLl1k5P6K3%J6l4
6785B0n5K9K9m8L8j2k1K0n2L4L3l9J8M0l8K8J7k2k2kK6Jj3Lk7%%qn4J08n6jJ8
6818hL1n7J7K0k8K0L0l0N2l4Qm3lO5m0K1m5%K1K0m7J4j7N3l3P0r5K8l0L8M0n9
6850b1K6j7L5j2l3L7k4K8qL5l0j1k1J6PJ2OJ3p6O4n5N3Ql9k9N3k6J4j6j0N7kL
6883C7j1k3o3P9K4m2o3M4rN3l2K1k3j6RK3n3J8L9M5n2l5K3j8%K7Pl9k6O4Lm3j7
$$ y = [16, -26, 54, -18, 7, 42, 0, 27, 11, 15, -21, 54, -3, -35, 4, -9, -12, 2, 30, -32, 55, 16, 6, 29, 12, 69, 36, 14, 45, -15, -12, -52, -10, 13, -11, 46, 0, -8, -17, 41, 2, 13, -28, -17, 15, 1, -21, -18, -28, 6, -40, -12, 47, 21, -52, -7, -32, 23, -4, -24, 42, 20, 28, 28, 13, -6, -11, 51, 35, 3, -11, 23, -8, -29, 12, 34, -15, -47, 23, 27, -29, 30, -19, -33, -21, -10, -16, 15, -24, -18, -17, 30, 50, 12, 12, 44, 43, -32, -27, 10, -3, 12, -36, -33, -73, 41, 17, 43, 10, 5, 10, 10, -28, -22, 17, 3, 19, 15, 20, -39, 21, -20, 23, -27, -7, 49, -2, -8, -5, -36, -61, 15, 38, 38, 54, 20, -35, -6, 23, -25, 13, 1, -20, 0, -52, -18, 15, -24, -6, 34, -4, 24, 41, 19, -3, -5, 21, 22, 9, 12, -15, -15, -15, -23, -77, 31, -25, -26, -8, 23, -34, -17, 3, -25, -5, 25, -5, 47, 13, 21, -22, -25, 40, 0, 21, -24, -24, -3, 17, -30, -16, -33, 20, -13, 57, -38, -10, -40, -2, 38, -21, 5, -12, 23, 11, -22, 15, -9, 19, 11, 46, 16, 5, -16, 0, 7, 19, 25, 38, -38, 26, -29, 24, 32, -7, -36, 17, -9, 5, -11, -21, 36, 34, 37, 26, 3, -60, 19, 43, 1, -62, -18, -27, 26, -6, 15, -8, -24, -15, 8, -45, -27, 12, 57, 5, -30, -7, -25, -25, 2, 9, -30, -56, 8, 11, -32, -49]
6916d9L4m1Q9m4m6Q2rl4J3mOk5J5L2J5k9l7rJ6j4J4M5l5j1K4L7qJn9K7kL7oqj0
6951Gj9K5n0N2n5M6j7j8N8l7K8rl7K1oK9j5O4o0J5j5k8N2k5j9mj5j0P7k2l1K9
6983A1j7J6L4p2K0l7O2l3pK2j8M0m6J1J2l3O4l0k7j4N8%nn9L7L6ql4P7o2K2j0
7015A0j9m5N7K3j7kK7k6J9om0L2J0%n0M6j6LK3p6R2m5pO4o2J7J6J3j6k0J9m4O7
7048D7l5m9L6L6J0m5M2Oo2K5m8O5m3J2k2L8j2j2K7q6J11o8K9j9rO2o5O1o9K4j2
7079b5QK0pJ9j3R%k4j2K1QN5no1L8l2Rl3NJ3N9r4M6J8j9Rk6N1Ql5q8J05k5m8L5
7114a1M4l4l2N9q2P4mK2j6m7J5j3K3LN8j03M0K4k5K5k3jN2m5M1p4M6k6K2kn2K
7146d0kL7oM7p2K4lLJ0j5K0L0k4n1O5m1m0M5K9m4J4M3l9J7K3n5O4j5QOm6J7n7
$$ y = [-49, -15, -56, 33, -11, -57, 25, 16, -18, -5, -9, -3, -28, -13, 19, 34, 5, -32, -41, -25, -39, -25, 20, -15, -26, -2, 35, 27, 28, -31, -4, -6, 31, 25, 17, 7, -12, 13, -37, 15, -40, 6, -11, -29, 29, -8, 20, 11, -26, -5, -11, 18, 3, 67, 7, 22, 7, -21, 31, 6, -13, -17, -32, -42, 35, 13, -18, 11, -6, 10, 44, -28, -8, -45, 17, -16, -23, -1, -19, 21, -25, -14, -2, -35, 29, -1, -28, -42, 16, 16, 11, -48, -11, 25, 17, -17, 60, -2, 20, 10, -9, -54, 3, 26, 9, 7, 34, 8, 27, 21, -19, 13, 23, 23, -27, 19, 3, 6, 29, -47, 45, 0, -7, 57, -5, 12, 28, 41, 25, 5, 24, -20, 47, 12, -37, -1, 35, 45, 0, 42, 48, -14, 11, -37, 28, -15, -3, -25, 13, 1, -11, 16, -70, 41, -27, 2, -17, -26, 36, -29, 32, -37, -13, -25, -17, 3, -4, 15, 2, 11, 11, -13, -25, -4, 4, 59, 54, -7, 31, -1, 8, -25, -20, -7, 52, -42, 4, 22, 3, 12, -14, 37, 45, 10, -78, 27, 2, -46, -11, 33, -1, -33, 26, -56, 18, 14, 36, 20, -27, -12, -25, -2, 1, 59, -44, -4, 20, -5, 20, -3, -4, 48, 3, 44, -30, 16, -10, 12, 10, -42, -40, -42, -5, -11, 36, -36, -12, -15, -12, -2, -17, 3, 33, 9, -42, 23, -18, -58, -13, 16, -28, -14, 29, -10, 7, 30, -25, 39, 24, 32, 38, -8, 9, -48]
7179d8K9K5Qj1kP4n3p4P2j4J7rJ6k1l7J4l3L3J8prL2k0rO0n5K2j3m0O3J3n7L4
7212A8p9K4M1L7m2M7m9M2jo6L3k2Mj2L5j0M4n5j2P7r4L4K5l6J1%O1l8l1PK8m4
7244b3%R6j05M6jJ0Ll0L1k5k9K3L1m7Rj0M3Rm6jL6l2j7j4M9kJ7k8Nl8P7k0k5j5
7278b3K6J0q8J15m2K3j8qk6K1l4M7j4k0JM7m0K3L1k8J4j1m3O8n5K9M3p0Q6k9o2
7309b7K8M7m5J6k8NL2l3rmJ6K0K1J0k3n4M7l7N6LJ6n0J6l4M5j45J57j7r2R8n8
7340b3m0O3j4N2l5K6l4k6KRk9J4K0K3%m1kM3M6n2K7j7l5k6O4l2MK0KJ1Nj2j1O
7374Hl9m1R5k9J9k3k8KL8oN5j9j01M5K3j2N5po5j2O6K9o8L7m5L0J5k5KJ4k1L9
7406C1m1k6K6l1L1J5M5q0K5k3K8K0K1r4J27n1Qj1j3kk5K0J1P2j10j2K5L1pOQj
$$ y = [-48, -19, 6, 14, 3, 1, 75, 22, -52, 20, 6, 23, 14, 30, 9, -28, -14, -47, -14, 4, -3, -12, 20, 0, -9, 51, -4, 18, 5, -35, 28, 41, -16, 18, -61, -37, 4, 41, -1, 46, -3, 39, 38, -28, 5, -17, -13, -25, 10, 0, 44, -11, -23, 54, -40, -6, 19, -17, -6, -6, 55, 17, -14, -7, 21, -23, -23, 73, -32, 14, 13, 23, 26, -4, 27, 2, -27, -4, 27, -20, -11, -21, 22, 31, -15, -16, 20, -12, -29, -43, 6, 4, 21, -7, -2, -40, 37, 17, -8, -23, 3, 13, -75, 40, -2, 21, 3, -5, -31, -10, -44, 3, -11, -31, -30, 17, -23, 0, 31, 3, 17, 6, -37, 31, -24, 5, 48, -22, 64, 35, -27, 1, 48, 3, 19, -9, -4, 28, -5, -14, -18, -2, 18, 39, 49, 26, -28, 19, -18, 38, 41, 57, 7, 23, -11, 34, -111, 46, 29, -63, 35, -23, -63, 0, -14, 38, 3, 29, -5, -31, -29, -20, -49, -35, -15, 8, 8, -33, -35, 8, 54, 2, 29, 12, -23, -49, 15, -17, -13, 7, 9, 20, 25, 13, 2, 8, -31, -72, 23, -6, 13, -10, -38, -36, 2, -4, 51, 32, -69, -24, -1, -13, 42, 35, -30, -42, 24, 53, -15, 22, -23, 7, 22, -3, -1, 13, -8, 31, -10, -36, -10, -41, -10, 5, 50, -30, -5, -28, 0, 20, 41, -53, 74, 23, 31, 20, 7, 5, -20, 0, 11, 83, -27, -39, -14, 17, 10, 16, 24, 23]
7438B3l4K1J9L6l7k0J8n7J2K8J0J2Klm8k3J0L3M1l5PQjl9K8l0J7K1Jn2M0m3L2
7471cJ5j1nLK1n3P3j10O3J9O8o7n6J9%O6n3m6O9j9j2m2R3l5M2p3M2j3pK6J7om6
7504b1k9O4j1m2K9J5k6J1K9PJ6n5M1n7NL8m1N4j15P3M4J0o3L1J8m0L0j7N4j04
7534e2Q6m0O9o4J3J3J4Pn6j3MlL4mk2J6K7n3N6n6J7l5P8j5o8J27p0nj3K3l0O9
7566E4j08N0j0J7k1L5j5lJ6n1Q7m7N0k1r2R1m6l1P9l4k1L9K6l1L4j2k3j8l3N5
7596A6K4o7N2l6J5rml8N3J1K8m7J3m4L1kJ2j6K0j1K8j3Pj0j0j1%J3m5K1O5q6M9
7629Ik2Nk1J2N6n7K2j0L5l6j2J8j9J7j9M8l6j4O5k2k5Rn9N1Ql9N4m6L0nk4J9R
7662Apj0k8O2k3j3J6K1km2K4l6N8l4j2J1QO4m5J7n9M2J4Lm6Q4q5M0j5m7N1on4
$$ y = [23, -11, 10, 29, 65, 28, 8, 26, -31, -19, 9, 19, 31, 33, 30, -18, -41, -31, 2, 43, 8, 15, 23, 22, -17, 11, -19, -2, 19, 20, -32, 8, -35, -3, 12, 1, -4, -1, 20, -33, 40, -70, -7, 12, 80, 13, -43, -24, -24, 42, -11, -57, 12, -7, -19, -61, 32, -3, 39, -34, 8, -5, -12, 14, 31, 25, -21, -50, 14, 3, -39, -10, 5, -21, -10, 19, 26, 42, -13, 28, -29, -24, 14, -27, 27, -88, -15, 29, 39, -24, 7, 25, -15, 15, -2, 52, -52, 34, -6, 63, -1, 12, 25, 39, 46, -10, -23, -19, -22, 12, 8, -14, 2, 29, -24, 32, -24, -7, -42, 36, 21, -47, 80, 10, 5, -8, 15, -15, 54, -54, -4, -14, 3, -18, 17, 2, -1, 15, -36, 51, 4, 54, 33, -59, 32, -14, -45, 34, 0, -21, 18, 44, 13, 47, 35, 12, -6, -39, 16, 40, -27, 25, -11, 4, -5, -9, -47, 6, 17, 45, -2, 11, -33, -2, -4, 8, -8, 12, 1, 29, 16, 23, 13, 3, -8, -8, 5, -40, -19, 46, -40, 9, -13, -8, -29, -17, 39, -18, 4, -6, 29, -7, -19, -1, -20, -3, -22, 26, -10, -24, 41, 19, -6, 3, -56, -5, 3, -36, 18, -28, 2, -3, -27, -8, 1, -6, -16, -44, 18, -5, -18, -2, 19, 17, -25, -1, -37, 21, -13, -25, -14, -6, 58, 13, 30, -29, 13, 27, 30, -16, 68, -17, 23, 8, -39, 12, 6, -48]
7695d8L9n8M5qK1N9q7Q4m5O6q2l0P6q1L3J5L0m2J3K5qN7j07L4MK9k2ljj7M5m1
7727eK3l7J7N3K5p9KL7q1LN2m3NK2q%K7rK3Orl8K6m4N9o1N0Qp0M4lk7nK7N1k5
7763A6l2QmJ4KL5Nm4k6J02p3j5J4Jn9O4j3K2rJ1qj8m4J9L3j1j1K5NM2n6K1J1m0
7797a3K4j6Qk5M6jk3J5j9L5m0LJ6j6L3qj2m5O5ll2%N1m2jj2o1P9N9l3q2L3l1N7
7831IJ5L0m9J4j4M6m6j7llk3J25lr0nL6q3N0J0l9MJ7K7n5N1o0Q3n8L4L0o5K3L3
7864B4k7k7L9K4m1J2J4m4Q8k0p4K7k7O9l9Mk7M7n1N0m7L0l0L8j0M3L0l3nm0O4
$$ y = [-48, -9, -67, -22, -30, -9, 50, -37, 47, 2, 68, -14, -44, 32, -49, -16, -1, 29, -13, 0, 25, 17, 74, -33, 1, 5, 34, 12, 9, 8, -9, 36, -5, 18, -19, -2, 51, 76, -3, -1, 36, -45, -42, 10, -33, -28, -6, -14, -14, 13, 4, 27, 33, 24, -14, 12, -32, 27, -34, 16, 24, -46, -2, -5, -32, -37, -10, 41, 16, -16, -8, -12, 2, 4, 39, 44, 0, -26, 76, 3, -12, 2, 3, -56, 8, -5, 17, 8, 19, 11, -7, -51, -32, 1, -10, -21, 4, 9, 51, -5, 16, 27, -13, 11, -5, 3, -22, 24, 23, 0, 15, -4, 31, -9, -6, 10, -6, 27, 19, 7, -38, 27, 24, -8, -8, 43, 1, 0, -12, -73, 6, 65, 32, -50, -17, -48, 9, 24, 54, 5, 19, 5, 51, 5, -12, -15, -18, -41, 84, 81, -9, -14, 22, -61, -11, -1, -40, -36, -19, 8, -47, 4, -56, 27, -31, 3, 33, -32, -9, 24, -3, -30, 9, 33, -8, 4, 18, -26, 62, 42, -32, -5, -32, 37, -2, 2, -25, 22, -29, 21, -26, 4, -26, 12, 2, 45, 75, 42, 37, -3, 61]
$$ [...]
8191a5
##END NTUPLES=NMR FID
##END=
