##TITLE=1H_AM_NV76.1
 CDCl3
 8 sc, 
 27.10.2023
##JCAMPDX= 6.0         $$ Bruker NMR JCAMP-DX V2.0
##DATA TYPE= NMR FID
##DATA CLASS= NTUPLES
##ORIGIN= UXNMR, Bruker Analytische Messtechnik GmbH
##OWNER= root
$$ XWIN-NMR		Version 3.5
$$ Fri Oct 27 16:36:23 2023 Russian Standard Time (UT+4h)  she@DPX200
##.OBSERVE FREQUENCY= 200.13135
##.OBSERVE NUCLEUS= ^1H
##.DELAY= (6, 6)
##.ACQUISITION MODE= SIMULTANEOUS
##.ACQUISITION SCHEME= undefined
##.AVERAGES= 8
##.DIGITISER RES= 18
##SPECTROMETER/DATA SYSTEM= spect
##.PULSE SEQUENCE= zg30
##.SOLVENT NAME= D2O
##.SHIFT REFERENCE= (INTERNAL, D2O, 0, 15.7039)
##AUDIT TRAIL= $$ (NUMBER, WHEN, WHO, WHERE, WHAT)
$$ ##TITLE= Audit trail, XWIN-NMR		Version 3.5
$$ ##JCAMPDX= 5.01
$$ ##ORIGIN= Bruker BioSpin GmbH
$$ ##OWNER= she
$$ F:/spectra/data/she/nmr/H-F/1/audita.txt
$$ ##AUDIT TRAIL=  $$ (NUMBER, WHEN, WHO, WHERE, WHAT)
(   1,<2023-10-27 16:35:12.79 +0400>,<she>,<DPX200>,
      <created by zg, POWCHK disabled, PULCHK disabled
       configuration hash MD5:
       00 E9 B6 7A A2 85 ED C7 34 08 36 98 17 FE 4E 26
       data hash MD5: 16K
       68 58 46 69 FB FA EA E5 D7 84 25 93 C6 FD 8D BD>)
$$ ##END=
$$ 
$$ hash MD5
$$ 9B F1 6B 2E EB 31 DA 43 29 2E C8 D0 EE B9 FA 29
##$RELAX= 
##$RELAX= 
##$RELAX= 
##$RELAX= 
##$RELAX= 
##$RELAX= 
$$ Bruker specific parameters
$$ --------------------------
##$DU= <F:/spectra>
##$EXPNO= 1
##$NAME= <H-F>
##$PROCNO= 1
##$TYPE= <nmr>
##$USER= <she>
##$AMP= (0..31)
100 100 100 100 100 100 100 100 100 100 100 100 100 100 100 100 100 100 
100 100 100 100 100 100 100 100 100 100 100 100 100 100 
##$AQSEQ= 0
##$AQ_mod= 1
##$AUNM= <au_zg>
##$AUTOPOS= <>
##$BF1= 200.13
##$BF2= 200.13
##$BF3= 200.13
##$BF4= 200.13
##$BF5= 200.13
##$BF6= 200.13
##$BF7= 200.13
##$BF8= 200.13
##$BYTORDA= 1
##$CFDGTYP= 0
##$CFRGTYP= 5
##$CHEMSTR= <none>
##$CNST= (0..31)
1 1 145 1 1 1 1 1 1 1 1 1 1 1 1 1 1 1 1 1 1 1 1 1 1 1 1 1 1 1 1 1 
##$CPDPRG= <>
##$CPDPRG1= <>
##$CPDPRG2= <>
##$CPDPRG3= <>
##$CPDPRG4= <mlev>
##$CPDPRG5= <mlev>
##$CPDPRG6= <mlev>
##$CPDPRG7= <mlev>
##$CPDPRG8= <mlev>
##$CPDPRGB= <>
##$CPDPRGT= <>
##$D= (0..31)
0 1.2 0 0 0 0 0 0 0 0.06 0 0.03 0 0 0 0 0.0002 0 0 0 0 0 0 0 0 0 0 0 0 
0 0 0 
##$DATE= 1698410112
##$DBL= (0..7)
120 120 120 120 120 120 120 120 
##$DBP= (0..7)
150 150 150 150 150 150 150 150 
##$DBP07= 0
##$DBPNAM0= <>
##$DBPNAM1= <>
##$DBPNAM2= <>
##$DBPNAM3= <>
##$DBPNAM4= <>
##$DBPNAM5= <>
##$DBPNAM6= <>
##$DBPNAM7= <>
##$DBPOAL= (0..7)
0.5 0.5 0.5 0.5 0.5 0.5 0.5 0.5 
##$DBPOFFS= (0..7)
0 0 0 0 0 0 0 0 
##$DE= 6
##$DECBNUC= <off>
##$DECIM= 32
##$DECNUC= <off>
##$DECSTAT= 4
##$DIGMOD= 1
##$DIGTYP= 9
##$DL= (0..7)
0 120 120 120 120 120 120 120 
##$DP= (0..7)
150 150 150 150 150 150 150 150 
##$DP07= 0
##$DPNAME0= <>
##$DPNAME1= <>
##$DPNAME2= <>
##$DPNAME3= <>
##$DPNAME4= <>
##$DPNAME5= <>
##$DPNAME6= <>
##$DPNAME7= <>
##$DPOAL= (0..7)
0.5 0.5 0.5 0.5 0.5 0.5 0.5 0.5 
##$DPOFFS= (0..7)
0 0 0 0 0 0 0 0 
##$DQDMODE= 0
##$DR= 18
##$DS= 0
##$DSLIST= <SSSSSSSSSSSSSSS>
$$ [...]
##$SUBNAM2= <"">
##$SUBNAM3= <"">
##$SUBNAM4= <"">
##$SUBNAM5= <"">
##$SUBNAM6= <"">
##$SUBNAM7= <"">
##$SUBNAM8= <"">
##$SUBNAM9= <"">
##$SW= 18.05172834244
##$SWIBOX= (0..15)
0 0 2 0 0 0 0 0 0 0 0 0 0 0 0 0 
##$SW_h= 3612.71676300578
##$TD= 16384
##$TD0= 1
##$TE= 0
##$TE2= 300
##$TE3= 300
##$TEG= 300
##$TL= (0..7)
0 120 120 120 120 120 120 120 
##$TP= (0..7)
150 150 150 150 150 150 150 150 
##$TP07= 0
##$TPNAME0= <>
##$TPNAME1= <>
##$TPNAME2= <>
##$TPNAME3= <>
##$TPNAME4= <>
##$TPNAME5= <>
##$TPNAME6= <>
##$TPNAME7= <>
##$TPOAL= (0..7)
0.5 0.5 0.5 0.5 0.5 0.5 0.5 0.5 
##$TPOFFS= (0..7)
0 0 0 0 0 0 0 0 
##$TUNHIN= 0
##$TUNHOUT= 0
##$TUNXOUT= 0
##$USERA1= <user>
##$USERA2= <user>
##$USERA3= <user>
##$USERA4= <user>
##$USERA5= <user>
##$V9= 5
##$VALIST= <valist>
##$VCLIST= <CCCCCCCCCCCCCCC>
##$VD= 0
##$VDLIST= <DDDDDDDDDDDDDDD>
##$VPLIST= <PPPPPPPPPPPPPPP>
##$VTLIST= <TTTTTTTTTTTTTTT>
##$WBST= 1024
##$WBSW= 4
##$XGAIN= (0..3)
0 0 0 0 
##$XL= 0
##$YL= 0
##$YMAX_a= 248017
##$YMIN_a= -248934
##$ZGOPTNS= <>
##$ZL1= 120
##$ZL2= 120
##$ZL3= 120
##$ZL4= 120
##$ABSF1= 10
##$ABSF2= 0
##$ABSG= 5
##$ABSL= 3
##$ALPHA= 0
##$AQORDER= 0
##$ASSFAC= 0
##$ASSFACI= 0
##$ASSFACX= 0
##$ASSWID= 0
##$AUNMP= <proc_1d>
##$AZFE= 0.1
##$AZFW= 0.1
##$BCFW= 1
##$BC_mod= 2
##$BYTORDP= 1
##$COROFFS= 0
##$CY= 11.3945322036743
##$DATMOD= 1
##$DC= 2
##$DFILT= <>
##$DTYPP= 0
##$F1P= 15.7292609196834
##$F2P= 12.9074282941183
##$FCOR= 0.5
##$FTSIZE= 0
##$FT_mod= 4
##$GAMMA= 1
##$GB= 0.15
##$INTBC= 1
##$INTSCL= 1
##$ISEN= 128
##$LB= 0.24
##$LEV0= 0
##$LPBIN= 0
##$MAXI= 10000
##$MC2= 0
##$MEAN= 0
##$ME_mod= 0
##$MI= 1.114404
##$NCOEF= 0
##$NC_proc= 0
##$NLEV= 6
##$NOISF1= 3.799351
##$NOISF2= 2.8
##$NSP= 1
##$NTH_PI= 0
##$NZP= 0
##$OFFSET= 15.70392
##$PC= 1
##$PHC0= -24028.16
##$PHC1= 7.852731
##$PH_mod= 1
##$PKNL= yes
##$PPARMOD= 0
##$PSCAL= 0
##$PSIGN= 0
##$REVERSE= no
##$SF= 200.130013532006
##$SI= 16384
##$SIGF1= 3
##$SIGF2= 2
##$SINO= 400
##$SIOLD= 16384
##$SREGLST= <1H.CDCl3>
##$SSB= 0
##$STSI= 0
##$STSR= 0
##$SW_p= 3612.71676300578
##$SYMM= 0
##$S_DEV= 0
##$TDeff= 0
##$TDoff= 0
##$TI= <>
##$TILT= no
##$TM1= 0
##$TM2= 0
##$TOPLEV= 0
##$USERP1= <user>
##$USERP2= <user>
##$USERP3= <user>
##$USERP4= <user>
##$USERP5= <user>
##$WDW= 1
##$XDIM= 8192
##$YMAX_p= 0
##$YMIN_p= 0
$$ End of Bruker specific parameters
$$ ---------------------------------
##NTUPLES= NMR FID
##VAR_NAME=  TIME,          FID/REAL,        FID/IMAG
##SYMBOL=    X,             R,               I
##VAR_TYPE=  INDEPENDENT,   DEPENDENT,       DEPENDENT
##VAR_FORM=  AFFN,          ASDF,            ASDF
##VAR_DIM=   8192,          8192,            8192
##UNITS=     SECONDS,       ARBITRARY UNITS, ARBITRARY UNITS
##FACTOR=    0.0002768,     1,               1
##FIRST=     0,             0,               0
##LAST=      2.2672688,     0,               0
##MIN=       0,             -248934,         0
##MAX=       2.2672688,     248017,          0
$$ Real data points
##PAGE= N=1
##DATA TABLE= (X++(R..R)), XYDATA
0 0 0 0 0 0 0 0 0 0 0 0 0 0 0 0 0 0 0 0 0 0 3 -7 8 -8 8 -8 12 -16 16 -19 22 -25 29 -34 37 -44 50 -56 62 -70 79
41 79 -88 99 -109 121 -135 150 -164 182 -201 220 -242 266 -294 322 -354 391 -429 475 -522 576 -636
62 -636 702 -773 840 -885 836 -433 -1725 24311 248017 5776 -199110 88779 103483
75 103483 -147130 -23861 165869 -28579 -110504 50356 4869 -78982 81420 74368 -129116
86 -129116 -46828 123346 -17400 -85157 100822 63710 -142542 -38453 135617 11955 -85371
97 -85371 27465 22947 -74433 4840 86329 -12107 -58065 16989 12007 -27374 30541 50110
109 50110 -34226 -54568 12834 29478 1909 3146 -2681 -29924 -17431 22532 25741 5556 -3602
122 -3602 -20664 -27366 20076 54198 -1737 -50022 -3420 25708 -18615 -9149 49316 8761 -68100
135 -68100 -21973 56345 26519 -24809 -10555 1211 -11920 -622 18777 15500 -1191 -28978
147 -28978 -33121 22104 52088 -7674 -44038 3868 18790 -17813 4111 42542 -3408 -49787
159 -49787 -9187 32432 16954 -613 -6315 -18522 -11195 12867 16608 7371 -2926 -22176 -21048
172 -21048 14345 28595 2813 -14772 -13876 -11992 5645 27630 12372 -19123 -18432 -232 5316
185 5316 9358 14542 337 -24000 -21376 12972 33542 7623 -23981 -12319 9810 853 -391
198 -391 22542 8912 -35536 -26309 24367 28600 -6369 -16898 -6946 -3362 1568 10602 13817 5322
212 5322 -17890 -26897 8967 38637 4921 -31400 -9026 11208 -7034 -615 27966 6415 -34798
225 -34798 -16709 24727 21794 -1172 -6942 -9722 -11146 2736 14974 8831 -4754 -16416 -16991
238 -16991 4579 24394 9829 -14581 -12072 -946 418 10854 19359 -4461 -27570 -8450 15601
251 15601 8438 1763 5204 -11364 -23378 6392 31234 7658 -16394 -7546 -1519 -3455 11307
264 11307 17585 -5846 -21040 -9714 3545 13929 16071 -7672 -24901 -1782 15987 1537
276 1537 3047 14939 -12684 -32501 8161 35095 519 -20214 -1868 -1834 -9233 12887 21766
289 21766 -5568 -18891 -6044 3453 12598 16376 -5902 -22793 -4190 10106 2066 6023 9572
302 9572 -15562 -24598 9027 25437 2032 -10209 -3790 -8199 -6094 15568 18030 -7371 -18562
315 -18562 -5849 4761 9275 11432 871 -14689 -11761 5418 14088 9411 -1534 -12601 -12320
328 -12320 2982 14694 8314 -4276 -10531 -11000 -2096 14492 15608 -5876 -18194 -5570 6351
341 6351 6177 8297 5401 -12661 -18152 4064 18958 7026 -6279 -8103 -7844 -1430 12022 13241
355 13241 -1501 -12783 -10633 1056 13512 12131 -4367 -14199 -7612 1869 7652 10853 2768 -13472
369 -13472 -14962 2913 15453 8826 -4298 -9873 -7684 -1126 8668 13457 2039 -15332 -13147 5926
383 5926 13706 5910 -502 -6364 -12340 -2751 15013 12667 -4281 -10863 -8307 -2485 10436 14256
397 14256 -2998 -14548 -6143 1016 4345 12816 5916 -16637 -14971 8132 11647 2268 3141 -3976
411 -3976 -17416 -3564 19431 10605 -7609 -6127 -5173 -6766 9574 18897 -1896 -16419 -5260
424 -5260 2301 3340 11806 6184 -15192 -14086 5798 8942 4021 5360 -5967 -18495 -1464 18510
438 18510 7645 -6463 -3936 -6809 -8535 9373 18243 -1232 -14613 -6614 942 5688 12188 4271
452 4271 -12471 -11062 2318 7153 8080 5500 -8774 -16099 -154 14071 7340 -2387 -5479 -9364
466 -9364 -5729 9028 13736 540 -10754 -9501 -1518 8262 11712 2270 -9509 -9880 -1146 7828
480 7828 10885 3486 -8807 -11383 -1311 9496 10442 1602 -8445 -10046 -2011 7839 10617 2728
494 2728 -9111 -11692 -1965 8217 9598 2535 -8056 -12106 -2679 9561 9824 1259 -6393 -9578
508 -9578 -4102 8386 12292 1768 -8610 -8928 -2710 6411 11663 3610 -9538 -10269 -873 6465 9569
523 9569 5414 -7370 -13280 -2081 9523 8191 1501 -5251 -10882 -5609 8185 11320 1213 -6705
537 -6705 -8258 -4386 6371 12832 3342 -9037 -8761 -1681 5008 9994 5519 -7651 -12018 -1968
551 -1968 7740 8720 3697 -5099 -10810 -4565 7329 10466 2796 -6647 -9965 -4465 5668 10256 3571
566 3571 -7171 -10295 -3138 6489 9645 4132 -5341 -10077 -4118 7101 10574 3065 -6017 -8875 -4504
581 -4504 4965 10870 4714 -6789 -9707 -2845 5212 9171 5135 -5715 -11158 -3722 6354 8080
595 8080 3289 -4572 -10399 -5627 6419 10408 3043 -5068 -8473 -5260 5079 11495 4291 -6451
609 -6451 -8499 -3782 3719 10037 5880 -6176 -10089 -2692 4775 8023 5644 -4169 -11053 -4403 6177
624 6177 8153 3842 -3449 -10262 -6381 6105 9995 2532 -4362 -7417 -6200 3251 11730 5329 -6514
639 -6514 -8126 -2792 2700 8576 7148 -4699 -10699 -2988 5094 6677 5387 -1910 -10913 -6433 6762
654 6762 9332 1956 -3266 -7028 -7193 2585 11102 4719 -5996 -7680 -4039 1627 8757 7273 -4568
669 -4568 -10265 -3248 4539 6944 5545 -1647 -9628 -6128 5491 9385 3489 -3165 -7346 -6350 2685
684 2685 10201 5252 -4946 -8152 -4442 1999 8005 6538 -3698 -9821 -4502 3739 7074 5073 -1956
699 -1956 -8948 -6115 4088 8958 4579 -2862 -7529 -5677 2735 9183 5635 -3212 -7855 -5167 2137
714 2137 8174 6202 -2949 -8830 -5266 2886 7495 5129 -2424 -8229 -5840 2442 7955 5455 -2410
729 -2410 -8162 -5862 2368 8209 5615 -2335 -7705 -5423 2287 7836 5809 -1539 -7347 -5968 1928
744 1928 8303 5823 -2447 -7534 -5387 1594 7349 5823 -2003 -7814 -5651 1524 7057 5972 -1685
759 -1685 -8239 -5950 2235 7307 5214 -1392 -6980 -5951 1524 7627 5996 -1446 -7168 -5703 1772
774 1772 7519 5727 -1559 -6949 -5630 1291 7149 5797 -1543 -7356 -5948 1145 7070 5796 -1660
789 -1660 -7479 -5643 1307 6622 5776 -743 -7061 -6243 1183 7210 5840 -902 -6607 -5802 1211 7118
805 7118 5745 -981 -6201 -5577 555 6716 6322 -832 -7168 -6097 1010 6827 5623 -1130 -6477 -5946
821 -5946 -160 6174 6593 -511 -7262 -5885 836 5907 6000 145 -6821 -6175 1412 6385 4983 354
837 354 -5263 -6989 -43 7972 6080 -1629 -5426 -5022 -1166 5778 7517 -520 -7463 -5030 471 4251
853 4251 5987 1632 -7004 -7272 1501 6327 4072 390 -4329 -6999 -1002 7599 6356 -1393 -5189
868 -5189 -4695 -1134 5542 7474 74 -6839 -5149 404 4527 5996 1437 -6413 -6998 535 6007 4634
884 4634 160 -4677 -6471 -1284 6012 6265 -129 -5648 -5621 -564 5420 6381 468 -5615 -5437 -333
900 -333 4916 6140 1464 -5435 -6479 -283 5737 5745 564 -4978 -6077 -929 5271 5718 497 -5007
916 -5007 -6049 -1423 5115 6441 475 -5733 -5689 -644 4520 5899 1567 -5205 -6481 -588 5303 5744
932 5744 1481 -4380 -6481 -1266 5895 5969 309 -4179 -5082 -2242 4291 7155 1136 -5961 -5483 -549
948 -549 3637 5612 2247 -5143 -6948 -591 4906 4788 1704 -3381 -6826 -2228 5876 6226 120 -3960
964 -3960 -4447 -2230 3680 7148 1868 -5392 -5484 -567 3728 5566 2543 -4625 -6958 -931 4831 4712
980 4712 1438 -3162 -6314 -2939 4776 6467 783 -4343 -4960 -1897 3411 6301 2030 -4439 -5448
995 -5448 -1224 3584 5754 2618 -3892 -6417 -1428 4514 5351 1792 -3237 -5777 -2554 3834 5976
1010 5976 1850 -3856 -5736 -2342 3496 5865 1869 -3990 -5640 -2082 3374 5740 2293 -3717 -5790
1025 -5790 -1938 3716 5787 2436 -3498 -5739 -1908 3637 5433 2563 -2859 -6007 -2668 3923 5782
1040 5782 1721 -3240 -5113 -2818 2728 5962 2290 -3841 -5373 -2125 2525 5439 3020 -3511 -6196
1055 -6196 -1809 3610 4737 2492 -2000 -5658 -3232 3619 6152 2054 -2948 -4690 -2642 2448 5835
1070 5835 2754 -3357 -5300 -2184 2372 5025 2990 -2804 -6124 -2697 3164 5207 2193 -2619 -5189
1085 -5189 -2978 2437 5584 2947 -2706 -5362 -2499 2699 5273 3025 -2333 -5343 -2612 2957 5119
1100 5119 2516 -2121 -5041 -3368 2354 5856 2617 -3222 -5040 -2434 1838 4866 3335 -2492 -5734
1115 -5734 -2770 2487 4739 2928 -1865 -5352 -3119 2669 5323 2587 -2034 -4463 -3001 1994 5596
1130 5596 3257 -2514 -5157 -2484 2140 4789 3096 -1900 -5204 -3195 1988 4999 2892 -2091 -5125
1145 -5125 -3152 1827 4787 3004 -1897 -5072 -3029 2077 4759 3035 -1498 -4900 -3314 2117 5300
1160 5300 2862 -1918 -4379 -3149 1338 5179 3599 -2074 -5088 -2785 1655 4306 3257 -1307 -5238
1175 -5238 -3545 1925 4645 2627 -1383 -4345 -3677 1317 5305 3112 -2048 -4257 -2742 984 4720
1190 4720 3962 -1479 -5119 -2841 1771 4366 3386 -854 -4680 -3501 1529 4633 2989 -1256 -4366
1205 -4366 -3554 970 4635 3186 -1593 -4613 -3157 1056 4351 3462 -1122 -4644 -3341 1256 4530
1220 4530 3418 -1025 -4267 -3256 1036 4368 3600 -724 -4359 -3342 1182 4307 3344 -793 -4375
1235 -4375 -3606 976 4260 3037 -1066 -4095 -3661 415 4531 3614 -1205 -4290 -3117 659 3918 3659
1251 3659 -578 -4415 -3462 992 4006 3285 -395 -3932 -3596 893 4604 3355 -860 -3806 -3298 126
1267 126 4014 3794 -908 -4553 -3292 621 3556 3521 -122 -4293 -3789 885 3990 2996 -229 -3504
1283 -3504 -3966 148 4517 3594 -929 -3608 -2979 42 3719 4194 -175 -4286 -3233 758 3402 3372
1299 3372 191 -4041 -4195 403 4014 2995 -376 -3288 -3727 -347 3969 3881 -510 -3837 -3249 62
1315 62 3469 3808 51 -3748 -3494 311 3654 3567 286 -3375 -3670 -92 3909 3730 -236 -3590 -3301
1332 -3301 -199 2998 3695 560 -3753 -4061 152 3659 3078 -71 -3083 -3681 -629 3506 3802 -40
1348 -40 -3345 -3241 -391 3292 4261 478 -3902 -3328 382 2898 3124 1088 -2997 -4473 -382 4114
1364 4114 3268 -347 -2728 -3221 -978 3127 4058 -13 -3625 -3231 -558 2563 3855 864 -3675 -3864
1380 -3864 171 3230 3160 1036 -2398 -4031 -787 3654 3685 87 -2769 -3253 -1039 2782 3998 584
1396 584 -3258 -3260 -512 2585 3793 979 -3284 -3898 -506 2748 3116 771 -2773 -3902 -825 3080
1412 3080 3628 924 -2473 -3554 -812 3054 3560 624 -2553 -3392 -1277 2556 3880 856 -2953 -3396
1428 -3396 -711 2518 3795 1221 -2894 -3852 -806 2472 3100 992 -2479 -3946 -1284 2770 3575 886
1444 886 -2175 -3302 -1183 2712 3926 985 -2636 -3127 -1051 2048 3649 1525 -2613 -3947 -929
1459 -929 2688 3493 1162 -2358 -3490 -1168 2201 3327 1197 -2258 -3836 -1649 2430 3636 907
1474 907 -2445 -3160 -1162 2130 3678 1583 -2163 -3525 -1210 2192 3629 1552 -2309 -3624 -1103
1489 -1103 2143 3184 1541 -1675 -3681 -1700 2404 3475 884 -1945 -3091 -1941 1537 3807 1576
1504 1576 -2502 -3417 -1146 1684 3404 1983 -1911 -3761 -1133 2242 2970 1586 -1178 -3518 -2052
1519 -2052 2353 3780 1053 -1909 -2781 -1768 1258 3755 1823 -2369 -3365 -1227 1344 3009 2125 -1731
1535 -1731 -4021 -1500 2297 2982 1267 -1180 -3225 -2256 1711 3796 1595 -1693 -2921 -1755 1287
1550 1287 3668 1991 -1841 -3272 -1330 1330 2958 2056 -1468 -3776 -1779 1845 3047 1490 -1233
1565 -1233 -3241 -2178 1476 3539 1717 -1528 -3169 -1874 1185 3324 1916 -1445 -3020 -1811 1191
1580 1191 3496 2185 -1573 -3245 -1350 1338 2806 2106 -1048 -3610 -2055 1512 2980 1711 -972
1595 -972 -3192 -2408 1325 3419 1500 -1123 -2509 -2296 580 3567 2225 -1767 -2924 -1261 693 2606
1611 2606 2819 -746 -3733 -1719 1737 2667 1697 -268 -3008 -2793 1175 3435 1440 -1094 -2413 -2505
1627 -2505 287 3575 2242 -1786 -2750 -1375 281 2478 2910 -868 -3803 -1693 1490 2298 1919 -42
1643 -42 -3007 -2709 1314 3370 1641 -685 -2312 -2433 422 3347 2110 -1160 -2551 -1909 129 2768
1659 2768 2669 -1089 -3346 -1635 777 2153 2323 -137 -3212 -2492 1111 2796 1707 -371 -2463 -2579
1675 -2579 610 3240 2126 -593 -2311 -2200 231 3088 2379 -953 -2677 -1783 92 2234 2592 -323
1691 -323 -3185 -2239 801 2430 1965 -22 -2542 -2586 433 2713 2051 -289 -2419 -2517 247 2894 2343
1708 2343 -448 -2189 -1915 -74 2545 2829 -274 -2879 -1998 436 2049 2149 77 -2693 -2595 399
1724 399 2566 2015 34 -2283 -2635 149 2817 2054 -408 -2034 -2277 -362 2547 2690 -439 -2553
1740 -2553 -1704 261 2069 2608 393 -2622 -2424 488 2300 1904 119 -2205 -2793 -95 2588 2115
1756 2115 -221 -1978 -2280 -475 2406 2601 -295 -2378 -1999 -223 1882 2569 245 -2544 -2253 226
1772 226 2159 2238 544 -2012 -2502 3 2436 2224 201 -2072 -2459 -384 2180 2264 56 -1921 -2353
1789 -2353 -559 2164 2623 110 -2274 -2109 -228 1750 2356 573 -2239 -2544 -110 2047 2243 627
1805 627 -1851 -2575 -165 2310 2215 414 -1560 -2451 -862 2098 2590 -18 -2109 -2001 -554 1427 2491
1822 2491 679 -2290 -2498 -154 1892 2052 601 -1728 -2561 -479 2117 2282 367 -1563 -2294 -817
1838 -817 1932 2722 407 -1978 -1957 -404 1461 2355 993 -1917 -2626 -305 1814 1930 508 -1589 -2527
1855 -2527 -890 1868 2293 375 -1590 -2170 -780 1605 2624 718 -1803 -2126 -492 1394 2282 1040
1871 1040 -1604 -2539 -543 1758 2152 813 -1353 -2302 -830 1624 2410 584 -1536 -2394 -1015 1434
1887 1434 2312 584 -1573 -2236 -970 1324 2433 966 -1580 -2203 -638 1371 2280 1015 -1452 -2377
1903 -2377 -772 1423 2098 939 -1201 -2399 -869 1718 2425 752 -1173 -2079 -1161 1150 2424 791
1919 791 -1617 -2234 -982 1040 2244 1154 -1348 -2305 -724 1348 2101 1138 -1100 -2337 -1038 1472
1935 1472 2107 871 -1049 -2217 -1138 1276 2427 918 -1194 -1961 -1080 1076 2396 1067 -1407 -2162
1951 -2162 -984 815 1985 1256 -1308 -2409 -847 1231 1910 1189 -694 -2393 -1205 1513 2232 676
1967 676 -772 -1835 -1568 828 2694 1108 -1484 -1714 -734 499 2106 1798 -1172 -2597 -684 1095
1983 1095 1411 1201 -428 -2666 -1632 1580 2105 465 -566 -1490 -1786 638 2940 1190 -1526 -1588 -699
2000 -699 169 1896 2043 -985 -2678 -702 1215 1331 1239 -131 -2380 -1669 1430 2144 590 -673 -1590
2017 -1590 -1840 443 2644 1158 -1445 -1653 -941 114 1920 1977 -843 -2391 -778 1079 1576 1384 -74
2034 -74 -2163 -1571 1111 2079 966 -499 -1719 -1647 562 2332 1150 -937 -1632 -1261 207 1944 1651
2051 1651 -834 -2189 -1094 530 1546 1468 -278 -2061 -1432 816 1902 1199 -258 -1731 -1491 664
2067 664 2087 1228 -499 -1687 -1480 284 1991 1522 -659 -1856 -1209 341 1721 1601 -416 -2001
2083 -2001 -1399 472 1596 1339 -312 -1861 -1435 499 1792 1349 -180 -1716 -1452 564 1959 1324
2099 1324 -316 -1557 -1545 170 1964 1518 -533 -1672 -1246 121 1642 1672 -341 -1958 -1358 327 1440
2116 1440 1459 -64 -1938 -1574 527 1661 1157 3 -1454 -1848 193 2189 1374 -483 -1265 -1238 -258
2133 -258 1681 1950 -395 -1967 -1093 212 1167 1574 169 -1947 -1652 499 1498 1101 157 -1423 -1962
2150 -1962 73 2007 1240 -435 -1168 -1354 -469 1637 2041 -301 -1859 -1020 230 1128 1543 402 -1703
2167 -1703 -1688 364 1492 1179 136 -1353 -1785 -25 1712 1304 -191 -1281 -1519 -372 1532 1757 -159
2184 -159 -1642 -1274 -47 1092 1571 335 -1486 -1638 156 1502 1432 162 -1312 -1463 -103 1393 1491
2201 1491 174 -1413 -1642 -150 1499 1446 10 -1327 -1492 -353 1272 1640 146 -1544 -1528 -207 1297
2218 1297 1480 262 -1275 -1478 -173 1246 1601 366 -1325 -1629 -52 1444 1377 190 -1039 -1476 -526
2235 -526 1313 1693 186 -1435 -1389 -255 1075 1455 370 -1205 -1569 -312 1224 1473 342 -1170 -1554
2252 -1554 -202 1268 1482 383 -987 -1567 -412 1299 1652 265 -1134 -1335 -397 1009 1592 462
2268 462 -1251 -1617 -274 1161 1369 356 -1061 -1517 -449 1057 1477 418 -1027 -1537 -448 1184
2284 1184 1514 350 -1009 -1321 -496 941 1715 610 -1221 -1484 -188 1076 1257 428 -857 -1508 -612
2301 -612 1026 1535 358 -1123 -1410 -437 931 1395 474 -1035 -1465 -565 913 1518 566 -1084 -1556 -311
2319 -311 973 1301 643 -678 -1572 -716 1115 1634 417 -959 -1243 -536 716 1474 681 -915 -1562 -573
2337 -573 904 1397 479 -931 -1458 -587 695 1363 780 -820 -1536 -559 927 1372 461 -698 -1323 -642
2355 -642 780 1476 699 -764 -1530 -663 934 1433 450 -729 -1256 -770 536 1564 819 -958 -1498 -461
2373 -461 712 1139 788 -555 -1528 -750 839 1322 635 -545 -1350 -729 828 1480 550 -586 -1159 -815
2391 -815 601 1606 830 -915 -1257 -460 468 1174 981 -544 -1656 -714 838 1170 563 -460 -1348 -921
2409 -921 676 1402 658 -596 -1163 -811 503 1547 769 -770 -1227 -582 392 1274 1033 -468 -1541 -694
2427 -694 712 1189 594 -422 -1236 -952 451 1363 754 -646 -1315 -786 467 1218 746 -546 -1313 -769
2445 -769 475 1276 855 -439 -1288 -754 567 1330 789 -371 -1215 -805 407 1271 865 -490 -1283 -747
2463 -747 467 1126 782 -288 -1220 -990 415 1348 689 -507 -1123 -794 192 1205 1044 -462 -1323 -694
2481 -694 411 1125 953 -214 -1279 -849 533 1114 769 -163 -1051 -1022 368 1320 780 -519 -987 -721
2499 -721 115 1150 1036 -393 -1353 -765 333 957 875 -95 -1223 -918 348 1164 774 -169 -1071 -1010 303
2518 303 1281 871 -244 -1027 -867 121 1183 962 -345 -1111 -846 173 1046 947 -225 -1144 -895 131
2536 131 1042 985 -141 -1160 -853 240 981 915 -20 -1078 -995 233 1240 815 -194 -932 -951 -6 1177
2555 1177 1011 -205 -1077 -765 -2 922 1092 -112 -1231 -874 227 807 805 103 -1045 -1171 134 1134
2573 1134 667 -132 -735 -995 -101 1128 1091 -259 -983 -728 -12 855 1110 59 -1149 -891 253 812
2591 812 826 160 -911 -1125 85 1069 735 -93 -757 -1011 -246 1051 1055 -166 -1029 -744 -27 780 1116 133
2611 133 -1022 -928 141 865 839 172 -858 -1049 -11 969 884 -20 -720 -940 -205 871 1042 -6 -940
2630 -940 -843 -61 773 954 148 -936 -959 -22 884 913 87 -785 -951 -146 906 965 101 -757 -909 -116 844
2651 844 975 108 -886 -914 -119 799 927 173 -835 -1044 -169 817 907 124 -830 -978 -180 735 947 151
2671 151 -773 -902 -180 745 1007 226 -780 -877 -186 774 987 244 -750 -945 -177 768 912 173 -697 -963
2691 -963 -304 731 899 127 -767 -935 -242 651 948 198 -671 -887 -164 660 954 333 -728 -922 -196
2710 -196 753 911 316 -571 -947 -331 705 992 216 -598 -905 -304 598 953 251 -690 -890 -329 535 870
2730 870 294 -645 -943 -257 671 900 313 -555 -921 -298 645 1026 293 -596 -885 -268 556 945 343 -581
2750 -581 -895 -294 602 857 321 -553 -893 -376 549 908 293 -646 -862 -365 464 940 437 -559 -941 -332
2770 -332 565 833 402 -464 -936 -391 602 848 344 -454 -787 -417 489 975 357 -658 -828 -307 404 815
2790 815 423 -514 -952 -365 562 821 417 -377 -836 -466 470 916 351 -419 -774 -392 401 922 446 -493
2810 -493 -908 -340 431 776 510 -364 -898 -480 444 843 400 -394 -823 -499 370 883 397 -450 -804 -415
2830 -415 396 773 502 -383 -906 -452 404 835 443 -353 -778 -474 408 875 450 -379 -793 -467 237 801
2850 801 505 -350 -915 -525 346 737 440 -299 -826 -558 328 824 451 -363 -772 -486 222 861 521 -407
2870 -407 -783 -376 269 768 559 -211 -860 -498 369 749 438 -183 -762 -607 302 854 422 -281 -738 -551
2890 -551 130 757 473 -339 -749 -490 177 691 559 -220 -807 -491 299 727 504 -151 -744 -607 248 736
2910 736 528 -234 -726 -536 245 709 468 -222 -695 -524 125 733 563 -252 -779 -473 173 679 588 -204
2930 -204 -719 -526 168 694 620 -77 -765 -573 256 675 519 -161 -673 -631 63 695 535 -210 -706 -567 121
2951 121 646 510 -139 -719 -532 90 722 577 -67 -703 -591 135 672 574 -15 -574 -528 60 687 604 -52
2972 -52 -675 -486 121 653 525 -17 -653 -625 124 668 490 -33 -595 -617 27 657 549 -68 -601 -559 26
2993 26 560 582 3 -575 -531 84 583 620 36 -616 -591 98 647 522 -29 -575 -559 -57 598 606 -77 -627 -525
3016 -525 -50 500 567 4 -583 -635 12 517 484 60 -596 -610 0 640 587 -30 -541 -499 -50 616 634 0
3038 0 -600 -537 -7 495 568 85 -581 -630 -25 498 529 66 -591 -614 -86 516 538 18 -487 -579 -89 541 618
3061 618 -27 -502 -505 -87 480 707 134 -545 -600 -29 418 577 142 -501 -598 -75 523 491 71 -446 -592 -167
3083 -167 558 568 18 -458 -531 -192 406 657 159 -536 -508 -37 393 539 250 -428 -689 -82 476 554 115
3104 115 -399 -583 -158 445 599 6 -421 -470 -229 373 632 164 -468 -601 -141 323 545 228 -404 -623
3124 -623 -125 467 542 154 -277 -517 -192 416 646 136 -401 -484 -175 337 547 208 -436 -568 -126 380 541
3145 541 221 -431 -661 -171 408 495 204 -298 -583 -224 377 579 124 -369 -507 -236 357 629 263 -405
3165 -405 -518 -212 315 552 293 -329 -595 -133 344 488 203 -317 -590 -263 365 533 173 -308 -553 -315
3185 -315 284 595 213 -295 -473 -268 219 523 273 -375 -605 -158 325 459 323 -190 -629 -281 381 502
3205 502 159 -273 -484 -326 228 557 218 -321 -434 -212 251 541 307 -370 -636 -186 322 475 251 -241
3225 -241 -531 -340 307 505 238 -174 -487 -286 224 583 257 -236 -423 -258 105 483 296 -304 -587 -222
3245 -222 238 421 308 -176 -581 -293 284 515 255 -159 -473 -304 204 521 277 -229 -459 -311 124 544
3265 544 353 -241 -500 -269 158 397 301 -232 -479 -327 203 483 255 -125 -483 -299 156 491 262 -190
3285 -190 -428 -382 155 509 327 -145 -430 -277 136 495 342 -119 -440 -308 169 491 286 -106 -424 -315
3305 -315 117 435 327 -130 -437 -347 116 456 365 -171 -476 -285 68 432 332 -60 -411 -317 123 460 290
3326 290 -112 -417 -366 141 469 308 -118 -417 -355 64 441 315 -122 -387 -307 19 342 306 -124 -507 -345
3347 -345 111 426 370 -117 -453 -274 132 446 319 -80 -385 -354 68 426 373 -118 -411 -319 20 393 357 -93
3369 -93 -444 -304 -5 385 366 -39 -466 -364 89 387 316 -27 -350 -320 88 427 285 -57 -342 -388 54 410
3391 410 347 -53 -300 -284 -51 388 332 -24 -401 -346 54 281 227 32 -366 -425 26 343 293 -53 -303 -378 -64
3414 -64 380 323 -62 -312 -259 -32 350 412 1 -324 -317 14 305 387 40 -397 -391 -31 418 327 25 -358 -334 -2
3438 -2 361 383 -19 -377 -326 -62 358 335 29 -351 -322 -4 354 381 86 -269 -317 63 345 329 44 -269 -325
3461 -325 3 312 375 14 -318 -334 -51 266 348 42 -303 -372 -39 296 304 74 -264 -397 -5 312 359 72
3483 72 -281 -343 -91 298 322 72 -248 -388 -42 308 265 3 -309 -369 -48 229 338 97 -265 -337 -95 239
3505 239 386 88 -268 -318 -89 238 285 90 -239 -330 -7 242 346 126 -230 -334 -93 283 397 104 -250
3526 -250 -298 -86 228 345 81 -324 -411 -109 187 282 105 -265 -424 -102 286 322 102 -182 -265 -108 236 342
3548 342 90 -174 -279 -131 153 319 144 -248 -309 -82 218 295 184 -178 -390 -151 198 294 98 -173 -310
3569 -310 -148 163 358 69 -208 -290 -163 143 351 139 -188 -304 -83 159 300 167 -199 -326 -121 227
3589 227 304 149 -171 -305 -195 212 368 88 -188 -284 -210 147 317 125 -244 -264 -102 120 313 185 -173
3610 -173 -365 -115 203 308 102 -97 -334 -228 209 334 156 -137 -277 -149 25 327 145 -187 -327 -121
3630 -121 158 286 203 -99 -345 -179 169 284 137 -116 -301 -161 196 296 176 -146 -215 -183 103 288 230
3651 230 -61 -385 -136 98 169 206 -81 -313 -207 77 276 108 -89 -305 -198 116 265 183 -100 -270 -217
3672 -217 48 335 186 -120 -267 -171 120 280 195 -48 -262 -165 90 229 219 -107 -288 -238 63 287 141 -77
3694 -77 -281 -191 71 241 199 -66 -292 -235 99 241 175 -53 -292 -180 105 235 215 -111 -252 -187 54 252
3716 252 208 -38 -270 -151 69 286 156 -30 -265 -208 79 267 183 -86 -279 -221 -6 268 234 -30 -247 -214
3738 -214 98 239 179 8 -289 -166 72 218 275 -15 -267 -264 21 277 195 -49 -208 -214 -14 211 215 -37 -242
3761 -242 -200 17 232 184 -25 -283 -221 59 244 197 -18 -217 -184 -16 271 208 10 -181 -158 19 251 226 -46
3784 -46 -253 -204 -9 209 177 50 -241 -204 56 245 240 -16 -192 -284 -63 273 214 -21 -163 -179 -11 220 266
3807 266 15 -206 -237 0 194 219 66 -234 -238 -28 225 218 -5 -170 -227 -76 199 167 22 -196 -268 -62 210
3830 210 209 3 -168 -229 11 184 279 48 -166 -218 9 197 184 92 -181 -214 -54 237 260 -19 -151 -206 -80
3853 -80 188 206 59 -144 -199 -59 178 192 51 -184 -261 -33 143 213 39 -151 -268 -71 160 217 8 -137
3875 -137 -226 -84 169 177 73 -164 -284 -91 150 171 22 -178 -212 -86 130 183 111 -171 -284 -63 193 295
3897 295 16 -123 -237 -123 126 250 70 -195 -200 -49 139 225 137 -139 -185 -50 131 188 99 -144 -227 -140 150
3920 150 193 42 -121 -286 -84 166 225 117 -126 -180 -98 122 243 71 -117 -219 -66 134 205 29 -121 -200
3942 -200 -69 123 231 104 -111 -203 -78 92 220 105 -140 -210 -118 116 220 91 -146 -199 -131 112 224 167
3964 167 -79 -184 -77 116 243 127 -88 -192 -72 76 198 85 -51 -217 -125 72 237 110 -82 -208
3984 -208 -126 29 178 152 -88 -261 -100 78 133 169 -44 -231 -138 66 190 129 -56 -156 -121 68 262 117
4006 117 -90 -149 -66 11 177 121 -55 -178 -111 28 205 164 -98 -191 -139 35 147 131 -82 -191 -198 56 191 121
4030 121 -30 -153 -168 75 186 117 -8 -150 -130 55 163 153 -83 -262 -139 59 156 163 -45 -192 -149 38 193
4053 193 131 -17 -182 -147 -8 160 195 -52 -177 -117 33 176 124 -39 -176 -138 22 176 164 -74 -143 -155 3
4076 3 184 174 -15 -155 -201 -37 143 195 -60 -182 -175 0 180 145 32 -218 -190 -5 188 154 -38 -90 -179 35
4100 35 157 187 47 -137 -137 -52 185 180 -11 -198 -152 -15 101 175 17 -187 -149 12 143 133 -18 -155 -213 -75
4124 -75 138 178 47 -80 -189 -19 189 165 11 -148 -140 -51 174 223 36 -233 -153 15 128 143 33 -166 -107
4147 -107 -6 135 154 66 -201 -193 1 118 168 32 -146 -144 -33 111 207 44 -120 -195 7 134 136 -14 -110 -160
4171 -160 -43 139 135 37 -109 -154 -51 114 151 30 -113 -212 -82 82 186 30 -107 -144 -91 122 168 50 -93
4194 -93 -147 2 164 162 95 -119 -184 -44 68 164 75 -92 -124 -120 113 180 81 -86 -154 -78 86 158 6 -115 -145 -107
4220 -107 76 200 52 -74 -151 -87 97 188 67 -50 -149 -76 57 189 88 -29 -146 -67 73 161 62 -70 -155
4243 -155 -103 80 142 68 -123 -146 -76 65 130 99 -77 -135 -39 65 171 94 -141 -216 -108 77 145 85 -47 -145 -19
4268 -19 119 173 38 -66 -190 -122 70 145 52 -73 -191 -97 94 140 45 -48 -173 -136 37 188 112 -63 -198 -139
4292 -139 99 138 104 -50 -106 -100 46 140 123 -61 -231 -106 19 102 184 -32 -151 -130 65 172 103 -5 -163 -104
4316 -104 3 183 183 -22 -149 -91 38 140 98 -72 -139 -128 33 128 156 -44 -122 -141 67 142 99 -43 -205 -208 25
4341 25 142 93 -64 -161 -130 8 134 110 -20 -139 -93 15 190 82 -28 -140 -150 -28 143 129 -28 -158 -154
4364 -154 -30 173 144 -77 -118 -125 8 84 125 -11 -183 -171 -43 64 107 -12 -95 -167 -20 117 121 1 -68 -139 -5
4389 -5 116 72 12 -130 -138 -17 152 155 13 -123 -102 1 98 123 81 -99 -131 -15 131 113 38 -100 -103 -72 116 126
4415 126 38 -108 -143 35 134 175 -6 -134 -190 -50 107 84 1 -89 -130 -11 115 84 31 -79 -180 -48 75 208
4439 208 39 -120 -124 -1 135 142 71 -90 -106 -70 138 175 56 -69 -155 12 89 177 3 -129 -151 -57 95 119 46
4464 46 -126 -131 -100 96 159 40 -57 -163 -68 96 149 37 -104 -119 -49 75 163 51 -47 -79 -30 81 152 63 -94
4489 -94 -153 -17 104 120 62 -133 -147 -99 103 92 71 -140 -167 -97 120 112 49 -76 -135 -78 86 172 12 -90 -153 -47
4515 -47 66 132 62 -68 -184 -23 126 85 55 -102 -162 -90 48 139 87 -76 -154 -37 85 129 104 -91 -154 -93 86
4540 86 106 30 -86 -158 -125 107 68 60 -35 -128 -71 95 137 46 -91 -175 -87 96 132 87 -39 -165 -77 51 129 91 -46
4567 -46 -179 -62 52 87 20 -22 -101 -121 39 124 100 -59 -103 -89 75 145 112 -47 -120 -75 0 111 117 -37 -119 -118 23
4594 23 114 61 -11 -162 -82 47 133 105 -18 -164 -82 47 172 111 9 -157 -77 37 139 125 31 -64 -101 57 120
4619 120 140 -71 -139 -101 4 60 76 -13 -122 -79 31 169 152 -21 -146 -121 37 138 68 -9 -128 -72 -6 165
4643 165 116 -57 -109 -99 5 149 150 -32 -117 -87 67 119 133 6 -147 -122 -11 87 102 27 -132 -124 15 127 108
4668 108 -46 -106 -225 -11 112 97 27 -100 -121 -39 124 107 12 -124 -102 6 102 139 -12 -98 -144 -27 178 123
4692 123 32 -67 -104 2 94 150 23 -90 -103 -35 153 103 12 -91 -163 -23 71 142 1 -132 -115 -11 85 137 16
4717 16 -123 -156 -61 94 133 1 -152 -163 -47 101 134 45 -92 -87 -39 124 148 -2 -125 -151 -21 128 174 32
4741 32 -97 -138 47 165 97 32 -88 -96 -91 97 135 36 -55 -102 0 119 98 45 -74 -174 -10 89 113 55 -114 -126
4767 -126 -39 125 109 28 -64 -150 -104 87 174 108 -46 -152 -73 153 164 33 -80 -185 -10 101 126 98 -60 -116
4791 -116 -74 87 113 83 -127 -144 -47 99 126 74 -84 -176 27 127 123 77 -93 -107 -109 87 152 45 -88 -119 -58 86
4817 86 126 79 -120 -106 -65 63 147 80 -79 -178 -61 102 116 64 -96 -107 -84 63 157 62 -79 -182 -82 22 154
4842 154 46 -51 -153 -94 38 105 69 -116 -159 -89 40 99 94 -25 -99 -111 119 139 116 -22 -123 -118 47 101 76 -29
4868 -29 -131 -78 59 111 47 -36 -87 -83 81 118 40 -25 -171 -72 19 153 57 -108 -183 -66 3 129 61 -36 -181 -131
4894 -131 86 102 45 -26 -101 -89 63 158 26 -29 -133 -54 21 121 82 -24 -78 -132 17 146 89 -41 -142 -139 72
4919 72 109 81 -39 -107 -97 7 119 75 -23 -132 -141 16 113 100 17 -130 -68 35 140 162 -81 -181 -41 50 100
4944 100 129 -21 -148 -130 12 164 121 -33 -158 -124 11 67 103 -40 -117 -142 -16 84 100 -15 -109 -104 -13 116
4968 116 85 -34 -142 -128 49 91 66 -20 -167 -89 34 134 98 0 -114 -79 -46 105 105 -37 -109 -143 16 103 123
4993 123 45 -68 -74 54 142 101 2 -134 -127 -14 81 121 17 -138 -113 33 153 129 8 -95 -79 3 145 91 -2
5018 -2 -123 -95 -13 109 119 -46 -103 -93 18 129 156 18 -108 -190 12 73 113 21 -171 -90 -27 135 128 43 -147 -89
5044 -89 -28 66 140 58 -93 -132 -3 75 111 -3 -119 -121 10 57 98 23 -78 -104 -35 85 92 21 -65 -125 -22 114 103
5071 103 29 -89 -99 42 108 101 23 -70 -138 -18 118 93 11 -63 -115 -33 104 124 15 -80 -170 -33 66 72 70 -151 -118
5098 -118 -35 88 161 32 -86 -137 -22 148 146 -12 -109 -140 -14 97 98 44 -57 -127 -37 100 115 35 -87 -118 -50
5123 -50 109 92 47 -121 -121 -48 120 112 17 -62 -209 -49 95 124 19 -111 -77 -35 78 107 38 -93 -125 -22 101
5148 101 128 39 -70 -113 -82 57 137 29 -51 -105 -90 54 113 59 -56 -183 -16 33 107 61 -61 -149 -84 90 118
5173 118 42 -124 -148 -79 25 107 26 -34 -155 -90 19 50 44 -79 -156 -135 62 135 46 -86 -95 -90 78 126 60 -61 -112
5200 -112 -110 87 158 83 -63 -129 -43 1 155 49 -86 -112 -98 60 85 50 -7 -109 -64 52 96 67 -55 -146 -50 54
5226 54 180 40 -65 -97 -65 60 165 54 -79 -177 -85 106 82 119 -73 -105 -130 5 164 86 -57 -143 -135 18
5250 18 154 93 -51 -85 -72 53 103 123 -79 -154 -74 11 127 73 -34 -168 -82 57 137 57 -127 -150 -67 72 125
5275 125 103 -24 -114 -81 -10 142 116 -84 -153 -62 89 182 61 -21 -106 -84 78 126 127 -54 -114 -86 21 100 61 -62
5301 -62 -191 -74 10 149 61 -28 -106 -89 -14 141 105 22 -151 -132 9 104 50 -58 -114 -61 52 93 118 -49 -131 -58
5327 -58 30 95 92 45 -158 -62 -5 93 151 -16 -164 -154 7 82 146 -30 -176 -73 -55 123 102 6 -130 -69 18 111
5353 111 103 -19 -97 -135 23 154 94 7 -104 -122 -1 125 115 -11 -125 -145 1 131 105 -15 -56 -105 -14 109
5377 109 128 12 -138 -133 -14 139 52 -57 -120 -109 -19 138 122 -38 -165 -131 -64 101 127 -7 -146 -136 -6 125
5401 125 135 -1 -138 -121 15 107 93 19 -139 -135 -16 100 92 -12 -127 -92 13 77 125 -3 -91 -141 -4 104 100
5426 100 -21 -120 -151 25 92 134 -43 -123 -99 -9 137 95 22 -119 -139 -47 129 163 -20 -74 -138 52 107 121 5
5451 5 -72 -40 -28 82 86 23 -84 -86 -13 154 146 26 -86 -166 -45 53 69 45 -47 -135 -32 156 115 70 -72 -120 -24 95
5479 95 138 54 -145 -120 0 86 144 37 -83 -84 -39 88 103 20 -135 -153 -24 36 140 48 -139 -113 -94 88 133 23
5505 23 -53 -134 -43 90 85 48 -97 -149 -71 97 124 -6 -107 -75 -45 79 134 28 -106 -141 -28 47 82 42 -95 -97
5531 -97 -6 97 130 52 -77 -125 5 80 138 45 -98 -111 -44 97 182 49 -89 -81 -39 70 133 56 18 -114 -28 80
5557 80 158 40 -106 -119 -64 99 99 25 -22 -105 -54 85 157 49 -90 -144 -48 78 153 47 -66 -92 -19 101 59 69
5583 69 -85 -122 -35 94 107 58 -77 -105 -56 87 114 53 -33 -114 -60 100 98 46 -63 -157 -44 32 65 73 -61 -106 -53
5610 -53 92 164 73 -90 -121 -80 21 131 77 -111 -151 -76 33 118 49 -88 -86 -126 64 90 95 -20 -106 -10 70 118 63
5637 63 -35 -190 -93 40 137 30 -87 -101 -97 52 132 10 -59 -111 -26 37 117 78 -46 -120 -60 68 109 70 -54 -107
5663 -107 -53 64 89 42 -30 -138 -65 69 136 111 4 -160 -71 55 114 90 -51 -94 -87 42 120 28 -81 -90 -69 51
5689 51 90 79 -43 -85 -137 60 73 79 -49 -137 -76 41 114 51 -64 -114 -63 7 136 78 6 -171 -70 43 110 109 -36
5716 -36 -106 -95 41 144 67 -48 -97 -106 -20 133 112 -48 -159 -55 77 128 50 -28 -85 -116 64 101 136 -42 -116 -133
5742 -133 39 115 87 -76 -92 -55 19 106 90 -44 -139 -100 13 107 73 -16 -138 -110 39 81 58 -39 -90 -81 -32 105 118
5769 118 -22 -102 -103 46 166 39 -14 -123 -108 25 86 79 -24 -54 -58 1 79 102 -51 -118 -90 -21 154 64 -1 -138
5795 -138 -66 19 74 115 -71 -74 -111 20 102 87 -13 -104 -74 0 127 72 -46 -74 -83 12 72 50 26 -67 -86 39 129 164
5823 164 -27 -72 -103 16 102 72 -25 -127 -138 -11 37 60 -1 -98 -134 -20 73 145 43 -104 -109 -36 120 118 12 -109
5849 -109 -151 -15 136 102 -27 -79 -79 -15 60 96 31 -83 -62 -10 131 119 -30 -133 -95 -45 74 109 19 -133 -152 15
5875 15 49 137 -3 -61 -113 -10 101 80 -3 -82 -114 -41 101 84 6 -100 -50 -16 83 115 44 -93 -114 -26 77 127 -8
5902 -8 -71 -135 1 96 164 -11 -68 -85 -6 109 112 14 -59 -122 -21 89 86 30 -84 -106 -35 84 161 50 -77 -137 -53
5929 -53 96 82 -5 -42 -110 -37 101 98 43 -99 -134 -33 101 113 -9 -66 -64 -66 63 59 86 -56 -46 -21 52 73 38 -74
5957 -74 -101 -48 68 94 19 -75 -158 12 58 91 5 -100 -159 -63 61 151 44 -55 -121 -7 50 67 -8 -95 -93 -57 97
5984 97 61 21 -73 -45 0 75 50 -13 -89 -105 7 23 99 66 -21 -77 -31 60 130 52 -5 -91 -58 39 108 29 -82 -129 -97
6013 -97 74 89 41 -78 -143 -26 54 52 41 -47 -120 -39 97 65 25 -24 -95 -31 40 139 51 -66 -138 -31 39 106 66 -57
6041 -57 -92 -13 82 159 70 -29 -59 -13 57 91 50 -44 -82 -84 16 97 83 -26 -133 -75 95 101 54 -37 -112 -77 68 32 89
6070 89 -33 -91 -36 75 114 1 -40 -124 -78 41 56 -30 -68 -91 -59 79 95 37 -71 -99 -60 3 130 132 -44 -24 -76
6097 -76 57 87 39 9 -103 -15 -2 98 53 -72 -86 -107 42 126 40 -50 -76 -43 36 122 83 -17 -82 -19 8 74 135
6124 135 31 -123 -19 30 59 85 -11 -97 -38 87 153 35 -45 -142 -42 3 63 79 -82 -101 -82 21 106 55 13 -86
6150 -86 -43 -25 58 70 -39 -148 -81 38 95 38 -85 -136 -15 31 25 65 -69 -85 -73 22 21 48 -22 -85 -16 -1 105 57
6178 57 -21 -72 -61 2 76 118 -2 -112 -81 54 52 86 -31 -117 -80 67 97 79 -40 -117 -39 -5 79 104 -12 -91 -77
6205 -77 62 110 80 -44 -117 -76 16 59 51 29 -81 -102 4 39 55 -10 -113 -83 24 113 57 -65 -71 -44 -10 90 67
6232 67 -8 -95 -102 20 59 51 -32 -120 -69 -13 107 49 -75 -93 -79 -29 73 63 -36 -91 -64 4 111 103 -41 -24 -41 54 92
6261 92 94 -23 -89 -89 22 107 110 -9 -103 -110 9 69 50 22 -96 -106 14 118 68 -57 -115 -60 13 43 57 33 -42 -63
6289 -63 7 98 78 5 -52 -78 -9 36 66 17 -66 -52 -95 84 160 -9 -89 -74 38 71 80 -8 -114 -58 2 29 118 -33
6317 -33 -72 -106 -41 28 80 -43 -96 -52 15 55 8 14 -29 -90 18 80 34 30 -41 -101 -20 71 80 15 -71 -69 36 67 45 -6 -76
6348 -76 -65 -10 109 80 6 -82 -78 -13 56 59 54 -73 -48 -17 13 73 -3 -94 -39 1 72 75 5 -101 -75 -51 53 108 26 -85
6378 -85 -119 -13 101 90 52 -30 -72 12 83 89 -29 -24 -73 -52 76 80 34 -89 -80 24 102 136 8 5 -102 -17 76 55 -6
6407 -6 -41 -73 -77 32 73 28 -61 -76 18 36 57 -27 -22 -92 -17 15 22 30 -86 -74 -40 10 82 31 -66 -110 -10 55 27 21 -64 -73
6439 -73 -8 89 28 5 -51 -51 -38 95 47 -35 -10 -87 -25 17 99 10 -71 -57 -65 54 67 14 -51 -96 4 14 95 12 -71 -93
6469 -93 -50 61 23 21 -25 -81 22 62 133 42 -59 -81 -80 64 41 32 -75 -46 -31 21 89 87 -45 -126 -7 41 38 -13 -43
6498 -43 -37 -59 44 76 56 -4 -80 -17 71 82 -24 -62 -51 -31 -6 80 40 -28 -55 -14 101 126 31 -2 -121 -67 34 58
6526 58 56 -32 -81 -33 22 51 50 -24 -30 -75 23 56 -28 -7 -114 -76 33 108 19 -75 -72 -59 36 89 14 -9 -31 29 11 69 35
6557 35 -30 -130 -68 44 51 37 -96 -31 -69 9 52 15 -22 -97 -29 32 66 58 -23 -111 -3 -36 80 22 -39 -43 -5 52 99
6586 99 94 -36 -58 -55 -42 64 29 2 -58 -58 -20 54 16 -30 -141 -69 24 63 73 -48 -89 -41 33 77 22 -48 -61 -34 37 55
6616 55 -1 -73 -52 -75 -25 43 27 -84 -59 -46 56 56 57 -61 -89 -31 34 31 54 -80 -29 -61 31 73 19 -20 -91 -92 -2 48
6646 48 72 -57 -130 -107 14 77 -7 18 -93 -81 9 71 44 -34 -88 -56 -11 87 11 -37 -45 -49 37 40 43 -43 -83 -62 42 116
6676 116 -16 -1 -32 -57 -1 67 41 23 -80 -80 27 63 67 24 -2 -14 0 21 16 42 -68 -64 32 83 23 -7 -91 -76 19 21
6706 21 92 -78 -86 -38 12 20 74 -31 -65 -58 4 95 74 -71 -66 -22 54 93 60 3 -46 -48 9 17 33 7 -82 -5 23 68 -39
6737 -39 -35 -83 -62 36 71 75 -27 -37 -71 28 -7 37 -9 -4 -49 31 75 25 -17 -74 -37 -8 75 -16 13 -85 -32 -21 86 21 21
6768 21 -72 -61 75 28 42 -64 -6 -35 22 31 61 -28 -70 -13 -3 84 66 -65 -67 -113 -59 82 25 56 -38 4 16 67 47
6797 47 -47 -55 17 36 44 78 -20 -88 -47 -32 12 42 8 -61 12 72 72 87 -24 -109 -30 52 35 75 -22 21 -25 -8 -25 52 24
6828 24 -80 -65 18 34 45 8 9 -47 -31 17 55 3 -36 -70 48 45 19 -40 -5 -50 -51 14 71 -5 -44 -77 9 29 25 13 -87
6859 -87 -77 -41 -34 52 -8 -38 -46 19 -18 44 17 -10 -89 -43 75 38 4 -84 -30 -17 57 40 -16 11 -97 -5 15 13 0 -18 -52
6890 -52 17 69 55 -12 -48 -1 3 33 -2 -1 -40 -17 -44 52 -6 -8 -56 -68 9 69 37 -15 -39 -72 10 19 36 44 -62 -52 -31 6
6922 6 44 6 -17 -40 -21 34 30 -8 -47 -77 -24 40 30 -14 3 -47 -33 64 16 -23 -15 -34 23 61 55 25 -48 -119 1 38 54 13
6954 13 -18 -99 -45 46 50 -4 -7 -57 2 21 73 -64 -77 17 -10 31 6 31 -11 -46 -39 18 55 89 -41 -65 -37 61 88 -7 -71
6985 -71 -91 2 101 41 29 -73 -47 40 78 52 20 -37 -39 -52 -10 30 -13 -30 -58 -17 20 105 28 -48 -27 -29 7 11 41 -10 -38
7016 -38 -5 -10 -6 16 2 -57 -4 60 5 -13 -41 -48 4 66 45 -4 -21 -72 -34 39 -2 29 -13 -91 -66 32 83 -10 -52 -103 -20 38
7048 38 40 1 -62 -1 -64 14 71 36 1 -43 -11 18 30 44 -39 -57 -59 35 57 -30 -34 -53 -48 26 -32 22 -8 -19 -67 -58 33 -3 22
7081 22 2 55 34 9 36 -62 -86 -16 -47 50 49 -22 -81 -38 31 55 -50 -57 -67 -57 -2 65 46 -36 -43 -48 5 8 43 -11 -31 -33 45
7114 45 57 14 -15 -74 -1 6 58 52 -26 -72 -39 34 60 35 -15 -34 -26 44 14 21 35 4 -60 12 58 -12 25 -34 -48 8 77 26
7146 26 1 8 -40 45 47 -8 -22 -61 -48 -41 11 21 -61 -95 -11 49 20 -3 24 -70 -4 5 25 45 -75 -46 -53 43 16 20 -18 -54 -47
7179 -47 -15 77 32 -44 -6 -46 20 8 4 -20 -79 33 66 33 50 -15 -77 -16 29 22 76 -69 -67 3 30 36 35 -10 -44 -2 -8 27
7211 27 6 -76 -23 -21 53 37 4 -47 -50 25 49 -10 -43 4 -70 -48 73 -17 -21 28 -54 -37 40 71 18 -3 -14 -51 0 27 -27
7242 -27 -34 -29 -35 -3 25 27 51 -37 21 30 21 48 -37 -45 -20 51 27 17 4 -74 -48 13 29 31 -47 -68 -27 -33 18 34 -15 -21 19 -50 36
7277 36 27 -8 -106 -1 34 1 55 -5 -44 -31 -24 54 32 -35 27 -16 45 -30 18 -25 -16 -45 36 57 44 24 -27 -47 -45 58 23
7308 23 -16 -19 -32 5 14 5 19 -29 -19 -13 42 9 39 -35 -15 23 5 24 1 -35 -54 7 -9 1 -11 -12 -45 -12 44 69 -50 -54 -48
7341 -48 10 32 34 26 -26 -38 -14 90 19 -45 -16 -59 18 11 16 19 -24 -1 53 66 37 -55 -51 -4 -21 34 14 -41 -7 -12 -10 71 18 -18
7375 -18 -43 -28 -33 35 50 -32 -16 -42 -3 46 54 -37 -7 -30 44 31 13 -17 -20 13 -5 59 15 -3 -53 -54 -46 39 42 -17 -38 -24 36
7408 36 2 41 -57 -60 -47 -53 36 59 61 -54 -30 9 36 9 38 -47 -43 -36 53 6 25 -27 -15 8 40 67 -17 -3 -34 11 -1 56
7440 56 -27 -48 -33 -1 -2 28 19 -44 5 10 69 25 -6 -31 -12 36 4 56 -42 -18 -38 -17 51 -22 -6 10 6 -55 16 3 24 -23
7472 -23 -64 2 45 48 7 -42 -46 6 32 55 -3 -80 -9 -13 56 9 13 -29 19 -9 31 26 -19 -50 -31 -27 46 12 -4 -46 -55 -4 62 38
7506 38 -20 -75 -29 -24 -18 34 -1 -30 -9 13 33 -54 64 -29 -23 -21 -16 58 55 30 -15 -71 -29 3 1 -20 -49 50 -14 41 5 -11 -38
7539 -38 -29 7 40 -27 -13 -58 -28 34 26 -3 -36 -94 3 -7 34 -23 -24 -58 6 37 -21 -22 -11 -68 -14 41 79 74 -31 -80 3 51
7571 51 53 -44 -25 -85 -8 90 19 26 -50 -32 -4 67 -23 -9 14 -12 0 35 33 53 -30 -76 21 6 53 0 -40 -56 -31 -39 30 9
7603 9 -54 -26 -32 12 47 23 15 -20 -39 21 27 -1 -18 31 -8 25 23 -23 -46 -87 7 13 -5 50 -19 -71 -32 19 25 -10 -6 -92 -47 39
7637 39 -18 38 -16 -36 1 3 14 77 -10 -47 8 -14 40 9 -2 -56 -9 -11 52 99 -5 -33 12 26 92 -7 -53 -57 -31 21 37
7668 37 17 -23 -47 2 21 35 20 21 -65 -29 71 22 26 -84 -22 -48 6 -13 12 -32 -9 6 27 24 42 -61 -23 -62 15 16 0
7699 0 -41 -55 -23 11 28 0 -55 -3 35 51 42 -32 -15 -52 -57 2 34 -33 -66 -47 -11 36 32 37 32 -65 -16 39 49 18 -20 -68 -58
7732 -58 -31 45 30 54 -33 -23 22 60 -12 -4 35 -15 37 51 -3 -35 -32 -30 29 47 27 -4 -83 29 2 -4 71 -12 -51 -15 21 68
7764 68 -27 -24 -60 -83 18 27 -2 -73 -14 -25 -29 -6 -4 -16 -62 8 23 70 27 -17 -76 -24 1 0 49 37 -22 -25 25 11 1 -43 -35
7797 -35 -24 21 68 54 -35 -16 -66 29 3 -20 -34 -8 -28 38 56 -20 -40 -88 -45 6 13 20 26 -63 -56 55 -21 -27 -30 -37 -7 -83 8
7830 8 19 -39 -38 -19 31 54 32 42 -39 -21 -42 14 66 -17 -60 -24 -26 -12 24 -60 -25 15 12 -32 29 -14 -7 -78 29 37 55 4 -49
7863 -49 -14 3 88 19 -16 -52 -39 -47 30 8 6 -28 -37 56 44 27 -21 -56 46 -2 -25 -3 79 -99 -6 -22 -11 96 -7 -42
7893 -42 -28 9 60 71 -29 -54 -60 14 -23 -1 -13 5 -37 28 35 41 30 -81 -2 26 92 -20 -26 2 -12 -17 -27 82 7 -80 -53
7924 -53 -33 61 18 2 -70 -37 -11 42 16 -44 -63 -38 -11 43 -7 -38 -54 -60 9 39 1 -10 -4 -20 1 24 26 51 -32 -32 -11 43
7956 43 41 -31 -31 -38 40 73 -40 30 4 -60 -16 -50 19 -49 -67 -85 -29 35 69 -3 -53 -42 10 71 46 -13 -37 -78 -16 64 99
7987 99 -3 -39 -72 4 -22 11 16 -39 -36 -18 29 42 -47 -70 -33 -5 -1 -27 7 -27 0 -21 10 41 23 -8 -66 13 38 43 -1 -67
8019 -67 -40 -62 4 16 27 -27 -10 -7 49 34 29 -16 -16 -20 21 53 42 -17 21 -18 -27 62 -8 -5 -47 8 -15 2 -2 -19 -74 -21 13 8
8053 8 -33 -62 -13 -13 1 27 55 -57 -30 -37 8 65 12 -63 -46 -9 -22 116 -21 -36 -30 -8 64 5 -41 31 -61 25 40 48 -3
8084 -3 -16 -66 -21 49 -35 -48 -34 -58 4 24 28 -21 -19 -14 -24 52 45 59 -26 -44 -2 51 -8 -23 -20 -85 -10 32 -24 64 -7 -64 -7
8117 -7 80 -18 3 -12 -3 30 30 21 21 -62 -69 -29 4 12 35 -23 -56 23 73 41 31 2 -27 57 -7 72 4 -7 -45 -5 -20 40 8 9
8151 9 -47 -1 -4 51 26 -44 -28 -10 12 36 24 -29 -3 -33 11 43 44 -21 -90 -95 31 56 -22 -22 -3 -18 44 24 18 27 -19 19 -9
8184 -9 44 33 8 -20 -1 -23 56
8191E6
$$ Imaginary data points
##PAGE= N=2
##DATA TABLE= (X++(I..I)), XYDATA
0 0 0 0 0 0 0 0 0 0 0 0 0 8 -8 8 -8 16 -16 16 -24 25 -32 40 -48 56 -65 74 -89 104 -115 137 -154 177 -199
33 -199 227 -252 285 -323 358 -403 447 -499 555 -616 681 -754 832 -918 1013 -1116 1230 -1353
51 -1353 1491 -1643 1814 -2007 2220 -2465 2747 -3075 3462 -3926 4498 -5218 6159 -7449 9323
66 9323 -12311 17810 -31224 131230 63369 -248934 56141 143048 -114671 -67380 168710
77 168710 -12703 -144595 35547 61738 -69412 44798 78004 -109590 -66313 134071 17457
88 17457 -103647 58624 73085 -130398 -51662 143497 26106 -115854 6033 51615 -51663
99 -51663 -4312 87514 -8978 -74618 15020 37322 -19983 13002 38679 -37492 -56810 23911
111 23911 43604 -4662 -14317 -5659 -19828 -6510 30624 25298 -8550 -17328 -15270 -11565 22623
124 22623 42988 -11859 -56505 -4345 38611 -4510 -14846 35012 7711 -60690 -13813 67002
136 67002 27321 -40894 -20568 10435 -1579 1585 17784 6480 -13650 -24632 -16372 27373
148 27373 45324 -15168 -51888 3142 31941 -8940 -5500 30405 -6519 -49191 -2203 44464
160 44464 15513 -16020 -13168 -11305 -2303 19122 16753 -2857 -11563 -16465 -8940 21154 27994 -5823
174 -5823 -24227 -10435 1150 11510 21858 2769 -26844 -18647 8705 13163 6410 4452 -7148
187 -7148 -21858 -10738 20903 30151 -1842 -30414 -12053 17249 9061 -3046 10828 2715 -31512
200 -31512 -17902 32518 29963 -15193 -24131 -1725 6809 6805 9921 6244 -5120 -18299 -17180 13946
214 13946 34004 -2626 -38238 -9798 21225 3010 -3570 18625 2491 -33104 -10881 32658
226 32658 21559 -12798 -16114 -6620 -2851 7985 15345 3339 -11460 -14050 -5907 12767 23514
239 23514 3623 -21128 -13077 6373 7197 6801 8796 -10325 -26650 -3188 22998 10166 -6869
252 -6869 -3018 -8135 -14478 11122 30266 1449 -25426 -9349 7169 3211 8303 11119 -10436
265 -10436 -21591 -1869 14298 13964 7242 -11572 -22358 2609 22550 3510 -6794 4786 -10386
278 -10386 -25501 11084 35661 -3968 -29831 -2911 8898 -2317 9928 16899 -10484 -22064
290 -22064 -84 12734 11033 7290 -10438 -21796 424 18361 5144 -1452 3053 -12324 -17697
303 -17697 13921 27214 -3295 -19663 -4994 -117 -610 13317 12229 -13584 -20784 -12 12629
316 12629 9239 4012 -5333 -14863 -6604 11738 15061 2825 -8698 -12497 -5820 9181 15614 3564
330 3564 -10573 -11045 -3586 5664 14827 9797 -11198 -18941 -650 13392 7323 1179 -1922 -12842
344 -12842 -13052 9197 20164 1931 -13826 -9208 -1422 4400 11945 8258 -7846 -14671 -4936 8199
358 8199 13967 6559 -9756 -14828 -2029 9412 9571 5323 -3336 -13990 -9696 9148 16819 3377
372 3377 -11108 -11497 -2830 4974 9538 7594 -4547 -16330 -8617 11509 15267 725 -7971 -7572
386 -7572 -6481 2928 15795 8799 -10571 -13317 -2404 5236 11260 9545 -7297 -16049 -2150 8998
400 8998 6825 6663 68 -16685 -11876 13021 14720 -2841 -5507 -4945 -11496 725 20218 7878
414 7878 -14670 -9986 676 406 9066 14125 -6459 -19343 -2115 10584 5928 5898 1239 -14996
428 -14996 -10983 11652 13374 -123 -2415 -6439 -13083 2699 20205 5202 -13713 -7621 -1305
441 -1305 -2129 9444 14301 -6401 -18407 -3578 8476 7618 6791 -1053 -13898 -8495 8390 10898
455 10898 3897 -1092 -9640 -11713 5063 16976 4768 -8851 -7793 -4402 292 10729 10576 -5210
469 -5210 -14132 -6256 4773 10046 7419 -3790 -12440 -7245 4638 10118 6890 -2630 -11320 -8410
483 -8410 4424 12198 7148 -4017 -10458 -6420 4102 10854 7585 -2826 -11180 -8165 4122 11509
497 11509 6698 -3371 -10335 -8401 3050 12232 7101 -4847 -9818 -6771 1220 10092 8930 -4018
511 -4018 -12131 -6398 3299 9029 8324 -1557 -11834 -7719 5092 10083 6425 -642 -9590 -10365 3024
526 3024 12956 6137 -4505 -8076 -7316 -99 10764 9450 -3967 -10504 -5827 1301 8453 9604 -2017
541 -2017 -12598 -7279 3814 7973 6809 73 -10134 -9703 3531 11643 6872 -1833 -7796 -7999 759
556 759 10592 8672 -2516 -9857 -7558 1191 9023 8271 -1387 -10046 -8034 2056 9529 7312 -1664
571 -1664 -9088 -8438 458 9594 8216 -2357 -9623 -7016 999 8365 9096 136 -9731 -7929 2488
586 2488 8969 7308 104 -8410 -9172 1174 10057 6910 -1803 -7618 -7986 -585 9506 8957 -2044
601 -2044 -9062 -6957 -228 7683 9297 -670 -10458 -7647 1343 7082 7960 1192 -9117 -8871 2179
616 2179 8795 6716 782 -6912 -9293 68 9900 7384 -1183 -6851 -8190 -1530 9276 9307 -1985
631 -1985 -8470 -6120 -1155 6121 9887 879 -10483 -7997 1761 6377 6707 2349 -7615 -9989 982
646 982 9191 6080 413 -5067 -8998 -2136 10192 9221 -2262 -7188 -5375 -2068 5730 10270 1062
661 1062 -9781 -7426 691 5334 7254 2811 -7810 -10100 405 8219 5972 512 -5317 -8709
675 -8709 -2341 8649 8937 -749 -7056 -6269 -1560 6202 9660 1678 -8413 -7650 283 5992 7335
690 7335 2531 -6768 -9403 -650 7575 6653 629 -5697 -8334 -2523 7261 8445 237 -6872 -7144 -1653
706 -1653 6014 8606 1693 -6998 -7720 -1059 6004 8000 2498 -6196 -8355 -1143 6892 7576 1526 -5694
722 -5694 -7710 -1972 6056 7796 1589 -6147 -8075 -2216 5912 7888 1637 -6176 -7878 -2059 5680
737 5680 7608 1963 -5483 -7590 -2469 5482 8355 2462 -5960 -7561 -1563 5594 7552 2583 -5280
752 -5280 -7757 -2024 5449 7483 2569 -5178 -8308 -2631 5797 7445 1566 -5210 -7326 -2811 4773
767 4773 7751 2449 -5308 -7698 -2497 5166 7675 2371 -5142 -7246 -2252 4948 7571 2817 -4809
782 -4809 -7400 -2429 5039 7632 2743 -5071 -7740 -2437 4955 7059 2433 -4512 -7585 -3291 4575
797 4575 7532 2532 -4786 -7335 -2975 4356 7431 2698 -4593 -6829 -2540 4100 7272 3442 -4182
812 -4182 -7509 -2844 4845 7623 2919 -4454 -6978 -2783 3764 7031 3717 -4029 -8117 -3255 4367
827 4367 6623 2862 -3595 -7471 -3774 4551 7179 2085 -3648 -6084 -4095 3175 8608 3589 -5218
842 -5218 -6603 -1924 2825 6561 5060 -3465 -8354 -2616 4538 5501 3196 -1760 -7474 -5010 4618
857 4618 7649 1574 -3582 -5224 -4370 1896 8136 4037 -5104 -6751 -2172 2484 6076 4944 -3048
872 -3048 -7971 -2929 4263 5871 3441 -1735 -6923 -4556 4059 7512 2512 -3285 -5566 -3785 2030
887 2030 7074 4150 -3685 -7057 -3366 2703 6216 3865 -3099 -7063 -3591 2956 5956 3739 -2103
902 -2103 -6638 -4413 3004 7099 3710 -2766 -6062 -3660 2554 6712 3987 -2620 -6119 -3745 2102
917 2102 6421 4438 -2749 -7008 -3637 2808 5751 3624 -1962 -6602 -4693 2492 6616 3591 -2356
932 -2356 -5878 -4546 1765 7111 4323 -2989 -5772 -3112 1353 5672 5385 -1736 -7287 -3646 3111
947 3111 5442 3670 -973 -6278 -5264 2477 6633 3056 -2033 -4966 -4979 634 7048 4764 -3218 -6012
963 -6012 -2873 1027 4778 5287 -1006 -7081 -4170 2858 5509 3774 -596 -5778 -5232 2250 6819 3431
979 3431 -1871 -4706 -4533 230 6307 5245 -2288 -6300 -3581 1216 4738 4557 -1047 -6281 -4468 1707
995 1707 5232 4009 -628 -5621 -5092 1489 6350 4137 -1436 -4920 -4240 657 5730 5048 -1037 -5584
1011 -5584 -4308 924 5370 4677 -1007 -5658 -4454 944 5059 4374 -860 -5622 -4813 870 5304 4340
1027 4340 -803 -5421 -4831 907 5429 4303 -607 -4782 -4779 293 5828 4961 -1018 -5057 -3809 360
1043 360 4677 5077 -284 -5577 -4465 915 4598 4294 84 -5284 -5397 777 5440 3789 -746 -4158
1059 -4158 -4838 -655 5318 5317 -854 -5190 -3968 330 4310 4974 296 -5094 -4511 751 4578 4345 420
1076 420 -4496 -5163 45 5341 4507 -587 -4688 -4462 -288 4308 4784 152 -4949 -4907 13 4566 4484
1093 4484 175 -4408 -4804 -116 4860 4580 -73 -4172 -4228 -455 4515 5414 265 -5111 -4366 455
1109 455 4031 4316 789 -4336 -5297 -311 4627 4261 142 -4016 -4912 -848 4440 4712 -167 -4317
1125 -4317 -4231 -600 3805 4950 780 -4527 -4742 1 4346 4417 743 -3738 -4712 -630 4338 4764 614
1142 614 -4039 -4632 -608 3985 4479 636 -3917 -4731 -746 3976 4361 421 -3783 -4659 -1105 3946
1158 3946 4904 422 -4130 -4184 -672 3494 4940 1382 -4011 -4863 -358 4022 4274 1054 -3205 -4814
1174 -4814 -1178 4087 4728 438 -3566 -4087 -1391 3270 4972 900 -4283 -4441 -604 3090 4220 1625
1190 1625 -3556 -5159 -806 3967 4285 1066 -2945 -4608 -1411 3672 4808 1021 -3270 -4232 -1302
1205 -1302 3191 4750 1274 -3537 -4468 -978 3200 4257 1275 -3275 -4821 -1489 3272 4398 1154
1220 1154 -3377 -4536 -1336 3107 4420 1582 -2910 -4455 -1394 3246 4442 1328 -2846 -4306 -1526
1235 -1526 3201 4708 1280 -3041 -4124 -1489 2727 4702 1728 -3327 -4687 -1306 2722 3912 1604
1250 1604 -2750 -4779 -1833 3037 4257 1339 -2609 -4104 -1770 2910 4779 1522 -3055 -4064 -1385
1265 -1385 2452 4337 2162 -2728 -4745 -1352 3022 3998 1759 -2144 -4481 -2167 2890 4345 1157
1280 1157 -2606 -3976 -2321 2047 4726 1896 -3125 -4126 -1247 2167 3942 2417 -2220 -4804 -1725
1295 -1725 2934 3929 1683 -1839 -4186 -2439 2637 4720 1618 -2496 -3614 -1948 1692 4454 2333
1310 2333 -2640 -4540 -1771 2074 3752 2014 -2019 -4445 -2106 2308 4121 1978 -1955 -4024 -2237
1325 -2237 2019 4417 2345 -2230 -4226 -1797 2095 3763 2310 -1372 -4163 -2576 2204 4393 1750
1340 1750 -2189 -3627 -2220 1329 4043 2365 -2181 -4205 -1994 1588 3764 2572 -1699 -4589 -2281
1355 -2281 2404 3666 1717 -1058 -3510 -2979 1636 4896 2296 -2335 -3442 -1725 1088 3736 2852
1370 2852 -1852 -4458 -2041 1708 3293 2474 -1113 -4358 -2842 2067 4005 1726 -1347 -3363 -2940
1385 -2940 902 4341 2541 -1996 -3639 -1860 1239 3692 3015 -1128 -3940 -2139 1623 3534 2490
1400 2490 -1037 -4117 -2843 1562 3798 2083 -1221 -3502 -2819 1134 3897 2505 -1278 -3616 -2665
1415 -2665 871 3712 2410 -1451 -3588 -2307 750 3515 3072 -814 -3789 -2366 1477 3587 2713
1430 2713 -684 -3821 -2854 1159 3628 2284 -871 -3309 -2925 660 3831 2755 -1065 -3395 -2552 533
1446 533 3352 2855 -1125 -3851 -2496 868 3079 2735 -304 -3533 -2961 1085 3918 2761 -757 -3291
1462 -3291 -2662 701 3391 2531 -633 -3236 -3002 304 3515 2973 -896 -3483 -2466 641 3074 2723
1478 2723 -479 -3488 -3013 470 3248 2850 -385 -3375 -2877 742 3430 2624 -172 -2789 -2931 24
1494 24 3554 3026 -801 -3221 -2393 26 2647 3200 -55 -3632 -2987 631 2896 2489 25 -3100 -3344
1511 -3344 352 3410 2454 -389 -2500 -2931 -415 3419 3422 -547 -3136 -2195 118 2538 3275 329 -3355
1528 -3355 -2934 630 2829 2438 402 -2773 -3587 65 3539 2529 -617 -2598 -2721 -653 2805 3363
1544 3363 -178 -3218 -2589 -48 2470 3160 403 -3121 -2926 355 2735 2638 496 -2483 -3179 -91
1560 -91 3262 2869 -93 -2480 -2737 -481 2779 3208 21 -2994 -2917 -392 2441 2965 314 -2748 -2948
1577 -2948 -349 2444 3056 530 -2866 -3075 85 2695 2514 495 -2266 -3236 -546 3019 3046 183
1593 183 -2259 -2758 -799 2664 3299 97 -2645 -2461 -741 1725 3269 819 -3103 -3084 161 2111
1609 2111 2213 1153 -1947 -3644 -562 3155 2638 85 -1677 -2716 -1292 2520 3589 218 -2499
1624 -2499 -2194 -721 1632 3440 1091 -3007 -2928 87 1804 2175 1321 -2089 -3846 -553 2887 2322
1640 2322 262 -1458 -2896 -1459 2504 3427 287 -2284 -2337 -979 1729 3437 1075 -2500 -2597 -388
1656 -388 1653 2784 1515 -2135 -3353 -408 2260 2269 826 -1459 -3210 -1438 2379 2991 360 -1838
1672 -1838 -2535 -1320 1764 3274 893 -2187 -2540 -914 1548 3077 1348 -2194 -2922 -431 1722 2440
1688 2440 1480 -1443 -3170 -1019 2333 2751 686 -1484 -2706 -1509 1655 3014 832 -1835 -2651 -1295
1704 -1295 1437 3063 1186 -1951 -2592 -806 1276 2603 1637 -1557 -3250 -950 1926 2450 1006 -1158
1720 -1158 -2677 -1392 1909 3033 995 -1490 -2456 -1558 1358 3026 1022 -1966 -2525 -1142 979 2676
1736 2676 1651 -1652 -3051 -793 1652 2223 1325 -1020 -2966 -1555 1806 2795 948 -1252 -2383 -1502
1752 -1502 1290 3114 1447 -1504 -2346 -1178 956 2691 1691 -1587 -2916 -1161 1097 2211 1509
1767 1509 -1038 -2944 -1513 1570 2524 1215 -971 -2522 -1674 1193 2875 1369 -1253 -2445 -1498 1081
1783 1081 2771 1525 -1172 -2386 -1325 835 2643 1828 -1160 -2814 -1408 1121 2163 1409 -829
1798 -829 -2775 -1776 1139 2542 1368 -904 -2349 -1836 1023 2806 1400 -1056 -2161 -1548 512 2613
1814 2613 1974 -1106 -2642 -1155 885 2124 1806 -502 -2661 -1804 1121 2480 1262 -793 -2302 -1955
1830 -1955 563 2649 1557 -1049 -2322 -1579 431 2357 2053 -833 -2663 -1328 990 2063 1654 -237
1846 -237 -2364 -1933 973 2569 1419 -690 -2030 -1752 469 2563 1857 -824 -2275 -1505 395 2148
1862 2148 1969 -580 -2625 -1741 650 1948 1569 -231 -2250 -2023 633 2467 1633 -513 -1912 -1674
1878 -1674 391 2348 1839 -523 -2296 -1727 302 2180 1909 -485 -2246 -1642 386 2060 1936 -262
1894 -262 -2337 -1866 424 1953 1571 -310 -2201 -1997 384 2167 1695 -223 -1849 -1820 253 2397 1968
1911 1968 -399 -2057 -1658 40 1906 2062 -205 -2338 -1761 327 1891 1782 68 -2060 -2043 277
1927 277 2067 1604 -239 -1884 -2074 -12 2114 1828 -355 -1842 -1720 45 2108 2184 -141 -1987 -1644
1944 -1644 157 1842 2047 56 -2182 -1863 214 1761 1769 200 -1886 -2047 192 2064 1581 -50 -1650
1961 -1650 -2143 -357 2156 1901 -460 -1760 -1542 -458 1630 2449 215 -2333 -1617 411 1394 1744 702
1978 702 -1831 -2423 231 2174 1316 79 -1164 -2199 -625 2321 2128 -621 -1703 -1281 -743 1255
1994 1255 2633 259 -2535 -1680 401 1029 1541 979 -1689 -2629 201 2177 1285 120 -926 -2021
2010 -2021 -748 2201 2223 -422 -1591 -1292 -644 1114 2545 378 -2308 -1741 122 1074 1642 954 -1653
2027 -1653 -2516 -57 1928 1335 218 -1039 -2052 -737 1920 2097 -16 -1398 -1516 -603 1437 2331
2043 2331 447 -1832 -1611 -250 1093 1878 842 -1634 -2259 -204 1560 1499 465 -1179 -2056 -644
2059 -644 1669 1897 255 -1325 -1799 -681 1359 2081 363 -1457 -1681 -488 1210 2026 731 -1474
2075 -1474 -1828 -265 1323 1784 698 -1208 -2074 -558 1332 1663 513 -1176 -1938 -682 1347 1847
2091 1847 476 -1219 -1750 -758 1249 1933 407 -1341 -1717 -648 1085 1977 772 -1329 -1753 -378
2107 -378 1120 1746 944 -1072 -2027 -561 1324 1552 618 -903 -1979 -851 1340 1792 343 -1027 -1525
2124 -1525 -1054 931 2223 661 -1518 -1594 -502 641 1717 1171 -1160 -2149 -425 1254 1389 859 -585
2141 -585 -1960 -988 1410 1814 386 -847 -1471 -1225 833 2208 596 -1450 -1475 -584 418 1653 1369
2158 1369 -1163 -2164 -464 1214 1302 844 -441 -1863 -1165 1244 1921 579 -747 -1484 -1043 836 2037
2175 2037 845 -1157 -1521 -806 527 1707 1231 -1055 -2034 -735 881 1398 891 -566 -1798 -1131 905
2192 905 1771 725 -765 -1572 -940 729 1729 974 -635 -1664 -1014 770 1836 967 -829 -1553 -896
2209 -896 587 1595 1107 -712 -1814 -999 700 1566 916 -717 -1615 -942 565 1570 963 -537 -1709
2226 -1709 -1129 757 1783 900 -688 -1385 -938 438 1682 1303 -521 -1705 -870 648 1503 971 -463
2243 -463 -1565 -1166 476 1587 964 -542 -1599 -1135 460 1559 954 -549 -1491 -1104 372 1628 1236
2260 1236 -609 -1620 -862 535 1415 1152 -238 -1605 -1135 537 1604 955 -401 -1422 -1065 366
2276 366 1479 1101 -435 -1519 -1137 341 1488 1061 -548 -1413 -951 324 1306 1200 -240 -1623 -1222
2293 -1222 560 1491 933 -274 -1200 -1142 173 1474 1237 -337 -1481 -1019 393 1361 1059 -269 -1433
2310 -1433 -1137 193 1301 1184 -249 -1556 -1227 349 1408 990 -225 -1241 -1210 -6 1526 1337 -358
2327 -358 -1411 -974 235 1222 1250 -37 -1338 -1220 240 1404 1141 -231 -1299 -1153 190 1197 1109
2344 1109 -48 -1375 -1309 120 1357 1102 -264 -1255 -1079 42 1202 1197 -59 -1284 -1232 134 1365
2361 1365 1155 -146 -1212 -1001 68 1074 1357 161 -1444 -1307 260 1184 942 7 -1007 -1321 -114
2378 -114 1273 1174 -135 -1179 -1209 -161 1223 1226 -173 -1236 -999 -102 1031 1439 139 -1428 -1158 327
2396 327 1079 973 296 -997 -1543 -17 1413 1111 -139 -992 -1132 -261 1154 1231 -50 -1187 -1118 -226
2414 -226 993 1337 100 -1329 -1174 87 950 1068 370 -1034 -1408 -73 1289 1158 10 -879 -1055
2431 -1055 -275 980 1326 184 -1145 -1175 -91 986 1157 109 -1082 -1209 -176 950 1156 165 -1046
2448 -1046 -1267 -185 1007 1229 126 -958 -1139 -224 989 1243 310 -960 -1205 -166 1014 1145 199
2465 199 -812 -1155 -380 1003 1373 162 -1156 -1175 -279 757 1104 445 -952 -1384 -281 967 1057 253
2483 253 -787 -1244 -287 996 1206 199 -752 -1039 -421 840 1367 344 -992 -1034 -172 674 1169 624
2501 624 -941 -1373 -231 955 1020 286 -700 -1265 -488 845 1211 232 -805 -1119 -479 754 1261 313
2519 313 -889 -1053 -389 698 1236 483 -795 -1243 -358 767 1148 494 -726 -1194 -376 712 1088 466
2537 466 -736 -1281 -443 821 1003 356 -616 -1160 -620 673 1252 363 -835 -974 -449 536 1201 556 -777
2556 -777 -1200 -319 654 1003 629 -554 -1287 -437 861 944 342 -384 -1114 -798 653 1270 299 -770 -908
2575 -908 -521 345 1170 692 -839 -1195 -240 568 1013 694 -461 -1344 -534 795 1000 400 -411 -1020 -743
2594 -743 609 1326 385 -650 -879 -492 339 1116 733 -757 -1186 -352 490 870 595 -412 -1275 -662 654
2613 654 1051 439 -380 -985 -682 495 1222 530 -526 -892 -488 404 1056 727 -480 -1117 -516 522 952
2632 952 571 -383 -1112 -720 445 1047 506 -458 -978 -621 306 1024 613 -489 -966 -536 348 1023 646
2651 646 -392 -1083 -576 457 1009 618 -348 -968 -675 355 1073 635 -383 -1035 -621 291 937 631 -384
2670 -384 -1028 -647 360 966 626 -312 -1007 -688 344 981 635 -309 -916 -642 369 1026 643 -266 -938
2689 -938 -642 260 985 690 -322 -984 -628 269 894 681 -267 -996 -700 339 838 589 -203 -965 -753
2708 -753 340 969 610 -233 -843 -699 183 973 769 -279 -939 -636 237 906 760 -161 -942 -735 260
2727 260 869 676 -161 -878 -742 185 885 640 -180 -838 -696 142 844 763 -247 -881 -675 237 854 718
2747 718 -106 -845 -752 175 893 718 -158 -769 -699 94 875 760 -218 -918 -669 147 743 697 -68 -894 -799
2768 -799 184 842 638 -75 -773 -819 16 875 720 -189 -766 -625 48 813 869 -89 -835 -701 173 835 729
2789 729 28 -786 -859 90 889 685 -111 -729 -772 -51 757 751 -92 -828 -683 -18 649 725 -23 -807 -727 105
2811 105 713 665 41 -707 -738 24 826 774 -65 -685 -703 -1 680 799 24 -762 -747 -20 664 615 37 -693
2833 -693 -795 -18 742 696 29 -683 -751 -130 733 724 26 -701 -729 -10 618 691 138 -676 -787 -87 731 739 13
2856 13 -573 -729 -173 613 818 23 -743 -682 -107 517 742 142 -709 -717 -63 587 677 145 -577 -837 -93 701
2878 701 721 120 -553 -694 -193 631 846 120 -595 -668 -197 569 749 163 -664 -751 -88 495 672 191 -576
2899 -576 -795 -161 603 778 136 -521 -715 -192 598 759 208 -509 -710 -203 546 787 120 -560 -644 -174
2919 -174 520 783 286 -521 -734 -190 554 680 181 -576 -704 -188 485 658 246 -451 -734 -217 536 687
2939 687 159 -508 -683 -257 486 806 257 -533 -672 -177 483 701 264 -386 -707 -237 461 740 249 -456
2959 -456 -737 -241 484 741 250 -429 -708 -315 426 710 319 -494 -663 -231 470 670 245 -417 -723 -321
2979 -321 399 746 225 -429 -695 -320 363 641 294 -395 -768 -231 346 679 400 -384 -798 -332 402 604
2999 604 278 -305 -682 -359 426 777 323 -364 -590 -273 371 717 391 -335 -659 -315 316 624 265 -377
3019 -377 -699 -365 355 690 265 -338 -623 -416 277 658 291 -382 -681 -322 304 677 366 -315 -640 -316
3039 -316 306 632 389 -237 -639 -372 338 640 300 -266 -608 -337 263 669 328 -243 -671 -380 234 652
3059 652 396 -339 -674 -353 238 612 369 -227 -634 -443 295 594 386 -169 -599 -440 264 709 315 -242
3079 -242 -550 -466 200 683 456 -279 -585 -379 199 554 456 -232 -674 -388 243 547 360 -114 -636 -493 220
3100 220 641 277 -221 -500 -394 124 657 478 -248 -567 -390 134 527 471 -128 -614 -421 230 565 401
3120 401 -98 -610 -496 153 658 379 -204 -533 -405 41 583 489 -172 -622 -373 205 540 410 -107 -603
3140 -603 -414 213 488 359 -108 -516 -512 126 590 355 -84 -480 -403 19 546 446 -173 -569 -396 58 483
3161 483 392 -99 -577 -409 126 483 487 -29 -533 -469 96 582 401 -48 -431 -478 35 573 415 -101 -496 -395
3183 -395 -30 439 471 -128 -543 -436 82 397 452 -11 -537 -533 79 505 348 -24 -440 -517 -18 528 493 -67
3205 -67 -437 -378 -18 435 505 19 -526 -387 51 359 460 41 -535 -527 -2 427 356 33 -402 -494 -46 541
3227 541 435 -75 -442 -425 -75 327 543 -15 -536 -429 -1 347 485 91 -440 -429 20 466 428 45 -397
3248 -397 -509 -112 447 457 -20 -363 -411 -81 381 509 17 -426 -409 -12 337 476 114 -433 -500 -61 450
3269 450 437 117 -396 -496 -107 390 486 -3 -380 -439 -69 363 453 57 -400 -412 -132 396 455 113 -384 -446
3291 -446 -51 406 424 77 -367 -419 -86 358 492 126 -351 -377 -114 390 431 72 -313 -443 -103 294 436
3312 436 84 -346 -473 -113 311 414 145 -365 -448 -124 330 428 90 -318 -510 -177 322 427 118 -325 -339
3333 -339 -85 289 423 163 -317 -377 -70 277 384 118 -299 -439 -119 363 422 126 -327 -466 -112 342 428
3354 428 127 -246 -401 -206 242 405 145 -291 -440 -117 264 453 178 -257 -434 -124 273 417 206 -228
3374 -228 -462 -109 297 443 151 -259 -409 -204 297 458 84 -237 -405 -184 311 458 173 -298 -389 -120
3394 -120 224 381 218 -260 -455 -154 285 397 169 -146 -417 -233 261 442 100 -223 -325 -202 211 437
3414 437 166 -248 -407 -178 214 367 225 -184 -386 -179 243 411 158 -108 -348 -240 218 430 189 -198
3434 -198 -383 -204 164 382 219 -228 -384 -179 138 362 246 -220 -440 -269 178 305 167 -206 -383 -213
3454 -213 239 390 172 -176 -317 -216 164 366 262 -240 -348 -179 107 453 190 -115 -402 -215 126 348
3474 348 222 -170 -393 -237 145 345 132 -158 -311 -316 144 354 220 -122 -347 -212 91 338 280 -122 -400
3495 -400 -207 103 370 191 -100 -351 -242 137 328 282 -93 -392 -212 92 337 229 -90 -360 -271 63 310
3516 310 212 -77 -335 -225 101 405 244 -131 -354 -226 86 223 307 -56 -356 -291 75 328 211 -101 -330
3537 -330 -295 25 314 224 -123 -300 -300 5 294 297 -60 -354 -212 75 289 309 15 -335 -231 40 387 253
3559 253 -45 -310 -278 52 321 245 -44 -304 -260 -30 325 246 -77 -324 -184 95 218 257 -18 -345 -272 50
3581 50 293 234 11 -271 -290 42 373 233 -54 -226 -265 -14 273 317 -60 -221 -232 49 222 332 -19 -338
3603 -338 -298 33 268 183 -8 -212 -340 -8 311 263 -20 -238 -262 -119 325 310 0 -289 -197 -24 242 302
3625 302 82 -292 -287 8 247 243 13 -190 -287 -23 311 256 4 -228 -260 -91 261 279 2 -297 -294 -27 205
3648 205 300 43 -283 -317 -39 249 225 29 -240 -257 -36 219 236 48 -250 -244 -87 239 276 47 -202 -290 -50
3671 -50 193 229 5 -221 -323 -22 264 277 87 -200 -265 8 229 263 85 -142 -245 -83 251 279 58 -198
3693 -198 -276 -43 207 296 101 -251 -242 -30 234 271 45 -227 -324 -87 204 254 122 -217 -268 -122 184 261 69
3716 69 -105 -229 -116 187 278 55 -163 -286 -117 178 275 87 -180 -256 -70 180 255 69 -204 -315 -69 171
3738 171 206 62 -170 -241 -167 125 236 61 -117 -221 -116 182 273 57 -188 -278 -82 155 289 111 -168 -259
3760 -259 -79 105 246 105 -174 -244 -114 121 318 124 -148 -243 -132 153 295 59 -146 -283 -168 150 237
3781 237 112 -137 -271 -107 116 249 153 -118 -247 -149 58 262 86 -87 -235 -143 78 248 152 -151 -241 -111
3803 -111 96 195 210 -112 -276 -133 145 227 120 -44 -220 -175 118 256 105 -139 -254 -113 78 223 175 -109
3825 -109 -253 -157 89 186 154 -124 -259 -165 74 242 120 -55 -241 -136 91 232 90 -53 -226 -171 73 221
3847 221 213 -80 -210 -68 55 246 186 -70 -230 -164 41 236 161 -114 -231 -154 27 242 131 -30 -223 -161
3869 -161 21 217 118 -84 -224 -180 66 220 163 -98 -228 -162 82 219 131 -74 -175 -179 18 219 163 -23 -157
3892 -157 -177 33 214 167 -46 -180 -197 27 142 132 -67 -216 -186 53 215 120 -100 -206 -220 24 219 204 -71
3915 -71 -191 -166 0 208 186 -47 -196 -188 25 196 151 22 -181 -241 61 168 186 -24 -152 -169 27 156 181
3938 181 -26 -225 -187 29 188 179 15 -208 -190 -3 188 215 -33 -190 -203 -9 179 142 13 -208 -211 34 153
3961 153 192 -45 -174 -195 6 213 162 -1 -129 -225 -35 182 206 11 -153 -146 -60 160 251 35 -145 -218 -66
3984 -66 206 189 59 -200 -212 -25 141 157 77 -153 -158 -7 165 170 -16 -155 -167 -54 134 175 47 -146 -164 -15
4008 -15 112 182 82 -145 -178 0 165 229 2 -140 -220 -53 169 204 28 -160 -179 -88 116 174 7 -140 -171
4031 -171 -124 97 203 41 -176 -203 -68 107 155 40 -125 -204 -82 149 185 88 -114 -203 -122 138 206 52 -145
4054 -145 -206 -58 112 163 18 -86 -160 -17 149 156 87 -143 -184 -129 106 196 64 -127 -178 -76 143 175 135 -99
4078 -99 -216 -81 88 163 75 -98 -203 -84 121 163 93 -70 -193 -116 128 184 40 -69 -159 -71 70 186 89
4101 89 -118 -175 -96 108 233 172 -90 -166 -53 80 106 83 -22 -225 -159 52 177 72 -40 -155 -97 68 189
4124 189 108 -115 -126 -95 64 168 132 -97 -176 -84 76 153 150 -79 -220 -116 105 202 106 -107 -189 -132 80 201
4148 201 115 -66 -187 -199 43 173 153 -75 -195 -104 26 190 128 -52 -158 -114 51 202 128 -50 -192 -136 56
4171 56 216 136 10 -157 -128 55 150 178 -55 -186 -83 63 185 123 -10 -218 -67 108 190 119 -21 -179 -107
4194 -107 -21 163 153 -49 -179 -166 -2 148 188 -31 -166 -118 38 174 101 22 -180 -163 7 161 135 -14 -161
4217 -161 -145 16 205 118 -83 -146 -103 -7 194 137 17 -174 -163 15 114 126 41 -168 -112 -12 196 152 -34 -195
4241 -195 -165 14 114 106 -38 -171 -198 -1 137 150 51 -166 -142 -53 136 142 -20 -130 -164 -32 117 155 2 -134
4265 -134 -118 4 109 179 48 -144 -171 21 182 112 46 -118 -138 12 177 109 13 -103 -157 -3 118 168 40
4288 40 -175 -160 29 108 188 46 -105 -154 -39 76 147 37 -117 -125 -10 141 149 35 -85 -116 5 124 183 -2
4312 -2 -108 -154 -17 131 168 47 -129 -154 17 118 159 35 -106 -163 -54 142 153 56 -122 -144 -60 115 160 33
4336 33 -93 -136 -29 104 182 55 -130 -105 -30 78 131 32 -102 -146 -78 130 158 32 -18 -121 3 112 103 62 -75
4361 -75 -85 -19 75 145 61 -107 -146 -111 53 130 85 -76 -188 -104 91 108 78 -113 -149 -80 22 160 44 -62 -132
4386 -132 -35 62 172 58 -70 -134 -25 155 145 71 -63 -121 -28 165 142 63 -109 -169 -105 74 178 46 -107 -154
4410 -154 -121 33 103 69 -86 -176 3 56 137 101 -29 -178 -124 41 124 87 -54 -177 -91 -8 177 88 -53 -160
4434 -160 -111 93 96 78 -35 -142 -120 56 112 68 -75 -193 -93 89 122 80 -56 -148 -105 31 159 66 -27 -107 -117
4459 -117 16 174 115 -79 -120 -112 33 148 160 -53 -153 -155 11 128 62 -6 -89 -101 35 152 151 -14 -183 -102 70
4484 70 137 112 -5 -106 -99 23 166 122 40 -131 -105 -8 99 107 33 -139 -101 2 127 102 -53 -125 -87 27 79 109
4510 109 -7 -146 -155 17 115 121 -2 -136 -121 -37 160 160 17 -131 -111 14 130 175 45 -94 -135 -3 72 147 32
4535 32 -119 -162 -18 112 133 48 -105 -135 -54 146 137 37 -113 -118 -56 128 106 28 -121 -144 -20 109 85 -18 -91
4560 -91 -133 -10 114 116 17 -104 -128 -33 146 116 -2 -139 -130 -37 110 109 -32 -171 -126 -18 61 169 26 -108 -171
4585 -171 33 86 123 -12 -98 -69 -61 112 94 59 -76 -117 -35 148 123 19 -108 -128 -26 78 93 115 -118 -95 -4
4610 -4 80 198 36 -99 -160 -37 106 173 75 -68 -149 -65 80 121 12 -111 -139 -38 110 120 27 -84 -174 -58
4634 -58 71 104 44 -49 -147 3 43 140 62 -78 -197 -60 125 124 87 -96 -173 -18 81 192 46 -75 -143 -86 88
4659 88 185 91 -114 -139 -85 65 150 81 -87 -165 -73 58 147 69 -56 -160 -108 66 149 51 -76 -119 -94 54 162
4684 162 45 -69 -131 -29 75 145 130 -85 -170 -107 13 118 26 -10 -149 -90 89 171 79 -66 -118 -36 48 116 78
4709 78 -57 -147 -84 45 152 83 -70 -127 -88 40 142 26 -19 -134 -118 32 92 85 -70 -119 -74 33 128 77 -37
4734 -37 -133 -88 60 97 93 -30 -137 -58 12 123 129 -45 -186 -104 30 154 96 -59 -169 -115 33 124 105 4 -152
4759 -152 -182 42 87 53 0 -111 -61 -13 112 109 -53 -111 -94 63 109 123 11 -117 -140 99 123 132 -44 -93 -62 23
4785 23 98 110 -32 -108 -92 27 107 89 -55 -117 -96 18 111 115 8 -112 -139 -2 98 76 -35 -65 -67 3 123 74
4811 74 -20 -183 -96 -41 158 81 -36 -74 -125 -6 136 129 42 -109 -109 26 118 114 1 -113 -77 47 125 139 -18 -131
4837 -131 -127 -14 80 97 4 -133 -156 21 109 88 -30 -121 -133 -8 94 102 16 -65 -118 -35 116 161 27 -124 -181 -42
4863 -42 99 63 38 -114 -137 9 70 96 -20 -116 -97 -34 155 206 14 -131 -155 -51 79 172 18 -99 -144 -3
4887 -3 115 154 -9 -108 -94 -51 152 72 -11 -104 -145 -46 109 150 22 -77 -133 -21 117 111 43 -105 -147 -40 98 111
4913 111 30 -103 -165 13 38 147 -8 -68 -149 -47 151 93 47 -170 -156 -44 78 135 64 -104 -162 -33 102 144
4937 144 32 -106 -105 -40 97 149 48 -68 -151 -23 56 179 63 -106 -139 -29 20 125 99 -120 -144 -12 100
4960 100 128 50 -122 -173 -100 89 91 48 -89 -105 -100 82 155 52 -99 -128 -26 86 69 66 -105 -142 -97 91 114 55
4986 55 -42 -114 -62 64 179 44 -66 -141 4 41 192 28 -43 -125 -22 68 103 68 -73 -124 -77 100 137 58 -81
5011 -81 -105 -73 48 133 94 -89 -153 -42 88 121 94 -97 -69 -26 37 159 87 -53 -205 -95 77 180 77 -57
5035 -57 -112 -94 96 87 70 -43 -126 -70 68 136 82 -72 -112 -57 7 96 117 -51 -158 -115 59 81 74 -80 -164 -65 3
5062 3 132 99 -18 -46 -61 5 94 96 -55 -137 -83 87 130 83 -36 -182 -61 27 109 128 -59 -114 -97 36 153 79
5088 79 -47 -137 -137 7 97 82 -80 -134 -101 27 85 90 -53 -133 -95 42 122 119 -34 -139 -85 16 181 129 -6 -130
5114 -130 -72 56 124 153 17 -155 -140 1 138 126 -29 -136 -98 42 111 75 8 -138 -82 27 121 106 -15 -165
5138 -165 -114 30 100 110 -21 -132 -131 53 89 100 -11 -92 -126 15 130 87 18 -138 -77 -12 130 105 2 -154 -107
5163 -107 15 90 114 21 -60 -100 14 133 160 -35 -89 -133 -17 144 117 -1 -169 -120 -29 124 57 0 -107 -129 -7
5188 -7 104 150 21 -71 -86 41 133 88 24 -141 -134 1 103 81 33 -99 -62 15 157 116 -25 -110 -81 -27 92 132
5214 132 -27 -144 -94 -15 105 96 -28 -104 -152 -17 127 132 -17 -64 -161 -33 124 125 -12 -80 -83 0 111 156 64 -128
5240 -128 -99 -11 111 121 19 -97 -141 11 170 157 35 -94 -150 -12 74 59 13 -130 -113 9 142 122 21 -105
5264 -105 -118 -24 149 125 36 -127 -175 12 95 172 46 -117 -102 -8 110 163 87 -130 -70 -34 105 104 -32 -51 -113 -14
5290 -14 134 131 29 -132 -107 -40 108 60 39 -84 -102 -50 119 98 21 -103 -144 -89 87 144 -3 -79 -133 -81 118 133
5316 133 29 -110 -100 -15 109 152 67 -87 -133 -40 70 124 71 -41 -114 -15 71 131 51 -64 -130 -43 64 174 75
5341 75 -44 -70 -94 119 109 64 -68 -107 -94 61 106 75 -46 -139 -54 128 61 71 -74 -114 -89 99 120 44 -83 -73
5367 -73 -51 66 128 57 -87 -143 -80 119 189 63 -83 -170 -68 90 163 92 -120 -146 -96 62 109 11 -88 -150 -60 17
5393 17 132 42 -42 -153 -43 97 84 80 -63 -129 -96 48 152 77 -21 -98 -64 60 123 70 -81 -109 -54 81 129 70
5419 70 -94 -132 -32 70 101 93 -50 -66 -116 13 110 9 -46 -133 -58 104 157 93 -10 -135 -43 -8 118 58 -54
5444 -54 -109 -79 52 132 113 -9 -84 -47 106 157 128 -38 -90 -36 74 160 89 -68 -137 -69 -5 122 12 -48 -163 -142
5470 -142 28 81 18 -55 -119 -147 29 151 73 -10 -59 -51 54 83 83 -51 -142 -67 29 138 100 31 -121 -60 49 179
5496 179 43 -7 -70 -32 48 110 56 -12 -140 -29 29 104 70 -59 -89 -77 52 90 123 -52 -91 -62 37 108 115 -20 -86
5523 -86 -101 43 139 137 48 -76 -119 34 117 73 -78 -145 -94 80 173 71 -34 -104 -73 8 61 92 -22 -132 -136 -16
5549 -16 96 109 11 -190 -92 39 140 109 -29 -92 -112 22 136 75 -33 -182 -110 -9 113 125 -11 -174 -156 11
5573 11 107 90 -1 -127 -112 25 126 150 -46 -145 -99 -23 104 112 21 -100 -85 -11 100 99 34 -140 -31 40 61 58 -52
5600 -52 -39 -164 -68 110 101 -6 -91 -54 27 111 119 15 -74 -103 43 95 130 47 -84 -92 -22 76 164 22 -83 -60 81
5627 81 123 99 92 -69 -120 16 101 135 -31 -116 -87 18 19 77 -29 -61 -46 -52 109 78 30 -79 -113 21 84 67 30 -110
5655 -110 -88 -27 99 97 11 -84 -138 -14 100 139 23 -95 -109 -33 104 65 20 -41 -143 -23 104 124 19 -122 -141
5680 -141 -51 101 121 3 -21 -134 -42 113 87 -2 -112 -80 -36 77 107 26 -97 -140 3 112 123 69 -102 -161 -42
5705 -42 96 106 20 -68 -141 -6 64 125 17 -65 -36 -50 49 153 8 -62 -95 -34 100 139 40 -36 -143 -34 144 106
5731 106 55 -129 -90 -1 96 99 26 -56 -108 -11 73 153 24 -55 -82 -57 100 134 66 -78 -72 16 101 109 22 -43 -133 -28 76
5760 76 140 93 -81 -73 -78 32 104 50 -95 -150 -43 134 152 66 -107 -114 -4 61 109 30 -44 -159 -59 72 147 37
5786 37 -102 -154 -5 46 124 60 -55 -149 -41 98 111 27 -64 -131 -49 89 176 9 -90 -116 -44 9 81 29 -53 -122 -53
5813 -53 44 134 30 -44 -163 -108 83 78 2 -58 -170 -77 71 108 105 -68 -93 -93 34 152 74 -16 -84 0 95 124 87 -134
5841 -134 -106 -71 -9 141 39 -48 -91 -76 48 129 2 -80 -125 -75 25 49 72 -34 -164 -30 3 138 80 -92 -96
5866 -96 -72 76 78 79 -32 -98 -72 60 107 87 -63 -109 -88 78 171 65 -62 -107 -65 45 134 95 -13 -96 -61 31 145
5893 145 66 -33 -109 -106 58 149 64 -94 -93 -75 54 101 45 -21 -98 -64 -16 108 45 -26 -72 -29 -3 119 67 -30 -51 -49 71
5922 71 131 69 -47 -104 -72 28 74 75 -9 -120 -41 46 54 88 -38 -90 -68 24 75 93 3 -65 -83 35 109 108 -96 -91 -92 4
5952 4 58 118 -16 -95 -129 56 129 78 21 -82 -183 13 48 148 11 -130 -56 13 103 85 -18 -118 -66 -8 77 54
5978 54 -30 -91 -52 25 83 64 -26 -138 -88 -13 103 97 -72 -117 -131 35 89 81 -30 -110 -110 -3 113 45 -20 -107 -63 58
6006 58 125 62 -29 -136 -97 -15 106 147 -23 -123 -77 1 96 34 -36 -129 -98 51 59 88 -7 -128 -87 42 133 85 -43
6033 -43 -36 -67 -27 78 96 9 -71 -97 -2 70 115 -32 -71 -49 30 123 54 -23 -101 -129 52 136 53 -3 -78 -96 -16 93 57
6062 57 -65 -80 -79 4 126 115 37 -77 -99 2 91 83 -4 -87 -114 7 85 110 -24 -100 -102 -47 89 128 -12 -60 -101 -22
6090 -22 114 130 35 -46 -116 18 78 116 -2 -63 -73 -2 82 61 31 -142 -70 -51 67 50 -30 -94 -52 -12 68 85 32 -75
6118 -75 -104 8 37 93 3 -112 -63 -10 63 94 -10 -78 -52 3 79 73 52 -88 -117 29 39 110 25 -76 -156 -34 91
6145 91 75 1 -109 -86 9 42 116 -9 -7 -101 -65 102 50 -5 -83 -151 -53 63 67 22 -88 -57 -27 109 95 22 -25 -63
6173 -63 -6 6 120 30 -62 -80 -33 42 119 17 -32 -111 -69 35 82 26 -54 -134 -13 89 76 -8 -68 -50 19 41 93 9
6201 9 -70 -40 -29 83 155 75 -53 -108 -44 80 62 2 -83 -45 11 87 94 10 -72 -100 -5 78 92 35 -35 -82 -2 52 74 59
6231 59 -57 -115 -31 81 107 65 -34 -111 -56 43 82 -1 -32 -117 -79 59 77 24 -45 -139 -29 43 70 32 -7 -49 -66 63
6259 63 129 1 -96 -10 -11 59 96 -2 -69 -89 -61 10 83 21 -91 -104 -91 21 72 57 -85 -141 -57 39 76 23 -49 -54 -38
6288 -38 57 71 16 -82 -108 -99 56 113 52 -63 -89 -69 63 90 24 -5 -107 -44 29 50 15 -25 -90 -121 17 78 108 -42
6316 -42 -78 -9 14 63 71 -19 -81 -47 87 72 43 -75 -110 -72 21 128 14 -21 -93 -9 93 102 59 -55 -59 -41 7 55 70
6345 70 -24 -51 -76 39 114 52 -25 -102 -72 -30 91 81 -20 -118 -80 14 49 31 -18 -85 -22 20 52 49 -102 -48 -94 59
6373 59 59 88 -17 -96 -22 14 122 54 -14 -93 -30 93 90 34 22 -61 -57 81 95 43 -21 -66 -22 18 82 69 -73 -68 -86 -13
6403 -13 87 59 -63 -140 -59 -6 82 6 -49 -49 -37 -22 103 62 -72 -39 -62 -8 89 54 -36 -80 -30 24 67 51 -8 -68 -77
6432 -77 17 33 46 27 -34 -42 -12 133 125 0 -47 -59 -27 58 50 -57 -57 -53 37 67 111 -62 -113 -12 -7 79 -2 -38 -31 -96 5
6463 5 66 93 -5 -79 -61 6 101 27 -9 -42 -44 8 68 55 -12 -58 -87 -8 72 30 -28 -81 -79 -5 76 59 -15 -86 -54 22 39 19
6495 19 -3 -76 -44 47 55 74 9 -31 -53 43 74 21 -9 -24 -54 11 73 28 -7 -73 -46 2 102 75 -8 -72 -30 8 82 65
6525 65 33 -73 -97 22 32 39 -29 -9 -50 -4 7 45 31 -92 -40 16 45 14 12 -59 -94 41 65 50 32 -45 -81 -32 52
6554 52 83 19 -87 -56 -6 39 55 30 -48 -10 -31 44 62 -31 -58 -63 -7 54 70 19 -3 -79 -9 26 43 -20 -57 -92 -42 77
6584 77 64 20 -60 -94 25 58 45 7 -40 -73 35 18 55 -6 -51 -44 -6 74 82 -30 -45 -23 23 115 54 -37 -77 -92 3 91
6614 91 38 -34 -37 -79 24 110 63 -4 -38 -124 -40 65 45 13 -43 -57 54 59 33 27 -51 -39 38 19 92 2 -49 -55 -32 78
6644 78 94 -4 -16 -69 23 65 56 38 -51 -30 -11 25 108 46 -16 -107 -1 40 121 42 -15 -47 -23 13 54 10 -44 -84 12 82
6674 82 104 -3 -59 -67 -5 89 64 25 -85 -85 6 19 8 21 14 -41 13 34 46 31 -74 -102 -21 49 61 20 -57 -22 -9 43
6704 43 104 13 -25 -67 -5 74 57 36 -71 -35 -16 15 28 15 -33 -16 -62 47 91 7 -51 -62 -53 75 66 70 -39 -48 -78 21
6734 21 75 17 -98 -82 -90 44 23 -6 10 -98 -42 2 73 -41 -39 -68 -24 -15 18 1 -4 -44 -31 58 49 53 -11 -27 10 -6 46
6765 46 14 -39 -31 -38 25 56 22 -50 -66 -23 7 61 4 -76 -119 -41 -24 28 21 -76 -51 -37 37 46 -5 -43 -49 -16 6 33 3 -5 -41
6798 -41 6 0 47 51 -59 -70 13 73 25 55 -44 -70 -42 49 65 -3 -32 -41 0 34 26 41 2 -57 -24 -6 59 17 -24 -80 -69 20
6830 20 22 6 -39 -55 -67 13 85 56 16 -54 -21 5 56 -13 9 -34 -2 78 104 41 -30 -46 -72 14 55 48 9 -49 -26 34 58
6861 58 13 -32 -72 -51 15 23 47 -24 -70 -22 11 39 66 -51 -51 -58 26 61 56 1 -7 -13 57 56 51 2 -33 -6 44 33 0 -14 -13 -68
6895 -68 56 84 44 -32 -35 -10 -15 71 15 -24 -69 -13 -10 53 61 -26 -92 -36 -19 30 65 -12 -43 -43 8 43 -19 -57 -43 -64 2 52
6927 52 -6 -26 -61 -5 11 35 57 10 -37 -35 32 2 57 -12 -13 -31 -3 96 53 0 0 -8 -42 9 24 -27 -67 -21 -4 25 7 -40
6959 -40 -29 -34 4 49 42 -11 -49 8 39 57 33 -60 -22 -15 -15 73 -14 57 -61 -4 32 65 94 -13 -11 -6 55 34 52 -8 -51 -50 15
6992 15 -3 62 -40 -34 -10 29 27 -7 -27 -60 -56 8 43 25 -13 -56 -30 55 50 39 -9 -48 -28 -17 106 16 -8 -40 -23 -28 69 27
7024 27 -43 -54 -27 54 60 33 -46 -33 -43 13 30 -7 5 -5 -17 -15 41 39 5 -31 -44 28 36 1 -4 -64 -28 -31 34 44 -34 -42 -95 -45
7058 -45 44 19 -7 18 23 -1 6 26 -2 -54 -48 11 70 112 -25 -15 -34 15 47 57 36 -58 -72 14 44 26 -111 -70 -23 -31 35
7089 35 49 -16 -35 -23 -35 16 35 -8 -38 -99 -18 42 38 -11 -39 -35 -8 81 32 11 -14 -42 21 68 28 -21 -1 -38 8 7 22 -14
7121 -14 -28 7 -27 -37 30 -25 -67 -30 0 65 36 26 -47 -46 -9 82 42 48 -30 -71 19 72 35 3 -33 -40 26 24 16 21 -5 -22 1
7154 1 14 48 -5 -57 -51 -49 10 41 54 -32 -24 15 -25 42 17 -12 -17 -58 8 30 37 -49 -4 15 64 73 34 -3 19 -24 66 -25 46 -16
7188 -16 -6 -52 6 36 21 -40 -38 34 31 92 19 -45 -36 -3 -8 31 -12 7 -45 -13 44 74 15 -74 -82 -33 -48 25 14 -33 -41 -40 43 33
7222 33 34 -25 -43 -15 52 60 29 2 -90 17 58 75 5 -33 -28 -34 30 84 -57 -44 -63 -5 -11 25 31 -8 -52 -17 40 11 -47 -4
7254 -4 0 13 -10 31 -48 -26 -47 -48 46 -3 21 -28 -51 -26 54 45 24 -42 13 21 5 34 2 -43 -42 5 50 14 -6 -44 -100 19 50
7287 50 30 7 -26 -40 -47 28 51 -9 -55 29 14 10 -36 -26 5 -45 -24 45 70 79 -35 -28 23 35 44 8 -42 18 -2 40 6 11 25
7320 25 -7 26 32 5 -5 -14 -42 2 27 49 -42 32 -50 -62 75 39 -24 -18 -21 9 11 56 28 -31 -49 17 55 7 35 -85 -1 -23
7352 -23 46 31 20 8 31 -17 82 64 26 -18 -87 -3 35 11 47 -4 -7 -20 11 79 4 -37 -67 -36 -10 -6 3 -54 -12 -28 -11 40
7384 40 3 -50 -14 -45 7 67 -18 12 -11 5 1 62 40 29 -6 -55 -41 26 10 9 -35 -63 40 -15 16 -33 -77 49 -18 77
7414 77 33 -27 -17 22 2 -15 8 35 -80 2 19 43 21 -10 -58 -20 27 77 66 -7 -6 -14 45 88 22 55 -17 17 37 62 -27
7445 -27 -16 -21 5 -29 25 24 17 2 8 14 17 32 -23 -38 -19 38 5 60 -40 -62 -42 8 27 23 -35 -51 4 1 70 15 -19 -48 12 19
7479 19 28 23 -40 -39 -10 38 49 18 -7 -81 -16 -9 70 52 -34 4 -46 5 13 27 -29 -27 17 -25 105 -42 -16 -46 -19 -10 -12 53 -12
7512 -12 -58 -7 8 50 40 -45 -43 -26 52 53 -15 5 -80 -44 106 18 22 2 -20 -24 58 17 29 11 -44 -47 14 43 10 22 -68 -34
7544 -34 -5 30 18 -26 -51 -95 12 20 20 -33 -26 -39 -6 51 94 -56 -30 -6 -45 57 -26 44 20 6 41 12 48 8 -18 -51
7574 -51 -11 91 8 -41 -23 -32 0 99 3 -33 -95 -2 3 24 59 23 -12 -51 34 52 56 -31 -73 -82 40 93 15 -28 -49 -23 1
7605 1 60 43 -26 -1 -18 1 56 27 35 -12 -6 41 34 9 -59 -51 -55 6 31 63 -32 -6 -54 -50 -29 21 -20 -62 5 60 67 90 36 -89
7639 -89 -46 -16 19 -3 15 -33 -26 35 41 73 -14 -24 28 37 6 62 3 -37 52 49 15 59 -15 -3 -61 9 47 28 38 -60 -24 17
7671 17 2 51 -1 -45 -38 24 48 5 -40 -36 -75 18 34 71 -63 -14 -12 -6 37 21 7 -40 7 7 68 50 -1 -66 -11 11 37 -20
7703 -20 -19 -18 9 16 42 -26 -23 -28 -8 -20 -21 -13 -20 -42 -9 -5 21 59 -26 -18 -55 -12 48 51 -48 -27 -20 22 -4 23 26 -72 -13 0 55 -15 19
7740 19 -55 -71 -18 24 49 -24 -38 -31 -47 -11 25 -16 -61 -36 -17 53 29 18 -68 -79 -45 29 60 -9 -54 -64 28 56 70 4 7
7771 7 -36 60 33 17 24 6 -44 -26 48 56 6 -67 -71 27 -2 91 7 44 -70 -12 47 72 51 -21 -47 -10 30 66 21 -51 -35 4
7803 4 40 26 -10 -41 -69 -43 15 91 22 -28 -36 -14 63 43 66 -65 -16 10 32 77 19 -28 -34 -27 48 51 33 -65 -31 -23 47 61 11
7836 11 -42 -57 15 -16 40 -5 -9 -88 -13 5 53 -3 -42 -26 -10 10 2 81 -5 -50 -4 29 75 -23 -35 -8 -80 46 95 36 5
7867 5 -11 8 66 38 14 -42 1 -32 17 36 37 21 -7 38 41 -17 -5 -7 -76 1 15 -3 -34 -19 -96 -28 26 21 27 -4 -13 -41 14 48
7901 48 49 -51 -25 -16 26 21 -6 -2 -52 16 75 26 15 -39 -58 -8 47 5 22 -14 -67 1 45 43 26 -62 -40 -11 4 31 43 -61
7933 -61 -22 -33 -12 78 25 -3 -48 38 -24 92 54 -60 9 8 79 39 63 7 -9 -11 10 24 -17 -86 -60 -58 13 50 27 -46 -52
7964 -52 22 -24 55 15 -29 -21 -56 53 25 71 -20 -31 34 22 49 53 -15 -26 -50 14 34 32 -1 -19 -23 42 87 28 61 24 -5 52
7996 52 27 -5 41 -22 -26 19 -10 -27 0 -39 -16 -23 -4 37 -24 -52 -33 -11 31 82 15 -44 -2 10 23 5 16 -15 -25 25 47
8027 47 15 -46 -49 -27 68 -1 -4 15 -27 -19 18 43 68 -47 -39 -19 32 49 -28 23 -13 -97 30 76 44 51 -54 -55 -54 28 67 -47
8059 -47 -39 -5 39 -2 -6 -76 -68 -52 29 26 51 13 -50 -2 7 75 -2 -34 -87 18 -5 74 8 -10 -40 -40 17 93 -21 -10 -42 1
8091 1 -3 64 25 17 -33 -38 11 -1 20 -24 -23 -17 8 88 66 -48 -24 -6 36 58 52 -43 -5 -42 -5 28 26 3 -41 -59 18 43 25 7
8125 7 -87 23 19 64 34 -12 -35 -4 -35 7 4 -64 -76 -25 -27 57 29 -16 -40 25 -6 52 34 -74 4 -3 11 63 30 13 1 -24
8157 -24 25 -5 24 9 -17 -71 16 28 69 21 -39 -4 -5 79 28 -34 -53 5 -14 40 1 -30 -47 -55 17 25 25 18 -9 36 -33 44 42
8190 42 -32
8191c2
##END NTUPLES=NMR FID
##END=
