##TITLE=1H_AM_NV75
 CDCl3
 8 sc, 
 30.10.2023
##JCAMPDX= 6.0         $$ Bruker NMR JCAMP-DX V2.0
##DATA TYPE= NMR FID
##DATA CLASS= NTUPLES
##ORIGIN= UXNMR, Bruker Analytische Messtechnik GmbH
##OWNER= root
$$ XWIN-NMR		Version 3.5
$$ Mon Oct 30 14:29:24 2023 Russian Standard Time (UT+4h)  she@DPX200
##.OBSERVE FREQUENCY= 200.13135
##.OBSERVE NUCLEUS= ^1H
##.DELAY= (6, 6)
##.ACQUISITION MODE= SIMULTANEOUS
##.ACQUISITION SCHEME= undefined
##.AVERAGES= 8
##.DIGITISER RES= 18
##SPECTROMETER/DATA SYSTEM= spect
##.PULSE SEQUENCE= zg30
##.SOLVENT NAME= CDCl3
##.SHIFT REFERENCE= (INTERNAL, CDCl3, 0, 15.7039)
##AUDIT TRAIL= $$ (NUMBER, WHEN, WHO, WHERE, WHAT)
$$ ##TITLE= Audit trail, XWIN-NMR		Version 3.5
$$ ##JCAMPDX= 5.01
$$ ##ORIGIN= Bruker BioSpin GmbH
$$ ##OWNER= she
$$ F:/spectra/data/she/nmr/H-F/1/audita.txt
$$ ##AUDIT TRAIL=  $$ (NUMBER, WHEN, WHO, WHERE, WHAT)
(   1,<2023-10-30 14:26:45.09 +0400>,<she>,<DPX200>,
      <created by zg, POWCHK disabled, PULCHK disabled
       configuration hash MD5:
       00 E9 B6 7A A2 85 ED C7 34 08 36 98 17 FE 4E 26
       data hash MD5: 16K
       05 BA 5A 94 23 2B 0C B9 71 8F FD 62 57 E1 AB 20>)
$$ ##END=
$$ 
$$ hash MD5
$$ 7F D4 09 15 AB FD F7 70 48 0E 77 BF FA AB 7C 4E
##$RELAX= 
##$RELAX= 
##$RELAX= 
##$RELAX= 
##$RELAX= 
##$RELAX= 
$$ Bruker specific parameters
$$ --------------------------
##$DU= <F:/spectra>
##$EXPNO= 1
##$NAME= <H-F>
##$PROCNO= 1
##$TYPE= <nmr>
##$USER= <she>
##$AMP= (0..31)
100 100 100 100 100 100 100 100 100 100 100 100 100 100 100 100 100 100 
100 100 100 100 100 100 100 100 100 100 100 100 100 100 
##$AQSEQ= 0
##$AQ_mod= 1
##$AUNM= <au_zg>
##$AUTOPOS= <>
##$BF1= 200.13
##$BF2= 200.13
##$BF3= 200.13
##$BF4= 200.13
##$BF5= 200.13
##$BF6= 200.13
##$BF7= 200.13
##$BF8= 200.13
##$BYTORDA= 1
##$CFDGTYP= 0
##$CFRGTYP= 5
##$CHEMSTR= <none>
##$CNST= (0..31)
1 1 145 1 1 1 1 1 1 1 1 1 1 1 1 1 1 1 1 1 1 1 1 1 1 1 1 1 1 1 1 1 
##$CPDPRG= <>
##$CPDPRG1= <>
##$CPDPRG2= <>
##$CPDPRG3= <>
##$CPDPRG4= <mlev>
##$CPDPRG5= <mlev>
##$CPDPRG6= <mlev>
##$CPDPRG7= <mlev>
##$CPDPRG8= <mlev>
##$CPDPRGB= <>
##$CPDPRGT= <>
##$D= (0..31)
0 1.2 0 0 0 0 0 0 0 0.06 0 0.03 0 0 0 0 0.0002 0 0 0 0 0 0 0 0 0 0 0 0 
0 0 0 
##$DATE= 1698661604
##$DBL= (0..7)
120 120 120 120 120 120 120 120 
##$DBP= (0..7)
150 150 150 150 150 150 150 150 
##$DBP07= 0
##$DBPNAM0= <>
##$DBPNAM1= <>
##$DBPNAM2= <>
##$DBPNAM3= <>
##$DBPNAM4= <>
##$DBPNAM5= <>
##$DBPNAM6= <>
##$DBPNAM7= <>
##$DBPOAL= (0..7)
0.5 0.5 0.5 0.5 0.5 0.5 0.5 0.5 
##$DBPOFFS= (0..7)
0 0 0 0 0 0 0 0 
##$DE= 6
##$DECBNUC= <off>
##$DECIM= 32
##$DECNUC= <off>
##$DECSTAT= 4
##$DIGMOD= 1
##$DIGTYP= 9
##$DL= (0..7)
0 120 120 120 120 120 120 120 
##$DP= (0..7)
150 150 150 150 150 150 150 150 
##$DP07= 0
##$DPNAME0= <>
##$DPNAME1= <>
##$DPNAME2= <>
##$DPNAME3= <>
##$DPNAME4= <>
##$DPNAME5= <>
##$DPNAME6= <>
##$DPNAME7= <>
##$DPOAL= (0..7)
0.5 0.5 0.5 0.5 0.5 0.5 0.5 0.5 
##$DPOFFS= (0..7)
0 0 0 0 0 0 0 0 
##$DQDMODE= 0
##$DR= 18
##$DS= 0
##$DSLIST= <SSSSSSSSSSSSSSS>
$$ [...]
##$SUBNAM2= <"">
##$SUBNAM3= <"">
##$SUBNAM4= <"">
##$SUBNAM5= <"">
##$SUBNAM6= <"">
##$SUBNAM7= <"">
##$SUBNAM8= <"">
##$SUBNAM9= <"">
##$SW= 18.05172834244
##$SWIBOX= (0..15)
0 0 2 0 0 0 0 0 0 0 0 0 0 0 0 0 
##$SW_h= 3612.71676300578
##$TD= 16384
##$TD0= 1
##$TE= 0
##$TE2= 300
##$TE3= 300
##$TEG= 300
##$TL= (0..7)
0 120 120 120 120 120 120 120 
##$TP= (0..7)
150 150 150 150 150 150 150 150 
##$TP07= 0
##$TPNAME0= <>
##$TPNAME1= <>
##$TPNAME2= <>
##$TPNAME3= <>
##$TPNAME4= <>
##$TPNAME5= <>
##$TPNAME6= <>
##$TPNAME7= <>
##$TPOAL= (0..7)
0.5 0.5 0.5 0.5 0.5 0.5 0.5 0.5 
##$TPOFFS= (0..7)
0 0 0 0 0 0 0 0 
##$TUNHIN= 0
##$TUNHOUT= 0
##$TUNXOUT= 0
##$USERA1= <user>
##$USERA2= <user>
##$USERA3= <user>
##$USERA4= <user>
##$USERA5= <user>
##$V9= 5
##$VALIST= <valist>
##$VCLIST= <CCCCCCCCCCCCCCC>
##$VD= 0
##$VDLIST= <DDDDDDDDDDDDDDD>
##$VPLIST= <PPPPPPPPPPPPPPP>
##$VTLIST= <TTTTTTTTTTTTTTT>
##$WBST= 1024
##$WBSW= 4
##$XGAIN= (0..3)
0 0 0 0 
##$XL= 0
##$YL= 0
##$YMAX_a= 114948
##$YMIN_a= -155456
##$ZGOPTNS= <>
##$ZL1= 120
##$ZL2= 120
##$ZL3= 120
##$ZL4= 120
##$ABSF1= 10
##$ABSF2= 0
##$ABSG= 5
##$ABSL= 3
##$ALPHA= 0
##$AQORDER= 0
##$ASSFAC= 0
##$ASSFACI= 0
##$ASSFACX= 0
##$ASSWID= 0
##$AUNMP= <proc_1d>
##$AZFE= 0.1
##$AZFW= 0.1
##$BCFW= 1
##$BC_mod= 2
##$BYTORDP= 1
##$COROFFS= 0
##$CY= 11.3945322036743
##$DATMOD= 1
##$DC= 2
##$DFILT= <>
##$DTYPP= 0
##$F1P= 15.7292609196834
##$F2P= 12.9074282941183
##$FCOR= 0.5
##$FTSIZE= 0
##$FT_mod= 4
##$GAMMA= 1
##$GB= 0.15
##$INTBC= 1
##$INTSCL= 1
##$ISEN= 128
##$LB= 0.24
##$LEV0= 0
##$LPBIN= 0
##$MAXI= 10000
##$MC2= 0
##$MEAN= 0
##$ME_mod= 0
##$MI= 1.114404
##$NCOEF= 0
##$NC_proc= 0
##$NLEV= 6
##$NOISF1= 3.799351
##$NOISF2= 2.8
##$NSP= 1
##$NTH_PI= 0
##$NZP= 0
##$OFFSET= 15.70392
##$PC= 1
##$PHC0= -23791.61
##$PHC1= 31.65271
##$PH_mod= 1
##$PKNL= yes
##$PPARMOD= 0
##$PSCAL= 0
##$PSIGN= 0
##$REVERSE= no
##$SF= 200.130013532006
##$SI= 16384
##$SIGF1= 3
##$SIGF2= 2
##$SINO= 400
##$SIOLD= 16384
##$SREGLST= <1H.CDCl3>
##$SSB= 0
##$STSI= 0
##$STSR= 0
##$SW_p= 3612.71676300578
##$SYMM= 0
##$S_DEV= 0
##$TDeff= 0
##$TDoff= 0
##$TI= <>
##$TILT= no
##$TM1= 0
##$TM2= 0
##$TOPLEV= 0
##$USERP1= <user>
##$USERP2= <user>
##$USERP3= <user>
##$USERP4= <user>
##$USERP5= <user>
##$WDW= 1
##$XDIM= 8192
##$YMAX_p= 0
##$YMIN_p= 0
$$ End of Bruker specific parameters
$$ ---------------------------------
##NTUPLES= NMR FID
##VAR_NAME=  TIME,          FID/REAL,        FID/IMAG
##SYMBOL=    X,             R,               I
##VAR_TYPE=  INDEPENDENT,   DEPENDENT,       DEPENDENT
##VAR_FORM=  AFFN,          ASDF,            ASDF
##VAR_DIM=   8192,          8192,            8192
##UNITS=     SECONDS,       ARBITRARY UNITS, ARBITRARY UNITS
##FACTOR=    0.0002768,     1,               1
##FIRST=     0,             0,               0
##LAST=      2.2672688,     0,               0
##MIN=       0,             -155456,         0
##MAX=       2.2672688,     114948,          0
$$ Real data points
##PAGE= N=1
##DATA TABLE= (X++(R..R)), XYDATA
0 0 0 0 0 0 0 0 0 0 0 0 0 0 0 8 -8 8 -8 8 -16 16 -16 24 -24 32 -33 40 -48 56 -64 73 -88 96 -112 128 -144
35 -144 160 -177 201 -225 249 -280 312 -345 380 -421 465 -513 565 -625 685 -757 834 -918 1014
54 1014 -1118 1239 -1376 1535 -1714 1930 -2187 2503 -2900 3418 -4124 5147 -6771 9748 -16993
69 -16993 72443 33898 -135915 -51128 23757 66032 47212 -20359 -62566 -25627 8937 48938
81 48938 38239 -10306 -47620 -59706 3692 114948 45325 -103920 -68650 36008 46051 40996
93 40996 -589 -66105 -41410 30568 53095 29078 -30468 -54693 -14793 28258 55902 25223
105 25223 -67967 -55575 44174 41085 -2466 4002 -24169 -40827 14956 44606 19328 -18340
117 -18340 -46631 -17766 37081 41648 3851 -47447 -46534 36214 57240 -16659 -31872 -2350 -5852
130 -5852 11926 27268 -6305 -20186 -6818 -1210 14781 18885 -4214 -21177 -19990 12479 40570
143 40570 -473 -39352 -9653 13953 14980 18316 -13696 -37284 2443 31635 13080 -10217
155 -10217 -22720 -11542 15026 19715 7119 -12581 -27203 -2142 27460 14003 -3531 -13511
167 -13511 -26332 241 39292 20217 -22674 -32828 -10784 26565 36383 -816 -34991 -29125
179 -29125 8548 40835 21312 -24373 -33113 -10678 17577 36753 11889 -33994 -33705 3805 30560
192 30560 28708 -4025 -36338 -26635 12535 38981 24622 -21408 -43838 -13751 29973 42144
204 42144 7994 -41527 -40808 12400 44466 23092 -17733 -37914 -18217 20389 34741 13292
216 13292 -20717 -35702 -12888 26443 38268 7183 -35953 -39570 7086 45327 26562 -20342
228 -20342 -39474 -15129 23825 35010 7734 -24982 -28971 -3831 24645 28317 1452 -28982
240 -28982 -27616 6515 33313 20477 -15122 -31522 -12819 17933 28091 7880 -21053 -26628
252 -26628 -2325 23459 22710 -2361 -25567 -20147 9962 27382 11550 -14770 -22110 -5730 15638
265 15638 19005 2574 -15090 -17222 -470 18130 15441 -4848 -18718 -12193 8965 20506 5445
278 5445 -15528 -15175 1201 13804 10851 -4620 -13599 -6451 6037 11744 4750 -8731 -11132 -140
292 -140 9634 9420 -1799 -12674 -6429 8452 11052 1419 -8899 -9879 1882 11886 6733 -5616
306 -5616 -11771 -4893 9237 12167 -285 -11638 -10459 2357 14409 8681 -8471 -14508 -4592 9910
320 9910 14817 2269 -14048 -13637 2135 15905 12652 -6033 -18055 -8692 10068 17983 6340
333 6340 -13660 -18055 -1129 16151 15478 -1683 -18077 -14588 5993 19520 10938 -9731 -20170
346 -20170 -8214 13157 19579 4199 -16033 -18859 -330 18788 16557 -3787 -19615 -14105 7296
359 7296 21318 11358 -11338 -20604 -7229 13773 20227 4307 -16827 -18805 -89 18296 16900
372 16900 -3587 -20461 -13997 7377 19995 10932 -10882 -20590 -6580 13321 17838 4102 -14839
385 -14839 -17799 -22 16862 15017 -2356 -18194 -13342 7805 18644 8593 -9489 -17615 -5440
398 -5440 13074 14715 1333 -11559 -13678 -629 13969 11713 -2590 -13941 -11692 5583 16852
411 16852 6106 -10068 -13603 -3239 11542 11988 -2700 -10553 -6219 1642 8867 6979 -3303 -8306
425 -8306 -5349 3074 10972 4527 -8633 -8429 693 7381 7124 -3152 -9307 -1234 4935 3273 1226
440 1226 -2982 -4845 9 3275 3405 581 -5990 -3804 5179 4409 -1236 -3315 -3586 1957 6196 -550
456 -550 -4350 -403 186 936 3430 808 -2899 -4246 -1222 7283 6069 -6326 -8373 183 6342 7086
472 7086 -1948 -10617 -2669 6850 3924 341 -1790 -4870 -2833 2212 6240 5275 -5297 -10691 -251
487 -251 8869 7600 -102 -10695 -8440 7135 10761 1527 -4859 -7985 -4180 6774 9599 1549 -7911
502 -7911 -10179 441 10731 6367 -2525 -8006 -8550 2671 12315 5027 -5530 -9224 -6773 5781
516 5781 14597 3785 -11544 -12375 783 13727 9434 -5608 -10843 -5551 3864 11662 5358 -7684
530 -7684 -8842 -2705 3996 10386 4953 -8886 -11296 -1121 9528 10574 -1302 -11991 -8400 3469
544 3469 12558 7687 -8973 -13142 449 9396 6733 -450 -7273 -5569 2193 4610 3847 2103 -4328
559 -4328 -7992 -1713 8525 10193 -3020 -14310 -4624 10689 9161 -2452 -8858 -4657 4531 5597
573 5597 -583 -1828 -479 -2623 -2083 3071 5697 541 -7164 -4920 5210 6816 -715 -4778 -2673
588 -2673 1355 3299 1286 -675 -1099 -2392 -962 3638 3381 -2415 -4965 -210 4969 2008 -4405 -2891
604 -2891 3190 2724 -2442 -2919 1804 3247 -1650 -3838 1538 4533 -996 -5409 -216 6523 2737 -6381
620 -6381 -5530 4642 8017 -752 -8179 -3066 5857 4910 -2212 -3902 -530 1019 163 713 2319 96
636 96 -4766 -3568 3812 6583 419 -6815 -5437 3258 7141 1886 -3718 -4834 -2236 3425 6465 2000
652 2000 -5074 -7012 -482 7974 6361 -3383 -7844 -3124 4274 6414 1098 -3849 -3893 -2664 1198 6850
668 6850 4534 -5053 -9295 -2465 8557 9591 -2636 -11008 -4773 5659 8518 1894 -6029 -5454 44
683 44 3031 4767 3151 -3854 -6966 -1709 5363 7389 664 -7996 -6371 2430 7331 4812 -3280 -8224
699 -8224 -3035 4673 6489 2308 -5271 -7451 199 6477 4335 -982 -4910 -4014 1322 4352 3544 249
715 249 -5110 -5387 2046 7085 3944 -3715 -8024 -1790 7158 5564 -2221 -5351 -3004 1990 4220 1385
731 1385 -1464 -2590 -2932 533 4336 2406 -2095 -4329 -2083 3551 4668 -660 -3728 -2184 702
746 702 3318 2212 -1652 -2638 -943 1285 2937 686 -2748 -1655 1047 1577 638 -1170 -1317 600
762 600 509 -480 229 73 -774 -219 386 616 70 -1540 -739 2139 1539 -1571 -2274 -98 2686 2252 -1684
781 -1684 -3035 -115 2250 2081 -29 -2302 -1774 579 1810 1780 -99 -2831 -2334 1085 3145 1885
797 1885 -1784 -3967 -1388 2906 3611 484 -3312 -3788 268 4162 3206 -1100 -4283 -2849 2136 4723
813 4723 1998 -2565 -4308 -1596 3146 4599 962 -3679 -4526 -591 4452 4663 -698 -5341 -4036 1660
829 1660 5572 3203 -2898 -5627 -2205 3368 5390 1516 -4196 -5195 -486 4629 4985 -103 -5428 -4423
845 -4423 1611 5577 3710 -2159 -5894 -2876 3383 5685 1948 -4040 -5827 -810 4923 4780 -287
860 -287 -5185 -4607 1411 5394 3093 -1999 -5145 -2958 2924 5316 1678 -3326 -4850 -1048 4407 4494
876 4494 -414 -4115 -3574 913 4723 2752 -1998 -3822 -2077 1969 4205 1155 -2865 -3306 -807 2684
892 2684 3328 -349 -3215 -2230 363 2774 2262 -1376 -2884 -986 1228 2483 1062 -1939 -1924 146
908 146 1406 1728 99 -1881 -864 747 917 885 -360 -1507 -203 913 501 80 -820 -899 631 713
926 713 -346 -463 -544 140 1114 -110 -1117 -149 333 496 787 -548 -1222 -20 805 1185 447 -1516 -1415
945 -1415 693 1648 1157 -775 -2465 -627 1915 1510 139 -1265 -2221 -366 2155 2015 -130 -2572
961 -2572 -2627 977 3488 1685 -1830 -3570 -1219 3007 3241 -186 -2424 -2546 -342 3012 3176 -433
977 -433 -3446 -2947 1050 4468 2433 -2479 -4359 -1510 3165 4157 75 -3589 -3175 -159 3275 3662
993 3662 -570 -4402 -3095 1525 4627 2495 -2712 -4527 -1108 3190 4004 511 -3339 -3222 -24 3123
1009 3123 3653 74 -4324 -3542 1543 4748 2494 -2715 -4672 -1075 3302 3478 20 -3152 -2836 172
1025 172 2586 2633 165 -3091 -3129 774 3865 2471 -1749 -3924 -1431 2776 3529 339 -2861 -2592 409
1042 409 2693 2038 -506 -2451 -1884 745 2515 1423 -1187 -2490 -1130 1387 2288 592 -1797 -2231
1058 -2231 -142 1977 1811 -480 -2177 -1244 1138 2017 440 -1367 -1364 201 1332 848 -349 -849 -503
1075 -503 350 853 418 -471 -853 -355 745 882 -288 -1036 -537 484 1006 148 -1117 -961 409 1170
1093 1170 580 -897 -1431 34 1510 1100 -608 -1663 -526 1335 1335 -133 -997 -896 -105 1023 1152
1110 1152 153 -1139 -1679 -148 2177 1844 -1071 -2946 -1241 2189 2862 -289 -2741 -1723 716 2226
1126 2226 1425 -917 -2054 -1144 721 2329 1635 -1318 -2897 -1014 2195 3087 213 -2873 -2267 609
1142 609 2572 2053 -750 -3009 -1821 1241 2975 1516 -2087 -3475 -555 2811 2639 -415 -2851 -1905
1158 -1905 891 2160 1521 -261 -2267 -2063 763 3045 2050 -1572 -3662 -1066 3098 3189 -483 -3168
1174 -3168 -2006 1315 2574 949 -1051 -1859 -1298 740 2243 1252 -1220 -2677 -1109 2082 2720 -81
1190 -81 -2547 -1951 711 2435 1366 -1040 -2019 -1014 1169 2227 702 -1623 -1858 11 1797 1461
1206 1461 -496 -1654 -796 560 1156 769 -444 -1352 -898 632 1640 600 -1491 -1685 377 1794
1222 1794 852 -1104 -1491 93 1255 677 -398 -644 -321 215 562 461 -100 -734 -541 568 1047 112
1240 112 -1011 -841 394 1055 331 -770 -947 -84 763 799 -97 -1025 -864 449 1321 559 -991 -1318 46
1259 46 1359 946 -472 -1131 -500 558 1047 601 -423 -1157 -771 720 1668 567 -1503 -1794 135 1969
1277 1969 1326 -1007 -1978 -652 1146 1530 303 -1181 -1454 -223 1158 1517 210 -1575 -1574 352 1984
1294 1984 1372 -821 -2029 -781 1279 1880 544 -1335 -1779 -139 1623 1570 -139 -1831 -1549 610
1310 610 1977 965 -1066 -1895 -664 1202 1628 310 -1252 -1598 -241 1551 1557 -188 -1692 -1374 617
1327 617 2029 978 -1151 -1733 -382 1337 1552 92 -1315 -1168 71 1314 1178 -372 -1436 -940
1343 -940 484 1479 759 -1014 -1512 -269 1064 1209 -4 -1242 -949 353 1155 764 -461 -1203 -408
1360 -408 741 984 296 -737 -956 71 925 634 -223 -904 -576 473 839 227 -607 -855 -89 785 541
1379 541 -322 -734 -431 393 815 138 -644 -567 57 649 551 -277 -652 -265 385 725 243 -610 -641 117 642
1400 642 570 -198 -833 -412 453 727 165 -669 -835 -33 752 563 -224 -868 -591 438 921 304 -547 -870
1420 -870 -222 804 885 -44 -844 -737 274 1057 651 -452 -961 -471 621 1083 215 -834 -924 -56 880
1439 880 857 -183 -1073 -747 314 1004 563 -600 -1083 -399 675 1068 234 -873 -950 20 973 872 -153
1458 -153 -1048 -667 479 1094 547 -594 -1013 -286 698 943 121 -884 -907 55 906 714 -273 -985 -648
1477 -648 458 982 336 -638 -884 -138 743 755 3 -728 -658 179 834 560 -296 -788 -387 488 805 168
1497 168 -632 -665 17 627 463 -151 -596 -416 177 531 290 -340 -599 -210 412 569 0 -552 -410 238
1517 238 513 204 -269 -373 -36 325 353 56 -301 -260 27 359 289 -180 -447 -165 278 347 -62 -419 -290
1538 -290 125 336 146 -235 -323 -107 223 311 49 -295 -331 80 382 249 -149 -341 -87 316 374 84 -286
1559 -286 -304 33 353 288 -72 -367 -348 110 436 207 -322 -508 -135 353 422 -84 -455 -335 96 404 295
1580 295 -181 -379 -242 224 522 273 -336 -494 -69 437 500 -1 -513 -377 138 469 268 -230 -506 -214
1600 -214 241 462 139 -399 -487 -37 409 386 -70 -422 -334 161 453 250 -208 -470 -170 351 475 113 -348
1621 -348 -408 55 447 287 -154 -360 -228 158 356 140 -213 -335 -111 203 271 21 -260 -286 -9 242 187
1642 187 -105 -230 -125 116 281 119 -146 -161 5 234 186 -22 -170 -87 63 109 74 -10 -116 -99 -15 80 86 -82
1666 -82 -168 -106 69 76 -54 -149 -92 72 113 2 -60 -8 27 41 57 48 -1 -80 23 102 107 -10 -82 -60 85 125 12 -143
1694 -143 -111 1 60 31 -90 -66 -119 -8 144 6 -152 -176 1 133 76 -12 -236 -159 144 150 33 -46 -135 -33
1718 -33 86 230 31 -217 -138 84 178 183 -80 -215 -19 77 153 41 -95 -21 -39 186 2 -50 -237 -268 53 145
1742 145 -15 -90 -195 1 113 88 47 -126 -138 193 181 158 1 -225 -211 -21 130 104 -106 -220 48 -62 137
1765 137 169 -96 -238 8 59 42 21 -171 -187 -41 135 97 44 -247 -47 80 155 105 -32 -209 -70 48 160
1788 160 70 -184 -172 -119 137 110 56 -204 -173 -3 159 113 -46 -186 -117 88 199 71 -140 -144 10 187 155 -19
1812 -19 -96 -81 36 134 86 -39 -112 -69 88 148 10 -163 -157 36 111 58 -99 -143 -36 80 54 -50 -83 -49 40 49
1838 49 52 -7 -82 -31 105 131 -27 -84 -46 85 143 29 -53 -77 -13 83 77 -20 -105 -78 9 90 37 -72 -125 -42 90 76
1866 76 -13 -115 -81 32 98 71 10 -125 -49 33 171 99 -58 -162 -47 121 188 24 -146 -158 0 145 87 -36
1890 -36 -164 -138 43 168 97 -124 -242 -131 117 246 69 -172 -230 -15 244 258 -13 -220 -176 92 297 221
1912 221 -110 -298 -114 188 304 73 -227 -274 -23 265 247 -55 -321 -228 108 301 157 -196 -327 -104 202
1933 202 277 33 -259 -231 44 271 222 -38 -257 -141 126 286 136 -132 -243 -51 199 247 -32 -230 -167 60
1955 60 196 106 -89 -208 -121 83 159 84 -120 -175 -49 119 169 11 -167 -119 41 151 115 -39 -123 -50 57 136
1979 136 81 -68 -120 8 88 90 -25 -99 -118 47 77 49 -67 -108 -13 73 93 20 -92 -89 12 126 56 -41 -87 -7 106
2006 106 129 6 -99 -38 82 158 18 -77 -115 -38 98 124 -37 -151 -119 35 176 94 -137 -187 -52 172 223 -6
2030 -6 -229 -192 67 261 138 -113 -217 -63 208 296 65 -196 -260 28 301 223 -73 -302 -233 140 311 105
2052 105 -224 -336 -73 240 314 -41 -332 -309 25 318 288 -115 -350 -182 191 392 130 -263 -332 -14 293
2073 293 299 6 -277 -262 49 314 237 -108 -345 -200 194 346 117 -259 -367 -93 258 254 -9 -285 -270 55
2095 55 282 242 -50 -312 -194 174 362 177 -180 -312 -56 280 333 36 -248 -277 -10 298 232 -92 -328 -205
2117 -205 130 315 93 -238 -294 -75 205 240 -25 -254 -202 67 267 187 -113 -277 -107 159 288 62 -187
2138 -187 -234 28 265 190 -83 -251 -113 132 203 45 -195 -222 19 205 147 -75 -205 -103 114 210 41 -185
2160 -185 -167 16 205 154 -59 -213 -87 154 240 37 -229 -209 62 251 145 -123 -227 -117 155 192 36 -201
2182 -201 -235 -15 249 164 -112 -272 -203 166 277 86 -219 -316 -42 297 293 -18 -288 -217 76 378 188 -122
2204 -122 -359 -161 199 406 67 -261 -307 -64 321 343 -37 -379 -309 22 358 250 -200 -419 -242 227 504
2225 504 26 -385 -351 61 394 389 -69 -456 -307 152 413 254 -224 -440 -412 292 369 30 -629 -483 26 551
2247 551 341 -46 -445 -425 253 439 191 -247 -490 -162 433 437 91 -378 -355 -27 457 336 -156 -463 -273
2268 -273 220 490 147 -348 -444 -52 380 350 -98 -408 -284 175 331 171 -254 -359 -112 189 332 42 -264
2289 -264 -280 25 328 249 -119 -315 -111 207 329 101 -221 -257 25 276 205 -79 -294 -146 155 236 34 -200
2311 -200 -225 -17 176 175 -72 -228 -187 86 277 125 -162 -257 -45 254 252 -63 -292 -151 184 281 112 -178 -263
2334 -263 -24 227 256 13 -264 -290 34 314 195 -156 -366 -181 207 339 64 -312 -335 -27 344 322 -108
2355 -108 -405 -283 184 467 215 -289 -458 -66 359 445 55 -379 -380 74 425 351 -150 -546 -334 260 537
2376 537 193 -471 -540 -18 473 408 -91 -547 -424 199 507 263 -263 -521 -209 362 508 112 -464 -476 59
2397 59 551 383 -142 -518 -331 270 516 137 -330 -511 -108 362 438 -26 -513 -385 127 457 249 -230 -462
2418 -462 -164 237 447 115 -274 -387 -25 379 403 -86 -399 -292 180 395 181 -244 -364 -101 276 326 8
2439 8 -349 -284 37 296 239 -104 -369 -192 239 301 110 -282 -317 0 300 226 -94 -291 -181 135 379 131
2461 131 -201 -321 -67 283 290 -44 -306 -241 90 320 112 -232 -343 -122 227 315 9 -342 -307 84 349 208
2483 208 -259 -386 -74 307 382 37 -322 -292 114 385 275 -161 -429 -195 258 454 125 -402 -456 27 470
2504 470 349 -142 -505 -313 234 488 177 -325 -449 -107 391 480 12 -460 -429 127 537 335 -253 -524 -215
2525 -215 344 527 85 -414 -481 -19 451 417 -111 -541 -374 226 558 228 -320 -526 -92 406 456 -2 -443
2546 -443 -407 78 450 358 -170 -528 -285 265 522 203 -372 -466 -87 422 431 9 -444 -384 175 418 224 -214
2568 -214 -490 -268 243 461 104 -380 -444 -65 439 411 -136 -461 -270 156 438 221 -237 -417 -89 334 402
2589 402 57 -401 -340 134 441 266 -136 -455 -182 243 358 -12 -366 -315 -4 374 287 -124 -369 -288 295
2610 295 467 70 -320 -367 31 441 314 -210 -358 -208 155 417 60 -277 -334 10 296 254 -176 -421 -282
2631 -282 195 383 212 -187 -485 -155 297 391 -94 -371 -244 96 450 260 -187 -456 14 468 497 -18 -326
2652 -326 -321 209 438 189 -82 -473 -370 329 420 12 -253 -336 98 436 397 103 -482 -424 -25 562 292 -282
2674 -282 -647 -225 353 444 64 -469 -351 65 480 428 -99 -490 -368 198 542 283 -279 -529 -120 362 469
2695 469 50 -451 -420 65 469 343 -177 -553 -279 253 489 170 -352 -508 -75 418 437 -62 -442 -360 137
2716 137 504 307 -247 -483 -193 357 478 45 -399 -439 51 451 303 -194 -453 -269 206 413 139 -330
2736 -330 -399 -39 374 338 -99 -405 -266 188 400 182 -243 -384 -45 304 341 -39 -348 -258 143 371 183
2757 183 -210 -329 -95 298 312 -18 -318 -264 51 338 204 -152 -370 -143 249 333 57 -319 -294 68 353
2778 353 235 -151 -329 -167 207 316 87 -279 -338 -3 332 307 -75 -374 -274 163 400 149 -265 -396 -100
2799 -100 314 336 -13 -358 -282 98 416 257 -170 -413 -178 249 439 102 -349 -374 -30 398 362 -70 -441
2820 -441 -326 168 471 252 -278 -506 -139 316 470 68 -418 -398 120 460 344 -161 -496 -252 257 436
2840 436 186 -353 -464 -52 422 413 -51 -454 -364 167 498 266 -241 -454 -172 345 452 47 -398 -392 39 456
2862 456 318 -170 -433 -242 219 433 144 -291 -390 -67 348 390 -44 -388 -288 136 430 217 -212 -383 -92
2883 -92 255 328 8 -316 -253 56 286 245 -126 -318 -150 180 253 76 -241 -289 -14 264 222 -84 -298 -157
2905 -157 179 276 73 -171 -244 -35 242 228 -47 -249 -201 78 285 126 -143 -253 -73 200 279 -25 -266 -219
2927 -219 60 286 169 -155 -316 -102 215 320 32 -275 -250 65 312 212 -123 -311 -146 210 342 106
2947 106 -247 -344 -30 287 297 -62 -372 -267 137 360 141 -227 -390 -109 289 357 -8 -341 -331 66 392
2968 392 257 -136 -399 -201 234 430 160 -275 -372 -32 369 363 -69 -415 -268 147 412 159 -257 -423 -116
2989 -116 267 365 -2 -335 -350 26 353 278 -136 -388 -204 197 390 96 -252 -306 -15 313 322 -4 -284 -245
3011 -245 87 324 211 -149 -330 -137 222 298 74 -238 -269 11 253 233 -61 -250 -200 92 255 144 -140
3032 -140 -299 -81 219 224 -1 -222 -181 78 221 125 -81 -210 -112 114 229 57 -164 -191 -5 202 183 -98
3054 -98 -206 -138 125 208 3 -159 -158 2 141 152 -66 -185 -95 111 204 85 -153 -196 1 214 180 -65 -219
3077 -219 -107 98 240 65 -136 -224 -39 205 177 -18 -236 -193 84 242 119 -170 -211 -29 218 202 -33 -243
3099 -243 -188 67 260 154 -86 -258 -122 189 259 77 -231 -243 -7 277 178 -106 -287 -185 124 263 112
3120 112 -174 -278 -68 171 244 38 -272 -256 30 239 207 -86 -273 -138 178 273 92 -172 -271 -38 189 244
3142 244 15 -228 -227 87 254 134 -75 -259 -111 106 251 75 -166 -236 -50 173 204 -7 -214 -230 47 232
3164 232 135 -78 -192 -126 130 222 17 -179 -197 -193 136 178 2 -87 -115 250 337 103 -75 -175 -76 139 164 -46
3188 -46 -169 -223 34 133 107 -7 -87 -138 127 128 1 -175 -148 49 49 61 -23 -125 -197 11 170 -34 -61 -206 -72
3213 -72 132 169 -74 -123 -42 56 61 123 -93 -209 40 149 196 -89 -203 122 205 47 101 41 32 113 74 113 -18 -68
3239 -68 60 68 69 91 -3 -269 47 92 128 18 -157 -263 -56 249 136 -155 0 -244 82 224 -45 -98 -152 46
3263 46 112 206 -31 -99 -99 99 203 40 -115 -167 -48 132 129 97 -212 -206 6 140 179 -126 -190 -113 51 39 -1 -80
3289 -80 -177 -91 128 207 10 -265 -224 166 196 178 -70 -152 -83 142 149 -22 -142 -140 -42 212 230 28 -108 -302 45
3314 45 274 161 -51 -102 -80 100 189 -34 -123 -185 -123 245 156 -44 -99 -181 -16 177 126 -115 -96 -20 148 117 2
3339 2 -128 -151 -39 61 118 -46 -150 -149 71 117 12 9 -95 8 -7 69 -53 -131 -134 41 207 80 -45 -81 -54
3364 -54 83 88 59 -128 -141 -97 114 117 54 -109 -91 2 133 17 -119 -134 -43 57 86 -12 -74 -99 39 77 41 -6 -95
3391 -95 9 30 94 26 -126 -70 27 98 59 -41 -50 -21 86 75 14 -95 -80 -15 95 84 -60 -145 -83 75 119 18
3417 18 -140 -121 -14 103 85 -18 -152 -94 25 145 53 -84 -156 -38 99 138 4 -149 -99 18 159 92 -56
3440 -56 -169 -84 61 164 73 -148 -195 -54 155 164 -8 -174 -150 58 208 114 -84 -173 -63 93 189 67 -142
3463 -142 -165 -29 135 157 -35 -195 -140 118 186 91 -119 -212 -66 141 141 34 -167 -156 10 192 130 -25 -151
3486 -151 -89 85 174 105 -119 -177 -29 143 152 3 -163 -133 12 159 89 -65 -199 -88 120 167 34 -132 -177
3509 -177 -15 148 93 -35 -168 -81 49 147 64 -85 -154 -29 137 150 13 -155 -109 40 180 94 -106 -146 -35
3532 -35 110 129 -18 -124 -111 43 127 96 -54 -130 -69 73 142 4 -156 -132 17 124 85 -70 -142 -42 134 139
3556 139 23 -132 -157 -4 133 81 -52 -177 -102 81 146 29 -119 -171 -29 138 125 -29 -163 -105 54 179
3578 179 94 -121 -183 -57 151 166 3 -173 -127 33 169 122 -102 -177 -88 81 169 49 -128 -181 -36 149 146 -40
3602 -40 -173 -137 47 174 93 -115 -237 -55 127 154 10 -184 -160 14 190 138 -35 -212 -126 97 213 80
3624 80 -135 -173 -29 167 177 -11 -186 -145 23 205 102 -106 -233 -116 106 198 27 -146 -179 8 188 129
3646 129 -61 -188 -75 72 200 83 -115 -157 -27 150 170 6 -150 -104 86 185 60 -126 -144 -41 106 149
3668 149 -12 -135 -140 31 129 120 -79 -171 -89 82 153 25 -137 -132 -4 141 119 -46 -165 -61 73 160 35 -128
3692 -128 -130 -17 132 125 -41 -145 -111 74 158 93 -80 -172 -39 139 147 -14 -139 -121 44 173 101 -73 -164 -31
3716 -31 117 161 16 -148 -158 8 152 122 -49 -159 -74 104 187 40 -137 -177 -45 151 165 -39 -190 -119 72
3739 72 186 97 -93 -183 -56 154 193 42 -171 -127 20 194 140 -54 -173 -87 101 162 52 -129 -201 -36 177
3762 177 147 -15 -199 -141 50 166 69 -88 -195 -57 123 172 23 -141 -174 11 179 136 -66 -181 -99 88
3784 88 208 69 -129 -162 -31 166 182 -22 -175 -134 53 159 80 -110 -170 -37 125 139 1 -143 -142 -3 133
3807 133 125 -46 -171 -81 77 159 30 -133 -130 -4 142 100 -59 -145 -92 43 158 44 -108 -135 -34 122 129 0
3831 0 -123 -103 38 148 66 -62 -142 -65 111 151 3 -133 -108 14 154 95 -76 -153 -72 111 163 23 -126 -133 7
3856 7 136 124 -26 -142 -96 71 173 54 -104 -129 -36 145 157 -10 -137 -95 51 181 105 -84 -152 -59 118 146
3880 146 2 -151 -148 17 155 133 -45 -174 -94 104 177 44 -142 -180 -20 135 130 -17 -175 -126 62 149 74 -105
3904 -105 -158 -23 92 166 9 -134 -130 7 199 126 -41 -162 -76 100 129 45 -133 -180 -14 134 102 -41 -150
3927 -150 -129 51 165 75 -66 -142 -46 106 127 11 -129 -132 20 166 99 -56 -155 -56 99 154 61 -98 -150 -13
3951 -13 91 120 -10 -121 -90 51 110 82 -42 -148 -14 92 103 -3 -105 -73 28 134 78 -25 -129 -64 72
3974 72 106 39 -86 -133 4 123 81 -39 -152 -74 83 148 51 -122 -128 -33 91 112 -40 -139 -100 42 110 24 -98
3999 -98 -105 -18 118 114 -12 -114 -102 21 133 69 -65 -104 -49 76 100 21 -108 -117 -12 119 95 -62 -144 -97 44 125
4025 125 19 -110 -116 9 108 113 -37 -123 -104 57 104 58 -70 -136 -40 111 148 24 -92 -107 -8 143 113 -44 -134
4050 -134 -69 81 148 42 -112 -116 -2 111 115 -1 -137 -64 22 106 45 -64 -141 -32 90 127 23 -105 -109 13 108
4075 108 98 -40 -151 -56 45 104 46 -93 -113 -14 122 94 -27 -118 -95 22 124 86 -71 -132 -63 87 94 7 -108
4100 -108 -117 28 99 85 -50 -96 -62 73 118 40 -101 -112 -30 84 65 -35 -110 -87 23 78 40 -101 -101 -20 70 89 -13
4127 -13 -59 -67 21 88 46 -57 -77 -9 69 115 26 -86 -86 0 88 51 -43 -97 -27 42 70 34 -76 -107 5 70 53 -29 -106
4156 -106 -23 15 84 42 -65 -77 -13 80 75 -18 -78 -52 45 120 53 -49 -92 -3 64 121 14 -89 -92 -3 108 76 -52 -108
4184 -108 -63 67 90 8 -41 -104 -7 76 75 -9 -114 -86 27 99 41 -37 -128 -29 60 71 41 -105 -94 14 98 98 -29 -114
4212 -114 -88 65 123 40 -77 -86 -14 81 90 -4 -91 -56 30 113 55 -31 -105 -50 77 118 42 -86 -106 -2 90 71 -12 -106
4240 -106 -69 50 92 -5 -58 -90 -7 72 68 -13 -81 -48 64 100 30 -24 -80 -27 61 65 -16 -89 -65 38 73 38 -26 -90 -48
4269 -48 40 89 18 -68 -68 16 66 34 -10 -84 -36 56 56 16 -65 -86 -13 54 56 -22 -53 -45 38 103 26 -37 -61 -22 45 67 18 -77
4301 -77 -57 -14 71 51 -24 -59 -43 36 63 23 -49 -72 -21 63 51 -32 -81 -54 51 90 19 -43 -72 -36 81 69 17 -89 -56
4330 -56 26 94 44 -37 -102 -37 54 70 23 -79 -101 5 84 65 -41 -85 -43 60 73 33 -54 -89 36 80 76 -4 -107 -74
4358 -74 8 99 58 -52 -76 -26 45 71 13 -73 -75 15 63 82 -47 -112 -55 45 86 41 -75 -54 -29 63 49 -8 -74 -56 16
4387 16 75 30 -30 -67 -15 72 90 7 -31 -76 -22 88 53 -23 -52 -49 15 72 33 -25 -67 -20 63 41 -24 -72 -75 11 66 31 -17
4418 -17 -38 -39 42 62 21 -58 -57 7 54 34 -3 -70 -33 15 59 28 -36 -48 27 49 44 2 -54 -21 -7 66 40 -36 -75 -16 45 31
4450 31 -2 -37 -59 2 52 17 -24 -41 -26 47 58 -1 -67 -57 9 54 24 -30 -73 -33 33 60 15 -42 -79 -11 77 67 -20 -68
4480 -68 -42 42 75 33 -38 -60 -11 53 62 0 -85 -49 9 87 36 -28 -77 -29 44 54 6 -29 -72 -2 46 31 -1 -67 -40 -7 48
4511 48 3 -36 -57 -13 40 64 -32 -41 -47 14 47 16 -27 -38 -6 41 62 2 -42 -55 6 60 44 -13 -56 -40 12 40 -8 -30 -80
4542 -80 -46 32 47 9 -42 -38 -10 64 34 -9 -60 -40 6 77 6 -19 -39 15 39 45 8 -51 -34 30 77 59 -40 -66 -26 16 66
4573 66 -3 -52 -40 24 51 54 -20 -64 -30 48 50 32 -63 -49 -19 41 32 -19 -38 -43 35 34 24 -21 -48 25 39 36 3 -49 -31 21 45
4606 45 22 -37 -49 -19 32 35 -15 -31 -40 2 50 25 -40 -36 -7 9 31 -6 -30 -37 -2 -2 23 -19 -35 -30 13 36 -12 -42 -18 8 63
4639 63 26 9 -43 -24 -13 34 38 -3 -13 -13 27 45 27 -29 -42 5 27 38 26 -59 -56 -9 55 11 -30 -79 -42 13 41 26 -35 -68
4671 -68 -28 57 33 -8 -54 -52 9 59 19 -39 -56 -7 62 42 25 -71 -58 8 88 44 -30 -53 -26 43 64 14 -56 -20 5 30 32
4702 32 -26 -62 -51 22 44 26 -38 -58 10 43 36 -3 -45 -47 14 42 7 -29 -42 -25 39 33 9 -30 -27 -13 52 21 -24 -39 -8 16
4734 16 37 6 -39 -34 -10 28 21 -17 -36 -36 22 8 12 -9 -57 -23 47 53 5 -36 -28 8 10 29 -12 -50 -24 15 20 1 -48 -54 -8 25 38
4769 38 -5 -70 -32 10 50 14 -11 -40 -23 36 34 11 -45 -66 -17 69 30 -10 -63 -30 -11 31 14 -21 -59 36 67 45 20 -74 -29
4800 -29 20 19 24 -63 -81 -55 70 23 23 -27 -26 -21 80 -28 -3 22 -85 -16 94 91 4 -53 -8 93 112 15 -51 -75 54 58
4830 58 60 -109 -29 -14 133 113 -32 -43 -59 72 -24 22 15 -19 48 10 148 -12 -84 -110 -38 110 63 -18 -102 -110 57 14
4858 14 -57 -60 -118 -2 -3 99 -60 51 -26 14 52 -3 -34 -72 56 31 56 38 -116 16 34 74 183 48 -60 -64 27
4885 27 51 -32 -22 32 62 86 55 8 54 81 11 145 72 116 124 -6 4 6 -30 -242 -91 -2 164 144 -60 70 -108
4912 -108 -73 157 99 -150 -33 -91 186 41 -49 31 -200 66 100 63 -30 45 44 107 159 20 -3 -6 192 0 -103
4937 -103 -53 -64 5 8 114 -22 -45 53 -94 119 113 11 -94 -37 50 -3 17 -86 -87 -65 31 11 90 -51 -16 -12 103
4964 103 -32 -78 -95 -14 26 137 18 -101 -13 25 96 14 -42 -120 50 74 -32 3 -83 -98 -8 104 127 -32 -37 -71
4990 -71 24 63 -7 -7 -72 -24 52 98 7 -81 -56 -2 61 62 -8 -74 -45 33 62 10 -43 -82 -6 76 44 15 -50 -81 -6 87 47
5021 47 -35 -88 -9 76 96 26 -74 -51 38 98 63 -37 -99 -44 71 83 19 -58 -74 -16 73 75 -44 -58 -23 28 56 26 -47
5050 -47 -83 1 54 67 -37 -103 -77 58 81 24 -57 -70 -17 36 42 12 -73 -46 19 62 38 -55 -43 -6 61 74 8 -92 -37
5079 -37 16 91 58 -38 -65 -43 58 76 37 -70 -77 -15 43 47 -4 -88 -65 15 78 32 -36 -76 -38 61 61 -2 -82 -66 -13 65 28
5110 28 -40 -72 -37 50 80 38 -66 -76 -17 78 76 12 -77 -49 16 98 41 -62 -70 -10 76 73 -2 -71 -88 17 66 50 -36 -107
5140 -107 -63 45 103 23 -79 -81 -17 109 111 -25 -89 -70 48 107 38 -76 -80 2 102 96 0 -88 -61 33 87 52 -43 -76
5168 -76 -14 79 99 9 -59 -62 18 82 72 -50 -111 -39 47 109 -2 -71 -99 -25 69 78 -5 -82 -59 17 73 21 -60 -81 -8 86
5198 86 50 -4 -68 -54 36 78 71 -84 -92 -35 59 62 26 -47 -64 -21 75 52 15 -78 -44 27 77 13 -50 -75 -18 66 68 6 -88 -64
5230 -64 41 105 54 -28 -73 -36 52 75 -13 -66 -64 34 67 70 12 -79 -58 56 48 22 -67 -75 -3 57 72 -8 -79 -52 61 84 47
5261 47 -63 -107 -29 111 99 -9 -121 -71 20 99 52 -32 -124 -34 82 75 -12 -80 -85 -8 103 88 -32 -80 -73 79 101 32
5289 32 -54 -75 27 97 78 -24 -89 -64 20 106 42 -55 -81 7 69 74 -10 -119 -72 20 83 64 -52 -110 -60 40 93 18
5317 18 -38 -47 3 82 57 -37 -85 -59 42 72 43 -25 -68 -29 81 51 -4 -50 -50 14 73 43 -49 -78 -39 20 72 34 -37 -77
5347 -77 -6 64 98 6 -95 -57 60 95 39 -53 -65 -35 48 75 -1 -68 -52 -15 80 71 -59 -87 -32 70 76 21 -63 -85 1
5376 1 85 74 -12 -118 -49 65 93 23 -44 -68 -11 88 78 -10 -74 -75 31 86 53 -81 -90 9 60 92 -18 -76 -53 48 103
5405 103 33 -48 -101 -16 44 85 9 -94 -88 3 78 92 -22 -73 -57 60 80 51 -40 -78 2 90 52 -14 -73 -47 1 80 40
5434 40 -63 -83 -40 54 71 -11 -102 -71 2 67 53 -20 -93 -32 38 71 -1 -59 -63 4 82 52 -21 -56 -42 27 72 42 -49 -83
5464 -83 -36 45 72 -8 -79 -97 -27 48 57 -40 -73 -23 34 111 23 -46 -71 -8 64 80 -14 -63 -61 40 65 43 -51 -84 -41 76
5494 76 82 -12 -70 -84 17 89 67 -54 -76 -27 50 85 10 -81 -76 11 73 35 -4 -86 -23 49 102 45 -57 -64 4 76 60 -27
5524 -27 -92 -53 34 101 45 -43 -60 -24 75 76 -11 -75 -40 26 92 36 -20 -60 -41 69 76 -8 -90 -64 19 61 47 -24 -64 -26 45
5555 45 67 46 -56 -71 -8 51 73 2 -89 -70 10 46 41 -24 -73 -39 36 102 6 -41 -67 4 53 60 -14 -79 -38 20 74 15 -51
5586 -51 -60 -22 36 60 -12 -66 -57 33 81 50 -23 -93 -37 52 78 30 -49 -82 7 77 75 -28 -56 -62 10 73 8 -56 -89 -38 53 59
5618 59 -3 -65 -57 35 92 47 -17 -84 -29 52 73 1 -80 -90 13 71 61 -21 -75 -42 44 87 -7 -68 -62 0 63 37 -10 -90 -79
5649 -79 40 56 39 -36 -59 -32 71 48 -10 -84 -68 44 72 35 -14 -44 -13 64 70 -17 -23 -57 -8 54 65 -47 -60 -38 32
5678 32 67 34 -24 -50 -6 67 78 -21 -61 -23 8 76 42 -12 -110 -40 53 79 -2 -43 -53 -23 49 21 -3 -70 -62 14 101 40 -40
5709 -40 -72 -17 72 49 9 -68 -76 24 75 45 -28 -86 -56 33 74 20 -56 -70 8 88 52 -25 -71 -43 51 64 27 -36 -75 -17
5739 -17 53 84 -7 -84 -74 25 74 31 -40 -82 -25 91 87 8 -62 -65 -14 68 36 -53 -64 -26 47 65 -2 -56 -68 -16 37 68 -7
5770 -7 -87 -47 16 63 47 -23 -54 -48 50 75 -16 -59 -66 -6 41 65 -28 -79 -32 20 68 -1 -36 -63 8 61 52 -11 -59 -22 9 77
5802 77 37 -22 -67 -25 39 72 17 -44 -47 2 62 21 -9 -79 -58 42 48 18 -38 -67 -5 63 54 -26 -48 -49 52 62 21 -49 -62
5833 -62 -4 45 86 -27 -72 -60 -5 67 50 -6 -83 -47 33 76 19 -53 -43 19 66 71 -33 -80 -24 18 86 23 -53 -63 -11 52
5863 52 57 -15 -81 -35 30 88 22 -47 -71 -56 28 49 6 -66 -72 13 78 70 -23 -100 -31 54 62 32 -38 -72 -5 66 56 -7 -70 -72 10
5896 10 83 65 -33 -89 -25 42 65 6 -43 -74 -21 58 49 13 -70 -42 21 80 14 -30 -88 -34 25 61 19 -76 -65 18 49 71 -19
5927 -19 -88 -41 28 86 22 -20 -62 5 80 58 -15 -64 -28 49 56 43 -32 -63 -38 43 30 1 -73 -51 29 69 35 -41 -66 -31 43
5958 43 55 4 -72 -101 0 63 57 -25 -75 -56 49 47 41 -40 -75 -28 54 66 10 -57 -68 29 65 48 -44 -67 -41 69 54 4
5988 4 -36 -78 -26 53 48 -12 -89 -46 44 61 36 -50 -66 -10 77 43 -7 -68 -36 32 71 38 -16 -49 -3 46 66 4 -64 -55 18 71
6020 71 40 -5 -58 -46 34 68 53 -15 -50 -17 48 65 31 -67 -71 12 52 34 -28 -65 -55 44 84 2 -78 -91 -6 73 66 -22 -76
6051 -76 -80 60 89 42 -46 -88 -14 76 84 4 -74 -55 29 93 76 -59 -93 -45 43 46 34 -57 -52 30 52 80 -32 -80 -71 59 71
6082 71 28 -53 -86 -3 72 75 -28 -79 -65 9 75 43 -38 -81 -26 87 90 1 -39 -66 2 56 39 -19 -76 -26 26 90 -5 -32
6112 -32 -63 -1 60 54 -11 -73 -40 40 65 34 -46 -91 -39 52 81 12 -32 -56 11 50 71 -12 -71 -9 46 107 36 -33 -58 -3 64
6143 64 50 -4 -82 -65 22 64 45 -80 -96 -25 61 76 2 -70 -72 13 75 42 -54 -60 -26 45 57 50 -67 -66 16 78 68 -18 -101
6174 -101 -64 56 78 27 -91 -95 -17 95 81 3 -89 -84 42 82 30 -41 -122 -23 72 103 -3 -70 -103 4 69 63 -23 -97
6202 -97 -41 56 87 17 -68 -81 -7 82 80 -42 -102 -55 13 82 57 -67 -82 -46 68 91 -21 -91 -97 23 88 76 -37 -75
6230 -75 -49 52 108 13 -70 -92 -19 96 78 -1 -81 -66 23 89 60 -44 -127 -41 41 93 7 -65 -73 1 104 88 -17 -114
6258 -114 -58 35 83 33 -62 -89 -18 78 64 1 -95 -49 24 107 65 -61 -96 -40 98 104 2 -78 -76 3 84 64 -33 -100 -37
6287 -37 68 108 34 -91 -94 -5 67 83 -6 -92 -85 67 125 50 -47 -102 -44 75 93 -15 -104 -109 40 114 58 -58 -107 -27
6315 -27 62 77 -10 -97 -89 38 114 61 -46 -95 -56 71 111 35 -71 -122 -19 84 107 2 -109 -87 16 105 76 -52
6341 -52 -107 -28 91 92 2 -116 -80 1 80 77 -39 -97 -55 86 105 36 -72 -75 -5 111 93 -3 -82 -101 34 123 65 -42
6369 -42 -103 -18 82 105 6 -87 -90 15 112 61 -24 -97 -49 47 128 26 -90 -91 13 91 84 -9 -107 -59 74 109 54 -87
6397 -87 -100 -9 107 123 2 -87 -85 59 120 63 -68 -123 -51 58 125 34 -87 -90 17 124 91 -38 -105 -52 57 104
6423 104 38 -58 -108 0 104 81 -22 -103 -106 39 121 58 -79 -111 -26 48 102 15 -102 -92 24 105 74 -45 -104 -57
6449 -57 78 135 26 -68 -97 11 84 104 -27 -130 -68 55 130 43 -49 -124 -25 74 65 4 -106 -102 40 91 63 -62 -103
6476 -103 -12 101 139 27 -73 -93 21 126 104 -1 -119 -52 68 105 42 -68 -114 -16 92 98 -3 -81 -77 29 121
6501 121 39 -65 -132 -26 64 96 -10 -124 -111 15 123 72 -47 -123 -71 72 115 67 -87 -126 -21 133 98 -24
6525 -24 -133 -84 49 100 76 -105 -102 -30 96 103 2 -92 -99 40 109 68 -65 -130 -23 67 124 28 -112 -111 17 105 60
6552 60 -39 -115 -78 58 90 20 -98 -121 -23 92 73 -16 -106 -90 33 114 61 -47 -109 -55 100 112 26 -109 -82 42
6578 42 133 71 -30 -106 -53 83 86 18 -80 -101 -17 104 72 -12 -119 -91 32 93 74 -84 -116 -35 111 97 17 -96 -95
6605 -95 5 118 69 -26 -129 -21 60 126 7 -83 -90 9 108 109 8 -106 -42 43 114 40 -76 -93 -23 89 102 -17
6631 -17 -96 -83 34 145 69 -59 -106 -71 97 109 7 -100 -121 12 97 113 -54 -108 -40 69 122 47 -101 -120 2
6656 2 128 88 -51 -124 -53 74 132 100 -56 -113 -37 91 87 9 -72 -93 36 107 66 -65 -86 -65 70 69 11 -83 -89 11
6684 11 95 83 -51 -119 -75 52 106 42 -52 -98 -14 101 80 -1 -72 -72 24 119 51 -61 -92 -39 68 107 51 -85 -67 -9
6712 -9 108 68 -11 -87 -58 51 107 46 -64 -111 -3 75 95 -19 -113 -85 45 106 52 -58 -110 2 76 101 5 -95
6738 -95 -103 40 103 90 -21 -117 -49 60 93 41 -88 -69 21 104 104 -7 -93 -69 42 128 28 -60 -87 -2 84 82 3 -127
6766 -127 -53 32 87 54 -57 -104 -13 69 68 -11 -64 -63 31 91 47 -35 -119 -51 51 92 49 -77 -86 -9 94 79 -18 -86 -63
6795 -63 38 87 61 -54 -82 -25 80 86 25 -59 -87 23 76 66 -38 -101 -41 56 63 24 -49 -79 -24 88 76 2 -91 -59
6823 -59 62 99 58 -42 -95 -42 56 102 -16 -76 -89 22 101 62 -22 -97 -32 35 95 7 -87 -71 -14 80 78 -38 -78 -65
6851 -65 42 83 45 -49 -91 5 50 59 -2 -78 -35 18 75 40 0 -87 -5 88 100 1 -81 -71 23 98 46 -1 -48 -26 75 102
6881 102 8 -59 -48 11 87 57 -47 -80 -42 35 84 44 -51 -90 11 40 48 -2 -58 -50 38 90 28 -51 -59 -13 48 85 24 -46
6911 -46 -86 8 75 56 -33 -81 -18 22 60 2 -35 -53 -2 63 48 -9 -53 -55 15 51 39 -46 -68 -52 50 66 0 -42 -56 6
6941 6 54 55 -17 -89 -49 31 102 30 -51 -50 5 53 66 -2 -64 -56 14 73 29 -29 -66 -18 38 80 16 -33 -50 15 47 53 -6 -53 -40
6974 -40 60 77 51 -48 -70 -17 71 59 -47 -78 -55 40 58 29 -40 -62 -34 50 74 -2 -38 -88 11 62 49 -40 -48 -28 29 68
7004 68 21 -43 -35 -13 33 64 -9 -52 -28 48 56 20 -19 -77 -13 36 43 6 -51 -37 28 51 13 -24 -44 4 32 33 3 -26 -28 -3 43
7037 43 59 -9 -55 -33 29 56 -6 -39 -44 -29 50 38 7 -58 -17 6 38 35 -12 -46 -27 18 67 9 -65 -51 6 61 45 -5 -80
7068 -80 -43 32 36 21 -13 -38 -30 58 61 -10 -62 -45 0 52 53 -24 -45 -8 33 65 7 -44 -32 -4 41 51 -21 -46 -44 62 55 46 -35
7101 -35 -57 -22 52 52 -14 -52 -50 25 67 35 -5 -43 -29 71 48 -10 -43 -44 16 52 33 -21 -58 -19 33 61 32 -20 -64 -35 41
7132 41 70 9 -38 -35 10 42 36 -25 -48 7 18 40 -6 -48 -32 -32 29 25 -17 -77 -21 23 29 23 -36 -62 -4 33 26 9 2 -42 16 44
7166 44 22 -9 -27 -19 38 19 28 -51 -27 -18 102 68 -86 -139 -101 44 8 -22 -101 -43 5 86 44 122 -13 -2 -43 144 160
7195 160 -41 4 -255 -80 163 27 -66 12 57 -28 4 -30 -53 52 66 67 -136 16 10 33 150 20 30 -27 -106 114
7221 114 -6 128 -12 7 57 -23 3 -119 -58 37 -36 -7 174 -82 -49 -24 162 75 84 -63 49 11 60 104 -125
7246 -125 -19 -68 9 18 147 -84 66 19 67 -31 -89 -23 68 7 4 -8 -62 -9 -71 49 33 50 34 -7 -15 -29 75 79 -90
7275 -90 -78 -4 199 54 5 -67 -58 0 35 -83 -71 -97 -41 -18 25 -15 -81 22 24 16 3 15 -19 59 10 54 84 -82 146
7304 146 -50 107 50 48 -13 -25 94 7 20 31 27 109 248 21 9 59 -60 99 -29 31 31 -151 22 71 25 -30
7330 -30 -87 -74 -47 107 32 -2 -58 -33 36 -38 -24 -114 -55 -32 119 56 -63 -83 27 5 27 -29 2 -34 2 35 69 3
7358 3 -9 -60 74 7 87 -60 -12 -52 33 -45 -9 -17 -31 29 43 85 -80 -69 -49 -15 55 0 -79 -57 25 73 37 -106 -46
7387 -46 -12 -22 81 -31 -44 -44 5 69 30 18 17 -49 85 27 14 13 -68 25 68 72 22 -50 -39 5 -12 31 -16 -73 -5 60 60
7418 60 -52 -17 -37 -46 40 59 -26 17 -53 33 39 32 -16 -12 -9 48 23 -14 -28 -17 -7 75 4 22 -57 -2 31 60 5 -45 -25 31
7450 31 41 -5 -23 -39 -1 18 47 35 -46 -25 2 10 27 -11 -45 -26 9 25 51 -58 -45 34 41 18 -24 -36 -5 -3 73 17 -15
7481 -15 -27 -3 24 22 -1 -55 -21 25 27 6 -6 -30 -34 20 34 26 -12 -45 17 40 47 -6 -27 -5 10 19 16 -29 -47 22 14 40 21 -39
7515 -39 -10 17 44 31 -25 -54 -13 17 42 4 -19 -36 -26 84 62 -1 -38 -27 27 24 -1 -8 -58 -15 48 2 -11 -13 -18 18 44 17
7547 17 -23 -35 -8 36 64 -4 -55 -25 31 36 32 -39 -41 5 48 44 38 -44 -47 4 60 60 -24 -53 5 23 53 11 -39 -28 8 17 29 -17
7581 -17 -50 -23 52 37 16 -30 -41 -7 11 32 -2 -42 -31 14 47 51 12 -46 -30 15 30 4 -18 -56 -2 10 57 -4 -35 -15 15
7612 15 27 29 -21 -17 -8 39 61 -20 -34 -41 9 61 39 1 -52 -14 33 55 16 -53 -24 -16 30 44 -35 -19 9 19 54 30 -7 -38 10
7645 10 51 31 -2 -18 -19 15 42 14 5 -45 19 62 60 13 -43 -32 3 81 14 -40 -47 -13 9 52 20 -28 -36 -10 57 33 -5 -47 -7
7678 -7 40 31 14 -26 -38 -8 24 47 -22 -38 -26 9 42 27 -9 -43 -22 17 32 35 -34 -37 16 33 38 -14 -57 -16 55 31 -9 -48 -49
7711 -49 -36 40 35 -10 -11 -29 -1 45 9 -15 -25 -29 37 45 -16 -30 -30 20 18 26 -21 -38 4 9 61 -8 -29 -17 3 57 42 1 -39 -11
7745 -11 56 59 31 -27 -36 -5 56 32 -12 -39 -29 9 63 52 -35 -40 -38 63 42 7 -39 -30 22 72 50 -15 -59 -2 34 54 -6 -58
7777 -58 -44 0 48 64 -8 -37 -31 40 29 19 -22 -79 -13 46 59 9 -37 -33 3 32 19 -42 -55 -23 39 60 24 -41 -36 4 47 37
7809 37 -20 -55 -38 28 54 29 -29 -35 10 27 16 10 -12 -2 17 41 5 -25 -52 -10 41 45 -13 -37 -16 41 38 33 3 -47 8 35 26
7842 26 9 -11 -17 16 56 19 3 -66 -26 19 53 40 -54 -30 -4 41 27 -2 -29 -17 -5 49 28 -32 -39 -7 44 51 1 -47 -51 34
7874 34 68 28 -42 -60 -8 21 69 3 -58 -35 -10 63 35 -5 -33 -32 45 59 22 -16 -46 -24 30 39 -12 -43 -25 51 44 9 -41 -50
7906 -50 0 55 43 -6 -57 -18 17 51 41 -13 -29 -12 29 39 21 -42 -21 -4 28 52 -7 -24 -27 26 67 5 -44 -30 1 37 33
7937 33 28 -48 -32 7 45 28 1 -55 18 45 51 -9 -54 -48 25 45 37 -36 -43 -18 44 57 18 -42 -58 19 18 30 -30 -36 -28 25 45 4
7971 4 -39 -59 -8 63 33 -2 -44 -35 -5 71 34 -19 -67 -17 21 50 10 -38 -40 2 56 15 -12 -61 -12 26 45 38 -19 -38 23 55
8003 55 47 25 -23 -25 10 22 0 -34 -68 -6 15 34 -30 -60 -36 6 44 21 -38 -29 -19 5 27 -2 -32 -39 -5 56 54 -39 -44 -30 40
8036 40 83 21 -8 -42 -21 49 31 18 -35 -30 29 54 12 -30 -49 -10 25 43 -9 -46 -34 29 26 45 5 -33 -20 10 22 13 -21 -37
8068 -37 16 19 7 24 -25 -10 41 61 18 -41 -41 6 37 49 -10 -27 5 9 59 5 -7 -47 -8 48 41 9 -12 -10 23 53 29 -12 -57
8101 -57 -22 17 50 14 -46 -54 13 31 43 -10 -37 -12 59 -25 24 -19 -23 12 33 42 3 -34 -12 23 42 22 -22 -57 -16 38 28 13
8133 13 -56 -28 6 52 34 5 -24 -18 33 25 10 -24 -26 1 32 22 2 -36 -15 29 43 3 -22 -29 -17 37 31 3 -28 -34 28 56 37
8166 37 -4 -35 -18 37 50 -15 -39 -6 13 33 15 -24 -16 -4 20 13 14 -26 -31 -11 29 36 -17 -26 -20
8191b0
$$ Imaginary data points
##PAGE= N=2
##DATA TABLE= (X++(I..I)), XYDATA
0 0 0 0 0 0 0 0 0 0 0 0 0 0 0 0 0 0 0 0 0 0 0 0 0 -6 8 -8 8 -8 8 -8 12 -14 16 -16 16 -21 24 -24 28 -30 36 -38 44 -46
44 -46 52 -54 62 -67 74 -82 90 -98 111 -121 136 -151 169 -190 218 -249 289 -342 412 -513 660
65 660 -905 1347 -2313 5266 -31592 -155456 -41443 80559 66029 18099 -46116 -64422 -2926
78 -2926 40090 44255 18192 -36047 -50015 -22948 29582 93261 22152 -118608 -62681 74752
90 74752 61861 5591 -24896 -62132 -23120 54553 51526 67 -45924 -48581 9001 47369 37535
103 37535 -1692 -66616 -45520 60055 54061 -23345 -19770 -14371 -25289 24477 47635 1085
115 1085 -33891 -36033 56 47046 31877 -19200 -47086 -27712 43191 56665 -27286 -48435
127 -48435 6129 12193 8601 19765 -10961 -26909 -47 10088 12632 11738 -11727 -21667 -6761
140 -6761 17956 32366 -6224 -43086 -4788 29147 13172 2768 -15408 -30520 9156 37304
152 37304 5224 -22121 -19696 -1896 21021 17512 -5223 -17954 -18908 5323 30400 9011 -17904
165 -17904 -15617 -12141 8345 36300 10025 -34260 -28141 6829 32676 26401 -15243 -39246 -14876
178 -14876 24068 38445 7576 -35969 -30544 7589 28270 26363 -3464 -39677 -25370 20899
190 20899 35409 13845 -19533 -36939 -12473 27607 36132 6269 -33696 -37984 4740 41246
202 41246 30648 -12187 -45860 -26696 29768 47204 6622 -33787 -34241 -883 32866 30220 -3868
215 -3868 -31394 -27767 4680 35123 28072 -11520 -41278 -25637 23625 46488 10762 -36005 -36782
228 -36782 2089 34835 28412 -8405 -33560 -20955 11687 30439 18380 -12994 -31937 -15873
240 -15873 19986 33920 8005 -26511 -28854 985 27479 23061 -5441 -27459 -19509 10192 27799
253 27799 13868 -14489 -26997 -10154 19344 26193 1068 -23186 -18975 4506 20956 14196 -7019
266 -7019 -19045 -11028 8207 19881 9084 -12589 -18710 -3878 15289 18081 -1628 -19571 -11439
279 -11439 8847 15806 5618 -10002 -13782 -1376 10590 9934 -687 -11418 -9002 4588 11230
292 11230 5077 -6266 -12082 -2594 11523 9479 -3736 -10632 -6080 6002 12106 2725 -9442 -9851
306 -9851 610 11640 9464 -5315 -13034 -5370 7743 13574 3323 -12792 -12865 2123 13313 10530
320 10530 -4499 -16283 -8835 8975 16178 5633 -12297 -17037 -1356 15719 14792 -2043 -17489
333 -17489 -13391 7190 19205 9371 -9817 -18562 -6971 13614 19040 2769 -16267 -17317 869
346 869 18559 15383 -5136 -19977 -12953 8642 20827 9268 -12748 -20331 -5852 14968 19698
359 19698 2225 -18240 -17832 2328 19291 15443 -5167 -20608 -12770 9500 20846 9623 -12072
372 -12072 -20774 -5754 15618 18969 2072 -17194 -17728 2222 18853 13570 -5210 -18384 -12448
385 -12448 8144 19256 8250 -10779 -18540 -6243 14391 17810 530 -15459 -14567 2097 17184
398 17184 11560 -6295 -14561 -8384 6157 15688 7010 -9242 -14206 -4979 10779 15800 275 -14884
412 -14884 -10978 3419 13629 8569 -7764 -12728 -2358 6460 8490 3187 -6972 -8720 -1018 6322
426 6322 9025 937 -10706 -6962 5200 8610 3813 -5325 -8967 907 7818 2705 -1731 -3424 -3552
441 -3552 1671 4528 1655 -1526 -5086 -2582 5877 4260 -3687 -4088 -1412 2501 5244 -1331 -5829
456 -5829 30 2401 878 2066 -318 -3626 -2293 1273 6182 3887 -7329 -7604 3833 7946 3699
471 3699 -4296 -9631 -573 9502 3726 -3407 -3372 -3467 -552 4325 4786 1215 -6547 -8803 2905 10741
487 10741 4034 -5024 -9943 -4607 9828 10751 -2948 -8537 -5369 407 8604 7815 -3095 -9594 -6353
502 -6353 4598 11794 3419 -7522 -8094 -3376 5951 11682 1149 -10248 -8035 -662 8388 11704
516 11704 -1501 -14565 -8741 6652 14262 5017 -10544 -11354 -36 8215 9828 1152 -10793 -8028
530 -8028 2883 7454 7503 466 -10881 -8851 4524 11475 6440 -6053 -12693 -3930 8554 11328
544 11328 2255 -11804 -11678 4811 12217 3622 -5121 -7981 -3332 5220 6026 1228 -1563 -4901 -5414
559 -5414 2105 9228 6208 -6212 -13047 -810 13507 7571 -6764 -9603 -1666 6931 5931 -2371
573 -2371 -4152 -496 -756 -564 3356 3817 -1731 -6973 -2951 6533 6240 -3120 -6204 -1296 3132 3476
589 3476 283 -2171 -1392 -891 347 3449 2344 -3151 -4219 1193 5203 1301 -4754 -2571 3799 2824
605 2824 -2861 -2829 2003 2946 -1789 -3610 1521 4084 -1451 -5020 472 5950 1310 -6613 -4117 5805
621 5805 7026 -2787 -8314 -1188 7387 4456 -3969 -4684 650 2605 809 183 940 -688 -3797 -1678
637 -1678 4763 5239 -2098 -7297 -3200 5344 6817 -756 -6070 -3921 762 4713 4860 -984 -6475 -4796
653 -4796 2693 8278 3832 -6133 -7734 168 6673 5535 -1447 -5794 -3059 785 3233 5379 1494
668 1494 -6876 -7434 1615 9621 6384 -6171 -11315 -1358 8907 7250 -1813 -8056 -4501 3204 4933
683 4933 2906 16 -5035 -5554 1531 7006 5039 -2521 -8406 -3768 5867 7661 1428 -5774 -7254
698 -7254 112 7216 5310 -1334 -6563 -5563 2900 7630 2292 -4115 -5301 -2009 3425 4805 1215
713 1215 -2500 -4925 -3039 4163 6893 943 -5858 -6391 1075 8360 4197 -4914 -5897 -565 3976 4271
729 4271 -75 -3226 -2336 -859 1858 4094 890 -3722 -3733 -80 4218 3683 -2355 -4676 -964 2299
745 2299 3079 923 -2758 -2711 423 2173 2211 -175 -3053 -1252 2091 1798 -39 -1304 -1068 922 1040
762 1040 -519 -87 272 -602 -122 581 305 -223 -1161 -473 1900 1062 -2072 -1984 793 2551 1205 -2358
780 -2358 -2859 893 2909 1275 -1134 -2367 -941 1731 2165 723 -1061 -2538 -1129 2278 3032 334
796 334 -2768 -3236 201 3764 2675 -1452 -3963 -2446 1944 4383 1538 -3028 -4233 -1002 3558 4225
812 4225 -66 -4056 -3470 596 4265 3562 -1180 -4566 -2968 1853 5120 2942 -2854 -5505 -1760 3947
828 3947 5325 826 -4754 -4973 343 4971 4175 -1103 -5462 -3847 2052 5433 3017 -2727 -5866 -2408
844 -2408 3938 5623 1218 -4291 -5341 -319 5316 4842 -735 -5311 -4255 1855 6066 3188 -2845
859 -2845 -5523 -2413 3648 5617 966 -4191 -4674 -653 4436 4567 -788 -4866 -3681 1172 5124 3070
875 3070 -2700 -4784 -1796 2749 4675 1149 -3716 -3635 -36 3311 3608 -319 -3901 -2483 1170 3347
891 3347 2391 -1629 -3673 -1059 1901 2773 1068 -2371 -2938 137 2180 1876 -69 -2456 -1759 1092
907 1092 1830 910 -649 -1991 -550 1515 1055 158 -612 -1284 115 1402 427 -373 -636 -518 806 871
925 871 -546 -648 -133 228 792 -185 -1300 -57 712 249 195 -653 -1141 314 1141 604 -227 -1474 -986
944 -986 1351 1717 264 -1238 -1908 155 2529 1265 -947 -1552 -1272 583 2501 1274 -1353 -2564
960 -2564 -1391 1963 3300 240 -3020 -2935 243 3559 2413 -1833 -3223 -1395 1165 3204 1976 -2025
976 -2025 -3664 -1324 2588 4199 813 -3846 -3670 639 4223 3246 -1646 -4335 -1798 1934 3649 2134
992 2134 -2243 -4533 -1369 3249 4226 488 -4160 -3989 837 4212 2867 -1492 -4162 -2147 1886 3634
1008 3634 2098 -1705 -4425 -1890 3317 4583 575 -4011 -3889 897 4394 2651 -1727 -3724 -1730
1023 -1730 1788 3080 1366 -1463 -3310 -1803 2171 3851 856 -3147 -3594 114 3660 2770 -1285
1038 -1285 -3546 -1667 1796 3041 1016 -1716 -2467 -728 1838 2550 445 -2039 -2172 45 2157 1904
1054 1904 -451 -2297 -1584 867 2284 1038 -1429 -2242 -537 1748 1743 -374 -1873 -1055 816 1465 413
1071 413 -897 -915 -77 710 813 113 -631 -651 133 940 703 -488 -987 -131 785 811 -195 -1178 -616 795
1091 795 1070 -21 -1208 -1135 442 1510 510 -1187 -1533 -4 1622 1043 -786 -1271 -439 511 1147
1108 1147 744 -471 -1264 -909 682 2172 1082 -1805 -2528 -4 2787 2235 -1353 -3094 -838 1850
1124 1850 2203 358 -1822 -2010 -180 1574 1940 444 -2148 -2532 201 2819 2241 -1096 -3273 -1355
1140 -1355 1966 2740 868 -1804 -2787 -559 2448 2699 115 -2807 -2765 832 3457 1768 -1783 -3085
1156 -3085 -930 1997 2298 333 -1468 -2192 -996 1724 2824 601 -2530 -3112 287 3733 2353 -1926
1172 -1926 -3437 -867 2456 2625 -45 -1991 -1605 -125 1525 2046 233 -1994 -2170 38 2586 2064
1188 2064 -1253 -2941 -1106 1675 2391 391 -1959 -1943 -13 1777 1824 -251 -2115 -1401 923 2023
1204 2023 904 -1181 -1693 -145 1277 1183 189 -899 -1185 -202 1127 1368 -66 -1728 -1287 968 1837
1221 1837 236 -1555 -1328 521 1399 310 -891 -762 -36 446 495 109 -352 -663 -182 749 883 -198
1239 -198 -1051 -452 806 1074 7 -966 -677 391 944 516 -510 -1036 -423 791 1151 -6 -1315 -1056
1257 -1056 521 1416 465 -1019 -1200 -49 938 891 46 -851 -964 -102 1091 1346 -107 -1717 -1224 939
1275 939 2089 654 -1595 -1790 142 1738 1237 -464 -1545 -1055 516 1453 920 -584 -1765 -1001 1048
1292 1048 1913 529 -1543 -1858 9 1845 1524 -371 -1754 -1249 704 1948 1003 -983 -1875 -768
1308 -768 1351 1953 213 -1681 -1604 157 1676 1274 -531 -1669 -1108 503 1752 981 -1012 -1851 -675
1325 -675 1233 1888 233 -1748 -1481 412 1728 1129 -632 -1555 -655 795 1468 680 -885 -1424 -276
1342 -276 1098 1350 129 -1365 -1249 394 1361 785 -630 -1453 -590 847 1134 212 -909 -1126 5
1359 5 1055 769 -262 -944 -678 479 1109 360 -590 -805 -152 838 834 -114 -773 -552 277 919 377 -618
1379 -618 -720 -108 574 647 -159 -847 -418 306 643 251 -497 -714 -46 552 542 -71 -717 -479 403 721 258
1400 258 -432 -734 -75 749 684 -142 -745 -543 367 878 312 -562 -797 -259 709 828 -101 -839 -673 127
1420 127 907 622 -485 -966 -376 611 1017 247 -805 -859 22 930 909 -184 -1060 -615 455 1049 533
1439 533 -615 -1079 -292 752 958 108 -938 -945 44 936 773 -281 -1114 -678 501 1042 478 -632 -1050
1458 -1050 -273 863 1004 58 -884 -825 189 1010 727 -278 -966 -539 531 1023 382 -649 -996 -201
1476 -201 793 861 -110 -953 -746 201 839 488 -397 -861 -432 474 817 186 -611 -760 -43 731 697 -124 -762
1497 -762 -421 378 748 295 -377 -580 -144 465 561 48 -501 -518 56 558 414 -273 -628 -228 364 474 -40
1518 -40 -467 -380 90 380 239 -171 -356 -158 206 357 136 -246 -343 21 404 297 -161 -381 -107 301 353
1539 353 23 -307 -295 78 299 175 -124 -357 -220 186 371 75 -304 -369 35 388 325 -124 -359 -198 191
1560 191 406 163 -203 -343 -128 286 453 51 -425 -396 67 463 277 -253 -506 -206 250 377 56 -348
1580 -348 -421 -68 294 424 43 -474 -410 149 550 341 -231 -526 -146 385 516 128 -361 -438 25 428 399
1601 399 -46 -471 -394 152 475 230 -305 -488 -205 276 419 44 -434 -447 -24 402 347 -116 -452 -288 226
1622 226 475 209 -283 -338 -46 332 358 29 -255 -203 85 308 222 -98 -306 -191 130 291 96 -236 -272 -48
1644 -48 178 218 -15 -253 -212 48 200 89 -129 -189 -16 124 151 54 -49 -75 9 57 138 90 -72 -102 29 180
1668 180 110 -76 -148 -48 107 71 -51 -99 -45 34 40 -13 -21 12 -9 18 94 47 -28 -71 18 135 104 -9 -100 -84 26
1695 26 95 69 -96 -107 -44 61 -7 -29 -147 -148 43 68 -46 -50 -148 37 84 249 -21 -106 -142 75 193 145 28 -156
1721 -156 -71 174 255 151 -139 -218 131 120 143 -82 -206 -88 159 232 106 -164 -267 -78 176 -35 -92 -311
1743 -311 -133 -41 126 -10 -126 -258 -116 -31 156 29 -118 -215 -82 110 190 104 169 21 10 181 215 124 -217
1766 -217 -37 3 182 135 5 -141 -78 -28 140 37 -38 -177 -9 87 138 8 -75 -197 9 60 194 13 -104
1789 -104 -151 -19 264 141 -96 -144 -96 86 207 62 -147 -187 -71 134 178 -34 -190 -133 56 135 72 -88 -152
1812 -152 -45 111 106 28 -115 -134 17 123 146 -30 -174 -81 115 151 12 -125 -106 14 110 41 -72 -94 -57 20
1836 20 53 -14 -85 -96 -32 83 71 -44 -69 3 85 123 30 -94 -22 76 111 73 -24 -55 6 70 93 13 -96 -97 24 116
1864 116 31 -87 -142 -68 61 81 0 -81 -126 -67 99 99 -5 -124 -130 -1 187 131 -88 -164 -73 146 189 84 -69
1889 -69 -134 -29 149 209 48 -157 -209 -1 192 202 -57 -268 -191 82 219 73 -168 -276 -117 198 249 12
1911 12 -236 -254 22 256 244 -62 -286 -164 155 305 153 -173 -298 -67 249 292 19 -264 -275 37 320 210
1933 210 -119 -326 -155 162 289 95 -191 -248 -60 218 235 -4 -244 -169 88 239 177 -114 -242 -84 141
1954 141 223 52 -155 -195 -22 135 158 -13 -179 -152 6 179 107 -77 -187 -87 94 164 58 -85 -102 1
1976 1 148 142 2 -70 -95 46 161 80 -19 -105 -67 97 98 -28 -109 -97 15 89 20 -52 -116 -75 19 81 16 -138 -97 0
2004 0 85 94 -65 -116 -15 76 143 22 -124 -64 102 185 110 -48 -118 -29 140 161 41 -149 -210 45 215 122 -102
2029 -102 -243 -128 134 192 15 -227 -227 -8 243 205 -81 -278 -194 141 305 139 -194 -271 -30 259 329 0
2051 0 -288 -258 73 324 225 -160 -331 -158 210 371 117 -279 -345 -39 293 323 -32 -350 -257 118 331 186
2073 186 -148 -348 -130 196 327 122 -258 -326 -39 323 321 -32 -335 -290 95 317 188 -166 -324 -157 181
2094 181 287 97 -246 -322 -74 260 313 1 -298 -286 71 332 217 -106 -276 -149 173 322 135 -160 -314
2115 -314 -58 282 301 -46 -299 -265 78 280 146 -173 -288 -136 162 225 38 -221 -295 -35 253 228 -71 -269
2137 -269 -160 144 271 77 -151 -184 20 222 203 -23 -193 -117 106 243 105 -160 -197 -23 187 150 -55 -227
2159 -227 -142 97 194 53 -165 -219 -27 179 155 -95 -264 -175 151 255 67 -194 -194 41 276 168 -91 -179 -144
2182 -144 138 279 107 -172 -240 -64 254 247 -43 -261 -215 67 305 181 -173 -349 -144 210 342 111 -233
2203 -233 -307 6 283 299 -75 -319 -240 151 353 225 -105 -371 -264 235 350 88 -311 -372 4 397 355 -140
2225 -140 -449 -246 91 443 171 -137 -365 -201 391 528 71 -307 -437 -134 409 352 -83 -504 -308 387
2245 387 555 119 -119 -534 -86 379 487 220 -494 -555 76 331 383 -202 -533 -265 149 422 214 -324 -388
2266 -388 -79 387 408 2 -415 -276 137 468 251 -310 -419 -85 280 376 -7 -348 -272 55 303 221 -140
2287 -140 -360 -206 158 331 84 -266 -312 -27 251 233 -99 -304 -202 178 293 117 -180 -258 4 271 218
2308 218 -65 -245 -145 122 233 122 -131 -204 -82 176 243 31 -246 -222 73 281 163 -172 -301 -73 228
2329 228 265 -19 -274 -188 74 272 174 -132 -301 -156 181 323 81 -271 -349 1 311 258 -97 -361 -254 132
2351 132 371 157 -245 -412 -111 315 401 2 -404 -375 103 441 273 -170 -427 -180 251 453 181 -317 -480
2372 -480 -49 454 453 -57 -556 -374 230 536 243 -329 -549 -167 357 465 15 -488 -441 32 458 334 -167
2393 -167 -553 -333 271 585 161 -403 -491 -53 459 483 -4 -421 -382 118 554 307 -206 -499 -198 270 502
2414 502 142 -399 -408 -7 350 309 -84 -421 -314 156 413 234 -246 -486 -152 310 364 21 -364 -327 112 362
2436 362 224 -103 -321 -166 197 356 120 -242 -345 -47 291 290 -67 -301 -237 159 337 119 -207 -289 -86
2457 -86 260 300 -20 -303 -226 72 345 203 -194 -351 -107 219 313 23 -314 -250 42 305 221 -135 -382 -156
2479 -156 233 360 70 -360 -353 69 414 255 -165 -398 -199 270 402 112 -285 -370 -20 409 374 -40 -435
2500 -435 -328 209 497 185 -333 -448 -104 393 412 -65 -476 -373 65 457 315 -251 -555 -239 318 537
2520 537 99 -403 -468 34 485 445 -107 -522 -289 252 544 290 -306 -515 -121 422 535 21 -499 -437 135
2541 135 517 318 -222 -544 -306 274 473 155 -336 -479 -115 422 477 -26 -510 -381 130 527 295 -236
2561 -236 -552 -183 352 430 90 -235 -380 -30 425 409 -31 -470 -298 165 456 228 -307 -444 -106 370 421
2582 421 22 -375 -385 63 365 306 -178 -444 -123 223 434 137 -310 -399 -4 443 289 -174 -421 -186 173
2603 173 338 120 -359 -327 -77 282 325 -39 -361 -274 130 399 274 -230 -372 -37 296 364 -13 -440 -144
2624 -144 149 371 192 -267 -309 -132 417 343 8 -420 -318 100 448 185 -214 -465 -87 202 286 170 -356
2645 -356 -271 36 423 113 -165 -300 -262 360 563 220 -396 -423 -14 482 420 -58 -480 -305 288 488 409 -200
2667 -200 -384 -181 384 412 106 -462 -442 -43 434 273 -159 -477 -322 144 429 150 -333 -453 -138 391 454
2688 454 29 -467 -404 113 516 361 -192 -517 -263 282 516 169 -352 -491 -65 447 396 -69 -475 -383 156
2709 156 501 284 -266 -483 -205 354 477 101 -404 -419 34 445 346 -152 -501 -294 252 473 179 -348 -413
2730 -413 -32 382 369 -68 -405 -317 126 410 213 -236 -421 -90 317 359 -21 -342 -303 128 391 229 -181
2751 -181 -363 -127 274 352 59 -304 -308 66 362 237 -154 -336 -124 230 315 81 -291 -353 -12 309 286 -110
2773 -110 -403 -206 198 352 79 -304 -314 -1 309 289 -60 -312 -199 157 360 213 -208 -339 -72 315 342
2794 342 10 -348 -270 115 398 216 -214 -412 -175 252 404 72 -324 -388 -5 380 322 -108 -448 -276 195
2815 195 439 196 -263 -464 -103 361 437 56 -409 -418 59 473 355 -159 -492 -218 305 488 155 -337 -460
2836 -460 -47 415 403 -21 -436 -341 140 500 275 -254 -496 -180 344 502 47 -411 -391 33 483 366 -170
2857 -170 -460 -233 228 450 165 -335 -429 -70 360 391 -54 -403 -304 108 404 239 -214 -408 -129 290 412
2878 412 58 -348 -309 72 346 247 -101 -338 -154 187 300 105 -247 -303 -17 267 215 -82 -299 -225 140 307
2900 307 102 -203 -296 -36 237 220 -26 -254 -170 99 258 126 -151 -269 -87 224 272 16 -235 -185 68 284
2922 284 196 -131 -252 -91 185 278 50 -260 -255 39 271 200 -108 -327 -153 168 291 61 -259 -300 -32 292
2944 292 243 -48 -318 -260 128 363 188 -213 -352 -113 319 372 -3 -315 -293 80 410 274 -158 -392 -171
2965 -171 245 380 121 -315 -368 -11 353 329 -87 -395 -263 162 441 226 -223 -438 -119 324 372 12 -367
2986 -367 -308 64 355 259 -159 -404 -184 206 369 126 -291 -380 -55 324 311 -32 -349 -212 139 363 211
3007 211 -160 -319 -107 238 330 105 -286 -279 27 282 238 -90 -300 -174 157 253 108 -185 -288 -123 211 237
3029 237 11 -241 -214 45 250 138 -126 -277 -102 162 208 19 -161 -183 14 205 175 -32 -181 -123 99 224
3051 224 87 -112 -227 25 207 164 -57 -197 -99 64 177 56 -133 -207 -52 117 169 -10 -189 -162 80 221
3073 221 120 -149 -187 -14 194 151 -9 -184 -161 92 231 135 -106 -224 -85 196 228 -22 -210 -209 97 243
3095 243 139 -108 -239 -97 138 235 44 -169 -235 -1 235 215 -73 -293 -173 129 276 95 -199 -291 -45
3116 -45 207 234 -18 -243 -186 69 239 182 -86 -294 -158 159 280 86 -193 -248 -25 232 225 -12 -254 -202 90
3139 90 253 173 -123 -236 -130 165 274 65 -184 -239 -25 226 213 -46 -240 -222 44 228 102 -144 -252 -118
3161 -118 105 205 11 -189 -224 -1 164 181 -97 -291 -153 136 277 118 -74 -123 -53 150 195 16 -122 -142
3183 -142 37 218 230 -53 -205 -83 119 150 119 -133 -284 6 140 131 9 -156 -102 73 86 97 -211 -96 -20
3206 -20 59 235 -27 -113 -261 14 72 16 -97 -23 38 70 222 -11 -118 -121 23 109 115 -17 -124 -44 58 90 -118
3231 -118 -38 -283 -36 107 170 -86 -35 -16 54 181 -62 27 -142 -2 177 113 -152 -176 -80 165 93 39 -32 -121
3255 -121 -21 82 91 -120 -233 -176 27 85 64 -9 -73 48 244 110 13 -93 -97 24 246 213 -92 -191 -65 139
3279 139 144 25 -113 -212 4 115 170 -10 -87 -192 -9 215 194 43 -300 -116 150 250 15 -190 -247 -45
3301 -45 72 150 -26 -160 -130 14 123 236 1 -219 -126 57 173 9 -172 -283 -58 166 127 -26 -112 -191
3323 -191 13 171 156 -133 -161 -123 90 195 47 -71 -173 26 173 90 32 -233 -71 -10 218 101 9 -39 -92
3346 -92 88 213 115 -161 -106 41 36 75 -1 -54 -16 -70 51 36 -55 -150 20 131 71 -21 -84 -95 47 88 84 8 -120
3373 -120 15 107 163 19 -69 -70 7 63 53 -33 -74 -40 57 103 56 -95 -84 10 111 73 -35 -81 -37 51 133 -7 -84
3400 -84 -97 -22 103 45 -71 -116 -29 72 152 11 -78 -144 -26 99 52 -16 -152 -102 44 127 79 -57 -120 -68 107
3425 107 157 27 -141 -160 35 149 112 -49 -147 -40 128 214 76 -108 -165 -8 151 189 4 -141 -169 49 179
3448 179 134 -113 -194 -58 101 202 19 -207 -193 39 133 121 -11 -196 -119 95 187 91 -129 -177 -44 129 197
3471 197 3 -146 -131 43 174 162 -85 -192 -122 89 172 65 -130 -189 -33 144 128 -9 -192 -124 43 153
3493 153 117 -70 -197 -95 83 179 45 -137 -174 -46 136 113 -58 -169 -106 34 181 39 -97 -168 -31 129
3515 129 114 -12 -133 -115 67 127 105 -79 -159 -19 118 146 11 -113 -94 34 127 108 -54 -123 -53 98 133 26
3539 26 -126 -126 -1 92 104 -48 -145 -94 61 133 10 -133 -142 15 136 102 -58 -153 -90 85 151 71 -96 -108 -16 165
3565 165 135 -9 -113 -111 65 153 67 -105 -189 -32 120 137 -3 -179 -144 2 161 96 -88 -180 -72 92 178 27
3589 27 -127 -183 -2 155 142 -21 -181 -128 68 194 144 -81 -204 -68 154 192 15 -136 -157 10 183 124 -50
3612 -50 -184 -104 82 197 80 -149 -195 -56 162 171 3 -192 -157 69 179 136 -106 -187 -100 126 185 41 -170
3635 -170 -192 6 198 152 -68 -192 -105 79 179 83 -125 -141 -4 137 170 16 -171 -117 60 196 125 -93 -156
3658 -156 -82 148 156 40 -169 -128 21 152 106 -82 -146 -99 58 161 47 -160 -159 -17 151 122 -45 -169 -108 88
3682 88 165 44 -92 -144 -9 144 161 18 -123 -84 70 163 88 -67 -157 -20 97 146 -2 -121 -116 58 135 100
3706 100 -65 -169 -78 108 189 10 -139 -169 1 152 97 -84 -172 -77 95 172 35 -118 -169 -19 139 167 3
3729 3 -137 -101 90 172 104 -101 -175 -53 123 170 30 -135 -158 45 164 129 -84 -173 -110 89 179 75 -137 -177
3753 -177 -40 167 149 -15 -171 -184 32 175 105 -110 -203 -57 147 182 21 -167 -158 21 172 158 -38 -175 -98
3776 -98 78 194 44 -136 -182 -28 142 179 10 -177 -113 68 169 98 -104 -189 -56 96 173 -11 -126 -152 18
3799 18 148 78 -69 -148 -101 81 133 64 -124 -156 -3 107 122 -14 -155 -91 48 169 62 -83 -124 -4 151
3822 151 138 3 -114 -53 27 160 85 -91 -119 -44 72 137 2 -131 -126 -17 115 81 -92 -154 -84 82 152 12
3846 12 -103 -129 24 126 105 -32 -167 -78 85 163 61 -99 -141 -44 158 122 11 -123 -101 69 165 106 -110 -154
3870 -154 -53 121 179 42 -124 -106 27 157 129 -80 -151 -97 78 150 6 -120 -166 -36 137 141 -10 -156 -114
3893 -114 55 177 91 -105 -153 -52 107 172 39 -168 -143 7 156 121 -45 -165 -97 92 173 60 -106 -160 -31
3916 -31 135 130 -12 -161 -121 73 162 76 -86 -166 -75 88 134 15 -148 -152 3 136 92 -68 -175 -95 84 161 28
3941 28 -108 -158 -4 108 136 -27 -106 -95 55 146 84 -76 -120 -22 112 121 0 -120 -105 45 130 94 -61 -143 -80
3966 -80 70 107 21 -112 -93 -10 91 59 -85 -138 -73 96 121 48 -61 -116 -4 123 100 -9 -91 -53 60 134 74
3991 74 -55 -90 -33 117 105 20 -79 -109 3 121 49 -49 -106 -43 89 126 4 -121 -109 0 111 79 -56 -134 -77
4016 -77 63 106 44 -103 -130 -15 93 124 -35 -132 -72 65 132 64 -56 -109 -18 115 105 6 -109 -109 29 132 106
4041 106 -36 -122 -60 79 136 40 -85 -144 -16 137 112 -23 -119 -95 31 148 35 -89 -144 -47 80 109 -2 -113
4065 -113 -110 -37 106 106 -22 -122 -56 73 141 63 -80 -118 -2 115 128 -15 -129 -113 34 149 69 -69 -140 -25
4089 -25 68 121 15 -114 -137 20 95 69 -54 -139 -87 47 108 35 -97 -135 -15 99 93 -32 -92 -68 39 97 28 -80
4115 -80 -87 -25 76 126 27 -79 -86 34 92 51 -28 -96 -17 90 104 34 -113 -98 -7 85 54 -52 -98 -35 60 91 1 -95
4143 -95 -78 16 54 72 -35 -113 -58 33 103 24 -75 -92 -13 97 87 -14 -108 -63 34 102 54 -45 -86 -34 85 104 9 -80
4171 -80 -71 25 92 54 -35 -90 -60 42 81 37 -59 -81 -22 82 93 -31 -118 -71 37 86 16 -71 -129 -46 80 107 15 -87
4199 -87 -96 32 101 96 -37 -107 -69 73 135 54 -54 -97 5 114 123 24 -73 -62 49 91 53 -75 -102 -23 55 89 -12
4226 -12 -85 -109 0 81 60 -54 -118 -78 51 90 28 -82 -78 11 95 83 -26 -92 -75 42 103 38 -45 -94 -24 53 91 12
4254 12 -53 -68 25 89 62 -24 -91 -38 26 87 3 -56 -85 -29 58 55 -46 -82 -56 30 85 25 -56 -92 -13 48 56 -10 -62 -72 14
4285 14 72 42 -15 -74 -38 28 74 27 -50 -55 26 80 42 -7 -42 -16 43 64 52 -37 -51 -6 65 54 -20 -68 -78 25 61 17
4315 17 -34 -96 -26 17 35 -5 -72 -61 25 64 31 -48 -67 -40 51 87 29 -38 -30 -1 90 76 -1 -58 -37 37 101 26 -32 -70 6
4346 6 94 76 -9 -87 -54 20 94 19 -60 -99 2 42 74 11 -72 -91 16 99 41 -46 -98 -45 53 92 21 -53 -89 18 80
4375 80 74 -3 -72 -28 60 110 48 -39 -51 -14 52 77 -10 -90 -69 -6 42 56 -33 -79 -65 29 50 3 -46 -93 -12 37 51 -19 -58
4406 -58 -60 29 49 39 -28 -63 -53 25 81 48 -39 -38 3 70 65 4 -37 -21 50 35 37 -42 -44 -7 74 47 7 -56 -46 1 67 41 -73
4439 -73 -80 -34 33 37 -9 -61 -62 4 23 42 -47 -41 -17 47 50 10 -54 -47 0 59 43 -18 -50 5 52 76 7 -20 -50 -7 75 80 1 -40
4473 -40 -11 47 77 36 -46 -72 7 66 60 5 -84 -75 28 66 11 -34 -83 -43 27 65 22 -31 -21 -7 80 50 -13 -71 -37 81
4503 81 60 28 -34 -17 -2 68 50 -1 -13 -30 -12 26 24 -27 -58 -16 9 36 25 -34 -88 -5 54 9 -12 -46 -63 18 55 19 -47
4534 -47 -72 -22 25 31 -13 -54 -45 -6 40 65 -12 -47 -26 9 67 62 -41 -37 -4 65 41 -9 -39 -29 13 54 45 -41 -49 -1 32 54 19
4567 19 -23 -64 22 41 47 -39 -84 -37 25 48 14 -39 -59 -8 44 52 -20 -39 -34 42 59 37 -36 -35 22 50 66 12 -43 -16 21 64
4599 64 33 -16 -47 -26 52 35 -19 -57 -30 24 76 32 -35 -57 -36 24 31 -26 -49 -47 -10 28 29 12 -36 -28 19 69 28 -38 -35 -8 48
4632 48 50 18 -19 -13 19 65 31 -20 -42 0 49 50 31 -31 -51 6 31 31 8 -56 -44 -25 46 39 -19 -64 -33 42 47 27 -56 -46 16
4665 16 40 42 -12 -50 -32 18 78 50 -39 -67 -21 41 58 31 -39 -25 38 92 28 -29 -69 -23 38 88 16 -73 -51 20 59 38 -29
4696 -29 -79 -43 21 53 -12 -51 -61 -4 42 25 -27 -58 -55 26 62 21 -40 -28 -19 44 42 -5 -26 -34 16 54 61 -14 -39 11 40 58 10
4729 10 -41 -26 -19 32 37 3 -64 -34 10 49 -2 -39 -52 -28 1 32 -27 -51 -34 -12 14 42 -22 -37 -33 8 48 21 -34 -19 -33 68
4761 68 69 11 -26 -8 23 74 51 7 -54 -13 47 42 19 -29 -14 -18 52 39 6 -28 -27 19 56 9 -54 -71 39 71 26 -58 -80 -47
4793 -47 15 57 12 -29 -93 -53 52 67 7 -58 24 7 109 149 -45 -45 -32 77 102 -16 -77 -27 44 109 64 14 -89 -105
4821 -105 36 133 33 -23 -116 -26 -23 25 -22 -90 -38 50 45 31 -38 -139 -67 44 24 -37 -53 -75 -14 -16 82 -38 -105 65
4849 65 -34 15 71 -5 -86 -12 77 96 -110 -73 -35 -25 -68 108 -46 -46 23 41 -20 -47 35 -168 -60 56 113 -84 15
4876 15 -45 24 35 -40 -32 -43 -11 -72 20 14 -59 -126 137 73 -44 -48 -2 22 243 93 131 -126 -50 -52 19 172 38 -43 -30
4905 -30 -73 150 8 216 -60 -95 -4 -22 94 -163 -200 -31 204 234 -84 -92 30 -40 50 -94 -99 -74 11 221 102
4930 102 -42 -108 -64 156 128 -154 -57 -110 125 30 -35 -40 -56 -100 186 65 29 7 -43 18 44 30 -109 -71 -171 38
4956 38 110 144 -34 -66 63 132 196 44 -110 -97 23 149 39 -72 -72 33 74 48 61 -97 -66 29 44 78 0 -7
4982 -7 -56 39 96 97 7 -27 10 29 47 -19 -108 -53 -8 61 43 -15 -69 -39 29 57 22 -47 -79 -23 47 50 38 -82 -61 15 78
5013 78 76 -22 -73 -38 79 80 24 -50 -46 17 114 67 -11 -59 -43 68 79 23 -66 -82 6 66 70 -7 -94 -40 33 65 23 -62 -92
5044 -92 -10 41 59 -11 -60 -39 56 50 36 -56 -75 -32 59 73 20 -59 -43 33 81 58 -39 -48 -23 54 87 14 -32 -60 3 103 64
5075 64 -10 -55 -44 63 63 -4 -39 -72 -4 70 41 -28 -95 -70 10 61 33 -35 -71 -50 56 62 -23 -43 -52 21 68 59 -10 -91 -22
5106 -22 51 100 12 -47 -62 1 49 88 -3 -35 -53 26 86 45 -45 -87 -23 60 79 12 -96 -54 -1 84 12 -46 -82 -74 22 79
5136 79 1 -77 -79 6 96 87 -8 -109 -78 32 121 37 -51 -84 -27 100 103 -4 -81 -51 19 116 82 -59 -91 -34 77 81 15
5165 15 -92 -81 -4 73 64 -32 -126 -54 53 84 14 -90 -111 -8 78 93 -28 -95 -62 62 104 34 -38 -82 -13 91 84 25
5193 25 -34 -51 41 92 77 -33 -77 -22 46 69 43 -41 -50 43 64 65 -30 -103 -45 30 86 4 -61 -71 -31 56 48 26 -70 -58 18
5224 18 69 29 -53 -57 -28 51 73 35 -37 -63 11 100 70 -13 -65 -18 57 89 22 -60 -69 -19 60 70 -3 -67 -52 23 99 29 -42
5255 -42 -102 -52 44 81 2 -91 -70 13 82 64 -71 -68 -51 44 86 -7 -93 -90 30 102 80 -35 -68 -42 75 92 35 -52 -87
5284 -87 -15 91 91 -8 -72 -75 47 90 38 -67 -94 -54 68 62 -3 -63 -76 15 84 76 -38 -94 -52 52 98 -3 -72 -74 13
5313 13 82 76 5 -95 -52 40 86 33 -37 -62 -2 77 67 6 -78 -64 18 68 68 -16 -81 -33 68 69 15 -65 -81 -3 59 47 -12
5344 -12 -84 -57 30 68 34 -64 -93 -23 57 53 11 -100 -54 3 94 71 -46 -74 -44 41 123 37 -33 -72 7 111 69 -15 -65
5373 -65 -62 67 88 30 -59 -70 -21 56 61 -24 -82 -65 24 90 31 -73 -74 -23 53 70 13 -99 -83 9 109 51 -30 -84 -25 70
5403 70 85 23 -81 -69 29 77 60 -2 -74 -37 62 101 37 -28 -107 -6 83 80 -26 -94 -45 42 89 16 -17 -100 -27 57 81
5432 81 -23 -101 -54 9 83 59 -42 -85 -42 42 69 26 -48 -94 3 54 91 7 -70 -18 44 78 46 -36 -61 -22 54 92 16
5461 16 -68 -85 -16 69 76 -39 -65 -63 50 54 24 -43 -108 -22 60 52 -6 -84 -51 17 81 41 -57 -78 -18 70 101 24 -64 -50 8
5492 8 76 83 -2 -47 6 76 97 22 -54 -78 21 73 55 -17 -97 -36 18 103 19 -45 -92 -14 63 53 -16 -97 -38 27 74 31 -48
5523 -48 -88 -40 49 76 -1 -57 -45 30 72 60 -36 -45 -46 65 93 29 -54 -63 7 85 68 -7 -81 -59 53 78 36 -44 -89 -15 84
5554 84 93 4 -66 -32 31 64 30 -46 -79 -47 37 49 16 -73 -48 6 71 66 -25 -61 -46 31 60 26 -45 -63 6 90 99 15 -48 -59
5586 -59 6 62 47 -38 -103 -12 34 87 32 -62 -67 6 62 64 -36 -96 -54 31 52 40 -54 -74 -14 41 50 0 -84 -46 30 95 76
5617 76 -46 -59 -36 49 90 31 -56 -26 1 93 96 -5 -41 -40 34 76 9 -69 -82 -8 54 61 -14 -120 -53 -6 81 30 -69 -94
5647 -94 -28 56 73 -11 -73 -56 17 66 55 -17 -73 -28 25 81 16 -43 -22 10 65 54 0 -50 -46 41 68 56 -28 -51 -37 62 45
5678 45 -21 -61 -55 -3 70 28 -29 -91 -20 30 47 -3 -56 -50 -9 59 52 -1 -57 -14 29 99 16 -38 -73 -26 67 71 5 -48 -43 17 77
5711 77 58 -16 -71 -41 73 73 36 -70 -66 -6 53 67 -4 -69 -60 29 87 26 -39 -83 -23 56 55 -8 -90 -45 8 75 50 -12 -81
5742 -81 -27 57 96 19 -62 -48 -15 81 46 -30 -82 -17 34 93 48 -29 -54 -17 77 69 14 -72 -43 21 68 51 -48 -52 -13 47 52 5
5774 5 -52 -37 -5 33 34 -12 -71 -77 47 36 5 -33 -71 -18 45 78 -12 -52 -39 51 70 28 -6 -45 1 65 56 19 -45 -41 16 54
5806 54 55 -40 -55 -28 10 66 27 -54 -69 -17 45 24 -2 -78 -66 10 41 28 -31 -82 -32 37 72 8 -47 -59 11 107 36 -24 -89
5837 -89 -11 25 95 28 -37 -67 -8 88 55 -26 -70 -61 47 77 29 -37 -60 -27 47 52 -16 -84 -70 21 75 47 -42 -70 -28 51 66
5868 66 -11 -55 -49 3 67 41 -2 -72 -40 36 49 45 -19 -70 15 74 68 16 -44 -77 8 59 44 -34 -86 -23 58 59 18 -62 -78 -22
5900 -22 33 48 -34 -68 -42 39 68 34 -44 -76 -10 69 53 12 -58 -60 11 68 56 -6 -35 -29 35 82 54 -53 -65 9 64 70 -6
5931 -6 -84 -53 14 74 22 -66 -64 -19 46 63 7 -72 -100 -13 54 22 -37 -78 -49 34 51 -4 -54 -73 4 72 53 -4 -34 -54 41
5962 41 89 36 -9 -69 -3 64 97 -3 -69 -40 31 86 45 -59 -57 -39 38 80 22 -76 -54 -5 72 7 -14 -75 -48 23 94 28
5992 28 -70 -78 3 56 46 -28 -78 -48 16 85 18 -32 -52 -32 69 71 26 -34 -25 14 87 66 -21 -65 -23 27 94 19 -31 -67 -13
6023 -13 76 50 -1 -82 -73 5 73 43 -23 -79 -38 38 72 16 -96 -49 -14 83 49 -18 -76 -31 37 75 54 -37 -56 -9 79 49
6053 49 9 -87 -82 30 87 63 -32 -72 -57 45 74 28 -81 -88 -11 73 71 -27 -80 -67 49 96 15 -68 -75 -13 62 85 -18 -102
6083 -102 -80 34 89 57 -19 -57 6 39 63 -13 -67 -47 24 84 75 -37 -43 -37 22 77 37 -61 -43 14 83 66 10 -55 -57 7 82
6114 82 50 -61 -69 -32 51 44 7 -60 -73 -22 61 22 -14 -54 -58 35 84 7 -70 -64 -12 72 76 -2 -20 -32 52 78 40 -45 -58 -24
6146 -24 62 79 17 -74 -87 23 63 38 -67 -117 -49 12 82 10 -81 -73 11 59 67 -19 -81 -58 37 93 22 -55 -81 -24 68 105
6176 105 -17 -68 -57 53 109 69 -30 -82 -26 59 99 11 -79 -88 -15 81 86 -19 -95 -54 47 86 36 -99 -89 -30 69 76 -2
6205 -2 -84 -57 48 111 56 -64 -94 -41 49 98 19 -67 -71 -1 78 58 -24 -76 -76 48 90 52 -86 -80 -29 105 81 10 -96
6234 -96 -45 -6 91 72 -74 -86 -40 57 69 3 -89 -95 -3 91 69 -39 -84 -45 24 83 35 -47 -108 -15 73 86 -32 -114 -76
6263 -76 26 104 79 -28 -106 -30 65 92 2 -80 -98 -19 113 75 -37 -83 -76 67 108 39 -81 -104 3 104 74 -50
6289 -50 -109 -45 37 87 33 -72 -104 -22 77 100 14 -81 -74 40 90 52 -45 -96 -26 58 114 22 -67 -81 23 103 75 -6 -88
6318 -88 -55 32 85 25 -106 -89 -24 95 99 -14 -117 -78 0 100 62 -75 -97 -43 68 83 -3 -99 -89 0 106 43 -28
6345 -28 -109 -36 50 109 52 -83 -111 0 96 104 0 -95 -79 65 113 74 -51 -109 -44 87 97 4 -99 -87 24 93 31
6372 31 -43 -104 -59 66 103 45 -101 -142 -8 100 93 -35 -113 -75 31 140 44 -80 -121 -1 94 96 33 -101 -84 51
6398 51 136 72 -37 -119 -38 83 123 40 -102 -114 -4 114 88 -35 -128 -58 33 88 20 -87 -113 -32 85 106 -16 -118
6424 -118 -74 14 130 61 -85 -125 -8 90 110 25 -106 -63 30 119 68 -18 -91 -55 83 128 36 -74 -113 -1 95 95 -25
6451 -25 -117 -81 53 95 32 -78 -111 -23 82 99 6 -109 -102 39 86 63 -42 -121 -52 72 116 11 -87 -119 13 127
6477 127 81 -41 -119 -39 87 122 46 -75 -137 -6 113 115 -19 -128 -82 38 109 70 -42 -136 -14 88 105 26 -114
6502 -114 -105 -1 109 76 -61 -118 -61 44 107 33 -82 -133 -8 90 111 -10 -108 -74 64 131 83 -79 -111 -23 121
6527 121 129 -41 -102 -95 19 117 81 -29 -129 -68 78 105 44 -86 -57 -6 112 76 -37 -154 -70 55 112 29 -79
6552 -79 -135 -25 87 69 10 -109 -80 38 115 65 -47 -121 -7 71 104 25 -85 -50 31 130 118 -37 -126 -66 42 138
6578 138 50 -84 -111 -23 117 64 -32 -125 -99 46 120 32 -60 -124 -38 84 90 13 -75 -106 21 129 66 -38 -131 -41 83
6605 83 135 31 -72 -114 19 111 111 -24 -88 -58 73 103 37 -49 -103 -29 99 114 -14 -130 -80 45 111 60 -71 -114
6631 -114 -57 80 120 6 -117 -100 14 103 80 -33 -129 -85 63 130 56 -62 -116 -5 113 131 -30 -108 -73 27
6655 27 113 80 -59 -110 -15 95 85 7 -101 -87 24 105 84 -49 -120 -34 52 102 13 -92 -120 -6 113 75 -43 -104
6681 -104 -83 51 100 30 -44 -86 -20 92 124 -8 -78 -54 29 98 78 -26 -97 -46 76 82 36 -80 -128 12 125 95
6707 95 -68 -82 -36 28 92 35 -81 -124 -24 66 77 -29 -135 -72 29 95 19 -73 -98 -38 81 81 10 -116 -77 6 98
6734 98 114 -67 -88 -58 80 125 29 -69 -86 10 92 89 -35 -96 -73 38 109 41 -60 -129 -9 67 96 -10 -110 -88 -17
6761 -17 81 38 -68 -138 -32 79 115 0 -111 -83 10 80 51 -28 -83 -55 72 125 42 -81 -95 11 77 97 -13 -76
6787 -76 -36 71 94 44 -59 -91 -21 56 77 -19 -105 -78 21 85 52 -28 -86 -53 52 91 37 -77 -98 -18 77 44 -27 -106
6815 -106 -32 50 87 44 -44 -96 4 52 81 22 -51 -63 33 88 58 -13 -104 -18 64 83 6 -57 -90 -31 63 70 -25 -79 -99 18
6845 18 104 19 -59 -95 -12 70 48 -10 -81 -79 33 108 47 -14 -70 -31 50 84 16 -72 -74 31 86 70 -7 -96 -36 66 97 37
6875 37 -55 -77 -10 66 71 -12 -65 -47 51 74 44 -43 -72 -11 72 48 -3 -88 -96 18 53 37 -44 -89 -50 42 67 29 -51 -45 9
6906 9 87 61 -2 -58 -23 61 77 22 -12 -41 -24 76 36 8 -66 -85 15 67 17 -51 -69 -36 37 59 13 -91 -63 -25 44
6935 44 58 -41 -69 -38 26 61 29 -40 -69 -30 73 60 18 -58 -45 18 83 87 -21 -59 -49 48 84 28 -66 -77 8 72 52 -17
6965 -17 -79 -33 36 63 39 -52 -74 -9 60 64 -12 -79 -77 3 66 13 -41 -82 -23 48 66 9 -67 -29 -5 73 40 -1 -52 -16 36
6996 36 56 36 -43 -37 41 36 67 -24 -42 -36 49 70 10 -18 -60 -12 57 39 20 -46 -53 1 52 17 -48 -62 -12 15 52 -16 -46 -45 -5
7029 -5 39 26 8 -74 -9 49 67 12 -10 -37 -11 50 75 -11 -38 -22 19 57 66 -7 -32 -7 12 54 -1 -55 -56 -54 44 27 -36 -61
7061 -61 -46 9 48 0 -38 -34 -29 39 42 -7 -55 -69 27 54 23 -12 -63 0 27 46 5 -53 -59 15 85 45 -25 -58 -17 47 51 36 -32
7094 -32 -27 -14 58 64 1 -48 -65 14 41 35 -52 -33 -18 21 39 -6 -23 -28 5 62 40 -25 -51 -5 29 46 37 -45 -22 21 58 34 5
7127 5 -40 -24 42 64 16 -38 -21 -9 43 26 8 -5 -13 11 48 36 -35 -40 -36 14 31 -20 -39 -62 -26 7 49 12 -55 -34 30 41
7159 41 25 -26 -45 -30 20 48 17 -36 -32 26 67 47 -21 -26 -17 -5 12 46 23 -27 -21 80 -86 -38 -144 -23 90 44 -19 -29
7189 -29 -45 40 -1 91 -30 -23 3 73 150 -56 117 -69 -99 46 63 -59 -67 59 -111 57 80 -62 -24 73 26 246
7215 246 60 45 -106 -38 66 11 22 -263 -3 32 112 -163 1 -33 -43 85 -45 68 -13 -39 100 -59 123
7238 123 -55 92 -7 -101 207 39 -59 -123 -28 -33 114 -10 -13 -53 54 97 -46 -12 -97 40 -40 0 83 -73 -74 117
7264 117 51 5 -61 -64 -25 -79 180 -19 81 -72 -12 90 40 97 -165 -98 -110 59 74 -62 -28 -78 36 79 60 -37
7290 -37 -96 25 63 109 -55 -85 -45 -17 79 89 40 -34 -1 37 10 0 -65 -11 34 12 94 -43 -88 -39 -17 -10 -73 -1 -101
7319 -101 10 7 24 21 -117 -23 24 68 49 -110 18 -50 115 23 -4 -108 -29 -4 124 7 -66 -23 -43 15 -4 -5 -26
7346 -26 -11 93 61 71 49 13 66 -42 41 -54 -48 -122 8 66 -23 -13 -18 -1 64 79 -2 -9 -46 0 -1 -17 -40 -64 -60 -29 98
7377 98 40 -15 44 -55 63 25 62 -25 -12 39 56 92 26 -19 -27 32 4 7 -37 -25 -68 17 26 -19 -45 -39 4 44 53 -26 -52 23
7409 23 -2 -7 -4 0 -45 -17 36 96 -27 -86 -25 66 55 17 -78 -19 31 67 45 -22 -36 -35 17 38 20 36 -23 -44 24 39 -12 -51
7441 -51 -54 -46 17 45 -27 -57 -52 20 37 -33 -53 -26 -13 48 14 -28 -43 -33 -2 57 14 -26 -45 -1 32 28 14 -34 22 31 55 25 -28
7474 -28 -38 5 29 43 18 -26 -28 14 39 33 -31 -63 -22 -2 28 7 -49 -51 -5 20 50 -16 -40 -46 2 38 19 5 -41 -23 51 27
7506 27 16 -40 -55 5 58 66 -4 -43 -9 42 29 12 -31 -30 18 58 32 2 -36 -29 6 22 -11 -37 -42 -10 12 21 -3 -50 -67 -12 42
7539 42 6 -57 -74 -19 29 44 7 -47 -11 18 46 48 -5 -65 -36 43 55 31 -27 -47 16 46 19 -11 -52 -28 21 57 15 -54 -43
7570 -43 -14 12 39 -5 -42 -32 -12 38 27 -41 -43 -11 54 28 3 -55 -48 6 51 30 -13 -43 -31 34 37 14 -5 -37 3 46 31 25
7602 25 -44 -41 31 54 22 -18 -29 -11 23 36 -8 -30 -47 -9 1 36 -26 -55 -32 1 38 5 -55 -41 9 19 40 -19 -42 -18 31
7633 31 39 20 -27 -34 4 28 39 3 -32 -24 26 39 42 3 -36 -21 51 41 19 -26 -9 -3 43 59 -41 -59 -14 25 31 -2 -57 -41 -9
7666 -9 29 25 -5 -73 -22 35 40 21 -48 -28 14 37 21 -4 -40 -24 29 38 21 -26 -48 -23 22 35 12 -52 -67 8 34 19 -5 -36
7698 -36 -28 6 48 5 -47 -54 -1 32 45 -20 -48 -49 2 21 2 -44 -66 0 33 61 -5 -37 -8 17 53 61 -7 -38 -17 32 43 49 -42
7731 -42 -26 14 36 44 7 -49 -55 25 62 -11 -46 -50 -18 38 19 11 -69 -45 17 49 -2 -40 -67 -14 36 38 12 -46 -67 -2 17 31 -22
7764 -22 -41 -10 42 59 -4 -38 -34 12 42 39 13 -63 -31 28 46 3 -60 -36 -28 39 38 -4 -59 -45 2 42 15 -39 -53 -29 17 56
7796 56 22 -40 -60 -35 42 19 -4 -51 -33 47 34 13 -24 -49 9 20 24 -1 -45 -21 23 50 23 -18 -44 -20 30 36 -1 -27 -13
7827 -13 1 48 1 -36 -56 -26 33 29 11 -66 -48 -3 38 16 -34 -65 -26 61 60 32 -43 -54 28 63 39 -10 -14 -26 30 77 5 -16
7859 -16 -23 14 62 56 9 -26 -31 -7 39 18 -30 -61 -33 30 61 19 -34 -59 -15 44 23 -36 -59 -21 27 36 25 -38 -33 15 37 44 -11
7892 -11 -29 -13 32 63 15 -18 -21 -15 51 70 7 -14 -41 33 39 46 -39 -66 -5 44 52 8 -43 -54 13 30 16 -18 -42 -29 4 52 29
7925 29 -61 -74 -19 41 50 -14 -44 -24 5 38 52 -36 -53 8 38 71 23 -39 -32 43 63 29 -8 -49 -40 15 43 8 -33 -44 -7 41
7957 41 35 -1 -56 -51 15 43 -3 -31 -35 -7 27 42 11 -56 -8 11 53 22 -9 -51 -19 33 35 22 -3 -5 1 46 69 -25 -64 -18 43
7990 43 58 39 -46 -26 8 53 31 -41 -43 -40 11 52 12 -24 -47 -4 9 50 -36 -60 -60 32 63 9 -35 -26 -24 40 52 18 -57 -54 33
8023 33 57 42 -14 -55 -9 48 38 15 -24 -25 -7 34 33 0 -24 -41 33 38 19 -14 -34 -52 28 18 -3 -34 -46 -1 23 9 -52 -43
8055 -43 -8 20 28 -19 -17 -32 6 31 26 1 -19 -14 17 71 23 0 -39 -20 30 46 15 -41 -36 6 32 22 -23 -59 -22 28 42 13 -46
8088 -46 -32 6 33 19 -9 -67 -23 16 2 17 -53 -54 1 24 33 -1 -39 -20 37 60 31 -2 -34 -4 40 20 -23 -14 -23 29 37 48 -8
8121 -8 -22 4 7 37 -12 -31 -38 -7 19 14 -27 -52 0 40 40 7 -54 -32 0 14 15 5 -61 -30 -6 21 22 -28 -8 18 39 43 -14 -43
8155 -43 -10 22 42 20 5 -36 23 30 18 -19 -41 -36 0 20 45 -25 -24 -3 28 35 -12 -24 -35 1 19 4 -17 -22 -32 -9 -7 18 -30
8188 -30 -18 4 54
8191E4
##END NTUPLES=NMR FID
##END=
