##TITLE=1H_AM_NV73.2
 CDCl3
 8 sc, 
 18.10.2022
##JCAMPDX= 6.0         $$ Bruker NMR JCAMP-DX V2.0
##DATA TYPE= NMR FID
##DATA CLASS= NTUPLES
##ORIGIN= UXNMR, Bruker Analytische Messtechnik GmbH
##OWNER= root
$$ XWIN-NMR		Version 3.5
$$ Tue Oct 18 16:34:15 2022 Russian Standard Time (UT+4h)  she@DPX200
##.OBSERVE FREQUENCY= 200.1313499994
##.OBSERVE NUCLEUS= ^1H
##.DELAY= (6, 6)
##.ACQUISITION MODE= SIMULTANEOUS
##.ACQUISITION SCHEME= undefined
##.AVERAGES= 8
##.DIGITISER RES= 18
##SPECTROMETER/DATA SYSTEM= spect
##.PULSE SEQUENCE= zg30
##.SOLVENT NAME= CDCl3
##.SHIFT REFERENCE= (INTERNAL, CDCl3, 0, 15.7039)
##AUDIT TRAIL= $$ (NUMBER, WHEN, WHO, WHERE, WHAT)
$$ ##TITLE= Audit trail, XWIN-NMR		Version 3.5
$$ ##JCAMPDX= 5.01
$$ ##ORIGIN= Bruker BioSpin GmbH
$$ ##OWNER= she
$$ F:/spectra/data/she/nmr/H-F/1/audita.txt
$$ ##AUDIT TRAIL=  $$ (NUMBER, WHEN, WHO, WHERE, WHAT)
(   1,<2022-10-18 16:33:17.00 +0400>,<she>,<DPX200>,
      <created by zg, POWCHK disabled, PULCHK disabled
       configuration hash MD5:
       00 E9 B6 7A A2 85 ED C7 34 08 36 98 17 FE 4E 26
       data hash MD5: 16K
       6A 53 2D 0E 61 EA 8D 77 D2 4C 7F 16 8F D5 B2 A5>)
$$ ##END=
$$ 
$$ hash MD5
$$ ED 8D 13 04 31 63 F3 70 E6 7F 8F 22 A5 65 4E D7
##$RELAX= 
##$RELAX= 
##$RELAX= 
##$RELAX= 
##$RELAX= 
##$RELAX= 
$$ Bruker specific parameters
$$ --------------------------
##$DU= <F:/spectra>
##$EXPNO= 1
##$NAME= <H-F>
##$PROCNO= 1
##$TYPE= <nmr>
##$USER= <she>
##$AMP= (0..31)
100 100 100 100 100 100 100 100 100 100 100 100 100 100 100 100 100 100 
100 100 100 100 100 100 100 100 100 100 100 100 100 100 
##$AQSEQ= 0
##$AQ_mod= 1
##$AUNM= <au_zg>
##$AUTOPOS= <>
##$BF1= 200.13
##$BF2= 200.13
##$BF3= 200.13
##$BF4= 200.13
##$BF5= 200.13
##$BF6= 200.13
##$BF7= 200.13
##$BF8= 200.13
##$BYTORDA= 1
##$CFDGTYP= 0
##$CFRGTYP= 5
##$CHEMSTR= <none>
##$CNST= (0..31)
1 1 145 1 1 1 1 1 1 1 1 1 1 1 1 1 1 1 1 1 1 1 1 1 1 1 1 1 1 1 1 1 
##$CPDPRG= <>
##$CPDPRG1= <>
##$CPDPRG2= <>
##$CPDPRG3= <>
##$CPDPRG4= <mlev>
##$CPDPRG5= <mlev>
##$CPDPRG6= <mlev>
##$CPDPRG7= <mlev>
##$CPDPRG8= <mlev>
##$CPDPRGB= <>
##$CPDPRGT= <>
##$D= (0..31)
0 1.2 0 0 0 0 0 0 0 0.06 0 0.03 0 0 0 0 0.0002 0 0 0 0 0 0 0 0 0 0 0 0 
0 0 0 
##$DATE= 1666096396
##$DBL= (0..7)
120 120 120 120 120 120 120 120 
##$DBP= (0..7)
150 150 150 150 150 150 150 150 
##$DBP07= 0
##$DBPNAM0= <>
##$DBPNAM1= <>
##$DBPNAM2= <>
##$DBPNAM3= <>
##$DBPNAM4= <>
##$DBPNAM5= <>
##$DBPNAM6= <>
##$DBPNAM7= <>
##$DBPOAL= (0..7)
0.5 0.5 0.5 0.5 0.5 0.5 0.5 0.5 
##$DBPOFFS= (0..7)
0 0 0 0 0 0 0 0 
##$DE= 6
##$DECBNUC= <off>
##$DECIM= 32
##$DECNUC= <off>
##$DECSTAT= 4
##$DIGMOD= 1
##$DIGTYP= 9
##$DL= (0..7)
0 120 120 120 120 120 120 120 
##$DP= (0..7)
150 150 150 150 150 150 150 150 
##$DP07= 0
##$DPNAME0= <>
##$DPNAME1= <>
##$DPNAME2= <>
##$DPNAME3= <>
##$DPNAME4= <>
##$DPNAME5= <>
##$DPNAME6= <>
##$DPNAME7= <>
##$DPOAL= (0..7)
0.5 0.5 0.5 0.5 0.5 0.5 0.5 0.5 
##$DPOFFS= (0..7)
0 0 0 0 0 0 0 0 
##$DQDMODE= 0
##$DR= 18
##$DS= 0
##$DSLIST= <SSSSSSSSSSSSSSS>
$$ [...]
##$SUBNAM2= <"">
##$SUBNAM3= <"">
##$SUBNAM4= <"">
##$SUBNAM5= <"">
##$SUBNAM6= <"">
##$SUBNAM7= <"">
##$SUBNAM8= <"">
##$SUBNAM9= <"">
##$SW= 18.0517283424941
##$SWIBOX= (0..15)
0 0 2 0 0 0 0 0 0 0 0 0 0 0 0 0 
##$SW_h= 3612.71676300578
##$TD= 16384
##$TD0= 1
##$TE= 0
##$TE2= 300
##$TE3= 300
##$TEG= 300
##$TL= (0..7)
0 120 120 120 120 120 120 120 
##$TP= (0..7)
150 150 150 150 150 150 150 150 
##$TP07= 0
##$TPNAME0= <>
##$TPNAME1= <>
##$TPNAME2= <>
##$TPNAME3= <>
##$TPNAME4= <>
##$TPNAME5= <>
##$TPNAME6= <>
##$TPNAME7= <>
##$TPOAL= (0..7)
0.5 0.5 0.5 0.5 0.5 0.5 0.5 0.5 
##$TPOFFS= (0..7)
0 0 0 0 0 0 0 0 
##$TUNHIN= 0
##$TUNHOUT= 0
##$TUNXOUT= 0
##$USERA1= <user>
##$USERA2= <user>
##$USERA3= <user>
##$USERA4= <user>
##$USERA5= <user>
##$V9= 5
##$VALIST= <valist>
##$VCLIST= <CCCCCCCCCCCCCCC>
##$VD= 0
##$VDLIST= <DDDDDDDDDDDDDDD>
##$VPLIST= <PPPPPPPPPPPPPPP>
##$VTLIST= <TTTTTTTTTTTTTTT>
##$WBST= 1024
##$WBSW= 4
##$XGAIN= (0..3)
0 0 0 0 
##$XL= 0
##$YL= 0
##$YMAX_a= 37174
##$YMIN_a= -50342
##$ZGOPTNS= <>
##$ZL1= 120
##$ZL2= 120
##$ZL3= 120
##$ZL4= 120
##$ABSF1= 10
##$ABSF2= 0
##$ABSG= 5
##$ABSL= 3
##$ALPHA= 0
##$AQORDER= 0
##$ASSFAC= 0
##$ASSFACI= 0
##$ASSFACX= 0
##$ASSWID= 0
##$AUNMP= <proc_1d>
##$AZFE= 0.1
##$AZFW= 0.1
##$BCFW= 1
##$BC_mod= 2
##$BYTORDP= 1
##$COROFFS= 0
##$CY= 11.3945322036743
##$DATMOD= 1
##$DC= 2
##$DFILT= <>
##$DTYPP= 0
##$F1P= 2.36226072786647
##$F2P= -0.459571619588291
##$FCOR= 0.5
##$FTSIZE= 0
##$FT_mod= 4
##$GAMMA= 1
##$GB= 0.15
##$INTBC= 1
##$INTSCL= 1
##$ISEN= 128
##$LB= 0.24
##$LEV0= 0
##$LPBIN= 0
##$MAXI= 10000
##$MC2= 0
##$MEAN= 0
##$ME_mod= 0
##$MI= 1.114404
##$NCOEF= 0
##$NC_proc= 0
##$NLEV= 6
##$NOISF1= 3.799351
##$NOISF2= 2.8
##$NSP= 1
##$NTH_PI= 0
##$NZP= 0
##$OFFSET= 15.70392
##$PC= 1
##$PHC0= -18113.36
##$PHC1= 10.2007
##$PH_mod= 1
##$PKNL= yes
##$PPARMOD= 0
##$PSCAL= 0
##$PSIGN= 0
##$REVERSE= no
##$SF= 200.130013532006
##$SI= 16384
##$SIGF1= 3
##$SIGF2= 2
##$SINO= 400
##$SIOLD= 16384
##$SREGLST= <1H.CDCl3>
##$SSB= 0
##$STSI= 0
##$STSR= 0
##$SW_p= 3612.71676300578
##$SYMM= 0
##$S_DEV= 0
##$TDeff= 0
##$TDoff= 0
##$TI= <>
##$TILT= no
##$TM1= 0
##$TM2= 0
##$TOPLEV= 0
##$USERP1= <user>
##$USERP2= <user>
##$USERP3= <user>
##$USERP4= <user>
##$USERP5= <user>
##$WDW= 1
##$XDIM= 8192
##$YMAX_p= 0
##$YMIN_p= 0
$$ End of Bruker specific parameters
$$ ---------------------------------
##NTUPLES= NMR FID
##VAR_NAME=  TIME,          FID/REAL,        FID/IMAG
##SYMBOL=    X,             R,               I
##VAR_TYPE=  INDEPENDENT,   DEPENDENT,       DEPENDENT
##VAR_FORM=  AFFN,          ASDF,            ASDF
##VAR_DIM=   8192,          8192,            8192
##UNITS=     SECONDS,       ARBITRARY UNITS, ARBITRARY UNITS
##FACTOR=    0.0002768,     1,               1
##FIRST=     0,             0,               0
##LAST=      2.2672688,     0,               0
##MIN=       0,             -50342,          0
##MAX=       2.2672688,     37174,           0
$$ Real data points
##PAGE= N=1
##DATA TABLE= (X++(R..R)), XYDATA
0@%%%%%%%%%%%%%%%%%%%%%%%%%nJ3j6J6j6J6j6J6j6K4l2L2l2L6m4M8n0N8o4O9
45C7p7Q5r3J03j15J25j37J51j67J86k07K30k57K90l29L76m35N11o14P60r79J344
67G88k055L895j6645l6325M8882J3965j5562J9285n303k6406J1387O439j1233
80h888J0631J2502j0810j1840J811Q051j507l627J0749P181j3224j4462j085J2299
94b219J4281j58r331o975l627N125M220l786O155N308j3681m179J0135j601N3
109b80R306l160j0215l779J668Q108O542j237n042r338k19J2667j665q602P751
124B505J510q105N280J125q325M946N148l282K171m964r441J0062J1148m841k875
139B062l677p944P381J0908o854n401N405j886l228N923r20o633M958M591o012
$$ plain form
0 0 0 0 0 0 0 0 0 0 0 0 0 0 0 0 0 0 0 0 0 0 0 0 0 0 0 -5 8 -8 8 -8 8 -8 8 -8 16 -16 16 -16 20 -24 24 -26 32 -32 37
45 37 -40 45 -48 55 -60 65 -72 79 -88 98 -109 121 -136 154 -175 201 -234 277 -337 423 -556 788
67 788 -1267 2628 -14017 -50342 -1460 12505 -3057 16228 10925 -15481 -4094 2345 -8888
80 -8888 1743 14245 3435 -8405 -6594 1457 -50 -3677 7072 14253 1029 -13433 -14518 -2219
94 -2219 12062 11904 2573 -4402 -8029 -2904 1316 -2470 3685 8993 -4688 -8867 1268 -333 -280
109 -280 9026 5866 -4349 -8128 -6460 1648 8190 6953 1911 -7427 -7646 5021 3356 -5246 2505
124 2505 4015 -4090 1190 2315 -6010 -1064 4084 802 2973 -1991 -11432 -1370 9778 4937 2062
139 2062 -1615 -9559 -2178 8730 1876 -3525 1880 -6 -3234 2689 1769 -4864 94 4685 -1327
154a327l17K445n183L529R144o685p890M769Q19j085N763j147n836K921K555k842
170c67m31k07J22L526Q6m157j863P42L532L939k401n760j349L007M288R83l723
187c3j925J278N7J066J329l231j507M517J909k815j869j127R03M668Q96n220k802
204c906J390K353L472j69n232q74L589m18n97J945j793j421L558j34l917N34J903
221B83M93J647j751m334J777M114k35o76j196l333J386M537j398l412R84J281
237A67L23J203j379l055J123L524R74j731l086j354L208L555j084l195j684K18
253b273K594K826j374l824l15K882J331j178j672r24Q95K338N69k228j726R36
269a143K268J247j462k522N4K070Q75l58q65j542K35K485R4k749m82K151J003
$$ plain form
154 -1327 -1644 801 -4382 -853 8291 1606 -6284 -1515 -696 -1781 3982 2835 -3001 -80 2475 -367
170 -367 -798 -1005 -883 2643 2729 -1428 -3291 -2549 983 4922 2521 -3239 -4588 -1581 2707 3690 -33
187 -33 -1958 -680 -623 443 1772 -1459 -2966 1551 3460 645 -1224 -2351 -1448 3220 4116 -1104 -3906
204 -3906 -2516 -163 3309 3140 -2092 -2966 623 205 -392 1553 -240 -1661 1897 1763 -2154 -1620 283
221 283 776 2423 672 -3662 -1885 2229 1994 1318 122 -3211 -1825 2712 1314 -2098 -1114 167
237 167 490 1693 314 -2741 -1618 1906 2880 1149 -1937 -3291 -83 3472 2388 -807 -2491 -2273
253 -2273 321 3147 1773 -2051 -2366 516 1847 669 -1003 -1927 -1032 1306 1875 -353 -2079 -1143
269 -1143 1125 2372 910 -1612 -1558 512 1387 1029 164 -1378 -1143 1342 1436 -1313 -1795 356 1359
286A359n21j136j375M43K276P49j668j866k91K023K420q21k778m73J565J348O04
303A858j331k643K61L292J185k365k301P2J933J891k46k200j624Q20K499J349
319B450j798k719J13K403J168q74j364o90Q75J903K57k117j317J347J676j97j385
336b69q92K92J072Q51m60j467o32J377J655n75j942l98J588J191n79j405r26N91
354i28K053R53j913k171P34K332Q14j170j677p38J030J918M86j876j953O82K462
371A038R58j609j848KJ671J545l01j983j379R64K257N56k039j600R16J468L97
388A013k68j151j113J177J782p81j664n0Q74R59J59j381p94J130R21N8k80j414
406h23n69K176J097j921j073N11L20J066O01k001j339J663J646n4j317j855L18
$$ plain form
286 1359 838 -298 -1673 -1230 1046 1795 127 -1739 -2030 -7 2413 1592 -1186 -1659 -94 1254 1858
303 1858 527 -2116 -1855 1437 2622 257 -2044 -1972 -39 1852 1606 -594 -2218 -1398 1101 2450
319 2450 652 -2067 -1954 449 1617 743 -621 -1311 -436 1467 1724 -393 -1710 -363 1313 1116 -269
336 -269 -1161 -869 203 1054 594 -873 -1505 -128 1527 952 -990 -1388 200 1391 812 -593 -1519 -928
354 -928 1125 2078 165 -2006 -1272 1060 1874 704 -973 -1711 -681 1237 1723 -153 -2106 -1424 1038
371 1038 1996 387 -1461 -1459 212 1757 1456 -527 -1906 -942 1315 1871 -168 -1768 -852 616 1013
388 1013 745 -406 -1519 -342 1440 659 -1005 -1055 -181 778 937 -444 -1238 -108 813 871 591 -823
406 -823 -1392 784 1881 -40 -1113 -602 -282 784 1385 -616 -1955 -292 1354 1300 -17 -1872 -1554
423a554K685P20j798j173k51P68K205M03k548j280J352J406M44o61j588n63J343
440i0J401k50j665j091J132J775o8j452r30N09J351L92q85p80k72O38J436k88
458H63j852K55J479l10l38K98j011j13J901j16j948j92Q91P15O02j123j572Q34
476g37J395K37n9j304j506J716K140j047j448l99j30J734J662j931k060Q47J161
493B71Q99M41k224j754K109J805q24p15p04q94J476J910q82j829l09R45J316J19
511A156j409p99M68Q27Q30m76j639MJ588L83p70n88j74N35N75k37m06m14n5J256
531F55M06j794l87J636J59m46K69j129o46K079P79j861o10M31O1J168N30j940
549f40r12J514Q96k33m87j032l29J553J258j002j863p1J728Q78o14n99q50m83
$$ plain form
423 -1554 1131 1851 53 -1120 -1371 -603 1602 2005 -543 -1823 -471 935 1379 718 -870 -1433 -90
440 -90 1311 1061 -604 -1695 -563 1212 1144 -308 -1238 -729 622 1014 129 -651 -923 -285 1151 863
458 863 -989 -734 745 435 97 395 -616 -729 1172 1056 -892 -1084 -193 522 1124 1 -1571 -737
476 -737 658 895 836 -468 -1974 -258 1882 835 -613 -1012 -1142 592 2254 323 -1737 -890 271
493 271 1170 1611 -613 -2367 -258 1547 723 8 -696 -1590 -114 1796 914 -915 -1224 -279 1037 1156
511 1156 -253 -1052 -584 243 1073 597 -1042 -1038 550 933 163 -425 -599 -64 511 274 -132 -546 -601 655
531 655 1061 -733 -1120 516 675 229 498 -631 -1277 802 1581 -280 -890 -459 -398 770 1300 -640
549 -640 -1552 -38 858 625 138 -894 -1223 330 1588 586 -1277 -1348 380 1258 644 45 -805 -1288
567a288J875J490j899j602R50N55K01P34j099j488J301J384o86o90m31j01J448
584F54O68j639p97P80M30O43L20j511q78J308R82k95o17p29R8J097J95q20m55
603e66K1O33Q83o44j456K47J330M54l63q20q23M56J381M08r24j045qR99P71m02
623E32q92k57O23N86k10o05l72K32R51L82j331r36J062Q89j59n0p18j043J092
642b24J558p99j143J91J21M39P37q87r70R60P11m16j35o08o03J445J171j421j159
661a032M25L56P19Q42j152j531O79J291K11l33q60o13R38J012n84q35q7K37P74
680D57N48j119j176Q36J261j11n63m99n59N57J333j29j241k91M88M39M02l32r12
699f11K31Q99j31m68j37l14M52J058n67j420L33R85P2O4k76j074J89J419P6r09
$$ plain form
567 -1288 587 2077 178 -1424 -474 81 282 1016 -83 -1571 -270 1114 428 -262 -693 -794 654
584 654 1322 -317 -1114 -334 96 739 1059 -452 -1330 -22 960 665 48 -681 -583 514 709 -111 -566
603 -566 -545 88 971 327 -1129 -882 448 902 539 -281 -1104 -648 733 1141 217 -828 -836 163 934 532
623 532 -360 -617 6 592 382 -223 -595 -363 588 970 -361 -1297 -235 654 495 445 -273 -1316 -224
642 -224 1334 535 -608 -417 -296 143 880 -7 -977 -17 694 278 143 -465 -1068 377 1548 127 -1032
661 -1032 -607 -251 468 1310 158 -1373 -694 597 808 475 -385 -998 -60 952 368 -467 -554 -317 457
680 457 1005 -114 -1290 -454 807 696 133 -366 -925 -368 965 836 -405 -696 -208 231 633 301 -611
699 -611 -380 519 388 -80 -217 -531 -79 979 412 -1008 -675 310 382 446 170 -904 -715 704 780 -129
719a29k95l3M19Q63l57j148J39P90K17P5n23j003M37J415m9j039l87K9M68R06
739G95j44j200k96P55N60Q6n34p53L21J005j4p18k11K6L32P20j82j180j21J033
759B80L67m04l51m15K1Q69L87q19o48L04O47L58l54q18p1Q06M81k68n78n22L30
780c98J068J93r90o05L27O12M95k26r47l00P65O18j43n71n75K18R56K00q02m41
800e46K32L61M39pq20m25P60O47l53n19j63J62M77K39m48n21J60N80K56m15n74
821d78Q0O04L04l05m94k04L79O42M0p41n19M33O94J49n15o20QO80M89k83p19l22
843f98N07P83L3q10n18L77O47K60l27o57k55O65O87k53p43k55L83N49J27m86n04
864d88R5N51L23k85n94j03N68M05k72m62j20K83M11Q1m50m24K56N99J09n21l95
$$ plain form
719 -129 -424 -457 -38 825 468 -680 -541 249 466 541 18 -985 -548 867 818 -221 -608 -579 -111 795
739 795 651 -549 -845 -90 470 556 22 -731 -410 595 581 -137 -348 -322 10 730 548 -632 -753 280
759 280 647 243 -108 -523 -502 367 754 -65 -713 -409 238 596 242 -576 -647 159 640 372 -206 -728 -398
780 -398 670 863 -127 -732 -405 207 702 476 -471 -771 -6 612 469 -102 -677 -459 497 697 -105 -546
800 -546 -314 47 486 479 -341 -766 -6 641 288 -231 -394 -232 245 484 36 -485 -325 255 511 96 -478
821 -478 -398 206 510 205 -289 -493 -114 528 568 -173 -692 -259 435 584 69 -551 -543 137 626 343 -376 -698
843 -698 -191 592 625 -185 -703 -326 321 581 254 -403 -658 7 694 441 -302 -557 -174 375 502 16 -488
864 -488 -393 158 481 196 -398 -501 67 472 200 -262 -382 -99 312 393 -57 -481 -225 374 483 -38 -433
885d33J61M85K55k61n35j88N14N45j76o38l27L69O44J15n91m78J37N26M24k02
905C46p45k58O70N71k06m99l63J49O59K87n08n47J9M90M84j91p04j56N00L33l5
926B96k82m62N6O91J81n56l26J60L20K79j44n40j01M94L07j23l73l20K35O18M2
947D52n63l15K32L77K10j66n43j78N58M81l10n29q9K67L97J67m77n17K79N38J03
968C74j97m58k81N72N66l82m66J3M6L34M36n13o55M49N27j66j09k35l29N06N82
989F14m93n04J48J07L54L39o52o12N76M95j47p8l44l85O03O22n14m94J33J40L38
1010B46K68n88n22M56M92k8j56m10l34N68O45l68n65j9J52K54L24k68o15J46O00
1031B78k0l13n5r1J01M67j12o27Q1M67qJ2l3n48O2P86p5n89J14N2j09M96mq04
$$ plain form
885 -433 -272 213 468 207 -328 -516 -2 543 367 -271 -598 -229 415 530 -61 -539 -402 124 548 346
905 346 -399 -657 13 584 378 -121 -484 -335 324 611 103 -444 -425 65 549 358 -346 -502 -2 331 296
926 296 14 -448 -392 299 480 -76 -402 -242 78 357 213 -327 -428 66 373 250 -123 -443 -208 410 452
947 452 -111 -426 -194 183 393 227 -316 -494 64 545 235 -294 -383 -116 281 448 -29 -546 -267 271 374
968 374 177 -281 -562 10 576 194 -272 -259 -213 121 557 44 -611 -162 365 199 90 -145 -474 32 614
989 614 121 -383 -235 -128 226 565 -87 -699 -123 372 225 147 -197 -582 21 643 129 -365 -232 -92 246
1010 246 514 -74 -596 -140 352 324 168 -242 -576 -8 637 269 -296 -315 -163 91 415 147 -468 -322 278
1031 278 258 -55 -110 -201 -100 367 255 -372 -291 176 168 180 147 -401 -339 447 372 -217 -103 -51 -160 336 332 -472
1055d72J36O82j49k06j5m15J75Q56k25p12L5R7J62O49k20r59J46O49j8N5n2o97
1077d98J17Q79j17n60J6k1J03N62j49q00O5N49R0Kj59n27N3P21Q3m70j46N1N6
1100a00K85O7m38j27M31J43k75j16k2J1M12J31n91k51M19K06J4N8m70l45O63M07
1122E12n16j73R1j70L87L90o62m09N96K15j25P0m37l58P43M37n23k23k9j86N42
1143A72M51o56m06L99P9J9K62l83l97N25K91m12r3Q0r2K74K35m40k81L20K21l0
1165A38n8k01j16K78K40j83k82L8K37J28j04k53j50K27M02m5m37k18J47L55K81
1186D24k58n32k1M03K59K7l24m34J94N93Ll76j84n0K60M60j74n85l1L44K26J36
1208C60k66n05J23M88Q4j24k15k78J91M38j19l18M0L9N5J88j52l18K19K80j32
$$ plain form
1055 -472 -336 346 197 -9 -24 -439 -264 592 367 -345 -310 -213 -51 598 378 -581 -435 214 196 251 199 -498
1077 -498 -381 498 381 -179 -163 -184 -81 481 332 -468 -403 146 236 238 79 -448 -395 326 409 -61 -207 -156 -100
1100 -100 185 252 -186 -313 118 261 -14 -130 -152 -141 271 402 -189 -440 -21 185 199 257 -213 -558 105 512
1122 512 -4 -177 -86 -256 131 521 -141 -550 46 261 136 206 -231 -589 154 591 68 -155 -184 -370 172
1143 172 623 -33 -439 -40 39 58 320 -63 -460 65 356 -56 -149 -69 -161 113 348 -92 -373 -53 168 138
1165 138 80 -121 -237 41 281 98 -184 -146 91 219 115 -138 -288 -61 341 296 -141 -359 -212 143 424
1186 424 166 -366 -387 16 275 302 -22 -456 -262 331 334 -42 -226 -276 -16 444 270 -315 -346 -2 224 360
1208 360 94 -411 -288 200 284 160 -55 -333 -142 296 177 -141 -101 -62 -7 181 29 -289 -70 210 78
1229G8j47k2p3J73K45j65k88M7K16R0o7j76o6J53K10l4k84j67K25L11j0k89k52
1252b92K6L55K99k10m12j19K65L28P0l14l01R5L15J91j48l60p9L50K38j44k48
1273i5j62J09L76J08l53k99J27K67J65o3l16j54K19K71j8k30j44J09J95K6j40
1294bj45J5K40J33k24k43R0K23J15m1k56j69K15K58l6k10j42L7K47J07k10j95
1316a93M9J87J47j01k74o9K57K01l9k08k26R8L37J03k29k17rJ83K32n7k74r6J67
1339c1K00Ok13j64J21K09M7j45k12k2K71J68j79k06l4J29K06K6k60j45J58J83
1361A13N6j34k39M1K79Q1j53j57r8J92K80q7k89q8J22J96J32k17k94J08K40O2
1383A46k9k01j86K30K79j20k06n9jK29J67k50k14J14J37J18jk73j04K69J24r6
$$ plain form
1229 78 -69 -91 -164 9 254 89 -199 -152 64 154 87 -89 -155 -2 208 174 -110 -277 -52 259 249 -40 -292
1252 -292 -266 89 388 178 -234 -353 -88 240 310 -4 -305 -210 105 296 148 -212 -291 59 297 153 -95
1273 -95 -257 -148 228 336 -17 -316 -189 78 243 180 -136 -290 -71 200 182 -48 -192 -83 112 138 -2
1294 -2 -147 -132 108 241 17 -226 -136 87 202 161 -95 -264 -49 209 173 -37 -179 -142 105 212 2 -193
1316 -193 -144 43 190 89 -185 -254 3 204 165 -43 -269 -171 166 269 40 -177 -186 -3 229 172 -102 -198 -31
1339 -31 169 175 -38 -202 -81 128 175 30 -182 -204 67 235 56 -150 -184 -55 151 177 -83 -228 -70 113
1361 113 169 35 -204 -163 116 197 44 -113 -211 -19 261 174 -115 -203 -81 115 247 30 -264 -156 84 146
1383 146 117 -84 -270 -40 239 119 -87 -146 -147 82 249 -1 -215 -101 36 154 153 -120 -224 45 169 73
1405G3n8j55mK92L8k77m9P2Q8J52q3l01M5K67J6l6j09k06J59L14r5k25l1mJ76
1430E9K14k00k70O7J48J42K2k78j81K57J89n1r1k04l9L21J09k17j14m6N8K95q
1453A82l39K0J49j4J41k2l42R1L21j06r5L3j67R2L27k09k49J76J9j1K14k19l00
1476c08L19K00k11J7o3k01L00K48l48j51J33MJ81J37l69j78L14R9j5J6k97q2L71
1499A16J31j95j07j15P0L07ok85n3J6J25K48j70k94J04J22L5J20j81k50K48J86
1521A72j70L2m1j98K65J94l56l0K41j54N2K10l51q9M05n9k29J61j48r6M19m4l96
1544b10J21J21j16K69j2m59J17L79j32n1K8k91J00M21j15k89K2l1J07K95j53l25
1566b04N0J41R6R5j83k16J27J51L9k2j87o4K33M9j10J4j07k4K70j1k85J00P1p0
$$ plain form
1405 73 15 -140 -144 148 186 -91 -140 -68 20 172 89 -212 -167 100 116 80 -29 -235 -76 238 143 -82 -113 -117 59
1430 59 273 73 -197 -130 18 160 182 -96 -277 -20 169 118 27 -177 -216 105 214 -3 -117 -163 -105 190 182
1453 182 -157 -137 12 -2 139 117 -225 -134 187 81 -14 19 -148 -56 271 62 -187 -11 8 -3 211 -8 -308
1476 -308 11 211 0 17 -46 -247 53 301 -47 -198 -65 -61 120 257 -112 -290 24 123 108 124 -173 -255 116
1499 116 247 52 -55 -170 -100 207 201 -84 -137 -121 4 252 82 -212 -108 14 49 169 -12 -262 -14 172
1521 172 2 34 -7 -205 60 254 -102 -132 109 -45 7 217 -134 -223 182 123 -106 55 -93 -189 230 186 -210
1544 -210 -89 32 -84 185 173 -286 -169 210 78 27 55 -236 -136 285 170 -119 -97 -128 -21 274 121 -204
1566 -204 -154 -13 83 178 -5 -221 -94 57 96 74 -113 -177 56 105 -5 9 -98 -122 148 137 -148 -48 23 -47
1590d7J81k4k98J54J96k04M0J01k52J30L06l50j78L32n4o8K48k65l18L99K11k53
1612a3K0n7k46L26K92l37j53J31p8J83J99l03k13K46J25l0K3k21j14K66J72j21
1634I7j40j27L1K44R3j65j49l7J22J45k0j11l4l3Q9J00j44o6J87l4j09J13p7j19
1658a44K56N6k95M4J36j24J02J26k68k1K78j08j16J08r1l1K78o5l20P6J48nJ55
1681A75q2l35O8K82J8j6q2k53Q7L17m8j71Jo4M9K20p7k38K3J55O1j1r9j50O1K07
1707I8O7j54j48jJ27J18J3j22j24O2J54l3p4Pk9L3J10q3j57J29J02o1ko1j35J35
1733b9J84j17r6Pl3N0J49j18j18J26M2o2O1n8j01J67Q8j78n8O3jJ13Q1j92j19
1758a49J19R3J6mj30n6J32Q3r6p6RM9Q4Nj25p5Q4J40%j24r9J5J12J20l5j56o6
$$ plain form
1590 -47 134 110 -188 -34 162 -42 -2 99 -153 -23 283 -67 -245 87 33 -35 213 -52 -370 29 240 -13
1612 -13 7 -50 -296 30 322 -15 -168 -37 -115 68 267 -36 -249 -3 122 92 115 -106 -220 46 218 97
1634 97 -43 -170 -139 105 198 33 -116 -153 -31 114 94 -17 -51 -84 5 105 -39 -105 82 48 -61 52 -25 -144
1658 -144 112 168 -127 -83 53 -71 31 157 -111 -132 146 38 -78 30 -61 -92 186 121 -199 -123 25 20 175
1681 175 93 -242 -174 108 126 110 28 -225 -138 179 131 -40 -39 -103 -54 166 89 -149 -126 29 90 79 -20 -170 -109 98
1707 98 165 11 -137 -138 -11 107 120 -2 -126 -64 90 57 -17 -10 -39 -6 104 21 -136 -7 95 34 32 -29 -164 -29
1733 -29 155 38 -58 -51 -84 -34 115 -3 -121 5 47 -15 46 -12 -113 54 142 -36 -94 -31 -32 81 162 -30 -149
1758 -149 -30 63 79 75 -55 -111 21 104 8 -68 -59 -10 74 79 -46 -121 -37 103 103 -21 -120 -105 7 127 92 -64 -130
1785a30J11J05J1p6j01oJ48M9j19p3J2O1J18k9j70k9J14O8L2o5j47J0J47M7o2
1810B6n2n9N3J12j7j00J2L0L6K6n6r1M3J01j1o3n0k6Q4P9m3q7JM2M5J0q0m4P2
1839gO1Kp2n8L4J14L1q0r2j3Q9J13m3j23l9L7R9M6q6j12N6Q1M1l4j00m1J02Q8
1867I4n2q9m7K4J28M6j02r6L6P6O0qj15l5Q3O3j9m4n3J1J21mq1m1J4N5P5n9j21
1896h0MP1N4j8n7p1O0R4no0l5lP5N1p8o5KO9P2j5j14l8R3N8J1m9r6JJ15K6o2m5
1928c5l1M4R7k9r4NM3L0K9m2j01M1J02j4m7m3k0N5R0l7q8QL1L1L9o4q3N2O9j8
1958B0l4l4pO5P7n7p4oM1O6j3o9o0N2Q0J1m6o4K2M8O7k5r7k7Q3M0k9l0p1lJ12
1989C8M7r1n8M7J3M7K0j21l3R3M0l7mn9k3J33M5j17k5N2nN5K3j16m6J02K7l2o
$$ plain form
1785 -130 -19 86 97 21 -80 -86 62 111 -8 -81 -69 -8 110 81 -89 -118 -4 64 96 31 -116 -106 41 88 26
1810 26 -26 -85 -32 80 63 -37 -25 5 41 67 11 -80 -37 64 53 -10 -60 -86 -2 77 34 -53 -52 -10 35 45 -35 -79 -7
1839 -7 54 56 -16 -74 -40 74 105 25 -67 -80 9 122 79 -44 -83 -46 53 99 13 -99 -43 38 79 45 -55 -96 6 94
1867 94 42 -47 -94 -70 58 104 2 -94 -58 18 78 70 -45 -80 3 66 47 3 -50 -39 82 78 -3 -44 -30 25 100 41 -80
1896 -80 -76 -5 49 31 -26 -97 -37 57 52 -8 -43 -46 29 80 2 -63 -61 8 80 65 -49 -87 6 64 75 26 -70 -69 46 72 10 -35
1928 -35 -66 -22 75 46 -48 -43 0 30 59 17 -84 -43 59 45 -2 -45 -65 -10 80 43 -45 -37 -6 25 64 0 -83 -31 38 20
1958 20 -14 -48 -55 10 87 30 -44 -50 -9 57 44 -25 -85 -33 47 58 12 -52 -30 18 85 60 -37 -64 19 59 30 0 -71 -74 38
1989 38 85 -6 -64 -17 -4 43 63 -58 -91 2 42 5 1 -58 -81 52 97 -20 -45 7 2 57 80 -36 -82 20 47 15 9
2018Im0k4Q9M9r7k8L9J4K0jp9l0P3N5n5k6%J1N5L2o9p0N3N6j1jo6m2R1P7o6n5
2050c7L5k0M8Q2j02j14R6P3m4nm2p4Q1J25o7q3K4oL8Q3p1j14N9O7l9L2k9q2O5
2079b1J00m9o7L7j2PO2l8q9L9O5k8qJ4n7K9Q7m6o1L9K3k9K7j9q8N2J18l9j01L9
2109a4LQQ3l2j27K6P1nkj5j03L0J45j9r3J2njJ28j9j61OJ14pNNj02k2J43L7p5
2140A4j7k7pR7J4j18mM4oK9J1m9n1R5L5o5j7Rj3L0K1n4l5N7Rk4K6j1j8M8J7p0
2172c0rP1ol2J5m8k4R6N0q7l1J8kN8M6r9n2O0K2JNp6k8J01N1q1j4Nj0O9N9j12
2204a4r4P2O2J2Jn2p0N5Q5k2l7j3j9L6L9n2l5L7K4jMk6l0L1O9j8o7oJ2K0K4j2
2236A5n0JL9Ppj4j4K2K8k9o5N3J3oRj1p6L3Q2Jl5kk1KN3Qo0LJ5J7J1l3k4L7O3
$$ plain form
2018 9 -31 -55 34 83 -14 -42 -3 11 31 30 -49 -79 -6 49 -6 -32 -32 -21 34 66 -3 -73 -20 36 25 24 -42 -84 7 84 18 -37
2050 -37 -2 -22 26 108 6 -108 -12 61 17 12 -30 -104 -23 102 35 -48 -24 -30 8 91 20 -94 -35 32 -7 25 -4 -86 -21
2079 -21 79 30 -37 0 -12 -5 57 19 -70 -31 34 6 -2 12 -45 -16 71 25 -36 3 26 -3 24 5 -83 -31 87 48 -53 -14
2109 -14 -11 -3 80 48 -79 -53 18 13 11 -4 -107 -77 68 49 -44 -32 -37 -38 90 71 -90 -84 30 23 28 33 -69 -91 52 89 14
2140 14 -3 -30 -37 60 74 -44 -48 -4 -10 19 30 -19 -70 25 60 -5 -22 -13 -26 4 25 -29 -64 -7 2 -22 4 -7 -25 23 40 -30
2172 -30 -39 32 26 -6 9 -39 -63 33 83 -4 -35 -17 -19 39 85 -14 -66 -6 16 17 22 -54 -82 19 70 -11 -25 -20 -30 39 98 -14
2204 -14 -108 -36 26 38 39 -13 -83 -28 57 35 -2 -15 -34 2 41 -11 -46 -9 15 14 18 -8 -38 -7 62 44 -23 -29 -17 3 27 15
2236 15 -35 -34 5 12 5 -9 -23 -1 27 -2 -67 -14 -1 -7 2 -9 -85 -52 30 31 -4 -6 -27 -25 28 36 -24 -21 -6 11 22 -11 -35 2 65
2271F5l4m1j0PK5M7k0p3k8M4L7Ml7k2J2J9K3j0l0rM3J2m2l5MO1J8j3k9l8J9N9
2303B8M3o0n4J6L2K1pk7k9L3J8J1m2jJ2M5nn3k9J6J2L9Nn7k1K7N6Ll8k6QJ9J7
2336A2j7mj3J6K1j1l8J4N0J1l2k1j0J4K7J0j4n3KM8jj7pK0%J1nl2j0L5J8om6l1
2370e9M4L9J1k6k3k1K4N5ro8k2L1K8qlk8K0K0K0j7k6k0O0L1l4l1qLL6J7j9m2K
2403b3K6K6j4k3j6K7Oj4j2rlL5J7m9j9L9L1kk7j2mJ0K0kk3k5L1L3k2oJQK1J1j7
2438B0l3JK2J6j0m9NM0Qk0Jlk6M0J2l9k0K2J2J3rk8mL1QJ1k0l9J7N0j2l6kJ9k
2473dJ1J1l3j0L3J9j0k6pJ2L9j4l3jj0K4K8nm0%K8K5j9k7MnML5k3m7J8M0kj8r
2508a2j1J4K2jk2J2j9J2L9l5l5L2L0k6J7Ml1QL6k1k9KJ4OJ0k6k2M1Jj3K3k5k0
$$ plain form
2271 65 31 -10 -20 -13 12 59 39 -34 -62 -18 19 23 -14 -36 -24 -5 18 8 -22 -31 12 24 -18 -53 -49 12 30 17 -12 -50 -31 28
2303 28 71 11 -43 -27 5 26 19 -8 -37 -4 14 25 -17 -18 -6 39 34 -19 -48 -32 -20 19 24 -33 -54 -27 29 32 -6 -32 -24 -5 12
2336 12 -5 -9 -22 -6 15 4 -34 -20 30 41 9 -12 -22 -8 19 29 15 -38 -36 12 11 -6 -13 7 7 18 13 -19 -29 6 24 18 -28 -59
2370 -59 -15 24 35 9 -14 -35 -11 44 35 -33 -55 -24 4 -4 -7 -35 -15 5 25 8 -18 -38 22 53 19 -12 -20 -17 19 36 17 -25 -23
2403 -23 3 29 15 -8 -24 3 9 -5 -17 -26 -29 6 23 -26 -45 -6 25 23 -4 -16 -20 -10 10 8 -15 -40 -9 24 2 -4 -3 5 26 37 20
2438 20 -13 -12 10 26 16 -33 -28 12 20 0 1 -2 -28 12 24 -15 -35 -13 -1 12 3 -25 -29 2 10 21 1 -38 -21 29 17 -19 -21 -2 -4
2473 -4 7 18 -15 -25 8 27 17 -9 -16 -4 35 21 -12 -13 -23 1 29 24 -16 -16 12 37 18 -9 -5 -10 -6 29 6 -41 -23 17 15 -3 -12
2508 -12 -23 -9 13 12 -10 2 -17 -5 34 -1 -36 -4 26 0 17 21 -10 -2 34 13 -16 -14 0 6 16 -10 -32 9 10 -3 20 -5 -25
2541b5L0K5m1k3J7J9pJ6k3k3J4M8Pk8j8%K8K5k5j5j5K0J2K2j5n3J5N3pk5mj7j0
2574b3M0J9n0j3L1NkKk6oL6j0j2J5qk9M0J3n5J6N0l3j4L4j8k1M2Nm8J2J9rJ4k
2608A4m6K8M0j2j8Jl4%O3j5m7oK3PNJ9m7j7L9M0k0m4j0J0L4K8l3l1J6%J8L1l9
2641cl7L8L1l2rJ9k6KL9pl4K2Qj3J7pk0L0Lj9mJ7l2J1L2m5j6N4rl2J8Lk6K7K8
2676B8m1k8K9KL0Lk3l7K8M0k7K0k3k6K8M6m3l1J8J3QJ0j1m4J1M6nk1j6j3K1L3
2708B5j8l1J6Lj2L2Om5OM0j1l3K2Lj4J3J3l2j4M9mPqk7J6K5rl0Pj0jL8Mn3MN1
2744B8j6j7L%k3N2kl9j0MK0K3j4k4J1%MJ4oj7k1K8J3k5JJ7P%Mj4qJ2J8kj3k1J3
2781@K3j8j6J5oKJ1J2k7j3K3Ol5oK2LMMj2k0J0K3Npj2KRMplQj7J5Oqj7L6Mmkl2
$$ plain form
2541 -25 5 30 -11 -34 -17 2 -5 11 -12 -35 -21 27 34 6 -12 -12 16 41 16 1 -14 6 18 40 25 -28 -13 40 33 8 4 -13 -23
2574 -23 17 36 -14 -27 4 9 7 9 -17 -23 13 3 -9 6 -2 -31 9 22 -33 -17 33 0 -14 20 2 -19 23 28 -20 -8 11 2 16 14
2608 14 -32 -4 36 24 6 7 -27 -27 36 21 -26 -32 -9 -2 3 22 -25 -42 -3 37 17 -27 -37 -27 7 35 2 -29 -13 -13 5 36 -3
2641 -3 -40 -2 29 -3 -12 7 -19 -17 22 15 -19 3 11 -2 15 8 -12 18 21 2 -2 15 -17 -6 26 -19 -35 19 10 -22 -4 -1 -27 0 28
2676 28 -13 -41 -12 -10 20 23 0 -37 -9 31 4 24 1 -25 3 49 6 -25 -7 6 14 24 13 -31 -20 26 21 0 -16 -29 -8 25
2708 25 7 -24 -8 -5 -17 15 21 -24 -18 22 11 -22 0 3 -11 2 15 -17 -31 18 14 21 13 -14 2 27 18 -12 -5 -15 -16 22 26 -27 -23 28
2744 28 12 -5 -2 -2 -25 27 25 -14 -24 -20 0 23 9 -15 -4 -4 0 14 8 -9 -30 -2 11 -14 -13 4 11 11 15 1 -7 5 23 21 8 -13 0
2781 0 23 5 -11 4 -2 0 11 23 -4 -17 6 12 -23 -29 -7 -4 0 4 -8 -28 -18 5 10 3 -9 -7 2 6 -1 -4 4 -13 2 8 0 -17 19 23 19 17 -15
2822a5pJ4L0rj0k4OJ7K2k6k4J9nNNj3qJ3J8j2k1J3J8KjnjpRK9j6j5lJ0lpQ%kp
2862cNjj2MJ6J7l7jMRNKj3qNJ5lj8LLJ2qj2%NJ0J3j8j4J2J6J2j5j6MJKJ6jj1j0
2903a0J3J8j5j6J0J4j2Qnl2J0K2L%k6OJ2ROj1j9J6kNoj7J5pJ0kj4J5Qj5J2nk4
2940b6K3J8qj3QjJ0J0qopRmlj6J3LJj3pJ1j0J8J2k2k9L0RqLjrJ1QQj1k1K4Njj8
2981hoJ9%Pqj2oJ0L4j6j5j5K0Pm%nj9KJ7kpnKK2k6rJ1Pj4K2J4l9J1J6%j4Q%mQ
3022CJnKokJ3pnOJ5j8LJ1j5mK5rj9LJ5Kj2k0J3OjJ1j6qjQK3j4k9J6MJ1mnQj3J9
3064ENj1nJ3k%Oqj1MJ4nOJl0K5Oj9QQk0jK0j4j0K0lj3MNqJ1Mj9LQORj2k2NK4O
3107A3k4J0joJ9Ok2nPJ4Mqj3KOJ4j5j1j3%K8K1l3k6J8K4j8LJ2l2J6L2j3k7K3o
$$ plain form
2822 -15 -22 -8 22 13 3 -21 -15 2 24 -2 -26 -7 -12 -7 -2 -15 -23 -10 8 -4 -25 -12 6 8 7 2 1 -6 3 32 16 1 -2 8 5 -2 6 6 4 -3
2862 -3 2 1 -11 -7 9 26 -11 -12 -8 1 6 8 -5 -13 -8 7 4 -14 -11 -8 4 -4 -16 -16 -11 -1 12 -6 -20 -8 8 20 5 -11 -7 -6 -4 12 11 0 -10
2903 -10 3 21 6 -10 0 14 2 10 5 -27 -17 5 8 8 -18 -12 0 9 15 4 -15 1 -1 4 -2 -19 -4 -11 -1 -3 -17 -2 6 -9 3 -2 -26
2940 -26 -3 15 7 -6 2 1 11 21 13 7 0 9 5 2 -14 -1 2 3 -10 -17 -6 -16 2 14 -8 -37 -7 2 -6 -3 -4 -13 -2 6 14 3 -18 6 11 10 -8
2981 -8 -14 5 5 12 4 -8 -14 -4 30 14 -1 -16 4 11 7 7 2 -17 -15 2 0 -7 -12 -10 12 -14 -23 -12 -5 -19 3 17 -22 -11 5 5 -9 -1 -1 -5 3
3022 3 4 -1 1 -5 -7 6 -1 -6 0 15 -3 0 11 -4 -8 17 8 -11 -8 7 9 -3 -23 -10 -4 -5 6 -10 -18 -19 -11 12 -2 -31 -15 -11 0 -4 -9 -1 -14 5
3064 5 10 -1 -6 7 5 5 11 3 -8 -4 10 5 11 12 -18 7 13 -6 2 10 -10 -11 9 -5 -15 5 2 -11 -7 -2 -10 1 5 -14 -11 -3 3 12 0 -22 -17 7 13
3107 13 -11 -1 -2 -8 11 17 -5 -10 -3 11 15 7 -6 -4 2 16 1 -10 -23 -23 5 26 -7 -33 -15 9 -9 -6 6 -26 -10 22 9 -18 5 -1
3143aj6K0jj9J4J9k4K1lj9J5Rpl0L1%k3K3%j5NK0k2kPqKKj3NJ0j5JRrj2J4K3j4
3182clLnKPjlnPJ2pMj5j2K3Nj0qOoK2qj1j5K9%k5K7j5jJJ0j4Qoj7J0Oj7LL1k3
3224a4QRj8j1K8Lj8POKnJ3j2KJ2Ql0J2%PJ2k0Kk2K0jJ2j2j7J0j0K2rj4KMLJ6j3
3263fk1J9J0j0oJ0qNOqj0RKOJ4ok0J2RrJ3PrpMnrJ6p%Nrj2J5Nj6Qj4jJ7Mo%%j
3308dPMqj5J3QLk0rK8npJj5NJ0J6Oj9j0%J0J0mqPoJ0pkmLJ0j2njlLJ5j7JQmQJ0
3353A1j8mJ1mJJ0%j0MNqjLJ3%rnNkR%j6mJK1j0oMrKJj3J1K%lLj5%J5O%oj3QQo
3400hQoRNMolJJ5j6nmnJ3NPk4KOjJ2mmrLLNqlMkJ3j4qNJ2%qnOpJ0jknRj0J4%k
3450AMkLnj7J9Rj5%nmJ1NNj9mJ3JlmkMnklJ2loJ4lj6JJ3J3plj5J1%OMpjJ2k%m
$$ plain form
3143 -1 -17 3 2 -17 -3 16 -8 13 10 -9 6 15 8 -22 9 9 -14 9 9 -6 -1 19 -3 -5 2 -6 -4 -2 -15 -10 0 -15 -14 -5 -14 -26 -12 11 -3
3182 -3 -6 -3 -8 -6 1 0 -3 -8 -1 11 4 8 -7 -19 4 9 -1 -9 -3 -9 13 5 -6 -21 8 8 -17 10 -5 -6 -5 5 -9 -1 -7 -24 -14 -8 -25 -22 9 -14
3224 -14 -6 3 -15 -26 2 5 -13 -6 0 2 -3 10 -2 0 12 20 -10 2 2 9 21 1 3 -19 1 0 12 0 -17 -7 -17 5 -4 -18 -16 -12 -9 7 -6
3263 -6 -27 -8 2 -8 -14 -4 -12 -7 -1 -9 -19 -10 -8 -2 12 6 -14 -2 7 -2 11 18 9 2 6 1 -8 8 1 1 6 -3 -15 0 5 -11 -3 -17 -18 -1 3 -3 -3 -3 -4
3308 -4 3 7 -1 -16 -3 5 8 -12 -21 7 2 -5 -4 -19 -14 -4 12 18 -1 -11 -11 -1 9 5 -3 4 -2 8 1 -1 -5 -2 8 -4 -9 -10 -13 -10 5 -12 -11 -3 -7 1 11
3353 11 -7 -11 0 -4 -3 7 7 -3 1 6 -2 -3 0 13 13 4 -1 4 2 11 11 -5 -9 -8 13 3 -3 1 -8 -6 -5 -18 -7 -5 -5 -8 -5 -20 -20 -5 1 1 -5 -18 -10 -2 -8
3400 -8 0 -6 3 8 12 6 3 4 19 3 -2 -6 -11 2 7 14 -10 -8 -2 -3 9 5 1 -8 -5 -2 3 -5 -8 -4 -6 7 -7 -15 -10 2 2 -6 -11 -5 -12 -2 -3 -5 -10 -1 -11 3 3 1
3450 1 5 3 6 1 -16 3 12 -3 -3 -8 -12 -1 4 9 -10 -14 -1 0 -3 -7 -9 -5 -10 -12 -15 -3 -6 -12 2 -1 -17 -16 -3 10 3 0 -15 -4 -4 2 6 -1 -2 10 8 8 4
3497DKnRLoj9J1KJOj3%lJ4j7OprJ3lJ0ooMJ0nJ3p%OKj2LMlKrNqJ7j6MROk1J2N
3544Hj6nJ7kn%KjRkj4Oj4JJ6nj6OJ0kRkopR%J2mlLJKpmLkR%no%KOklrJ3p%jlM
3596e%qJ3rLPj5j0K5j4lJ1qj0OJ8qNkMj1J9j0j3JK1j1J2pj2J6J2j6nQj1%J4j2
3635ej4K1qqKK3k4nJ7ojlJqK4nj7QQnj1J0%J1Kj4qJ3R%mNk3J1J4j0oJKnJ4j4q
3678a6RMJjLk6RK4prK%qK4nqnPPoJ0j4jJMmQmqJ8j0QqJ1m%MrnJ0nnkKoQJqJRj2
3729a1oK2j5N%KqlJ7PlkjKpJ1jj3lJ0PJj2qJ4JMj9J5j8J3Rj0LknjJMK%pLLj4M
3775iKqJ0QnopK2JjL%lkNrPjK%j8J3k%kJNomoPpkJ0qj2J6njJ2rLLRjj1mKKJ3j3
3826fJJMnJ2mjJlKmMJrJ3oKj0KJ0jj3jKL%rRpJ0KprJ2J0%kj5Mj0J4Rjj1JJJ0%
$$ plain form
3497 4 6 1 10 13 7 -12 -1 1 2 8 -5 -5 -8 6 -11 -5 -12 -21 -8 -11 -1 -7 -13 -9 1 -4 9 2 2 8 10 -2 1 5 2 4 -5 0 -8 9 -7 -3 6 12 -9 3 8
3544 8 -8 -13 4 2 -3 -3 -1 -2 7 5 -9 -3 -17 -16 0 -5 -21 -15 -5 -7 2 0 -6 -13 -4 -4 8 4 1 4 5 7 0 -4 -1 -3 6 6 1 -5 -5 -3 3 1 -2 -11 2 -5 -5 -6 -9 -5
3596 -5 -5 -13 0 -9 -6 1 -14 -24 1 -13 -16 -5 -13 -23 -17 1 -7 -2 -4 0 -11 8 -2 -15 -14 7 -4 8 1 -11 5 17 1 -4 4 -7 -7 7 -5
3635 -5 -19 2 -6 -14 -12 11 -13 -18 -1 -7 -8 -11 -10 -18 6 1 -16 -8 0 -5 -16 -6 -6 5 7 -7 -15 -2 7 7 3 8 -15 -4 10 0 -6 -5 -3 -8 6 -8 -16
3678 -16 -7 -3 -2 -3 0 -26 -17 7 0 -9 -7 -7 -15 9 4 -4 -9 -2 5 -1 9 -5 -6 -5 -1 -5 3 -1 -9 9 -1 7 -1 10 6 6 10 1 -4 6 1 -4 -6 -4 -10 -2 -1 -9 -8 1 -11
3729 -11 -17 5 -10 -5 -5 -3 -11 -14 3 10 7 5 4 6 -1 10 9 -4 -7 3 10 11 -1 -9 5 6 10 -9 6 -12 1 10 0 3 1 -4 -5 -4 0 2 2 -5 -2 1 -13 -9
3775 -9 -7 -15 -5 3 -2 -8 -15 7 8 7 10 10 7 5 10 1 8 7 9 9 -9 4 2 2 0 1 6 0 -4 -10 -3 -10 -12 -2 -10 -22 -6 -11 -12 0 -9 -6 -3 6 5 -6 -10 -8 -6 7 -6
3826 -6 -5 -4 0 -5 7 3 2 3 0 2 -2 2 3 -6 7 1 3 -7 -5 5 4 -9 -10 -8 -5 -5 -14 -5 -12 -2 0 -7 -16 -4 6 6 4 -11 -7 -17 -3 6 5 -6 -5 -4 6 6
3874FLj2%NpKMlQljrJ2Oj2Nj2Oj1J9onkpQ%pNkOrQrJ0mJ1npRJPNKj3oJ2j%jlL
3925FmoJ1Qk2%MklLOmj2KlK2j5OKLj7J4Rj5QLmjjMNn%RpNKLj3nKj0J0lJ2j6J1
3972Bj0KMMlooPKokJQOljoRJjooJ3LqoJ3lJJNq%%NJmrN%njNoQLk5RnK1k1MMJ3
4026Cj4NjJ3rQLj9MJ0KpOqmQQkOrj3J8lj3PPoKmOj0lJ7j0nKKj2JQln%J1kPj7K4
4074InnqPKlLMoJLkOlpQkkomjPLNqRm%j7J5mMJ0k4JjNQm%rJ4%LJjpQjlJJ0poJ4
4129A1Lj1rJ9jqnkLoKqOkMOlqKPj9J6Rj0Lj1J3rOMkopOKOlRkOpJ0%j4jK0j3pK
4178AMj3J7kpj2QJLjj4J5ooNMj7J1K1nj8J7orjJ1lk1K1NRJj7QQjj4J1lmKJ0k0
4221gjJ0Jj1JJ4qrPQj0MjoJj6J7KRj7QMrJ5J1k3qJ8Rj6RnqmK2j2kJ1j2RqmQLM
$$ plain form
3874 6 9 -3 -3 2 -5 -3 1 -2 6 3 2 -7 5 11 -1 4 -8 -2 -13 6 0 -5 -7 -14 -6 -6 -13 -8 -10 -4 -13 -5 -14 -4 -8 3 -2 -9 0 1 8 13 15 2 -4 8 7 7 6 3 6
3925 6 2 -4 7 15 -7 -7 -3 -5 -8 -5 1 -3 -15 -13 -16 6 -9 -3 -1 2 -15 -1 8 -7 1 4 0 -1 -2 2 7 2 2 11 4 9 11 14 1 -4 -2 -12 -2 -5 7 -9 2
3972 2 -8 -6 -2 2 -1 -7 -13 -6 -4 -10 -12 -11 -3 3 0 -1 -7 2 3 2 -4 -10 3 6 -2 -8 5 2 3 4 9 1 1 1 6 7 3 -6 -1 -1 -6 -7 -2 -8 0 3 -22 -13 -18 3 -18 -14 -10 3
4026 3 -11 -6 -7 6 -3 5 8 -11 -7 3 5 -2 4 -4 -8 0 8 6 12 3 -10 8 5 -8 -1 6 0 2 -2 4 -6 -9 8 -2 -7 -5 -3 -15 -14 -6 -9 -14 -14 -3 -5 2 -15 9
4074 9 4 -1 -9 -2 0 -3 0 4 -2 -1 2 0 6 3 -4 4 2 0 -6 -10 -11 -4 -1 4 -4 5 1 1 -16 -1 -5 -1 9 -15 -14 -15 -10 -2 -6 -6 -15 -1 -1 2 3 2 -5 3 2 -1 0 10 3 -3 11
4129 11 14 3 -6 13 12 4 -1 -3 0 -6 -4 -12 -6 -8 -4 2 -1 -9 -7 0 -19 -3 6 -4 -1 -12 1 -8 -2 2 0 -6 -13 -7 -5 1 -2 7 5 11 4 14 14 0 -1 19 6 -1 1
4178 1 5 -8 9 7 0 -12 -4 -3 0 -1 -15 0 -6 -12 -7 -3 -20 -9 12 7 -11 6 0 -9 -10 1 -2 -23 -2 3 12 13 -4 4 12 11 -3 8 5 1 3 13 -7
4221 -7 -8 2 3 -8 -7 7 -1 -10 -3 5 -5 -1 -2 -8 -7 -23 -6 -4 5 -12 -4 0 -9 6 17 -6 -14 4 13 -3 6 1 -7 -11 11 -1 -3 8 -4 5 -3 -7 1 4 8
4266Hj4OlqRJmJJ0kj1MrMmJ3Lk0OOnjOQKj5J1LooOQnjmOrJ8nnj1KJ3j6JMJJ0j0
4315d%Kn%J2mroJ1Qk0J3KplOJ6j8JJ9qoljNLJ4qj2JJ3j1j0JRKj5QKj8J1%Lj5R
4360a2QqOrJ3pNKLj0QkRj5oK0olKkkJNJ3j8kQNoJJ2j9OKMnkKKq%kPqOmmjJ6j0
4410e%oNMj1J3LjqQPpmOk%n%LJJ0r%nKQlj7kJ7j2KJ2pj3J6oLj7J2PjrQj0jOQQ
4459Hj8OK0j4LMMj8LJ0ol%OLj3%J1j0lOmoLLJpmQ%KKJ1j3qJJ5rOLj2QKpJ2%JO
4507A3pj0J0Mnj5K0j0oLJOqOPj6%MnkKKj2QKJ6pMmLpNMk1MMJ6k0LRJ0j4kJ6j2
4552aLJ0j0%jpJ0JnnJ5Lj6J1lj8NNprKJMOk%kMPOqKL%j2QNljNkKMJ1j9NJMj4k
4602dJ3j4lJ2j3ONkkMj5OPj9Q%Oj8J9MkpJ5j0KMoK%JKLJ0j2lPj7K1j0%mRj1lJ
$$ plain form
4266 8 -6 0 -3 -11 -2 -1 -5 -4 6 4 -7 -3 -12 -8 -12 1 4 -16 -10 -4 -9 -10 -4 4 6 -9 2 5 -1 -7 -1 7 2 1 -3 3 -6 12 7 2 -9 -7 6 -10 -9 -5 -4 6 -4
4315 -4 -4 -2 -7 -7 5 1 -8 -14 -3 5 -15 -2 0 -7 -10 -4 12 -6 -5 14 6 0 -3 -4 1 4 18 10 -2 -1 12 1 -9 -8 1 3 -12 -4 -2 -20 -9 -9 -6 -21 -12
4360 -12 -4 -12 -6 -15 -2 -9 -4 -2 1 -9 -1 -3 6 -9 -15 5 -1 -4 -2 -4 -6 -5 0 13 -5 -7 1 6 0 1 13 -6 0 2 6 1 -1 1 3 -5 -5 -7 0 -8 -2 -6 -10 -11 5 -5
4410 -5 -5 -11 -6 -2 -13 0 3 2 -6 2 9 2 -2 4 2 2 -3 -3 0 1 11 2 2 -3 -1 7 4 -13 -15 2 -10 -8 4 -3 -16 0 -6 -3 -20 -8 -1 -2 -11 -3 -13 -14 -8 0 8
4459 8 -10 -4 16 2 5 9 13 -5 -2 8 2 -1 -1 5 8 -5 -5 6 -4 -7 -1 -5 -11 -8 -5 -4 -11 -15 -7 -7 -5 -3 8 -5 -13 -12 3 -6 0 3 -9 -1 1 -6 6 6 7 13
4507 13 6 -4 6 10 5 -10 10 0 -6 -3 -2 4 -4 2 9 -7 -7 -3 -8 -10 -8 -6 -18 -10 -8 8 1 5 1 4 -3 2 6 -15 -11 -7 9 -11 -8 1 11 -3 -5 11 -1
4552 -1 2 12 2 2 1 -6 4 5 0 -5 10 13 -3 8 5 -13 -8 -3 -10 -19 -17 -16 -12 -6 -8 -8 -10 -6 1 7 -1 1 4 4 -8 0 5 2 1 6 4 6 10 21 2 7 8 12 -2 -4
4602 -4 9 -5 -8 4 -9 -3 2 0 -2 2 -13 -7 0 -19 -11 -11 -5 -23 -4 0 -2 -9 6 -4 -2 2 -4 -2 -2 -1 1 4 14 2 -1 6 -11 10 0 0 -4 5 -6 -9 -8
4647hkRJ1nOj1oJRqmQJnkKjPj2RmPJkpPJ1%KNj4oJ2MoMqj2J1Nj5JRj3MJ7j3j6
4695a7J0PpLnj0K0orJ2oj0J2MoLMpLLl%NjJ0j1JMpJ5lLj5JRj1Oj4K1mj1pJ7j3
4739a0MlQj6LJ5Kj7J0kmJljJQ%QJj3QJ8k2KjmMJLnnMOj3lJ4nlKnJ2j3nNQOj0J0
4787Aj5KJ4j4KQPj2KJ1kQqj2NLkkOJrJ3j0jKJ0j0Nklk%Oj2RnoR%pMmJLJoLJ0j2
4836a0mjM%J0LlMmJ1rJNllJ2nkj3MJ4lj1J0n%nmoKRqk%MJRp%JpOM%qLQLj2OpJ2
4888Dj2J3%jqJ0Loj5J1Rj0KNj3mQMpjNjMj1J6oMlj1Rjj2K7j6oJ4KrJPj0Q%Pj3
4933cjjJ1oj0J6npJJ3jLlj5KkQj1J3lpJojOJ0j4%J0j1%LLJ2Mk%mmK%pjOoMNmm
4982fnJ1JoJ0rqNnM%KO%lmJNmnlLjJ0qJ2q%J8j2LNnlPnJ2j3LJ4k3mMJ1Pj0lpJ
$$ plain form
4647 -8 -10 -1 10 5 11 0 -6 -5 4 -4 -8 0 1 -4 -6 -4 -5 2 -10 -1 -5 2 3 1 -6 1 12 12 14 19 5 -1 11 15 9 13 5 -7 4 9 -6 -5 4 -9 -5 12 -1 -17
4695 -17 -7 0 -7 -4 -9 -19 1 -5 -14 -2 -8 -18 -6 -2 -8 -5 -1 -8 -5 -2 -5 -5 0 -1 9 -2 -1 3 -4 11 8 11 -4 -3 6 -5 1 -13 8 4 -7 -14 3 -10
4739 -10 -6 -9 -1 -17 -14 1 3 -14 -4 -6 -10 -9 -12 -13 -12 -4 -4 4 5 -8 0 18 -4 -2 -3 -7 -3 -2 1 -4 -9 -5 1 -12 -15 -1 -6 -9 -7 -12 0 -13 -18 -13 -5 1 -9 1
4787 1 -14 -12 2 -12 -10 -2 5 -7 -5 6 4 12 4 -8 -3 0 -2 -4 2 3 -6 7 -3 -4 -2 8 -2 3 1 -2 -4 -4 2 -10 -1 -6 -12 -3 -3 -10 -6 -10 -9 -6 -5 -11 -8 2 -10
4836 -10 -14 -15 -11 -11 -1 2 -1 3 -1 10 1 2 7 4 1 13 8 6 -7 -3 11 8 -3 7 2 2 -3 -7 -13 -11 -2 -10 -12 -12 -8 -7 2 -5 -5 -4 -11 -5 -1 -1 -9 -6 2 5 -7 -1 -8 4
4888 4 -8 5 5 4 -4 6 9 3 -12 -1 8 -2 0 5 -8 -12 -4 0 -7 -8 -3 -4 0 -11 5 -1 3 0 -11 -2 -3 -15 12 -4 -10 4 6 -3 -2 5 -5 3 3 10 -3
4933 -3 -4 -5 6 0 -10 6 1 -6 -5 8 7 10 7 -8 -6 -8 0 -11 2 -1 -8 -7 -13 -14 -8 2 -12 -12 -2 -13 -13 -10 -7 5 9 7 7 3 -1 1 1 -6 -7 -1 -7 -3 2 -2 -6
4982 -6 -11 0 1 -5 5 -4 -12 -7 -12 -8 -8 -6 0 0 -3 -7 -6 -1 -5 -10 -13 -10 -11 -1 -9 3 -5 -5 13 1 4 9 4 1 8 3 15 2 5 19 -4 -8 -4 7 14 4 1 -6 -5
5031eJpJ1j5POmrJ2PojJoNmLLjKqQNpJ3poJ2loRkj2MPo%J4k2J2knPoOj0LLpj1
5081a7RLPjknOoPj0MMjJMkJKj%oMJkj3K0mrLLmjNmoROrnJ0qMJj3JNM%O%olJJL
5136cjlRjMKnPJLj4k%Rj4KJ2j3%J0nkKkJPok%Lj2QLMMmnPrPmkjkJ0Nj1%LMM%k
5189FpJ%PoljKNj0kJ0qKMLj3kmJ0JPL%n%kkJlJ1mnmOOj2K0j4Pln%QlNkj6J7JL
5240A0pj0O%j0JPj3KL%MlJjMJ0moJ4Orjj2jQLKkj1J0OOj3NnpPKkOjOk0RJj0lN
5289gJkqjJ3%rLNlQKL%Lmk%oQLjlPpkMj2J0J3qnrnNMKj0J0opJ3nlkNLjQj2%Jn
5342a1QMl%kONko%Pj5RJJ0j6kJ0Nj1JkoMpQJlJJkRp%lOLrkN%kJQj1LJ4%j5jJ3
5393EmjRnj3J7j0QLnjoRmRnlm%rOrJ4j4J9rKkk2J5kOJL%Qj4PQnj0J2jj4J2oJ2
$$ plain form
5031 -5 -4 -11 0 -15 -8 -2 -6 -15 -3 4 -2 -3 -2 -8 -3 -7 -4 -1 -2 0 -8 0 5 -2 11 4 -2 10 7 1 10 8 -4 0 7 1 1 15 -7 5 3 -2 5 -1 5 -5 -2 1 -6 -17
5081 -17 -8 -5 2 1 -1 -6 0 -6 1 -9 -5 -1 -2 -1 3 1 2 4 3 3 -3 1 2 0 -13 7 3 -6 -3 0 -4 -5 0 -4 -10 -1 5 -4 -9 1 -7 -3 -2 -15 -14 -9 -5 -5 1 1 -5 -8 -7 -6 -3
5136 -3 -4 -7 2 1 5 7 2 9 10 13 -1 -3 -3 6 -8 -6 6 -7 -7 3 -2 -4 -2 -4 -3 4 -2 -4 -4 -1 -13 -5 -2 2 6 2 -3 4 -5 2 -2 -4 -5 -7 3 8 -3 -3 0 4 8 8 6
5189 6 -1 0 0 7 1 -2 -3 -1 4 -6 -8 2 -6 -4 0 3 -10 -12 -16 -6 -5 2 5 5 0 0 -2 -4 -3 -6 5 1 -4 -8 -2 4 -8 12 -2 5 2 -3 -3 5 2 7 5 -11 6 7 10
5240 10 3 -7 -1 -1 -11 -10 -3 -16 -14 -11 -11 -7 -10 -9 -10 -6 4 0 -6 8 14 5 4 -8 -9 -1 2 4 2 -9 1 7 13 0 5 0 -7 0 2 0 6 5 11 -9 0 1 -9 -12 -7
5289 -7 -6 -8 -16 -17 -4 -4 -13 -10 -5 -8 0 2 5 5 8 4 2 2 -4 4 7 6 3 10 3 1 5 -7 3 16 8 3 -6 -11 -6 -2 0 -10 0 -6 -13 0 -5 -8 -10 -5 -2 -3 5 -7 -7 -6 -11
5342 -11 -3 1 -2 -2 -4 2 7 5 -1 -1 6 -9 0 1 11 -5 -7 3 8 -3 -2 -4 -10 -6 -13 -5 -4 -7 -6 -5 -7 2 -5 -5 -8 -2 1 -8 -10 -5 -5 -7 -6 2 -9 -6 8 8 -7 -8 5
5393 5 1 0 9 4 -9 8 -2 6 9 4 3 -3 6 2 11 6 3 -1 -1 -10 -4 -13 1 -13 6 -3 -1 -3 -25 -10 -12 -6 -5 -2 -2 6 -8 -1 7 2 -8 4 3 -11 1 -5 7
5440GplOJj0J3J0j8RrJ0Jmj0O%j6J1qJ2njJ0mmKj0J2Oj1MnPNjjqM%NrJ3jj0N%
5486DmkPqqJ5mmM%m%LjLnNj0PlJ0qj3MOMJ2npKklKJ0Mj1jOnQJlmMjKkOnj1MJj1
5539a1NKLj1RQj8J3PqlPkjKQj8OJlJJ1JMJljLqOnlkRk0K2j4KqLKLj1Ppk%nQRN
5590Dj0lPNpmlJ1oJ5pJMNqJj%Mj3JJ0kpLOnKjknjOqJ0lqKRkoNqmQlpJ2Lj1ORo
5643bj0J3Kj0J6j3LJ1ooJ1j3KrJ8j8J1%qRpJ1rMMj1J2nqj0RMmJkMqOjQPk3RQR
5688Ij1N%NPj0j%njPMKk3J2Jj0QOj5kPOj3Orj1J9Nk%NlPrmJOj1J3qPlqJJ1R%j3
5737cPpMMj1J1j0%OoL%kkNljKkkJMJojKRnKnJ6mrJ%mRj2J3qjJ3mmmJ1QppjOj1
5789dJRj4J4kj3Lp%nQjJ0j2QnPJoJ0qjQKj1J4Jkj5OQKoJ2qPj0PrrOKnMQqMjJM
$$ plain form
5440 7 0 -3 3 4 -6 7 17 -1 8 -1 9 10 6 -4 2 2 -14 -3 -11 1 -4 -5 5 1 -3 -1 -11 1 7 -4 0 -5 2 7 6 5 -3 1 1 6 -3 10 9 -1 4 4
5486 4 0 -2 5 -3 -11 4 0 -4 0 0 -4 -4 -1 -2 1 -4 1 -9 -2 -5 5 -3 -16 -12 -6 -2 10 5 -2 0 -2 -5 -3 7 11 0 -1 5 0 8 9 6 2 6 5 7 5 11 6 -5 -1 0 -11
5539 -11 -6 -4 -1 -12 -3 5 -13 0 7 -1 -4 3 1 0 2 10 -8 -2 -1 -4 -3 8 9 13 14 11 10 13 5 11 6 3 1 10 -10 12 -2 0 -8 -5 -3 0 -11 -4 -11 -13 -13 -18 -10 -1 4
5590 4 -6 -9 -2 3 -4 -8 -11 0 -6 9 2 3 7 12 4 5 4 4 8 -5 -4 6 4 -3 0 6 1 3 2 0 -5 -6 0 -8 2 -1 -9 -7 2 0 -6 -1 -9 -13 -5 -8 -15 -3 0 -11 -5 4 -2
5643 -2 -12 1 3 -7 9 -4 -1 10 4 -2 9 -4 -2 -11 7 -11 0 0 -8 1 -6 5 -4 0 4 -7 5 0 -8 -18 -9 -5 -9 -8 -10 -6 -14 -8 -9 -1 6 -17 -8 0 9
5688 9 -2 3 3 8 15 5 4 4 -1 -2 5 9 11 -12 0 1 -9 -1 5 -10 -12 -5 1 -12 -6 -15 -26 -7 -2 -4 -4 1 -2 5 -4 -8 -7 -1 -12 1 -7 0 -3 -11 -10 1 10 10 -3
5737 -3 4 -3 1 5 -6 5 -5 -5 1 -5 -2 -2 -4 -6 -1 -4 -5 -3 -5 -7 -6 -2 -1 -7 -8 -6 3 -2 0 -5 11 7 -2 -1 -1 -5 4 -8 5 -3 -4 9 5 1 -3 8 16 9 2 1 7 -4
5789 -4 -3 6 -8 6 4 -9 -6 -13 -13 -18 -10 -11 -1 -13 -5 -10 -3 -2 -8 2 -6 -7 1 3 -8 6 7 5 -10 -4 4 6 0 12 4 11 1 8 -1 -10 -4 -2 -7 -3 5 -3 1 0 1 5
5839Ej%j4NrLOlPQqJQj0Qj4J5opOlJ2j0NjOKqokQjpJ8k5J0mjKJ4rj1kOjQnlPq
5889iLrJ1jPJpJlMoJ5j3RjjQrOj6K2p%%j0KjJ3j4jPj0MK%MpOoJ0j1JLOnOj0Rn
5938bJmoOjNjmPkqNOOrJkPn%LMj0O%nr%J1j0MlJOMmj2J0lJ8j1l%%P%JkLKj3NO
5991Fj2nRQj2PnMorJ2MmnJ0j3NpMlKRrQmj0J5j0MJ0j5QOkMKOj3J4qLnN%pJ1k1
6038iKJ5j3NkKjoKoJJ1pjNrJ2nRj6OqJ0nJJ1j8LJ1QoJ0qLknlMkJ0rPloOlj0ML
6087bj6J3MjjjmJkMJ0qKlKKpJ1kl%NJlJPk0J8jj0JKlMlJJnLjJ4k3ORj3JM%j4L
6137a6LjROoKpmJ0JqOJ0rjLONqKkJkJlkklJ1KnnRlmJ8j5Qj4JqJ9j1lJ3Mj3J0o
6186arL%MkMj0K1j0Pj4RLj2PRj1jNj2KNmKJL%kOj5J1jl%jjJJ3j3lJ0okJLj0J2
$$ plain form
5839 5 4 4 -10 -5 -14 -11 -5 -8 -1 7 -1 0 8 -2 6 -8 7 1 -6 0 -3 9 -1 4 3 9 11 3 -3 -5 3 2 -5 13 -12 -2 -6 -7 -5 9 0 -11 -13 -7 -8 0 -5 -8 -1 -9
5889 -9 -6 -15 -4 -5 2 3 -4 -3 -6 -2 -8 7 -6 3 2 1 9 0 6 -10 12 5 5 5 -5 -3 -4 9 -5 -6 1 -9 -5 -3 -3 1 -6 0 -6 4 -7 -6 -3 3 -2 4 -6 3 -2
5938 -2 -1 -5 -11 -5 -6 -1 -2 -6 1 -1 -9 -4 2 8 -1 0 -2 5 0 0 3 7 -3 3 3 -2 -11 -11 0 -10 -6 -9 -8 -2 2 -2 -14 -4 -7 11 0 -3 -3 -3 4 4 5 3 6 8 -5 0 6
5991 6 -6 -11 -2 6 -6 1 -4 0 -6 -15 -3 1 -3 -8 2 -11 -6 -13 -9 -12 -10 -1 -10 -2 -6 -16 -1 -11 -7 3 -12 -4 2 0 4 6 12 -1 13 5 8 3 8 8 1 12 -9
6038 -9 -7 8 -5 0 -2 0 -1 -7 -5 -11 -10 1 -6 -7 -2 -11 1 -4 5 -11 -5 -13 -3 -8 -7 4 -14 -11 0 8 2 12 4 7 5 0 -3 1 -1 9 0 7 4 -2 4 1 -9 -5 -2
6087 -2 -18 -5 -1 -2 -3 -4 -8 -7 -9 -5 5 -3 -1 -4 -2 0 -7 4 2 -1 -1 4 5 2 3 10 -10 8 7 -3 -2 0 -3 1 -2 -1 0 -5 -2 -3 11 -12 -6 3 -10 -9 -5 -5 -19 -16
6137 -16 -13 -14 -5 1 -5 -3 -10 -14 -4 -3 -11 -5 5 -4 -5 -2 4 9 1 3 1 2 0 1 -2 -4 -6 -9 2 4 -1 -6 3 0 -4 14 -1 7 -7 -6 -14 5 -6 -9 4 8 -5 5 -1
6186 -1 -10 -7 -7 -3 -5 -1 -11 10 0 7 -7 2 5 -7 0 9 -2 -3 2 -10 -8 -3 -7 -5 -4 -1 -1 -3 3 -12 -1 -2 -5 -5 -6 -7 -6 7 -6 -9 1 -5 -7 -6 -3 -13 -1
6233aoMPpkj2J6jRKllJMlolJ2k5J3J0j8JQj2QQrj%JmRrPOmNlJkQoQj6J0Nj9KJ6
6283Fj2L%KJqJ3j4J0lOnOlJqoK%%LlPj4M%jQPj2L%J4nrOPnmLL%lJ3rqkPpLLLn
6336brQJ9k8J4p%jJ0r%mjmLJ2pLl%%Qj1PnMJRqPoK%jmPnlQrjJKJ2j1lRnj5LOm
6388a1QjQnLrmkJ2ppRlLoJ1qPlj1J5MnOj1J9j1MomlJMnJpj%OoJ3%nRj0j1J5Ko
6437hLJJjnjJJ0oOl%oQnpJ6LqJ0kj6J7nPpj3lJ6npNljJ%Plj0jnJ0LOj0jNLj0P
6487fOj0J0omMkPk%N%mMjjNj6J1jrJ7olJpJ0j1JjLJ%lJ0j2NjmMjPOj5J6Knj0Q
6536BKoPoqNkJ4j2JMjmNpJ0j2PQJk4POljMjnmJQKrK2j6mPNJnrJ8j5kJ1LjqLJl
6587cJ6j0lj7J0J7j5mKMJ1pomj1K7qkmOkKjrlJ5Pmj0NnkK2j2Loj0J1J2mpLj7J8
$$ plain form
6233 -1 -7 -3 4 -3 -5 -17 -1 -2 7 9 6 3 4 8 5 -1 -4 8 -17 -4 6 -12 -11 -3 -15 -7 1 -8 -9 -9 -8 -12 -3 -12 -5 1 -3 2 -1 0 -2 6 0 8 -8 2 7 -12 -10 6
6283 6 -6 -3 -3 -1 0 -8 5 -9 1 -2 4 -1 5 2 3 -5 -11 -9 -9 -9 -6 -9 -2 -16 -12 -12 -13 -5 2 -10 -7 -7 7 2 -7 -1 6 1 -3 0 3 3 0 13 4 -4 -6 1 -6 -3 0 3 -2
6336 -2 -11 -3 16 -12 2 -5 -5 -6 4 -5 -5 -9 -10 -14 -11 1 -6 -3 -6 -6 -6 2 -9 -2 -7 -3 -2 7 -1 6 0 2 2 1 -3 4 -1 -4 4 -5 -6 -5 -3 9 -2 -5 4 -1 -16 -13 -7 -11
6388 -11 -3 -4 4 -1 2 -7 -11 -13 -1 -8 -15 -6 -9 -6 -12 -1 -9 -2 -5 -16 -1 3 -2 4 -7 12 1 5 -1 -5 -8 -7 -3 -8 -7 -14 -15 -15 -9 -15 -2 -2 -7 2 -8 -19 -4 -2 -8
6437 -8 -5 -4 -3 -4 -9 -10 -9 1 -5 1 -2 -2 -8 0 -5 -12 4 7 -1 9 7 -9 8 3 10 3 -10 -13 3 -2 -9 -4 -7 -8 -7 -7 0 -3 -13 -14 -19 -9 -6 0 -10 -11 -6 -3 -13 -6
6487 -6 0 -10 0 -6 -10 -6 -8 -1 -3 -3 2 2 -2 2 1 0 5 -11 0 -1 -10 7 1 -2 -1 -8 2 -9 -8 -9 -6 -5 -5 -8 2 -10 -5 -6 -10 -6 -7 0 6 -9 7 9 4 -6 2
6536 2 4 -2 5 -1 -9 -4 -6 8 -4 -3 1 0 -4 1 -6 4 -8 -1 7 8 -16 -9 -3 -6 -7 -3 -4 -9 -13 -12 -4 -2 -11 11 -5 -9 -2 3 4 -1 -10 8 -7 -9 2 5 4 -4 -1 0 -3
6587 -3 13 3 0 -17 -7 10 -5 -9 -7 -3 8 1 -5 -9 -20 7 -1 -3 -7 -1 -3 -1 -2 -11 -14 1 8 4 -6 -1 -6 -8 14 2 5 -1 -11 0 12 8 1 4 -13 5
6631EqOonOJj3JOKLqPJokJ3j3MjLj1PjJ3kqJ3j1kRlLplR%m%LooJ2KnMNj4kQm%
6683e%NoJnLJmJLk%J1olLNLrJ2kJj1QnlJlkONkj0LNlLJoLkjJOqlJ5kqqQKlMJn
6739fnLJ5rj0J4LKqlKrJ8j5JKNL%lRLk2J3j4J1j3KJ2j0oJ2JpqJ5JMlj9N%OM%%
6785dP%lMQlj0KJ0Jk0J3%j3MJ1qpJ4Rj9MprQ%MJj0jJ5kj4PPqNoNJKklNOlJJmO
6835EoOnjOj8J2jmJPoPj5J4qjj%jlJ0j6QjRomJ0KJnOj1J5j1Nm%JQrNPrnmjJ4%
6885CpOj7RNOn%LqNkrJ7j7jO%j1J5joPNoqQkjNOpRj1J5qmRMrj9J2J%qNmlNJ6j6
6936hLLj3J9roMklJ4lkLPj5KJNkLklJJ%J5j7KPLmpJ3qpOrQnJ0kLj2PJnoJ2lno
6987a1QkMmK0k0KKK%kOk2PJ0Lj3jKJ6j2LLOj9J7j1k%J3%j0J0jOpjpJj2QRrlNJ2
$$ plain form
6631 5 -3 3 -3 -8 -2 -1 -14 -13 -7 -5 -2 -10 -3 -2 -8 -10 3 -10 -6 -7 -4 -15 -8 -9 4 2 -6 7 -4 -6 3 0 3 -4 -7 2 2 -2 -2 1 -5 -11 1 3 -2 2 7 -7 -9 -1 -5 -5
6683 -5 -5 0 -6 -5 -10 -7 -6 -10 -9 -6 -8 -8 3 -3 -6 -3 2 5 -4 8 6 7 -4 4 -1 -4 -3 -6 -8 -2 3 1 -9 -6 -1 -4 -1 0 -6 -3 -5 -6 -5 1 -7 -10 5 3 -5 -13 -5 -3 -6 -2 -1 -6
6739 -6 -11 -8 7 -2 -12 2 5 7 -1 -4 -2 -11 7 -8 -7 -5 0 3 3 0 9 12 -10 3 -11 0 -13 -11 1 -9 -15 -3 -2 -9 -17 -2 -1 3 0 -19 -14 -14 -8 -4 -4 -4
6785 -4 3 3 0 4 12 9 -1 1 11 12 -8 5 5 -8 -4 7 -1 -8 6 15 -4 0 -7 -16 -8 -8 -4 -3 -13 -14 1 -1 -15 -8 -1 -9 -4 -10 -5 -4 -2 -4 -7 -2 4 1 2 3 -1 5
6835 5 -1 5 0 -1 5 -13 -1 -2 -6 -5 2 -4 3 -12 2 -6 -7 -8 -8 -9 -12 -2 -18 -10 -11 -2 -8 -12 -2 0 1 -4 2 -9 6 -5 0 -4 -4 -3 5 -4 1 8 -1 -6 -10 -11 3 3
6885 3 -4 2 -15 -6 -1 5 0 0 3 -5 0 -2 -11 6 -11 -12 -6 -6 -17 -2 -3 -9 -2 3 -3 -11 -3 -5 -6 -1 5 -2 7 -4 11 3 -1 8 12 3 -16 -4 -3 -3 -11 -6 -10 -13 -8 8 -8
6936 -8 -5 -2 -15 4 -5 -11 -7 -9 -12 2 -1 -3 0 7 -8 -6 -5 0 -2 1 -1 -4 -3 -2 -2 13 -4 -2 5 8 4 -3 10 2 -5 1 -8 0 -5 5 3 6 -6 1 2 -3 -9 3 0 -5 -11
6987 -11 -3 -5 -1 -5 15 -5 -3 -1 1 1 -1 5 -17 -10 0 3 -10 -11 -9 7 -5 -2 1 7 -12 5 -6 -8 -8 5 5 -5 5 4 10 3 2 -5 -4 -16 -8 1 -8 -11 -6 6
7033FoJOlpKkJ0nJ1j2MqJ6j2KojNmJJ2kj3MOj2NRj2lkJ2%j1LJ3j0oRrkMjJ0kn
7080ePLpMkJ4j2KMj3JJ1jj2J2KooOoPkmJ1j5jJ5pkJ1%lqLNj0%kJ0%oJ0rLLmLm
7128@lKKkMPj3OKlnLNLj0JKrK0j2lomJ4jrk%KPmLOlQJj7NQnj1J6Lj9KQOpMjnQ
7180DKqOpk%JlJ5nqOorJ0ojlJ2nlNjJPnoJ1oPJjqMj4J5qNmPj6PLJJ1lj5kJNLj2
7232a7QqjJ1Mj1LLJjmKQj0J2j8%K1j0OPLrkPK%ojLj4K4j3lmjKrJ6ljqJ1kjj%m
7280hKjoLkNj%LMlj8K0j3NJ5nNolN%mPpJ3j8J0Olj0MKmj2J3noJ0rnJ1MOrj1J0
7327fNj4RP%mMj2NJ0j%oLlMopJ3mPoJ0rjKnlJ0OorMKmpLj3J6mNj0J4pJLKkkOm
7378dJMLj5MqJ2LkJ1j6Nj1QnqJ8lrR%K%jrPkkkPj2J2%PKj7%kJ1p%RJj2J2nJ2L
$$ plain form
7033 6 0 1 7 4 -3 -1 -3 7 2 13 1 5 -3 13 1 3 -3 -4 1 -3 -2 10 8 -5 -1 5 -7 -2 7 -5 -8 -10 2 2 -9 -6 7 -3 -9 0 -9 -11 -7 -8 2 0 -5
7080 -5 2 5 -2 2 0 14 2 4 8 -5 -4 7 6 -6 6 8 2 -4 2 -4 3 1 -3 8 -7 -8 7 0 -2 9 9 6 -2 1 6 -4 -4 -6 4 4 -2 8 -1 2 5 1 4 0
7128 0 -3 -1 1 -1 3 10 -3 3 5 2 -3 0 5 8 -2 -1 1 -8 12 0 -3 -9 -13 1 0 -9 -11 -11 -9 -2 -6 -3 3 0 8 9 -8 -3 5 0 -11 5 8 -11 -9 -1 5 -2 2 1 -4 4
7180 4 6 -2 4 -3 -5 -5 -4 -7 8 3 -5 1 -5 -14 -4 -10 -11 -14 -2 -7 -10 -5 -6 -5 2 -3 -9 2 -4 3 4 3 -5 -1 -15 0 -8 -3 -7 0 -16 -9 -6 -5 6 3 -12 -14 -13 -8 -5 -17
7232 -17 -9 -17 -18 -7 -3 -14 -11 -8 -7 -8 -12 -10 -2 -12 0 -18 -18 3 -7 -1 6 9 0 -2 5 7 7 1 0 3 -11 13 0 -3 -7 -8 -6 -15 1 -2 -3 -11 0 -2 -3 -4 -4 -8
7280 -8 -6 -7 -13 -10 -12 -7 -8 -8 -5 -1 -4 -22 -2 -15 -10 5 0 5 -1 -4 1 1 -3 4 -3 10 -8 2 8 5 -5 -1 1 -3 -15 -2 -7 -13 -3 -12 -17 -6 -2 4 -5 -16 -6
7327 -6 -1 -15 -6 1 1 -3 1 -11 -6 4 3 3 -3 0 -3 1 -5 -12 1 -3 4 -2 8 -1 -2 0 -5 -8 2 8 2 -7 -3 -1 -5 -12 -9 -22 -6 -10 -5 -15 -1 -8 -7 -4 -2 -4 -6 0 -4
7378 -4 -3 1 4 -11 -7 -15 -3 0 -2 9 -7 -2 -13 -5 -10 -18 0 -3 -12 -3 -3 -1 -1 -2 -11 -4 -6 -8 -10 -3 -15 -3 -3 4 6 -11 -11 -13 -2 -9 -9 0 1 -11 1 -4 8 11
7426A1j2RomoKljJ1pkJlQqJ2q%%mLNPjojpQkkMRrj5K1plKlRonJ1Oj0NNj0Qj0K
7477blJpJ7j1NpOj5NJ%MqJ7j0nOJKNlkpJ1npRLJmmPmkJ1qMj0J1koKmJ4j2lL%J
7527dkLnqOlmRnPkJ%J3j4PmPoqJ1NpLJj3J1kJ0njnMqRkJljK%NPj4LMlj0J1%lq
7579a0RoNoJ0qNnJ2j5J0jpOlRjj0KJ5j0LoQrjkLnmMKNjkJknPjKj4J6kMqlOMoj0
7630a5QkJ3jj4QjOoO%MJpK%%qnJ0j0%KKPmoNpOmoQJKKkKNnj%lOLj0QLjj0J0j1
7682iJ1J0nJpmLkKQj0Jj%NJqJ1j3PrNn%MPj0LJ0lnQjmPJj4NJjJJklRnK%nP%rK
7735bJ0j4J1j2%ONqkM%LmlpM%LjMNoMlNkJ3j3M%OkPj5lkOJ4qLj5kPLnQKj2%J4
7785A0qkJ0j5PLrQj3ONkjnQkJ3j0nPMopN%Jm%MkMjKknLpMJkkmJ2kPj3%RpLklQ
$$ plain form
7426 11 -1 8 2 -2 -8 -6 -9 -10 1 -6 -8 -7 -10 -2 -10 2 -6 -6 -6 -10 -7 -2 5 4 -2 -3 -10 -2 -4 -6 -2 7 -2 -17 4 -3 -6 -4 -7 2 -4 -9 2 8 -2 3 8 -2 6 -4 -2
7477 -2 -5 -4 -11 6 -5 0 -7 -1 -16 -11 -10 -10 -6 -14 3 -7 -12 -6 -5 -3 2 -1 -3 -10 1 -4 -11 -2 1 2 -2 -6 1 -3 -5 6 -2 2 -8 3 1 -5 -3 -7 7 -5 -8 -5 -5 -4
7527 -4 -6 -3 -8 -16 -10 -13 -17 -8 -13 -6 -8 -7 -7 6 -8 -1 -5 2 -4 -12 -1 4 -3 0 1 -12 -1 -3 7 2 1 -4 0 -8 1 -1 0 -3 -4 -2 -2 3 10 -4 -1 3 0 -10 1 1 -2 -10
7579 -10 -1 -7 -2 -8 2 -6 -1 -6 6 -9 1 0 -7 -1 -4 5 4 -6 -4 11 1 4 -2 6 -3 -4 -6 -3 -8 -12 -8 -6 -1 -2 -4 -3 -5 -10 -3 -4 -2 -16 0 -2 2 -6 -9 -3 1 -5 -15
7630 -15 -7 -9 4 3 -11 -3 -4 2 -4 2 2 6 7 0 2 2 2 -6 -11 -1 -11 -11 -9 -7 0 -4 -10 -5 -12 -6 -10 -16 -8 -7 -5 -3 -5 -3 2 -3 -4 -4 -7 -1 2 -8 0 3 2 -8 2 -9
7682 -9 2 12 7 8 1 -3 0 -2 0 8 -2 -1 -2 -2 3 4 -4 7 -6 1 -8 -3 -8 -8 -4 3 -7 -4 6 3 -2 6 5 1 8 9 -5 0 1 0 1 2 0 -3 6 1 3 3 -2 5 5 -4 -2
7735 -2 8 -6 5 -7 -7 -1 4 -4 -6 -2 -2 1 -3 -6 -13 -9 -9 -6 -7 -3 2 -4 0 -3 2 0 13 0 4 4 10 8 15 0 -3 -5 1 15 7 10 -5 -7 0 3 -2 6 8 -4 -4 10
7785 10 2 0 10 -5 2 5 -4 4 -9 -3 2 0 -1 -6 2 0 13 3 -2 5 9 3 -4 1 1 2 -2 -2 2 0 4 3 5 3 -2 1 -6 -2 -1 -3 -5 -9 3 1 8 -5 -5 4 -3 0 -2 -5 3
7838CjnlMJ1j3J2qJpJ3j2J2joKOnjK%NkPj4oQnoR%KmmKPnMJj4QJ%Rj9RPjQlj1
7889c%kkN%M%nnQOQ%j4kPqJnMOpMnoLRpLMj0Qm%JjKJ1oNqnRnJ5oj3K2rmj0J2m
7942ArQnLkJ4j3oLMj3J4Pp%RnLj5J3lkNoKj0QpJ9jj1%PmJ1poJ1LkMookMjN%no
7992bklj1J3%kJlJ4oPrjJ4rmMMNqKj%kJJLmkMMj4jRj4ORlmOolpJ8j4NRj5RknK
8044gJ5ojJJqJ0KoMKjqj0K1%rPnqR%KomMMJLrMNj0kjL%Qq%lQj0J5lklrOkNjPm
8098AJ3j3KRm%oJ1j1%%npJ7pj1RrJ9MlojpNj1J0NjlLLK%JjpNj8MQjpJ2oMkMpR
8148FKoN%njoOkRjj6LNN%Jlj0NMkqOjJ1JoOKpQJj1NqQmmKNMm
$$ plain form
7838 3 2 -3 -6 -2 9 -4 8 0 1 -6 7 -5 7 6 0 2 8 3 2 4 4 9 7 14 0 -6 2 -3 -9 0 0 2 -2 -6 -4 3 -2 2 3 -11 -3 -2 -2 7 -12 -3 4 3 11 8 -3
7889 -3 -3 -5 -7 -2 -2 2 2 -3 -8 0 6 14 14 0 -2 5 -3 -2 -7 -3 3 -4 0 -5 -11 -8 1 -6 -3 1 -9 -1 -5 -5 -4 -5 -3 8 2 7 -1 -6 3 -2 13 7 -6 16 7 3 -7 5 1
7942 1 -8 0 -5 -2 -4 10 -3 -9 -6 -2 -15 -1 6 -1 -1 8 3 6 -9 4 1 -1 4 -2 0 -10 -2 -9 10 9 -2 -2 5 1 12 5 -1 10 13 11 15 9 3 1 5 4 9 9 4 -2
7992 -2 -4 -7 -18 -5 -5 -7 -6 -9 5 -1 6 -3 -4 10 1 -3 1 5 10 2 4 3 3 1 2 3 6 2 0 4 8 -6 -7 2 -12 -6 3 0 -4 2 -4 -7 -14 4 -10 -5 4 -11 -2 -4 -9 -7
8044 -7 8 2 1 2 3 -5 5 7 1 5 7 6 -2 -12 9 9 0 7 2 -6 3 3 5 -1 -5 -1 3 4 7 -2 2 7 -3 -5 -6 -3 -3 5 -3 -3 -6 2 -8 7 4 2 -1 -10 -4 -6 -1 -2 5 1
8098 1 14 1 3 12 8 8 2 13 2 2 2 -3 -10 7 0 -11 -2 -11 8 12 9 3 2 -5 0 -11 -1 4 3 0 3 6 8 8 9 8 1 6 -12 -8 0 -1 -8 4 -2 2 0 4 -3 6
8148 6 8 2 7 7 2 1 -5 1 -1 8 7 -9 -6 -1 4 4 5 2 -8 -3 1 -1 -9 -3 -4 7 8 2 8 10 3 11 12 1 6 -2 6 2 -2 0 5 9 5
8191E
$$ Imaginary data points
##PAGE= N=2
##DATA TABLE= (X++(I..I)), XYDATA
0@%%%%%%%%%%%%%%%%%%Qj6J6j6J6j6K4l2L2l2M0m8N6o4P2q0Q8j04J20j36J52j68
40h8J84k00K24k50K74l04L36l71M11m52M96n46O02o64P35q15R03j001J115j251
60f62J413j609J851k161K573l152M033n542Q825k8377J9986L9996l8498Q612n14
75F774k4571P531J9924j2971N387J0547j1689j3559P137R577P72n965O259L681
89H834j3576j1688P959J4729R724o957j3863n050K503O453O127m026N95M388j0885
104d733n402J3470J786m905N602l083j1128M03O714P207L318n910p038m462K021
119f140J2167L59j1280M824N205r073K099N125p526K604P480n241j752m64o050
134g663Q624J1447q601q071L26l006O254J0716p402q833O132J536m524M401J362
$$ plain form
0 0 0 0 0 0 0 0 0 0 0 0 0 0 0 0 0 0 0 0 8 -8 8 -8 8 -8 16 -16 16 -16 24 -24 32 -32 40 -40 48 -56 64 -72 80 -88
40 -88 96 -104 120 -130 144 -160 176 -195 216 -236 260 -286 316 -348 387 -428 475 -526 589 -662
60 -662 751 -858 993 -1168 1405 -1747 2286 -3256 5569 -22808 -2822 37174 -1324 7288 6774
75 6774 -17797 -10266 9658 -3313 2074 12621 932 -12627 -5490 4087 4859 -1106 5153 8834
89 8834 -4742 -16430 -8471 6258 15982 9025 -4838 -9888 -7385 -932 5195 1169 1764 6152 -4733
104 -4733 -10135 3335 5121 216 5818 2735 -8393 -7990 -1276 5931 9249 3339 -3699 -8161 -6140
119 -6140 6027 6386 -4894 -70 5135 -3938 -1839 3286 -4240 -1636 5844 603 -1149 -1613 -7663
134 -7663 961 12408 3807 -4264 -3938 -6944 -690 10026 2624 -6209 -77 1459 -3065 1336 2698
149B698o636L159N931o005k714M780k423N62P596n754r348O252M854k846L062
164C168k02o601K076M202l268j250J565J47K031j65m301p97K911K925J721l380
180G82n415P05M885L196q53m418j969K602J087n9Q26k174j480M126J659m102k033
197b635R35J479L116j16n508j959L734K972J249j274m825o22M733M76k075J370
213A050o92j954K763O09m015N43L193j53j95j204l273J951M660j154k724o27j551
230b773J407M334j361m159J341K455l83J2r44k239J506L528k32k900k188K31L444
247A079K684k390l757l96J893K452J458k180l646M85L488R17k110j586J16J441
263e2J814j69k436j170J738K123J40k028k079P43K496N19j328r87o76N64K141
$$ plain form
149 2698 -3938 -779 5152 -853 -3567 1213 -1210 -648 6948 1194 -8154 -1902 2952 106 3168
164 3168 2966 -3635 -1559 2643 -625 -1875 -310 -163 1868 1703 -2598 -3395 -484 2441 4162 782
180 782 -4633 -3928 957 4153 3300 -1118 -3087 -485 602 543 1369 -805 -2285 1841 3500 -602 -2635
197 -2635 -1700 -221 2895 2779 -2729 -4688 -954 2018 3267 1993 -2832 -3454 1279 1755 -320 1050
213 1050 358 -1596 1167 1776 -2239 -1696 1497 1344 1149 -55 -3328 -1377 3283 2129 -595 -1222 -2773
230 -2773 -1366 2968 1607 -2552 -1211 1244 861 873 -71 -2310 -804 2724 2492 -408 -2596 -2365 1079
247 1079 3763 1373 -2384 -2780 -887 1565 3023 843 -2803 -2318 1170 2087 -23 -1609 -1493 -52
263 -52 1762 1593 -843 -2013 -275 1848 1988 -40 -2119 -1376 1120 1639 311 -676 -1352 -788 1353
280A353l3k706k54K587P36j441j169m78Q69K013J18k162j356Q12K135J490j535
297I79k843J21K331R61n60j479j737Q95L175M50l009j853J305K365J068j193k277
314a301p53J705K241K57k349k231R96K762O55j705j405O7J181J355l71k159q51
331a906J786J586p93j624m06R23J133L36q11j225n5J563J200j014j908O3J851
348F99Q16j167j409j77J125J592J22k143j682J424K393L8j913j416K28J531J488
365A549l08k048j269J419K410J75k183j512Q44J934Q36j110j969n80J589J954
381A731k04k307j193J536J700k51r60q77m85J234J556j036j786M05J355N56l35
398F39j239n30J388R67o25o84p74j69J906Q80k220j173J308P58L00J46j659j017
$$ plain form
280 1353 1320 -1386 -1640 947 1683 242 -927 -1405 -536 1477 1595 -567 -1923 -1111 1024 2514 979
297 979 -1864 -1743 588 1549 989 -490 -2227 -1332 1843 2293 -716 -2569 -1264 1101 2169 976 -1301
314 -1301 -2054 -349 1892 2149 -200 -2431 -1435 1327 1982 277 -1128 -1061 120 1475 1104 -1055 -1906
331 -1906 -120 1466 673 -951 -1357 -434 699 1035 224 -1001 -1056 507 1707 693 -1215 -1152 699
348 699 1515 348 -1061 -1238 -113 1479 1601 -542 -2224 -800 1593 1631 -282 -1698 -1470 61 1549
365 1549 1241 -807 -2076 -657 1753 1928 -255 -1767 -923 1011 1847 737 -1232 -1812 -223 1731
381 1731 1527 -780 -1973 -437 1263 1012 52 -825 -1310 -76 1480 444 -1342 -937 418 974 639
398 639 -600 -1130 258 1225 600 -84 -858 -1027 879 1759 -461 -1634 -326 432 732 878 -781 -1798
416a798K003J566r84j595r49Q66K497K45k457j036Q63J098J370k14k613r19K095
433C8J443m64j116j175L4J641J042q44j613m52J497J565o38j718m97J020J236
450I99k7j214o80L55P62R16m57j754K43J763l06r77L35l64k44J538l5k043L1J546
470C87M62j38r58j169J072J683l73q45q24p78J618J972j498j970L73P13J138R71
488A836k017k036J521J746Nl93j701j199K357J963j553j351L1q0J259J540j304
505F24k010L04J448Q88m09j523n28J028Q57J91o87j336K42J725J92j249n30K81
523d92O06M51m09n47k8K00Q51K78j582m21J844L06j165M8l62n02J738P27k155
542f14p51J240L56M28K42j716p54J863R49r27p42m50J21J436P96j366j626M93
$$ plain form
416 -1798 205 1771 787 -808 -1757 -891 1606 1851 -606 -1642 -779 319 1689 1475 -1138 -2057 38
433 38 1481 1017 -99 -1274 -1240 401 1443 599 -1014 -1466 31 1596 958 -760 -1257 -237 999
450 999 972 -242 -922 -567 195 1111 654 -1100 -857 906 600 -377 -42 -406 -650 888 853 -1190 -1159 387
470 387 849 711 -247 -1416 -344 1339 966 121 -703 -1481 137 2109 611 -1359 -986 -273 865 1836
488 1836 -181 -2217 -696 1050 1055 662 -1039 -2238 119 2082 529 -822 -791 -871 388 1928 624
505 624 -1386 -1082 366 1254 845 -678 -1206 -178 679 870 183 -1153 -911 814 1006 -243 -773 -492
523 -492 114 565 156 -391 -419 -219 632 910 -672 -1093 751 1057 -108 -60 -422 -924 814 1541 -614
542 -614 -1365 -125 231 659 901 -815 -1569 294 1243 316 -426 -876 -755 681 1477 111 -1515 -1022
560a022J937N82j272q81j33J05J472J052k030j716J507J186l68J06p24j187J297
577h9J521j075j090J53K77J001M28j674p90J324O68n7o8j201o28J547R81q61q39
596d72k68L34J006Q2j029l37M91N57M44o68j237N21J484Q4r20p13k82P42J208
615A027m0j274q07M66J123M52p41r05M9P80M69m28o45o1M78O74O9j193o94J312
635A11J022o62n55l18n39R98J408j021j459M90O41J41L63p02r32R79Q90p71m46
654c62o0k26J108R32j558j256J028Q53J98K55j044j301J002J540k47q79n94k00
672h11R50Q91q17r91K68N62M54J45j008r07J036J323m82r92k50LO30J046l64j400
692g14j00R31L96Km02p36K67R72j99p41PJ04K96P15n59j328M89J318j55n08k07
$$ plain form
560 -1022 915 1497 225 -656 -789 -684 788 1840 -190 -1906 -399 787 419 525 -199 -1386 -89
577 -89 1432 357 -733 -580 -303 698 1126 -548 -1338 -14 654 597 529 -672 -1300 247 1228 367 -472
596 -472 -740 -406 600 682 -347 -684 -193 364 808 140 -1097 -576 908 992 72 -641 -923 -181 1027
615 1027 987 -287 -1094 -628 495 947 206 -699 -650 130 599 171 -474 -535 -57 617 686 -507 -1201 111
635 111 1133 471 -84 -402 -941 57 1465 444 -1015 -525 116 257 620 -82 -1014 -35 855 84 -362
654 -362 -422 -648 460 1392 -166 -1422 -394 459 657 912 -132 -1433 -431 1109 862 -17 -611 -811
672 -811 139 1030 213 -778 -510 52 506 651 -357 -1264 -228 1095 613 -379 -629 -626 4 1050 686 -714
692 -714 -814 117 513 515 113 -623 -356 616 417 -324 -317 -213 83 798 239 -1089 -600 718 563 55 -152
713a52o22K73J352n9j247k02M66L82M98m07j081K74J048M8m19m03n63N24J313
732A023k93j315j87N71M86M85l29j155q8J034M77l54n83m58M35R47j78r13j26
751e21M20K93L53k84j004L2J191K61p55l92k6K21P14J86r09n43O21O68L0n30o50
772f24J60Q86K82o14n75j27N11Q47p9j130m21P06O76R6m49p94m8R44N17m86o51
793c73k25M41Q12Kr36l55N51M28J07k22o60k43Q47N52n75o30O5L84L52L5m90m08
815e41L28O00N0n21m26K52O36J32m91m28O9M64M57j86p57k90O21O44j41o68m33
836f29K90O97K57n21o73rO58O14k55q69l01O42O44m2n39n13M8P37N09m95p72j2
858e34O03M49j31n58l46L04N62J24m42n00R8O23K70m52m54O7L94K78r8m77k70
$$ plain form
713 -152 -774 -501 851 792 -455 -657 -191 191 689 282 -799 -525 523 571 152 -251 -814 -290 1023
732 1023 730 -585 -772 -201 285 770 441 -714 -802 232 709 355 -228 -686 -251 696 518 -395 -521
751 -521 -101 192 545 261 -743 -711 480 741 -14 -406 -432 -211 503 689 -220 -763 -142 526 556 26 -624
772 -624 -464 422 704 90 -485 -612 -101 746 667 -463 -884 -178 498 594 145 -649 -697 247 764 278 -373
793 -373 -598 -157 655 657 -279 -634 -83 345 452 230 -430 -673 174 726 151 -479 -414 -30 322 357 -133 -541
815 -541 -213 387 437 -84 -510 -258 378 510 19 -409 -340 124 581 395 -362 -652 -31 613 472 -196 -629
836 -629 -339 358 615 94 -579 -588 70 684 429 -440 -741 -99 545 503 -36 -549 -501 236 745 250 -522 -534
858 -534 69 518 387 -171 -517 -213 349 473 31 -469 -371 252 522 70 -384 -317 77 355 257 -220 -490
879d90L93N37q0n86k66L53M93M0l98m35N1N82L88l82o40o9N41N25j33o74l39M17
901a72N37J49m08o32j5P50M38m59n86p7L46N48Q5o37m44K99N50K49l52o44RO57
923A91K67k87l41k14J74O17O9o72k70L68L47O5k36m73L9N58K10l30l61r8L26N00
945D49r3o45j89M31L74J1k99m16QN88L64m77n34J11M19K75m5m92l77L95N77r1
967C44m14l01m9N46M63m98n63J97K83J87K04m37n84M99O37l31l32j6j21L90N02
988F06n52n83L63L27R5J33n56n26O74N98l92l15r5j81N00N46o04o05L48L40J09
1009B30P8n06m10N67N49k57l50k11r3N43N27m93o67J71M01J56R1k90n05K23O44
1030C98r5m77k8J22P5K97j15n79J01N88l7k47l2k87N5P18p5p29Q9L46j14K25O6
$$ plain form
879 -490 -97 440 360 -226 -492 -139 354 394 -4 -439 -388 194 582 200 -440 -509 32 557 424 -250 -589 -172
901 -172 365 514 106 -526 -541 209 647 188 -398 -475 -129 419 504 -133 -577 -278 272 521 169 -475 -466 191
923 191 458 171 -170 -384 -210 407 476 -196 -466 -98 249 314 78 -395 -356 202 412 82 -279 -377 -51 449
945 449 356 -289 -478 -47 327 338 39 -377 -369 219 583 106 -428 -317 102 377 332 -160 -537 -142 435 344
967 344 -70 -371 -420 126 589 91 -472 -275 8 195 399 -38 -622 -123 514 183 -149 -165 -286 104 606
988 606 54 -529 -166 161 256 389 -167 -693 -19 579 187 -128 -223 -404 96 642 38 -567 -219 121 230
1009 230 308 -198 -608 -41 508 251 -99 -310 -403 140 667 174 -493 -322 79 235 326 36 -469 -246 398
1030 398 303 -174 -202 -80 -5 292 177 -402 -301 287 250 3 -29 -316 -261 457 382 -347 -258 88 -26 199 265
1053B65o89R5P81j62m92Q4j05J04O89k30q69J37M47Q3K93k02q88J98Q82q7l04
1074C0l3m11J05Q47j27p77R7K84K4L29j39p29J30P31Jk97j35l07J20O80J7o41
1096b01j46K67J09J40Pm00r9M57J43l76j23J37Q8K30N3n29k16N66K52k25p8k58
1118b02k16O14L95o46k97L15J1J30L05n60m33O86L34l97q4j71k32O40M43o90l77
1139d32K65M0L30L34o51m74N77K60j89J11k30l59M99L55m88k04K63pJ17J58l96
1160a21k74M18K76k04j44j14l0K59J97k45k82J15K91M4j82k00j6K53K99j57m46
1181b63r3L29L12O8l32m53J24N22J55k09l19k57K74N52r7n19j09J75K33K93k42
1202A44n80J01N05J37r6k77l46K04N45j8l21j68q7K11L85j50m03Q2J62kR8j09
$$ plain form
1053 265 -424 -329 452 290 -202 -118 -223 -119 570 340 -529 -392 55 138 431 229 -659 -461 421 334 30
1074 30 -3 -414 -309 538 411 -366 -269 15 39 368 229 -500 -370 361 362 65 -70 -377 -257 423 440 -201
1096 -201 -347 -80 29 169 176 -224 -323 134 277 -99 -222 -85 3 233 286 -243 -459 107 359 134 56 -202
1118 -202 -418 196 591 -55 -352 -37 -26 104 409 -151 -584 102 436 39 -45 -216 -448 192 635 -55 -432
1139 -432 -167 -127 203 537 -114 -588 -11 249 60 171 -59 -418 81 436 -52 -256 7 0 117 275 -121
1160 -121 -395 23 299 95 -49 -163 -193 66 263 18 -264 -149 142 186 4 -196 -212 41 340 183 -263
1181 -263 -356 -27 285 353 21 -432 -308 214 369 160 -159 -416 -142 410 313 -206 -315 -140 93 386 144
1202 144 -436 -335 170 307 211 -66 -412 -208 337 319 -2 -170 -257 -46 339 189 -214 -132 30 28 126 17
1224A7k72J96L11j88k28O2L9J16J65j91k86J34K58K7j42j38j6J92J43j01k53o6
1246b21K78K50j33l38j06J67L28J50l19l94M9L59K53j10l50k20K40L30M3k54k87
1267b85J8L95J70k66k47j0J96K88J9m07k19K62L04L2j75k67o2K84K47j31k71o9
1289a94J62J94n6j74q9R4J91N3k51j91J69K44K9j40k03p1K68K29j44k59m4J29
1311e4K15L5k44j66J47K12L9j56k36J4L00J41j59k35j03J76L00Nl08j64J12K27
1333I8J18j21k66k9K45J47p9k23p7J75K07o0j93j34O6K71R9k52k03P7J75J35n5
1356A21k66r2K20J77m8j70j54J04K79J4k25j37M0J93K01j42l09MK28J41K5k18
1378a4k52J69K94k8j34j60r2K46K30j90k58L9J09J42Q7k52j94J98J88jo6k17n6
$$ plain form
1224 17 -255 -59 252 64 -164 -102 -63 53 218 27 -259 -125 133 160 18 -120 -136 56 199 98 -155 -221
1246 -221 57 307 174 -164 -270 -103 225 375 56 -338 -289 70 323 213 -137 -357 -117 213 256 2 -285
1267 -285 -267 128 298 32 -215 -225 -29 259 278 -129 -348 -86 218 250 75 -192 -254 30 277 146 -125 -194
1289 -194 -32 162 106 -68 -157 -63 128 181 -70 -261 -92 152 181 41 -162 -233 35 264 120 -139 -183 -54
1311 -54 161 196 -48 -214 -67 145 184 28 -208 -194 106 247 88 -147 -250 -74 226 231 -77 -241 -129 98
1333 98 216 95 -171 -200 45 192 113 -110 -187 -12 195 135 -58 -192 -126 145 244 -8 -211 -134 41 176 121
1356 121 -145 -237 -17 160 112 -58 -212 -108 171 185 -40 -177 -137 56 257 115 -194 -190 38 179 204 -14
1378 -14 -266 -97 197 169 35 -125 -217 29 259 69 -189 -150 -41 101 188 -64 -258 -60 128 127 61 -156 -212
1401b12K88J38j93r9k2J9K47J6k91n6J80P7L2p2k63P8K98k3j60o0r7J42K79j38
1425A08k84K1J21J29J04k12k51J48K35K4n8k20j28L03K03j58j69q3K0K95R5k86
1447d3j25R3Q1J75k6l48RK68rlj5k71O6L75j08k44R2l1PK88j56l22K24J28j01
1472DJ14r2k99K78K84l08r4R5j22J89K43l56k20K63P2K0R5k97j81L83J49j66n1
1495Cj58m8L59J22l10j22M5R8K42m8l33j6J51R1J25j64k92J42K43o0j1r7k07K29
1519a6K34k22q6P5j29J62K19l33j05L08p3q3J95k24j53M09J5l38J11M4j33L04
1541A81L1m40Q7K85j41P7O1m00O6M66j53k36J00j44M1L95j22l89Q9J28M9J94j48
1564G7l51J17K56L5k5j50j65J62K00n3q7j19l7K35L8j74j6krK03qk97O4J87r0
$$ plain form
1401 -212 76 214 21 -78 -100 -81 166 182 -109 -165 15 92 124 52 -211 -133 165 142 -18 -78 -175 -33 246 108
1425 108 -176 -155 -34 95 199 -13 -264 -116 119 143 85 -135 -263 40 243 85 -84 -167 -147 148 243 -43
1447 -43 -168 -75 6 181 155 -193 -184 84 75 72 57 -214 -148 227 119 -125 -33 -64 -57 231 75 -247 -23 105 4
1472 4 118 26 -273 5 289 -19 -113 -18 -140 49 292 -64 -284 -21 51 71 166 -131 -312 71 220 54 3
1495 3 -155 -203 156 278 -32 -154 -109 -11 231 183 -150 -166 -15 76 201 37 -255 -113 130 70 59 -38 -245 -16
1519 -16 218 -4 -90 -15 -144 18 237 -96 -201 107 34 -49 146 -78 -231 178 193 -145 -34 10 -123 181
1541 181 212 -228 -141 144 3 80 141 -259 -193 273 120 -116 -16 -160 -119 276 154 -235 -146 -18 31 225 77
1564 77 -274 -157 99 134 109 -41 -206 -44 156 103 16 -103 -140 95 133 -41 -57 -59 -68 135 127 -170 -106 81 -9
1589iQ2L2k83Q7K82j98p9J68j56OK93k56k43L66O2k16J55j03l11L75K75l63j01
1612a35R7j43K19L05l72k48K59M2J8J53k50k32L10J88j63n0j07o9K65J66k28j62
1634a37OQ0K10L3k29j34O3J41J04p3j47pN5N0P9j35q7J84Pj53O7L1j08J70R6k95
1660a29j7K36p5k2J46j97q9K90m1k25J35J4r3K02k9l17Q5K51n2%m9k63Q8L31k8
1685A52j55n8j38R6L10o2k61J9N3M0J41o2k41O0K22mj02o9p5J05J81Oj99j25P5
1710i1J71O3p5j20q7R7J56m4j21J7RJ8Q0n2j44J12J51j13p0Oo7J08J70j40j52
1735a18P5K8L7R2j02j45J32P4r6J7nr1J30R8j80q1J22N0L8K6j62r8J63J19o5n7
1761Ao5k7J38P5j21q8O9M9L7k8j09m8J19J10m8j39p0O8J29N5o0j60k3J56J03n5
$$ plain form
1589 -9 73 105 -178 -91 191 -7 -86 82 -74 -68 225 -31 -274 92 154 -62 93 -10 -321 54 329 -34 -135
1612 -135 -38 -181 38 343 -29 -277 -18 24 42 195 -55 -287 23 211 48 -2 -109 -178 87 253 25 -137
1634 -137 -131 -51 159 192 -37 -171 -108 33 137 64 -83 -90 -35 15 94 -41 -128 56 63 -90 -23 8 -100 70 166 -129
1660 -129 -146 90 15 -7 139 -58 -147 143 102 -123 12 26 -67 135 106 -211 -126 125 73 73 24 -239 -151 180 152
1685 152 -3 -61 -199 -103 207 145 -116 -97 -44 -4 137 75 -166 -106 116 112 10 -59 -134 -29 152 158 -41 -166 -91
1710 -91 80 143 68 -52 -139 -42 114 70 -51 -34 -25 -7 73 21 -123 -11 140 27 -43 -37 -104 4 174 34 -118
1735 -118 -43 -15 22 114 12 -133 -1 73 -23 -6 -11 -102 28 126 -54 -135 -13 37 75 101 -61 -159 4 123 58 1
1761 1 -64 -91 47 122 1 -87 -18 31 68 40 -69 -117 2 112 64 -75 -145 -77 52 107 47 -113 -136 20 123 68
1787F8r6o7L3J55J2j31n1N6N8O6m3j58%J52N9n3p6j02K9J66K7j12n5KL6J09l2
1814E2j22J2Q3Lpm4p1O4J19m3r2pK2O4N9n1r4J8O2K7l0o8k2Q0M6k6p2m1N8J06
1844H5j2j08n3K5R0P8o6j43J8Q2Q8jr5q5N9J16j4n5o8j8J07P1q8r2OO4Q4J2j08
1873b1q7O9Q8J6l6r1k5J00N5m2m3l0M0Q3qj00k9O2M9K6p2r7L8J09J0m0n7m2O9
1902fR6l3r9j2J4P6J8p4p1N0P2M3l2j00oJ04M0j8p0n3K5J13Lr5l7L0M8O7m1j11
1932e9J0P8K0j3n4p3N9J00l3o9j5lN9P6o2j09M3N7K3qn1n8O4Q1k3n9k2J7O9L7
1962H2p0q1K2O4L7j6r5k1P3P0j1p5l7L5N5K5m0q6JR1M4o4l8k5K5Q7L5j17n4Q0
1992dL4J7qj08j9J23L3p8j7oqJ04L1j29l6Q6kJ4Rq7l3J22K5o4j4lJO7L9j15l1
$$ plain form
1787 68 -28 -95 -62 93 105 -26 -77 -21 37 103 60 -98 -98 54 113 60 -16 -118 -89 77 104 -8 -63 -61 -25 84 52
1814 52 -70 -58 25 28 21 -23 -94 -30 89 46 -46 -53 -31 33 92 41 -53 -35 27 54 24 -44 -66 14 60 34 -38 -79 -21 85
1844 85 73 -35 -88 -63 27 105 39 -104 -86 -4 84 83 -12 -97 -38 78 64 9 -59 -77 30 101 13 -79 -73 -9 75 87 -21
1873 -21 -108 -39 49 65 29 -62 -87 13 68 26 -17 -47 -7 76 68 -32 -61 1 50 76 4 -93 -55 54 64 24 -33 -75 -6
1902 -6 90 57 -42 -54 -40 36 54 -20 -91 -41 31 74 42 -58 -64 40 80 62 -8 -61 -36 77 80 -15 -52 -22 26 93 52 -59
1932 -59 -49 29 49 36 -18 -91 -32 68 35 -34 -49 -52 7 83 21 -88 -45 12 35 27 -24 -82 -18 63 40 -19 -41 -24 45 82
1962 82 12 -69 -47 17 54 38 -57 -78 -5 65 54 -21 -58 -23 32 57 17 -69 -68 23 67 3 -35 -60 -35 52 87 -30 -84 -4
1992 -4 30 47 39 -69 -88 35 68 -10 -27 -33 -41 63 94 -35 -71 15 13 27 36 -51 -84 38 63 -1 -15 -18 -17 50 89 -26 -57
2023e7N6L4j0oo5k4R7L6p6l8L1K0L6J0p2n9P3O0k9l9j7j9Q8Q3q6p9N5L1J4K7p9
2054dj00R3R6n5m6j4l5N9J06p4j10M0M3PM7o5r4O9Q8n6Mno4N5J01o6p3M0L7k6
2084bN0l7p9M6Q4l1l0J5l2J2P6n2p5M8M4m6MJ5o0K8J05n5j04M8M1jL7k0j27K7
2114g1J22pn7om7K6J35k9j26K3O1k5O6pj47kJ49Kn8jn7qJ43K9j23k7J7NO0J6r1
2145c5l6R0J3k7K6m6k1P6L0q9l2L8PNK0m1l1M1M1k8KJ5l2L6J1n6oO9pm7OOl0Q9
2179E7M0j08m4N7K6K0Np6n2O8M1k3j1l9k1R8L8r6m3M2QL5L2r3p3Q7Q7m0km3l5
2210e8N8P1l5n2j0PL2L0m1m3L5M5rl1nj2K2N2l9p9QM4J3Kj1m3LO5kk5RrJ5J7m1
2245a7l9M1M1k4kpm5J8J00k2o8j2K3QL2j8m9LL9KQj8k6M5M3l6n4QJ2L4J8k9p1
$$ plain form
2023 -57 -1 33 23 17 -48 -72 25 61 -15 -53 -22 -2 34 44 -28 -87 -14 46 17 -22 -39 -58 30 113 27 -52 3 34 48 75 -4
2054 -4 -104 -11 85 30 -16 -30 -65 -6 100 26 -84 -44 -1 6 53 -12 -106 -37 51 -5 -1 -6 -70 -15 86 20 -53 -13 24 -2
2084 -2 48 11 -68 -22 62 31 1 16 -16 -4 72 20 -55 -7 37 -9 -5 10 -50 -22 83 28 -76 -28 13 12 49 29 -98 -71
2114 -71 51 44 -13 -19 -66 -40 95 66 -60 -37 24 -1 65 58 -89 -91 58 60 2 1 -56 -64 79 108 -15 -42 -25 -20 40 56 -35
2145 -35 -71 19 32 5 31 -15 -36 40 70 -19 -51 -13 -6 -1 19 -22 -53 -12 29 1 3 18 -14 22 33 -23 -29 40 33 -14 -8 -2 -32 57
2179 57 97 -11 -55 2 28 48 53 -23 -75 -7 34 11 0 -39 -60 38 76 -20 -63 -21 -13 22 54 -39 -112 -25 62 22 20 -23 -58
2210 -58 0 71 36 -16 -26 -19 13 43 2 -41 -6 39 30 -1 -6 -18 4 56 17 -62 -54 -10 3 5 -6 -49 -46 19 17 -8 1 -8 7 24 -17
2245 -17 -56 -15 26 2 0 -7 -52 -34 66 44 -24 -36 -13 -5 27 9 -40 -37 2 4 12 -6 -32 13 56 20 -34 -26 -14 20 38 9 -62
2278f2OO7J7j0l8j7K2K2J7l0j8mK6K0m6k3K6N7Ml1k3j4K3N7Po0n6L4N4jj3j1k8
2311b6L6K6pm3pK6L0j9n5j2L8K4mmm3j3M7N6l3l7j3J8K6j0klrK1Lpk5K3L9nk4
2346A2k8mK7J6nk6k8J1M1J4m0j4L1mkjj6j0K7K2l9k9JM5L0qm2j0LK3L9k1o1kO1
2381A3J2k3qmJ2L0Mk2n0J4L9K9n0m3J0K3L0Nl0l0K4K4J5j8l2QJ9%j0pJ0rL2Mm0
2416a9j6M2K0j3k3j5J2PPKk0j2M6K5l2k0J4JK1qj4k4QM8j7j1l1rM9Qk1j9qj0M5
2451A3J7n1l3L9J8Oj1k4RK2J3lk0k4RN5j5l9LK3%J8ok4rL9Oql2j2L4J0k2k0NR
2487eK0Nj6l4LL9Pl8k5J5J2NK7j5l8J7O5j4k9r%J6K0rm2LJ5J5K2l5l6L9L1l9j
2522iL0m3J3L2k5l3K0L1j1lpj6K3J4k0l%j9J7M1n7j3L5J6j1Qk1j5J8N1j7l5j5
$$ plain form
2278 -62 -56 11 28 18 -20 -37 -15 7 24 -6 -24 -28 -2 18 -28 -51 -25 32 36 5 -18 -32 -9 48 55 -5 -61 -27 27 26 13 2 -26
2311 -26 10 36 29 -14 -21 5 35 16 -39 -51 -13 11 7 3 -40 -53 -6 50 17 -20 -33 -15 11 1 -1 -4 -13 8 11 4 -21 2 41 36 12
2346 12 -16 -20 7 23 18 -8 -36 -25 16 30 -10 -24 7 3 1 0 -16 -26 1 23 -16 -45 -44 1 31 23 -19 -29 -26 -3 36 15 -46 -48 13
2381 13 25 2 -6 -10 2 32 36 14 -36 -22 17 46 -4 -47 -37 -14 16 21 -9 -39 -15 9 24 6 -26 -18 1 1 -9 -16 -6 -15 17 21 -19
2416 -19 -35 7 27 14 -9 -24 -12 -5 2 4 -16 -28 18 43 11 -9 5 6 27 19 5 -19 -11 37 20 9 -22 -31 18 26 5 -14 -22 -32 13
2451 13 30 -21 -54 -15 3 9 -2 -26 -17 5 18 15 -5 -29 -20 35 20 -19 -16 7 7 25 19 -5 -14 25 31 23 -9 -21 13 23 1 -19 -14 -5
2487 -5 15 20 4 -30 -27 12 19 -19 -44 -29 -17 -12 15 0 -38 -21 44 30 1 -8 -8 8 28 19 -23 -20 -5 10 32 -3 -39 0 31 -8 -9
2522 -9 21 -22 -9 23 -2 -35 -15 16 5 2 -5 -21 2 16 -4 -7 -7 -26 -9 32 -25 -38 -3 13 2 10 -11 -26 -8 43 26 -9 -24
2555b4K0K3J9l2j5JK5J3Lj3m5J6L7j5k8nK5l0L6K0n9kL9J1j4Kk7j4L5jk7J7Lj9
2589b5L2K0m5jN3k3l6M1Kl5L1J2n2K0L9j1%j8l0ON4ql2rj2LL7Mo9kO9Mj1nk2j2
2625c1M1K5k6l0lRL9Pl4j3NL3jJ3l3l5M1K9k9j5K3j5j2M3j2m6K6J6j2mJ2l0J8
2658aJ6l3NJ4j1nL2l1k3L9K2n3kL5k1J3L8l7k9L4K2j0J0l9pL6J2k8j3J8k7K5L8
2691C9l0l0K5J0j2J0rk5OL8rk6mLJ2K2j9k2NJ6pPKk4%L5ml7K1K9k8J6J9l6%L2
2727B5Lok2j3K0K3j6j3qJ5nRQn3J6L6k1k7J3lnL3Ol8k5L9QK4nm0MK4Kkjj3lK2
2765A1J3k1j7K4K3k8koQlPrj2mJ5J0lk2QJ6k1LK8j9k4K7Rl3%K7%pQj2k4K8J8N
2803B1j4k7J7%J6j3j4PJ3J2Jj6j5J8K9nl2%lJ6K0j8j8k0RL2j0k2oJ5%OQok0J9
$$ plain form
2555 -24 -4 19 38 6 -9 -8 17 30 33 20 -25 -9 28 13 -15 -20 5 -25 11 31 -28 -30 9 20 6 8 -19 -33 2 1 -26 -9 -6 -25
2589 -25 7 27 -18 -19 34 11 -25 16 18 -17 14 26 -26 -6 33 22 22 4 -26 -20 34 26 -6 -15 -27 -24 13 17 -52 -54 15 19 8 3 -19 -31
2625 -31 10 35 9 -21 -24 -15 24 31 -3 -16 -11 22 21 34 1 -34 7 36 7 -8 15 0 -12 31 19 -27 -1 15 3 -1 11 -19 -1
2658 -1 15 -18 -13 1 -10 -15 17 -14 -37 2 24 -29 -31 4 -17 -4 34 -3 -32 2 24 14 24 -15 -22 14 26 -2 -15 3 -24 1 39
2691 39 9 -21 4 14 2 12 3 -22 -16 22 13 -13 -17 -14 -2 20 1 -21 -16 0 -7 0 2 -22 -22 13 9 -28 -7 22 -6 10 29 -7 -7 25
2727 25 28 22 0 -13 7 30 14 1 -7 8 3 12 20 -33 -17 19 -2 -29 -16 -19 -24 9 15 -23 -48 -9 -1 23 18 -22 -18 6 8 6 5 -8 -11 11
2765 11 24 3 -14 10 33 5 3 -3 5 2 9 0 -12 -16 -1 9 6 -16 -8 8 -13 -10 18 -1 -25 2 11 -22 -22 5 5 -2 6 -6 -30 -2 16 21
2803 21 7 -20 -3 -3 13 0 -14 -7 6 18 19 3 -12 6 35 30 -2 -2 -5 11 31 13 -5 -25 -16 16 6 -16 -22 -7 -7 -1 7 1 -19 0
2839@J0nk5K5lJ3Mj8npJ9J3j2k0NRJ1j0LKMonLmmK0nk6jK5mplj1oJ1K5k2onRM
2882eQj2J1nNMJj9J1K0Oj3k5J1J7lJ6j6k0mJ6K4k6k0J5J0ommpJJ7oj5lJ9N%j2
2921hJmJ0J3%j0k2J3J1OnlNmLjjj4K6J3l0j2K1koJ0oolMllj2RJ2ok0J3kRLK2l2
2964a1qJ5Qkj2lRJ4kJj4pML5j3k4LJ8Jjj7JNPJ7j0k8MK0mmlqj0K0Nk0qNJ7%j0
3006a0j1K6Jj3MJ2j8JL5k0mRjlN%j0RoQqnj1QK3l0PPJmNlj8J6lLj9KjJ0MmJMn
3051fJ3Pj9rmK5KMrlKPRk5nJ9J5l0J9j1j3LK5k9J2mqJ9Mk8oK8j1lJ5ll0K2J1j6
3091a1mK0oqJ2k0KJ9mmOj2MK2mj9J3RmjQj9mJ2Rnj2PrJJ7k9lnJ9jJ1j2k2J6K2
3132A1j2Nj4j0OJ8nj1OJ9j8PJ6k4MJ2%qJ2rlK2j2k1L0rj9MJ0k1J3Qrj9J6J1k2
$$ plain form
2839 0 10 5 -20 5 2 15 19 1 -4 -11 8 21 9 -11 -6 3 14 4 7 9 13 7 2 5 1 -3 17 12 -14 -15 10 6 -1 -4 -15 -21 -10 15 -7 -13 -18 -9 -5
2882 -5 3 -9 2 -3 2 6 7 -12 -1 19 25 12 -13 -2 15 12 28 12 -8 -12 4 28 2 -18 -3 7 1 -3 -7 -14 -13 4 -2 -17 -20 -1 4 4 -8
2921 -8 -7 -11 -1 12 12 2 -20 -7 4 10 5 2 7 3 6 5 4 -10 16 29 -1 -13 8 6 0 10 4 -2 -5 -1 -4 -7 -19 -10 2 -4 -24 -11 -13 -4 -1 21 -11
2964 -11 -19 -4 4 2 -10 -13 -4 10 8 9 -5 -12 -8 27 14 -10 -7 11 12 11 -6 -5 0 7 24 14 -14 -10 10 6 2 -1 -9 -19 1 6 -14 -22 -17 0 0 -10
3006 -10 -21 5 6 -7 -3 9 -9 -8 27 7 3 12 11 8 13 13 3 12 6 14 6 1 -10 -2 21 -9 -2 5 6 2 7 4 -14 2 -1 2 -17 -15 -16 -6 -2 -6 -5 -1 -6
3051 -6 7 14 -5 -14 -18 7 9 13 4 1 3 10 19 -6 -11 8 23 -7 12 1 -12 -9 16 -13 -1 -5 -13 6 10 -18 -24 4 -7 -10 5 2 -28 -6 5 -11
3091 -11 -15 5 -1 -9 3 -17 -15 4 0 -4 2 -10 -6 16 12 -7 6 15 11 10 18 -1 -5 7 16 11 -1 6 -3 -2 15 -14 -17 -22 -3 -4 7 -5 -27 -11 11
3132 11 -1 4 -10 -20 -14 4 -1 -12 -6 13 -5 2 18 -6 -2 10 10 2 14 5 2 24 12 -9 21 12 -7 -3 7 -14 -1 7 -2 -21 -5 6 -16
3169a6Rj0lJ8jQoj5MOJ9j7pRJ7pMmj1JJ4Mlj6PoJ8lk1J1kjQJ0rj2K1j5rJ4mj9
3211a5J9Lj4lJ6k2RJ6j8KONj9J3loK1jk9J8K3qkRj6%OPj8kJ3knPrkkkK0j9lj1
3253a8K0%%npLLOj0MlQOj2JpNJ6Jj3KJ0j4K7j6k2J5J8k0J3Jj4Mjkp%%kOj1JJ1
3296cjLrJ2j3K1ojj9J3QKqRoLJ5j6qoJ4J0kj1pPNNNj1jmJ7j4Pj7jjJ8qk4J8JJ
3340cn%%nPMj0j0K1kJ2Pk4mJ4%NjLpoQkmJ1M%jrKknRqj4J8lmJjoQJ0j8kJKNkn
3390a1KNQj1J5rMJ2j1NLmKJLr%JKJj6JLjJ2j4nKJ2Oj3pj1J9knmnQk%OoL%J3j1
3437hMnPJ2JqjjKJ%NnpJ0pNKj8J3j1OpK%LmKJ3oJ2j5kLLm%Kj1LOjjqMJ6rJpQL
3488CoJ5j1%J1pJ3j9nNj%%rLJ5j7Mp%jRl%%qJ3lRr%O%J0j2%PkNj5NJ7j2kJ0j0
$$ plain form
3169 -16 -7 -17 -20 -2 -3 5 -1 -16 -12 -6 13 -4 -11 -2 15 8 12 8 -3 -2 12 16 13 -3 4 -2 16 13 -8 3 1 0 8 18 9 -3 18 3 -6 8 4 -15
3211 -15 4 7 -7 -10 6 -16 -7 9 -9 -7 -1 4 -15 -2 -5 -11 10 9 -20 -2 21 13 11 20 4 4 10 17 -1 -3 10 8 3 10 1 -1 -3 -5 15 -4 -7 -18
3253 -18 2 2 2 -3 -10 -7 -4 2 -8 -4 -7 1 7 -5 -4 -11 -6 10 11 -2 0 10 -4 23 7 -15 0 18 -2 11 12 -2 2 1 -1 -8 -8 -8 -10 -4 -15 -14 -3
3296 -3 -4 -1 -10 2 -11 10 4 3 -16 -3 5 7 -1 8 2 5 20 4 -4 -10 4 14 12 1 -6 1 6 11 16 5 4 0 17 3 10 -7 -8 -9 9 1 -23 -5 -4 -3
3340 -3 -8 -8 -8 -13 -6 -2 -12 -22 -1 -3 9 16 -8 -12 2 2 7 6 9 2 -4 4 2 -2 9 13 13 12 3 5 3 -2 7 -1 -15 3 0 -4 -3 -4 -10 -2 8 -10 -12 -11 -9 -4 -6 -11
3390 -11 -9 -4 4 -7 8 -1 3 15 4 9 12 8 10 11 14 5 5 6 8 9 -7 -6 -3 -4 8 -6 -11 -9 3 9 -4 -11 -22 -3 -5 -10 -14 -19 -11 -13 -13 -7 -13 -10 -10 3 -8
3437 -8 -4 -9 -2 10 11 3 2 1 3 4 4 9 4 -3 7 0 5 7 -11 2 -9 -3 -10 -8 -8 -5 -9 -7 6 0 12 -3 -5 -2 1 -3 -3 -1 -12 -9 -3 -4 -5 -13 -9 7 -2 -1 -8 0 3
3488 3 -3 12 1 1 12 5 18 -1 -6 -1 -2 -2 -2 -11 -8 7 -10 -6 -13 -13 -14 -5 -8 -8 -8 -16 -3 -6 3 -6 -6 0 0 10 -2 -2 5 3 8 -7 -2 15 3 1 11 1
3534AnJ7kj5J3pMPkmj1Rmj9QJ1qKPk3NPjPno%MJ4mRrNpJ1Oj4J0kkMKj0l%%j1J6
3582Ej2J0jnnRkmJ1kj1J3jk0J6j0mJ4Jj6MJ6mq%JmJ3Qj5J0olJJ9j3kQj0P%j1j
3625dOKj5JRrKJ4pk3OK4j7J2Jj4M%Ln%J1nJ0ppORj2MNj1MJ2Kj6PJ0j4NJ0j4jL
3669Ajj2J0%%jjj5jJ8lpOj8J4%K4k6PLmJ0LnqJ0MJkj7KJ2MklLj6J4Qmk2J9%j3
3713hQkorJ9nk2K5plOnj1J8Mj2PMj0J7KqlK2lj9J1%rK3mj9nPLOlj5RkPnjj2KK1
3759A3qj0qJ2j0OMj1OLJNoj0QJ0J0j2OjnMJ3j2pQJ0j0llJ4rQj7oMQnpJ2j4RKn
3803cnJ3mj4J0%mRMjpmnkJ4Noj0nJ7K%%NoMKLJoRmj6pL0k0mOomJKoMk0K0lMj2
3852a9J5lrJ1Mm%J5j6OkJLPOrmlKJ0lMn%nLJonMJ1j5RrMpkmPKlkljLJkRKjKQ%
$$ plain form
3534 1 -4 13 11 -4 9 2 6 13 11 7 -4 5 1 -18 -10 1 -7 -5 2 -21 -16 -9 -10 -3 -8 -14 -14 -10 4 0 9 0 5 -2 9 15 1 11 9 7 11 13 3 0 0 0 -11 5
3582 5 -7 3 2 -3 -8 1 -1 -5 6 4 -7 6 5 -15 1 -9 -13 1 2 -14 -10 6 2 -6 -6 -5 -9 4 12 -3 7 1 -2 -1 18 5 3 11 1 8 8 -3 -4
3625 -4 2 4 -11 -10 -1 -10 -8 6 -1 -24 -18 6 -11 1 2 -12 -8 -8 -5 -10 -10 1 -4 6 -1 -8 -2 7 -5 -1 4 -7 -3 9 11 -5 2 12 -2 3 13 -1 -2 1
3669 1 0 -12 -2 -2 -2 -3 -4 -19 -20 -2 -5 -12 -6 -24 -10 -10 14 -12 -5 -2 -6 4 7 2 -6 4 8 9 7 -10 -8 4 8 6 3 6 -10 4 12 8 -14 5 5 -8
3713 -8 0 -2 -8 -17 2 -3 -25 0 -7 -10 -4 -9 -20 -2 2 -10 -3 1 -9 8 10 2 -1 21 18 -1 10 10 1 24 20 1 -4 3 6 12 9 -6 3 1 8 3 2 -10 -8 13
3759 13 5 -5 -13 -1 -11 -5 -1 -12 -6 -3 -2 3 -3 -13 -5 5 15 3 9 8 3 7 20 8 1 9 19 9 6 3 17 8 16 -1 -7 -3 5 0 -7 5 -9 0 2 -3
3803 -3 -8 5 1 -13 -3 -3 -7 2 6 5 -2 -6 -11 -13 1 6 0 -10 -15 2 4 4 4 9 3 7 9 12 13 7 16 12 -4 -11 19 -1 -5 1 -5 -9 -8 -6 -12 -8 -28 -8 -11 -7 -19
3852 -19 -4 -7 -16 -5 -1 -5 -5 10 -6 0 -2 -1 2 9 15 6 2 -1 1 11 8 12 7 7 2 5 6 0 -5 -1 10 -5 4 -5 -1 -8 -10 -14 -7 -5 -8 -10 -13 -14 -11 -10 -12 -3 -1 -2 0 8 8
3905Hj1LmMKoLNMkoknJ0J0j5mNjOqMj1K0j6J0j1pRQrMJj5J3KJ6j3rNM%Lml%QO
3953A1Qj4J0%LrjnOqKooNJOroKQj5NPKLmJj5K1lmoNOnRnOOqkNlJMPj2lQNj4J0
4005A0mj7JJ0Qpkk0K1JJ%nj1J8mpKRJoPjm%QmmmPRnMKmQLpj3J3pJ1oj2LqJ1oM
4054D%j1J0njqNMj1LMlNmJ1lQj2J3%j1KmJ7mP%j1%NqmO%ojJJ5r%LJk4J4LLj6P
4102eMnnJ4j5%LJ3opQ%OjnkQRrJ6j6kRNj3J5Jj7l%OnO%j6MPlLj7NOlOj2J1oKR
4151CKmlMMkJrjJ8lkmKKQj0pNJ3j4lJ4k0J0oLqOJrOlqLl%J1j5LK3nj1nJ7qrNO
4200bqMJ6nj0J0K0k4%J4omlj4QOkJ0pplJ5j0j1jJ2Kj7OLj6J6J0qjnJ4NlJljLL
4244GKj4JRJ1mj0R%l%Oj8K%J1Lj1j4J3nONj4J%J2rj1Pk%MQj4LPOj6J0QNnmJ4l
$$ plain form
3905 8 -3 0 -4 0 2 -4 -1 4 8 6 0 -2 -7 3 13 -2 -6 -1 -2 4 -4 0 -11 9 -7 3 -8 -15 -6 2 -7 -3 -2 -17 -4 -2 14 1 -8 -3 1 1 4 0 -3 -3 5 11
3953 11 19 5 15 15 18 9 8 3 9 1 3 -3 -9 -4 -3 3 -6 -12 -10 -2 -17 -12 -5 -3 0 -4 -3 -18 3 0 -4 -10 -5 1 -4 5 0 6 12 4 2 7 4 5 9 16 4 1 9 14 0 10
4005 10 6 -11 -10 0 8 1 -1 -21 0 1 2 2 -3 -14 4 0 -7 -5 4 5 -1 6 5 1 1 9 5 1 -3 4 13 8 12 14 10 18 21 14 1 14 7 18 12 0 3 -5 6 0 4
4054 4 4 -7 3 -2 -3 -11 -6 -2 -13 -10 -6 -9 -4 -8 3 0 8 -4 9 9 -2 0 -4 13 9 16 16 5 5 10 2 -2 4 4 -2 -3 -2 13 4 4 7 8 -16 -2 1 4 -12 -5
4102 -5 -1 -6 -11 3 -12 -12 -9 4 -2 -9 -1 -1 5 4 -1 -3 5 14 5 21 5 3 12 17 4 19 20 3 0 0 6 1 7 7 -9 -5 2 -1 2 -15 -10 -4 -7 -1 -13 -2 -8 -6 3
4151 3 5 1 -2 2 6 4 5 -4 -5 13 10 8 4 6 8 16 6 -1 4 17 3 0 14 -6 4 -2 1 -7 -1 0 -9 -3 -6 -14 -11 -14 -14 -3 -18 -15 8 3 -8 -13 4 -4 -13 -8 -2
4200 -2 -10 -6 10 5 -5 5 25 1 1 15 9 5 2 -12 -4 2 0 10 3 -4 -7 8 -2 -13 -14 -2 0 -17 -11 -8 -24 -8 2 -6 -7 -12 2 7 4 5 2 1 4 7
4244 7 9 -5 -4 5 16 12 2 11 11 8 8 14 -4 -2 -2 9 12 1 -13 0 -5 1 6 -8 -7 -7 5 -4 -15 -8 -10 -10 -6 2 -12 -9 -2 4 -12 -2 6 11 6 2 16 13
4290A3nkmJ1k1J1NkokQj0QnolNNj2J1Nj1Rqk%Nj8%J3k3J2L0k2kJJ0J1lK%ljRj
4335A2j1RNkmJjpRKj0l%nKNj0RmrKJ5j6J2lnkOOnj1PRq%K0Rk9MPrONoLNkj1J6
4384A3nljLJj3Pj0O%rmJ2pljPmjJ0oQrQOrkJ5nPkmMj0J0Pj6jMlmkJ1ojJ2poMk
4434aJNj9rK1kJkRk3ORqKJ0mmLOlRlJ0kk3QJ4kjMj3qK0rRqpLJ0j4J0J%j6K1qr
4481fqOOnLnPjrK2j9MNKJoJ2lj0J1Okk%Qpj2POqkMlj2LJ1j1pK1jrj1Pj%JLNj6
4530a5ORj4OQQqkjJ2qkJ4nnLNj2LRj5J7JnOj2nNnKj6J2J%LokpK1k4JJ1N%qRjJ2
4578A1jLlj2RO%mnMLrJ2mrJ4pNj6QkNnKj0LOLnmpMPj2NnMj0JJ2nlJ3kJNlPQnK
4629A5j1jlPK1k0kjLj1Rkj2RmKMj4NlP%kLj2JlNJ%NmOJ5j3pJ0J0nJ%j1jJ4jnJ0
$$ plain form
4290 13 8 6 2 13 -8 3 8 6 0 -2 6 -4 4 -1 -7 -10 -5 0 -12 -1 4 -7 2 -6 -8 -8 -3 -21 -21 -8 -31 -19 11 -11 -13 -12 -2 9 6 8 8 5 4 13 12
4335 12 1 10 15 13 9 10 9 2 11 13 3 0 0 -5 -3 2 -8 1 -3 -12 -10 5 -11 1 -2 -7 -9 -3 3 -2 -13 -6 3 -5 -5 15 24 -5 -1 6 -3 3 8 2 5 10 8 -3 13
4384 13 8 5 4 7 8 -5 2 -8 -2 -2 -11 -15 -3 -10 -13 -14 -7 -11 -12 -2 -8 0 -9 -1 5 -4 -6 9 4 11 9 5 9 -1 9 16 0 -1 3 0 -4 -6 5 -1 -2 10 3 -3 1 -1
4434 -1 0 5 -14 -23 -2 -4 -3 -5 4 -19 -13 -4 -12 -10 0 -4 -8 -5 1 -2 7 4 14 12 -11 -3 11 9 8 12 -1 -9 11 2 11 3 -4 -1 9 -5 5 6 6 -10 11 3 -6
4481 -6 -14 -8 -2 -7 -4 -9 -2 -3 -12 10 -9 -5 0 2 3 -3 9 6 -4 7 13 11 9 9 17 10 -2 5 11 3 1 5 2 -10 -7 4 -7 -14 7 6 -3 -14 -7 -8 -8 -7 -4 1 -15
4530 -15 -9 0 -14 -8 0 8 0 -2 -3 9 1 -1 13 8 3 6 11 -1 2 11 -4 13 14 9 15 3 -2 3 -2 0 -16 -4 -3 -3 0 -6 -8 -15 6 -18 -17 -6 -1 -1 -9 0 -1 11
4578 11 10 13 10 -2 7 13 13 9 4 8 11 2 14 10 1 15 8 13 -3 5 3 8 3 5 -5 -2 4 7 2 -2 -9 -5 2 -10 -5 -10 -6 -16 -15 -3 -8 -11 2 0 1 6 3 10 18 13 15
4629 15 4 3 0 7 28 8 6 5 8 -3 6 4 -8 1 -3 -1 3 -11 -6 -9 -2 -2 -4 -1 -13 -12 -15 -10 -9 -9 -4 -8 -2 13 0 -7 3 13 8 9 9 -2 -3 11 10 5 15
4676A5j5K1k4J8pJnmjnM%MnnJ4j0qmJ0RMq%KOrK%QoOJNoQj4MJ7k2QMlnJ4%j8R
4724A0NkrjnOLj0QmpPj0kQoOjMOpj1OJ4oLJ3pOj0JJMj0QjNrjJpJ4Oj2lRj1lk%
4774crQLMj3nNJ3qJNkrOqJ3j3J7J0j8%J5pkKnJ5pNoLlrRqjMljJPj1j2J5%nJ0p
4822dJ0rjmMJ0j1rJ4qMOrPjOjJRj0kLPLj3nJ7j1J2kk0J6j5RKj0JLl%mLPLmj0%
4869iOMOn%J4j5MLj2LpJ2LllOPrORj4%K%LmOj4O%nmoNlQnJ0qomLJ4qJ4KjqOmn
4921@NPjrLK%N%PLj1pQj1%RmqO%Kj1mJ0kqNLKqLpNK%lMnRRq%PQj1J5lmj0PnlJ
4975DJJj1J9j1j3J1JK%rKMokjLj0NNmPoKRj0mJ1NJpjMKJ4j0J3rKkj0J0KKp%rN
5023Ej3J5j0MJ5j6nOJ2j3mkLLKqMrkJ4kjLPolpJ7M%pkPoJ6j0Nj6J2r%No%noRq
$$ plain form
4676 15 0 21 -3 15 8 9 4 0 -1 -6 -2 -2 2 -3 -8 6 -4 -12 -16 -6 3 7 -1 -1 1 7 -2 0 0 8 2 8 9 14 8 16 2 6 23 1 9 13 10 5 19 19 1 10
4724 10 15 13 4 3 -2 4 7 -3 5 1 -6 1 -9 -11 -3 -9 -3 -4 0 6 -1 -12 -6 8 2 5 18 11 17 7 8 9 13 3 11 10 15 6 5 6 -1 13 19 7 4 13 2 -1 -3 -3
4774 -3 -12 -4 -1 3 -10 -15 -10 3 -5 -4 1 -1 -10 -4 -12 1 -12 5 15 -3 -3 12 5 3 5 0 15 8 13 7 10 7 -2 7 -1 -2 2 -1 -2 -1 6 -5 -17 -2 -2 -7 3 -4
4822 -4 6 -3 -4 -8 -4 6 -5 -14 0 -8 -4 2 -7 0 -1 5 4 5 14 4 2 5 12 15 2 -3 14 3 15 13 -7 9 -6 3 5 -5 -4 -1 -4 -4 -8 -5 2 5 1 -9 -9
4869 -9 -3 1 7 2 2 16 1 5 8 -4 -1 -8 4 7 4 1 7 14 5 11 20 6 6 8 8 11 7 13 -1 5 5 0 -4 -10 -5 -8 0 -5 5 -3 -9 -13 -10 4 -4 10 12 11 3 9 5 0
4921 0 5 12 11 2 5 7 7 12 12 19 22 11 4 12 1 1 10 6 -2 4 4 6 -5 -9 1 -1 -9 -4 -1 1 -7 -4 -11 -6 -4 -4 -7 -3 -8 1 10 2 2 9 17 6 21 18 14 4 11 6 3 4
4975 4 5 6 -5 14 3 -10 1 2 4 4 -5 -3 1 -5 -7 -8 -5 -15 -10 -5 -9 -2 -8 -6 3 -7 -11 0 5 6 -1 -2 2 4 18 8 21 12 14 12 2 12 14 16 9 9 0 5
5023 5 -8 7 -3 1 16 0 -5 1 13 0 -4 -6 -3 0 2 -6 -2 -11 -13 1 -1 -2 1 8 2 -1 -8 9 13 13 6 4 11 5 21 11 16 0 12 3 3 8 2 2 -3 -9 0 -8
5071hJQj2%lKQj1QOr%J%OONolRp%LMpNoQJj0NOkkPKj4lQooNmmLoP%j1J2Rjokp
5126a1RJ5pJj2MK0j5%pJ3%JLlpLmL%kLLk2J3oj1J3jQj0J4j3lJJ0rPpKnQJkNo%
5173cKJLlJ2nMJ1mj0%JljNpj3J5qQkj4QNon%J0j7PNMokklJ3JnJ0Pj7J5Rj3MpN
5221ImNKokQLj0LJj4J6mmnjPnrlJ4oLJ%j3RPlJlLNkOqoQlJJ8%j7RPKj0j%kLol
5274AMRj7J7oj8K1%j8NpnNqOMJJoJ1kj4K1OroMKJ0n%lJPJlmrOLlLmjNmOj3jQn
5325cjOnNj1Pj1NkmJ0NmoJ1oJ1oqJ4%KKJ0rpPklJKomJJ%%j2jnJ0pjPpnJ6mLo%
5376a0kOkkPoRljQk0K3Qoj6J5j1J2nOkNqNlrKNj6O%mMj0J0mMkmLkj4J7Pj5KOj
5424h%QlJ0j5%NO%%%JmLjoJ5j2KJjlJLJ0qKj5LOlj4rJ2nKP%qOLPjkLK%LjJnNl
$$ plain form
5071 -8 -7 1 -11 -11 -14 -12 -4 -15 -7 -1 -10 -10 -9 -9 -3 3 8 2 -1 8 1 1 4 8 1 6 0 8 9 -1 4 10 8 6 13 15 1 -2 6 0 -6 -1 -5 -9 -6 -12 -5 -5 -16 -4 5 4 -2 -4 -11
5126 -11 -2 13 6 7 -5 -1 19 4 4 -3 10 10 11 14 11 4 7 3 6 6 4 7 10 -12 1 -5 -16 -3 -4 4 -6 8 -5 -8 -7 3 -6 1 -6 -4 -9 -1 0 -2 3 -3 -3
5173 -3 -1 0 3 0 12 7 11 22 18 8 8 9 6 5 10 3 -10 5 -3 5 3 -11 -3 2 -4 -9 -9 1 -16 -9 -4 0 -6 -8 -10 -13 0 1 -4 6 13 -4 11 20 7 11 4 9
5221 9 5 10 12 6 4 12 15 5 8 9 -5 11 7 3 -2 -3 4 -1 -10 -13 1 -5 -2 -1 -1 -14 -5 2 -1 0 -3 0 5 3 9 1 -5 3 0 1 19 19 2 11 18 20 10 9 9 7 10 4 1
5274 1 5 14 -3 14 8 -10 11 11 -7 -2 -9 -14 -9 -17 -11 -7 -6 -5 -11 0 -2 -16 5 11 2 -4 0 2 12 7 7 4 5 12 13 10 6 -3 3 6 3 6 2 1 6 2 8 -5 -6 2 -3
5325 -3 -4 2 -3 2 -9 -2 -13 -8 -10 -14 -4 1 -3 -9 2 -4 7 1 -7 7 7 9 11 21 12 5 12 10 7 8 10 4 0 1 2 2 2 -10 -11 -16 -6 -13 -14 -7 -14 -19 -3 -7 -4 -10 -10
5376 -10 -12 -6 -8 -10 -3 -9 0 -3 -4 4 -16 7 15 9 -7 8 -3 9 4 10 8 13 5 10 7 -2 0 5 -11 -5 -5 -9 -5 -15 -5 -9 -5 -7 -11 -8 -10 -24 -7 0 -15 -13 -7 -8
5424 -8 -8 0 -3 7 -8 -8 -3 3 3 3 3 4 0 3 2 -4 11 -1 1 2 1 -2 -1 2 12 4 6 -9 -6 0 -3 -17 -26 -14 -19 -17 -10 -10 -18 -12 -9 -2 -3 -5 -2 0 0 3 2 3 -2 3 0
5477@J8j8M%pROj1Jj0%J2pRrKqMoJ1j4QLj2Pl%MLnKJJqJ5oRJMj0%QpmRKJooNk
5528@ojOKnlOn%qJ8j8J1Mj9J1j1RJ0j4Plj3J7J0l%MLj1MKNLqQLJoJ%%rjLj0J2
5575Foml%JJ%nkkLjKmPkMklMLoMJ6k1LRqRjKLrLoJ1Rj2LJ0j8JNk0PpK0j9NmpJ1
5627a0J6j2olR%lQlJ0Nj2KRj6LRrkP%LjPj8J4Lj0LLj3MRorkL%n%OjRpm%lMJ8j7
5677hLKOKKjkJ0qjKjNkjJqMN%qkjkJ1j0rMMkkJnpJ8qJOJrKOjKMj1QMlNlKrJ3m
5732FJ0komKJMr%LqKqkPoJ0j5M%MkoRnJ0lJ1jpqJ1KnOmoQNoKPj4NJ2j0nJ2krJ2
5783A2jj3NMj6J1kpJOj5RPj2NMjLN%nJKKnJ0qj%JOLj0%nJ1pJJ2j1J2pKj1RNkj4
5831dMn%j%lpQk%J3nj0LPkOqJJ5j3kNmQ%%MnMj0Qj1J7q%Jj2PoL%MlmNLJjj0Jj
$$ plain form
5477 0 18 0 4 4 -3 6 12 1 2 -8 -8 4 -3 6 -3 -1 -9 -5 -11 0 -14 -6 -3 -15 -8 -11 -11 -7 -4 -9 -7 -6 -5 -13 2 -4 5 6 10 0 0 8 1 -3 6 8 9 3 -3 2 0
5528 0 -6 -7 -1 1 -4 -7 -1 -6 -6 -14 4 -14 -3 1 -18 -7 -18 -9 1 -13 -6 -9 -22 -5 5 2 2 6 9 -2 2 4 9 12 4 12 15 16 10 11 11 11 2 1 4 -6 6
5575 6 0 -4 -7 -7 -6 -5 -5 -10 -12 -14 -11 -12 -10 -14 -7 -9 -5 -7 -10 -6 -3 -9 -5 11 -10 -7 2 -6 3 2 4 7 -2 1 -5 6 15 3 6 16 -2 -1 4 -16 -9 -16 4 -15 -10 -14 -21 -10
5627 -10 6 -6 -12 -15 -6 -6 -9 -1 -4 6 11 -1 1 10 -6 -3 6 -3 -5 2 2 5 4 11 -7 7 10 0 3 6 -7 -3 6 0 -9 -11 -8 -8 -13 -13 -7 -8 1 -6 -10 -10 -13 -9 9 -8
5677 -8 -5 -3 3 5 7 6 4 14 6 5 7 6 11 9 8 9 1 5 10 10 2 0 -1 -3 8 -2 -11 -7 -3 -5 -7 -6 -11 -18 0 -8 -7 -1 0 -9 -7 -1 -2 0 4 -7 1 5 2 7 4 6 -3 10 6
5732 6 16 14 8 4 6 7 11 2 2 5 -3 -1 -9 -11 -4 -10 0 -15 -11 -11 -7 -9 -15 -6 -11 -1 -4 7 6 -1 -9 2 4 -1 5 1 -5 3 8 2 4 11 -3 2 14 4 -1 11 9 0 12
5783 12 11 -2 3 7 -9 2 0 -7 -6 0 -15 -6 1 -11 -6 -2 -3 0 5 5 0 1 3 5 0 10 2 1 1 2 8 11 1 1 -4 7 0 1 13 2 14 7 9 -2 7 12 10 -4
5831 -4 0 -5 -5 -6 -6 -9 -16 -8 -10 -10 3 -2 -12 -9 -2 -4 2 -6 -5 10 -3 -5 0 -4 4 4 4 8 3 7 -3 5 -6 11 3 3 4 -8 -1 -7 -4 -4 0 -3 -7 -2 1 2 1 -9 -8 -9
5883i%Pj4KJ2m%MpPLJ5nnpRkoQ%oJ2j6J2oj%j4RMj7LRkpJ1j2JOkoOLNmNkrMLM
5934A%Qj4NKnJ4j6J6Mj2J3j2NrkkR%jj0jJ3j7J2onLjMl%JJ1j0pNKMjJJMk%J0p
5981ErK%RlMrJOlOj2M%JPLj5qJ8j5Nj6J4KqJ2j6JJ4j0Mj7J4Rj5J4lpJ6jmJ0j7
6025gJ4jnKNklLolKnMLrJlLkJ%%JJpR%joRj4K1qpPMjoJ0PoPj5LOLpKj0J1kOj4
6078eMmNrL%LqmjOj2J4lLoMK%jLJQj5J4%nPnJjpJ7kjqJJ1kljLorRKqPj2LKmLp
6132a3J%JqJj0K3jJKJ0koNlmj%LMj3PPJqJ5nj1rJ9j7J0PoJPj1LrkkmJ1j2J3ml
6179a2kJ2onmPJmJ1lKNJ0j0KMl%MpmqOMmjPp%%j%lLLmkj1J7j7OLKrQpkPJ1KoJ
6231dJnRKjJmPJJ0j0jJlkJjqNrRkpJ1opL%knMJNj0J%KJ3lJmMmQqPoMMRj0KkoJ0
$$ plain form
5883 -9 -9 -2 -16 -14 -2 -6 -6 -2 -9 -2 1 16 11 6 -1 8 6 0 8 8 2 14 -2 10 4 3 3 -11 -2 2 -15 -12 -3 -5 -12 -1 -13 -12 -6 -8 -14 -8 -5 0 -4 1 -1 -10 -6 -3 1
5934 1 1 9 -5 0 2 -3 11 -5 11 15 3 16 4 9 0 -2 -4 5 5 4 -6 -7 6 -11 1 -5 -10 -7 -8 -4 -7 -7 -6 5 -5 -12 -7 -5 -1 -2 -1 0 4 2 2 12 5
5981 5 -4 -2 -2 7 4 8 -1 0 6 3 9 -3 1 1 2 9 12 -3 -11 7 -8 -3 -19 -5 -3 -11 1 -15 -14 0 -10 -6 -23 -9 0 -15 -1 -4 -11 5 4 0 10 -7
6025 -7 7 6 1 3 8 6 3 6 0 -3 -1 -6 -2 1 -8 -7 -10 -7 -9 -8 -8 -8 -7 -6 -13 -4 -4 -5 -11 -2 -16 5 -3 -10 -3 1 0 -6 4 11 5 12 -3 0 6 9 2 4 -6 5 3 9 -5
6078 -5 -1 -5 0 -9 -6 -6 -3 -11 -15 -16 -10 -22 -8 -11 -8 -14 -10 -8 -8 -9 -6 -5 3 -12 2 2 -3 4 -1 0 -1 -8 9 7 6 -2 -1 10 8 5 4 7 1 -8 1 3 -5 2 -10 -7 -5 -9 -6 -13
6132 -13 -12 -12 -11 -19 -18 -28 -5 -6 -5 -3 7 5 -1 4 1 -3 -4 -4 -1 3 -10 -3 4 5 -3 12 7 -4 -13 6 -11 -1 6 0 1 8 -3 0 -9 -11 -13 -17 -6 -18 -5 -9 -12
6179 -12 -14 -2 -8 -13 -17 -10 -9 -13 -2 -5 -3 2 12 2 4 8 5 5 9 2 -2 -10 -4 0 -4 -5 2 -5 -5 -5 -6 -6 -9 -6 -3 -7 -9 -20 -3 -20 -14 -11 -9 -18 -10 -17 -19 -12 -1 1 -5 -4
6231 -4 -3 -8 1 3 2 3 -1 6 7 17 7 6 7 4 2 3 2 -6 -1 -10 -1 -3 -10 1 -5 -12 -9 -9 -11 -16 -12 -11 -6 -16 -15 -15 -13 0 -3 -2 -6 -2 -6 2 -6 1 -5 -1 3 12 2 4 2 -4 6
6286FKjLrrJ1qloJ1rLnPj0JONoKmLMjRpOj0RQ%j2PpJ4koP%j0Pj0RQj1mRn%%nL
6338@j4ROj9RjqJ2onRPj8J1NNkmRkMOj0oJ0Pj9J7%rp%k%PKqKkNRmj4J1nnMKkk4
6388b8K3jj3N%LLllOkPmJ2j5J4KqRkLjJ1q%qJ4ppqOqJ3j5jQpoLJ0j9J0RlqPJn
6436a1NkJkPMlmKNkRj0PNj1J2ppJNnpJ4qjm%lj%mkLJjomJ0K%J1mQj0kJ0jpOpJ
6488gMj3J7Kj1J1pJ0pJ0j3Pj2J4nljJ3olPj0lkKj6J4pPLjpQqJ1LqOQnJLJ%ooJ9
6535A4klPJj0j2KkJ3mkJj4J3NppM%pmQqMnPLj1J%K0nnmJ4oJ0rM%kQMj1LLJjK%
6585A1mokLmOmj2OlJ2j3J0Kj4NjLJLrJ0Pj1JKj5K1Mj4NjJ8j4OJRj2OLnj6J2Jj1
6630cMLkj7J7Oj6jpQQpJ0pLqkJ7j3%KqQmPPk0J8JJ%JjqPLjLKk%pJkpONprOMoj7
$$ plain form
6286 6 8 7 10 1 -8 3 -5 -8 -14 -3 -12 -9 -14 -7 -17 -16 -10 -5 -11 -9 -13 -10 -6 -7 2 -5 1 -9 0 8 8 -4 3 -4 10 8 2 9 9 -1 6 -4 5 13 2 -2 7 2 2 2 -3 0
6338 0 -14 -5 1 -18 -9 -10 -18 -6 -12 -17 -8 -1 -19 -8 -3 2 0 -4 5 3 7 13 3 -3 7 14 -5 12 12 3 -4 -4 -6 -6 1 3 -5 -3 -5 0 9 5 -9 2 -3 -8 -4 -2 -4 -28
6388 -28 -5 -6 -19 -14 -14 -11 -8 -11 -14 -8 -10 -3 -7 5 -10 4 6 -2 7 5 8 7 18 10 10 2 16 9 2 -6 0 -8 5 -10 -11 -3 -10 -16 -13 -3 -22 -12 -3 -6 -14 -7 -6 -11
6436 -11 -6 -8 -7 -9 -2 2 -1 -5 -3 2 0 9 -1 6 11 0 12 5 -2 -1 4 -1 -8 6 -2 -3 -7 -7 -10 -11 -11 -15 -17 -14 -13 -14 -20 -24 -14 -12 -12 -1 -5 3 -7 -9 1 0 -7 -1 -8 -7
6488 -7 -3 -16 1 3 -8 3 -4 6 -1 9 -4 3 -9 5 0 -3 -4 9 3 0 7 -3 -6 -8 -6 -22 -8 -15 -8 -5 -6 -13 -5 -13 -2 1 -7 -1 7 2 3 6 7 7 1 -5 14
6535 14 12 9 16 17 7 -5 -3 -5 8 4 2 3 -11 2 7 0 -7 -3 -3 -10 -14 -6 -14 -10 -15 -8 -5 -16 -15 -15 5 0 -5 -9 5 -1 9 0 4 4 2 10 14 3 6 9 10 9 11 11
6585 11 7 1 -1 2 -2 4 0 -12 -6 -9 3 -10 0 2 -12 -7 -8 -5 -4 -1 -10 0 7 -4 -3 -1 -16 5 9 -5 0 -1 17 3 9 10 19 7 13 16 11 -5 7 8 -3
6630 -3 1 4 2 -15 2 8 -8 -9 -16 -8 0 -7 3 -4 -1 -9 -11 6 -7 -7 -5 -13 -5 -9 -2 5 -15 3 4 5 5 6 5 -3 4 7 6 9 11 9 9 2 3 1 -6 0 5 -2 -11 -5 -1 -7 -24
6683b4NK%LPolRJ5j2LMKMj5%NJ1rPjPkqlMkJ1nNj4LqKJ1oj0KlkJKJkJPrJkkJ1
6734bmJJPqLNKklRmjNmkLnmnJ3pmk%MoLRopNQrpJ0JpQmMlkljlJ3pKJOlOj3RjK
6791ALMj0mJ0Mjj0Qj0JJMLj5kMlmKNrK0j8J4lNlLlKOj8J6J3pqkJLKMrNPj2%Mj
6840CLj4OpJ0jj1Pnjj3J6Nj4MMjmJ0%j4LJ0NkmPmjQnKKpJ1jkMooOJoMqKJLpN%
6891borPkkNjjpMQJpRNqQLQjrQnKpRkK%j1LMnmjJ9qprJ5j6%KMrJJ3lJrOrNOJp
6947hR%Mj7J4%Qj0J2lj2QJ0qMpQNkj4M%njj4J2qPOk1NJ4Kj5M%klkJ6pPMLjj1M
6994aKJ0j4MljJ9jjj0qQoJ0kknNnJoKNrLLoj4MJ3rkPOpJlRpRkJ1m%%JMj2J3j1
7044aQJNj1NqQj6J0OllmkLoJ1pjlLj6OmJ0MqRqJ2nNrJ0mRPrj0MQmJQjj1LRlj8
$$ plain form
6683 -24 -19 -17 -17 -14 -7 -13 -16 -7 8 -4 -1 3 5 9 -6 -6 -1 10 1 8 7 14 12 4 1 5 3 14 9 14 0 3 -5 -3 8 2 -8 -6 -9 -11 -10 -8 -7 -9 -8 -1 -10 -9 -11 -13 -2
6734 -2 -6 -5 -4 3 -5 -2 3 5 3 0 9 5 4 9 5 3 6 1 -3 -8 5 -2 -6 -8 -8 -4 -10 -7 2 -4 -11 -6 2 -7 -14 -4 -3 -10 -2 -6 -2 -5 -7 -10 -11 -14 -1 -8 -6 -5 1 -2 4 -9 0 -1 1
6791 1 4 8 -2 -6 4 8 7 -3 5 -5 -4 -3 1 4 -11 -13 -9 -12 -16 -14 -9 -18 2 -16 -2 -5 0 -3 0 -3 -1 5 -13 3 16 9 1 -1 0 3 5 9 0 5 12 0 0 4 3
6840 3 6 -8 -2 -9 1 0 -11 -4 -9 -10 -23 -7 -2 -16 -12 -8 -9 -13 -3 -3 -17 -14 -4 1 -1 -5 2 -2 -3 5 0 2 4 -3 8 7 5 9 3 -3 3 4 -2 2 -6 -4 -3 0 -7 -2 -2
6891 -2 -8 -17 -10 -12 -14 -9 -10 -11 -18 -14 -6 -5 -12 -3 2 -6 2 5 13 12 3 11 6 8 1 10 8 10 10 -1 2 6 1 -3 -4 15 7 0 -9 6 -10 -10 -8 -4 -13 -12 1 -2 -1 -10 -4 -13 -8 -2 -1 -8
6947 -8 1 1 5 -12 2 2 10 0 12 9 -3 5 15 7 11 4 12 17 15 1 5 5 0 -1 -15 -3 -11 -4 2 -19 -14 0 2 -13 -9 -9 -11 -14 -16 0 -7 0 4 7 6 -5 -1
6994 -1 1 11 -3 1 -2 -3 16 15 14 4 -4 4 -2 8 6 4 -1 4 -1 0 -6 -4 1 -8 -5 -2 -8 -22 -18 -5 -14 -16 -9 -3 -10 -9 -12 -3 -10 -1 -3 8 4 4 4 5 9 -3 10 -1
7044 -1 7 8 13 2 7 -1 7 -9 1 7 4 1 -3 -5 -2 -8 3 -4 -5 -8 -5 -21 -15 -19 -9 -5 -13 -4 -12 0 -5 0 -9 1 -3 6 13 4 -6 -2 6 2 3 11 10 -1 2 11 8 -10
7094a0RKPqOkokJ8j6okOokOojKJ4ojoPrJNOJLOj0MJ7j2KkQj1%Pj0lMJ2j0j0nK
7143g%%mRjoPKNj6POnLJQqOKkomJ0nmPpPNJ0j4MpJ8pj2OKrlpOJ3kj2pPrJ1kj8
7194b2J5LjkJLJPQj0QlMj3L%MkpJ4j%mKLnJJ4j8nJ0j1NPlj5MJJmlRoo%PQjj4Q
7244ePjkJ2lJKjjK%joJjRj0kJ2mnoJnOMj1KLmLNrPm%LJJmKKjN%kPOoknJ2qJmJ2
7300A6lmLKj0Mj9J1jj0J0oMkMMj5MLqOJ2nrPkPrLJ4M%j4RpNoPm%LJ2j8nJ4J6l3
7347fJ6Lj3Rp%j0ONmp%JjlMkJ8k1KMJ0nML%MokmOM%mLOnJQj0njkPk%Mj0mJ0j2
7398hJ0j3J4nkmjqMOlPKjjJ3njJjLKOj3J7lj7J7j4NnpRMj0MKlQ%j8LOMj8RJo%
7447a0OLjnJ0j2LpPNlN%%NLmPrNMMj1%JoLOJrnMmJ1oJmnMpPLmKJ%Pp%lKMKj1N
$$ plain form
7094 -10 -1 1 8 0 6 4 -2 -4 14 -2 -8 -10 -4 -10 -12 -6 -12 -13 -11 3 -3 -4 -10 -3 -12 -11 -6 0 1 4 10 0 4 21 9 11 9 17 6 6 13 3 0 4 16 6 -4 -9 -7
7143 -7 -7 -7 -11 -2 -3 -9 -2 0 5 -11 -4 2 -3 0 1 9 1 7 9 7 1 -3 7 2 -2 5 -2 5 10 20 6 10 3 21 14 2 8 10 1 -2 -9 -3 10 8 -4 -11 -4 -13 -2 -4 -22
7194 -22 -7 -4 -5 -7 -6 -3 -2 5 13 3 11 8 12 -1 2 2 6 4 -3 11 10 10 6 8 11 6 7 21 3 -2 8 -3 2 9 6 -9 -5 -4 -3 -7 -10 -1 -7 -13 -13 -6 2 1 -13 -5
7244 -5 2 1 -1 11 8 9 11 10 9 11 11 10 4 5 4 13 3 1 13 9 4 -2 -1 -6 0 4 -7 -5 -2 -6 -3 2 -7 0 -4 -4 -1 0 1 -3 -1 1 0 5 5 3 10 16 10 8 3 15 7 8 4 16
7300 16 13 9 12 14 4 8 -11 0 -1 -11 -1 -7 -3 -5 -1 3 -12 -8 -5 -13 -7 5 0 -9 -2 -4 3 -6 -3 11 15 15 1 10 3 8 2 9 5 5 8 20 2 -3 11 27 -6
7347 -6 10 13 0 9 2 2 -8 -2 3 -1 -8 -8 -7 -8 -11 -7 -9 9 -12 -10 -6 4 -1 3 6 6 10 4 2 -2 4 8 8 4 7 13 8 9 17 7 2 1 -1 6 4 4 8 -2 -6 4 -8
7398 -8 2 -11 3 -2 -4 -8 -9 -17 -13 -7 -10 -3 -1 -2 -3 10 5 4 5 4 7 9 15 2 19 16 -1 16 2 7 2 -5 4 8 -2 2 4 1 9 9 -9 -6 0 4 -14 -5 -4 -10 -10
7447 -10 -4 -1 -2 -7 3 -9 -6 -13 -6 -1 -4 1 1 1 6 9 5 12 3 8 12 16 5 5 6 0 3 9 10 1 -4 0 -4 7 1 2 -2 -7 -3 -10 -3 0 -4 -2 -1 -1 6 -1 -1 -4 -2 2 4 -7 -2
7502bQqOnJ0Qj9QjNj%pJ7lj6J1j4J4j6Rj2J5j6J1j0jkj0J0RjqJ1j6PJJRnJ0j1
7544dkJ7qQ%j3lJ7mKjMqJmMJLj0MJpjkMj2LjnkJ1qPnQ%Mlj1J5kQkJ0j9Q%KOpO
7595A0oNj2J0lj5J8lljOqPplLLmjmJkNqJ2j1OnQ%OkkJOj2J0J8j9nJ1J3rjj8J4
7641IJlj5J7j3JLj1KKKoQj3OJNLqLpJQnNRrkOoNKjLLmlQ%J3j4%jLopJ0j2J%Nj1
7693a2OjKj4J0NqMm%OMLjlNopJ9okMlMqKJ1j3OMojMJJ%lqJ3r%PkKomnJ4j9J6L
7744Ek0OJ2j1MlJ1mNMkqPrJ7%rJ3nKj1MjlRq%oQpLj1jKJ7j1nNj5J3rPNj2Rj4J1
7791fK%KlJJ4onNJMmJ2j2j0J6kkPppLqnJ9pj0L%PnkmN%QmjNj6JO%NlJ3j2kLnM
7842bQKrJ1LnJ2j3kJ1kj0KLj1JmR%rLlRrklNlLNj%kJ5j2J0rQk5K1nMjoQKNqjR
$$ plain form
7502 -2 6 -2 4 -1 9 17 -2 6 5 10 9 9 2 19 16 0 11 -3 11 -5 4 -8 7 -9 2 -8 -9 -11 -21 -11 -2 -3 -11 0 -16 -9 -8 -7 2 -3 7 -4
7544 -4 -6 11 3 11 11 -2 -5 12 8 10 9 13 5 6 2 6 7 10 0 4 5 -2 -3 -5 -1 -13 -10 -11 -16 -18 -7 -15 -8 -13 -5 -5 -1 -4 -15 0 -2 6 4 14 -5 3 3 5 11 4 10
7595 10 4 9 -3 7 4 -11 7 4 1 0 6 -2 5 -2 -5 -2 1 -3 -4 -8 -7 -9 -4 -12 0 -11 -5 -10 -2 -2 4 2 0 1 7 -5 5 23 4 -1 10 23 14 13 -5 9
7641 9 10 7 -8 9 -4 -3 0 -11 -9 -7 -5 -11 -3 -16 -10 -9 -4 -1 -9 -6 -13 -12 -4 -9 -4 5 -4 -6 0 -6 -1 1 0 3 6 2 -1 7 7 20 6 6 5 8 2 -5 5 -7 -6 -6 -1 -12
7693 -12 -6 -7 -5 -19 -9 -4 -12 -8 -12 -12 -6 -2 1 0 -3 2 -4 -11 8 2 0 4 1 5 -3 -1 10 -3 3 7 1 0 4 5 6 6 3 -5 8 -1 -1 6 4 6 0 -4 -9 5 -14 2 5
7744 5 -15 -9 3 -8 -4 -7 4 0 5 9 7 -1 6 -3 14 14 5 18 13 15 4 8 7 4 13 5 5 -1 7 0 3 -8 -9 -7 10 -1 -6 -1 -16 -3 -12 -5 0 -12 -3 -17 -6
7791 -6 -4 -4 -2 -5 -4 10 4 -1 4 5 9 5 17 5 -5 11 9 7 14 7 0 3 -5 -10 9 2 -8 -5 -5 2 -3 -5 -9 -4 -4 4 0 -1 4 -12 -11 -5 -5 0 -3 10 -2 -4 -1 -6 -2
7842 -2 6 8 -1 10 13 8 20 7 5 16 14 4 6 9 -2 -1 -5 4 4 -5 -2 -5 4 -5 -7 -10 -5 -8 -5 0 -1 -1 -3 12 0 10 1 9 -16 5 0 4 3 -3 5 7 12 4 3 12
7892A2Nj2MlkOJoljJ2nJj3lOl%mPj2KPOoPj4J0JpJ7JpjRpKpKJ6kjJj0J0kjrmR
7942IrMMj9RLLmjrKJRo%Lj0J5nNnmKORj6MJ3joQpJ1j0%kNrJOmKoNmnpNRj0J0p
7994cRnmLojmJ6j6J2j1PJmJ0ok%OKlJMjJ0j6J5Qj3%nOj2QpmlOJlJnkJRj6J7Kn
8043bKpMj1OPjkJ3moOlKJ2j8LPLJj1MnmRKq%qONJ0oj4lMmONj3Oj0J2kNKknJ1P
8093A1Jj2%QnMJrJ2nj0OMnQ%rjmJ3j1pJ1mKpQqlNmLkJqML%PojLK1k0J2lJ6oj1
8142CJ2%lq%Kj5J9lnOnjj3RLj3kK%L%NNqkMKLNmplLPpMoLJ2PlnQlm%Oo
$$ plain form
7892 12 17 5 9 6 4 10 11 5 2 1 13 8 9 -4 -7 -1 -4 -4 -8 -1 -13 -11 -4 2 -4 3 -11 -1 0 -7 10 11 4 3 12 5 7 0 2 18 16 15 16 6 16 14 13 4 0 9
7942 9 0 4 8 -11 -2 1 4 0 -1 -10 -8 -7 2 -4 -4 -1 -11 4 -1 4 -1 -5 -3 3 12 -4 0 13 12 6 14 7 18 8 8 6 11 2 3 9 5 7 1 6 2 -3 -10 -5 4 -6 4 -3
7994 -3 6 1 -3 0 -6 -7 -11 5 -11 1 -10 -3 -2 -6 4 -2 -4 -4 2 4 1 2 6 5 15 -1 14 22 9 9 4 10 -2 6 -1 -5 -8 -2 -1 -4 -3 -8 -10 -9 0 -16 1 3 -2
8043 -2 0 -7 -3 -14 -8 -1 -2 -4 9 5 -1 5 2 4 16 -2 1 8 11 12 1 5 0 -4 5 7 -1 -1 -9 -3 2 12 6 -8 -11 -7 -11 -5 0 -13 -7 -17 -5 -7 -2 0 -2 -7 4 11
8093 11 12 0 0 8 3 7 8 -1 11 6 -4 2 6 1 9 9 0 -1 -5 8 -3 -10 1 -3 -1 -8 0 -8 -11 -6 -10 -7 -9 -8 -16 -12 -9 -9 -2 -8 -9 -6 15 -5 7 4 20 14 3
8142 3 15 15 12 4 4 6 -9 10 7 2 8 3 2 -11 -2 1 -12 -14 -12 -12 -9 -9 -4 1 -7 -9 -5 -3 0 5 1 -6 -9 -6 1 -6 -2 -8 -5 7 14 11 6 14 11 7 7 13 7
8191G
##END NTUPLES=NMR FID
##END=
