##TITLE=1H_AM_NV68
 CDCl3
 8 sc, 
 24.10.2023
##JCAMPDX= 6.0         $$ Bruker NMR JCAMP-DX V2.0
##DATA TYPE= NMR FID
##DATA CLASS= NTUPLES
##ORIGIN= UXNMR, Bruker Analytische Messtechnik GmbH
##OWNER= root
$$ XWIN-NMR		Version 3.5
$$ Tue Oct 24 15:39:23 2023 Russian Standard Time (UT+4h)  she@DPX200
##.OBSERVE FREQUENCY= 200.13135
##.OBSERVE NUCLEUS= ^1H
##.DELAY= (6, 6)
##.ACQUISITION MODE= SIMULTANEOUS
##.ACQUISITION SCHEME= undefined
##.AVERAGES= 8
##.DIGITISER RES= 18
##SPECTROMETER/DATA SYSTEM= spect
##.PULSE SEQUENCE= zg30
##.SOLVENT NAME= D2O
##.SHIFT REFERENCE= (INTERNAL, D2O, 0, 15.7039)
##AUDIT TRAIL= $$ (NUMBER, WHEN, WHO, WHERE, WHAT)
$$ ##TITLE= Audit trail, XWIN-NMR		Version 3.5
$$ ##JCAMPDX= 5.01
$$ ##ORIGIN= Bruker BioSpin GmbH
$$ ##OWNER= she
$$ F:/spectra/data/she/nmr/H-F/1/audita.txt
$$ ##AUDIT TRAIL=  $$ (NUMBER, WHEN, WHO, WHERE, WHAT)
(   1,<2023-10-24 15:38:17.21 +0400>,<she>,<DPX200>,
      <created by zg, POWCHK disabled, PULCHK disabled
       configuration hash MD5:
       00 E9 B6 7A A2 85 ED C7 34 08 36 98 17 FE 4E 26
       data hash MD5: 16K
       4D A7 7C 56 74 39 0F BA CA 96 A9 C7 F8 19 E5 4F>)
$$ ##END=
$$ 
$$ hash MD5
$$ A0 9D 22 00 D1 A2 53 97 E2 16 2A 4A A2 2C 1A BF
##$RELAX= 
##$RELAX= 
##$RELAX= 
##$RELAX= 
##$RELAX= 
##$RELAX= 
$$ Bruker specific parameters
$$ --------------------------
##$DU= <F:/spectra>
##$EXPNO= 1
##$NAME= <H-F>
##$PROCNO= 1
##$TYPE= <nmr>
##$USER= <she>
##$AMP= (0..31)
100 100 100 100 100 100 100 100 100 100 100 100 100 100 100 100 100 100 
100 100 100 100 100 100 100 100 100 100 100 100 100 100 
##$AQSEQ= 0
##$AQ_mod= 1
##$AUNM= <au_zg>
##$AUTOPOS= <>
##$BF1= 200.13
##$BF2= 200.13
##$BF3= 200.13
##$BF4= 200.13
##$BF5= 200.13
##$BF6= 200.13
##$BF7= 200.13
##$BF8= 200.13
##$BYTORDA= 1
##$CFDGTYP= 0
##$CFRGTYP= 5
##$CHEMSTR= <none>
##$CNST= (0..31)
1 1 145 1 1 1 1 1 1 1 1 1 1 1 1 1 1 1 1 1 1 1 1 1 1 1 1 1 1 1 1 1 
##$CPDPRG= <>
##$CPDPRG1= <>
##$CPDPRG2= <>
##$CPDPRG3= <>
##$CPDPRG4= <mlev>
##$CPDPRG5= <mlev>
##$CPDPRG6= <mlev>
##$CPDPRG7= <mlev>
##$CPDPRG8= <mlev>
##$CPDPRGB= <>
##$CPDPRGT= <>
##$D= (0..31)
0 1.2 0 0 0 0 0 0 0 0.06 0 0.03 0 0 0 0 0.0002 0 0 0 0 0 0 0 0 0 0 0 0 
0 0 0 
##$DATE= 1698147496
##$DBL= (0..7)
120 120 120 120 120 120 120 120 
##$DBP= (0..7)
150 150 150 150 150 150 150 150 
##$DBP07= 0
##$DBPNAM0= <>
##$DBPNAM1= <>
##$DBPNAM2= <>
##$DBPNAM3= <>
##$DBPNAM4= <>
##$DBPNAM5= <>
##$DBPNAM6= <>
##$DBPNAM7= <>
##$DBPOAL= (0..7)
0.5 0.5 0.5 0.5 0.5 0.5 0.5 0.5 
##$DBPOFFS= (0..7)
0 0 0 0 0 0 0 0 
##$DE= 6
##$DECBNUC= <off>
##$DECIM= 32
##$DECNUC= <off>
##$DECSTAT= 4
##$DIGMOD= 1
##$DIGTYP= 9
##$DL= (0..7)
0 120 120 120 120 120 120 120 
##$DP= (0..7)
150 150 150 150 150 150 150 150 
##$DP07= 0
##$DPNAME0= <>
##$DPNAME1= <>
##$DPNAME2= <>
##$DPNAME3= <>
##$DPNAME4= <>
##$DPNAME5= <>
##$DPNAME6= <>
##$DPNAME7= <>
##$DPOAL= (0..7)
0.5 0.5 0.5 0.5 0.5 0.5 0.5 0.5 
##$DPOFFS= (0..7)
0 0 0 0 0 0 0 0 
##$DQDMODE= 0
##$DR= 18
##$DS= 0
##$DSLIST= <SSSSSSSSSSSSSSS>
$$ [...]
##$SUBNAM2= <"">
##$SUBNAM3= <"">
##$SUBNAM4= <"">
##$SUBNAM5= <"">
##$SUBNAM6= <"">
##$SUBNAM7= <"">
##$SUBNAM8= <"">
##$SUBNAM9= <"">
##$SW= 18.05172834244
##$SWIBOX= (0..15)
0 0 2 0 0 0 0 0 0 0 0 0 0 0 0 0 
##$SW_h= 3612.71676300578
##$TD= 16384
##$TD0= 1
##$TE= 0
##$TE2= 300
##$TE3= 300
##$TEG= 300
##$TL= (0..7)
0 120 120 120 120 120 120 120 
##$TP= (0..7)
150 150 150 150 150 150 150 150 
##$TP07= 0
##$TPNAME0= <>
##$TPNAME1= <>
##$TPNAME2= <>
##$TPNAME3= <>
##$TPNAME4= <>
##$TPNAME5= <>
##$TPNAME6= <>
##$TPNAME7= <>
##$TPOAL= (0..7)
0.5 0.5 0.5 0.5 0.5 0.5 0.5 0.5 
##$TPOFFS= (0..7)
0 0 0 0 0 0 0 0 
##$TUNHIN= 0
##$TUNHOUT= 0
##$TUNXOUT= 0
##$USERA1= <user>
##$USERA2= <user>
##$USERA3= <user>
##$USERA4= <user>
##$USERA5= <user>
##$V9= 5
##$VALIST= <valist>
##$VCLIST= <CCCCCCCCCCCCCCC>
##$VD= 0
##$VDLIST= <DDDDDDDDDDDDDDD>
##$VPLIST= <PPPPPPPPPPPPPPP>
##$VTLIST= <TTTTTTTTTTTTTTT>
##$WBST= 1024
##$WBSW= 4
##$XGAIN= (0..3)
0 0 0 0 
##$XL= 0
##$YL= 0
##$YMAX_a= 666540
##$YMIN_a= -660937
##$ZGOPTNS= <>
##$ZL1= 120
##$ZL2= 120
##$ZL3= 120
##$ZL4= 120
##$ABSF1= 10
##$ABSF2= 0
##$ABSG= 5
##$ABSL= 3
##$ALPHA= 0
##$AQORDER= 0
##$ASSFAC= 0
##$ASSFACI= 0
##$ASSFACX= 0
##$ASSWID= 0
##$AUNMP= <proc_1d>
##$AZFE= 0.1
##$AZFW= 0.1
##$BCFW= 1
##$BC_mod= 2
##$BYTORDP= 1
##$COROFFS= 0
##$CY= 11.3945322036743
##$DATMOD= 1
##$DC= 2
##$DFILT= <>
##$DTYPP= 0
##$F1P= 15.7292609196834
##$F2P= 12.9074282941183
##$FCOR= 0.5
##$FTSIZE= 0
##$FT_mod= 4
##$GAMMA= 1
##$GB= 0.15
##$INTBC= 1
##$INTSCL= 1
##$ISEN= 128
##$LB= 0.24
##$LEV0= 0
##$LPBIN= 0
##$MAXI= 10000
##$MC2= 0
##$MEAN= 0
##$ME_mod= 0
##$MI= 1.114404
##$NCOEF= 0
##$NC_proc= 0
##$NLEV= 6
##$NOISF1= 3.799351
##$NOISF2= 2.8
##$NSP= 1
##$NTH_PI= 0
##$NZP= 0
##$OFFSET= 15.70392
##$PC= 1
##$PHC0= -23302.28
##$PHC1= 6.0527
##$PH_mod= 1
##$PKNL= yes
##$PPARMOD= 0
##$PSCAL= 0
##$PSIGN= 0
##$REVERSE= no
##$SF= 200.130013532006
##$SI= 16384
##$SIGF1= 3
##$SIGF2= 2
##$SINO= 400
##$SIOLD= 16384
##$SREGLST= <1H.CDCl3>
##$SSB= 0
##$STSI= 0
##$STSR= 0
##$SW_p= 3612.71676300578
##$SYMM= 0
##$S_DEV= 0
##$TDeff= 0
##$TDoff= 0
##$TI= <>
##$TILT= no
##$TM1= 0
##$TM2= 0
##$TOPLEV= 0
##$USERP1= <user>
##$USERP2= <user>
##$USERP3= <user>
##$USERP4= <user>
##$USERP5= <user>
##$WDW= 1
##$XDIM= 8192
##$YMAX_p= 0
##$YMIN_p= 0
$$ End of Bruker specific parameters
$$ ---------------------------------
##NTUPLES= NMR FID
##VAR_NAME=  TIME,          FID/REAL,        FID/IMAG
##SYMBOL=    X,             R,               I
##VAR_TYPE=  INDEPENDENT,   DEPENDENT,       DEPENDENT
##VAR_FORM=  AFFN,          ASDF,            ASDF
##VAR_DIM=   8192,          8192,            8192
##UNITS=     SECONDS,       ARBITRARY UNITS, ARBITRARY UNITS
##FACTOR=    0.0002768,     1,               1
##FIRST=     0,             0,               0
##LAST=      2.2672688,     0,               0
##MIN=       0,             -660937,         0
##MAX=       2.2672688,     666540,          0
$$ Real data points
##PAGE= N=1
##DATA TABLE= (X++(R..R)), XYDATA
$$ [...]
849D44j035q28K019J194k858j354L655J190m001p07M044O8l454O49K412j137r01
$$ 444 -591 -1419 600 1794 -1064 -2418 1237 2427 -1574 -2281 1763 1831 -1623 -974 1438 301 -600
866f00J127o68o85K197l09l003J289L271k422k789K995J712l018n01K193n84r80
$$ -600 527 -141 -826 1371 1062 -1941 -652 2619 197 -2592 403 2115 -903 -1404 789 205 -775
883g75J252m64j430J915J048k798k78L099m18k711R15J872q08r57M80R6L46M25
$$ -775 477 13 -1417 498 1546 -1252 -1530 1569 1151 -1560 -645 1227 419 -538 -58 38 384 809
901H09j061o01J584L76j750j67J561j32j184N6N40J29m8m35l12P67M84j003m41
$$ 809 -252 -853 731 1107 -643 -810 751 619 -565 -509 31 160 112 -323 -635 132 616 -387 -828
920h28J017L97q35m02O98N03n30m19M94L20m27J7K19k83N4O42n64p63J001N36
$$ -828 189 586 -249 -651 47 550 20 -399 95 415 -12 5 224 -59 -5 637 73 -690 311 847
940H47j491j14J650n85j422J150Q38j584m4J737r15j344J686N64j972L83J747
$$ 847 -644 -758 892 307 -1115 35 873 -711 -755 982 67 -1277 409 973 -999 -616 1131
957A131j139r63J612R1j704J033J280j796n70K205l29k048Q88J482j239p37J048
$$ 1131 -8 -971 641 732 -972 61 1341 -455 -1025 1180 851 -1197 -309 1173 -66 -803 245
974B45Q9o24L49k3o95O37P71j109p40J404O63j445n11J285O55j161n57R32N85
$$ 245 334 -290 59 36 -659 -22 749 -360 -1100 304 967 -478 -989 296 951 -210 -767 165 750
993G50n87o27K69O69R4o87m98P25Q19p31j155P28J401r17j469Q58J376r17j110
$$ 750 163 -464 -195 474 568 -119 -617 108 927 196 -959 -231 1170 253 -1216 -358 1018 101 -1009
1012a009P84O19l11k61j63M7P96m0j178J50J359k50j168K99Q55j95l96j34J13
$$ -1009 -225 394 83 -178 -341 -294 502 462 -716 -566 793 543 -625 -326 529 334 -62 -196 -83
1031h3O36j0r40n3J102j37j055J91O11j22k33k22k68Q20M38j353l46J744J12j877
$$ -83 553 543 -397 -450 652 515 -540 -349 262 140 -93 -315 -583 237 675 -678 -1024 720 832 -1045
1051a045L20J815p78j256J010N60r56L27N32r12Q5J330r67j143J573O94j938N8
$$ -1045 -725 1090 312 -944 66 626 -330 -3 529 -383 -298 1032 65 -1078 495 1189 -749 -691
1069f91J646p56j060J069J96j083M77P90r73l73J137k5r19K25O78j00k29k70R9
$$ -691 955 199 -861 208 404 -679 -202 588 -385 -758 379 354 -565 -340 338 238 9 -261 -162
1088a62P25k55r87N08J038p32q29P76N45o83JJ37k01N54q3j058L29J392r33j547
$$ -162 563 308 -679 -171 867 135 -694 82 627 -56 -55 82 -119 435 352 -706 -377 1015 82 -1465
1108a465J437J244j883o50J969Mj443N56Q12n19r8K62l84J33O43p78n53J167J73
$$ -1465 -28 1216 -667 -1317 652 656 -787 -231 581 62 -36 226 -158 -25 618 -160 -713 454 627
1127F27j251K01J215m82p89N70M39m72j27MO4J04k30m33M38M17o86j87R09L6q44
$$ 627 -624 -423 792 310 -479 91 530 58 -69 -65 -1 103 -127 -560 -122 295 -391 -578 331 367 -477
1148d77M27O04m70k97N17r2n25L99N0m37L00L17m22lN57k55m35M47K18o28o7M22
$$ -477 -50 554 84 -213 304 212 -313 86 136 -301 -1 316 -106 -109 448 193 -242 205 423 -205 -272 150
1170A50m5n38N5M67mm46O7N71p6m98L40L30m72j42M06j48l35L87R7m51L89N11
$$ 150 105 -433 -378 89 85 -361 -294 277 201 -297 43 373 -99 -241 165 17 -318 69 166 -285 104 615
1192F15o63j54Q75j61r09L33O20p33m86O04R3n86L05M45l26m2N65j55l52M76l9
$$ 615 -48 -202 673 512 -397 -64 556 -177 -663 -59 34 -552 -247 198 -128 -170 395 240 -112 364 325
1213C25o59J42L39m91k40N29N2k30K17K90J01R3n1j14K00r6n76p5J94l96l27L85
$$ 325 -334 -192 147 -344 -584 -55 -3 -233 -16 274 375 468 417 303 503 407 -169 -244 -50 -446 -773 -388
1235c88O1j21J75N27m4R6K34j30p1J29n08m11K98j0o86L9P01J2l70O14O56k56
$$ -388 -327 -448 -273 254 210 306 540 410 339 468 -40 -451 -153 -163 -849 -810 -109 -97 -467 147 803 547
1257E47j14K61J91m63m23j46l9k47m59j1M33K38k88K37P74L11l81j25M73J11q34
$$ 547 433 694 885 422 -1 -147 -186 -433 -892 -903 -470 -232 -520 -283 491 802 421 296 769 880 46
1278D6n48M58Or37k29R90K88q40L86J259m2o68M58N08m24o45j39j56rk96p06K63
$$ 46 -502 -44 -38 -975 -1204 -214 74 -766 -380 879 837 169 627 1135 711 66 -73 -229 -238 -534 -1240 -977
1300i77J103k84r13J096J360r94q28J277N74j475o09R03Oj009k66O68M12k36l49
$$ -977 126 -158 -1071 25 1385 391 -437 840 1414 -61 -670 233 239 -770 -1036 -368 44 -192 -541
1319e41N34J032k08j050M37J084p51j242M28O97n43r45L89Q69j06p19L13J071
$$ -541 -7 1025 817 -233 204 1288 537 -705 -277 420 -123 -1068 -679 190 84 -635 -322 749
1337G49n3j141R3J309m38j539L92J449n82j435O80J415m06j072M62Q36j04p30
$$ 749 696 -445 -352 957 519 -1020 -628 821 239 -1196 -516 899 493 -579 -117 719 615 -115
1355a15k86M45M18p10o81Q79Q45j062o41J454P22j511n66J533K30j666m15J230
$$ -115 -401 44 462 -248 -929 -50 795 -267 -908 546 1268 -243 -809 724 954 -712 -1127 103
1373A03J01j032q5Q56L31k49R7M16K35p4l44J6Q4n75o18L18L85p59o38J220R58
$$ 103 204 -828 -913 -57 274 25 122 538 773 699 355 371 455 -120 -738 -420 -35 -794 -1432 -212 746
1394G46q98m03J566O58j255o01J083J4j486n44P23N2r48j53J002R42n42l81J090
$$ 746 -152 -555 1011 1669 414 -187 896 910 -576 -1120 -397 -345 -1293 -1446 -444 498 -44 -425 665
1413F65J367p03j498N58J185j087j906J79J216m81j235M23J365L25m12L45R32
$$ 665 2032 1329 -169 389 1574 487 -1419 -1240 -24 -505 -1740 -1317 48 373 -39 306 1238
1430A238J53p38j53L29m77j211j37N09m11p72O04J042l2k34R10P90l24k78L28
$$ 1238 1391 653 500 829 352 -859 -996 -487 -898 -1670 -1066 -24 -56 -290 620 1410 1086 808 1136
1449A136K3q69q78J74L52q97j069R11J548m57j251J218K169n91j845M49J721p11
$$ 1136 1159 290 -588 -414 -62 -959 -2028 -1117 431 -26 -1277 -59 2110 1519 -326 123 1844 1133
1467A133k143k63J425n2j689l17J709Q02j091k59J792Q49j390p78J366M66j595
$$ 1133 -1010 -1273 152 100 -1589 -1906 -197 605 -486 -745 1047 1896 506 -272 1094 1560 -35
1484c5j082Q44N71r51p95O17J043j37n13L47R56j31n22K33J14n31l84M57k80q10
$$ -35 -1117 -273 298 -653 -1448 -831 212 75 -438 -91 865 734 212 445 559 28 -356 101 -179 -989
1504i89J86R33j33p29L72J055M6p83jQ46R8r89m51P79K83j028m42R24N98p82o89
$$ -989 -803 130 -3 -732 -360 695 741 -42 -43 803 901 -88 -539 240 523 -505 -947 -23 575 -207 -896
1525h96R20R75p49j176P67J303p51j435N76J338n38j070L07Q09Nn59j45K93M72
$$ -896 24 999 250 -926 -159 1144 393 -1042 -466 872 334 -736 -429 380 385 -174 -319 -26 446
1544D46k37o11J58Q06l57p69O16N79n86m59P14J43o47k9M21k74k85L19j21k39
$$ 446 209 -402 -244 562 205 -564 52 631 45 -414 300 443 -204 -233 188 -86 -371 -52 -173 -412
1564d12L40J58j73L6L20r6j0K10k46l63M35J59p76j29P16J17p42L1O62K47m85
$$ -412 -72 86 -87 -51 269 173 163 373 127 -236 199 358 -418 -547 169 286 -456 -425 237 484 -1
1585aj30M05K27k88m12J08K84l38m25K11L21o5l27K18M58mk76J12M11j13m28K1
$$ -1 -131 274 501 213 -199 -91 193 -145 -570 -359 -38 -103 -430 -212 246 242 -34 78 489 376 -52 -31
1607c1K37j04k58j15J39P7j51N7K46N9j12J47J61j56k61J68N4l38j96J61J24j97
$$ -31 206 102 -156 -271 -132 -55 -206 -149 97 156 44 191 352 196 -65 103 157 -181 -377 -216 -92 -289
1629b89m7J63K05Jl6N4K03J23k80j07K30n5l86n1K64r9k62J82K46n2kJ25P6Jj7
$$ -289 -336 -173 32 33 -3 51 254 377 97 -10 220 165 -221 -272 -8 -107 -369 -187 59 7 5 130 206 207 190
1654A90o8r4l8l6k06m3J08l1q0J23J80K9O5J23K1j7k0J6q2j40j19j9M2j50m8J33
$$ 190 122 28 -10 -46 -252 -295 -187 -218 -298 -175 5 34 99 222 243 226 206 222 140 0 -119 -138 -96 -246 -294 -161
1680a61J74P0k4Q1J59N3j33j46J5K5l19k74J88J48l37K5M16J75j94R5M12K3j19
$$ -161 13 83 59 140 299 352 219 73 88 113 -206 -480 -292 -144 -481 -456 -40 135 -59 36 448 471 352
1703C52j31ONj48m25j29K68l5m03K24N89Nk43L26M17k14k47P8m1l00l08j73J04
$$ 352 221 227 232 84 -341 -470 -202 -237 -640 -416 173 178 -65 261 678 464 217 295 254 -46 -354 -527 -423
1726d23L3j75l6M39L36j69P2O05R4l34j74K28j79m97j66M9q4j88k4K66L07Q5M5
$$ -423 -390 -565 -601 -162 174 5 77 682 776 442 268 496 317 -180 -346 -297 -381 -569 -593 -327 -20 65 110
1749A10L09L39j84k77J72r4m70l89O9p0k14r5L55K81Q1J12L40L34o2j96N8O7m13
$$ 110 419 758 574 297 469 375 -95 -484 -415 -485 -699 -794 -439 -158 -77 35 375 709 647 451 509 576 163
1772A63m45j0M5k54k22J96L73ML1K58M22P5k52qJ57k40m50k12J28j63k97mL81
$$ 163 -282 -292 -247 -501 -723 -527 -154 -150 -119 139 561 636 384 376 533 293 -157 -369 -241 -404 -701 -705 -324
1795c24K39m4K6M13L81k14k00K85L8n21k28J34j29m11P3J93P5j01J88K52J22J36
$$ -324 -85 -129 -103 310 691 477 277 562 600 79 -149 -15 -144 -555 -482 -289 -214 -315 -127 125 247 383
1817C83j27j8J27j28l81L1J50k86k80K18K69k83M1L56J56k48J54K04J8j40q6O0
$$ 383 256 238 365 237 -144 -113 37 -249 -529 -311 -42 -325 -284 72 228 -20 134 338 356 216 130 190
1839A90o6p1k04NJ51j06k08R4K71j22j72J92L05j22k32K87J42j94k08J03O2k00
$$ 190 124 53 -151 -146 5 -101 -309 -215 56 -66 -238 -46 259 137 -95 192 334 140 -68 35 97 -103
1861a03j77Q4J11p7j66J69J89O7q2J60K04pj57j4J13q5l83n9Q9j10k42K9K19M3
$$ -103 -280 -196 -85 -162 -328 -159 30 97 15 175 379 372 215 201 314 229 -154 -213 -124 -234 -476 -447 -228 -185
1885a85m6K15K94J29j58P0J55j39k89j05J7j76k60QJ81Q9o1J51L03J88n4N9J52
$$ -185 -231 -16 278 407 249 319 474 335 46 -59 -42 -218 -478 -470 -289 -200 -261 -110 193 381 327 386 538
1908E38l6k75j99r4n1l53j22J15J29j54J15M37K28j5L6K81P0l47j13l2q1m03j38
$$ 538 502 227 28 -66 -117 -470 -592 -477 -348 -502 -387 50 278 263 299 580 650 303 190 158 77 -326 -464
1931d64J7R7n9k6K87L17N0KK43J47j42k31j4r6l49k02J9qq8N0J47J79J87J17J82
$$ -464 -447 -350 -409 -435 -148 169 219 221 464 611 469 238 224 128 -221 -423 -404 -412 -500 -450 -303 -124 63 180 362
1956C62R2N0j37q3L4k38l31L5%j35k05L36J38l0J22L16l1O1O7j14j59J7j67l26
$$ 362 454 504 367 284 318 80 -251 -216 -216 -351 -556 -220 -82 -112 10 326 295 356 423 309 150 167 0 -326
1980c26L4K3j51o5K80J15j32K49K92n8j14J86j1k22l9R1k27j80Q2K0j13M7J91
$$ -326 -292 -269 -420 -485 -205 -90 -222 27 319 261 147 333 322 100 61 152 -75 -255 -173 -153 -266 -219 -28
2003b8n6J30J69l6n7J13qj88j8J07j98k27J01O9j73L2J48P0J1M7J17M7k7l6N5
$$ -28 -84 46 215 179 122 235 227 39 21 128 -70 -297 -196 -127 -300 -268 -120 -50 -39 8 125 172 145 109 164
2028A64P6j20j60J2L4j02j07P6J45n9j20J18J78o2oKP9j7o5j02K7k3j40n3J77
$$ 164 240 120 -40 -28 6 -96 -203 -127 18 -41 -161 -43 135 73 67 69 148 131 66 -36 -9 -32 -172 -225 -48
2053d8P3k39O5K51m7j15J43J87j43k5L8j4r5j13N8j02O0j3j22J06J77j37j10K77
$$ -48 25 -214 -149 102 55 -60 83 270 127 102 140 126 31 -82 -24 -126 -66 -79 -201 -95 82 -55 -165 112
2077A12J59l62jL38j51k88J19J98k50j29J89k2m3R3J12r2J51J00j58m2K49p2l76
$$ 112 271 -91 -92 246 95 -193 -74 124 -126 -255 -66 -88 -131 -38 74 -18 133 233 75 33 282 210 -166
2100a66J76J80m14j29L79kl18J23L23j67q0K26l0j34K00n0k30O4J90l36p4M30
$$ -166 10 190 -224 -353 26 24 -294 -171 152 -15 -95 131 101 -33 167 117 -113 -49 141 -195 -269 161
2122A61r2l50J98M14l29j56M53j3l33N2K50l05j10L03j70k51K44J19l25J34L21
$$ 161 69 -281 -83 331 2 -154 299 286 -47 5 255 -50 -160 143 -27 -278 -34 85 -240 -106 215
2143B15k84j99N06R9o04J76L83l39k63L34J04l73Q2L40k12j26L33j19j64L04R3
$$ 215 -69 -268 238 337 -267 -91 292 -47 -310 24 128 -245 -163 177 -35 -161 172 53 -111 193 286
2164B86m25N8L67k41l86M21J44n10M3M37j88k67K21K27k90L3K17r7r9J73r9j16
$$ 286 -139 -81 286 45 -341 80 224 -286 -243 194 6 -261 -40 187 -103 -70 147 50 -49 124 25 -91
2186i1J44P6k58QL23j91j89K52R1k36m6K99j02k26J29J57k31l9J27n3k8O5n7K4
$$ -91 53 129 -129 -121 202 11 -178 74 165 -71 -117 182 80 -146 -17 140 -91 -130 -3 -56 -84 -19 -76 -52
2210e2O6j2OK4Q4q4j10J16P0j49j8J59k6j56J16J14j66p3J90k2j03j7J11m6k3
$$ -52 14 2 8 32 116 32 -78 38 108 -41 -59 100 74 -82 34 148 -18 -91 99 77 -26 -43 68 22 -1
2235aL8o0j9L6j5j56J68J30k12m8L00p5k49J61J87j76j58K34M0k21R9J60k01J1
$$ -1 37 -23 -42 -6 -21 -177 -9 121 -91 -139 161 86 -163 -2 185 9 -149 85 125 -96 3 163 -38 -27
2259b7J06j8o6P4Rj21J8J47j58j38K77l2j91L1J93j46j14K07O8k07N1J41j17j2
$$ -27 79 61 -5 69 78 -43 -25 122 -36 -174 103 71 -120 -89 104 -42 -156 51 119 -88 -37 104 -13 -25
2283b5J76j19j18J45%j55P3J95j61j62K42P0k45j5K34q0j89J82Ok50J47J22j56
$$ -25 151 32 -86 59 59 -96 -23 172 11 -151 91 161 -84 -99 135 55 -134 48 54 -196 -49 73 -83
2306h3q5K10mj69J32J28k23OK26r5j27J17M0l8n4J01n1r1R7K6j20KJ30j77N4J32
$$ -83 -168 42 38 -131 1 129 -94 -88 138 43 -84 33 73 35 -19 82 31 -60 37 63 -57 -55 75 -102 -48 84
2332H4lk17R3J52k13p1K36M9k68P1J98o9r5P1J06j12Kl8j3J48o6j27K9J70p7j52
$$ 84 81 -136 -43 109 -104 -175 61 110 -158 -87 111 42 -53 18 124 12 14 -24 -37 111 45 -82 -53 117 40 -112
2358a12J85M6j48r5J46K3q3m5P5R6j04n7J5J03j0j05J7J77n2k13J75J13j00j30
$$ -112 73 119 -29 -124 22 45 -38 -83 -8 88 -16 -73 -58 45 35 -70 -53 124 72 -141 34 147 47 -83
2382h3K08Rj59k8K10j16r5M2L1ljO3j28L9R7j45pJ28J1k42J59R8j32j13K77m3
$$ -83 125 134 -25 -53 157 41 -54 -12 19 16 15 78 -50 -11 86 -59 -66 62 73 -169 -10 88 -44 -157 120 77
2408G7k41J04K08k04q8K43l6j29J20J12k59%K69j73j79K51M1l25J67K22k42j04
$$ 77 -164 -60 148 -56 -144 99 63 -66 54 166 -93 -93 176 3 -176 75 116 -209 -42 180 -62 -166
2430a66L58j10k75K39J05k63j6L10j25k56K72R7l13Q6K50j72j41K26o4l8L3R7
$$ -166 192 82 -193 46 151 -112 -128 182 57 -199 73 170 -143 -57 193 21 -120 106 42 4 37 134
2452A34k51R9K28l19m8K70r0k01K31J10l01J47R6j62r6K55j48j19K73mk56J55
$$ 134 -117 -18 210 -109 -157 113 23 -178 53 163 -138 9 105 -57 -153 102 -46 -165 108 104 -152 3
2474CJ89k69j01M03r8k75K11J63l05p4L65j59k07J93J11k71M5K04j93p3J89N5
$$ 3 192 -77 -178 225 127 -148 63 226 -79 -153 212 53 -154 39 150 -121 -76 128 -65 -138 51 106
2496A06k01P0Q0j68K3J07P8j58k0J86j07n5L7Q8q9n3J68J0j68N7J83j69j52K59
$$ 106 -95 -25 55 -113 -90 17 95 -63 -83 103 -4 -59 -22 66 -23 -76 92 102 -66 -9 174 5 -147 112
2520A12Q3l22P1K12k29n8K16k4k60J62J13j80N5J80j33j83L24l5k50J97J33k83
$$ 112 195 -127 -56 156 -73 -131 85 61 -199 -37 76 -104 -49 131 -2 -185 139 104 -146 51 184 -99
2542i9rK30o6j54J00J13k10R7J05j39j5J41j13o9J63m0k27J72J30j88K9J25j45
$$ -99 -108 122 56 -98 2 115 -95 2 107 -32 -47 94 -19 -88 75 35 -192 -20 110 -78 -49 76 -69
2565f9n4J76l1j02J79K3k55J45J70j51j72K54n1j80J40J60k16o1K81j88j11J56
$$ -69 -123 53 22 -80 99 122 -133 12 182 31 -141 113 62 -118 22 182 -34 -95 186 -2 -113 43
2587D3P1k47N3K24j86j15K18K8k58J32J49j37p4J38l4q9P4R8j16RJ21l4r3KQ5
$$ 43 114 -133 -80 144 -42 -157 61 89 -169 -37 112 -25 -99 39 5 -84 -10 88 -28 -19 102 68 -25 -23 62
2612F2%j4m3J12j22k6N3nj13O2J76j35j59J41Q3j88Q4J22p4j27J88n8j37R1J59
$$ 62 62 48 5 117 -5 -31 22 17 -96 -34 142 7 -152 -11 72 -116 -32 90 16 -111 77 19 -118 -27 132
2637A32j93J6J36mj53P3Q6j31PJ61p7j81J70L9j00m3J27j01r1J65K2j16lN7Qm8
$$ 132 -61 -45 91 87 -66 7 93 -38 -31 130 53 -128 42 81 -19 -62 65 -36 -127 38 60 -56 -59 -2 6 -42
2663d2L7qj7J1K6P6j17J4L4J7k4pO6j08L9J18n5j13Q0N5j35j2J34q4l5L0M9p8
$$ -42 -5 -13 -30 -19 7 83 -34 -20 14 31 7 0 66 -42 -3 115 60 -53 27 82 -53 -65 69 -15 -50 -20 29 -49
2691d9%J04r2k2J27o1j93J94N8j18L0J24j37j0J83j9k30J24P7j59L4J40o6r3J10
$$ -49 -49 55 -37 -59 68 7 -186 8 66 -52 -22 102 -35 -45 138 119 -111 13 90 -69 -35 105 39 -54 56
2716E6L6k28R5J13j05q6J90n6j77J67K5j07J0J64j10r8J89K4j49Q5J00j88OJ49
$$ 56 92 -136 -41 72 -33 -119 71 15 -162 5 30 -77 -67 97 -13 -111 78 102 -47 38 138 -50 -44 105
2740A05n1q4J44k9j61N8O8k9n0N1k2k5l4J4O3L0j01l8J13n0o1P8J06j76lJ30j3
$$ 105 54 -30 114 85 -76 -18 50 21 -29 22 0 -25 -59 -45 18 48 -53 -91 22 -28 -89 -11 95 -81 -84 46 33
2767C3j30J28J7j21J01P2j58o0K75j11j91J96J09k82K2K73j36k33K06J14k26J7
$$ 33 -97 31 48 -73 28 100 -58 -118 157 46 -145 51 160 -122 -100 173 37 -196 10 124 -102 -85
2789h5J78j84J4J32n0j19J89ok16P8K68j58k16K52R4k79k2K15j6j29J5J04J0o0
$$ -85 93 -91 -77 55 5 -114 75 69 -147 -69 199 41 -175 77 171 -108 -130 85 69 -60 -45 59 69 9
2813Ip9Q0M4q4q2J47J4p0p5Q4j3J9%m8J20j9j44L3K14k7k40M5K69j20k65K27J39
$$ 9 -70 10 54 -30 -112 35 49 -21 -96 -12 -25 -6 -6 -54 66 47 -97 -64 150 123 -117 -72 197 77 -188 39 178
2840A78k77j9J56oj16N4K1L9J1o3k8J37n6j80J12J32o4j49J29N5l5r9Q1K8P8j39
$$ 178 -99 -118 38 32 -84 -30 -9 30 41 -22 -50 87 31 -149 -37 95 31 -118 11 66 31 -68 13 41 119 -20
2866b0n9K00M6k83rK66n5k80K13J58k50q3K10Qj20R2k1j01J33l3q8N3R9j71p5
$$ -20 -79 121 167 -116 -125 141 86 -194 19 177 -73 -156 54 62 -58 34 13 -88 45 12 -76 -23 76 -95 -170
2891a70K23N1k77M5L54k03r9Q2J78k08j0R0Qn9K2n8L9J00j59l2K11m4k15K6K32
$$ -170 53 104 -173 -128 226 23 -76 6 184 -24 -34 56 64 5 27 -31 8 108 -51 -83 128 84 -131 -105 127
2916A27j13j40N7N7O4p9o0L0J63r9j69K14J00k55nK52l2k54J05J29p2o3j4kR5
$$ 127 14 -126 -69 -12 52 -27 -87 -57 106 7 -162 52 152 -103 -108 144 112 -142 -37 92 20 -43 -57 -59 36
2941C6L0j64M9K17j36k52K10J82k69m4K26J2k17j2J86M0j35q6J22J21q9j88J85
$$ 36 66 -98 -49 168 32 -220 -10 172 -97 -141 85 97 -120 -132 54 94 -41 -127 -5 116 27 -161 24
2964B4K32k66j53K33R2k26q3K13J9j60m2P3J90j64o2P1J63r4k66J57J95j66k04
$$ 24 256 -10 -163 70 162 -64 -147 66 85 -75 -117 -44 146 -18 -80 -9 154 60 -206 -49 146 -20 -224
2987b24K15J67k12p6K32J6r9j2k5J16m9r5J0J31M6k64Q3J56j28r1J14J54j62r7
$$ -224 -9 158 -54 -130 102 118 19 7 -18 98 49 -46 -36 95 141 -123 -40 116 -12 -103 11 165 3 -94
3011i4QJ48m9r3kJ84n8k00O3K35k06o9J37J52j61J0R5r1l5J15q1r3J62n2k05J96
$$ -94 -86 62 13 -80 -82 102 44 -156 -93 142 -64 -133 4 156 -5 5 100 9 -26 89 8 -85 77 25 -180 16
3037A6J62k49j18L43n5k68K01J26k01l5J63j08j02Q4O7j07R7M6j30J00J44q6j85
$$ 16 178 -71 -189 154 99 -169 32 158 -43 -78 85 -23 -125 -41 26 -81 16 62 -68 32 176 90 -95
3060i5K25lk48O1J38j13q2J31Pr1N2P6l9M4M7j48j3J11j20nJ2N2j22M8R4O1j58
$$ -95 130 127 -121 -60 78 -35 -117 14 21 -70 -18 58 19 63 110 -38 -51 60 -60 -65 -53 -1 -123 -75 19 80 -78
3087g8Q2J08o6o3L1N1p0j9rJ7r3K5R7o6MJ38k6l5L7O8j43m5J30j28j85K34N5k15
$$ -78 4 112 46 -17 14 65 -5 -24 -33 -16 -109 -84 13 -53 -49 89 63 28 65 133 -10 -55 75 -53 -238 -4 51 -164
3115a64k6L54j88j09K34Q1k29J01J66k31p3J82j17k23K46O1k51P7K70j22j39K60
$$ -164 -190 164 -24 -133 101 182 -47 54 220 -11 -84 98 -19 -242 4 65 -186 -109 161 39 -100 160
3137A60J9k61R2J37k39j35K24Ok32J03K33j10o5J93Mj12M4O1j14Lk6j0p3N8l5
$$ 160 179 -82 10 147 -92 -227 -3 3 -229 -126 107 -3 -68 125 129 17 61 122 8 11 -15 -25 -98 -40 -75
3162g5l8J23J03p6n8J20P9j36q7J56n2j70m5J24k5j36R3J24l3N2J4k0Q1N1k75
$$ -75 -113 10 113 37 -21 99 178 42 -45 111 59 -111 -156 -32 -57 -193 -100 24 -9 43 57 37 118 169 -106
3187a06M1K88k32l16K59K15l12r2M08Rk76J85J46j61l0P7j04j25J48j90j08K86
$$ -106 -65 223 -9 -325 -66 149 -163 -255 153 162 -114 71 217 56 26 103 -1 -126 22 -168 -276 10
3209A0R5m13J95M24k33k89L45K08m03p4K38m5j75J7N7j9j1qJ1J96N9j63k6K55
$$ 10 105 -308 -113 311 78 -211 134 342 -61 -135 103 58 -117 -100 -43 -62 -73 -81 -70 126 185 22 -4 251
3233B51p4l39M8J95r9k99J21K49n7k17J82K43q6j44J18K03k25j47M7N1o3o0o6
$$ 251 177 -162 -114 81 -18 -317 -196 53 -4 -221 -39 204 118 -26 92 295 70 -77 -30 21 -42 -102 -168
3256a68J13J38p8r4K07J75k93p8L71r2m30J30K04k02j17J12M4q1J67l2J8K26j03
$$ -168 -55 83 5 -89 118 293 0 -78 293 201 -229 -99 105 -97 -214 -102 -58 -139 28 -4 14 240 137
3279A37k16P1K09k48k72L51Rl02jL86p7j83K31K4K2j3Lr8P3q0j96P1K20k74j24
$$ 137 -79 -8 201 -47 -319 32 41 -261 -262 124 47 -136 95 119 141 128 131 33 106 26 -170 -99 121 -153 -277
3304b77K45J92k59Q7J94k5j32O2k6j4l9j18l8J51j2j95J87J94j21k06K70Q8j46
$$ -277 -32 160 -99 -12 182 157 25 87 61 47 8 -110 -148 3 -9 -204 -17 177 56 -150 120 208 62
3327F2n4J06j17n2l7p6L4P3j34R0J78l2m2J27J16k30M0L0Mj15J9q2l8J78j42o8
$$ 62 8 114 -3 -55 -92 -168 -134 -61 -195 -105 73 41 -1 126 242 12 52 82 86 -29 -10 -92 -130 48 -94 -162
3353a62K61Q6k15M4J84j32j05J05L8k43K9J16j70L1R6o6K1K50j76o6J72J13k76
$$ -162 99 185 -30 14 198 66 -39 66 104 -139 -110 6 -164 -133 -37 -103 -82 168 -8 -74 98 211 -65
3376f5K6J85j48j25J52k0j64K05rr2J49J53k26j8K29q8l17J75J68l64QK24j14
$$ -65 -39 146 -2 -127 25 5 -159 46 37 -55 94 247 21 3 232 144 -173 2 170 -194 -186 38 -76
3399g6n5K01k1j13J40M5k37R7J76k69n1K19K7k97O6L10k16m8J53M9m6m3J4k2J15
$$ -76 -131 70 49 -64 76 121 -116 -19 157 -112 -163 56 83 -214 -148 162 -54 -102 51 100 54 11 25 3 118
3424A18r4j14O1J10j42p6R9J12n1j23J61Kn1j3K5N2k3j84K5J95j60j28J77J24
$$ 118 24 -90 -29 81 -61 -137 -38 74 23 -100 61 63 12 -1 24 76 53 -131 -106 89 -71 -199 -22 102
3448A02j45J1J27n3N8p9r5J15P0k12k0J53Jk27J08K18j11j86K12J10j56J4L0n0
$$ 102 -43 -32 95 42 100 21 -74 41 111 -101 -121 32 33 -194 -86 132 21 -165 47 157 1 15 45 -5
3472eL1mj45L7K32k26j92L63J18l59N6L32j13k66J61R8j57j7N2k7jJ20k63KL51
$$ -5 26 22 -123 -86 146 -80 -272 91 209 -150 -94 238 125 -141 20 118 -39 -56 -4 -31 -32 88 -175 -173 178
3497A78j59k02K00K21l36l5L14j23j92P3J44j30Qj8L3O9P6j65k2K70j33k30K24
$$ 178 19 -183 17 238 -98 -133 181 58 -134 -61 83 -47 -39 -57 -24 45 121 -44 -66 204 71 -159 65
3520F5J90k92j50K43N2k22O6P3J9l6m1M3J28n1k10R0J80p3k75J87J37j85j34K21
$$ 65 255 -37 -187 56 108 -114 -48 25 44 8 -33 10 138 87 -123 -33 147 74 -201 -14 123 -62 -196 25
3544B5Q2r0q2P7J48m4j89Q6J67q5k60J77P6j59p7J64Mp2N3m3O9J19j20j54K44
$$ 25 107 17 -65 12 160 116 -73 13 180 95 -165 12 88 -71 -148 16 20 -52 1 -42 27 146 26 -128 116
3569A16P9l62NL20n3m06K40K16k45q3K83kk42K37j2o9L0l5k02J75K09l58j32M13
$$ 116 195 -167 -162 158 105 -301 -61 155 -90 -173 110 108 -134 103 91 22 52 17 -185 -10 199 -159 -291 122
3593A22L2m40J84L50k36j67K95K5k40N0Q7j17QK5j08N3J87j70jK15K9k52k1K71
$$ 122 154 -286 -102 248 12 -155 140 165 -75 -25 62 -55 -47 -22 -130 -77 110 -60 -61 154 183 -69 -90 181
3617A81j05j95K2J10l3j27M2Q8Q0j03k9J44L5q3K1N5r2o4K5k3O6q7j33J36J95
$$ 181 76 -119 -97 13 -20 -147 -105 -17 63 -40 -69 75 110 27 48 103 11 -53 -28 -51 15 -72 -205 -69 126
3642A26p1j92J63K46k43j57K65L4l08O7K18k11q7R2R2j48J65p8j4J29N7j88L1
$$ 126 55 -137 26 272 29 -128 137 171 -137 -70 148 -63 -150 -58 34 -114 51 -27 -41 88 145 -43 -12
3665a2J93j97j96K01J14k26l0K49l9j74J57N9k1p7J2M8M5q1r3j3J05q4q7J29J37
$$ -12 181 -16 -212 -11 103 -123 -153 96 57 -117 40 99 78 1 13 61 106 25 -68 -81 24 -60 -147 -18 119
3690A19j65j5L7J01n2o6N8R2n7j25P3J5r8k4J39N0j46l0J79o1k3K7L5n2J5j8o0
$$ 119 -46 -61 -24 77 25 -41 17 109 52 -73 0 15 -83 -107 32 82 -64 -94 85 24 1 28 63 11 26 8 -52
3717e2O8Oj06L8J65n1j48O0J01q8j30J81N4j22q3J61Pj00N0m0J9P0op5O1Pl6m9
$$ -52 16 22 -84 -46 119 68 -80 -20 81 -7 -137 44 98 -24 -107 54 61 -39 11 -29 -10 60 54 -21 40 47 11 -38
3745c8J19m1j59R4R6j36p2J98L5q4p0J02l2l0k3L0l4M2k9k5O5M4m3J3PL7o8O4
$$ -38 81 40 -119 -25 71 -65 -137 61 96 12 -58 44 12 -18 -41 -11 -45 -3 -32 -57 8 52 9 22 29 66 -2 62
3773F2J3k2j10L0P4J0j57O9M2Lo9N5R6m8l6ROm1Mj2l0L5k2Ok1P8m7l1J09J17j34
$$ 62 75 53 -57 -27 47 57 -100 -31 11 14 -55 0 96 48 12 21 27 -14 -10 -22 -52 -17 -39 -33 -54 24 -23 -54 55 172 38
3804C8l7R2l2j39Q9L8p6lK6Mo3Q1N9p1P2pq9k4J13r8n0R4L0q8k3Q1k1m6J8J00
$$ 38 1 93 61 -78 11 49 -27 -30 -4 0 -63 18 77 6 78 71 -18 -42 71 -27 -77 17 47 -41 -64 17 -4 -50 -32 68
3834F8m1n3O2J7l3qO7n4J0p1M8n5ml2O1L3j4L3o8O6kj7k4Oj8K4j4L4p2oJ0M9L
$$ 68 27 -26 36 53 20 12 79 25 35 -36 12 -43 -47 -79 -18 15 1 34 -34 32 30 13 -11 -5 -23 1 -13 21 -51 -57 -47 2 5
3867Ej8Q1n0K8o1K3N3p9Jj3k0K7O8o4J2o4M4K6pJ5O4q8N1l8K1m9J7K9o9P1j4n5
$$ 5 -13 68 18 46 -15 8 61 -18 -17 -30 -50 -23 45 -19 -7 -71 -27 -1 -8 7 71 -17 34 -4 17 -32 -15 14 -55 16 2 -53
3899e3L5P0k7l4J03K2j06J2K9m0j2K6j7k8j4%j2K1N7q0K8Q3k1n9l0J25j37K4J8
$$ -53 -18 52 25 -9 94 116 10 22 51 11 -1 25 8 -20 -34 -34 -46 -25 32 -48 -20 63 42 -17 -47 78 -59 -35 -17
3928a7K6m6RK0k3NO1pM0%j5m8l1P9o3m7Q1K3o4J0PM9o7K3N8l9pK0k3J8n4LM1k5
$$ -17 9 -37 -28 -8 -31 -26 35 28 68 68 53 5 -26 53 -10 -57 24 47 -17 -7 0 49 -18 5 63 24 17 37 14 32 -22 -19 22 -3
3962cK5o4K2Q8o1k2K9R6j26n6P1N9j08J1O0q5M2oO3o8O0j7n8M9Pqj6Q9o3o4M5
$$ -3 22 -42 -20 68 7 -15 14 110 -16 -72 -1 58 -50 -39 21 -64 -22 -28 35 -33 27 10 -48 1 8 0 -16 73 10 -54 -9
3993iN6l5n0R2k8jl3L9K0p0J1MM3k3k5l3M5l0k2J8L9J0q5K1N2M2q7nM1J0n5J7
$$ -9 47 12 -38 54 26 25 -8 31 51 -19 -8 -4 39 16 -9 -42 3 -27 -49 -31 8 18 -67 -46 6 48 -39 -44 -3 7 -48 -31
4025c1M1K9o3K6k0J00o5k9J8L2n2k7M6K2J4n7J2M4o8L1k1O9pq1M0K4J1j46J26
$$ -31 10 39 -24 2 -18 82 17 -12 6 38 -14 -41 5 27 41 -16 -4 40 -28 3 -18 51 44 -37 3 27 38 -108 18
4054A8M5o8k7P5oo9J22k6o2L5N3q6L5L6p8j09J85M1k23N0J34l4j09J03Rj19R7
$$ 18 63 -5 -32 43 37 -32 90 64 2 37 90 4 39 75 -3 -112 73 114 -109 -59 75 41 -68 35 44 -75 22
4081B2M0r2JR6o7j01J67qj91P1K14j35r5J64J7j87P2L2l7m5P1J9n6M4K5q8J0R7
$$ 22 62 -30 -29 67 0 -101 66 58 -133 -62 152 17 -78 86 103 -84 -12 20 -17 -62 9 28 -28 16 41 -47 -37 60
4109F0r7K4P7j6j19P1J12j21j22J67J5r4O5J4n7J5NN2o8O9k9o5J8Q5j06N2RK9
$$ 60 -37 -13 64 48 -71 0 112 -9 -131 36 51 -43 22 36 -21 -6 -1 51 -17 52 23 -42 -24 61 -45 7 16 45
4137D5r2J2J4j2lLP5j01K2OM5j9j1Kj2J03n6J0n7O2J8p8J1Q5m5n2N1O4j49M5M5
$$ 45 -47 -35 -21 -33 -36 -33 42 -59 -37 -31 14 -5 -16 -14 -26 77 21 31 -26 36 54 -24 -13 72 27 -25 26 90 -59 -14 31
4168C1m0k0j5J04j09L2M0n5m8J41r0m1J13J3j71K7J64p9q7J46K2j38K2J04n1p4
$$ 31 -9 -29 -44 60 -49 -17 23 -32 -80 61 -29 -70 43 56 -115 -88 76 -3 -90 56 78 -60 -38 66 15 -59
4194e9P3l9L5Rj2l9N1j1m9kJ32Nj43O2M5n6m6M8kk2K6%Nl5L1k8Q9l5n0J6K5Nn5
$$ -59 14 -25 10 19 7 -32 19 8 -41 -43 89 94 -49 13 58 2 -44 4 2 -20 6 6 11 -24 7 -21 68 33 -17 -1 24 29 -26
4227b6k4Q6Om6J9pL2j28O0L4K0j17O2Q5q6kM9j6Jm4L9N2oJ7q0j7Q6n7l4J04J9
$$ -26 -50 36 42 -4 15 8 40 -88 -28 6 26 -91 -29 56 -30 -32 17 1 2 -42 -3 49 43 60 -20 -37 49 -8 -42 62 81
4258H1j41M2O3m6l9Q0K8j35M4NLk4P6q9J4J8P7q0j0M6L1q5J06o2j4N4k6n7N1J0
$$ 81 -60 -18 45 -1 -40 40 68 -67 -23 -18 -15 -39 37 -52 -38 -20 57 -23 -33 13 44 -41 65 3 -11 43 17 -40 11 21
4288B1l2l9P4O2o9k5N9j6o6N1L7m9p5Q1M8o6lN1o3j3O6k1j6N5l0o6P6K0p6m3J17
$$ 21 -11 -50 24 86 17 -8 51 35 -31 20 57 8 -67 14 62 -4 -7 44 -19 -32 34 13 -3 52 22 -44 32 52 -24 -67 50
4319E0j7q0Q1N8o9m3P3K4j34RR3k7l9K3m9j1P5k2k6L8P4o3m7Q9m2o0LQ3p1m3N9
$$ 50 33 -47 34 92 23 -20 53 77 -57 -48 45 18 -21 2 -47 -58 17 -5 -31 7 81 18 -29 60 18 -42 -39 44 -27 -70 -11
4350a1k1JK1M7p2P2K0n5l4R2k3p9N7O7j35j3R4n6k6M2L4J5m4RLJ3k6N2n4L9K4
$$ -11 -32 -31 -10 37 -35 37 57 2 -32 60 37 -42 15 82 -53 -66 28 -28 -54 -12 22 37 -7 2 5 18 -8 44 -10 29 53
4381E3p0L1P%k7J0j3K8k2J0K1j5J1j5n2L8J7m0J9J6J9r9M8O6l5m5R4n1n7O1L9
$$ 53 -17 14 21 21 -6 4 -9 19 -3 7 28 13 24 9 -43 -5 12 -28 -9 7 26 -73 -25 41 6 -39 55 4 -53 8 47
4412D7j23J09J8j27P6O2n0r6J04J6r7P8qK1r0P2K5n0m8N2O4q2N2Kk7m2P0j04M6
$$ 47 -76 33 51 -76 0 62 12 -84 20 36 -61 17 9 30 -60 12 37 -13 -61 -9 55 -27 25 27 0 -42 28 -76 -30
4441c0k4O0k8N3Mo2M0j9O4o9k4Q7rn1k1J6J9Jm2L3pO3l9OlN6j27N3P5r3o6K9O1
$$ -30 -54 6 -22 31 35 -27 13 -6 58 -11 -35 52 43 -8 -29 -13 6 7 -35 -2 -9 54 15 21 18 74 -53 0 75 -18 -84 -55 6
4474Fj2j0P8k6o4N2n5NK3O2j26N3N4m8p1K0Q0n4j5J49p8p6O6K7n3OK4o1J9L0k0
$$ 6 -6 -16 62 36 -28 24 -31 -26 -3 59 -67 -14 40 -8 -79 -59 21 -33 -48 101 23 -53 13 40 -13 -7 17 -44 -25 5 -15
4505a5j4L5K2p2M5O9l2o2pR8p5k3N5J1k6j3M2l6M6q5J9N3K4m8l4M7Po0n5J20k1
$$ -15 -29 6 28 -44 1 70 38 -24 -31 67 -8 -31 24 35 9 -4 38 2 48 -37 -18 35 59 11 -23 24 31 -29 -84 36 15
4536A5p4K6L3Ol0P5Mqo7jM0j3mm0K6j4J4NL8j3k1KL7m8J2n1M9k2nqJ5K6j3J2k9
$$ 15 -59 -33 0 6 -24 51 55 47 -20 -21 19 6 2 -38 -12 -26 -12 -7 31 18 -3 -1 36 -12 0 -51 -2 -24 -29 -37 -22 4 -9 3 -26
4571b6J21o9J4m2LK8o0N3J4j8j1ol2pnQ8Mm4MP6j0r0m4J0N5pn8N9NM7j00J20L
$$ -26 95 26 40 -2 1 29 -31 22 36 18 7 1 -31 -38 -43 45 49 5 9 85 75 -15 -59 -49 6 -1 -59 0 5 52 -48 72 75
4604G5p4lQ1o9k9MP2p4j5K0L4l7K6m9L6M3l2K2n5N1k4m4N1Nn3oQ7kn6L5K3p2M2
$$ 75 1 -2 79 10 -19 -15 57 -17 -32 -12 22 -15 11 -38 -2 41 9 31 -24 27 3 -41 10 15 -38 -44 43 41 -15 20 43 -29 13
4637A3K2o2L7N3n6l7Q0m4l7MP4Pj42J24P6j56rO3k8l0mQ1n4J6l6OMP9m2n4P9j0
$$ 13 35 -27 10 63 7 -30 50 6 -31 -27 47 54 -88 36 112 -44 -53 10 -18 -48 -52 29 -25 -9 -45 -39 -35 44 2 -52 27 17
4669A7o5P0N9p0o1K1J16j06k0Q1m5k4O2%o4K7M1j01l3O7K1j00M9J11l9j46J39
$$ 17 -48 22 81 11 -50 -29 87 -19 -39 42 -3 -27 35 35 -29 -2 39 -62 -95 -28 -7 -107 -58 53 14 -132 7
4696GN1j46P9L9L5r6M0J3r5Q0l5k3J3N2K6m9nO6o8PM3m5qL0L9j38M5M5k7K9L0
$$ 7 58 -88 -9 30 65 -31 9 22 -73 7 -28 -51 -38 14 40 -9 -14 52 -16 -9 34 -11 -19 11 50 -88 -43 2 -25 4 34
4727C4o7J5N9l2K7j0J7r6J3N2K4j26J11L2l7q5Q2mp7J03o3lL6k4M0k3K7n6o0Q8
$$ 34 -33 -18 41 9 36 26 43 -53 -40 12 36 -90 21 53 16 -69 13 9 -68 35 -28 -31 5 -19 21 -2 25 -31 -91 -3
4757cL8o1j6R1j6o0l8O4Rm3N1l3j3O6pq0N3L3o4j7Q5n4kL9M0q5m1Q9po3PM0r9
$$ -3 35 -26 -42 49 33 -27 -65 -1 8 -35 16 -17 -30 36 29 -51 2 35 -29 -46 39 -15 -17 22 62 -23 -64 25 18 -45 -38 2 -97
4790i7R1k6njQ7k0o2L3Q2j18j7J20L0j76j2J58l2p7L8M4Nq7R1Rp4L9l0n5N7Kl7
$$ -97 -6 -32 -37 -38 49 29 -33 0 82 -36 -53 67 97 -79 -91 67 35 -42 -4 40 45 -42 49 58 -16 23 -7 -62 -5 -3 -40
4821d0L3L5Kj31J53L9j40j7J75p8n9O1J4m0r6J44o2m2N4Lk6K4Q0j11qJ56k5k45
$$ -40 -7 28 30 -101 52 91 -49 -66 109 31 -28 33 47 7 -89 55 -7 -49 5 8 -18 6 86 -25 -33 123 98 -147
4849a47J49M7j20L3L9Nl5N1N2n7K3pJ9j3j4mm4O3m9n4K2J26j34Q5j1K2qj7K6L3
$$ -147 2 49 -71 -38 1 6 -29 22 74 17 40 33 52 39 25 21 -23 40 -9 -63 -41 85 -49 36 25 47 39 22 48 81
4879H1j8j01n0P3K5q9NJ10j5k9O1Ok5J0J6k3rqk9k3K4L4p3O8Qmn4N5L7mk7Qn1
$$ 81 63 -38 -88 -15 10 -79 -74 36 21 -8 53 59 34 44 60 37 28 20 -9 -32 -8 26 -47 21 29 25 -29 26 63 59 32 40 -11
4912a1l2J8kRo8K0N0NoM8L3m1l9K0L7m0L4p1j9J7on6P6R3pq2Q9Q7j43o2J00k1
$$ -11 -43 -25 -27 -18 -86 -66 -16 -11 -17 31 64 23 -16 4 41 1 35 -36 -55 -38 -44 -100 -24 69 62 -20 69 156 13 -49 51 30
4944C0p2L3kp6O9L7ml5N7l7J7O3k3o1J0L1n6r2O8J6m3R3On3N4M2l3j5kJ2k1J8
$$ 30 -42 -9 -11 -87 -18 19 15 -20 37 0 17 80 57 -4 6 37 -19 -111 -43 -27 -70 23 29 -24 30 72 39 24 22 34 13 31
4976C1q3k4P0n6L4Nk7Q8J0j3n3Q4L7r7QJ8r2l9O6M1j46J02M7kJ0M0kl6RJ5l9m2
$$ 31 -52 -76 -6 -62 -28 -23 -50 38 48 35 -18 66 103 6 14 32 -60 -99 -33 8 -138 -36 11 9 19 59 57 21 30 45 6 -36
5008c6j0n8jP2Ol3L3O7k6K0M8k9j5J3m9q3P0km5N4lJ7J7M7j0KL5l5m7j14M9L6
$$ -36 -46 -104 -105 -33 -27 -60 -27 40 14 34 82 53 38 51 2 -81 -11 -13 -58 -4 -7 10 27 74 64 66 101 66 19 -95 -46 -10
5040a0p6mN4j7Qj2K9N5L1j8K2o2k1K3J3o8lN2n3N8QoL1kK3l9%M1p4rj2M0j7o1
$$ -10 -86 -90 -36 -53 -45 -57 -28 27 58 40 62 0 -21 2 15 -53 -56 -4 -57 1 9 3 34 32 55 16 16 57 -17 -26 -38 2 -15 -76
5074g6M0K7k6J2J6OjJ7L5r4M1j1Rj5Kl7j4K6J02k5j4M7m5L7p5M2l7m9k2P0n2J2
$$ -76 -36 -9 -35 -23 -7 -1 -2 15 50 -44 -3 -14 -5 -20 -18 -55 -69 -43 59 34 20 67 22 59 -16 26 -11 -60 -82 -12 -64 -52
5106e2N1L5m1K9k3L4j7ML5l1n8m6O1kKJ2j2M8K7l7oN5n8l6M9m2pm8M8LPJ2M2l8
$$ -52 -1 34 -7 22 -1 33 16 20 55 24 -34 -80 -19 -21 -19 -7 -19 29 56 19 13 68 10 -26 23 -19 -26 -74 -26 -23 -16 -4 38 0
5140@Rl5LJ3N3J0k8K9k5o4j1L2n5Q3Rj6L6j4j3J7J1Pl0j6K1J4n2J4o5K0M5K2J2
$$ 0 9 -26 -23 -10 43 53 25 54 29 -35 -46 -14 -69 14 23 7 43 29 16 33 44 51 21 5 26 40 -12 2 -63 -43 2 24 36
5173C6j5K6l9N0k8j6j0k0k2k1M0m7P4k1pL9N5Ko3J2J5l9L5m7Pl9k6J3K4M5Rk3
$$ 36 21 47 8 58 30 14 4 -16 -38 -59 -19 -66 8 -13 -20 19 74 76 13 25 40 1 36 -11 -4 -43 -69 -56 -32 13 22 -1
5205aj6O3k8j1Qln0k5JON9j9M9r7L4J7Po3R8L1m7NM8o1Jk7M8o3O0K0o9J9RM2n9
$$ -1 -17 46 18 7 15 12 -38 -63 -62 -56 3 -16 33 -64 -30 -13 -6 -69 29 60 13 18 66 5 6 -21 27 -36 24 44 -25 -6 3 45 -14
5240a4M1j6n1k3M7K6l6rL6jm7O1J8k2j7K1K3ln7J5l4N2k5nj8Rj6K9L0j0l8L4K0
$$ -14 27 11 -40 -63 -16 10 -26 -35 1 0 -47 14 32 10 -7 14 37 34 -23 -8 -42 10 -15 -20 -38 -29 -45 -16 14 4 -34 0 20
5273B0lo3N5Mj2PPj2l9P8m1j5K5Mk0%K9j6n1L5j6NQJ0k2L8JJ4j0o3j2RN4j8m0
$$ 20 17 -46 9 13 1 8 15 3 -36 42 1 -14 11 15 -5 -5 24 8 -43 -8 -24 -19 -11 -1 -23 15 16 30 20 -43 -55 -46 8 -10 -50
5308e0J31j09L8JJ4p1KP7o0K5k8N3nk2qN5o8Q7q3K2JJ4n2LN6k6J9J7m8Pk1J2L1
$$ -50 81 -28 10 11 25 -46 -44 33 -27 -2 -30 23 18 -4 -12 43 -25 62 -21 1 2 16 -36 -33 23 -3 16 33 -15 -8 -29 -17 14
5341A4kn0J4j0N3MNoj9oN2j8p8J1L4K1ml3j0J9J9J5o3P0k3l1k1M5m0l3M1J2Qk8
$$ 14 12 -38 -24 -34 19 23 28 22 3 -3 49 31 -47 -36 -2 19 15 -18 -28 -9 10 25 -38 32 9 -22 -43 2 -38 -71 -30 -18 -10 -38
5375c8O6kLom3Om4P7j8nL3o0J0M5K7l0n9M7Rm2j9K7j5J0M1k5k4Qj3N1Pn1NM8j
$$ -38 28 26 29 23 -20 -14 -58 19 1 -4 29 -31 -21 24 51 21 -38 9 18 -24 -43 -16 -31 -21 20 -5 -29 -21 -34 17 24 -27 -22 26 25
5410B5o0N3nl9PN2K8l7j9k5N1j6k6J1L7Pm8L1lJ5r8M7k5kK0OJ9k7kM0m4N7l3k3
$$ 25 -35 18 13 -26 -19 33 61 24 5 -20 31 15 -11 0 37 44 -4 27 24 39 -59 -12 -37 -39 -19 -13 6 -21 -23 17 -27 30 -3 -26
5444b6Q6r6L8j0k2K8nN9p7L1j5M7K9l6k0k0J7k7N0j9nj0Pj4p8J21l8O6r8Q1J3
$$ -26 60 -36 2 -8 -30 -2 -7 52 -25 6 -9 38 67 31 11 -9 8 -19 31 12 7 -3 4 -10 -88 33 -5 61 -37 44 57
5475E7j5m4m4K8K6Mj7pkl8L7K6L5o8K1j6j3L1N0l7m2%J4lK0Km7N3K0l5j5QO7n4
$$ 57 42 -2 -46 -18 8 12 -5 -12 -14 -52 -15 11 46 -22 -1 -17 -30 1 51 14 -28 -28 -14 -17 3 5 -42 11 31 -4 -19 -11 56 2
5509Bl7M6Jj0m4J20j00J4J1oO3o0j2k6L0J4l8K4Q5m6p0QK5m2M7OJ1J2lPl6KJ9
$$ 2 -35 11 12 2 -42 78 -22 -8 3 -3 60 0 -12 -38 -8 6 -32 -8 77 31 -39 -31 -6 -48 -1 5 16 28 25 32 -4 -2 17
5542A7j7M0k7o3M4N3k5m3M9M0m7l7L4ql2j6L6m1j7K2N0J4j2qk7L1Jm8J7M3l1q
$$ 17 0 40 13 -50 -6 47 22 -21 28 68 21 -16 18 10 -22 -38 -2 -43 -60 -38 12 26 14 6 -21 10 11 -37 -20 23 -8 -16
5574a6qj7P1n5L0L8K5n7nK0ro1J12r1K1k1kjmK5M8k8l8M4m8M0j8J0l0K2k3n1K
$$ -16 -24 -41 30 -25 5 43 68 11 6 26 17 -44 68 -23 -2 -23 -25 -26 -30 -5 43 15 -23 21 -27 13 -5 5 -25 -3 -26 -77 -75
5607g5N3jj2J02o8M4k5J7k0L7k3k0%m1M6n5L6J3j0mO4k5m3N8Rk7m9nM9l4l5L6
$$ -75 -22 -23 -35 67 -1 43 18 35 15 52 29 9 9 -32 14 -41 -5 8 -2 -6 58 33 -10 48 57 30 -19 -24 25 -9 -44 -8
5639hJ9k7mMj1O7k1l2L5l9N6r2MK8K1j1n6R2n0L3J0j2M0o6RK8l9kJ2j8OK6k1O8
$$ -8 11 -16 -20 -16 -27 40 19 -13 22 -17 39 -53 -49 -21 0 -11 -67 25 -25 8 18 6 46 -20 -11 17 -22 -24 -12 -30 -24 2 -19 49
5673D9k3L8n9oP0n6n5Q4l7j6l1oL5K0o3P9j8j3k1J8m6M2L4J1n3J3n3J2M8m2J7
$$ 49 26 64 5 -1 69 13 -42 42 5 -11 -42 -48 -13 7 -56 23 5 -8 -29 -11 -57 -15 19 30 -23 -10 -63 -51 -3 -45 -28
5704b8K2K2J3j2k4J7J2j8Pk7l1qO3%K1l6pL0K4k2j2L3j0q2O7j4J8k6m6N7m7L0
$$ -28 -6 16 29 17 -7 10 22 4 11 -16 -47 -55 8 8 29 -7 -14 16 40 18 6 39 29 -53 14 0 18 -8 -54 3 -44 -14
5736a4l1L1K9k3J5%J9l3jJ7Jj7j2QjQJj8Qj8O3k5jk3j0KM0Rk3l1K0J9R%l2mO4
$$ -14 -45 -14 15 -8 7 7 26 -7 -8 9 10 -7 -19 -11 -12 -4 -3 -21 -13 -31 32 7 6 -17 -27 -25 15 24 1 -30 -10 9 18 18 -14 -18 46
5773D6j6m0k0K9m4M5j2mL0l7K7n3J6oP1o4K7J7l4OM0k3m0N4Nk2MmK2j8qM2n2K8
$$ 46 30 -10 -30 -1 -45 0 -12 -16 14 -23 4 -49 -33 -39 32 -32 -5 12 -22 -16 24 1 -39 15 20 -2 2 -2 20 2 -6 36 -16 12
5807A2M9q4R8p6m8M3K0%j1m4M5l4o0J17j4k9JL6o9J8k2L3QqKL2J2j6Pn2L3O3p9
$$ 12 61 -23 75 -1 -49 -6 14 14 3 -41 4 -30 -90 27 13 -16 -15 21 -48 -30 -52 -19 -11 -19 -17 15 27 11 18 -34 -1 62 -17
5840a7n5R6j2k9JJ0l4O2kl4J7j2K8n4K9l8K3J6qk6L4JoO8p4L2l0P8n1J1%m1Ql2
$$ -17 -72 24 12 -17 -16 -6 -40 22 20 -14 3 -9 19 -35 -6 -44 -21 -5 -13 -39 -5 -4 -10 58 -16 16 -14 64 13 24 24 -17 -9 -41
5874d1O5o4j9L3L2q4O6NP4n5J4j1l8M3q5N3J7K9l6j0L1j2j3l7K2lN3l1kj9J5J7
$$ -41 24 -40 -59 -26 6 -78 -12 -7 67 12 26 15 -23 20 -65 -12 5 34 -2 -12 19 7 -6 -43 -21 -24 29 -2 -4 -23 -8 9
5906Il6L5m1K4l4M7NQm0N0p8J2N2J6j3m5k1R4o8K9k9L5J4k3j4O9l0Oj1k8m2N4
$$ 9 -27 8 -33 -9 -43 4 9 17 -23 27 -51 -39 13 29 16 -29 -50 44 -24 5 -24 11 25 2 -12 57 27 33 22 -6 -48 6
5938Fj3NN3m3l1L7K8l6mMJ7n1L4pOJ2j5L1kl5j2K0k9NK4m8M9oJ8M2k4ko2N2l7
$$ 6 -7 -2 51 8 -23 14 42 6 2 6 23 -28 6 -1 5 17 2 33 31 -4 -16 4 -25 -20 4 -44 5 -1 17 59 35 33 -29 23 -14
5973a4Q2j0k3j6M0q0K8Nk3L5j5NK3n0l9O4k9J6M6k2j8q0R6ml7J3l3Q8n4oJK1K
$$ -14 68 58 35 19 59 -21 7 12 -11 24 9 14 37 -13 -52 12 -17 -1 45 23 5 -75 21 17 -20 -7 -40 48 -6 -12 -11 10 12
6006A2k8j2L4K3J7m0o6M5K0L9JOp0PK2J7r1O2J6j1m2OO8k6K3k3j6Llo2P6M7p2
$$ 12 -16 -28 6 29 46 6 -60 -15 5 44 45 51 -19 -12 10 27 -64 -2 14 3 -39 -33 35 9 32 9 -7 -4 -7 -69 7 54 -18
6039a8QL2k3k6Pjk1j7L8M0QpnJ9m9l9N9k0L1k6KM0Qj7J9L2j14J0L6L7p6MKP7l4
$$ -18 -10 22 -1 -27 -20 -21 -42 -59 -21 19 27 20 15 34 -15 -54 5 -15 16 -10 -8 32 40 23 42 74 -40 -30 6 43 -33 -29 -27 50 16
6074A6k4PnM9o0rk0M4K4l3J7K4n2Rk2N7n1N7k8j9lJ4N4k8k8K6Lj8L3m1j2M7k1
$$ 16 -8 -1 -6 43 -17 -26 -46 -2 22 -11 6 30 -22 -13 -35 22 -29 28 0 -19 -22 -8 46 18 -10 16 19 1 34 -7 -19 28 7
6107GL5k0l5PLj1K3L3o8J0lK3J9k5k8KK7J4k8O0Mkn5M6n4N2o3l8P6r%l9K4rn7
$$ 7 42 22 -13 -6 -3 -14 9 42 -26 -16 -19 4 23 -2 -30 -28 -1 13 -15 45 49 47 -8 38 -16 36 -27 -65 11 2 2 -37 -13 -22 -79
6142g9O3J0K9m4JJ2rN5m4K0k7K4k8M5k5k6M0L2k8p0O2qk0LPL0m5m2O3N5q6Q%J1
$$ -79 -16 -6 23 -21 -20 -8 -17 38 -6 14 -13 11 -17 28 3 -23 17 49 21 -49 13 5 -15 -12 -5 25 -20 -62 1 56 -30 -22 -22 -11
6176a1rrj1N1j4J1k5l8J3K5JJ4Qj6L2Qm0kk0P0Pj00O3k1j2lL0j5K0qM2k1j5k1
$$ -11 -20 -29 -40 11 -3 8 -17 -55 -42 -17 -16 -2 6 -10 22 30 -10 -12 -32 38 45 -55 8 -13 -25 -28 2 -13 7 -1 41 20 5 -16
6210a6M2ln1j1J1j7P9k2nK0n8%L8j2J7RO5m0o2L3jm4J4l6L8j0j9Q4j9j2n7N7L9
$$ -16 26 23 -28 -39 -28 -45 34 12 7 27 -31 -31 7 -5 12 21 86 46 -16 17 16 -28 -14 -50 -12 -22 -41 43 24 12 -45 12 51
6243E1o4RL1o0M5j1J7rl0R4j33O2j6j8N9l8rK8kl4%O7jl1J5rl4J3L9k4nl7L7l5
$$ 51 -13 -4 27 -33 12 1 18 9 -21 73 -60 2 -14 -32 27 -11 -20 8 6 -28 -28 39 38 7 22 13 -21 -8 31 7 2 -35 2 -33
6277c3M1M2r7O6pK9o3%RK2K3K4q7K9K6Ml2l1O4p5N8l1J8k7J9K3j3Rl2K0Mnl5N7
$$ -33 8 50 -47 19 12 41 -22 -22 -13 9 32 56 -31 -2 24 28 -4 -35 29 -46 12 -19 -1 -28 -9 14 1 10 -22 -2 2 -3 -38 19
6311A9J5k0J5m4J9%RPj5L1J4j5o8O6k1k7M5kkl9J6k9L2oK4q9O0L0l6K0n2k1Q7
$$ 19 34 14 29 -15 4 4 13 20 5 36 50 35 -33 33 12 -15 30 28 26 -13 3 -26 6 0 24 -65 -5 25 -11 9 -43 -64 23
6344B3l3M1k8J6M8p6OL3m2k8Q1j8l5L9l7J9k2M0m0m6P0J5l2j1L6m2J4O3n9K1J0
$$ 23 -10 31 3 19 67 -9 -3 30 -12 -40 41 23 -12 27 -10 9 -13 27 -13 -59 11 26 -6 -17 19 -23 -9 54 -5 16 26
6375B6l4PJ0j7j3J3m6J0K9J7qj0%L2k6k8N2k9K5k7L0L6Mn4J9K8m0j6L3l4RK8l4
$$ 26 -8 -1 9 -8 -21 -8 -54 -44 -15 2 -6 -16 -16 16 -10 -38 14 -15 10 -17 13 49 53 -1 18 46 6 -10 23 -11 -2 26 -8
6408hM6n9J7P1r3MN0n0M0l5M8p7O4m8j4%K1n6Q7k2k7J0N8j7m1K5K2n0P4j8j4J8
$$ -8 38 -21 -4 67 -26 -22 28 -22 18 -17 31 -46 18 -30 -44 -44 -23 -79 8 -14 -41 -31 27 10 -31 -6 16 -34 40 22 8 26
6440B6m3RnL0l2M1m7L6rk5K1J3MJ8l4j3L0J0n2M6Ml4j7K3QK3j6n0R6r0RL8ll3
$$ 26 -17 -8 -13 17 -15 26 -21 15 6 -19 2 15 19 37 3 -10 20 30 -22 24 28 -6 -23 0 8 31 15 -35 61 -29 -20 18 15 -18
6474a8j4JO7nJ1r8N5K6QJ8k5j1K1j9k5J5l2j7j5N6J2m9L9%J0L3o9J4M4l3k6K4
$$ -18 -32 -31 36 31 42 -56 -1 25 33 51 26 15 36 17 -8 7 -25 -42 -57 -1 11 -38 1 1 11 44 -25 -11 33 0 -26 -2
6506bK5r0L1L8j3N4j8n0J5JM5m3p7O1K3J1k7K4MN5m6l1k4ML5j3l1M3k1L5%k2o
$$ -2 23 -67 -36 2 -11 43 25 -25 -10 -9 36 -7 -84 -23 0 11 -16 8 12 67 21 -10 -34 -30 5 -8 -39 4 -17 18 18 -4 -10
6539a0L7J7m8j6J7n7J03Mm9kl3P0n8Okk5QK0j8J4j4L8nJ9l3P4m4pj1j5lM6n8K8
$$ -10 27 44 -4 -20 -3 -60 43 47 -2 -4 -37 33 -25 -19 -21 -46 -38 -18 -36 -22 -36 2 -3 16 -17 57 13 6 -5 -20 -23 23 -35 -7
6573gJ4k1L5K1lk2k2rK7K0n4N5J7j8K3m7l6L1L0m7LpnJ8kM6n8pL9lom3K5N3o9
$$ -7 7 -14 21 42 39 17 -5 -14 13 33 -21 34 51 33 56 9 -27 4 34 -13 -10 -17 -22 -4 -6 40 -18 -25 14 11 5 -38 -13 40 -29
6608b9QJ8N5n8K7K4k9K6J0j6n0M4rk7O0pk2l8k2J6J4rMK8m5j0oj8J16l0k9M5k1
$$ -29 -21 -3 52 -6 21 45 16 42 52 36 -14 30 21 -6 54 47 25 -13 -35 -19 -5 -14 -10 18 -27 -37 -43 -61 55 25 -4 41 20
6641B0l4K3J5o7O8k1JJk9L1o2L7L3l1rkL9l1M1j3k9NRj1N3m5j3j5M2JOn4Q3k5
$$ 20 -14 9 24 -43 25 4 5 6 -23 8 -54 -17 16 -15 -24 -26 13 -18 23 10 -19 -14 -5 -16 37 -8 -21 -36 6 7 13 -41 42 17
6675A7OKl2NL1K4o5l1L2k0J8%qK6l5L6o5O5l4J3k2O4n1j3K0L3Mo7L2J5K2j8mq
$$ 17 23 25 -7 -2 29 53 -12 -43 -11 -31 -13 -13 -21 5 -30 6 -59 6 -28 -15 -37 27 -24 -37 -17 16 20 -47 -15 0 22 4 0 -8
6709hK6j4lk3M6m5M8L0k8o1K5Pkj2K4lk6P2l6j2j2L8J0p0Q5k9k2k4prO0Rj1J3
$$ -8 18 4 1 -22 24 -21 27 57 29 -32 -7 0 -2 -14 10 7 -19 53 17 5 -7 31 41 -29 56 27 5 -19 -26 -35 25 34 23 36
6743C6j9j5j0M0jJ2J4o6k1O2q3J02q8N9j3k1Kk5J4N6l0m5O9k9j5JM2m1m2M7N6
$$ 36 17 2 -8 32 31 43 57 -9 -30 32 -51 51 -37 22 9 -12 -10 -35 -21 35 5 -40 29 0 -15 -14 28 -13 -55 -8 48
6774D8m6Nk2K9qlol6N0qK6o7M4Rk8j1K8l6M9k1L9o5J05n9J4m6Rk5M9ml8J8O4m8
$$ 48 2 7 -15 14 6 3 -3 -39 11 3 29 -38 6 15 -13 -24 4 -32 17 -4 35 -30 75 16 30 -16 -7 -32 17 13 -25 -7 57 9
6808INMK2k9k2j9J9J6L9ql9L6q6R4j8l4l4O3pk3K6l0L2pn2NM4O9l7l3l8M8j0m0
$$ 9 14 18 40 11 -11 -30 -11 5 44 36 -3 33 -53 41 23 -11 -45 18 11 -12 14 -16 16 9 -43 -38 6 75 38 5 -33 15 5 -35
6842c5R9j8Nl9No1M3j2J9m5L2j6m1K5KOK7K6m5j0MmJ5M9k1J7J3Nk3k1J8kj1kj8
$$ -35 64 46 51 12 17 -44 -1 -13 6 -39 -7 -23 -64 -39 -37 -31 -4 22 -23 -33 -29 -33 -18 31 10 27 40 45 22 1 19 17 6 4 -14
6877a4O1m7M2m2j7L2mnL6m1L2l3J2J6m3L8j5L0n7Pl7jP2j9k8K2K1m0M0%rL1q1
$$ -14 47 0 42 0 -17 15 11 6 42 1 33 0 12 28 -15 23 8 38 -19 -12 -49 -50 22 3 -25 -3 18 -22 18 18 9 40 -41
6910d1P2m2j7JOJ5J0k4jK9k2RK5Lp3P7Mm5L1rj1l4O7jr4R4n3J6PRJ3pnk5lJ4N
$$ -41 31 -11 -28 -27 -21 -6 4 -20 -21 8 -14 -5 20 23 -50 27 31 -14 17 8 -3 -37 30 29 -65 29 -24 -8 -1 8 21 14 9 -16 -19 -5 0
6947@l1J5Mj3P0l2n5M0j4J5L7k2rL7k3m7PL4K6o9j4P1nl7N0j1m8Q1l0po0M0Qm0
$$ 0 -31 -16 -12 -25 45 13 -42 -2 -16 -1 36 14 5 42 19 -28 -21 13 39 -30 -44 27 22 -15 35 24 -24 57 27 20 -40 0 8 -32
6981c2L3J3l9L3k4KL0m4N9n2L5j0j3j6M0rk1j4N2l0M1jj1Kl4n2Q5k1QK4o9O8j6
$$ -32 1 14 -25 8 -16 -14 16 -28 31 -21 14 4 -9 -25 15 6 -15 -29 23 -7 34 33 22 24 -10 -62 23 2 10 34 -35 33 17
7014A7l6%M1p3O2l8L4qm7J1J6K2m0P2l5l5M9j6K2k1L4n3j2N3Pl4N9q0K4JM1J1
$$ 17 -19 -19 22 -51 11 -27 7 -1 -48 -37 -21 1 -39 33 -2 -37 12 -4 18 -3 31 -22 -34 19 26 -8 51 -29 -5 -4 37 48
7046D8o5K5plNj4qK3L0j4qL4n9j6J07q3l7M8L6j2rKl6m3L4R6n9m8J05o8j3l1L0
$$ 48 -17 8 1 -2 3 -11 -19 4 34 20 12 46 -13 -29 78 -5 -42 6 42 30 21 23 -13 -56 -22 74 15 -33 72 4 -9 -40 -10
7079a0L5k9M1j6k5mJ5m0O3n1lL7J8j6n2N5l0ON7l1l4R2r6L2Ll8NK8qK2j6J7n4
$$ -10 25 -4 37 21 -4 -8 7 -33 30 -21 -24 13 31 15 -37 18 -12 -6 51 20 -14 78 -18 14 17 -21 -16 12 4 26 10 27 -27
7112b7j1L6nK3J4J2n3k2O5k3m2L5J9lp8N5RJ6j1n7K7M9n0Q4p4M4p6Q7ol9j7J7
$$ -27 -38 -2 -7 16 30 42 -11 -33 32 9 -33 2 21 18 -60 -5 4 20 9 -48 -21 28 -22 62 -12 32 -44 43 37 -2 -19 -2
7144bM4o5L5l5j9L7j3o0J03o0K5j1J6PJ3J3l6m0N8K3j3j5j1K4Jo1M6Ql8N3pl3
$$ -2 42 -23 12 -23 -42 -5 -18 -78 25 -35 -10 -21 -5 2 15 28 -8 -48 10 33 20 5 -6 18 19 -42 4 12 -26 27 20 -13
7176a3l4R1l6K4k4MJ2m1L7L1k3k7J3jql1ON4m3RL7n2j3K8J8o3O6k4M6n7kK3l3
$$ -13 -47 44 8 32 8 12 24 -17 20 51 28 1 14 13 5 -26 -20 34 -9 0 37 -15 -28 0 18 -45 21 -3 43 -14 -16 7 -26
7209b6O1j6j8k8K9J6k0%j1J5k8M3n4Q4j5nqj0K8n8K7K1J8m8K7jMn0K1JK9k4J8
$$ -26 35 19 1 -27 2 18 -2 -2 -13 2 -26 17 -37 47 32 27 19 9 37 -21 6 27 45 -3 24 23 27 -23 -2 -1 28 4 22
7242B2n8j3J2QL9n2M9Jk9Rk6N7km2N6k8j6J1K4j7Prl1L6l3N1Rk1l0M3n8M3qj8
$$ 22 -36 -49 -37 -29 10 -42 7 8 -21 -12 -38 19 17 -25 31 3 -13 -2 22 5 12 3 -28 8 -25 26 35 14 -16 27 -31 12 4 -14
7276a4J2%NL9p5K5n0M5%n0J17l2J4l5k3jP6q3K1J7m4Lo3J20k0jM9n6l7LK6J8J7
$$ -14 -2 -2 3 42 -33 -8 -58 -13 -13 -63 54 22 36 1 -22 -23 53 -30 -9 8 -36 -33 -96 24 4 3 52 -4 -41 -38 -12 6 23
7309B3mk2K2k3K4n6N6J3j2Rm0L1K7l1p6L0J0J3O3n5m6M2j9jk6O3l1K1j7j8pL1
$$ 23 19 -3 19 -4 20 -36 20 33 21 30 -10 21 48 17 -59 -29 -19 -6 57 2 -44 -2 -21 -22 -48 15 -16 5 -12 -30 -37 -6
7341fqj6O4Op3O6j8l7M1j7m2O4k7k1L8J9p3N1j1K0m7jO7n5K5k8J8Qj5j9K7k8N5
$$ -6 -14 -30 34 40 -33 33 15 -22 19 2 -40 24 -3 -24 14 33 -40 11 0 20 -27 -28 39 -16 9 -19 -1 7 -8 -27 0 -28 27
7374B7l0L6j6l8J5n8Q2l5M6j1OJ2k7k0KL0p2P9k0K6j3mk1K9k5Pl6j4L2rK0l5O7
$$ 27 -3 33 17 -21 -6 -64 18 -17 29 18 24 36 9 -11 -9 21 -51 28 8 34 21 17 -4 25 0 7 -29 -43 -11 -20 0 -35 32
7407C2p1L2k9N2o2qP5m2M4l6NN2o4L8%J1J0j0n9mK7Ql1ML6nk4M9Rk6mp3J02j7
$$ 32 -39 -7 -36 16 -46 -54 21 -21 23 -13 -8 44 -20 18 18 29 39 29 -30 -34 -7 1 -30 -26 10 5 -19 30 39 13 9 -64 38 21
7441B1k1J6LJ7l0j9M9j6J3oNj6p1N2k8pJP0m1%J4j3nm7N1m7JM1oP4q7P7p7K1J
$$ 21 0 16 19 36 6 -13 36 20 33 27 32 16 -55 -3 -31 -38 -37 33 -8 -8 6 -7 -12 -59 -8 -55 -54 -13 -19 55 -32 45 -32 -11 -10
7476a0M0n5j2Q6m8K2m3J3L9Nr7J7N3l3K0qmM6l2%j9K4K5k6M8j0p1N1j8k9L8n5
$$ -10 30 -25 -37 49 1 23 -20 -7 32 37 -60 -43 10 -23 -3 -11 -15 31 -1 -1 -20 4 29 3 51 41 -30 21 3 -26 12 -43
7508d3K6k2l1O5K9%j5LoNOP3j56K4L3l5R1m5j2M5k1K4n2N1K0m1j6K4j9M5k5o4
$$ -43 -17 -39 -70 -5 24 24 9 12 6 11 17 90 -66 -42 -9 -44 47 2 -10 35 14 38 -14 37 57 16 0 24 5 50 25 -39
7540c9M1j9jm2N6M2o7N7n1J6J1k4K9rLK0K0p5J01j00Q0q6Q9m0k4L7j2oJ1Lj4J3
$$ -39 2 -17 -18 -60 -4 38 -29 28 -23 -7 4 -20 9 0 3 23 43 -32 69 -31 49 -37 52 12 -12 25 13 7 18 21 7 20
7572B0j2mK5m7Pn2N5k0M8j4l0O6Mk2p8R1m4k8oL3J0k3J9L0m3l9N0m8L1L2rl1J6
$$ 20 8 4 29 -18 -11 -63 -8 -28 20 6 -24 42 46 24 -54 37 -7 -35 -41 -8 2 -21 -2 28 -15 -54 -4 -52 -21 11 2 -29 -13
7605a3mL8j5K0j6J5ok2l9j3P4mJ4j6j4j6j2L3k1J2J2n3J3O1l6o0J15m4k1Rl0M4
$$ -13 -17 21 6 26 10 25 19 -3 -42 -55 19 15 29 13 -1 -17 -29 4 -17 -5 7 -46 -33 28 -8 -68 47 3 -18 -9 -39 5
7637EM3l2m9J3K8qO9n4oJ6K4j8k2J9Kqk6K1k7J3J0j5L1j4o7O8J7j8K7p2J4N6n2
$$ 5 48 16 -33 -20 8 0 69 15 9 25 49 31 9 28 30 22 -4 17 -10 3 13 -2 29 15 -52 16 33 15 42 -30 -16 40 -12
7670a2kjL1j3Pjl4k2MN8k3pK0J8Qk7k3n4Q4J9l1K2n6jP7o7O2l7J8mL6o9J9J6j8
$$ -12 -14 -15 16 3 10 9 -25 -47 -43 15 -8 -15 5 23 31 4 -19 -73 11 30 -1 21 -35 -36 41 -26 36 -1 17 13 49 -20 -1 15 -3
7705cJ2no2K4L2K5j9k7J0m3L1M4KlJ1k7p6N8OmolN7r0N4j4P3m4m4J9K2Jj4l1J03
$$ -3 9 4 -58 -34 -2 23 4 -23 -13 -56 -25 19 21 18 29 2 -74 -16 -10 -14 -20 -23 34 -56 -2 -16 57 13 -31 -12 10 11 -3 -34 69
7740F9q9J3L9J6o2J3L0m4M3J1J4l5l2l1PJ9M1n2MKM3m1KMM0j7m3L6l0k2R6nk3
$$ 69 -20 -7 32 48 -14 -1 29 -15 28 39 53 18 -14 -45 -38 -19 22 -30 -26 -24 19 -22 -20 -16 24 7 -36 0 -30 -52 44 39 16
7773A6l3K8K4o1OPJ1J3j1j6k8P7k9k3L4m5L9J5k5m2O3m4L0j4L1l9OJ2K6k0Rk8
$$ 16 -17 11 35 -26 -20 -13 -2 11 0 -16 -44 33 4 -19 15 -30 9 24 -1 -43 20 -24 6 -8 23 -16 -10 2 28 8 17 -11
7805a1rQ3q1l8O5J3Kj8n2OQ4n2kMl0RQN7n8K0k0qRj9nP4k1m1L3%M1n1Oj1J8Nn3
$$ -11 -20 63 -18 -56 9 22 24 6 -46 -40 44 -8 -10 -6 -36 -27 -19 38 -20 0 -20 -28 -19 -38 -43 31 10 -31 2 2 43 -8 -2 -13 5 10 -43
7842d3P3r7L1O4o4N1N8r1oK0lK5n5N1k2l4OM3K8m5M5l2%J2j6M4n1M5j1j4k2J8
$$ -43 30 -67 -36 28 -36 15 73 -18 -24 -4 -7 18 -37 14 -8 -42 -36 7 35 -10 35 3 3 15 -1 43 -8 37 26 12 -10 8
7874Hk3O9o4rNj8J5j3L2pjj6L1r0O7Kjj1L3J3K3j5k2K1J5n1p4N8M1J9k9j7J6m
$$ 8 -15 54 -10 -19 -14 -32 -17 -30 2 -5 -6 -22 9 -81 -14 -12 -13 -24 9 22 45 30 8 29 44 -7 -81 -23 18 37 8 -9 7 3
7908Cprl5L5N0l4k1J2M4j8j3Pn1J9L2o2P3K6j9j5l6K3O0q1J1jN4n6K8p2O3j5j3
$$ 3 -4 -13 -48 -13 37 3 -18 -6 38 20 7 14 -37 -18 14 -48 25 51 32 17 -19 4 64 -17 -6 -7 47 -9 19 -53 10 -5 -18
7941a8K0lm6Q7m5K1m0K8Kk5O9n8M1j4K0K0n4k0K1j9jRNrN0J2rm2Lo2P1pl3K3K2
$$ -18 2 -1 -47 40 -5 16 -24 4 6 -19 50 -8 33 19 39 59 5 -15 6 -13 -14 -5 0 -9 41 53 44 2 5 -57 14 7 -26 -3 19
7976A9m7k7lJ8j4O8j3Nl8M5mk1rK4l4J0K4L7j7m2O9p4O6po2N9j1l7LlPlj4mK6
$$ 19 -28 -55 -58 -40 -54 14 1 6 -32 13 9 -12 -21 3 -31 -21 3 40 23 -19 50 -24 42 35 -27 32 21 -16 -13 -16 -9 -12 -26 -30 -4
8011dJ8J6n4NJ9k8L4l7O7l9m1L1k1O0l3l4L1L8k9l9N3N5o8J0J5k7L2l9j7N9qj4
$$ -4 14 30 -24 -19 0 -28 6 -31 36 -3 -44 -13 -34 26 -7 -41 -10 28 -1 -40 13 68 0 10 25 -2 30 -9 -26 33 25 11
8043A1K4l3Mk2K4k2O0m5n6N6J6oK6o3Q1l3n0K4j2j6J9K9K4k4m7RO5k9mj0L9j9
$$ 11 35 2 6 -16 8 -14 46 1 -55 1 17 11 37 -26 55 22 -28 -4 -16 -32 -13 16 40 16 -31 -22 43 14 10 0 39 20
8075B0K2q4K7j4LJ0j9j1R3k6l3qJ7M6%l5K3m2K4k1NL8n5O3o5K8k6L7j7l6M3Nq7
$$ 20 42 -42 -15 -29 -26 -16 -35 -46 47 21 -12 -20 -3 43 43 8 31 -11 13 -8 -3 35 -20 43 -22 6 -20 17 0 -36 7 12 -75
8108g5J04j6j1j6MLj2j1j7K2N3m7O2j9m9N6n6OO8k3m2J0J1l0k6O6m3M3l7QK8O
$$ -75 29 13 2 -14 -10 -7 -19 -30 -47 -25 28 -19 43 24 -25 31 -25 -19 49 26 -16 -6 5 -25 -51 15 -28 15 -22 -14 14 20
8140B0k2K9m6JL3jj5J1k6j7J9m3O6m0M3l3JL4Jml2MkR8r8NN0j7J8%l2Ll3K6m6
$$ 20 -2 27 -19 -18 15 14 -1 10 -16 -33 -14 -57 9 -31 12 -21 -20 14 15 11 -21 -17 -19 79 -19 -14 36 19 37 37 5 8 -25 1 -45
8175d5N2Po3Q2l0l4P0ml0M0j5l0oK5l5K
$$ -45 7 14 -49 33 3 -31 39 35 5 45 30 0 -6 19 -16 -14
8191a4
$$ Imaginary data points
##PAGE= N=2
##DATA TABLE= (X++(I..I)), XYDATA
0@%%%%%%%Qj6J6j6K4l2M0m8N6p3R5j18J39j65K02k42K83l31L88m54N27o07O97
$$ 0 0 0 0 0 0 0 0 8 -8 8 -8 16 -16 24 -24 32 -41 54 -64 75 -90 112 -130 153 -178 210 -244 283 -324 373
30C73p98R12j038J174j326J495j679J881k106K351k620K914l233L582l962M378
$$ 373 -425 487 -551 623 -703 792 -887 994 -1112 1239 -1381 1533 -1700 1882 -2080 2298
46B298m834N333n878O474p131P856q657R550j0549J1672j2945J4399j6086J8066
$$ 2298 -2536 2797 -3081 3393 -3738 4118 -4539 5011 -5538 6134 -6811 7588 -8498 9568
60I568k0424K3295k6881L1502l7708M6530o0132Q3986j37517M60073j24575r08654
$$ 9568 -10856 12439 -14442 17060 -20648 25882 -34250 49736 -87781 372292 247717 -660937
72f60937Q29608L51687p46373j12864N81305k67290k35340L30523m4083k67303
$$ -660937 168671 520358 -226015 -338879 242426 -24864 -260204 70319 26236 -241067
82b41067L60729O8286m01387K09412M00547m47906k34011N37238J7403n84612
$$ -241067 119662 187948 -213439 -4027 396520 -51386 -285397 251841 269244 -315368
92c15368J27361M28058k37548k74645K56351J13714j59831L3709J04786n6304
$$ -315368 -188007 240051 2503 -272142 -15791 97923 -61908 -28199 76587 20283
102B0283J144M4971l4490j012N759q7404R245R2603p2236j07375Q4689Q8968m2618
$$ 20283 21427 66398 31908 30896 36655 -50749 -41504 51099 -21137 -128512 -43823 45145 2527
115B527m1243J2916N7759O5732o6608r2696J00517O4987j51427k1462J37592p9198
$$ 2527 -38716 -25800 31959 97691 31083 -61613 38904 103891 -47536 -68998 68594 -10604
127a0604j12384J45284M1461j62766N5971J41993j07723m2615J40982n8364j12936
$$ -10604 -122988 22296 63757 -99009 -43038 98955 -8768 -51383 89599 31235 -81701
138h1701J39246L5089j84456L6598J44506j07361o3429J26657m3116q8546J45267
$$ -81701 57545 92634 -91822 -55224 89282 -18079 -81508 45149 2033 -86513 58754
149E8754K0512j88849P4184J79394j47214j14396J75336J5328j56186P2253Q9056
$$ 58754 79266 -109583 -35399 143995 -3219 -117615 57721 73049 -83137 -10884 78172
160G8172j24968k749J25751p0595p6288J07293j480r8673P2138M6279j13422K3536
$$ 78172 -46796 -49545 76206 5611 -70677 36616 35136 -63537 8601 54880 -58542 -35006
172c5006J10082q0517n9219J12826o439r7785P2528N2418j13503j819J06754m9119
$$ -35006 75076 -5441 -64660 48166 41727 -56058 16470 68888 -44615 -46434 60320 11201
184A1201q1270N8759L3083l6924J1840Lj9493N9434J5337r0097K1250R7331o7084
$$ 11201 -70069 -11310 21773 -15151 -3311 -3308 -22801 36633 51970 -38127 -16877 80454 13370
197A3370q4461Q7856L3643j05517J847Q4455k9883m5785M1522K0243o812J5323
$$ 13370 -71091 16765 50408 -55109 -53262 31193 1310 -44475 -2953 17290 10478 25801
209B5801k2570j3105N9962j1328r0633L1930P5996p4297o0428Q5182K3272p7289
$$ 25801 3231 -9874 50088 38760 -51873 -19943 56053 -18244 -78672 6510 29782 -47507
221d7507J7540O5286k2169k2188K8114L821l142L691l2546m923M1747l1429n7932
$$ -47507 -29967 35319 13150 -9038 19076 22897 19755 23446 -9100 -14023 27724 -3705 -61637
234f1637N0044M0734o5499p280P4941r837m4311L9180K3410l6245M315J4817k8380
$$ -61637 -11593 29141 -36358 -43638 31303 21466 -22845 16335 39745 3500 7815 22632 -5748
247e748R3J2803l5332l42M0808l0840k7893O6623J2463o7812L2985O8834n7208
$$ -5748 -5655 7148 -28184 -28526 12282 -18558 -46451 20172 32635 -35177 -2192 66642 9434
260I434m1793O7291J42o7873J9616L0823m1374p51L0849k7098K163M6868l0211
$$ 9434 -32359 34932 35074 -32799 -13183 17640 -23734 -24485 6364 -20734 -18571 28297 -1914
273a914k7453P0307L569q3660L2946P3124p1508n5478P8176J2890p6034J6411
$$ -1914 -29367 40940 44509 -39151 -6205 66919 -4589 -60067 18109 30999 -45035 -28624
285b8624N0366l0558j0049L5066j3457r045L4686j6431l1429M0138Q454n9836
$$ -28624 21742 -8816 -18865 16201 2744 -6301 28385 11954 -19475 20663 29117 -30719
297c0719J1682N2264l9008m0455M8517K0869m1048J665L0032m744n530M269q731
$$ -30719 -19037 33227 -5781 -46236 2281 23150 -17898 -16233 13799 9055 3525 7794 -937
310i37O435J0590k3174p252K6201j1296k5998K4737J4234k9890M906K8218j4363
$$ -937 5498 16088 -7086 -14338 11863 567 -25431 -694 13540 -16350 -11444 16774 2411
323B411r131K0779r371j2406K4781p452l3345K4181K2156m1094m383M3005j7723
$$ 2411 -6720 14059 4688 -7718 17063 9611 -23734 447 22603 -18491 -22874 20131 2408
336B408k9794L7749J0354m0882J6106L2955l3609j2551L7615j3903l0132L1101
$$ 2408 -27386 10363 20717 -20165 -4059 28896 -4713 -17264 20351 6448 -23684 7417
348G417P700l9813J4659L3263l0820j3657L7951n741k7537K4226R764l0340J0190
$$ 7417 15117 -24696 -10037 23226 -7594 -21251 16700 10959 -16578 7648 17412 -12928 -2738
361b738K3073k7133r745K9576r286k3082K1717P941k3805J0171J8331j9300k966
$$ -2738 20335 -6798 -16543 13033 3747 -19335 2382 10323 -13482 -3311 15020 -4280 -7246
374g246K1018j1168j2249J9047l783k0137J6238R246k4803M580K2528j7179r575
$$ -7246 13772 2604 -9645 9402 5619 -14518 1720 10966 -13837 -9257 13271 -3908 -13483
387a3483K5555m767k0933K0636J0132k8234M956K4731k1144j5067K7627k555k7110
$$ -13483 12072 7305 -13628 7008 17140 -11094 -6138 18593 -2551 -17618 10009 7454 -19656
400a9656J7759J7347k6246r10K8315j2674j8239K3722M487k6362R618J9112k2770
$$ -19656 -1897 15450 -10796 -11706 16609 3935 -14304 9418 13905 -12457 -2839 16273 -6497
413f497r419K6406m366k4342J5652J7727k0523o609K2618j205j7722Q015J1481
$$ -6497 -15916 10490 6124 -18218 -2566 15161 -5362 -11971 10647 9442 -8280 -265 11216
426A1216j1137n618R043j848p914N067L170p837K168R985n875q496J1961P088
$$ 11216 79 -5539 3504 1656 -6258 -1191 1979 -5858 -3690 6295 420 -8076 3885 10973
440A0973j6213l111J9228l053k0623Q594J7459j4762j2649J7449N034j6201L415
$$ 10973 -5240 -8351 10877 7824 -12799 -4205 13254 -1508 -14157 3292 8326 -7875 -4460
453d460J2381q040l956J0315m523p741J1323P74j5707P532J4819j5955j0297K1263
$$ -4460 7921 -119 -4075 6240 1717 -6024 5299 6073 -9634 -2102 12717 -3238 -13535 7728
467G728K557k2647N378J9436j1445j2316J4451M244j2989L322Q386q070j783R668
$$ 7728 10285 -12362 -6984 12452 1007 -11309 3142 7386 -5603 -2281 6105 -1965 -3748 5920
481E920m727p497J0050K549j3522K786J3099r123j1013J3740O991j5417o28J5656
$$ 5920 1193 -6304 3746 6295 -7227 -4441 8658 -465 -11478 2262 9253 -6164 -6792 8864
495H864m243j1832R205O278j1932L7J0606q003q286J2039J223j4260O265J2960
$$ 8864 4621 -7211 1994 8272 -3660 -3623 6983 -1020 -9306 2733 3956 -10304 -4039 8921
509H921j1604n623J7144j047j5689R498J1025j5776m262J5722o337j4041J2445
$$ 8921 -2683 -8306 8838 7791 -7898 1600 12625 -3151 -7413 8309 1972 -12069 376
522C76N999j6418L335J6741r855r380J6887K738j6343O004J1398j3745n464J3970
$$ 376 6375 -10043 -6708 10033 178 -9202 7685 10423 -5920 84 11482 -2263 -7727 6243
536F243n525j3268J1559O443j4814K790J5249p776p725J4128J866j3275N254Q613
$$ 6243 718 -12550 -991 5452 -9362 -6572 8677 901 -6824 7304 9170 -4105 1149 9762
550I762j1657m924J0638l175j0208O546O135p450j38Q518j343l816M865J696m557
$$ 9762 -1895 -6819 3819 644 -9564 -3018 3117 -4333 -4471 4047 2704 -1112 3753 5449 892
565H92M70K261m257l001K786l83m156J032M212l55j993K839L499j103j568J839
$$ 892 1362 3623 -634 -3635 -849 -1232 -5388 -4356 -144 -499 -2492 347 3846 2743 1175 3014
581C014P75k612j156O75j930j915J717l08k536K401L491k138o16M694L3l466J980
$$ 3014 3789 1177 21 696 -1234 -3149 -1432 -1740 -4276 -1875 1616 -522 -1138 3556 3589 123 2103
598B103J429m278k41K863l991k824N200j48n710L744N734m816j532P197q77n906
$$ 2103 3532 -746 -987 1876 -2115 -4939 261 113 -5597 -1853 3881 -935 -2467 4730 3853 -2053
614b053M234K968p309n40O244l957n374N817K161o132J988N290m065j250O253
$$ -2053 2181 5149 -2160 -2700 3544 -413 -5787 30 2191 -3941 -1953 3337 -728 -1978 4275
629D275k243n774N943L406r005j256R007k556q351M516O017n067k564M936K01
$$ 4275 2032 -3742 2201 5607 -3398 -4654 4353 1797 -6554 -2038 3979 -1088 -3652 1284 1485
644A485k106K287o59k768L721J996o486p44P200j525p352K955N958l865l784M022
$$ 1485 -621 1666 1007 -1761 1960 3956 -2530 -3274 3926 2401 -4951 -1996 3962 97 -3687 335
660C35J693k966N71J658k072J79K889j857l251L097K559l922j744L912M19l217
$$ 335 2028 -938 -367 1291 -781 -602 2287 430 -2821 276 2835 -1087 -2831 1081 1500 -1717
676a717J052J698j987O24K625k876j939N143Q40o421P63O532k666n809L336L708
$$ -1717 -665 1033 -954 -330 2295 -581 -2520 2623 3463 -2958 -2195 4337 1671 -4138 -802 2906
692B906l603j515K392o45l4J981k184j900M741J202n906L79N741k046m641K580
$$ 2906 -697 -2212 180 -465 -499 1482 -702 -2602 2139 3341 -2565 -2186 3555 1509 -3132 -552
708e52K280k526k0J286j721R30K764k702k181M402J099m680L22L624j694k085
$$ -552 1728 -798 -818 468 -1253 -323 2441 -261 -2442 1960 3059 -1621 -1299 2325 631 -1454
724a454J625m74j089K252n03l198K459L381l627k144M238J010l620K41K084r40
$$ -1454 171 -303 -1392 860 357 -2841 -382 2999 -628 -2772 1466 2476 -1144 -903 1181 241
740B41n19N94j247J1K283q94k519J854K489k016j820K111J208j702r12Q92M66
$$ 241 -278 316 -931 -920 1363 469 -2050 -196 2293 277 -1543 568 1776 74 -838 54 520
757E20n11n69j19N08L01l20m63J80R81P1j195p9J777j50k020N13J981j176j529
$$ 520 9 -560 -679 -171 130 -190 -653 -473 508 579 -616 -695 1082 932 -1088 -575 1406 230 -1299
776a299J465O97j368K48R03r96K45J254j371p87K343l29k799J555K113k577j144
$$ -1299 166 863 -505 -257 646 -350 -105 1149 -222 -1009 1334 1005 -1794 -239 1874 -703 -1847
793a847K759k16k148J271Q63j654R49J252k269k9L141j463k958K646K021l269
$$ -1847 912 696 -1452 -181 682 -972 -23 1229 -1040 -1069 2072 609 -2349 297 2318 -951
809i51n73K836p50j471J547k89j647K204P97l579N73L924j954l518K852K260l020
$$ -951 -1524 1312 562 -909 638 349 -1298 906 1703 -1876 -1303 2621 667 -2851 1 2261 -759
826g59p32K088n20o10J251j206j095K857N78m022M43M478j308m095J820L347j877
$$ -759 -1491 597 77 -533 718 -488 -1583 1274 1852 -2170 -1727 2751 1443 -2652 -832 2515 638
843F38k231J351J066m98j73n36n59J556J075k595j313L277J286l886r36M026L71
$$ 638 -1593 -242 824 326 153 -383 -942 614 1689 -906 -2219 1058 2344 -1542 -2478 1548 1919
860A919l825L43K974q81j666J253R1q96J503K65k659Q03L258j948l060K774K241
$$ 1919 -1906 -1563 1411 530 -1136 117 208 -688 815 1080 -1579 -776 2482 534 -2526 248 2489
877B489l009j123K686k04j671J047J83j428J240J274k389p79K985q2k987O95K334
$$ 2489 -520 -1643 1043 839 -832 215 398 -1030 210 1484 -905 -1684 1301 1219 -1768 -1073 1261
894A261q55j464P82M72q5K71p10m86J418N29j768k94J798k1j388J24P97O0k80
$$ 1261 406 -1058 -276 196 111 382 -328 -814 604 1133 -635 -929 869 848 -540 -416 381 441 161
913A61l41j92O03M06q82n09R76M38r65m21P15M73o49m20N53L39l97j91M21j65
$$ 161 -180 -372 231 637 -245 -754 222 660 -305 -726 -11 462 -187 -607 -54 285 -112 -303 118 -47
933d7p1M99k57p42Q45O46j257l33J611k34j656R61J198j580m05J674m98j571J336
$$ -47 -118 381 124 -618 227 873 -384 -717 894 660 -996 -35 1163 -417 -822 852 354 -1217 119
952A19R11j792j71J910p91j434J540N75j826N81J550j391r19K027J04k100O44
$$ 119 1030 -762 -933 977 186 -1248 292 867 -959 -378 1172 -219 -1138 889 993 -1107 -463
969d63J817j171j078J190L92q82K22K37n55K83P13q90p41J241O28j498n76J442
$$ -463 1354 183 -895 295 687 -195 27 264 -291 -8 705 -185 -926 315 943 -555 -1131 311
987C11N41j225o18J037O29p54o03M31P30p3o55k72O46O97o62r58P25J248p97j466
$$ 311 852 -373 -991 46 675 -79 -682 -251 479 406 -249 -521 125 822 160 -798 -73 1175 378 -1088
1007a088Q71J438r44j148P47Q66n74m81J7J84M43n6j006O2J301k02j320L67J033
$$ -1088 -217 1221 277 -871 -124 742 168 -313 -296 -112 331 275 -731 -669 632 430 -890 -523 510
1026E10k46n83j6K51M80nq52J3J106o8j091J48Q08j04m48m0m1N05L20j058m71
$$ 510 264 -319 -335 -84 396 391 -461 -448 658 590 -501 -353 455 351 -97 -137 -178 327 647 -411 -882
1047h82J547L48k090J26K019o18j638R71Q73r37j46Q45o25k07J187n51j262J331
$$ -882 665 1013 -1077 -951 1068 450 -1188 -217 656 -281 -427 418 -207 -414 773 222 -1040 291
1065B91R24j732l54J850m38j421R86O56j195J36R68p87m81J043M7j048J94P43
$$ 291 1215 -517 -871 979 541 -880 106 762 -433 -297 671 -116 -597 446 493 -555 -361 382
1083C82k01m35j02J38N59j89r09L96J122o20r52Q89O57p41k26M41o8J34N2q04
$$ 382 181 -254 -356 -218 341 152 -757 -361 761 141 -811 78 735 -6 -232 209 141 275 327 -477
1103d77P5J362o42j583J157J503j701r50J992K58j700K06J126n58n36M50j79o9
$$ -477 -402 960 318 -1265 -108 1395 -306 -1256 736 994 -706 -500 626 68 -468 -18 -197 -266
1121b66N53m54n86R78M47j196R0J294l99r50N22O22n43l73L28M0Qj81k58L43L92
$$ -266 287 -167 -753 225 672 -524 -434 860 461 -489 33 655 112 -261 67 107 115 -66 -324 19 411
1142D11n19k76P91J23r60J66P68n62n03N50J00n62K88K77l11J56L84l10q7M63
$$ 411 -108 -384 407 530 -430 -264 504 -58 -561 -11 89 -473 -185 92 -219 -63 321 11 -76 387
1162C87r4n46L64L63o34k25N74P0n86J57M77mm70N4M87j64n20J18M72m35l51N06
$$ 387 293 -253 111 474 -160 -385 189 259 -327 -170 307 303 -167 -113 374 210 -310 -192 280 -155 -506 0
1184@mm17L88K01l37J66N17m68l68P83m3r46J94Q52n40n96P08L45o25J55N53l19
$$ 0 -4 -421 -33 168 -169 -3 514 46 -322 461 418 -528 -334 518 -22 -618 90 435 -190 -35 518 199
1206A99k56M55j79m87K62L7n90L4N50l90j43N87K22k76J29L58r9j53p5j98K2q0
$$ 199 -57 398 219 -268 -6 31 -559 -525 25 -365 -508 79 301 25 154 512 413 260 185 -13 9 -71
1228g1m34l4M64k19j24N68K86k62J52M18k49k69P5k51l20J3k84l60L82L38m94
$$ -71 -505 -539 -75 -294 -418 150 436 174 326 744 495 226 301 50 -270 -257 -541 -901 -519 -181 -675
1249f75J64R15J08m51M15N20m39n12K00k2n47m13J39K12p1q1K95N64K89k64J02
$$ -675 -511 404 512 61 476 996 557 45 245 223 -324 -737 -598 -386 -457 -538 -243 321 610 346 448
1270D48N04k1p07l36K39r7q37k95M72K93n28p4J212N17q57K47J107k69j071J21
$$ 448 952 931 224 -112 127 30 -807 -1102 -630 -337 -865 -939 273 790 -67 180 1287 1018 -53 68
1290F8M59o87o39L5J59J94J5j85L36J169j52r53P03J101j099j259J005M86j507
$$ 68 527 -160 -799 -764 -605 -411 -396 -581 -245 924 772 -181 522 1623 524 -735 270 756 -751
1309g51o76J164K55q81K8R70M24k94l15M10P16l91j020J40R86p55j184N78J036
$$ -751 -1427 -263 -8 -889 -861 109 533 239 -76 334 1050 659 -361 -221 765 10 -1174 -596 440
1328D40m82q06N95J003j68p56J85Q79j70j305k9J192l05j448K87J609m19j425
$$ 440 -42 -848 -253 750 582 -174 11 890 720 -585 -614 578 273 -1175 -888 721 302 -1123
1346a123P25J496o38j112M32Q85l35p82j09N63M52n86n17Q17R17r93p41J196P62
$$ -1123 -398 1098 460 -652 -220 665 330 -452 -561 2 454 -132 -649 168 1085 92 -649 547 1309
1365A309j630p27J425L23j669l46J467L15j034j6J066L05n16j37L07k9l59l39
$$ 1309 -321 -1048 377 700 -969 -1315 152 467 -567 -583 483 788 272 135 442 413 54 -285
1383b85j41R3k56l62M63O53l28l42J170R54r95p91J240M44j690q18J010Q2j368
$$ -285 -426 -333 -589 -951 -488 165 -163 -505 665 1619 624 -167 1073 1517 -173 -991 19 101 -1267
1402a267k47J140L25o40K23J102P35n88o53P07P49j179j574M19J148r80j593P28
$$ -1267 -1514 -374 -49 -689 -466 636 1371 783 130 837 1586 407 -1167 -748 400 -580 -2173 -1445
1420a445J733j36r90P74J520N1q29k5N77l43j076m83L39l90q27J37J003P9n20
$$ -1445 288 152 -838 -64 1456 1507 678 653 1230 887 -189 -672 -333 -723 -1550 -1413 -410 -331 -851
1439h51Q03J181j07m62M01L66o76p59K6j00q06n57O05N79k92m90J183J548m85
$$ -851 -48 1133 1026 564 965 1331 655 -104 -78 -178 -984 -1541 -936 -357 -649 -1139 44 1592 1107
1458A107j329Q98J665j022k325L33J544p54k152J44J848K31j375J15J876P63j269
$$ 1107 -222 676 2341 1319 -1006 -673 871 117 -2035 -1891 -43 188 -1187 -1072 804 1567 298
1475B98n13J442N02j789r03J162M12j633p81J350P95p65m78R32J063j70p92K14
$$ 298 -215 1227 1729 -60 -963 199 611 -1022 -1803 -453 342 -423 -901 31 1094 924 132 346
1493C46P04k75r40o3K44m97l25M47O6n82L75J001p5p64L46R23j44j025j59Q01
$$ 346 1050 775 -165 -228 16 -481 -806 -359 -293 -875 -500 501 426 -338 8 931 787 -238 -397 404
1513D04Q5j098k92R17L69q04l51J009O47q62n21Q44Q24r30j091P27J119p56j306
$$ 404 489 -609 -901 16 385 -419 -770 239 886 24 -497 347 1171 241 -850 -123 996 240 -1066
1532a066O01J293n17j214M55R08j51p03NM13K75j99n19J72P73k52p46M52P14n84
$$ -1066 -465 828 311 -903 -448 460 309 -394 -389 24 299 100 -419 -247 526 274 -472 -20 694 110
1552A10n47O30K62p52r0N67j92l19L03J28k23K44K45l25m9K04n2j96J06k05l25
$$ 110 -437 193 455 -297 -387 180 -12 -331 -28 100 -123 121 366 41 -8 196 144 -52 54 -151 -476
1573d76L85K07o03p9Q25K40o97o9P78R2m66k94L93J65l98m43K05K77j79l30K57
$$ -476 -91 116 -487 -566 259 499 -198 -267 511 603 137 -157 236 401 3 -440 -235 42 -137 -467 -210
1594b10M97j50l10J97M65j65l79pK86j30m52jK60mk85J05K75J38j22J13K35J2
$$ -210 287 137 -173 24 489 324 -55 -62 224 94 -358 -359 -99 -103 -388 -283 -8 130 8 121 356 368
1616C68k08M7J8j09l19R2J50k72j24J60K87j94m5K55J86q0j40m6R5m6k67j41J72
$$ 368 160 207 225 116 -203 -111 39 -233 -357 -197 90 -104 -149 106 292 212 72 26 121 75 -192 -333 -161
1639a61J1k75J2M21Jj41J17L79j10j33J35M2j36r7j19q5L9o2o9j0K47Pm0J10J55
$$ -161 -150 -425 -413 8 9 -132 -15 364 254 121 256 298 162 65 -54 -139 -100 -162 -231 -241 6 13 -27 83 238
1664B38p3nJ3o1j90J3j01m6j08QJ08J18L2K9J90J70k7m5PJ6o7j92k20KQ1k14j59
$$ 238 165 160 173 112 -78 -65 -166 -212 -320 -312 -204 -86 -54 -25 165 335 308 263 270 286 219 27 -193 -191 -110 -324 -483
1691d83L12K04j39K3M02J78l19q4K68q0m03r8j6m9o9k11J01M59P6k16K19N77n3
$$ -483 -171 33 -106 -83 319 497 178 94 362 282 -121 -219 -235 -284 -353 -564 -463 -4 72 -144 75 652 599
1714E99l99J84K07l52m76M4M4k46j91J04J89J37K5Q8L96K52k32j56K45J0o35k66
$$ 599 200 384 591 239 -237 -193 -149 -395 -586 -482 -293 -156 -131 -43 353 605 373 217 462 472 -163 -429
1736d29K99k01m09O7L28J28J4K39L72K60n7j32Q9Q6m00m18j5n3m20j64L00J61
$$ -429 -130 -331 -740 -673 -345 -217 -203 36 408 668 611 479 568 654 254 -164 -179 -232 -652 -816 -516 -355
1758c55qJ27M28K94Lp8J35K0l40k65j29L4l46l64K01L47Po7M09M88L4j28J22J88
$$ -355 -363 -236 192 486 489 411 546 566 226 -39 -168 -134 -480 -844 -643 -296 -289 -356 53 541 575 447 569 757
1782G57k21m50j94J18k48m62k9L60M2n3J08M69K58j44o4K87P0l72l74J43j1m80
$$ 757 536 86 -108 10 -238 -700 -729 -369 -327 -380 -272 197 455 311 247 534 604 232 -142 1 -10 -490
1804d90j91L20R4k58K49M44Q1o9J73Q5O7j21k19j35M7j49l60M8J89j07j95M16
$$ -490 -681 -361 -267 -525 -276 168 249 180 353 438 505 384 165 30 77 -72 -432 -384 -195 -302 -497 -81
1826h1L13l35N9L14J59l77M0K09j36k83l1J03j02j0r5O7J90jj59J78L31j27k88
$$ -81 232 -103 -44 270 429 52 92 301 165 -118 -149 -46 -148 -158 -253 -186 4 3 -156 22 353 226 -62
1849f2K57K48k68k80J70J52l18k02J08Q9j18j83J42K56q0m0J58K61n8p5K7J97
$$ -62 195 443 175 -105 65 217 -101 -303 -195 -106 -224 -407 -265 -9 -89 -129 29 290 232 157 184 381
1871C81j40k78LP5j49j77p8K04N1j92K93K40P7j44J12K18j40k62j21M5j44l57
$$ 381 241 -37 -34 41 -108 -285 -363 -159 -108 -300 -7 233 310 166 278 496 356 94 -27 18 -126 -483
1893d83p2J95l8m2J27L69R8L7R3L20p2k08j06J8j92l74j30N1R2j58M5L41K58k7
$$ -483 -555 -360 -398 -440 -313 56 154 191 284 604 532 324 218 236 44 -330 -460 -409 -317 -475 -430 -89 169 142
1917A42M0L75J34l50j66Q5j16m10j83K7j9j75j1L26K31J14N1K74K15m6j83M6m4
$$ 142 182 557 691 341 175 260 144 -266 -449 -422 -441 -616 -627 -301 -70 44 95 369 584 538 355 401 357
1940C57l26k72n7J6k21n9K32K01j6J20K81J78Qn7lq3j20l02j47k0j07j87J56J92
$$ 357 31 -241 -298 -282 -503 -562 -330 -129 -145 -25 256 434 442 385 382 299 179 -123 -270 -290 -397 -584 -428 -236
1964b36L4J9L49K45j22O0J69j25j94l1j49j89p0%k30J01K10J3l6L21J34j61O8
$$ -236 -202 -183 166 411 289 349 518 393 199 168 19 -170 -240 -240 -470 -369 -159 -146 -182 139 273 112 180
1987A80K05j67k22J03j5l20j29J66m6n8J48Q9j2J36K09r1Q5M2p3j49P7n1k29n8
$$ 180 385 218 -4 99 84 -236 -365 -199 -245 -303 -155 -66 -78 58 267 176 261 303 230 81 158 107 -122 -180
2011a80J23p4j76J53J93j37k7K56k4p1L4K0rkj01m3nn9r1J6J70k0q5J92P1j2j5
$$ -180 -57 -131 -307 -154 39 -98 -125 131 107 36 70 90 81 79 -22 -65 -70 -129 -220 -204 -34 -54 -139 53 124 112 97
2038I7Q6N0o8q3K8n4l1r0r2N8K8j52K0K04Jj32J07K24j02j77J43J14j78r6M1N4
$$ 97 183 233 165 82 110 56 25 -65 -157 -99 -71 -223 -203 1 2 -130 -23 201 99 -78 65 179 1 -95 -54 0
2064@j93M2O7m7J9R2NN7J73o0j24J44J49l32j75L46q5m09J08L07j74k02K87J28
$$ 0 -193 -151 -84 -131 -112 -20 -15 42 215 155 31 175 324 -8 -183 163 78 -331 -223 84 -90 -292 -5 123
2088A23j05J8J45j21MJ57k22p6K40j38l11J60L49l53j24L76Q1l65J76K67j92j85
$$ 123 18 36 181 60 64 221 -1 -77 163 25 -286 -126 223 -130 -254 122 203 -162 14 281 89 -96
2110i6K50o2k16R7Jk01L5K75k13j98L25J73l86K05L86k54k96L74O2m02J6K88j84
$$ -96 154 92 -124 -27 -26 -227 -192 83 -130 -328 -3 170 -216 -11 375 121 -175 199 261 -141 -125 163 -21
2133b1k09K92m2k22K47J50k99Q4L13k30l54M30J39n38j6N26k86l63L33K42m18
$$ -21 -230 62 20 -202 45 195 -104 -20 293 63 -291 139 278 -260 -276 250 -36 -399 -66 176 -242
2154b42j9L95j08j40K44J6l18K52J36l38k7L56j51l76L40K46m49kM02o1l98L12
$$ -242 -261 134 26 -114 130 146 -172 80 216 -122 -149 207 56 -320 20 266 -183 -185 217 156 -242 70
2176G0J58k66q0K38o0k14J37j0j70J23J58k12MK68n7k77K44K00k50o4J76p1j94
$$ 70 228 -38 -118 120 60 -154 -17 -27 -197 -74 84 -128 -124 144 87 -190 54 254 4 -60 116 45 -149
2199a49J02J98j72j1P6nj10J02J6j11N2R0j26o2J97j34j35J94N5j81q2K99n6j53
$$ -149 -47 151 -21 -32 44 39 -71 31 47 -64 -12 78 -48 -110 87 -47 -182 12 67 -114 -196 103 47 -106
2223a06Q3J45r7r5J49N9j18j5Q4q6l3N8j2p5J14o2o7J13Q9j36j15K06n3k06N1
$$ -106 -23 122 25 -70 79 138 20 5 89 3 -30 28 16 -59 55 -7 -74 39 128 -8 -123 83 30 -176 -125
2248a25K05j10j23K20Pk19R4J87j79MJ03K0q6Q8j4q6lR7j22o4J51J54l51Q9K63
$$ -125 80 -30 -153 67 74 -145 -51 136 -43 -39 64 84 -2 86 72 -14 -17 80 -42 -106 45 199 -152 -63 200
2273B00j75j94K21O4k41J8J87j09j05J48J4j82R3J58k04O5J78j02j64K44K3j42
$$ 200 25 -169 52 116 -125 -107 80 -29 -134 14 28 -154 -61 97 -107 -42 136 34 -130 114 137 -5
2295el5K33j43j41J64J0j28N1J49k23o5K25M9k50J16J15k02m7J92l4k14Q7K30
$$ -5 -40 193 50 -91 73 83 -45 6 155 -68 -133 92 141 -109 7 122 -80 -127 65 31 -183 -96 134
2318A34k12p4K22J3j12K2L4m8K5J14j56MJ41n5j79P6K08j93j28K22M7k13l6K04
$$ 134 -78 -152 70 83 -29 -7 27 -21 4 118 -38 -34 107 52 -127 -51 157 -36 -164 58 105 -108 -144 60
2342F0Rj85O2J17m8oj13N3P7jj21N6J61p5j69J36J55j96p7K08K0j17l3M0M7q0
$$ 60 69 -116 -54 63 15 9 -104 -51 26 25 -96 -40 121 46 -123 13 168 -28 -105 103 123 6 -27 13 60 -20
2368b0n4M2Q8m9j16N8J45n9j47P0J58j50j15J81J09j86l0P9O5j02O3R3q4q0J37
$$ -20 -74 -32 56 7 -109 -51 94 35 -112 -42 116 -34 -149 32 141 -45 -75 4 69 -33 30 123 39 -41 96
2393I6n7l7J22o9j00J01P6k57L4K14j56j67K73kk49O1K15j42j58K52N6k75J49
$$ 96 39 2 124 55 -45 56 132 -125 -91 123 -33 -200 73 71 -178 -117 98 -44 -202 50 106 -169 -20
2416b0J64k22K3K03j08k32K60P5k65N2K61j61j39K13J9l02K24J46k77p5L21r0
$$ -20 144 -78 -55 148 40 -192 68 143 -122 -70 191 30 -109 104 123 -179 45 191 -86 -161 160 70
2438G0k71K03J40k68J3K54j22j55J87K3j59Q0L2j49P7J79k21n7K43Kk62J78J36
$$ 70 -201 2 142 -126 -113 141 19 -136 51 74 -85 -5 27 -122 -45 134 -87 -144 99 101 -161 17 153
2461A53k24M3K14k09j62K45L9k14J23J37k85N7K36j82k02L57k3k91J78K21l01
$$ 153 -71 -28 186 -23 -185 60 99 -115 8 145 -140 -83 153 -29 -231 126 103 -188 -10 211 -90
2482i0p3K75o3k43K26J19j88k1K18j12j83J98M7j74J5P6M2j75J52Pj43m0J34L2
$$ -90 -163 112 49 -194 32 151 -37 -58 160 48 -135 63 110 -64 -49 27 69 -106 46 53 -90 -130 4 36
2506C6q1K3J00j14l4J60l5j35N3J72j47j50K35Q6l07J42J99j21k16K21K3k34J54
$$ 36 -45 -22 78 -36 -70 90 55 -80 -27 145 -2 -152 83 169 -138 4 203 82 -134 87 110 -124 30
2529C0J17k36pK43j70j62K24J15l04K9K52k11j34L03j7j98J65R0j55m9J96j61
$$ 30 147 -89 -96 147 -23 -185 39 154 -150 -121 131 -80 -214 89 72 -126 39 129 -26 -75 121 -40
2551d0QJ52j01q5J44Q0k52J14J45k21M4J29q6j59J78lj82J19J30k11pJ97j16j21
$$ -40 -32 120 19 -66 78 158 -94 20 165 -56 -12 117 31 -128 50 47 -135 -16 114 -97 -104 93 -23 -144
2575a44K00N4k54N1K84k32r9K58o2k19J68J57k56l6K90j01k25K02R6k44M1J78
$$ -144 56 110 -144 -93 191 -41 -140 118 56 -163 5 162 -94 -130 160 59 -166 36 132 -112 -71 107
2597A07q5j01J10R0k05R3M9l3j18J26l2o0M2M6k3k6M3N4l4j17J39M4j36m1J65
$$ 107 22 -79 31 121 -84 9 58 25 -93 33 1 -59 -17 29 6 -20 23 77 43 -74 65 109 -27 -68 97
2622I7p3j57J07J04j24j7J48r2j00J40pr5OJ67j77p5J86K9k30J18J93j74k2J44
$$ 97 24 -133 -26 78 -46 -63 85 -7 -107 33 26 -69 -63 104 -73 -148 38 67 -163 -45 148 -26 -48 96
2646I6K7j85J38N7j26k5J17n2q6M9Q1j39O5L9j0r5O4L0j04lM6L2j13O3N2o2l4
$$ 96 123 -62 76 133 7 -18 99 47 -39 10 91 -48 17 56 46 -49 15 45 -59 -62 -16 16 -97 -34 18 -44 -78
2673g8O3M9m7m0J07n9l9O1P4j32K7J11n1j23J36K6j20J9J51j39l4J08k6j39R3
$$ -78 -15 34 -13 -53 54 -5 -44 17 91 -41 -14 97 46 -77 59 85 -35 -16 135 -4 -38 70 44 -95 -2
2698bM1j51L1J14m3j18J53Q3k04L7J84j78j2J73j36j18J87K9j00l3J96j73l2J43
$$ -2 39 -112 -81 33 -10 -128 25 108 -96 -59 125 -53 -65 108 -28 -146 41 70 -30 -63 133 -40 -72 71
2722G1J0j92O5J65j70l4J66k8j95J69L9j29K2J07n1q5J26Oj41J49J3j21kQ7m1
$$ 71 81 -111 -46 119 -51 -85 81 53 -142 27 66 -63 -41 66 15 -70 56 62 -79 70 83 -38 -40 47 6
2747FrK8J5k1n5L7j0M9o2n9J48l1j80R2J43q0j92K37Lj41O0Q1j17M9J04j07r9
$$ 6 -3 25 40 19 -36 1 -9 40 -22 -81 67 36 -144 -52 91 11 -181 56 59 -82 -22 59 -58 -9 95 -12 -111
2774a11J95L6k91K53J17k71r4L58j34k23J95J29k41L2J42o2r2R6%j39J55Mj86
$$ -111 84 120 -171 82 199 -72 -166 192 58 -165 30 159 -82 -50 92 30 -62 34 34 -105 50 54 -132
2797a32L8K18j32j75J36J43k05m7K55k8k17J30J06k2n8p9J15K7o1o9J04Q1j87
$$ -132 -94 124 -8 -183 -47 96 -109 -156 99 71 -146 -16 90 68 10 -69 46 73 12 -57 47 128 -59
2820e9l0J69o1j09L7N5K2n9k1l1J71K1k36mK63p3k96K07K21k45o9J83k0j02L4
$$ -59 -89 80 19 -90 -53 2 24 -35 -56 -87 84 105 -131 -135 128 55 -241 -34 187 -58 -127 56 36 -66 -32
2845c2J00n6N6p6m1Q2O2j72oJ32o0j66J41J37j34l9Q1K3L2m5r0J11P5k26n7L25
$$ -32 68 12 68 -8 -49 33 95 -77 -83 49 -11 -177 -36 101 -33 -72 9 32 64 19 -71 40 115 -111 -168 157
2871A57o3l03J49L01k64j39K03J38k48P8O1j19qJ20j21J3R1n4j62K13J47l14j8
$$ 157 94 -209 -60 241 -23 -162 41 179 -69 9 70 -49 -57 63 -58 -45 46 -8 -170 43 190 -124 -142
2894a42K42l3k39J79R3j63j6J44m7k9L6n5Q9N9q3j46J96J18k83KJ99p4j83J28
$$ -142 100 67 -172 7 100 -63 -79 65 18 -11 25 -30 59 118 35 -111 85 203 -80 -78 121 47 -136 -8
2918hJ10n8q9m4R3R0j27j47K48Q2k38p6K22N5k55J13J87j14j19P9L4N3q5o4L7
$$ -8 102 44 -45 -89 4 94 -33 -180 68 150 -88 -164 58 113 -142 -29 158 44 -75 4 38 91 6 -58 -21
2943b1J93j11k20K09K06k75j45K29J14k83kK20j0j97l0J30L9n9j35J37J80k15
$$ -21 172 61 -159 50 256 -19 -164 65 179 -104 -106 114 104 -93 -123 7 46 -13 -148 -11 169 -46
2965d6j67K04J26k25m0K24J9j31o2J19O9k0j71O8J60q1j99P3K67j48k56J51L01
$$ -46 -213 -9 117 -108 -148 76 95 -36 -98 21 90 70 -101 -33 127 46 -153 -80 187 39 -217 -66 235
2988B35l29n0J74J00j55n8R5J1l9o7k6J90p1j54O0J81l4j31O4J81j11j43K6J13
$$ 235 -94 -144 30 130 -25 -83 12 23 -16 -83 -109 81 10 -144 -84 97 63 -68 -4 177 66 -77 -51 62
3012F2j7j78K2J67m6j86O4K61j48j56K01R3j58m3Q7o7pM9j4r6J94J7k72J60K17
$$ 62 45 -133 -111 56 10 -176 -112 149 1 -155 46 139 -19 -62 25 -42 -49 0 -14 -110 84 101 -171 -11 206
3037B06k34j09L00j8l11J45J43j15j89J97K8j30M9J12j11K9J25j22n3J48j06j28
$$ 206 -28 -137 163 145 -166 -21 122 7 -182 15 43 -87 -38 74 -37 -8 117 -5 -58 90 -16 -144
3059a44J42M5j87M2K40j36j20J82Q4j53L9P2j25K5O4p9r6J87m2j37L6P4n4j1P9
$$ -144 -2 43 -144 -102 138 2 -118 64 148 -5 34 106 -19 6 70 -9 -105 82 40 -97 -61 13 -41 -52 27
3084B7O2n6m3O0o9n1M3M6r5l1O9j1J8kR8l7l4L6P7j21J1J23j72p9J83o6j54J50
$$ 27 89 33 -10 50 -19 -70 -27 19 -76 -107 -38 -49 -31 -33 65 28 -6 30 107 -14 -3 120 -52 -131 52 -14 -168 -18
3112a8J54k24nK32%k07J86O9l11L7J96j37k11K47M2j93R8K13k23N0K39j16j88
$$ -18 136 -88 -93 139 139 -68 118 187 -124 -87 109 -28 -239 8 50 -143 -45 168 -55 -5 234 118 -70
3135g0J74J5k50J3K06j60j84K55O1j89O4K05m1j71J89J0j73j3R1j10r5J16m4J
$$ -70 104 119 -131 -118 88 -72 -256 -1 60 -129 -65 140 99 -72 117 127 -46 -59 32 -78 -173 -57 -101 -100
3159a00J25P1p4P5O6Mj38J04Q8k29j42J67Jk38M9K19m6j23J11Q6J8n3k6L0L7p6
$$ -100 25 96 22 97 163 167 29 133 221 -8 -150 17 18 -220 -171 48 2 -121 -10 76 94 41 15 45 82 6
3185Fj73l3K64j01k62K49K55k39j05L98o0k78J20J59j81j11J28j05q3J79o4j15
$$ 6 -167 -200 64 -37 -299 -50 205 -34 -139 259 199 -79 41 200 19 -92 36 -69 -152 27 -37 -152
3207a52K64N4k84J64K85j97l90L47J67m38j00K92qk90J03J99k5L7J3L8R1J5k54
$$ -152 112 166 -118 46 331 134 -256 91 258 -180 -280 12 4 -286 -183 16 -9 28 41 79 170 185 -69
3230f9k8K57j73j65n1L05p4k35J26L04j05j41R0K16j23k15L5J08j39j18N4Q8J
$$ -69 -97 160 -13 -178 -229 76 2 -233 -107 197 92 -49 41 257 134 -81 -46 62 -77 -195 -141 -53 -52
3253e2q6J8J35J41k2k22K30J91l75r6K38M4m13P3L44j92j85K98N9j00N8Ol4O7
$$ -52 -138 -120 15 156 134 -88 142 333 -42 -138 100 144 -269 -196 148 -44 -229 69 128 28 86 92 58 125
3277A25n8k14K0J68j90k30L70Q4k78O4M07r3j80R8J31j50j30%J2L1l4j06M1K11
$$ 125 67 -147 -127 41 -149 -379 -9 75 -203 -139 268 175 -5 93 224 74 -56 -56 -44 -13 -47 -153 -112 99
3301I9j31j27L06J23k65L1J55o7j87j1J9m4L4j13k6J52R6j48O1K83j36j40J55
$$ 99 -32 -159 147 270 5 36 191 124 -63 -74 -55 -99 -65 -178 -204 -52 44 -104 -43 240 104 -36 119
3324A19P4k43j1P9j24qj3K6J8J48n3k2J75Oj23rN4r2j01J09p0q8O4j0m0J10J9
$$ 119 193 -50 -61 18 -106 -114 -127 -101 -83 65 12 -10 165 171 48 39 93 1 -100 9 -61 -149 -85 -95 -135 -25 -6
3351fn9J90M1j34m3J84j50j83J03J02j43o9J59j03N6J48r2K1J90q8k18J36P6k85
$$ -6 -65 125 166 32 -11 173 23 -160 -57 45 -98 -167 -8 -111 -55 93 1 22 212 124 -94 42 118 -167
3375a67K0J74m2j34Q2N3n8J08J02j40L4J45j98j25K60j6l22J43K04k34n7K40j6
$$ -167 -147 27 -15 -149 -67 -14 -72 36 138 -2 32 177 -21 -146 114 98 -224 -81 123 -111 -168 72 56
3398E6r2J28Qj91J58R0k83J5K38j74k44K35J48k34N8K28j08r1J30J17j53Nj7o9
$$ 56 -36 92 100 -91 67 157 -126 -111 127 -47 -291 -56 92 -142 -84 144 36 -55 75 192 39 44 27 -42
3422d2R4j6j17M3P5j3j18P6J70j41o3J24k2m2n7j0Q5m9j60Q6J99j26k3J2J86m8
$$ -42 52 36 -81 -38 37 24 -94 -18 152 11 -52 72 50 8 -49 -59 26 -23 -183 -97 102 -24 -47 -35 151 103
3448A03j11O6Pj7k0o8M3N1j06j02K11O6k07K6K80j03k20J68Q3j49j04J74p7l4
$$ 103 -8 58 65 48 28 -40 3 54 -52 -154 57 123 -84 -58 222 119 -101 67 150 1 -103 71 -6 -40
3472d0J2r2K5K08p8k64L01J46l26m4L33n1l00J30J68j49q3Q9o4J22l1j40J13J96
$$ -40 -28 -120 -95 113 35 -229 72 218 -108 -152 181 130 -170 -40 128 -21 -104 -15 -79 43 12 -128 -15 181
3496A81j17k73K14K56l28r5K55%k88J29J75j32m8Q9o7N8J17j51p5K57o0k72J43
$$ 181 64 -209 5 261 -67 -162 93 93 -195 -66 109 -23 -71 18 -49 9 126 -25 -100 157 97 -175 -32
3519c2J92k44q6K71mk25O4J92q0k7N0q0P2rj45J4K61j69j82J02J81j96q6J73J78
$$ -32 160 -84 -170 101 97 -128 -64 128 48 21 71 -9 63 54 -91 -77 184 15 -167 -65 116 -80 -166 7 185
3544A85j78m4P1R1j4j80j6K53p4k74J57J95j96j35K36L6j54R6Rm4N1o9j18J09
$$ 185 7 -37 34 125 111 -69 -85 168 94 -180 -23 172 -24 -159 77 113 -41 55 64 20 71 2 -116 -7
3568gJ20k93q0M32r1m02L09K59k68j12K73L9k83P4J01j77P4M9k11J04K77k43j61
$$ -7 113 -180 -260 172 81 -321 -12 247 -21 -133 140 179 -104 -30 71 -106 -32 17 -194 -90 187 -56 -217
3591b17M50K8m39J37L69k40k75J80J29k24j6N1k6O4P6j22P2J32j25r2K57Q8l07
$$ -217 233 261 -178 -41 328 88 -187 -7 122 -102 -118 -67 -93 -29 47 -75 -3 129 4 -88 169 257 -50
3614e0p4K64q9k31K1J48M8j35J6J56K1q1m1J64n0j80L9J48q6j10kM8L9N5j07O8
$$ -50 -124 140 51 -180 -159 -11 37 -98 -82 74 95 14 -27 137 87 -93 -54 94 8 -102 -104 -56 -17 38 -69 -1
3640aJ74j19j65K11J35k60j56K60R0l58M9K60j54j37K06J01j39M7L5p3M6nj22
$$ -1 173 54 -111 100 235 -25 -181 79 169 -189 -140 120 -34 -171 35 136 -3 44 79 6 52 47 -75
3663g5k7K23j39j89J81J42k25m0K03Q1j87M0J55o0j26LQ8l9m2qO0M2n8p6J14O1
$$ -75 -102 121 -18 -207 -26 116 -109 -149 54 135 -52 -12 143 83 -43 -40 48 9 -33 -41 19 61 3 -73 41 102
3689A02q2m2L1J05j12m4N6K5j54J9RJ21q6j27K20K2j08m3J62N1j84L6Q5o8jJ4
$$ 102 20 -22 9 114 2 -42 14 39 -115 -96 -87 34 -52 -179 41 63 -45 -88 74 125 -59 -23 62 -6 -7 7
3715Gj3rO0p9j9J35m9j26Q5J35j58j13K09Q3k00n4J34K7r6J4O5k7j1J7n2lJ08
$$ 7 -6 -15 45 -34 -53 82 33 -93 -8 127 -31 -144 65 148 -52 -106 28 55 -41 -27 38 11 0 17 -35 -38 70
3742G0q6o5P2L9p5M1J18j15q4J39J2j09l2R8J6q0jpN5j1j0k6Q6N1o6JK6j5j23
$$ 70 -16 -81 -9 30 -45 -4 114 -1 -85 54 66 -43 -75 23 39 -41 -42 -49 6 -5 -15 -41 45 96 30 31 57 42 -81
3771h1Q6L3q2k6L4P5o5j5N7J02q7n4QP6k0l4k9k0Qk2M4Jn7PO4J7JL7r8L9j8J4
$$ -81 5 38 -44 -70 -36 39 -26 -41 16 118 31 -23 -15 61 41 7 -22 -42 -34 -56 -12 -11 -68 -61 3 20 21 58 -40 -1 -19 -5
3803eq3J21N4j15k1N6n1RN3M8p4RN0q1P8J0m1ol6j8l7J7L4l4M8M5n2njM6m7rM5
$$ -5 -88 33 87 -28 -49 7 -44 -35 18 66 -8 1 51 -30 48 58 17 11 -25 -43 -80 -63 -29 -63 -15 30 -22 -27 -28 18 -29 -38 7
3836GM3j10M8Km7RJM8JkJ5J9N3nl2Qj2k6j4rk7kO8j15K9LQ5m3J9qJ6L1j1j1m6
$$ 7 50 -60 -12 -10 -57 -48 -47 1 2 0 15 34 87 82 50 58 46 20 6 -3 -30 -32 36 -79 -50 -47 38 -5 14 6 22 53 42 31 -15
3871a5O1o6j6RqO0n0L6lj4J2j7J06p9j1J8L5p7Om4J3L7o1N4K2l9l3P0Q7p0PO4
$$ -15 46 -20 -36 -27 -35 25 -25 11 8 -6 6 -11 95 16 5 23 58 -19 -13 -57 -44 -7 -68 -14 8 -31 -64 6 93 23 30 94
3903I4j7m4o5M2k1q1O0O5m0J0J7k9J9L8J2n8PM9j10L0K9n1o4R1Rr4O3Q9n2o7J18
$$ 94 77 33 -32 10 -11 -92 -32 33 -7 3 20 -9 10 48 60 2 9 58 -52 -22 7 -44 -108 -17 -8 -102 -39 50 -2 -69 49
3934D9k7o2O1M8p0k9Q1o3l0L0L6jjM8pp5M6nl9j06J37o0l4R6kk9m8R2n5RN8K8
$$ 49 22 -40 21 69 -1 -30 51 -12 -42 -12 24 23 22 70 63 -12 34 29 -10 -116 21 -39 -73 23 21 -8 -56 36 -19 -10 48 76
3966G6j29P9M5o1m6RQ5k5j04J30p7J5KO9k6n6%M2K3n5m2lJ01p9jN6Pq0J5P4pj9
$$ 76 -53 26 71 10 -36 -27 58 33 -71 59 -18 -3 -1 68 42 -14 -14 28 51 -4 -46 -49 52 -27 -28 28 35 -45 -30 44 37 18
3998A8n6MP2p4J9k0P4j2r6L5L3Kj3MN5pk2l3J5L3q4K7Q5k7o2J8M6j9m0M0J1o0
$$ 18 -38 -34 38 -36 -17 -37 37 25 -71 -36 -3 -1 -14 -10 45 38 16 -17 -2 31 -53 -26 59 32 -30 -12 34 15 -25 15 26 -34
4030c4M2N6k6k4l9M0QN2n2o0K6L9l7J4k1M3m0j3K2Ol8p9J21Ko3l0R8K1j32Q5k0
$$ -34 8 64 38 14 -25 15 23 75 23 -37 -11 28 -9 5 -16 27 -13 -26 -4 2 -36 -115 6 8 -55 -85 13 34 -98 -13 -33
4061c3J4OO5j06N5J12j48l3J18N2j70k6K18r1j16J23L3j43j5J50j65Q4J8K6j14
$$ -33 -19 -13 52 -54 1 113 -35 -68 50 102 -68 -94 124 33 -83 40 73 -70 -85 65 -100 -16 2 28 -86
4086h6J22lj49O6J60m9j43J02J8j93R6J27j28J5J71o6p4J8K7n1K7L7j6p0J18p
$$ -86 36 33 -116 -50 110 61 -82 20 38 -155 -59 68 -60 -45 126 60 -14 4 31 -20 7 44 28 -42 76 69
4112F9j46L0J86j54q5J29M7j17K3p%j3Q0n4l0k0N1K0n9Q5o3lK6J3l7l7Q6Rm9M1
$$ 69 -77 -47 139 -15 -100 29 76 -41 -18 -25 -25 -38 42 -12 -42 -62 -11 9 -50 35 -28 -31 -5 8 -29 -66 20 29 -20 21
4142B1N1r6oN3Qq5M1K4o9J6M2M1o0P0pp8JJ28j25j6J21R8j82MN4m6j9K1L8l1n9
$$ 21 72 -24 -30 23 31 -54 -13 11 -58 -42 0 41 -19 51 44 -34 -33 95 -30 -46 75 173 -9 -5 49 3 -16 5 43 12 -47
4173d7J01p8J0O0q0k0L8K8j27N0J15k2n8J3P9j07l7R7K3j05N8j8j5N0K3Nm0M7
$$ -47 54 -24 -14 46 -34 -54 -16 12 -115 -65 50 28 -30 -17 62 -45 -82 15 38 -67 -9 -27 -42 8 31 36 -4 43
4201D3m0l5J05k5r1Q0j4k9j3N1O7j29l1K7M0q1M2M5J5j9m8J2RK0k2j2P9j8q3N
$$ 43 3 -32 73 48 -43 37 23 -6 -19 32 99 -30 -61 -34 6 -75 -33 12 27 8 -40 -28 -19 1 -21 -33 46 28 -55 -50
4231e0P5N1j76J04P7k3j22J25lo9l1KP6j02N3k4RnP4r7J7J08p8l9M9L0r3N8J11
$$ -50 25 76 -100 4 81 58 -64 61 58 -11 -42 -40 36 -66 -13 -37 -28 -33 41 -56 -39 69 -9 -48 1 31 -62 -4 107
4260A07q4n1J6L2k3%mL3m1mL2k9K7Q0r4l0L8N5j10O7j7n4M2qK8l8N1k5j3N7L0
$$ 107 23 -28 -12 20 -3 -3 -7 26 -15 -19 13 -16 11 91 -3 -33 5 60 -50 17 0 -54 -12 -20 8 -30 21 -4 -17 40 70
4291G0p6m2P3nk2jN5j03L3O1m8Jl9L0J3n5J18k4r0J1O3r4L0P8n0j6Q7pq6M2Q4
$$ 70 -6 -48 25 20 -2 -3 52 -51 -18 43 -5 -4 -43 -13 0 -55 63 39 -51 -40 23 -71 -41 37 -13 -29 58 51 -35 7 91
4322I1o3q8J16K5r7j0J12j07k1Q4k6q0J11j0j2j9J28j31p7J21m5j19M0J12p4m9
$$ 91 28 -60 56 81 -16 -26 86 -21 -42 42 16 -64 47 37 25 6 134 3 -74 47 2 -117 -77 35 -39 -88
4348h8R2mn8M6N5j22L5P4n2P7m8N6r6L1Lm2O0Pk0k1O0K5j18N8L1p5mO0j1l3J4
$$ -88 4 0 -58 -12 43 -79 -44 30 -22 55 7 63 -33 -2 1 -41 19 26 6 -15 45 70 -48 10 41 -34 -38 22 11 -22 -8
4379hM6j04OM4pK2J1M3n2o3O3m4M9K0j2kj4kk7l6P8L8m6L3k5n4JQ6j6m7j8Q4p2
$$ -8 38 -66 -60 -16 -23 -1 10 53 1 -62 1 -43 6 26 14 12 -2 -4 -31 -67 11 49 3 36 11 -43 -42 44 28 -19 -37 47 -25
4412b5j4P6m1J7k0j2j5Q4mq7RP5M2j35J01L3r5j3M5K2j07P4k4m1O5ol4L3J3Kl4
$$ -25 -39 37 -4 13 -7 -19 -34 50 46 -41 -32 43 85 -50 51 84 -11 -24 21 43 -64 10 -14 -55 10 4 -30 3 16 18 -16
4443a6L0K2l7l4M3Q3n6r7Q2K0o4L2K1K6k1o7K9k1M6l8j2L6J3m6j2RK0j5QL1o4
$$ -16 14 36 -1 -35 8 91 35 -62 20 40 -24 8 29 55 34 -33 -4 -25 21 -17 -29 7 20 -26 -38 -29 -9 -24 -16 15 -49
4474d9P8k6O3r1N0Oj7n7Q6j08N2N7l2j07Q4N0o1P2L3o1q8J04L2o4l3L4K0o8R3
$$ -49 29 3 66 -25 25 31 14 -43 43 -65 -13 44 12 -95 -11 39 -22 50 83 22 -66 38 70 6 -27 7 27 -41 52
4503E2m2k6LN9p3J0L7l0ORK7n6k8J18l9n5lO0n0mJ1k9M7J3m1%M2j7n9j0O9K3j08
$$ 52 10 -16 -13 46 -27 -17 20 -10 -4 5 32 -24 -52 66 27 -28 -31 29 -21 -25 -14 -43 4 17 -24 -24 18 1 -58 -68 1 24 -84
4536h4J16ojj2l7NK0j4R5p2n4J04r5K2R2n7m1L3R3j35nL6j3k4K4lj7n8L9O2o3
$$ -84 32 26 25 13 -24 -19 1 -13 82 10 -44 60 -35 -13 79 22 -19 14 107 -28 -33 3 -10 -34 -10 -13 -30 -88 -49 13 -50
4567e0N1j0P4m6k0j4l8M2nj6m4R9k3PL0j5%lN4oq4Q3m1Mj2m3k5M8L3l5L0Jl4J2
$$ -50 1 -9 65 19 -1 -15 -53 -11 -16 -32 -76 23 0 7 37 22 22 19 73 67 -17 66 25 29 17 -26 -51 -3 30 -5 25 26 -8 4
4601DK5J4j12oR7j5o7LN8n0N2j3kL2Rj8k8K4J10j58K5jK3q5J15L3j58M3J05k4
$$ 4 29 43 -69 -75 22 7 -60 -57 1 -49 3 -10 -12 20 29 11 -17 7 117 -41 -16 -17 6 -79 36 69 -89 -46 59 35
4631C5m6K8L0m5nN0j13N8J9J0l2n3Q6p2M2N5k5l3K3J5pl8K2l1k2%L6rqK8J8NL5
$$ 35 -11 17 47 2 -3 47 -66 -8 11 21 -11 -64 22 -50 -8 47 22 -11 12 27 20 -18 4 -27 -49 -49 -13 -22 -30 -2 16 21 56
4664E6Or7L6LOq9J08M6j41K3J34o9j13J37M2p9RO6q7pN6q1k9N7J00j43j8J65j23
$$ 56 62 -35 1 4 10 -79 29 75 -66 -43 91 22 -91 46 88 9 18 84 -3 -10 46 -35 -64 -7 93 -50 -68 97 -26
4693b6l8K5Q7p7PR0q0n3j6Q1n3j6J19j12K7Q9p3N5j0L5p1K0J1pl4M6k1o3LN1M6
$$ -26 -64 -39 48 -29 -22 68 -12 -65 -81 0 -53 -69 50 -62 -35 54 -19 36 26 61 -10 10 21 14 -20 26 5 -58 -55 -4 42
4724D2n2N2pn8O2j6p5O5Pp4j0N9j5o0M9R0n8L0p3L1l8N2j9j2N1op3K0P1m6p8J34
$$ 42 -10 42 35 -23 39 23 -52 13 20 -54 -64 -5 -20 -80 -31 59 1 31 -42 -11 -49 3 -16 -28 23 17 -56 -36 35 -11 -89 45
4756D5O0j51J3R1l9jo0J3j2k0R3k3l6m9J00q1j3J14l4o3R7nq3K1R0m8j22O3J19
$$ 45 105 -46 -33 58 19 18 -42 -29 -41 -61 32 9 -27 -76 24 -57 -70 44 10 -53 44 39 -44 -23 67 19 -103 -40 79
4785G9j59K7N0K7k9J6rm1N7j1p6N4P7p9m0L8N0q3l6J30M6j34M9P7l2j28J17J8
$$ 79 -80 -53 -3 24 -5 11 2 -39 18 7 -69 -15 62 -17 -57 -19 31 -52 -88 42 88 -46 3 80 48 -80 37 55
4813E5r4jJ1N1p7K6k7M7J2K2n9k6J06m9o6N8M1j29pJ87q9n4L2P5j11P1O0q0M3
$$ 55 -39 -40 -29 22 -55 -29 -56 -9 3 25 -34 -60 46 -3 -69 -11 30 -99 -106 81 -8 -62 -30 45 -66 5 65 -15 28
4842B8M2m0q4J38o7j06Q4R3j18m6J44Rj45J21l3k2k4R0p4N7q3krP5l0m9l9O5J7
$$ 28 70 30 -54 84 17 -89 -5 88 -30 -76 68 77 -68 53 20 -2 -26 64 -10 47 -36 -38 -47 28 -2 -51 -90 -25 -8
4871hkK2L9l8k5O3j4j1m5K9M1Rj20L5M5P7q9N5Qo6l5P1l2Oj1qn0P4k3n7O6Q1o7
$$ -8 -10 12 51 13 -12 51 37 26 -19 10 51 60 -60 -25 20 97 8 63 71 5 -30 41 9 15 4 -4 -54 20 -3 -60 6 87 20
4904B0k1P2o2L5j33J10k5m6l1P2J3n8L4K6M5qm6L8l8qj1rn2N0K5k3N5K5m2M6P1
$$ 20 -1 71 9 44 -89 21 -4 -50 -81 -9 4 -54 -20 6 51 43 -3 35 -3 -11 -22 -31 -83 -33 -8 -31 24 49 7 53 124
4935A24p7n5L9N0p6j00R9j0m4m2J03Lj6O6n5M9J3q3oN8nr8pP6l0jj1K8Rk8J17
$$ 124 47 -8 31 81 5 -95 4 -6 -50 -92 11 14 -2 64 9 58 71 -12 -18 40 35 -63 -70 6 -24 -25 -36 -8 1 -27 90
4966I0l6k3Nj1m7mK0m8k3O4J8l3L4K2m9lR8n2Jj1K4m3o1j3J02o6q3Q4P8r6M9J02
$$ 90 54 31 36 25 -22 -26 -6 -54 -77 -13 5 -28 6 28 -21 -24 74 22 23 12 36 -7 -68 -81 21 -45 -128 -44 34 -62 -13 89
4998H9m9m8L3Jj4p5j0j2K8O3m6k2O7P6l5J1J8j3l1n4K5p8J2J2kj7R4o7M7pQ0n7
$$ 89 40 -8 25 26 12 -63 -73 -85 -57 6 -40 -62 5 81 46 57 75 62 31 -23 2 -76 -64 -52 -54 -71 23 -44 3 -4 76 19
5030A9Q5j1j05j2J9m7j6j0K6M0m9J9O7K0k8J3L6k3qm5k8lL0l4JRP9l3K5J7n4L3
$$ 19 104 93 -12 -24 -5 -52 -68 -78 -52 -12 -61 -42 25 45 17 30 66 43 35 -10 -38 -41 -11 -45 -44 -35 44 11 36 53 -1 32
5062C2J4Pm6K4l2qo3rK9P3J0o8O7K8l9K1L3m6j3Nn7J9m6k0L8K0K4jL8l2K1m0K7
$$ 32 46 53 7 31 -1 -9 -72 -81 -52 21 31 -37 30 58 19 40 73 27 14 19 -38 -19 -65 -85 -47 -27 -3 -4 34 2 23 -17 10
5095A0qj3ok3K9m8J0Q3m2j8N8J7j4m1K3J6Rq0k3K5n%K5LQOm0P8l2mNOnqo1M6o7
$$ 10 2 -11 -17 -40 -11 -59 -49 34 -8 -26 32 49 35 -6 17 33 42 -38 -61 -36 -41 -41 -16 -13 -5 1 -39 39 7 3 8 14 9 1 -60 -14 -81
5132h1k1O5RL3L7K1l0qK6p9rM8k7o9O8j2m1O3KJ1l4Q0k6jN2j4j10P1m8k1m6J04
$$ -81 -102 -37 -28 5 42 63 33 25 51 -28 -37 11 -16 -85 -17 -29 -70 -7 -5 6 -28 52 26 25 77 63 -47 24 -24 -45 -91 13
5164A3q2L8N7o5N0N5n9K2m5O4j0k1o9K7O5r1J6k0M9%Q1n4K3k0K7k1j2k1kk2j7
$$ 13 -69 -31 26 -39 11 66 7 29 -16 48 38 17 -52 -25 40 -51 -35 -55 -6 -6 75 21 44 24 51 30 18 -3 -5 -27 -44
5195d4K5k2O1l7jO0K6o4L8l7L8l0m5Jj1K2m4P0j7n2N7j9rK2O6m5J7o2P5q8k0Q
$$ -44 -19 -41 20 -17 -18 42 68 4 42 5 43 13 -32 -31 -42 -20 -64 6 -11 -63 -6 -25 -34 -12 54 9 26 -36 39 -49 -69 -61
5227f1Q3o9N9j1Jl7J27j02M2l5K3k7j8n%L7m0JQNN8m7l8j0K1N5l4K9l8ok4L3j3
$$ -61 22 -47 12 1 2 -35 92 -10 32 -3 20 -7 -25 -30 -30 7 -33 -32 -24 -19 39 -8 -46 -56 -35 20 -14 15 -23 -29 -53 -20 -33
5260c3R4n9L9p5J5L8Rm2K5qL8j1K3r2L3J4M5p9K6N9p3J8l8J6k2KL1k9L8rm0M8
$$ -33 61 2 41 -34 -19 19 28 -14 11 3 41 30 53 -39 -6 8 53 -26 0 59 -14 4 -34 -18 -40 -38 -7 -36 2 -7 -47 1
5292AO1j21J6L5j4PJ2K7o7N1qRJ8k7l4M9j1j8M4K7o9J2N3k1k8P0r5J6j2L1rM9
$$ 1 62 -59 -43 -8 -22 -15 -3 24 -43 8 0 9 27 0 -34 15 4 -14 30 57 -12 0 53 32 4 74 -21 -5 -17 14 5 54
5324E4k5k8nM1on1qO6k7k8K6l3jP%O8l4l1J0l3J9Oj5N8n0P5k7j2ml6l1J21n8l
$$ 54 29 1 -4 37 31 -20 -28 38 11 -17 9 -24 -25 -18 -18 50 16 -15 -5 -38 -19 -13 -28 30 -20 55 28 16 12 -24 -55 66 8 5
5358El9L8J9K2k4j7O9n6o1L8K0n0J7O4m6k1M0n4M3lK7q9N7j2l2K3O2p9M8k6K2
$$ 5 -34 4 23 45 21 4 73 17 -44 -6 14 -36 -19 45 -1 -22 18 -36 7 4 31 -58 -1 -13 -45 -22 40 -39 9 -17 5
5389E%Pj8j4N7l5L5o7K0N5m4rLL1j4J4n2Q4m3j6m4N1L8l9k5M3m7O1k6k8rN4J8
$$ 5 5 12 -6 -20 37 2 37 -30 -10 45 1 -8 -5 26 12 26 -26 58 15 -1 -45 6 44 5 -20 23 -24 37 11 -17 -26 28 46
5422D6n5KJ8o4K5%L3m%%rPkj2O6j14N6k1J00l8mo4J1KM8Qn4K2k2M0M0n6Kkj2K1
$$ 46 -9 -7 11 -53 -28 -28 5 1 1 1 -8 -1 -3 -15 51 -63 -7 -28 72 34 30 -34 -23 -21 27 35 -19 3 -19 21 61 5 7 5 -7 14
5458A4k7QO9m3n6N9j3n5Rk0K7O3Kl4qOk2l8N6m0PO8l2L2l4J1K8l2O6q2J2N0j0
$$ 14 -13 -5 64 21 -35 24 11 -44 -35 -55 -28 35 37 3 -5 1 -21 -59 -3 -43 -36 32 0 32 -2 9 37 5 71 -11 1 51 41
5491D1p4P3o0QK0%J0%N5p3o3O1Mj1pJj3j7J21p7o2M1M6j1k5%J5j1N2ql7J4rk3
$$ 41 -33 40 -20 -12 8 8 18 18 73 0 -63 -2 2 -9 -16 -15 -28 -45 76 -1 -63 -22 24 13 -12 -12 3 -8 44 36 -1 13 4 -19
5525a9M6k2J2n4O7kkm3kP4l5m0L5n3O5j9j7j0L8m6K9L8m0m2J8M5n5j3MN7m4lJ5
$$ -19 27 5 17 -37 30 28 26 -17 -19 55 20 -20 15 -38 27 8 -9 -19 19 -27 2 40 0 -42 -24 21 -34 -47 -43 14 -30 -33 -18
5558a8nM9l9O3o9L5o4M5Olm7M8K7m2m0K0L5l4P7l1JL4ko7O5j4j7K3No6N4k1K8
$$ -18 -23 26 -13 50 -19 16 -48 -3 3 0 -47 1 28 -14 -54 -34 1 -33 44 13 14 48 46 -21 44 30 13 36 41 -25 29 8 36
5591C6j3jj4J2m1orj4L6Mp0N8%QPK0J4k5l8P1k5L6k3k5K3p5R4o6Q6Nq2jQN0j4
$$ 36 23 22 8 20 -21 -27 -36 -50 -14 -10 -80 -22 -22 -14 -7 13 27 2 -36 35 10 46 23 -2 21 -54 40 -26 60 65 -17 -18 -10 40 26
5626B6N6n2k6L8j2k6k2J8j3j8M1k4j3N5k9k9M9Rl6j4J5ojM2l8J9l7P1Rl9K3pN
$$ 26 82 30 4 42 30 4 -18 0 -13 -31 10 -14 -27 28 -1 -30 19 28 -8 -22 -7 -13 -14 28 -10 9 -28 43 52 13 36 29 34
5659C4JK4n5k0M1mOj1K5p1j2L8L2Mn4M4J1n5k3jN3m7J7n7N7K4K0k6mJ0K2j3k8
$$ 34 35 59 4 -16 25 21 27 16 41 -30 -42 -4 28 32 -22 22 33 -22 -45 -46 7 -40 -23 -80 -23 1 21 -5 -9 1 23 10 -18
5692a8j1m4PP9j1j1lqk1M1J7K7Ok7l3N4l7j3M4K5m6qk5Ok9R1o4OL2m2m0N3k5K0
$$ -18 -29 -73 -66 13 2 -9 -12 -20 -41 0 17 44 50 23 -10 44 7 -6 38 63 17 9 -16 -10 -39 52 -12 -6 26 -16 -56 -3 -28 -8
5726hk1k3P9q1P8l8j0M1prL2r1N4Nk1J7m3L0O6k9rj8L3N3p2J6J8o5mJ8O0Pj02
$$ -8 -29 -52 27 -54 24 -14 -24 17 10 1 33 -58 -4 1 -20 -3 -46 -16 50 21 12 -6 27 80 8 24 42 -23 -27 -9 51 58 -44
5759d4L9j2L1j4RQjn0j1KJ2j6P5k8n5K1LL8j5nM8o2L3rJ0MNJ2l5L6no1P9K8p5
$$ -44 -5 -17 14 0 9 17 16 -34 -45 -43 -31 -47 28 0 -55 -34 -31 7 -8 -13 35 -27 6 -3 7 11 16 28 -7 29 24 -37 42 70 -5
5794eL4m0K7j8K8j7K8mm6K5k4K2j2l6Q2o0J2K0pk7K4k1L0j4J5m0o1P7o6N2pJ0
$$ -5 29 -11 16 -2 26 9 37 33 -13 12 -12 10 -2 -38 44 -16 -4 16 9 -18 6 -15 15 1 16 -24 -85 -8 -74 -22 -29 -19
5826a9K4rMK3m8N9jm0K5j2k2O0o3L1j8K3l6J8M6m9J3rJ0j9L2o0k0K0L7o1J3K7
$$ -19 5 -4 0 23 -25 34 33 -7 18 6 -16 44 -19 12 -6 17 -19 -1 45 -4 9 0 10 -9 23 -37 -57 -37 0 -61 -48 -21
5858b1K4o6N7L2l1k0M0k6j8K2L7Mn6J9L0ok5k0P9r1J10n4m6M6kj3l5Q4n7J7l2
$$ -21 3 -63 -6 26 -5 -25 15 -11 -29 -7 30 34 -22 -3 27 21 -4 -24 55 -36 74 20 -26 20 18 5 -30 54 -3 14 -18
5889a8j2O4q6J5M7K5l4k8P1o5L4nj7M6k7k4Oj8j0NJ0M4j5L8j6k9Rrk1L7l9Q7o5
$$ -18 -30 34 -52 -37 10 35 1 -27 44 -21 13 8 -9 37 10 -14 -8 -26 -36 -31 -21 23 8 46 30 1 10 1 -20 17 -22 65 0
5922@L0K3j26R5p9J10n3l4j2O5k9oJ3j9oK3k0L1Qk5rJ7%j3L9ln3M7n1K0K7l2P
$$ 0 30 53 -73 22 -57 53 0 -34 -46 19 -10 -16 -3 -22 -28 -5 -25 6 14 -11 -20 -3 -3 -16 23 20 -33 14 -37 -17 10 -22 -15
5955a5k0M7L1j7kJ1nk8M9k9Mk3M8l8J0j6M8n4M3n1Q1j02P1q2K1L6J1k5lo5M5L5
$$ -15 -35 12 43 26 24 35 30 2 51 22 26 3 51 13 23 7 55 1 44 -7 74 -28 43 -39 -18 18 29 4 1 -64 -19 16
5987A6J6l9J0l5O0l1J1M0n0oQlL2j4m5O0l2n9M4M0Jk5L3j6n1L5L3j0k2J0m5L1
$$ 16 32 -7 3 -32 28 -3 8 48 -2 -8 0 -3 29 15 -30 30 -2 -61 -17 23 24 -1 32 16 -35 0 33 23 1 11 -34 -3
6019ck6O2n1K1nJJ7o3L9m4LO4m6N2l5M7j2J4k1O1q3Kj7M0nL8n0M5orn3L5L0l6
$$ -3 -29 33 -18 3 -2 -1 16 -47 -8 -52 -49 15 -31 21 -14 33 21 35 14 75 -8 -6 -23 17 12 50 0 45 39 30 -23 12 42 6
6053Fm5PQJ5k4N1K2k4Ql3l8M5L5m8J4L4o4oK4J1pJ4j5J3L3o0NJ9j5k1K8J0qL2
$$ 6 -39 -32 -24 -9 -33 18 40 16 24 -9 -47 -2 33 -15 -1 33 -31 -37 -13 -2 -9 5 -10 3 36 -24 -19 0 -15 -36 -8 2 -6 26
6087B6k3K0j7k4rN2j4k1j9J0M0j7J5rOlOK0n1L0J6ql6l1M1j8L9m7L5k1RJ1j06
$$ 26 3 23 6 -18 -27 25 11 -10 -29 -19 21 4 19 10 16 13 19 39 -12 18 34 26 -10 -41 0 -18 21 -26 9 -12 -3 8 -98
6120i8J15q2L8N2n1jN0l0Kj3O2l2l1P0l2k6J5kK0Pnl5QPl4J5k6K5M3o4M7o3L2
$$ -98 17 -65 -27 25 -26 -27 23 -7 -5 -18 44 12 -19 51 19 -7 8 6 26 33 28 -7 1 8 -26 -11 -37 -12 31 -33 14 -49 -17
6153a7n0O9n3L4J7k3N5Pr7M9k7O1j0ok1J1jQK8K6Pp9j3NJj4O0k8K7l1N0o6N8o1
$$ -17 -67 2 -51 -17 0 -23 32 39 -58 -9 -36 25 15 9 -12 -1 -2 6 34 60 67 -12 -25 -20 -19 -33 27 -1 26 -5 45 -21 37 -24
6187b4M3PM4p9L0l3K6qm0L4J3k3N7m8K8n9%J3pJ1K6j3K3l8K0oJ0qnPL5j2k4N8
$$ -24 19 26 70 -9 21 -12 14 6 -34 0 13 -10 47 -1 27 -32 -32 -19 -26 -15 11 -2 21 -17 3 -3 7 -1 -6 1 36 24 0 58
6221E8o3L7k9KK5j9L4l7mL4Lj4kk9M3j5l0K8kl2KlMM0q4k6K0K7Q5p9M1j2n0N9
$$ 58 -5 32 3 5 30 11 45 8 4 38 41 27 25 -4 39 24 -6 22 20 -12 -10 -13 -9 31 -53 -79 -59 -32 53 -26 15 3 -47 12
6255A2K8j4m9K1n9J03k4k2J0K2k4l5L7KJ9N2r1j0N4m5k2L9M2q0O4o1OJ7J1K3m9
$$ 12 40 26 -23 -2 -61 42 18 -4 6 28 4 -31 6 8 27 79 -12 -22 32 -13 -35 4 46 -34 30 -31 -25 -8 3 26 -23
6286b3kJ4K3k6K4Lpk1QL8k5l2K4L9M4o9lJKO%n4qO3m4L0k1N8o4K2L7j0j5j8J7
$$ -23 -25 -11 12 -14 10 13 6 -15 -7 31 6 -26 -2 37 81 12 9 10 12 18 18 -36 -44 19 -25 5 -16 42 -22 0 37 27 12 -6 11
6321A1n5N6jKj3k6O8p6O1m7jL6k7M1l5J6l0L4J0m5K1L0n2K9Nj9J6j1OL7mm6L1
$$ 11 -44 12 11 13 0 -26 42 -34 27 -20 -21 15 -12 29 -6 10 -20 14 24 -21 0 30 -22 7 12 -7 9 -2 4 41 37 -9 22
6354B2J4l6k6N0mL8o0l1M1k7L3l8N7n5J1pN0o4L0n2OJ1j1M9l0N6k5%l3J8K0mj5
$$ 22 36 0 -26 24 20 58 -2 -33 8 -19 14 -24 33 -22 -11 -18 32 -32 -2 -54 -48 -37 -48 1 -29 27 2 2 -31 -13 7 3 -12
6387a2j6%P6o4k8M9j1J0Rk2j0JL4KJm1K4N6n5k4L2qJ7n8M2p0L5P5m4K9rj6k9K8
$$ -12 -28 -28 48 -16 -44 5 -6 4 13 -9 -19 -18 16 18 19 -22 2 58 3 -21 11 3 20 -38 4 -66 -31 44 0 29 20 4 -25 3
6421CJ9Nk3p7N8K7n8O4k7K8L9o9M3l2J6k7M0n3L8K1Qk6lj6k8L3qM1n6M7k7M0p5
$$ 3 22 27 4 -73 -15 12 -46 18 -9 19 58 -11 32 0 16 -11 29 -24 14 35 43 17 14 -2 -30 3 -5 36 -20 27 0 40 -35
6454c5L4L8o9PLL2k6NO1r1K0L0kn0M2J8m7N2l3kL1J4n8K9K7j6n0J5L6l1K2K0m7
$$ -35 -1 37 -32 -25 -22 10 -16 -11 50 -41 -21 9 7 -43 -1 17 -30 22 -11 -13 18 32 -26 3 30 14 -36 -21 15 -16 6 26 -21
6487b1M6J7J9o2L3O6r3K4p9P2l1m8K2L6j6K8k9QMlj0j0L1K0k8J3MK0k8L5m0K1
$$ -21 25 42 61 -1 32 98 5 29 -50 22 -9 -57 -35 1 -15 13 -16 -8 -4 -7 -17 -27 4 24 -4 9 13 33 5 40 0 21
6519B1l8O2n9L7j2l1M8k3K2k9rNj3K8po5P0j3Mj7mJ8k1K6k8j5M1j9P4r6Q3l5k4
$$ 21 -17 45 -14 23 11 -20 28 5 27 -2 -11 -6 -19 9 2 -63 7 -6 -2 -19 -23 -5 -26 0 -28 -43 -2 -21 53 -43 40 5 -19
6552a9M0l4M9k8J1n5L2lJ1j7J9kJ5plj7N2J8r9M0Nl1L3l0N6rl4J6Nk8l0P2m9M4
$$ -19 21 -13 36 8 19 -36 -4 -7 4 -13 6 4 19 12 9 -8 44 62 -37 3 8 -23 10 -20 36 27 -7 9 14 -14 -44 28 -21 23
6586B3%j6k1O1m0J3p6J27j15P3k1l5J9j2j1k2N5Mq5N6P6l6l6J8K2j5K7n9N9rk
$$ 23 23 7 -14 47 7 20 -56 71 -44 29 8 -27 -8 -20 -31 -53 2 6 -79 -23 53 17 -19 -1 21 6 33 -26 33 24 22
$$ [...]
8191a2
##END NTUPLES=NMR FID
##END=
