##TITLE=1H_AM_NV67
 CDCl3
 8 sc, 
 24.10.2023
##JCAMPDX= 6.0         $$ Bruker NMR JCAMP-DX V2.0
##DATA TYPE= NMR FID
##DATA CLASS= NTUPLES
##ORIGIN= UXNMR, Bruker Analytische Messtechnik GmbH
##OWNER= root
$$ XWIN-NMR		Version 3.5
$$ Tue Oct 24 15:34:55 2023 Russian Standard Time (UT+4h)  she@DPX200
##.OBSERVE FREQUENCY= 200.13135
##.OBSERVE NUCLEUS= ^1H
##.DELAY= (6, 6)
##.ACQUISITION MODE= SIMULTANEOUS
##.ACQUISITION SCHEME= undefined
##.AVERAGES= 8
##.DIGITISER RES= 18
##SPECTROMETER/DATA SYSTEM= spect
##.PULSE SEQUENCE= zg30
##.SOLVENT NAME= D2O
##.SHIFT REFERENCE= (INTERNAL, D2O, 0, 15.7039)
##AUDIT TRAIL= $$ (NUMBER, WHEN, WHO, WHERE, WHAT)
$$ ##TITLE= Audit trail, XWIN-NMR		Version 3.5
$$ ##JCAMPDX= 5.01
$$ ##ORIGIN= Bruker BioSpin GmbH
$$ ##OWNER= she
$$ F:/spectra/data/she/nmr/H-F/1/audita.txt
$$ ##AUDIT TRAIL=  $$ (NUMBER, WHEN, WHO, WHERE, WHAT)
(   1,<2023-10-24 15:33:09.29 +0400>,<she>,<DPX200>,
      <created by zg, POWCHK disabled, PULCHK disabled
       configuration hash MD5:
       00 E9 B6 7A A2 85 ED C7 34 08 36 98 17 FE 4E 26
       data hash MD5: 16K
       AA 91 48 8D C8 26 AE 91 4D 83 8E C1 B5 E5 80 A7>)
$$ ##END=
$$ 
$$ hash MD5
$$ 93 86 16 D3 FA 31 41 66 DF 3E B9 5D 03 F3 B9 CE
##$RELAX= 
##$RELAX= 
##$RELAX= 
##$RELAX= 
##$RELAX= 
##$RELAX= 
$$ Bruker specific parameters
$$ --------------------------
##$DU= <F:/spectra>
##$EXPNO= 1
##$NAME= <H-F>
##$PROCNO= 1
##$TYPE= <nmr>
##$USER= <she>
##$AMP= (0..31)
100 100 100 100 100 100 100 100 100 100 100 100 100 100 100 100 100 100 
100 100 100 100 100 100 100 100 100 100 100 100 100 100 
##$AQSEQ= 0
##$AQ_mod= 1
##$AUNM= <au_zg>
##$AUTOPOS= <>
##$BF1= 200.13
##$BF2= 200.13
##$BF3= 200.13
##$BF4= 200.13
##$BF5= 200.13
##$BF6= 200.13
##$BF7= 200.13
##$BF8= 200.13
##$BYTORDA= 1
##$CFDGTYP= 0
##$CFRGTYP= 5
##$CHEMSTR= <none>
##$CNST= (0..31)
1 1 145 1 1 1 1 1 1 1 1 1 1 1 1 1 1 1 1 1 1 1 1 1 1 1 1 1 1 1 1 1 
##$CPDPRG= <>
##$CPDPRG1= <>
##$CPDPRG2= <>
##$CPDPRG3= <>
##$CPDPRG4= <mlev>
##$CPDPRG5= <mlev>
##$CPDPRG6= <mlev>
##$CPDPRG7= <mlev>
##$CPDPRG8= <mlev>
##$CPDPRGB= <>
##$CPDPRGT= <>
##$D= (0..31)
0 1.2 0 0 0 0 0 0 0 0.06 0 0.03 0 0 0 0 0.0002 0 0 0 0 0 0 0 0 0 0 0 0 
0 0 0 
##$DATE= 1698147188
##$DBL= (0..7)
120 120 120 120 120 120 120 120 
##$DBP= (0..7)
150 150 150 150 150 150 150 150 
##$DBP07= 0
##$DBPNAM0= <>
##$DBPNAM1= <>
##$DBPNAM2= <>
##$DBPNAM3= <>
##$DBPNAM4= <>
##$DBPNAM5= <>
##$DBPNAM6= <>
##$DBPNAM7= <>
##$DBPOAL= (0..7)
0.5 0.5 0.5 0.5 0.5 0.5 0.5 0.5 
##$DBPOFFS= (0..7)
0 0 0 0 0 0 0 0 
##$DE= 6
##$DECBNUC= <off>
##$DECIM= 32
##$DECNUC= <off>
##$DECSTAT= 4
##$DIGMOD= 1
##$DIGTYP= 9
##$DL= (0..7)
0 120 120 120 120 120 120 120 
##$DP= (0..7)
150 150 150 150 150 150 150 150 
##$DP07= 0
##$DPNAME0= <>
##$DPNAME1= <>
##$DPNAME2= <>
##$DPNAME3= <>
##$DPNAME4= <>
##$DPNAME5= <>
##$DPNAME6= <>
##$DPNAME7= <>
##$DPOAL= (0..7)
0.5 0.5 0.5 0.5 0.5 0.5 0.5 0.5 
##$DPOFFS= (0..7)
0 0 0 0 0 0 0 0 
##$DQDMODE= 0
##$DR= 18
##$DS= 0
##$DSLIST= <SSSSSSSSSSSSSSS>
$$ [...]
##$SUBNAM2= <"">
##$SUBNAM3= <"">
##$SUBNAM4= <"">
##$SUBNAM5= <"">
##$SUBNAM6= <"">
##$SUBNAM7= <"">
##$SUBNAM8= <"">
##$SUBNAM9= <"">
##$SW= 18.05172834244
##$SWIBOX= (0..15)
0 0 2 0 0 0 0 0 0 0 0 0 0 0 0 0 
##$SW_h= 3612.71676300578
##$TD= 16384
##$TD0= 1
##$TE= 0
##$TE2= 300
##$TE3= 300
##$TEG= 300
##$TL= (0..7)
0 120 120 120 120 120 120 120 
##$TP= (0..7)
150 150 150 150 150 150 150 150 
##$TP07= 0
##$TPNAME0= <>
##$TPNAME1= <>
##$TPNAME2= <>
##$TPNAME3= <>
##$TPNAME4= <>
##$TPNAME5= <>
##$TPNAME6= <>
##$TPNAME7= <>
##$TPOAL= (0..7)
0.5 0.5 0.5 0.5 0.5 0.5 0.5 0.5 
##$TPOFFS= (0..7)
0 0 0 0 0 0 0 0 
##$TUNHIN= 0
##$TUNHOUT= 0
##$TUNXOUT= 0
##$USERA1= <user>
##$USERA2= <user>
##$USERA3= <user>
##$USERA4= <user>
##$USERA5= <user>
##$V9= 5
##$VALIST= <valist>
##$VCLIST= <CCCCCCCCCCCCCCC>
##$VD= 0
##$VDLIST= <DDDDDDDDDDDDDDD>
##$VPLIST= <PPPPPPPPPPPPPPP>
##$VTLIST= <TTTTTTTTTTTTTTT>
##$WBST= 1024
##$WBSW= 4
##$XGAIN= (0..3)
0 0 0 0 
##$XL= 0
##$YL= 0
##$YMAX_a= 289849
##$YMIN_a= -202539
##$ZGOPTNS= <>
##$ZL1= 120
##$ZL2= 120
##$ZL3= 120
##$ZL4= 120
##$ABSF1= 10
##$ABSF2= 0
##$ABSG= 5
##$ABSL= 3
##$ALPHA= 0
##$AQORDER= 0
##$ASSFAC= 0
##$ASSFACI= 0
##$ASSFACX= 0
##$ASSWID= 0
##$AUNMP= <proc_1d>
##$AZFE= 0.1
##$AZFW= 0.1
##$BCFW= 1
##$BC_mod= 2
##$BYTORDP= 1
##$COROFFS= 0
##$CY= 11.3945322036743
##$DATMOD= 1
##$DC= 2
##$DFILT= <>
##$DTYPP= 0
##$F1P= 15.7292609196834
##$F2P= 12.9074282941183
##$FCOR= 0.5
##$FTSIZE= 0
##$FT_mod= 4
##$GAMMA= 1
##$GB= 0.15
##$INTBC= 1
##$INTSCL= 1
##$ISEN= 128
##$LB= 0.24
##$LEV0= 0
##$LPBIN= 0
##$MAXI= 10000
##$MC2= 0
##$MEAN= 0
##$ME_mod= 0
##$MI= 1.114404
##$NCOEF= 0
##$NC_proc= 0
##$NLEV= 6
##$NOISF1= 3.799351
##$NOISF2= 2.8
##$NSP= 1
##$NTH_PI= 0
##$NZP= 0
##$OFFSET= 15.70392
##$PC= 1
##$PHC0= -23304.22
##$PHC1= 7.0527
##$PH_mod= 1
##$PKNL= yes
##$PPARMOD= 0
##$PSCAL= 0
##$PSIGN= 0
##$REVERSE= no
##$SF= 200.130013532006
##$SI= 16384
##$SIGF1= 3
##$SIGF2= 2
##$SINO= 400
##$SIOLD= 16384
##$SREGLST= <1H.CDCl3>
##$SSB= 0
##$STSI= 0
##$STSR= 0
##$SW_p= 3612.71676300578
##$SYMM= 0
##$S_DEV= 0
##$TDeff= 0
##$TDoff= 0
##$TI= <>
##$TILT= no
##$TM1= 0
##$TM2= 0
##$TOPLEV= 0
##$USERP1= <user>
##$USERP2= <user>
##$USERP3= <user>
##$USERP4= <user>
##$USERP5= <user>
##$WDW= 1
##$XDIM= 8192
##$YMAX_p= 0
##$YMIN_p= 0
$$ End of Bruker specific parameters
$$ ---------------------------------
##NTUPLES= NMR FID
##VAR_NAME=  TIME,          FID/REAL,        FID/IMAG
##SYMBOL=    X,             R,               I
##VAR_TYPE=  INDEPENDENT,   DEPENDENT,       DEPENDENT
##VAR_FORM=  AFFN,          ASDF,            ASDF
##VAR_DIM=   8192,          8192,            8192
##UNITS=     SECONDS,       ARBITRARY UNITS, ARBITRARY UNITS
##FACTOR=    0.0002768,     1,               1
##FIRST=     0,             0,               0
##LAST=      2.2672688,     0,               0
##MIN=       0,             -202539,         0
##MAX=       2.2672688,     289849,          0
$$ Real data points
##PAGE= N=1
##DATA TABLE= (X++(R..R)), XYDATA
0@%%%%%%%%%%%%%%%%Kj0J6j6J6j7K5l2L4m2M9n6O7p7Q7r8J13j30J47j67J90k14
$$ 0 0 0 0 0 0 0 0 0 0 0 0 0 0 0 0 0 2 -8 8 -8 8 -9 16 -16 18 -24 25 -31 36 -41 46 -52 61 -69 78 -89 101 -113
38a13K39k68L00l33L71m13M58n08N62o20O85p55Q31r14J007j110J223j350J489
$$ -113 126 -142 158 -175 196 -217 241 -267 295 -325 360 -395 436 -478 529 -581 642 -708 781
57G81j647J827k032K269k547K876l275L766m372N121n963O175L352K83518j35687
$$ 781 -866 961 -1071 1198 -1349 1527 -1748 2018 -2354 2767 -3196 2979 6331 289849 154162
72A54162k93819J99884J84854r7398o2205q803j28299K1456J34196j10564j84821
$$ 154162 -139657 60227 245081 147683 85478 76675 -51624 -30168 104028 -6536 -191357
83a91357J08906J34431p6980m0067P2426j1237p970O1924n2472j08328P3102Q6008
$$ -191357 -82451 51980 -25000 -65067 7359 -3878 -11848 50076 -2396 -110724 -37622 48386
95D8386j14601q2985J36845J15001o8730p1945P9576J28489K854j23071o0954
$$ 48386 -66215 -149200 -12355 102646 33916 -38029 41547 170036 172890 49819 -11135
106a1135P2751L3170j01991r8478j0169K2420K9816J3327m5596j7363R8193R2458
$$ -11135 61616 94786 -7205 -105683 -115852 -93432 -63616 -50289 -95885 -113248 -15055 77403
118G7403k7240n1373J4771M1918K3440k7704p5678j7325P0927J5158o6770J208
$$ 77403 50163 -1210 13561 55479 78919 51215 -24463 -41788 29139 44297 -22473 -21265
130b1265O2690l376k8406K5090R294m0362k6908r704j1014M91k2376m1728K9700
$$ -21265 41425 38049 9643 34733 44027 3665 -23243 -32947 -43961 -43470 -65846 -107574 -77874
143g7874P2238j97j7792N2063L7166r996K9828J7629o9121k9548N4084k2798q9339
$$ -77874 -5636 -5833 -23625 28438 65604 55608 85436 103065 33944 4396 58480 35682 -53657
156e3657J712L5198l2988l43N2626j6744l0432N8403L0304n4845m972L3547l9881
$$ -53657 -51945 -16747 -49735 -50078 2548 -14196 -44628 13775 44079 -10766 -15738 17809 -22072
169b2072k5627N5703j118o4567K8431P6693q822k1920L2893K956j9483K8474l801
$$ -22072 -47699 8004 6886 -57681 -29250 47443 38621 16701 49594 52550 33067 61541 57740
182E7740q0688k7985M6751r291n8979n331K8176J4021K3326J6700j3531J3535
$$ 57740 -22948 -50933 -4182 -13473 -72452 -77783 -49607 -35586 -12260 4440 -9091 4444
194D444M8580L872l6226o609Q213j1691p521o443k2404L917L4861j338k6406J8806
$$ 4444 53024 56896 20670 14061 22274 10583 3062 -3381 -25785 -21868 12993 11655 -14751 4055
208D055L3264j5542k6577L906J366j3728j0751j7061j0998K7841K5830k1844r586
$$ 4055 37319 21777 -4800 -894 472 -13256 -24007 -41068 -52066 -24225 1605 -20239 -29825
221b9825M8630L7289j6956j7032Q406N492j069j0956l7742k8350K3098K4582k9622
$$ -29825 18805 56094 39138 22106 30512 36004 34935 23979 -13763 -42113 -19015 5567 -24055
234b4055l2758K6319M6162L686k4026m928J9584J6683p056k7248j9498J3684K5486
$$ -24055 -56813 -30494 15668 19354 -4672 -9600 9984 26667 19611 -7637 -27135 -13451 12035
247A2035j0563l3939R505M9566J1231l2248l038K9455L752k0827j4248j4745p715
$$ 12035 1472 -32467 -22962 26604 37835 5587 2549 32004 35756 14929 681 -14064 -21779
260b1779J5090m179l8433P65N0809J0879l1735Q836L7037L127r068Q53j7740j1377
$$ -21779 -6689 -10868 -49301 -48536 2273 13152 -18583 -9747 27290 30417 21349 22202 4462 -6915
274f915K5839j618n1916o462N2693O605m1885K889L9400P264j4585n016n231j087
$$ -6915 18924 17306 -34610 -41072 11621 18226 -23659 -20770 18630 25894 11309 6293 1062 -25
288b5Q429j1363k7646R72K3079L025j0401L411J3385J5062J1479p170j6227N198
$$ -25 8404 -2959 -30605 -29633 -6554 -3529 -13930 -10519 2866 17928 29407 22237 6010 11208
302A1208J5746j1505l1351j1555J5413J1043j4860j7323J6361L1922q13j9845
$$ 11208 26954 15449 -15902 -27457 -12044 -1001 -15861 -33184 -16823 15099 14286 -5559
314e559R364K1037q969j5549M499l556j6482M071J0607j3465o593K3977J2896
$$ -5559 3805 24842 15873 324 4823 1267 -15215 -11144 -537 -14002 -20595 3382 16278
327A6278j2940J090J6211p72j0000m280r667o459P613p467k3482R430L0418o751
$$ 16278 3338 4428 20639 19867 9867 5587 -4080 -10539 -2926 -10393 -33875 -24445 5973 -778
341g78j9026K2348K5360j3051q422J4164n889j7679O120J983k2266m854J7654
$$ -778 -19804 2544 27904 14853 6431 20595 14706 -2973 3147 5130 -17136 -21990 -4336
354d336j42q036J0957Q253k410Q862M671j5358l043J0967j2659j8230J0880O569
$$ -4336 -4478 -12514 -1557 6696 4286 13148 17819 2461 -582 10385 -2274 -20504 -9624 -3055
368c055j7649K792K4364O2r796J4695J1816r169j851K727j3938r051P007o103
$$ -3055 -20704 -17912 6452 6514 -3282 11413 23229 14060 12209 14936 998 -8053 -1046 -7149
382g149j5495M591J1573j173K205Q900J344L565R826m245j2085K340K988j3115
$$ -7149 -22644 -18053 -6480 -7653 -5448 3452 4796 8361 18187 13942 1857 4197 7185 -5930
396e930r432N838L713l868J217R077Q554J152k721L066L628p356p847N44o785
$$ -5930 -15362 -9524 -5811 -9679 -8462 615 9169 10321 7600 10666 14294 6938 -909 -365 -7150
411g150j1927N865Q860j1063l097K1774J0828q875K259Q933j746p57l809j7290
$$ -7150 -19077 -13212 -4352 -15415 -18512 3262 14090 5215 7474 16407 14661 13904 10095 -7195
425g195k481J4181j2052k0162J8155J7133j8593J205K9044o050j9828J9266R877
$$ -7195 -9676 4505 -7547 -27709 -9554 7579 -11014 -9809 19235 13185 -6643 12623 22500
438B2500k9268n321J9445j3284j7420J6073N172j1073J5288J1634j5698R832K4461
$$ 22500 -6768 -12089 7356 -5928 -23348 -7275 -2103 -13176 2112 13746 -1952 7880 32341
451C2341k2844k2389K8460L940m2486ML0790j7025k1296K6806J2568j9068J0353
$$ 32341 9497 -12892 15568 19508 -22978 -22974 7816 -9209 -30505 -3699 8869 -10199 154
464A54K1612j2215p445J3222p940j4136Q534m712j8594J2411J5487j9333k991
$$ 154 21766 9551 2106 15328 7388 -6748 1786 -2926 -21520 -9109 6378 -12955 -15946
477a5946L0965J831k2231J1349J8559j6385j4202R067k113j3124O9K169j958O730
$$ -15946 15019 16850 -5381 5968 24527 8142 -6060 3007 894 -12230 -12161 -9992 -11950 -5220
491e220M664k642Q845J0517q187m649J1294l699j7935L76P721r548r003P515P508
$$ -5220 -556 -3198 5647 16164 7977 3328 14622 10923 -7012 -6636 1085 -8463 -17466 -9951 -2443
506b443K01J177M074P263M708o751n509O374k378j5705j322Q242p804o368J1906
$$ -2443 -2242 -1065 3009 10272 14980 8229 2720 9094 6716 -8989 -10311 -2069 -9873 -16241 -4335
521d335N216n255P462Q592n388R21N386j0332n938Q839q069j5904J2104J0807
$$ -4335 881 -4374 3088 11680 6292 7213 12599 2267 -3671 5168 -2901 -18805 -6701 4106
535D106j6815N40K4551k765j5071J5402J0081j9962l187J3730j2722j4681J2940
$$ 4106 -12709 -12169 12382 9617 -5454 9948 20029 67 -3120 10610 -2112 -16793 -3853
548c853J590j5213R080J4572j0106Q66J9284n048j2918J3780L904k1735j215J3512
$$ -3853 -2263 -17476 -8396 6176 -3930 -3064 16220 11172 -1746 12034 15938 -5797 -7012 6500
562F500j2066j1595J3989L105j0975R347J1378r541m57J3204n954j1439O996O08
$$ 6500 -5566 -17161 -3172 -67 -11042 -1695 9683 142 -315 12889 6935 -4504 2492 3100
576C100j3044K133P842q113j217J4038N79p198R235P398r282k682N777o240q494
$$ 3100 -9944 -7811 31 -8082 -9299 4739 5318 -1880 7355 14753 5471 2789 8566 2326 -6168
591f168K733j530p160L076N575k824J385P875J800j028K815l53k839N70j773n768
$$ -6168 -3435 -4965 -12125 -9049 -3474 -6298 -4913 2962 4762 3734 6549 6196 3357 3927 2154 -3614
607c614k82K006k011N38L472k92J774N857j673n034L473J190q410k379L360m942
$$ -3614 -3896 -1890 -3901 -3363 109 -183 1591 7448 5775 741 4214 5404 -3006 -5385 -2025 -6967
623f967l821O657J417m250O430P572l826L82P281l379o260L935j307r453J267
$$ -6967 -10788 -4131 -2714 -6964 -534 7038 3212 3594 10875 7496 1236 5171 3864 -5589 -4322
638d322M718p007k358R577O44n906N810N852n339r24M117m772m166M253j903o150
$$ -4322 396 -6611 -8969 608 1252 -4654 1156 7008 1669 745 4862 90 -4076 177 -1726 -7876
654g876M619M638m568K272Q007l381l643Q183M14j0850K28O276o604o812M889
$$ -7876 -3257 1381 -3187 -915 7092 3711 68 8251 8665 -2185 -1957 4319 -2285 -9097 -4208
669d208J485l747L465L961k266L001N402l868k636N768j732q590K215M497o980
$$ -4208 -2723 -6470 -3005 956 -1310 1691 7093 3225 589 6357 4625 -3965 -1750 2747 -4233
684d233l447Q056J340n982L473O887l045l468L696O49m476j366M14j694k70P44
$$ -4233 -7680 376 1716 -4266 -793 6094 3049 -419 3277 3926 -550 -1916 -1502 -3196 -3466 -2722
700b722r92J307M173L68j875L204K877l713k943K773k46n649j504M031k74m031
$$ -2722 -3714 -2407 1766 2134 259 3463 6340 2627 -316 2457 2211 -3438 -4942 -911 -1185 -5216
716e216J509N904P91l375J553M587p59m523q36J457j606k740n09K73M53J286P36
$$ -5216 -3707 2197 2988 -387 1166 5753 4994 471 -365 1092 -514 -3254 -3763 -3490 -3037 -1751 -1015
733a015N77J684J209k99P05N35k722j942K352o7m910l28N708L79m960K265O538
$$ -1015 -438 1246 2455 2156 2861 3396 674 -1268 1084 1017 -3893 -4221 1487 1866 -3094 -829 5709
750E709j482n414J638L690k860m736m75J011j61k06o23j69L077L941J36j563J100
$$ 5709 4227 -1187 451 4141 1281 -3455 -3930 -2919 -3080 -3286 -3909 -4078 -1001 2940 3076 1513 2613
767B613K246N37j385l544k547K256K131m570m488M168N399k707m059L009M369
$$ 2613 4859 5396 4011 467 -2080 176 2307 -2263 -6751 -2583 2816 109 -3950 -941 3428
782C428j357l839n24K426O32l171k440K607L744m24j741J453L164K119l43l631
$$ 3428 2071 -1768 -2292 134 766 -2405 -4845 -2238 1506 1082 -659 794 3958 6077 5734 2103
798B103k614K931K324n804o991J953N831p81n368q30O006N619j941m738K389O144
$$ 2103 -511 2420 4744 -1060 -8051 -6098 -267 -1048 -6416 -7246 -1240 4379 2438 -2300 89 6233
814F233j151n776k92K870o84j827m22k27J773K876k219l566L825M110m956n729
$$ 6233 5082 -694 -986 1884 1200 -627 -1049 -1276 497 3373 1154 -2412 1413 5523 567 -5162
830e162K037L111j453k981k789J411P927K797q028j284J1980M419r644l573O344
$$ -5162 -3125 -14 -1467 -4448 -7237 -5826 2101 4898 -3130 -4414 7566 11985 2341 -1232 5112
845E112N50m737j921j908j791L371J198n343k65P276R29n381R88M817p09l283
$$ 5112 5662 925 -996 -2904 -4695 -1324 -126 -5469 -5734 1542 2471 -2910 -1922 2895 2186 -1097
861a097j065K69K257J916l828l348O217P147m050o999L323P532j346q223l592
$$ -1097 -2162 -1893 364 2280 -1548 -4896 1321 8468 4418 -2581 742 8274 6928 -1295 -4887
876d887L554K572l943m746M98L651K350L36j133M23M657L100l702l123L710J530
$$ -4887 -1333 1239 -2704 -7450 -6952 -3301 -951 -615 -1748 -1325 3332 6432 2730 -393 3317 4847
892D847n081k473K870O03j770m52k35J675M334j382o835J670P787k845r472O87
$$ 4847 -234 -2707 163 766 -1004 -1456 -1691 -16 4318 2936 -3899 -2229 5558 2713 -6759 -6072
908f072O111o56k855O36M09K091N495J04n106J238N635j781n450m84P60j983q88
$$ -6072 39 -617 -3472 -2836 -2427 -336 5159 5263 157 1395 7030 5249 -201 -685 75 -1908 -2796
925b796j10j104P94K376j51k26L010J442k624j211K327R56k678l128N30L255Q38
$$ -2796 -2906 -4010 -3216 -840 -991 -1217 1793 3235 611 -600 1727 2683 5 -3123 -2593 662 1500
942A500k642k22L020J742k88l01j695j458J510L4m499j871K403q1j469K610J863
$$ 1500 -1142 -1364 1656 3398 3110 2809 1114 -344 1166 1200 -3299 -5170 -2767 -2848 -4317 -1707 156
959A56j799J892M587p43k603J308L41k569L04N30m237j612M580J247l869K92L785
$$ 156 -1643 249 4836 4093 1490 2798 3139 570 874 1404 -2833 -4445 135 1382 -2487 -2195 1590
976A590J32q24Q64j379k182J559N53l528p76K924j01j420K893L006j493p79K727
$$ 1590 1722 898 1762 383 -1799 -240 313 -3215 -3991 -1067 -1168 -2588 305 3311 1818 1039 3766
993C766J272k058k136j229m83K52p94k528j049K621K802l71j657J139L090J088
$$ 3766 5038 2980 844 -385 -868 -616 -1410 -3938 -4987 -2366 436 65 -1592 -453 2637 3725
1009C725k126j865K97O78m29j519j475R69K592j20j822K114L103j842k848K078
$$ 3725 1599 -266 31 709 280 -1239 -2714 -1745 847 727 -1095 1019 4122 2280 -568 1510
1025A510J454l738k600R49J73n13P06n43l26L630L430k140j936K895J894k045
$$ 1510 2964 -774 -3374 -2425 -2252 -2765 -2059 -2602 -2928 702 4132 1992 56 2951 4845 2800
1041B800k138j057j115R89O77l148j657M244K594l218r24M042Q50l226n34J668
$$ 2800 662 -395 -1510 -521 156 -2992 -4649 -405 2189 -1029 -1953 2089 2939 -287 -821 847
1057H47j087j894L05M38j53J092J310k87N20K303P40j704j147K26l33j354j768
$$ 847 -240 -2134 -1829 -1391 -1544 -452 858 571 1091 3394 4134 2430 1283 1509 1176 -178 -1946
1074a946j867l7K154L65k342M66M528J640k843k84L344P0l193l84J466j452j527
$$ -1946 -3813 -3850 -1696 -1331 -3673 -3207 1321 2961 118 -166 3178 3248 55 -329 1137 -315 -1842
1091a842J446P62j167P00K051j95j043O47K45j458j090m65r22j70L82q02l0K794
$$ -1842 -396 366 -801 -101 1950 1755 712 1359 1604 146 -944 -1409 -2331 -2501 -2119 -2921 -2951 -157
1109a57J595j615P33L506q9k973M65J659k490k605J279M08k484j71K686L81j508
$$ -157 1438 -177 556 4062 3973 1000 1465 3124 634 -1971 -692 -284 -2768 -2939 -253 128 -1380
1126a380R65K179k6j488l51M72J7q50j437%J578O42j114M08K355O28j209J68P68
$$ -1380 -415 1764 1738 250 -101 371 388 -462 -1899 -1899 -321 321 -793 -385 1970 2598 1389 1557 2325
1145B325j484j598O62l46k685n35K638L15k141R06L569O13j886N05K026k45k185
$$ 2325 841 -757 -95 -441 -3126 -3661 -1023 -708 -2849 -1943 1626 2239 353 858 2884 2639 454
1162D54r33O76J72j288j269O67J820K75j081L85J604J75j082k06k50j319j69J160
$$ 454 -479 197 369 -919 -2188 -1521 299 574 -507 -122 1482 1657 575 369 119 -1200 -1369 -209
1180b09j033k090J481L427n05k286J456L156l67k485l14J245n12k008r96O05P42
$$ -209 -1242 -3332 -1851 1576 1071 -1215 241 3397 3030 545 231 1476 964 -1044 -2040 -1435 -693
1197f93o74n67J390J811l22p33R18Q74r83q32m3q60j104P42R43j356j077K372
$$ -693 -1367 -1934 -544 1267 945 212 1130 2004 1021 189 146 -714 -1818 -1076 -133 -1489 -2566 -194
1215a94K353j222j758J420K003r07k115m77O78J94q86o35O59J256nl00J087Q37
$$ -194 2159 937 -821 599 2602 1695 -420 -897 -219 -25 -911 -1546 -887 369 364 64 1151 1988
1233A988r94p65P56k12j806o94N74n53o94J110J089p66J92K218J218j340p96J055
$$ 1988 994 229 985 773 -1033 -1727 -1153 -1706 -2400 -1290 -201 -967 -775 1443 2661 1321 525 1580
1251A580O44j143j473m60M68K86n52m80L72Q50J38k09J44m3p01k10L25k88r43
$$ 1580 2224 1081 -392 -852 -384 -98 -650 -1130 -758 92 230 21 165 122 -579 -789 -464 -752 -1695
1270a695K15J110L07o2Q56R10O9N9O93j60j442p67K35m77j498o50L01J19J14N46
$$ -1695 -1480 -370 -63 -125 731 1641 1710 1769 2462 2302 860 93 328 -149 -1647 -2297 -1996 -1877 -1763 -1217
1290a217K79J63R31R37j84m04L04J83l60pK9n30l4R63K12p88o2O32l62j060j00
$$ -1217 -938 -775 156 1093 909 505 809 992 632 625 654 124 90 1053 1265 477 415 1047 685 -375 -475
1311d75m02j353k95Q53k86q29J060J616J41M02J537M48m35O52N62j455j019L72
$$ -475 -877 -2230 -2525 -1672 -1958 -2787 -1727 -111 30 432 1969 2417 1982 2634 3196 1741 722 1094
1329A094o73j427K6J35r70j28J269o8r21O42R15n81m47O82m4l82P91P71l37L30
$$ 1094 421 -1006 -980 -845 -1815 -1943 -674 -742 -1663 -1021 -106 -687 -1134 -452 -496 -878 -87 684 347 677
1349F77J346L16k76N78j4j223m77J05j502j884L02K14j457j53J500M37k68J344
$$ 677 2023 2339 2063 2641 2627 1404 927 1032 -470 -2354 -2052 -1838 -3295 -3448 -1948 -1511 -1779 -435
1367d35J408q5Q8R12N4o26J50k90o93J65K61r15j87J060k85j233N16P34j598j132
$$ -435 973 888 976 1888 1942 1316 1466 1176 483 648 909 -6 -193 867 582 -651 -135 599 -999 -2131
1387b131J068M9j778J8J705J75n45J421J573J39L21Q57r7l75n1j039j336P3n52
$$ -2131 -1063 -1014 -2792 -2774 -1069 -894 -1439 -18 1555 1694 2015 2872 2775 2400 2349 1310 -26 47 -505
1406e05j689QJ105o82p93J752J266j452j01K098r2j759M20J254o19p45Q86O14
$$ -505 -2194 -2186 -1081 -1763 -2556 -804 462 -990 -1091 1007 915 -844 -424 830 211 -534 352 966
1424I66QM41K62j15M28j09j431o61M37j217k059L33R55j052m22K061J066n56J067
$$ 966 974 1415 1677 1562 1990 1881 450 -211 226 -991 -3050 -2717 -1762 -2814 -3236 -1175 -109 -665 402
1443D02J989j98p62P06K13j251n98q4p46l28L76k81k83R07M62p72K82O84j124
$$ 402 2391 2193 1431 2137 2350 1099 501 417 -329 -657 -281 -562 -845 62 524 -248 34 718 -406
1462d06j062R15j1j811j10J950J24q25J464J689j96M8J133j83j280q5k79j578
$$ -406 -1468 -553 -564 -2375 -2485 -535 -411 -1236 228 1917 1721 1769 2902 2719 1439 1354 1075 -503
1480e03r69K9n80m78P94N40j67R20J307j06k13Q67j91j328K03N32j345q15J445
$$ -503 -1472 -1443 -2023 -2501 -1707 -1167 -1334 -414 893 787 574 1441 1250 -78 125 657 -688 -1503 -58
1499e8N68j077N16J729k74q28P38K37j534p45J51o86q06J43J7L19J130N44j78
$$ -58 510 -567 -51 1678 1404 576 1314 1551 17 -728 -577 -1263 -2069 -1926 -1909 -1590 -460 84 -94
1518i4J372J498j030q14J238j74k375o48J172p65j736Q71J372n00j55J245N37
$$ -94 1278 2776 1746 932 2170 1996 -379 -1027 145 -620 -2356 -1485 -113 -613 -768 477 1014
1535A014m85M5q8n07j73m63q14K95Q88n33k69J824J200j141M5J743k22k205k87
$$ 1014 529 574 486 -21 -194 -657 -1471 -1176 -288 -821 -1090 734 1934 793 838 2581 2359 154 -133
1554a33Q83j278j738K85Q52n15j67J086J026K85Q0M66N06j83j052n76L85k31j346
$$ -133 750 -528 -2266 -1981 -1129 -1644 -1811 -725 301 586 666 1132 1638 1455 403 -173 212 -19 -1365
1573a365l92J370P20p61K9J590P23q94n49N76j72j376p89K37j45o89J47J110O05
$$ -1365 -1757 -387 333 -428 -399 1191 1914 1020 471 1047 875 -501 -1290 -1053 -1198 -1887 -1740 -630 -25
1592b5PN27J152R5o38K0J99r13j320j06M00n97p34O55J202M25j11K65O41N23l46
$$ -25 -18 509 1661 1756 1118 1138 1337 424 -896 -1002 -602 -1199 -1933 -1278 -76 349 238 503 1144 1667 1321
1613A321j138n59N46l91j326j06J129j8l25J105J081m56q7R47m34j218MJ08j380
$$ 1321 183 -376 170 -221 -1547 -1653 -524 -542 -867 238 1319 863 776 1723 1289 71 75 183 -1197
1632a197p31R31J70p89O50J355K67J36N09l8l85L18l35j501m67P46k00r35L54
$$ -1197 -1928 -997 -827 -1616 -966 389 656 792 1301 1263 878 1196 861 -640 -1107 -361 -561 -1496 -1142
1651a142J058J93J43N85K32k38M6j96p53m34j28m42m33L93N68O7L22O84N70L13
$$ -1142 -84 109 252 837 1069 831 877 681 -72 -506 -634 -1076 -1509 -1116 -548 -481 -159 525 1095 1408
1671A408j05m33j63K6o89j017j09K15k64J16O83J89K17Q46K52m72Q2L21r93r29
$$ 1408 1303 870 707 733 44 -973 -1082 -867 -1131 -1015 -332 -143 74 920 1172 700 782 1103 110 -819
1691h19M87j01j232J35J225J41l03R56O37l99L68O50j175j203P13J80j588m80
$$ -819 -332 -433 -1665 -1530 -305 -164 -467 489 1126 727 1095 1745 570 -633 80 260 -1328 -1808
1709a808J094L20n36O59J069J10J48K02m25j95K90r92j576M56J083r08j197J158
$$ -1808 -714 -394 -930 -271 798 908 1056 1258 833 638 928 -64 -1640 -1184 -101 -1009 -2206 -1048
1727a048J893p6p03N37R12j02p32l20m55p23p3L22m60p35R48J645j85p55Q95J393
$$ -1048 845 769 66 603 1515 1413 681 361 -94 -817 -890 -568 -1028 -1763 -815 830 645 -110 785 2178
1747B178o77j458J05N78p43j518m44P95J063l65j162R12K727M73k395l95K215
$$ 2178 1501 43 148 726 -17 -1535 -1979 -1184 -121 -486 -1648 -736 1991 2464 69 -326 1889
1764A889K24k543j085R87j79p64O27L81q78Q92K521l54k160R48K288j534k549
$$ 1889 2113 -430 -1515 -528 -707 -1471 -844 -463 -1341 -449 2072 1718 -442 506 2794 1260 -1289
1781a289O26J120j386j088P05N17O74P43q92k20K932Q79l932j236L851J87m508
$$ -1289 -663 457 -929 -2017 -1312 -795 -121 622 -270 -490 2442 3321 -611 -1847 2004 2191 -2317
1798b317o66K870k40j312J537L89j210J997K378k301k145K149J038k502j366P12
$$ -2317 -2983 -113 -353 -1665 -128 261 -949 1048 3426 1125 -1020 1129 2167 -335 -1701 -989
1814i89q4o2M90m68O6K279M94k053N82K503j096l109L84J797p53j952j48J222
$$ -989 -1073 -1135 -645 -1113 -1047 1232 1726 -327 255 2758 1662 -1447 -1063 734 -19 -1971 -2119 -897
1832h97J233L98q03k22J719J185j056j540l25L85J45q42j470k27J724R56r95j25
$$ -897 336 734 -69 -291 1428 2613 1557 17 -308 77 222 -620 -2090 -2317 -593 363 -632 -757
1850g57J737R06p12m39K82l21p68m80n76k43N78J23p77N07K237N76j763j13K157
$$ -757 980 1886 1174 735 1017 696 -72 -552 -1128 -1371 -793 -670 -1447 -940 1297 1873 110 -3 2154
1869B154J81k388j000N88k7m32k11p55J77K258Q59j608J97K423k99k013N31N02
$$ 2154 2335 -53 -1053 -465 -492 -924 -1135 -1890 -1713 545 1404 -204 -7 2416 2117 104 635 1137
1887A137k194p33J782q45k073J767K349j556o73K904N92k333J23J627j110j748
$$ 1137 -1057 -1790 -8 -853 -2926 -1159 1190 -366 -1039 1865 2457 124 247 1874 764 -984
1903i84J7N6k67O25k64o91J473J977q55j209J433P67j651r59N94n65j296K95R38
$$ -984 -967 -911 -1178 -553 -817 -1508 -35 1942 1087 -122 1311 2078 427 -532 62 -503 -1799 -1504 -566
1922e66k85m98R53J692J08r98K34J384n40k035j49J146r41j571P72J383o56k69
$$ -566 -851 -1349 -396 1296 1404 406 640 2024 1484 -551 -700 446 -495 -2066 -1294 89 -567 -836
1940h36J397N59l25K22q0n83N6k00j400k91J106l95j071J190J695q36o56K069
$$ -836 561 1120 795 1017 937 354 410 210 -1190 -1481 -375 -770 -1841 -651 1044 208 -448 1621
1958A621O61k084m55J749p47k407K73J510q66j050J234J146n56J99J110k82p78
$$ 1621 2282 198 -257 1492 745 -1662 -1389 121 -745 -1795 -561 585 29 228 1338 1056 278
1975B78O56Jj451l61O77p08p06J229M83j138Q22K113q08j684J435J190k273j041
$$ 278 934 935 -516 -877 -200 -908 -1614 -385 98 -1040 -218 1895 1087 -597 838 2028 -245 -1286
1993a286J669m67j958R09J690j185m63J916M24j007O36N96j278l95J002q25j682
$$ -1286 383 -84 -2042 -1133 557 -628 -1091 825 1249 242 878 1474 196 -199 803 -22 -1704
2010a704O37R76p03j71J087Q8k63R61M79j071m26P65k46j007k11R2r8L11M45m9
$$ -1704 -1067 -91 -794 -965 122 210 -53 908 1387 316 -110 655 409 -598 -809 -717 -815 -504 -59 -108
2030a08Q2N03M66P2k00m30l40O1j55o08l48J72J60K88M24q3j32Q27N63m96o56
$$ -108 -26 477 943 1015 815 385 45 106 -49 -657 -1005 -833 -673 -385 39 -44 -176 651 1214 718 62
2051F2J29L3m58j46o9l91N7P11L62l61J14N70Q7j15J08m29o55K1M54l55r22K80
$$ 62 191 224 -234 -380 -449 -840 -783 -72 290 -71 43 613 700 585 693 264 -391 -370 84 -271 -1193 -913
2073i13Q29K54k01K41J44LL56J82p84n93K98K63n42k73J97O5K50O25j0m35K91
$$ -913 -84 170 -31 210 354 357 713 895 111 -482 -184 79 -463 -736 -539 -474 -224 401 391 -44 247
2094B47O41k47p07K5J25n41k43O96k6p31J42J213K73q59k80P97L38o55m64p5m4
$$ 247 888 641 -66 -41 84 -457 -700 -4 -30 -761 -619 594 867 8 -272 525 863 208 -256 -331 -375
2115c75k2N6o5j35K47M64J78J32p2k74P4N84m92j028K53Q43l85r32O52Q94o60
$$ -375 -397 -341 -406 -541 -294 170 348 480 408 134 208 792 300 -728 -475 368 -17 -949 -297 597 -63
2136f3n53J148O33j240o79J143M08j207o09P27L36l89o9K52J48K85J96k20J74
$$ -63 -616 532 1165 -75 -754 389 797 -410 -1019 -292 44 -345 -414 -162 -14 271 467 247 421
2155D21L9n01j20O24l11j242M01J427n48j347Q86J353p66r60J005O11j107n25
$$ 421 460 -41 -161 463 152 -1090 -689 738 190 -1157 -271 1082 316 -644 361 972 -135 -660
2173f60Q04K58q26l32M74N30j20m49J48O65J21o33m3N27k69p00K09N33m90o31
$$ -660 144 402 -424 -756 -282 248 128 -321 -173 492 613 -20 -63 464 195 -505 -296 237 -253 -884
2193h84O78P55m10n99M72P77j02r38L4P81k39r70J34P66l52p05O41P81n32m18
$$ -884 -206 549 139 -460 12 789 687 -251 -217 564 325 -645 -511 255 -97 -802 -161 620 88 -330
2213c30N67L59n33k47K06O5j74k55j5K56J83l14K0P37J23p55J15P06k12q72J18
$$ -330 237 596 63 -184 22 87 -87 -342 -357 -101 82 -232 -212 525 648 -107 8 714 502 -370 -252
2234b52N01l40n70K45M27k09q4L29J80j92J3K25l4k49j68J57l2k07J0J77J14O5
$$ -252 249 -91 -661 -416 11 -198 -282 47 227 35 48 273 239 -10 -178 -21 -53 -260 -250 -73 41 106
2256A06K9p9J74J22k21j84J88q5m19J1K77j83k66M69J85l63K57N02k16m80M74
$$ 106 135 56 230 352 131 -53 135 50 -369 -358 -81 -264 -530 -61 124 -239 18 520 304 -176 298
2277B98Q7n69j03L49j48l41L26Q2j39K38J73k17Q6K46k60l27L46j16n58L34M32
$$ 298 385 -184 -287 62 -86 -427 -101 -19 -158 80 253 36 122 368 108 -219 127 11 -547 -213 219
2298B19m63k57P29K87n57PN07j11m29J64q6j71j08N3j30J98J33k76J66N18j43
$$ 219 -244 -501 228 515 -42 -35 472 361 -68 96 10 -161 -269 -216 -346 -148 -15 -291 -125 393 250
2319B50l39K96L38n07l65M63O3m91r1M48J13k31p2K87J42j37j70J19L5k50l19
$$ 250 -89 207 545 38 -327 136 199 -292 -383 65 178 -53 -125 162 304 167 -3 116 151 -99 -418
2340d18J64O7j53O0J68J89l0k6K10K88k35k70J33K46l21m80K20K92k57k81L82
$$ -418 -254 -187 -340 -280 -112 77 47 21 231 519 284 14 147 393 72 -408 -188 104 -153 -434 -52
2361e2K12j80J8Q5p2J6J6j98p4J80m0j84J77K11k29J81L67j90k46L32J83n17j84
$$ -52 160 -20 -2 83 11 27 43 -155 -229 -49 -89 -273 -96 115 -114 67 434 244 -2 330 513 -4 -188
2384a88K55r7l34J84J4j03K02J73k78J57L94j57l31J79J99k62j51R9j2r7K03P3
$$ -188 67 -30 -364 -180 -166 -269 -67 106 -172 -15 379 222 -109 70 269 7 -144 -45 -57 -154 49 122
2406A22k37J02K56j47j95J43o2j34N9m1j51P0K21K5j60J84K81m7k03Q6R9r4k24
$$ 122 -115 -13 243 96 -99 44 -18 -152 -93 -134 -285 -215 6 31 -129 55 336 289 86 172 271 177 -47
2429d7p8O3Lj21oJ17M2k6r2L9J37l8m1oM3L2q7qJ32p8L7K10jk17L1L22j00m02
$$ -47 -125 -62 -59 -180 -186 -69 -27 -53 -145 -106 31 -7 -48 -54 -11 21 -66 -74 58 -20 17 227 226 9 40 362 262 -140
2457a40M3K31j35l03M1J56qq9J9N9K02O6j22m7J44M4j69L9m1k6J15N9j15n2J29
$$ -140 -97 134 -1 -304 -263 -107 -115 -204 -185 -126 76 142 20 -27 117 161 -8 31 -10 -36 79 138 23 -29 100
2482A00Q0j68n4KP7Mj91r0J68N6j43l7K21M9j06L3J65j13o5J87p9k17L6J62o1
$$ 100 180 12 -42 -40 37 41 -150 -240 -72 -16 -159 -196 25 74 -32 1 166 53 -12 175 96 -121 -85 77 16
2507A6k55J23J98j3r0L0M4L8Nj25r8R3J00p9m5L1L8NJ32m2k16K2L29j7m82m2L50
$$ 16 -239 -116 82 69 -21 9 53 91 96 -29 -127 -34 66 -13 -58 -27 11 16 148 106 -110 -88 241 224 -258 -300 50
2534E0J20m22j21L20K38k20o7J33O1K4p6N0j56QK30j47j73N5K61j7k48r9K48K75
$$ 50 170 -252 -373 -53 185 -35 -102 31 92 116 40 90 -66 -58 172 25 -148 -93 168 151 -97 -196 52 327
2558C27j79m75j1N92J11p29k33P16L25n41l66L77M27j21k82OR7J23K4j74l05J54
$$ 327 148 -327 -338 254 365 -364 -597 119 444 -97 -463 -86 341 220 -62 -56 41 164 188 14 -291 -137
2580a37L85k0m19r2M08K60l02l90K17M49j38o11mO96R3p19k54O30M45m54m33L25
$$ -137 248 228 -191 -283 125 385 83 -307 -90 359 221 -390 -394 302 395 -324 -578 52 497 43 -390 -65
2602f5M10j02k94j92J64K08Q5k11k73J10M75O0m86k02M32L62k86n62J76N19q8
$$ -65 345 243 -51 -243 -79 129 214 3 -270 -160 315 375 -111 -313 119 481 195 -367 -191 328 240
2623B40o03j29O19K18n62j64L86L78l47l01J94L22l3k81j24P2K40Jj87j83J39
$$ 240 -363 -492 127 345 -217 -381 5 383 36 -265 -71 251 218 -63 -187 -115 125 126 -61 -244 -105
2644a05M04q1l78j34L74L37l37n38J75O26j29n44n9N61J61l38k62K28K68j12k52
$$ -105 299 218 -160 -294 80 417 80 -458 -283 343 214 -330 -389 172 333 -5 -267 -39 229 117 -135
2665a35LJ62J65k32k16J32K58p3j90J6J51J55O4k59k75L44L17l24m97K61M46m3
$$ -135 -132 30 195 -37 -253 -121 137 64 -126 -110 41 196 260 1 -274 70 387 63 -434 -173 273 230
2687B30m49J0L28P9q7k41j4K06Q9k00j56N0K15J4j92j9K26R1j51k6M8J8J25r9
$$ 230 -219 -209 119 198 111 -130 -144 62 151 -49 -205 -155 60 74 -118 -137 89 180 29 3 51 69 194 95
2711I5j95K0L26j37l82J29K50O4k84m8J45J37j34L5j80lK75J5l00j22L82Q8j27
$$ 95 -100 -80 246 109 -273 -144 106 170 -114 -162 -17 120 -14 21 -159 -162 113 128 -172 -294 88 176 49
2734D9j58J24R2L7q8o3p4K29ok47q8K24O1j76j11K02N9p5m9Q8j3J8M1j17j24J56
$$ 49 -109 15 107 144 56 -7 -81 148 142 -105 -193 31 92 -84 -195 7 66 -9 -58 30 17 35 76 -41 -165 -9
2760iJ60j68j81J77J74p1j48O4N7k0J9q6q4Q0J71j50k11K15J82j61r0N8J93j10
$$ -9 151 -17 -198 -21 153 82 -66 -2 55 35 54 -32 -116 -36 135 -15 -226 -11 171 10 -80 -22 171 61
2784F1m8K8q4l5J42j09r3N5J31q5j00N5J42mn1k7O%J08n5j57Q2J33o5j25M1J53
$$ 61 13 41 -43 -78 64 -45 -138 -83 48 -37 -137 -82 60 56 5 -22 -16 -16 92 37 -120 -38 95 30 -95 -54 99
2811I9o2j06J62J4j02m4R8j07j12Q8L7l6l9J01PMl4Q0O4n9P4j63K8J08nj97K5
$$ 99 37 -69 93 107 5 -39 59 -48 -160 -72 -35 -71 -110 -9 -2 2 -32 48 112 53 127 -36 -8 100 95 -102 -77
2838g7K32n2j67Q1N0p4j7J30l3j66J8J00j5j08k9J00L5l0J0L3N8%j39R5J9O1k17
$$ -77 155 103 -64 17 67 -7 -24 106 73 -93 -75 25 10 -98 -127 -27 8 -22 -12 21 79 79 -60 35 54 115 -102
2865a02L7J59p2n9m3J41m3j3K4J4j4M6k9k4j51O6J29k0j41qJ05Q4n8j27K7J17
$$ -102 -65 94 22 -37 -80 61 18 5 29 43 29 75 46 22 -129 -63 66 46 -95 -103 2 86 28 -99 -72 45
2891D5L0j27nR4N3j74LJ45j4r9K6J11l7M9l8m2rP6k5j45k9J15j5m4k0k4R7J44
$$ 45 75 -52 -57 37 90 -84 -81 64 50 -49 -23 88 51 100 62 20 11 87 62 -83 -112 3 -12 -56 -76 -100 -3 141
2919A41j25j48L3J96rj78k8J27N2j04K4N5j5jK0K7n4P4Jj56M2M4L4j38M7K7J6
$$ 141 16 -132 -99 97 88 -90 -118 9 61 -43 -19 36 21 20 40 67 13 87 88 -68 -26 18 52 -86 -39 -12 4
2946Dm6l5K1K7P4l8r6M3J31mk17L6J28Nk8m8K5L7L2J7n7k9M4K5p5m0J69j28l7
$$ 4 -42 -77 -56 -29 45 7 -89 -46 85 81 -136 -100 28 33 5 -43 -18 19 51 68 11 -18 26 51 -24 -64 105 -23 -60
2975f0N4kK5o0M1kJ5Ln3k8K3P0Qj19K4J13k9n0K9Mj5K1O4n1o1K4J03j11m2Q9N
$$ -60 -6 -8 17 -43 -2 -4 11 14 -39 -67 -44 26 34 -85 -61 52 23 -27 2 6 -9 12 76 25 -36 -12 91 -20 -62 27 32
3006C2m6j3K4N0n1L9j7j2l4m5K2K0J8j7qL3KJ3n2RR8n9Llm3l4N9K4L1r7N3rK9
$$ 32 -14 -27 -3 47 -4 35 18 6 -28 -73 -51 -31 -13 -30 -38 -5 -3 10 -42 -33 65 6 9 6 -37 -71 -12 12 43 -54 -1 -10 19
3039A9n6K8M4o5L0Oo1oL2l6P5o8K1J9M3L1l3j3L1N0m6n2M8j6o0j7J38p3n5K9N3
$$ 19 -37 -9 35 -30 0 6 -55 -61 -29 -65 10 -58 -37 -18 25 56 23 10 41 91 45 -7 41 25 -35 -52 86 13 -42 -13 40
3070D0k9n0O3j0j9n1J3j0n0O9k2K0j4M5l1K9Q5o3j8J1O3j01j4M8k1j3J8LRK6j2
$$ 40 11 -39 24 14 -5 -56 -43 -53 -103 -34 -56 -36 -50 -5 -36 -7 78 15 -3 8 71 -30 -44 4 -17 -30 -12 -9 0 26 14
3101A4O3l3p9J8Rj0%k9qK9qlJ9j8O3j0j2j2O4o3K1k8j2J4N2m5P6q6L1Nlj3K7K
$$ 14 77 44 -35 -17 -8 -18 -18 -47 -55 -26 -34 -37 -18 -36 27 17 5 -7 57 -6 15 -13 -25 -11 41 -4 72 -14 17 22 19 6 33 35
3135C5k6J6K1n5m5K8L2l4l4K8O0n1M8l9J8J8l2k0nO0n3O2m8J2oL8pk1N1n8j5M8
$$ 35 9 25 46 -9 -54 -26 6 -28 -62 -34 26 -25 23 -16 2 20 -12 -32 -37 23 -30 32 -16 -4 -10 28 21 0 51 -7 -22 26
3167B6M0k9l9J4o4%lQ3q8l7L3Q0n3J4M2L6q4N5K4q4N8m4nM2%K2l6K2L5l1l0M8
$$ 26 66 37 -2 12 -52 -52 -55 28 -60 -97 -64 16 -37 -23 19 55 -29 26 50 -34 24 -20 -25 17 17 39 3 25 60 29 -1 47
3199D7J6r5L6JOnl5J7kl0L0O4p5P7o4kL5q2P5n5Q2m4o7O8M1j3m1M5L2m8m4jM6
$$ 47 63 -32 4 5 11 6 -29 -12 -14 -44 -14 50 -25 52 -12 -14 21 -61 14 -41 41 -3 -70 -2 39 26 -15 30 62 14 -30 -31 15
3232A5o9L5mqRl8J8P2Nm1J5nj8m9K9Q8q3m8O5M6j6Qk8N8No1nQ3p3k1m0M1nk9M3
$$ 15 -54 -19 -23 -31 -22 -60 -42 30 35 -6 9 4 -14 -63 -34 54 -29 -77 -12 34 18 26 -2 56 61 0 -5 78 5 -16 -56 -15 -20 -49 -6
3267fK0L2q4L0N0J4p2k2L1K6r3M0L1j4m4L3jP8p2L1PK6o2J1P3m4kq7N6K6k4l3
$$ -6 14 46 -38 -8 42 56 -16 -38 -7 19 -74 -34 -3 -17 -61 -28 -29 49 -23 8 15 41 -21 -10 63 19 17 -70 -14 12 -12 -45
3299d5L1L8n6L3K4l3l7K3L5n1qj3J6O1j8L4o8JL5L8o5M1n5O6l8N2m0j8J2L6p5
$$ -45 -14 24 -32 1 25 -8 -45 -22 13 -38 -46 -59 -43 18 0 34 -34 -33 2 40 -25 16 -39 27 -11 41 1 -17 -5 31 -44
3330d4K1QL2k4n5M7j5K1k4QN1n2L2j4j0R0p4k1P4l3m4RK4o0K7L3P1q9m4N6L0j4
$$ -44 -23 -15 17 -7 -62 -15 -30 -9 -33 -25 26 -26 6 -8 -18 72 -2 -23 51 18 -26 -17 7 -53 -26 7 78 -11 -55 1 31 17
3362A7m1MN3m6nm5L9M7m7n9N2J4L9l9M8Rk1k3l6N0j8j9j5k3Q8P7o0o6L0N9m8j6
$$ 17 -24 -20 33 -13 -18 -63 -24 23 -24 -83 -31 -17 22 -17 31 40 19 -4 -40 10 -8 -27 -42 -65 23 100 40 -26 4 63 15 -1
3394akm4K4J9n9m3Q9Q2j07K8n0N2K6p2N2POKrj1lM2ml3M2J5m8J8n0Q2o0j2j6M4
$$ -1 -3 -47 -23 -4 -63 -106 -17 65 -42 -14 -64 -12 14 -58 -6 1 7 9 0 -11 -14 28 24 -9 33 48 0 18 -32 50 -10 -22 -38 6
3428FOk5lpNK2Kp3QM0N4m5j7JP0l1m7j7J28jk7q1K9K1l5K2qJ9kl2L2p2M1N6q2
$$ 6 12 -13 -16 -23 -18 4 6 -67 -59 -19 35 -10 -27 -26 44 13 -34 -51 77 76 49 -32 -3 18 -17 5 -3 16 14 -18 14 -58 -17 39 -43
3463d3pR8k3j20K8R1m4K4K4o5k0M4O4r4rJ29nq8j6L1M2o5O2j5o7L0N9l8l8L9J9
$$ -43 -50 48 25 -95 -67 24 -20 4 28 -37 -57 -13 51 -43 -52 77 72 -16 -32 -1 41 -24 38 23 -44 -14 45 7 -31 8 27
3494B7m4j4lN4m4N2J4j01N0K5kn9P0j4k5j1K7M3p0R0o2J6M8j7o4j4O2M6p4q0O8
$$ 27 -17 -31 -34 20 -24 28 42 -59 -9 16 14 -45 25 11 -14 -25 2 45 -25 65 3 19 67 50 -14 -28 34 80 6 -74 -6
3525fQ3m0r4L7J6o7Q6j1k7l0R9n3N3p8K8K2O3j08qQ4mm9k0K1J5j0kL1qk7m3K4
$$ -6 77 37 -57 -20 -4 -71 15 4 -23 -53 46 -7 46 -32 -4 18 81 -27 -35 49 45 -4 -24 -3 12 2 0 31 23 -4 -47 -23
3557b3m3J27p9m9O3K9J3j03P3K6J9jMj68J10O8Qj23j2K3M8Pm9N7j2MK2p0K2R7
$$ -23 -66 61 -18 -67 -4 25 38 -65 8 34 53 52 56 -112 -2 66 74 -49 -61 -38 10 17 -32 25 13 17 39 -31 -9 88
3587H8q8o2P9K4m1o1P1N2k9o7KO5l2K9l7k1j2P4m7l4k6N7N1k0qj0L0J5rn1J6K1
$$ 88 0 -62 17 41 0 -61 10 62 33 -34 -32 33 1 30 -7 -28 -40 34 -13 -47 -73 -16 35 15 7 -3 27 42 33 -18 -2 19
3619A9M5j29LJ09k1p3m7Q4K4n0QmN7q8K0L0M3m9P8ml0kL4l4j9M8nq0Q8m7q2K1
$$ 19 64 -65 -62 47 26 -47 -94 -10 14 -36 -28 -32 25 -63 -43 -13 30 -19 59 55 25 23 57 23 4 52 47 -33 55 8 -74 -53
3651e3J04Kj86Q5R6o7p7J21L2o7o5J00J1p1m2J09l2o2R1l4L7j6L2o5ON5k6j09
$$ -53 51 53 -133 -48 48 -19 -96 25 57 -10 -75 25 36 -35 -77 32 0 -62 29 -5 32 16 48 -17 -11 44 18 -91
3679i1J39l1q8K1R2Q1k15O5J55j14j5j2Q5j20M9O3k3n1p9Q1pK5nJ4rm8M1k9K4
$$ -91 48 17 -71 -50 42 123 -92 -27 128 14 -1 -13 72 -48 1 64 41 -10 -89 -8 -15 10 5 19 10 -38 3 -26 -2
3708bM0j9p6J18j1o9MM2O1l4n6K6J9o9n6J8J7J2n5oJ04n6M9K0%k5J10l3l5j9J9
$$ -2 38 19 -57 61 50 -19 -15 27 88 54 -2 24 43 -26 -82 -64 -47 -35 -90 -96 8 -48 1 21 21 -4 106 73 38 19 38
3739C8n2J8m8N0kqK8l5jP6m1p7L2L8o1o4M3M5o2k4J21Q4j03J5N4k1j3M3m8p1K9
$$ 38 -14 4 -44 6 4 -4 24 -11 -12 64 23 -54 -22 16 -45 -109 -66 -21 -83 -107 14 98 -5 10 64 43 30 73 25 -46 -17
3770a7J4n9n4O7N7j5L8K8j1l7lN7q2m1M4J7o8J6OP0j4k1P6L0q0kJ4p1J6k3k8j4
$$ -17 -3 -62 -116 -49 8 -7 31 59 48 11 8 65 -17 -58 -14 3 -65 -49 -43 27 13 -8 68 98 18 16 30 -41 -25 -48 -76 -90
3802i0P2m3J4N3P0K0j1j6J4nn4m6M8j18K6J5%l8M6P8Mo3K8O9r2k1O0p7qrQ6k4
$$ -90 -18 -61 -47 6 76 96 85 69 83 78 24 -22 26 -92 -66 -51 -51 -89 -43 35 39 -24 4 73 -19 -40 20 -57 -65 -74 12 -12
3834a2n6Q7J06r3R3l7l2l0O2j20m1k6N7j4n0P3Pk8J38K7p0mLJ9j10ON1K4j24Q1
$$ -12 -68 19 125 32 125 88 56 26 88 -32 -73 -99 -42 -56 -106 -33 -26 -54 84 111 41 37 40 59 -51 -45 6 30 -94 -13
3864a3J0p9N3J07k4k3k1N1r0j9j1L3m8n3P6nP4j9NM3N6k1o5jNj2p6j3N1l4k5N
$$ -13 -3 -82 -29 78 54 31 10 61 -29 -48 -59 -26 -74 -127 -51 -56 18 -1 4 47 103 82 17 16 21 9 -67 -80 -29 -63 -88 -83
3896h3P0j7M5JN4l8kJ6L1j14J2J4rj5M1%J9Qk7M4J2l9k0l4l9K7Ol6L1M3l3N1K5
$$ -83 -13 -30 15 16 70 32 30 46 77 -37 -25 -11 -20 -35 6 6 25 33 6 50 62 23 3 -31 -70 -43 -37 -73 -42 1 -32 19 44
3929D4O0k6j6L5l4r0JO8p4J3PL8j8m5J5J6L5M0L3q0k3j1l1K3RQj0o6R7M3k5J8
$$ 44 104 78 62 97 63 -27 -26 42 -32 -19 -12 26 8 -37 -22 -6 29 69 102 22 -1 -12 -43 -20 -11 -3 -13 -79 18 61 36 54
3961E4rLJ8n3J7o0k2K9k7j9MN6N2k9k1N6L9n0m8K6jm1K6qk5O1n8NMP0Kr9R0o2
$$ 54 45 48 66 13 30 -30 -52 -23 -50 -69 -65 -9 43 14 -7 49 88 38 -10 16 15 -26 0 -8 -33 28 -30 -25 -21 49 51 -48 42 -20
3995b0nn9J09j3n5qP0K2p5L4k1J27n2j1j3m5K2m5k4M6M%m3N6J0n3N0N6m4k6K9
$$ -20 -25 -84 25 12 -43 -51 19 41 -34 0 -21 106 54 43 30 -15 7 -38 -62 -16 -12 -12 -55 1 11 -42 8 64 20 -6 23
4026B3J5m9k9J8M2n3j5M4KK2j9j6P4n0o7jO3k4q2NO0K6m4N9P2Oj08K7P0j1l3m4
$$ 23 38 -11 -40 -22 20 -33 -48 -4 -2 20 1 -15 59 9 -58 -59 4 -20 -102 -97 -37 -11 -55 4 76 82 -26 1 71 60 27 -17
4058a7M7o0k6K8nK6J7j6M8N0j28J4L0J0p1K8N3p3J2jN0n1K8N0q9N7J6k0m3P8q3
$$ -17 30 -30 -56 -28 -33 -7 10 -6 42 92 -36 -22 8 18 -53 -25 28 -45 -33 -34 16 -35 -7 43 -46 11 27 7 -36 42 -41
4089d1m0Q5J3n2j4P8K4p7K9K3j3M8j2l6l3L1k6k2kM8j0k1N2n1J9L3M7j08J4J8
$$ -41 -81 4 17 -35 -49 29 53 -24 5 28 15 63 51 15 -18 13 -13 -35 -37 11 1 -20 32 -19 0 33 80 -28 -14 4
4119DQo6M6N3k9o4N3N1Nk2J0m1M1k7j7q5K3J4M8n9K6N6k8O7j7k9l5j5K7Mn0M8
$$ 4 12 -54 -8 45 16 -48 5 56 61 39 49 8 49 22 5 -80 -57 -43 5 -54 -28 28 0 67 50 21 -14 -29 -2 2 -48 0
4151@Pp3N0M3m1J4R3k9l8O5Mj84K4O4l7n9R2J3m5O3pm8JJ24r7J1L5k8l7l4K8N2
$$ 0 7 -66 -16 27 -14 0 93 64 26 91 95 -89 -65 -1 -38 -97 -5 8 -37 26 19 -29 -28 96 -1 10 45 17 -20 -54 -26 26
4183B6j06R7J9j04N4K7Kk1R7m5r6L7M6k5o7J00l7k6Q3Ll4p3J02l3l3Qj4o0L8l1
$$ 26 -80 17 36 -68 -14 13 15 -6 91 46 -50 -13 33 8 -59 41 4 -22 61 64 30 -43 59 26 -7 1 -13 -73 -35 -66
4213f6J4KO3m6K6mN8k5j4K3K0n6K3l4Rm6L4O0l9K4J4j3m7oL8j9l5K0n7J5O0ql
$$ -66 -52 -50 13 -33 -7 -11 47 22 8 31 51 -5 18 -16 -7 -53 -19 41 2 26 40 27 -20 -26 12 -7 -42 -22 -79 -64 -4 -12 -15
4246a5L7J4j6j7M5Lk2KrJ0m8j7NK9k6L7L3q1M0Oj8lJ0k0rKJ9j07J18K0o9M1O2
$$ -15 22 36 20 3 48 51 29 31 22 32 -16 -33 -28 1 -25 12 45 -36 4 10 -8 -11 -1 -21 -30 -28 -9 -116 2 22 -47 -6 56
4279E6Kn3L1L1p5oK8o0J7J6m1O6j9L6jn4N5K1q3Q1%n1l7k2R3o3m8K6P2l0J6L2
$$ 56 58 5 36 67 -8 -14 14 -46 -29 -13 -54 12 -7 29 28 -26 29 50 -33 48 48 -3 -40 -62 31 -32 -80 -54 18 -12 4 36
4311C6m0jl5L3mLq5Q4qmj6K4QjP3k0Pql4l5J8j3p9Q1K5l6j8K7N8Pj0lp3K3Q2m9
$$ 36 -4 -5 -40 -7 -11 -8 -93 -9 -17 -21 -37 -13 -5 -6 67 47 54 46 12 -23 -5 -18 -97 -16 9 -27 -45 -18 40 47 37 34 -39 -16 66 17
4347A7j7o1Q4m3j2K0K3k8R9J4m9l6L0Oj18P2J9k5Oo8M2M7J8n6J7P4l0j2o5%k1
$$ 17 0 -61 23 -20 -32 -12 11 -17 82 96 47 11 41 47 -71 1 20 -5 1 -67 -25 22 40 -16 1 75 45 33 -32 -32 -53
4378e3J1l7K7J1M1K5l0K2L6n7L9j3k0l9QK5o5L8J9l5K6oO8Lj1J4k8j0K9j03L9
$$ -53 -42 -79 -52 -41 0 25 -5 17 53 -4 35 22 2 -37 -29 -4 -69 -31 -12 -47 -21 -27 41 44 33 47 19 9 38 -65 -26
4409b6rOJ3j2K8j6pK0R7oj34N7j0J2n2pK1l1N2j7M2l2N7L0j3p6J3L5qr3L2M0o0
$$ -26 -35 -29 -16 -28 0 -16 -23 -3 94 88 -46 11 1 13 -39 -46 -25 -56 -4 -21 21 -11 46 76 63 -13 0 35 27 -66 -34 6 -54
4442e4j7N5P5j2%K3k4j1nj3r5O0K0m3m3J31m8p8Q6Q4n8p7J01jr7J2O1j16O0J3
$$ -54 -71 -16 59 47 47 70 46 35 30 17 -78 -18 2 -41 -84 47 -1 -79 7 91 33 -44 57 56 -41 -29 32 -84 -24 -11
4472a1n7J4O4j1K3M1k1km4N7j1j02K9kk6L7K7j1RL7jj3L7qj17P4L0j05l7R7k7
$$ -11 -68 -54 10 -1 22 63 42 40 -4 53 42 -60 -31 -33 -59 -22 5 -6 3 40 39 26 63 55 -62 12 42 -63 -100 -3 -30
4503c0q6J62J1l5MQk5J3%lm5J6k9l0K9Q4p8K2Q9qn5N8%j09L8l7o0L2L0j0j8O6
$$ -30 -116 46 57 22 26 34 9 22 22 19 -26 -10 -39 -69 -40 44 -34 -12 77 69 14 72 72 -37 1 -36 -96 -64 -34 -44 -62 4
4535DP5j11K3J37q1j33J84j05m2L3Mm9l9J58m4o7J47k6q9R3P9j20n1Ql8r0J45
$$ 4 79 -32 -9 128 47 -86 98 -7 -49 -16 -12 -61 -100 58 14 -53 94 68 -21 72 151 31 -20 -12 -50 -140 5
4562Ejj26J01O6o0K4R9m1r6M7J0r6J9P5j07L2Q8om0M9L3j06N3N3r7j5Q3o3r6J28
$$ 5 4 -122 -21 45 -15 9 108 67 -29 18 28 -68 -49 26 -81 -49 39 33 -7 42 75 -31 22 75 -22 -37 46 -17 -113 15
4592A5J7q1j5J62q4j4O7L6j84J11O5j83L0J04n7r9J12qj04J09J05j51L5J11n3
$$ 15 32 -49 -64 98 14 0 67 103 -81 30 95 -88 -58 46 -11 -110 2 -6 -110 -1 104 -47 -12 99 46
4617D6q4P3n1n4j9O8k3j6R8p4j0J15Oq1J1O8j37L7Oo2K0P3Mm2j3J40n7n7P1j8
$$ 46 -38 35 -16 -70 -89 -21 -44 -60 38 -36 -46 69 75 -6 5 73 -64 -27 -21 -83 -63 10 14 -28 -41 99 42 -15 56 38
4647C8j25J10po9K4P8j38K2J61j31pN3O9j15M1N0j08l6J30Nj21lJ43j04qQ6j8
$$ 38 -87 23 16 -53 -29 49 -89 -67 94 -37 -44 9 78 -37 4 54 -54 -90 40 45 -76 -79 64 -40 -48 38 20
4674B0l4J38p7q2L5K0p4OJ28q7l2M7J6o6L1J10m3p6K5J1p8P3l3l5L2M6r1Q7O7
$$ 20 -14 124 47 -35 0 20 -54 -48 80 -7 -39 8 24 -42 -11 99 56 -20 5 16 -62 11 -22 -57 -25 21 -70 17 84
4703H4m1r2R1L6j50NR4k9n6O1n2k8M9P2o2L6Q5r4rK8j6j25J03J07j37m3J15Jo5
$$ 84 43 -49 42 78 -72 -67 27 -2 -58 3 -49 -77 -28 44 -18 18 103 9 0 28 12 -113 -10 97 -40 -83 32 33 -32
4732c2R3o3K1k3pj3JM8p3o3J30J6p3j1J00qp0J21l5q1oJ14j25KJ3j4K5P%l0L8
$$ -32 61 -2 19 -4 -11 -24 -23 25 -48 -111 19 35 -38 -49 51 43 -27 94 59 -22 -28 86 -39 -37 -24 -38 -13 -6 -6 -36 2
4763BQ8o4j3J3m6m6O4j2J3k3nj5J3J01n1RK4k7k7L9j3o2j3Q6p4k8L9P3j05j7N1
$$ 2 90 26 13 26 -20 -66 -2 -14 -1 -24 -29 -44 -31 70 19 28 52 25 -2 37 24 -38 -51 35 -39 -67 -28 45 -60 -77 -26
4794b6P1o0O5k9q1M8N9p5J2Rn6QP0J26j49J2M6k2j3kl3K0n1M1nm1M8J4j0qO4j8
$$ -26 45 -15 50 21 -60 -12 47 -28 -16 -7 -63 -55 15 141 -8 4 50 28 15 13 -20 0 -51 -10 -15 -56 -8 6 -4 -12 52 34
4826C4j9K6p7N7j29N3J5M9Ok6OnPK7L7J5m1jn5K5j4k1pP3l3M3j8l4K4rj6kqlM5
$$ 34 15 41 -36 21 -108 -55 -40 9 15 -11 -5 -10 -3 24 61 76 35 34 -21 4 -10 -31 -38 35 2 45 27 -7 17 8 -8 -10 -18 -21 24
4861B4j9r2L6M3O8q2O2J0k6j1Q5q2q9Q8m3j0J8L5r5M8N8k0k9%N3q2M6L5n0nJ5
$$ 24 5 -87 -51 -8 60 -22 40 50 24 13 98 16 -73 15 -28 -38 -20 15 -80 -32 26 6 -23 -23 30 -52 -6 29 -21 -26 -11
4892a1N7j34P0M2o2O7O9j15J5N7j3p3nJ14p8j07J03j8j7L0J6r0Q9L2n5k5R8o5
$$ -11 46 -88 -18 24 -38 29 98 -17 -2 55 42 -31 -36 78 0 -107 -4 -22 -39 -9 7 -83 6 38 -17 -42 56 -9
4920io1J17r9k8l6J72j41L2J10k8p1P1P2j51N6K0m7m0P6%j65J35N3o5J0P1j9l4
$$ -9 -70 47 -52 -80 -116 56 -85 -53 57 29 -42 29 101 -50 6 26 -21 -61 15 15 -150 -15 38 -27 -17 54 35 1
4948AM3P5k15L0P2n7k4Q2n3o0J59Pj22R0N2r0o3J10k7r1J39n3q7K7J38j25m4J31
$$ 1 44 119 -96 -66 6 -51 -75 7 -46 -106 53 60 -62 28 80 -10 -73 37 10 -81 58 5 -82 -55 83 -42 -86 45
4976D5J4j09J18K3j68k8J45r3l3J39j8j23P7J4K2j2J10j51mR6l0q8MN9q9RJ12
$$ 45 59 -50 68 91 -77 -105 40 -53 -86 53 35 -88 -11 3 25 13 123 -28 -32 64 34 -54 -50 9 -80 -71 41
5003D1p1m9J08N2j51N9J09j25o4J47mj77J25K1j87Q6J87j26L2J07o0j25R7Oj19
$$ 41 -30 -79 29 81 -70 -11 98 -27 -91 56 52 -125 0 21 -166 -80 107 -19 13 120 60 -65 32 38 -81
5028h1J7J38j51m2Q2M5r4J34Rr8RR7l3j09R9Jj38O1L9q6K1J46r6n0J60nj62J05
$$ -81 -64 74 -77 -119 -37 8 -86 48 57 -41 -32 65 32 -77 22 23 -115 -54 -15 -101 -80 66 -30 -80 80 75 -87 18
5056A8R1j96j2J65p4j51J83J5j09Q8J52j80k4J31p9r7R2K9j66N9Q6q0k8J20oj20
$$ 18 109 -87 -99 66 -8 -159 24 39 -70 18 170 -10 -34 97 18 -79 13 42 -124 -65 21 -59 -87 33 27 -93
5082i3J82J3j71Q9P1j53l1J34m6r5R1N6j04M4J16q4p5J47Kj64J43Mj18o0J66n8
$$ -93 89 102 -69 20 91 -62 -93 41 -5 -100 -9 47 -57 -13 103 19 -56 91 93 -71 72 76 -42 -102 64 6
5108Fj59J52L1j04J31Q7j48m1J85j05j08Q9J5j54R1R2q0K6O0%j35J14O1j00l0
$$ 6 -153 -1 30 -74 57 144 -4 -45 140 35 -73 16 31 -123 -32 60 -20 6 66 66 -69 45 106 6 -24
5133b4J24j16j13R5l3l2J20L2j07J22N1n0o7M7J9j35O2Nl7l2R0o7n2J58j8j23
$$ -24 100 -16 -129 -34 -67 -99 21 53 -54 68 119 69 2 49 68 -67 -5 0 -37 -69 21 -46 -98 60 42 -81
5159h1J16Q0j28K6nm7j01J57l3j14J13O7p4lJ06n4m3N5L7j54Q0j0k0m8J08o7n0
$$ -81 35 115 -13 13 8 -39 -140 17 -16 -130 -17 50 -24 -27 79 25 -18 37 74 -80 0 -10 -30 -78 30 -37 -87
5186h7P7M0j5N4N3j23p3J42m9l9J2L0r0PR4rp1O5K8ol8K2p0JQ3o7m2O0k1l2RJ48
$$ -87 -10 30 15 69 122 -1 -74 68 19 -20 -8 22 -68 -61 33 24 -47 18 46 40 2 24 -46 -45 38 -29 -71 -11 -32 -64 -55 93
5218I3r9J9L4m6J%L9q0PM2Rm0P1l7p9P9ml1P0l0Ko5L6J0m1j3N3n9R8L7p2KPLJ6
$$ 93 -6 13 47 1 2 2 41 -39 -32 10 19 -21 50 13 -66 13 9 -22 48 18 20 -45 -9 1 -40 -53 0 -59 39 76 4 6 13 16 32
5253C2p1P3n7%j2j3J3Q9o3L2k4P9l9j9j9Ol2j3qLjlN4l9O9j4KK4j5l7jm6P7m6
$$ 32 -39 34 -23 -23 -35 -48 -35 54 -9 23 -1 78 39 20 1 7 -25 -38 -46 -43 -44 -47 7 -32 37 23 25 49 34 -3 -4 -50 27 -19
5287a9m3qK2qQ5k3J5L4OJn6L0p8MM9k6n2J2L7j9L7J3J0K3n6L5o5P3k1pj4m1O0
$$ -19 -62 -70 -48 -56 29 6 21 55 61 62 6 36 -42 -38 11 -15 -67 -55 -18 -37 0 13 23 46 -10 25 -40 33 12 5 -9 -50 10
5320A0m0RN4l2j4kQN3J1k9n0j7P6o7mK4l2K7pN1m4J6L5k3k9k9J3%K4N4j37P2K8
$$ 10 -30 -21 33 1 -13 -15 -7 46 57 28 -22 -39 37 -30 -34 -10 -42 -15 -22 29 -15 1 36 13 -16 -45 -32 -32 -8 46 -91 -19 9
5353Ij3j0M5P9j73P8jn6l6J16r9j1N1J0j0L5KJ2m2R8p2n8P2j1p7nP1J1Ll0L0%
$$ 9 -4 -14 31 110 -63 15 14 -42 -78 38 -61 -72 -21 -11 -21 14 16 28 -14 84 12 -46 26 15 -62 -67 4 15 18 -12 18 18
5385A8j3P4q9rM2l0j5MP5j02K2L4l0O3J9p3l3L2K6n0%M1n4J9L9m9oQ2P2p5k6O3
$$ 18 5 79 -10 -19 23 -7 -22 -18 57 -45 -23 11 -19 44 63 -10 -43 -11 15 -35 -35 6 -48 -29 10 -39 -45 37 109 34 8 71
5417G1q8j0Q5m7k3%j1lK7P1j10rP9lo7Q5pr7L5N6j6r7J21k8r9M0R3n2%N7o8K2
$$ 71 -17 -27 58 11 -12 -12 -23 -26 1 72 -38 -47 32 29 -38 47 40 -57 -22 34 18 -79 42 14 -85 -45 48 -4 -4 53 -15 7
5449GjJ0j00O6N9n4q5P4J0O5J4p2j8K0L9m9l2M9M6q5N8p6L9JM8q2kJ05o6kN1k5
$$ 7 6 16 -84 -18 41 -13 -98 -24 -14 51 65 -7 -25 -5 34 -15 -47 2 48 -37 21 -55 -16 -15 33 -49 -51 54 -12 -14 37 12
5481A2q1K9L0qK3K1K6r1O3N3p7l3Q3k9n3M0k1l8M4Oo1M5L6k1l5N3M3p1j2M0k5
$$ 12 -69 -40 -10 -18 5 26 52 -39 24 77 0 -33 50 21 -32 8 -13 -51 -7 -1 -62 -17 19 -2 -37 16 59 -12 -24 16 -9
5512imN3p2k1L6OJ6j5P4j27J6J07m6n3L7J8p1j8J31j44L0Q4L9k2l2O0q2JN5o9
$$ -9 -13 40 -32 -53 -17 -11 5 -10 64 -63 -47 60 14 -39 -2 16 -55 -73 58 -86 -56 28 67 45 13 73 -9 -8 47 -22
5542b2l4M2MJ0Nnj5n3R4k3o9Q6J2p2kO3n1M0qn0j3Q3Ln4PM3o7L9J4j7k2K1N5p5
$$ -22 -56 -14 -10 0 5 0 -15 -68 26 3 -66 20 32 -40 -42 21 -30 10 2 -48 -61 22 25 -29 -22 21 -46 -7 7 -10 -32 -11 44 -31
5576c1k2J20l7q4N9K4j17J31k7l9k8O1pn2M5mk5ON3p7K0O0l6j7P8m1mK3qk2n8
$$ -31 -53 67 30 -54 5 29 -88 43 16 -23 -51 10 3 -49 -4 -8 -33 -27 26 -51 -31 29 -7 -24 54 13 9 32 24 2 -56
5607e6Q7k1l2M1nMlj4j5j6M9Om4MK4o1L3J6m8j9Q3l0m4J8J16m6p4Q6j7k0K5l3
$$ -56 31 10 -22 19 14 18 15 1 -14 -30 19 25 -19 -15 9 -52 -19 -3 -51 -70 13 -17 -61 -43 73 27 -47 39 22 2 27 -6
5639fk4L1l0M7Mj4l2j3N1pl2j2QN4m3K7Kl5O2k4m2K0M0n4J1M9n0NJ9rpL6k9l8
$$ -6 -30 1 -29 18 22 8 -24 -37 14 7 -25 -37 -29 25 -18 9 11 -24 38 14 -28 -8 32 -22 -11 38 -12 -7 12 3 -4 32 3 -35
5673c5M5Mk4J1j0lJ4l6O1n1K1jjn0JK4%MR7m7p7N2N1l3m7M6lj0jo4P1K5l5N1k9
$$ -35 10 14 -10 1 -9 -12 2 -34 27 -24 -3 -4 -5 -55 -54 -30 -30 -26 71 24 -53 -1 50 17 -30 16 13 3 2 -62 9 34 -1 50 21
5708B1J7l7m4J7K7l7K1M6m7qJ9k8L4k6L4l4j5K3QL1K4k9jJ%j3n9P0k3K0l1N3o7
$$ 21 38 1 -43 -26 1 -36 -15 31 -16 -24 -5 -33 1 -25 9 -25 -40 -17 -9 22 46 17 16 17 17 4 -55 15 -8 12 -19 34 -33
5741c3N1k7k2K3KKj4j3l7P3m0L4l3J3N3k4pP0n4k8j7k0j8J3L1K7j6M5k1L1p0M8
$$ -33 18 -9 -31 -8 -6 -4 -18 -31 -68 5 -35 -1 -34 -21 32 8 1 71 17 -11 -28 -48 -66 -53 -22 5 -11 34 13 44 -26 22
5773B2j00O1lj4O0o5J0n4P3pQ4l6j5j6L5m0pL6j3j4m4J8J3N3k2n5P1l0j6M%Rl5
$$ 22 -78 -17 -20 -34 26 -39 -29 -83 -10 -17 67 31 16 0 35 -5 -12 24 11 -3 -47 -29 -16 37 15 -40 31 1 -15 -11 -11 -2 -37
5806c7o1P2qJ7LjN6m7mk1L5n2N5j0J0j7ml3O3k6N9o8K4L3r1L5pQJ5k6k7N9qNJ0
$$ -37 -98 -26 -34 -17 -14 -15 41 -6 -10 -31 4 -48 7 -3 7 -10 -14 -47 16 -10 49 -19 5 38 -53 -18 -25 -17 -2 -28 -55 4 -4 1 11
5841A1k6K3L9j03L0K0k3K2oK6k9M2l6l1JN2pJ8oL1k1l9l8M5j8L1L0o2L8qk2NO4
$$ 11 -15 8 47 -56 -26 -6 -29 -7 -13 13 -16 26 -10 -41 -40 12 5 23 17 48 27 -12 -50 -5 -23 8 38 -24 14 6 -16 -11 53
5874E3n3JJ0m9M9M3q6j7LO0K4J0p5J5K1j2NL4n7LL0k3K2m9Nj7N9l2K5n5L5O8n7
$$ 53 0 1 11 -38 11 54 -32 -49 -46 14 38 48 -27 -12 9 -3 2 36 -21 -18 12 -11 11 -38 -33 -50 9 -23 2 -53 -18 50 -7
5907gj3%K1M5n0K0l3J1J6p2J13r3M1nj6K3k8LP4p7M7j9k5L2J1o8N8k1qj7L6%r
$$ -7 -20 -20 1 46 -4 16 -17 -6 10 -62 51 -42 -1 -6 -22 1 -27 -24 50 -27 20 1 -24 8 19 -49 9 -12 -20 -37 -1 -1 -10
5940a0M4n7k7Q0Mm8J2Nl4ML4J0k0L3L0o8L0p7P4m6KL5k9J2Qqj7J3lN0K5m6J9k1
$$ -10 34 -23 -50 30 34 -14 -2 3 -31 -27 7 17 -3 30 60 -8 22 -55 19 -27 -25 10 -19 -7 1 -7 -24 -11 -14 36 61 15 34 13
5974A3ponK0k9L0m4qL3j4L0J5k8N6o6l3N0m1Q8Mq6J5mJ2J6l0M8l8rM2j7l1M5l3
$$ 13 6 0 -5 15 -14 16 -28 -36 -3 -17 13 28 0 56 -10 -43 7 -34 54 58 -28 -13 -17 -5 11 -19 29 -9 -18 24 7 -24 21 -12
6008a2K4l7rlM3Jp1N2RkK2Mn8L6k0J8j8l1M4J7Kk2K4j8k8JJ8K5mm1O6k8k7l8Q1
$$ -12 12 -25 -34 -37 6 7 -64 -12 -3 -5 17 21 -37 -1 -21 -3 -21 -52 -8 9 11 -11 13 -5 -33 -32 -14 11 7 -34 32 4 -23 -61 20
6043B0k5M0q9N6j3j3J8K2k9L0k9L5k3nrk1O5j5O7j05k4O3k5j1M7n8N3k6k3j4N6
$$ 20 -5 35 -54 2 -11 -24 -6 16 -13 17 -12 23 0 -5 -14 -35 30 15 82 -23 -47 16 -9 -20 27 -31 22 -4 -27 -41 15
6074A5k1qk1Pl2M8%J3L6o6LN1l3ML6m6K2PJ1j3Nlk7J3j6rM2ojk3K1l3J3jRj1K0
$$ 15 -6 -14 -35 -28 -60 -12 -12 1 37 -29 -26 25 -8 -4 32 -14 8 15 26 13 18 15 -12 1 -15 -24 18 12 11 -12 9 -24 -11 -12 -3 -14 6
6111FL1k%m9NnRL6Qokk6LqM2j1l4J4n0K9k9NM5Nj9j7N6n2nL9Mm2kK4Olk7o6N6
$$ 6 37 35 35 -14 -9 -14 -5 31 39 33 31 5 8 0 42 31 -3 11 -39 -10 -39 -34 11 16 -3 -20 36 -16 -21 18 22 -20 -22 2 8 5 -22 -88 -32
6150c2L7J2n8L3L2j6K2j4Lk2rK0mJ2m6OK6j3L0n3P2j11Q4J3k6%j5J5m4N2k1Rp
$$ -32 5 17 -41 -8 24 8 30 16 19 -3 -12 8 4 16 -30 -24 2 -11 19 -34 38 -73 11 24 -2 -2 -17 -2 -46 6 -15 -6 -13
6183a3K6l3L7jJ1K1m7j9P7o0K0Qn6M4j0K2j9rl3M4k0m5J4R5q8N3m2QqK9J4kq6
$$ -13 13 -20 17 16 27 48 1 -18 59 -1 19 27 -29 15 5 27 8 -1 -34 10 -10 -55 -41 54 -34 19 -23 -15 -23 6 20 18 -68
6216f8Q1Ml1L8Pp8J5O1k3k0j3J9M0k1l1rK6M2p0l0J1O0k9OOM1j3k6L4m8NL2n5
$$ -68 13 17 -14 24 31 -47 -32 29 6 -14 -27 -8 32 11 -20 -29 -3 39 -31 -61 -50 10 -19 -13 -7 34 21 -5 29 -19 -14 18 -37
6249c7K9rO1m3jOO9p6J8K8l9Pj9K5k2j6O2k8k8k3K7K8l5K2J0j5L1K0l9j7rK6m4
$$ -37 -8 -17 44 1 0 6 75 -1 17 45 6 13 -6 19 -3 -19 43 15 -13 -36 -9 19 -16 6 16 1 32 52 13 -4 -13 13 -31
6282c1K5L2p8RQ%M3j3k1M2k6Q2q4lrj6Mj9J7K4pN5kL7j07R6k5p3O4l9N3n4N4o7
$$ -31 -6 26 -52 -43 -35 -35 8 -5 -26 16 -10 72 -12 -15 -24 -40 -36 -55 -38 -14 -21 34 32 69 -38 58 33 -40 24 -15 38 -16 38 -29
6316b9L8j1J5K2p4P1J9m8J4Npl9j6L6k4K0QJ0jl5J6K3%Ml6L0k4J6K6n5K8l2N8
$$ -29 9 -2 13 35 -39 32 51 3 17 22 15 -24 -40 -4 -28 -8 0 10 9 -26 -10 13 13 17 -19 11 -13 3 29 -26 2 -30 28
6349B8p5O7jo1L3l3L6j1M7j21N3pO7r0M6MJ6n3N5Kj0PJL6m9nQPl4L3k6P1Pk2n1
$$ 28 -47 20 19 -42 -9 -42 -6 -17 30 -91 -38 -45 22 -68 -22 -18 -2 -55 0 2 -8 -1 0 36 -13 -18 -10 -3 -37 -4 -30 41 48 26 -25
6384b5P3o3n9K3K8M2k5k5K5rM9n8L4J7k7mN1n8J2k1L7k7QJ9l5K5rK1K5n6lK8j5
$$ -25 48 -15 -74 -51 -23 19 -6 -31 -6 -15 34 -24 10 27 0 -4 47 -11 1 -20 17 -10 -2 17 -18 7 -2 19 44 -12 -15 13 -2
6417bk8M1j9N3q0J4L1M5j01Q9o3LL8n3ppOM6m9N0mj6J9l8N9o6N2rOo1J13n8ML
$$ -2 -30 11 -8 45 -35 -21 10 55 -46 43 -20 -17 21 -32 -39 -46 -40 6 -43 7 3 -13 6 -32 27 -39 13 4 10 -51 62 4 8 11
6451A1j5J5K8n9L0J6k3J6rrk7K5j2m9N0k3j3M0J4Jpk2L0l1oL7l1kJ0j1qN3kl3
$$ 11 -4 11 39 -20 10 26 3 19 10 1 -26 -1 -13 -62 -12 -35 -48 -8 6 7 0 -22 8 -23 -29 8 -23 -25 -15 -26 -34 19 17 -16
6485a6J5qL5j8j3K9m4J9n8N1Jj2Jj2J6mL3Pj6o9Q2l6J7Nl9M1k3K4k9N0K3j3k9
$$ -16 -1 -9 26 8 -5 24 -20 -1 -59 -8 -7 -19 -18 -30 -14 -18 15 22 6 -63 19 -17 0 5 -34 7 -16 8 -21 29 52 39 10
6518A0j5L5k3j9n4Q7j8p9O3qJ7j5n3Q1Oj7lK2J9n1K4J2l4JL0j7MJ2L2o0J4K8j5
$$ 10 -5 30 7 -12 -66 21 3 -76 -13 -21 -4 -19 -72 9 15 -2 -5 17 36 -15 9 21 -13 -12 18 1 5 17 49 -11 3 31 16
6551A6j0J2m2Q0o0l4L1O8n9m5O8Ol4J8K3jo2OL0K5jj2mn9O5l0OL3o2N4j8O7j25
$$ 16 6 18 -24 56 -4 -38 -7 61 2 -43 25 31 -3 15 38 37 -25 -19 11 36 35 23 19 -40 25 -5 1 34 -28 26 8 75 -50
6584e0L6k1PN7On2mM1o4O5l1J4J2p4N3L6k8rN4l3k7L1j5K2rNk7K5j2n6O5m9kj
$$ -50 -14 -35 -28 29 35 -17 -21 20 -44 21 -10 4 16 -58 -5 31 3 -6 48 15 -12 19 4 26 17 22 -5 20 8 -48 17 -32 -34 -35
6618c5L7L7m2jKk1K4l0P0n6k0K7nK1j7m0O3kl0N5p6L8j3J0J2n1QM9Qmk7J2oM3
$$ -35 2 39 -3 -4 -2 -23 1 -29 41 -15 -35 -8 -13 8 -9 -49 14 12 -18 37 -39 -1 -14 -4 8 -43 -35 14 22 18 -9 3 -3 40
6652D0rL8j08J7J0J9l1m6O4rj9K6kL0nk7k0N4N6j10kK6K5k5M1q1L9k8N1l7M4P4
$$ 40 31 69 -39 -22 -12 7 -24 -70 -6 -15 -34 -8 -10 20 15 -12 -32 22 78 -32 -34 -8 17 -8 33 -48 -9 -37 14 -23 21 95
6684I5n8n6K4k8M4rk0K9j6JOj9m6P9J3k3lk7rN1k4j5k4N0qPK2rl9K5%j3k7j2m
$$ 95 37 -19 5 -23 21 12 -8 21 5 6 12 -7 -53 26 39 16 13 -14 -23 28 4 -11 -35 15 7 14 36 27 -12 13 13 0 -27 -39 -43
6719d3nM8l1j3L1O6p8M8p2K0RK3k6j4J6j1K8pJ8L9m2N8J1n4k9J1Mj4pmLMj3PQ
$$ -43 -48 0 -31 -44 -13 53 -25 23 -49 -29 -20 3 -23 -37 -21 -32 -4 -11 7 46 4 62 73 19 -10 1 5 -9 -16 -20 -17 -13 -26 -19 -11
6754a1j1rL4k9j0N8m4M7rq4Q9l7K0ml0K9L5o0N6p9N9Qoo7R8k7r9J15p9J16q5N3
$$ -11 -22 -31 3 -26 -36 22 -22 25 16 -68 21 -16 4 0 -30 -1 34 -26 30 -49 10 18 12 -55 43 16 -83 32 -47 69 -16 37
6786C7%m3K2K2n5k7M0K1p5Q7k5m4K9J2k9ML7l7MQ8p6l8N9ro2L4j0j3N3J4K3l1
$$ 37 37 -6 16 38 -17 -44 -4 17 -58 29 4 -40 -11 1 -28 -24 13 -24 -20 68 -8 -46 13 4 -58 -24 -34 -47 6 20 43 12
6818A2l4P3j8m4N7j20M7Mk5N6L5r4O8m8J8P4o1kJ5mk2J5nn7N3%m9QN1j0J2K5n7
$$ 12 -22 51 33 -11 46 -74 -27 -23 -48 8 43 -51 17 -31 -13 61 0 -2 13 9 -13 2 -3 -60 -7 -7 -56 -48 3 -7 5 30 -27
6851b7J9l5N9k4m0N9l1K1k0L3j9O7m0j0J1L8n6L3Mp8OL5QJJ1k2N5k7Jk3n4N5K9
$$ -27 -8 -43 16 -8 -48 11 -20 1 -19 14 -5 62 22 12 23 61 5 38 42 -36 -30 5 13 14 25 3 58 31 32 9 -45 10 39
6884C9p2M7m3J7j0P8q8N4j3J8l8Q3o3J2L0q1M0o7P0K3n5M8j6l0m1L2Q6p2jO1n7
$$ 39 -33 14 -29 -12 -22 56 -32 22 9 27 -11 72 9 21 51 -30 10 -57 13 36 -19 29 13 -17 -58 -26 60 -12 -13 48 -9
6915im0K3J7rM3JJ2n6L3l1pJO%K4m0k5Q1k7Pm0K9J4k2K5np7O8K2k1k0Ml0M7l5
$$ -9 -49 -26 -9 -18 25 26 38 -18 15 -16 -23 -22 -16 -16 8 -32 -57 24 -3 4 -36 -7 7 -15 10 5 -72 -4 18 -3 -23 -19 -49 -2 -37
6950c7J1J8N3j4qm3L5L0m2jl8L6l4O2l5l9M3J1MK0n4K9K1p9M2l1L3m0RLmL7qk6
$$ -37 -26 -8 45 31 23 -20 15 45 3 2 -36 0 -34 28 -7 -46 -3 8 12 32 -22 7 28 -51 -9 -40 -7 -47 -38 -35 -39 -2 -10 -36
6984c6J8O1m6N1o2L6m2m8O3M6m2l5M6j3n6K8NN5p8R3k9n0O4p7J5K9n5L8J6J8l8
$$ -36 -18 43 -3 48 -14 22 -20 -68 -5 41 -1 -36 10 -3 -59 -31 -26 29 -49 44 15 -35 29 -48 -33 -4 -59 -21 -5 13 -25
7015b5L3k2k3jN3j9j4rJ3M9J2l8m7J4K5Pj2j0RkPl3L3Ml6M9k3L7o8O6l8J3k8N6
$$ -25 8 -14 -37 -38 15 -4 -18 -27 -14 35 47 9 -38 -24 1 8 -4 -14 -5 -7 0 -33 0 4 -32 17 -6 31 -37 29 -9 4 -24 32
7049C2m2k9Q6n9K9J5n6NM1n6L2k1N9l6l7P7p2pkL3k9K8Jl9Q3p6nQ2q6P1n5j2M1
$$ 32 -10 -39 47 -12 17 32 -24 -19 22 -34 -2 -23 36 0 -37 40 -32 -39 -41 -8 -37 -9 -8 -47 36 -40 -45 37 -49 22 -33 -45 -4
7082do2K6JO1J4k8m2L3L5l0l4P8ok5n4Ql5K2J3L2m0O3l8M1l5ML1k0j0jl5j8N4
$$ -4 -66 -40 -39 22 36 8 -34 -1 34 4 -30 48 42 17 -37 -29 -64 -42 -29 3 -37 26 -12 29 -6 -2 29 9 -1 -2 -37 -55 -1
7115aM7p6%O2k5m7K0N%K4k7J6k5O3m2l9O9m1LJOk5J0K6l0L3l3kL4Rl9Pj7k1O3
$$ -1 46 -30 -30 32 7 -40 -20 -15 -15 9 -18 -2 -27 36 -6 -45 24 -17 -14 -13 -7 -32 -22 4 -26 7 -26 -28 6 15 -24 -17 -34 -55 8
7150Hk4K5lm7K2J8l7j0K3k1K4N8n2L0q2P5%l0N3k3rK4K1o0n0K5K3KK7l4j6JL3
$$ 8 -16 9 6 -41 -19 -1 -38 -48 -25 -46 -22 36 -16 14 -68 7 7 -23 30 7 -2 22 43 -17 -67 -42 -19 -17 10 -24 -40 -39 -6
7183fk7J3OJ7j0%mnJ6L9l4K9j1l6j8M5nJqJ4p3kK5M0nK3q8O6L0q6M6Qk5O8J4r1
$$ -6 -33 -20 -14 3 -7 -7 -11 -16 0 39 5 34 23 -13 -31 14 9 10 2 16 -57 -59 -34 6 1 24 -64 2 32 -54 -8 0 -25 43 57 -34
7219c4J8J8L5k4Pm5L1l5M3L6k2m3m5N6L5l4nk9l9P1mj2K3n3O2l5L8j7l6L%M0k9
$$ -34 -16 2 37 13 20 -25 6 -29 14 50 28 -15 -60 -4 31 -3 -8 -37 -76 -5 -9 -21 2 -51 11 -24 14 -3 -39 -36 -36 4 -25
7252b5L8k7K9nlmk4j4K7KLn2L3PK0k6QpM5k4J1m0kPqk3K6L3J4k5J9o0L2l1K8J2
$$ -25 13 -14 15 10 7 3 -21 -35 -8 -6 -3 -55 -22 -15 5 -21 -13 -20 25 1 12 -28 -30 -23 -31 -54 -28 5 19 -6 13 -47 -15 -46 -18 -6
7288fk7OM8o7M1j8J7L7J4o4L7j8K0m5NK8j0l6N2J4p4P8n1k2K1M2n3%M2k9pL9K3
$$ -6 -33 -27 21 -46 -5 -23 -6 31 45 -19 18 0 20 -25 -20 8 -2 -38 14 28 -46 32 -19 -41 -20 22 -31 -31 11 -18 -25 14 37
7321C7o4J4j1OJ6k6J3N0m7K9j6j2J8k5Kj4k6N8J6j3o7P5M3n6l0L1kj5J6N5o2K4
$$ 37 -27 -13 -24 -18 -2 -28 -15 35 -12 17 1 -11 7 -18 -16 -30 -56 2 18 5 -62 13 56 0 -30 1 -1 -16 0 55 -7 17
7353A7k6j4k2N0o2O9m9N1L4p8L5K9l5KOj5j6l4N6l2N7o4J5L2Nl7N2l8M5j4k9M9
$$ 17 -9 -23 -45 5 -57 12 -37 14 48 -30 5 34 -1 1 7 -8 -24 -58 -2 -34 23 -41 -26 6 11 -26 26 -12 33 19 -10 39
7385C9nl7p1N8k3M7%K0l8l5N2l7Qj9O1nk4k5M9l6K9k6L3l2k8M9K3o9J8J9J2Mk6
$$ 39 34 -3 -74 -16 -39 8 8 28 -10 -45 7 -30 -22 -41 20 15 -9 -34 15 -21 8 -18 15 -17 -45 4 27 -42 -24 -5 7 11 -15
7418a5K4k0J8k5L6j9j3oJ5mk5k0K8L1k4L3J1l7K4L6q7j0P2l6N2k0k6M0l3NrK7
$$ -15 9 -11 7 -18 18 -1 -14 -20 -5 -9 -34 -54 -26 5 -19 14 25 -12 12 48 -39 -49 23 -13 39 19 -7 33 0 5 -4 23
7450B3l1K0JJ7l9nmJ7l9LL5m9O4o7M6J9nN3j5o8J8K6m6l8N6m5L0j5K9k9O7Qnp3
$$ 23 -8 12 13 30 -9 -14 -18 -1 -40 -37 -2 -51 13 -54 -8 11 6 59 44 -24 -6 20 -26 -64 -8 -53 -23 -38 -9 -38 29 37 32 -41
7484d1lR8o3J4l1L6l8J0RL0o4N9n7P7k5MrL4q8NL0L7l7J1nQJNrL4J7l0koJ7p6
$$ -41 -44 54 -9 5 -26 10 -28 -18 -9 21 -43 16 -41 36 11 15 6 40 -48 -43 -13 24 -13 -2 -7 1 2 7 -2 32 49 19 17 11 28 -48
7520d8P1on2K7jl2K3J6MMl5K4ok6L1K4o3O4l8j0Pk2L8L6p9K1jNl5L6K7j5J2l5
$$ -48 23 17 -35 -8 -9 -41 -18 -2 2 6 -29 -5 -11 -37 -6 18 -45 19 -19 -29 -22 -44 -6 30 -49 -28 -29 -24 -59 -23 4 -11 1 -34
7554c4O1j5K5p1Mk0M9kRk5MKl8M3PL8n4J3j9J7l7P7k2k2o4J1P2ll0M7o4L8o6N9
$$ -34 27 12 37 -34 -30 -50 -1 -3 6 -19 -15 -13 -51 -8 -1 37 -17 -4 -23 -6 -43 34 12 -10 -74 -63 9 6 -24 23 -41 -3 -69 -10
7588a0k7P6r2N3K4j8m2J7J3PK7n2%Q1r0J3L2m0J3j5L0J5pl0L2pOJ0o8N7j7qrm2
$$ -10 -37 39 -53 0 24 6 -36 -19 -6 1 28 -24 -24 57 -33 -20 12 -28 -15 -30 0 15 8 -22 10 3 9 19 -49 8 -9 -17 -26 -68
7622f8J20o5O3n4J1m3M2o5J9j0L6K0m0N4l8QooM9J6m3k3J8K7o7R2l2On1M5K5p
$$ -68 52 -13 50 -4 7 -36 6 -59 -40 -50 -14 6 -34 20 -18 -10 -16 -22 27 43 0 -23 -5 22 -45 47 15 21 -30 15 40 33
7654C3l1j5l0M2N1p4kJ5j2lP0m4L7l0m4N3J2o6JN8m7L6l8%L0Ll4N6m6pM1n4K7
$$ 33 2 -13 -43 -1 50 -24 -26 -11 -23 -26 44 0 37 7 -37 16 28 -38 -37 21 -26 10 -28 -28 2 5 -29 27 -19 -26 15 -39 -12
7687a2K7m6L0K7k9pQq6Q9J9m8j0O0k3L2No1J5l2L2J9Oml7K7jk7L6Pm4k0PpjN5
$$ -12 15 -31 -1 26 -3 -10 -2 -88 1 20 -28 -38 22 -1 31 36 -25 -10 -42 -10 9 15 11 -26 1 0 -27 9 16 -28 -48 -41 -48 -49 6
7722FJlj1M3m1J4m5m0M8N8j2m6J4N4l7j6O0n5J8O3q7L4l5j0j1j6qlO8n3M4J2l2
$$ 6 7 4 -7 36 -5 9 -36 -76 -28 30 18 -28 -14 40 3 -13 47 -8 10 73 -14 20 -15 -25 -36 -52 -60 -63 5 -48 -4 8 -24
7755b4J9Lj3Ql4M2j7jK4n7OM0N2r1P7l4k1Nj2M5l8M2p7N8k6L9o7K9j9K0K8Pl3
$$ -24 -5 -2 -15 -7 -41 1 -16 -17 7 -50 -44 -4 48 -43 34 0 -21 -16 -28 17 -21 21 -56 2 -24 15 -52 -23 -42 -22 6 13 -20
7788b0L9q1M3J6j6lL1n4J15q6pK0rj4J6rlOM9q8N4p8M5J1J1L1m5lQ1k1r8N6j0
$$ -20 19 -62 -19 -3 -19 -22 9 -45 70 -16 -23 -3 -12 -26 -10 -19 -22 -16 33 -55 -1 -79 -34 -23 -12 19 -26 -29 52 31 -67 -11 -21
7821b1j5rL1j0N1p5LQ2k5rk2N6m0K1mL7k4l1m7M7K9l1N7l7n6L1L1lr6O1JN0n2
$$ -21 -36 -45 -14 -24 27 -48 -45 37 12 3 -19 37 -3 18 14 51 27 -4 -51 -4 25 -6 51 14 -42 -11 20 17 -79 -18 -17 33 -19
7854a9MM8l4k5M3j9LJ9j9m0L8j2K2l4QJ6K1m4%lk8P5n3L9k1J6NJj5pj4J3n7P5
$$ -19 -15 33 -1 -26 17 -2 1 20 1 -39 -1 -13 9 -25 -17 -1 20 -24 -24 -27 -55 20 -33 6 -15 1 6 7 -8 -15 -29 -16 -73 2
7888Bj3k3K6l7N2L9p5J4rL4rJ2m8Q3j0Jj9n5K5k4L4J9k8J7Rj9%J9p5J08o9L5j1
$$ 2 -11 -34 -8 -45 7 46 -29 -15 -24 10 1 13 -35 48 38 39 20 -35 -10 -34 0 19 -9 8 17 -2 -2 17 -58 50 -19 16 5
7921Ej0pn6L5J7L8k0J0l7J8J3K4J9m6m9L0L0l4QJ6M4m0m3M2m0O9j4K0j12N1M3
$$ 5 -5 -12 -68 -33 -16 22 2 12 -25 -7 6 30 49 3 -46 -16 14 -20 -12 4 48 8 -35 7 -33 36 22 42 -70 -19 24
7952B4L2l2No0J2jJ8k5K2M1o1O0l2K9o1J4J6Qk8KK9loJ1j7MJ8l3L0l7J9Nm5L3
$$ 24 56 24 29 -31 -19 -20 -2 -27 -5 36 -25 35 3 32 -29 -15 1 9 -19 -17 12 9 3 14 -3 1 19 -14 16 -21 -2 3 -42 -9
7986iL7k8jNL7n5j4kj9P1M2m7l1J5m9k9P5m7L6L5j1Nk4J6j8MJ5%k9O0j2m1m0O1
$$ -9 28 0 -1 4 41 -14 -28 -30 -49 22 64 17 -14 1 -48 -77 -2 -49 -13 22 11 16 -8 8 -10 -6 9 9 -20 40 28 -13 -53 8
8020Hj4K4j6j3L5lqJ1m3JJ18n9j9j8j6j6N7j4m0LM8k3Kl3L9k3K8m3j5P3k7j4j1
$$ 8 -6 18 2 -11 24 21 13 24 -19 -18 100 41 22 4 -12 -28 29 15 -25 -22 26 3 5 -28 11 -12 16 -27 -42 31 4 -10 -21
8053b1KK9Mj9ORL6p0j8K4J1NM2j0m7K1j6nN3m8J5K1l1rooMN5k4Ml5K3j7J6J3k
$$ -21 -19 10 14 -5 1 10 46 -24 -42 -18 -7 -2 40 30 -17 4 -12 -17 36 -12 3 24 -7 -16 -22 -28 -24 31 7 11 -24 -1 -18 -2 11 9
8089IK5nk8o5P7J0j1k9j8PPJ3N7r8J6M1J2k1J9k8Ml9pL8rK0KK4o2L3k4O5Pj9%
$$ 9 34 29 1 -64 13 23 12 -17 -35 -28 -21 -8 49 -49 -33 8 20 -1 18 -10 -6 -45 -52 -14 -23 -3 -1 23 -39 -6 -30 35 42 23 23
8124B3m3JRk6K0pj0j0M9k1K5m9l7P3L3K6o0K7l9M4Qm2J3K7%m5%J8Np5L7%%nM5
$$ 23 -20 -19 -10 -36 -16 -23 -33 -43 6 -15 10 -39 -76 -3 30 56 -4 23 -16 28 36 -6 7 34 34 -11 -11 7 12 -63 -26 -26 -26 -31 14
8159A4q0K5M0RM6l8L0o3J5l7M3k1K5l3J9n3K6L2L4p6J1J6j7K6L6m1K7l5m6J61
$$ 14 -66 -41 -1 8 54 16 46 -17 -2 -39 4 -17 8 -25 -6 -59 -33 -1 33 -43 -32 -16 -33 -7 29 -12 15 -20 -66 95
8189I5q6l5
$$ 95 9 -26
8191b6
$$ Imaginary data points
##PAGE= N=2
##DATA TABLE= (X++(I..I)), XYDATA
0@%%%%%%%%%%qJ6j6J7k5L2m0M9n7P2q8J05j23J46j71J98k31K70l15L62m13M71
$$ 0 0 0 0 0 0 0 0 0 0 0 -8 8 -8 9 -16 16 -24 25 -32 40 -48 57 -66 80 -91 107 -124 146 -169 193 -220 251
32B51n36O06o85P71q64R70j088J217j354J502j668J851k047K262k498K755l037
$$ 251 -285 321 -364 407 -457 513 -575 642 -712 790 -878 973 -1074 1188 -1310 1445 -1592
49a592L347l688M062m477M936n449O031o690P443q314R336j0557J2043j3897J6291
$$ -1592 1755 -1933 2129 -2348 2588 -2861 3170 -3520 3923 -4391 4945 -5612 6431 -7466 8825
64H825j9512K4103l1217M3818p2704K57341N9067m36894K04415J86415j53396
$$ 8825 -10687 13416 -17801 26017 -46687 210654 269721 -167173 37242 223657 70261
75G0261j70617L7722o9174K0995J27449n4370j64805J34665J72118p8036q6074
$$ 70261 -100356 -62634 -131808 -110813 16636 -37734 -202539 -67874 104244 26208 -59866
86e9866Q5682P766m0457L1720k2766r2586O9930J03458q3582p3959J43446J06313
$$ -59866 25816 33582 -6875 24845 2079 -90507 -20577 82881 -701 -74660 68786 175099
98A75099r8990r4659P0075Q5502n6730j50431n5092Q0289L6580r7642o7853N5302
$$ 175099 76109 -18550 51525 137027 80297 -70134 -125226 -44937 -8357 -105999 -173852 -118550
110a18550P9158M1010J6938j9952Q16Q7024O2944o7022q1434J1922L6789o581
$$ -118550 -39392 1618 18556 -1396 -580 86444 149388 82366 932 12854 49643 43062
122D3062m4125n7561J331P6375K1099o7549o138O6298l927n0134Q381R888m2609
$$ 43062 -1063 -58624 -57293 19082 40181 -27368 -33506 32792 28865 -21269 -12888 -3000 -45609
135d5609k2599J5093R516J1717O367p270M2221P4612l091m0399K8176K4990m1398
$$ -45609 -68208 -53115 -43599 -31882 -25515 -32785 9436 84048 80957 40558 68734 93724 52326
148E2326j8013j973o7344l8712N3376k396p5809J5932P2111p749p708N3204k355
$$ 52326 34313 32340 -35004 -73716 -20340 -22736 -98545 -82613 -10502 -18251 -25959 27245 24890
161B4890l9366M0275L0196o2411k2466M3193j8216k8625N2857J7177n6489K1257
$$ 24890 -14476 25799 55995 -6416 -28882 14311 -3905 -32530 20327 37504 -18985 2272
173B272P6761j8960n4107J5191L608l7765J677l071o4696j5874O6929J4468m5787
$$ 2272 79033 60073 5966 21157 24765 -13000 -11323 -14394 -79090 -94964 -28035 -13567 -59354
186e9354J3753N7388K1907Q193Q153j7141k928K8093j2090n2610j3710J6085p290
$$ -59354 -45601 11787 33694 41887 50040 32899 29971 58064 45974 -6636 -20346 -4261 -11551
199a1551r905L453n404Q681L3371M09l0304R447K7737k1854l5066O185J1416j0134
$$ -11551 -21456 -18003 -23407 -14726 18645 19054 -11250 -1803 25934 4080 -30986 -24801 -13385 -23519
213b3519l918L477O724L0830K6821j8806j3436L8160K2486l8691l5005M606K826
$$ -23519 -27437 -23960 -17236 13594 40415 21609 8173 46333 68819 30128 -4877 -271 2555
226B555j2766j4762k2399q995L4236L1913k1110k2657L4852M4796r188l5787o541
$$ 2555 -10211 -24973 -47372 -56367 -22131 9782 -11328 -33985 867 45663 36475 688 -5853
239e853J9319P886j7106k5239p322K1779K5068r159k6729J3168M4520J440m3547
$$ -5853 13466 21352 4246 -20993 -28315 -6536 18532 9373 -17356 -4188 40332 41772 -1775
252a775j1152K6589j923l1040j3484Q35L274J7417O329k1636Q799N2033J0321
$$ -1775 -12927 13662 11739 -19301 -32785 -31950 -28676 -11259 -4930 -26566 -17767 34266 44587
265D4587l9328k98L4215o325k8741o414r331j0358J9914M330l8853J04N6964J0112
$$ 44587 5259 4961 39176 32851 4110 -2304 -11635 -21993 -2079 2251 -36602 -36498 20466 30578
279C0578m5590Q1M1972R79k9808r300J095o86N955n238j7222R723L0446N367j3312
$$ 30578 -15012 -14931 27041 28020 -1788 -11088 -9993 -10679 -4724 -9962 -27184 -17461 12985 18352 5040
294E040L228J3699N549l214j5281j9080J445J1783j2305k5998L90K5852J4760
$$ 5040 8268 21967 27516 24302 9021 -10059 -8614 3169 -9136 -35134 -34744 -8892 5868
307E868j0877r984J9391K7919p215k6922K907J8009j2295k1822M259M784j0447
$$ 5868 -5009 -14993 4398 32317 25102 -1820 1087 19096 6801 -15021 -10762 -5978 -16425
320a6425N467J6348n889n658K1742J1386j9073p434J2123m743j7343m813k074
$$ -16425 -10958 5390 -499 -6157 15585 26971 7898 464 12587 7844 -9499 -14312 -16386
333a6386k426R503J908j2512J2533L1660m619k3186J5724K2150k0406k0546R902
$$ -16386 -18812 -9309 -7401 -19913 -7380 24280 19661 -3525 12199 34349 13943 -6603 3299
346C299k520j9253M493R474j3924j168K3836N554j0456P896R337p472j318J328
$$ 3299 779 -18474 -13981 -4507 -18431 -19599 4237 9791 -665 7231 16568 9096 7778 9106
360I106j5466o914J1662n604j4956J3527J5307j1471J307K4350J13j7213O700
$$ 9106 -6360 -13274 -1612 -7216 -22172 -8645 6662 -4809 -3502 20848 20961 3748 10448
373A0448Q649j5812j0676K548r311p639J0918K754r251R043J7685J86k236O728
$$ 10448 19097 3285 -7391 -4843 -14154 -21793 -10875 -8121 -17372 -8329 9356 9542 7306 14034
387A4034m45m116K283o856j4465P26O095q560n534J1495Q970k074J405Q089L965
$$ 14034 13589 9473 11756 4900 -9565 -8839 -2744 -11304 -16838 -5343 3627 1553 2958 11047 15012
402A5012m552p512j892L10p979q325K710P63m885Q849J3876n045k902J9366Q289
$$ 15012 10460 2948 1056 1366 -6613 -14938 -12228 -11465 -16350 -7501 6375 1330 -1572 17794 26083
417B6083j6168n958O705n563q543l569j0543n94J6832k856j5441J8042K2210j6604
$$ 26083 9915 3957 10662 5099 -3444 -7013 -17556 -18150 -1318 -4174 -19615 -1573 20637 4033
431D033p226K4524m627k7183J0483J2704k7160r210K5038l497j7226J8107J4469
$$ 4033 -3193 21331 16704 -10479 4 12708 -14452 -23662 1376 -2121 -19347 -1240 13229
444A3229j1925P175J3047j6643k963J8455j9572k7376K3737J2159l7027j286L9588
$$ 13229 1304 8479 21526 4883 1920 20375 803 -26573 -2836 9323 -27704 -28990 10598
457A0598o268k3608K5768J9493k2459n52K0146j4120j7685J0793k990j6296P950
$$ 10598 4330 -19278 6490 25983 3524 2972 23118 8998 -8687 2106 -884 -17180 -9230
470i230N635j2838J0945K0168j3936p669K6928K410k8314L187J8400j7020j8813
$$ -9230 -3595 -16433 -5488 14680 744 -6925 20003 22413 -5901 -2714 15686 -1334 -20147
483b0147J1806N299j0865L272J0182J259N188N823l920J892N994j0647j0481P235
$$ -20147 -8341 -3042 -13907 -10635 -453 806 5994 11817 7897 9789 15783 5136 -5345 1890
497A890j882j6779J377J3408m033o308J1499J0594j713j721K290K055j291r128
$$ 1890 8 -16771 -15394 -1986 -6019 -12327 -828 9766 8053 6332 8622 10677 9386 258
511B58p928M297K20j2063P71J3548j304n054J2573P962p743J661O666q354o058
$$ 258 -7670 -3373 -3153 -15216 -14445 -897 -2201 -7255 5318 13280 5537 7198 13864 5510 -548
526e48L525p957p783R109p53j1945J1841J5908j2709l810K2327j412k1288P998
$$ -548 2977 -4980 -12763 -3654 -4407 -16352 -4511 11397 -1312 -5122 17205 15793 -5495 2503
540B503J1035k0380q683J6222n549j4355J4629J0341j2479O101J7487q787o812
$$ 2503 13538 -6842 -15525 697 -4852 -19207 -4578 5763 -6716 -615 16872 8085 1273
553A273J4831m422j8734P473O563k0128l662J8115n157j1676J5189R305j1360
$$ 1273 16104 11682 -7052 421 6984 -13144 -16806 1309 -3848 -15524 -335 8970 -2390
566b390M396J2076j0225o889J0685m451j4138N881N788j0206J782J2261l669l053
$$ -2390 2006 14082 3857 -3032 7653 3202 -10936 -5055 733 -9473 -7691 4570 901 -2152
580b152J2806J597j1059L778O154j1546p027O032l415q232M814M383l731M284
$$ -2152 10654 12251 1192 4970 11124 -422 -7449 -1417 -4832 -13064 -8250 -3867 -7598 -3314
594c314Q431j377q05O349R8n428n32j029m482o81k86l599J066M847J53K41L976
$$ -3314 5117 3740 2935 9284 9382 3954 3422 2393 -2089 -2770 -3056 -6655 -5589 -742 -589 -348 3628
611C628J25p88K845k518o989J368K336o948k224O501l66k454P542M309m434L557
$$ 3628 3753 2965 5810 3292 -3697 -2329 7 -6941 -9165 -2664 -3030 -5484 2058 6367 1933 5490
627E490O440n755m705M364l578q675K403J748p362J460Q170l191k426R756K494
$$ 5490 11930 6175 1470 5834 2256 -6419 -4016 -2268 -9630 -8170 0 -3191 -5617 4139 6633
642F633p381K969N735o469m267M250k759m716M821J607m846M278O592m058r27
$$ 6633 -748 2221 7956 1487 -2780 1470 -1289 -6005 -1184 423 -4423 -145 6447 2389 1462
657A462O509l377o871M727Q86j0981j062Q426l550o153O876N473l309K286M966
$$ 1462 7971 4594 -2277 2450 3336 -7645 -8707 -281 -3831 -9984 -3108 2365 -944 1342 6308
672F308k599m28L602m133n238L988l32p970J735O965m327l400Q391L186o630J328
$$ 6308 3709 3281 6883 2750 -2488 1500 1168 -6802 -5067 1898 -2429 -5829 2562 5748 -882 446
688D46O435l883n953K798J216m844j162K386l2L57K202M71R33L176j78l191R92
$$ 446 6881 2998 -2955 -157 1059 -3785 -4947 -2561 -2593 -2236 -34 437 1370 4546 4368 1177 2169
705B169J727m324l741K702J003m368k79N429J411l254J668N525k48m661q3L282
$$ 2169 3896 -428 -4169 -1467 -464 -4832 -5111 318 1729 -1525 143 5668 5420 759 676 3958
721C958j998n472p39K382n10j924R60K194J246J360P84j4N77K67j367r22j46k295
$$ 3958 1960 -3512 -4251 -1869 -2379 -4303 -3343 -1149 97 1457 2241 2227 2804 3071 1704 782 636 -1659
739a659j544K331J162l296K32N830Q97n065J021N578k329o626R00L975k793m582
$$ -1659 -3203 -872 290 -3006 -2774 3056 3953 -1112 -91 5487 3158 -3468 -2568 1407 -1386 -5968
755e968J355L234P95K40N61P94K638K477j510l166k5J171j164k738k785r84K799
$$ -5968 -4613 -1379 -584 -344 217 1011 3649 6126 4616 1450 1425 2596 1432 -1306 -4091 -5075 -2276
772b276K504l027k858N045N506l020m576K960M060k404m450J94L036O20k605j169
$$ -2276 228 -2799 -5657 -612 4894 1874 -2702 258 4318 1914 -2536 -2342 694 1314 -1291 -2460
788b460L447L601j253k630R25K239k86k756l926j860K488K091m656m538M643P309
$$ -2460 987 4588 3335 705 1630 3869 3583 827 -3099 -4959 -2471 -380 -5036 -9574 -4931 2378
804B378m26m690R61O547L827l915n402J594N017k358o719j02M038k76k407L68
$$ 2378 1952 -2738 -1777 4770 8597 4682 -720 874 5891 3533 -3186 -3288 750 474 -1933 -1565
820a565R26J159J649k147l555K731L468m904n227L656M705j373k416L39L266O262
$$ -1565 -639 520 2169 22 -3533 -802 2666 -2238 -7465 -3809 896 -477 -2893 -2554 712 6974
836F974J389p762k161R978K326j2110n138P054J273o258j602J398K30L281K304
$$ 6974 8363 601 -1560 8418 10744 -1366 -6504 550 1823 -4435 -6037 -4639 -4409 -1128 1176
851A176l795k00O933Q50o335j8M885j228m289j24J917J809J078k635k369N429
$$ 1176 -2619 -2819 4114 4964 -1371 -1389 3496 2268 -2021 -2145 -228 1581 2659 24 -2345 3084
867C084N327n624p659L136O655l269q595j744N897L265l260l015L141N323J925
$$ 3084 8411 2787 -4872 -1736 4919 1650 -6945 -8689 -2792 473 -2787 -5802 -2661 2662 4587
882D587r88j365J62K630R34m894m003K962J807m904k187M148J656k105j2J142
$$ 4587 3599 2234 2396 5026 5960 1066 -2937 25 1832 -3072 -5259 -1111 545 -1560 -1572 -430
898d30J137K302j635n919J193P242k437q795K071Q450q7l831J335K133J088K678
$$ -430 707 3009 1374 -4545 -3352 3890 1453 -7342 -5271 3179 3092 -739 596 2729 3817 6495
914F495j313o155j95M624k495o512J32K727o89k95J513N29J204K617J4j006J667
$$ 6495 5182 -973 -1168 3456 961 -5551 -5419 -2692 -3381 -3676 -2163 -1634 -430 2187 2201 1195 2862
931B862N89l176j673K185P22k725j934J920L565M85k747m47K931Q73k237j712
$$ 2862 3451 275 -1398 787 1509 -1216 -3150 -1230 2335 2820 73 -374 2557 3430 1193 -519
947e19j392j187J155N84l031p88M127J710j133K193K243j868J82L129j856m435
$$ -519 -1911 -3098 -1943 -1359 -4390 -5178 -1051 659 -474 1719 3962 2094 2276 5405 3549 -886
963h86L79R43k576l45J523k270p56N015J951m034j28L995k20k528np43j937J383
$$ -886 -507 436 -2140 -2485 -962 -3232 -3988 1027 2978 -1056 -1184 2811 2591 63 58 -685 -2622 -1239
981a239J452k428l34L831R05j638J912K189k369k189J579K94l202k457nO81Q24
$$ -1239 213 -2215 -2549 1282 2187 549 2461 4650 2281 92 1671 1965 -1237 -3694 -3699 -3018 -2194
998b194J25q22N42L525K593j069k012P65K163m13l234j952Q08J067l76j114k78
$$ -2194 -2069 -2891 -2349 1176 3769 2700 688 1453 3616 3203 -31 -1983 -1175 -108 -484 -1598 -1876
1015a876J598K390k85k142J032K262k448l570J635J710l245j979K612J980j85
$$ -1876 -278 2112 1827 -315 717 2979 531 -3039 -1404 306 -2939 -4918 -2306 -326 -511
1030e11R71P37P3K537K053l176l147K038J264l249k731O8L48J125J153j685q00
$$ -511 460 1197 1270 3807 5860 2684 -463 1575 2839 -410 -3141 -3073 -2725 -1600 -447 -2132 -2932
1047b932M280K480l564j807L564N79l940j055K304l69j619J011J637K31P65J048
$$ -2932 1348 3828 264 -1543 2021 2600 -1340 -2395 -91 -460 -2079 -1068 569 800 1565 2613
1063B613n40m85J046l12k802j617L92L0j071p66J3J318K697R34j666M60L852O58
$$ 2613 2073 1588 2634 2322 -480 -2097 -1705 -1675 -2746 -3512 -3499 -2181 516 1450 -216 244 4096 4754
1081D754l888j390K669k76l759m42K069n73j262J688J515j114J24J707n46j902
$$ 4754 866 -524 2145 1869 -1890 -2332 -263 -836 -2098 -410 1105 -9 115 1822 1276 -626
1097f26Q6L32j373q84M98K77N01J179K97L96K338J051k106o74K202r45m017l78
$$ -626 -540 -208 -1581 -2465 -1967 -1690 -1189 -10 287 683 3021 4072 1966 1292 3494 2549 -1468 -1846
1115a846J834j945k328J901J786j548J91L129O43j802M38J858p12k078m33P84
$$ -1846 -12 -1957 -4285 -2384 -598 -2146 -1955 1174 1817 15 453 2311 1599 -479 -912 -128
1131a28R5o26n95O95J819P04j154j07J711p6k212p57N08j296j605Q70O93j537
$$ -128 -33 -659 -1254 -559 1260 1964 810 703 2414 2338 126 -631 -123 -1419 -3024 -2154 -1461 -2998
1149b998M28L122J066j891O23L156j07k837l48J531q22k441o21J268N57p75m30
$$ -2998 -2570 552 1618 -273 350 3506 3399 562 214 1745 923 -1518 -2139 -871 -314 -1089 -1519
1166a519J221J858Pj339k7J280m10j714m72J35o14K1J471j82j331J645L152p34
$$ -1519 -298 1560 1567 228 201 1481 1071 -643 -1115 -980 -1594 -1573 -102 -284 -1615 30 3182 2448
1184B448k861P88K656j296l279l73J560l42j591q0J547J198k21k12J271J389q66
$$ 2448 -413 375 3031 1735 -1544 -1917 -357 -699 -2290 -2370 -823 375 154 -58 1213 2602 1736
1201A736j485L39N68j380j242K30jn71J015J365q79o77K166J855j849k219J165
$$ 1736 251 590 1158 -222 -1464 -1234 -1235 -1806 -791 574 -305 -982 1184 3039 1190 -1029 136
1218A36J631j391k331O2J463M15n40j33R63J204j40o82M01L27j332j188N68J9
$$ 136 1767 376 -1955 -1893 -430 -15 -555 -688 275 1479 1339 657 1058 1385 53 -1135 -567 -548
1236e48j393k54J330M47l13J200J294p40k23J518L22k112j324Q35M15j384j263
$$ -548 -1941 -2195 -865 -418 -731 469 1763 1023 800 2318 2640 528 -796 39 454 -930 -2193
1253b193K85J051N60k66k30P72Q08r9n27n2r0l81k39N92L2m80N03J245L36l81
$$ -2193 -1908 -857 -297 -563 -793 -21 787 688 161 109 19 -362 -601 -9 23 -457 46 1291 1627 1246
1273A246K35L80o28p80j19o47j514o82O71M4p62K06J240R35L76O43M46j6M82M90
$$ 1246 1481 1861 1233 453 334 -313 -1827 -2509 -1838 -1794 -2556 -2350 -1110 -175 201 844 1290 1274 1756 2246
1293B246p02r36K4J53n40k52J24l02j24P22j1j048m45O20m24j038O1L18m95L04
$$ 2246 1544 608 632 785 245 -7 117 -185 -309 413 402 -646 -1091 -471 -895 -1933 -1872 -1554 -2049 -1745
1313a745J470M69l29J290J629k52l77O00k29j387l29n3j604j154N25L5r74L74
$$ -1745 -275 194 -135 1155 2784 2532 2155 2755 2526 1139 810 757 -847 -2001 -1476 -1441 -2415 -2041
1331b041J010k37J44J361K59j015M88J063n22o17O73L06m34O70P50n42l03P76
$$ -2041 -1031 -1268 -1124 237 496 -519 -31 1032 510 -107 566 872 438 1108 1858 1316 1013 1789
1349A789j51j260k99k50j413p32M12o52j029J166J417l70L68K149Q37n58P41R87
$$ 1789 1638 378 79 -171 -1584 -2316 -1904 -2556 -3585 -2419 -1002 -1372 -1004 1145 1982 1424 2165 3152
1367C152q80q48L01m79j158l49o5o60mN14o76j24R84o0j237L16R27j003r14J494
$$ 3152 2272 1424 1725 1246 88 -261 -326 -986 -990 -476 -1152 -1276 -292 -352 -1589 -1273 -346 -1349 -2263 -769
1387g69R59j108M08K266M71q40J034J030p72r12o8q47j212m91q88j051L41L59
$$ -769 190 -918 -510 1756 2227 1387 2421 3451 2679 1767 1699 852 -360 -851 -1739 -2790 -2449 -2090
1405b090o82N50J807N7n96J642J283j512o24J843k2k094K36J580m90r34Q82O15
$$ -2090 -2772 -2222 -415 -358 -954 688 1971 459 -165 1678 1656 -438 -202 1378 888 -46 836 1451
1423A451m09j75n7o52k95m28j333n68P80l69j183J227K000k61j75K154J239j089
$$ 1451 1042 867 810 158 -137 -565 -1898 -2466 -1686 -2055 -3238 -2011 -11 -272 -447 1707 2946 1857
1441A857Q1J159r66j738j5L4j394o88M67n6r6P72K92j84O95N02q78k41N91p57
$$ 1857 1938 3097 2131 393 378 412 -982 -1670 -1203 -1259 -1355 -583 -291 -475 220 722 -156 -397 194 -563
1461e63r86J044O99j173K33K291M00j170Q82J296j011j153K58p02j784m56K02
$$ -563 -1549 -505 194 -979 -746 1545 1945 775 1657 2953 1942 789 1047 345 -1439 -1895 -1693
1478a693r28l14R93N51K04J213J134j51M16Q39n71r41K35l33j358k3Q70p22o38
$$ -1693 -2621 -2935 -1942 -1391 -1187 26 1160 1009 1425 2264 1693 752 987 654 -704 -727 143 -579 -1217
1497a217J613Q49j148j7J413o14j576J87K86j441o84Q88J34k20Q12R13N13J102
$$ -1217 396 1245 97 80 1493 879 -697 -510 -224 -1665 -2349 -1461 -1327 -1547 -735 178 691 1793
1515A793L29n10L79O06j522j600O04K2k133m48J795J7j211J119J914m52n88R01
$$ 1793 2122 1612 1991 2597 1075 -525 79 101 -2032 -2480 -685 -668 -1879 -760 1154 702 114 1015
1533A015K41j015m94M1n29j81R2j78N76J158p0l72J407P38j582q30J129n09k476
$$ 1015 1256 241 -253 -212 -741 -922 -830 -1008 -432 726 656 284 1691 2429 847 17 1146 637 -1839
1552a839k24J357n54j271J141J620M3j72J133P80m40n30o3j85o95j053m55N96
$$ -1839 -2063 -706 -1260 -2531 -1390 230 273 101 1234 2014 1574 1044 981 796 101 -952 -1407 -811
1570h11K37p85R4J737P97q90k29J216K19j463r36M13n7j100k95R74N01p8N47J248
$$ -811 -574 -1359 -1265 472 1269 379 150 1366 1585 122 -814 -401 -458 -1558 -1853 -879 -378 -456 91 1339
1590A339M83m41j1M09n57j262m98R2p52q78M53R68j03k07J012J291O8n96j29J63
$$ 1339 1822 1381 1370 1779 1222 -40 -538 -446 -1198 -2076 -1623 -655 -758 -965 47 1338 1406 810 681 844
1610H44o5p05j163k25P18J78p90L47J538L50n50P17O54r15p18L85n83j476nO60
$$ 844 779 74 -1089 -1314 -596 -418 -1208 -861 677 1027 477 1194 1848 933 215 600 17 -1459 -1464 -804
1630h04p14k59J458P26n59N36J323j47o76o0l36p52J7k81j005p3J184L80o00N72
$$ -804 -1518 -1777 -319 407 -152 384 1707 1560 884 824 488 -264 -247 -528 -1533 -1606 -422 -42 -642 -70
1650g0J271P0m38J27q2o64m10k44o39j73L50N3K3P60Q36N2l2L96J1l70n50o74
$$ -70 1201 1271 833 960 878 214 -196 -440 -1079 -1252 -902 -849 -826 -66 770 822 790 1186 1197 827 277 -397
1672c97l33O5l31n49L66Q39K12J98Q06K42j84L05p7r31m33J44p63o49O29N56p13
$$ -397 -730 -665 -996 -1545 -1179 -340 -128 70 876 1118 934 1239 1162 231 -202 -58 -821 -1470 -841 -285 -998
1693i98K96J572K34o86M74M13q96l53L05j033j138P88P44r96k07J702P67o60M47
$$ -998 -702 870 1104 418 892 1305 409 56 361 -672 -1810 -1022 -278 -1274 -1481 221 988 328 775
1712G75Q34k97n33k99n15n06J40o39q78Q28J490n02q97J426J732o00j373J18O88
$$ 775 1609 1312 779 480 -35 -541 -401 -1040 -1918 -1090 400 -102 -999 427 2159 1559 186 304 992
1731I92o19j102m08l6j91L47O77R1l14J073J459m23j265L93Q81j157j678J82Q08
$$ 992 373 -729 -1137 -1173 -1364 -1017 -340 -249 -563 510 1969 1546 281 674 1555 398 -1280 -1098 -290
1750b90n04r33K67J444J135l64r66Q97J905m18k801o83J960J01k616q17J806O91
$$ -290 -794 -1727 -1460 -16 1119 755 -211 686 2591 2173 -628 -1311 649 750 -1866 -2683 -877 -186
1768a86o44O95R28m70M18J753o99k565M10J981j581k631J018J802r49q67J446
$$ -186 -830 -135 793 323 741 2494 1795 -770 -360 1621 40 -2591 -1573 229 -720 -1587 -141
1785a41J053J30K95p42n46J791K40l765j408L745O05m239k73L934N90j809J195
$$ -141 912 1042 1337 595 49 1840 2080 -1685 -3093 652 1257 -2982 -3255 679 1269 -540 655
1802F55R76j288P77J664k462k619J952J456k478j271J804P41j14O90J1j24J539
$$ 655 1631 343 1120 2784 322 -2297 -345 1111 -1367 -2638 -834 -93 -207 483 494 370 1909
1819A909K17k344k82K088j270k999O61K419n27j758O50J921J007k26j001l34J137
$$ 1909 2126 -218 -500 1588 318 -2681 -2020 399 -128 -1886 -1236 685 1692 1466 465 131 1268
1836A268N16j696j788J75Q78J05m27o04N99J970Q88j140m88J368M48j498j019
$$ 1268 1784 88 -1700 -1525 -647 -542 -969 -1573 -974 996 1884 744 256 1624 2072 574 -445
1853d45J17k43p16j03J00L24P78N93m28M56J659k5k168n80J724j59k522q40J520
$$ -445 -328 -571 -1287 -1390 -1290 -966 -188 405 -23 433 2092 2067 -101 -681 1043 884 -1638 -2478 -958
1872i58O31l35J36K43M80J755N94k013n91J872n46k628K6J147j558n36K165J45
$$ -958 -327 -662 -526 -283 197 1952 2546 533 -58 1814 1268 -1360 -1334 -187 -1745 -2281 -116 29
1890B9j690J715K549j541j472K220M00k919m69J685q29j846N98J087J08N93L37
$$ 29 -1661 54 2603 1062 -410 1810 2210 -709 -1178 507 -322 -2168 -1570 -483 -375 218 555
1907E55m86J063J415j329j814R14P30j883j108J015J59q51O96J424K1m69Q98J063
$$ 555 69 1132 2547 1218 -596 318 1048 -835 -1943 -928 -769 -1620 -924 500 521 52 950 2013
1925B013m41j492k70R40o60j959P0J561l52j098J240J684n01n98J156L47r86m38
$$ 2013 1572 80 -190 750 90 -1869 -1799 -238 -590 -1688 -448 1236 735 137 1293 1640 654 216
1943B16j14o77j69J00p06OJ401K70r17J066J617j055j236J352M14k407q01J755
$$ 216 102 -575 -744 -644 -1350 -1344 57 327 -590 476 2093 1038 -198 1154 1568 -839 -1640 115
1961A15l31k070N75K178k75j061J334J329q77m79P67m25j251K87J79j144k58J147
$$ 115 -216 -2286 -1711 467 192 -869 465 1794 917 438 1205 780 -471 -184 -5 -1149 -1407 -260
1979b60k3n72J236P86j055K09J660j013k114R59J199k062j209K026L71j742R85
$$ -260 -283 -855 381 1167 112 321 1981 968 -1146 -187 1012 -1050 -2259 -233 138 -1604 -619
1996f19K023q96q60J649M85j573j05N80j220o41J033k89j252R00J475n77l39J103
$$ -619 1404 508 -352 1297 1782 209 104 684 -536 -1177 -144 -433 -1685 -785 690 113 -226 877
2014H77J92p85M24K55j306o15P70n3q87R9O44K40L20M84m4p9K06J14m62m06m92
$$ 877 1069 284 708 963 -343 -958 -188 -241 -1128 -1029 -385 -145 175 659 615 536 742 856 394 -12 -504
2035e04j84J95mk83M2M99N15K58K24j54k59L41K14p22q89J39K16k31j35K71L3
$$ -504 -688 -493 -497 -780 -738 -239 276 534 758 604 345 686 900 178 -711 -572 -356 -587 -722 -451 -418
2056d18K28P31K34n23j0M04j57m69j26k82m83K20P15k04n46M62J012O7m26m0J73
$$ -418 -190 541 775 252 242 646 489 20 -106 -388 -871 -651 64 -140 -686 -224 788 855 429 389 562
2077E62k44r4l9o78n22M75N10l71k20M60M24R3K40o5n42K0N19l63q12J43L47k70
$$ 562 318 224 185 -493 -1015 -540 -30 -401 -621 -161 263 356 596 531 -11 9 528 165 -647 -504 -157 -427
2099d27j14P48J56n56J65J016M8j110m25Q32J67q22n15K94J96J29J07P9n4L24
$$ -427 -541 207 363 -193 -28 988 1036 -74 -499 333 500 -322 -837 -543 -347 -218 -111 -32 -86 238
2119B38L31l9j79k51k41L2L28l44q66L06J100k17q73O00J055o81o84R13N14j328
$$ 238 569 530 351 100 -141 -109 219 -125 -991 -685 415 198 -675 -75 980 299 -385 528 1042 -286
2139b86o97J113M85j277m16R79N63m20j35L29J12J12q2k99j43K3l05j78N18j37
$$ -286 -983 130 615 -662 -1078 -99 464 44 -91 238 350 462 380 81 -62 -39 -344 -522 -4 -141
2159a41r00N39J459l83j420Q70J316q32j215P73P41j091o09R15L71p83k28P27
$$ -141 -1041 -502 957 574 -846 24 1340 508 -707 66 807 -284 -893 22 393 -390 -618 109
2177A09M92l39l74N0O00j09p71j89N39p2o68K77O56l30m98P48P37m37p39M59P11
$$ 109 601 262 -112 -62 538 429 -342 -531 8 -64 -732 -455 201 -129 -627 121 858 421 -318 141 852
2198H52l94r15NP45j76q95K27R26k15o80N11P92n29o73N27L92p35k93L60J35j81
$$ 852 458 -457 -452 293 117 -778 -551 375 160 -520 -9 783 254 -419 108 500 -235 -528 -168 -33 -214
2219b14q2Q1L05K17j91o4M85M4p35r2O33j99r12J16P80j36n91L42N38j19k09K88
$$ -214 -296 -215 90 307 116 52 537 581 -154 -246 387 188 -724 -608 172 36 -555 -213 325 206 -3 285
2241B85J07k54k29J95k8l19j28J94J42j34K2K85Q2m0m3q7N4K5k74j61K13P8m06
$$ 285 392 138 -91 104 76 -243 -371 -177 -35 -169 -147 138 220 180 137 50 104 129 -145 -306 -93 -15 -421
2264d21R0M68l5k23M05K69l78l2L25j95o13K59K52n48j42M13N8k84K85J99j42
$$ -421 -331 137 102 -121 284 553 175 143 468 273 -340 -81 171 -377 -519 -106 -48 -332 -47 152 10
2285A0J03J63k11p4K08k29l53L72N6l64J66O42m04k72N99K40o24j58M49j87m69
$$ 10 113 276 65 -9 199 -30 -383 -11 45 -319 -153 489 85 -187 412 652 28 -130 319 132 -337
2306c37m0K58k19l0J63j6J77K22j16L2L67k23m37K13L55m73l94M94K46m32j08
$$ -337 -377 -119 -338 -368 -205 -221 -44 178 62 94 461 238 -199 14 369 -104 -498 -4 242 -190 -298
2327b98M44K50l14j11K14J41k97k31O8P6j78j51J34K50l0j4K16J45j06q7J70%
$$ -298 146 396 82 -29 185 326 29 -202 -134 -58 -236 -387 -253 -3 -33 -47 169 314 208 121 291 291
2349B91j99l32Q8K60l24l55L62L93k62j49L72K35k49o9R4p4p6J3j39q0K32N8j55
$$ 291 92 -240 -152 108 -216 -571 -209 184 -78 -227 145 380 131 62 156 82 6 19 -120 -200 32 90 -65
2372f5J47J77j81l2L55k76m30K78J56m62k35M18J04k38J58J94m8J60J72j89k5
$$ -65 82 259 78 46 401 125 -305 -27 129 -333 -568 -150 -46 -284 -126 68 20 180 352 163 138
2393A38K51p0m31R1K01k59j84K45L4j18J55O9j91oK12j51k32N4P9p3L4J20q6J11
$$ 138 389 319 -112 -21 180 -79 -263 -18 16 -102 53 122 -69 -75 137 -14 -246 -192 -113 -186 -152 -32 -118 -7
2417gK72m5j98J56K64j85k67M9J04j81j80m3J70L9m6n8J35J10p2o5RJ56r0r6J3
$$ -7 265 220 22 178 442 257 -10 39 143 -38 -218 -261 -91 -52 -98 -156 -21 89 17 -48 -39 117 27 -69 -56
2442e6j1J05l6n3J24l3L7J33J7k79k4J75k4m34J57K29o6k64J24K25J35j73O3R7
$$ -56 -67 38 2 -51 73 40 77 210 227 -52 -76 99 75 -359 -202 27 -39 -303 -179 46 181 8 71 168
2466A68L2lj55o1R5k0j78pK3K9R4Nj19j1J16Q4j67j27R4J32l3j28j3K39J11j72
$$ 168 200 197 42 -19 76 56 -122 -129 -106 -77 17 22 -97 -108 8 92 -75 -202 -108 24 -9 -137 -150 89 200 28
2492B8n1K43Q6j72m2N2j25j00Q2K4k24kK29l4j62J08J89q0j42P9L9L7m6j4r7J44
$$ 28 -23 220 306 134 92 144 19 -81 1 25 -199 -201 28 -6 -168 -60 129 49 -93 -14 25 62 16 2 -95 49
2518D9N5k9o8O0K6L7K2r5j27RK23j27l47n4M35J26m01j52M05K28k98j46K42K8
$$ 49 104 75 7 67 93 130 152 57 -70 -61 162 35 -312 -366 69 195 -206 -358 47 275 -23 -169 73 101
2542A01k5j23K5m8K2J44l3j64K9K70l6k60q8K51K21k82l45J20N08K1o44j16O60
$$ 101 76 -47 -22 -70 -48 96 63 -101 -72 198 162 -98 -186 65 286 4 -341 -221 287 308 -336 -452 208
2565B08L41o58l40M68M15k96l38nK12Q5kj60k47K22L60o3l80l9M38J24l06m45
$$ 208 549 -109 -449 19 434 138 -200 -205 7 92 90 -70 -317 -95 265 202 -178 -217 221 345 39 -406
2587d06L86M00j66n48j5P11P8o76k41P17L50n55n17M23L80j54l80p9K17J50O7
$$ -406 -20 380 214 -334 -349 362 440 -236 -477 240 590 35 -482 -59 321 167 -213 -292 -75 75 142
2608A42k24j63J49M80j01m71j36M61K90m12m79K14N47o7n66oO26J48n62k04M91
$$ 142 -82 -245 -96 384 283 -188 -324 137 427 15 -464 -250 297 230 -336 -342 284 432 -130 -334 157
2629A57L29n54k71K40L13j11l19o3J92K32n2k44o7K48K83j09l97p4L90K38l94
$$ 157 486 -68 -339 -99 214 103 -216 -279 -87 145 93 -151 -218 30 313 204 -193 -267 123 361 -33
2650c3m03K66N95j38n48MN10J58m95j32J50K76j86k69J5K13J54k83r3J96K24j11
$$ -33 -436 -170 425 287 -261 -257 253 411 -84 -216 -66 210 24 -245 -230 -17 137 -146 -239 -43 181 70
2672G0k06Q4J19J24m6k26j54L06K88l64l96L01M99j27m83j4L98R6k29k40O1J54
$$ 70 -136 -52 67 191 145 -81 -235 71 359 -5 -401 -100 399 272 -211 -225 173 269 40 -200 -139 15
2694A5O6j85j66Q7L00l1k31N1J80Q4j43o6O7L3N3j35j57R1K22Nl67Q9L56Jl25
$$ 15 81 -104 -270 -183 117 86 -145 -94 86 170 27 -39 28 61 114 -21 -178 -87 135 140 -227 -138 218 219 -106
2719a06o6K66M5j06o2p8M4J67Mk23n6K65J14k45r2J21R4k4q6j14qJ78J9j65r7
$$ -106 -172 94 139 33 -29 -107 -63 104 108 -115 -171 94 208 -37 -129 -8 86 62 -24 -138 -146 32 51 -114 -211
2744b11K55R8j95m9K13R8j71l8P1Ll6no5r0O3K15k15j45J74K01p9k82J51P8nn2
$$ -211 44 142 -53 -102 111 209 38 0 71 74 38 33 -32 -122 -59 156 -59 -204 -30 171 92 -190 -39 39 34 -18
2770a8n2n8J20R3l1k17R7L19j47j46K5J86j25o4O1o9l2Q7l2j00j2K16l1k06J07
$$ -18 -70 -128 -8 85 54 -163 -66 253 106 -40 -15 171 46 -18 43 -26 -58 29 -3 -103 -115 101 70 -136 -29
2795b9J09Oj00n9Q7L9l6L1j39O1J61m5j68Q6J78q5j81J43Q8k17j6R9l4p5R5L7
$$ -29 80 86 -14 -73 14 53 17 48 -91 -30 131 86 -82 4 182 97 -84 59 147 -70 -86 13 -21 -96 -1 36
2821C6q6L5Q2%r1M6K4j0qn1n7k4J50k2j89Q7J75o7j25R9J03r2j02J45M2k44P1
$$ 36 -50 -15 67 67 -24 22 46 36 28 -23 -80 -104 46 24 -165 -78 97 30 -95 4 107 15 -87 58 100 -144 -73
2848g3J33j1j12M5R5m2l6K8j0J9j7p5l5M6K7j32K2J18P9j84K6J87mj45P1P5o7
$$ -73 60 49 -63 -18 77 35 -1 27 17 36 19 -56 -91 -45 -18 -150 -128 -10 69 -115 -89 98 94 -51 20 95 28
2875B8K4L3p4n5O3J00q8o5LQ9M9l4j25L9J28j46r3QJ08M3j30m5K10j1j18O6J4
$$ 28 52 85 11 -44 19 119 31 -34 -31 58 107 73 -52 -13 115 -31 -124 -116 -8 35 -95 -140 70 59 -59 7 21
2902B1K2l2mn8N6N4Qj20LO3Q9j00o5N1L3L8p3q3O5J75q6j39k5J77J9j05m3R9o4
$$ 21 43 11 7 -51 5 59 67 -53 -50 13 102 2 -63 -12 21 59 -14 -97 -32 143 57 -82 -107 70 89 -16 -59 40 -24
2931b4M6k3N0o8N9K5j30LJ50o3j58J01J49j5r5K3nM4nj11Qk3J38l8j55K9J55l2
$$ -24 22 -1 49 -19 40 65 -65 -62 88 25 -133 -32 117 102 7 30 25 69 64 -47 -39 -62 76 38 -117 -88 67 35
2959C5r4J9M3m3P2K6q4j06J65M2j60K5J29k7p6N5P2Pj01O8l2Jj9l7o5nJ36p4q1
$$ 35 -59 -40 3 -40 32 58 -26 -132 33 75 -85 -60 69 42 -34 21 93 100 -1 67 35 36 17 -20 -85 -90 46 -28 -109
2988a09N4J92q5j21O9Po3N8J4n0m2J9J47r4oJ2O1n5K9L6M8j68Q1ql8k7L1k5LN8
$$ -109 -55 137 52 -69 0 7 -56 2 16 -34 -76 -57 90 -4 -10 2 63 8 37 73 121 -47 34 26 -12 -39 -8 -33 -30 28
3018B8l7nK9J01q3r8K7L4j8K9q1N6m8M1N6n2j0N5P1q9K1Kk6PJ3o5rJ9NK9J4k6
$$ 28 -9 -14 15 116 33 -65 -38 -4 -22 7 -74 -18 -66 -25 31 -21 -31 24 95 6 27 29 3 10 23 -42 -51 -32 -27 2 16 -10
3050a0RpM1Pn4n0M1M1k3m2j9R0j6k9M2%qK1O0l2o6L3J7p4J3J1k0K0J4m4nO6k9
$$ -10 -1 -8 33 40 -14 -64 -23 18 -5 -47 -66 24 8 -21 21 21 13 34 94 62 -4 29 46 -28 -15 -4 -24 -4 10 -34 -39 27 -2
3083bl7J3N0ol2n7O7m8L2j1M6m3L0L8npj0J7lKl5JLL4j3l2L5j9J4l4K3nJ1m1J7
$$ -2 -39 -26 24 18 -14 -71 -4 -52 -20 -31 15 -28 2 40 35 28 18 35 32 34 -1 0 3 37 24 -8 27 8 22 -12 11 6 17 -24 -7
3118gJ9m1qM1p5N2kK0Ll3M2n2N4K7m9L0Nj7L2j4j1NpL1j6l4L0K8p9N2m2j3m0P7
$$ -7 12 -29 -37 4 -71 -19 -21 -1 2 -31 11 -41 13 40 -9 21 26 9 41 27 16 21 14 45 29 -5 25 53 -26 26 -16 -29 -69 8
3152Hkj6RJ7L4m7J3L9j6m7K8L2p6M3L5j26O5L7m0J7KK2k1n9R8l9j8Nl8N5q7M3
$$ 8 6 -10 -1 16 50 3 16 55 39 -8 20 52 -24 19 54 -72 -7 30 -10 7 9 31 10 -49 49 10 -8 -3 -41 14 -73 -30
3184c0N6j6K5l5NqmOK2O3o0Pk5KJ1o5P5j2kjmM2o7J2j1RpjKQj6J1k0L6J2l8m5
$$ -30 26 10 35 0 5 -3 -7 -1 21 84 24 31 6 8 19 -46 29 17 15 14 10 52 -15 -3 -14 -5 -12 -13 -11 -3 -19 -8 -28 8 20 -18 -63
3221f3R5l5L2Lp5R4q3J5N9k7m9M3L9k7l1O3l1J7M1o1K1%m7l7K7N1n0l3J0P3k3
$$ -63 32 -3 29 32 -43 51 -32 -17 42 15 -34 9 48 21 -10 53 22 39 80 19 40 40 -7 -44 -17 34 -16 -49 -39 34 11
3252A1r4N2N3ro2R5q5jM0k7K1%j9N8J8m7M4k4nO1o3n4Q2p4PoL4J0m4J2M0qj02
$$ 11 -83 -31 22 13 -49 46 -39 -40 0 -27 -6 -6 -25 33 51 4 48 24 19 80 17 -37 45 -29 -22 -28 6 16 -28 -16 24 16 -86
3285h6J11M1m6m5O5Jm3j4Kk3M5J5k5J9J2k9K0mK9j16M4J9l6Q6q8L9K4m5k7O5J2
$$ -86 25 66 20 -25 40 41 -2 -16 -14 -37 8 23 -2 17 29 0 20 16 45 -71 -27 -8 -44 42 -46 -7 17 -28 -55 10 22
3316B2M2r9K1K1l8k3J05j0k0m6K3J7k1m3N4L3m5J4K6l3J6rK6Km0OM0n2ql6J4K3
$$ 22 64 -35 -14 7 -31 -54 51 41 21 -25 -2 15 -6 -49 5 38 -7 7 33 0 16 7 33 35 -5 1 41 -11 -19 -55 -41 -18
3348a8R5o4n1L0j7l2N8N3n1n5N6P9j20JN1k5K3j9m4J01n0J9l4nM9mJp3N5k8n3
$$ -18 77 13 -38 -8 -25 -57 1 54 3 -52 4 83 -37 -36 15 -10 13 -6 -50 51 1 20 -14 -19 30 26 27 -46 9 -19 -72
3379g2P0N1n2l9J6M7o9O9M1o9j2L7kl3K5Q%J5n3n5R7J8M0j06m0Q5L8q6o5M1P4
$$ -72 -2 49 -3 -42 -26 21 -48 21 62 -7 -19 18 16 -17 8 16 16 31 -22 -77 20 38 78 -28 -68 17 55 -31 -96 -55 19
3410A9k5k6j6P0Oq0R1j2J3q6Q0m6L8Mr7K9K7K5J6k9m1J21Qj30K3J2M9J9j35M6
$$ 19 -6 -32 -48 22 28 -52 39 27 40 -46 34 -12 26 30 -67 -38 -11 14 30 1 -40 81 89 -41 -18 -6 43 62 -73 -27
3440b7M8l4K2o0J3N6j8k3k9N8L2m4l1O9q0N3ok2L2N0kp7qM6jl4o9R3j2o2M1Oj9
$$ -27 21 -13 9 -51 -38 18 0 -23 -52 6 38 -6 -37 32 -48 5 -1 -23 9 59 57 -20 -28 18 17 -17 -86 7 -5 -67 -26 -20 -39
3473c9L6M8j45R7K5Rq9J0P5J1l8l7K6k2O0L0l3o9O0J7n3MN2l1j2Pql3p2P5K7j0
$$ -39 -3 45 -100 -3 22 31 -58 -48 27 38 0 -37 -11 -33 27 57 24 -45 15 32 -21 -17 35 4 -8 -1 -9 -42 -114 -39 -12 -22
3505b2K1J2Ql6O3j3o9l1O0N0j0m5j8k7N8Q4j16k0L3R6r8q0K0J17l5j3l5N7k4K9
$$ -22 -1 11 19 -17 46 33 -36 -67 -7 43 33 -12 -30 -57 1 85 -31 -51 -18 78 -20 -100 -80 37 2 -11 -46 11 -13 16
3535A6ko2L3j5O4k2o4K5pL1j%J2j3N4p4J0N0j1l9L8J3rn6K3N9%m7o7N6N7j06M7
$$ 16 14 -48 -15 -30 34 12 -52 -27 -34 -3 -4 -4 8 -5 49 -25 -15 35 24 -15 23 36 27 -29 -6 53 53 6 -61 -5 52 -54 -7
3568gJ3j9j0L4l2j1j0O9ml5J4K5k5J5No9O9L7n6p3O2R0q7j2L3K9k9q2J5Q6o2j6
$$ -7 6 -13 -23 11 -21 -32 -42 27 23 -12 2 27 2 17 22 -47 22 59 3 -70 -8 82 -5 -17 16 45 16 -66 -51 35 -27 -43
3600d3J3J3Lj1mK6JO6J5n5o9K4N2k8J1k8k7M1%j5o8J38Oj06k4J13qo7k4L6Jl8
$$ -43 -30 -17 -14 -25 -29 -3 -2 64 79 24 -45 -21 31 3 14 -14 -41 0 0 -15 -83 55 61 -45 -69 44 36 -31 -55 -19 -18 -56
3632e6N3J6K3q2M8J1l0L4j1ll1M5m7l4P2j9o7N1J08j7j43P0J59j15j32J41R2j65
$$ -56 -3 13 36 -46 2 13 -17 17 6 3 -28 17 -30 -64 8 -11 -78 -27 81 64 -79 -9 150 35 -97 44 136 -29
3660b9kJ12k3r1l2J11l2j5J7K3j13jR6n4J1j2J9l8O2Q0n5l6J27kj31j2J61j11
$$ -29 -31 81 58 -33 -65 46 14 -1 16 39 -74 -75 21 -33 -22 -34 -15 -53 9 89 34 -2 125 123 -8 -20 141 30
3688C0j09O9M7k8r6O4J4ljRK2M2p0P9j00M8n2N8p6L9lL1K5%m5j3Q7L2m6j79P7
$$ 30 -79 -10 37 9 -87 -23 -9 -12 -13 -4 18 60 -10 69 -31 17 -35 23 -53 -14 -17 14 39 39 -6 -19 68 100 54 -125 -48
3719d8L5q6n2J22N5q9lJ19l1k1M1Pk0k7rM4p8lM9Mn1K3J21j15oN5lm6M0k4o9J9
$$ -48 -13 -99 -151 -29 26 -63 -66 53 22 1 42 49 29 2 -7 37 -41 -44 5 9 -42 -19 102 -13 -19 36 33 -13 27 3 -66 -47
3751d7K2M9j29P0J20l8l4NJ22j23k7M8j7n9K1Lq2K1M3JrJ9N0qn3R0%j5n9L6ll7
$$ -47 -25 24 -105 -35 85 47 13 18 140 17 -10 38 21 -38 -17 -14 -96 -75 -32 -31 -40 -21 29 21 -32 58 58 43 -16 20 17 -20
3783b0j4M8o9O1R6m7Rl3K4j8r4Lm3L7l0M1Q3p2M5N9K3j1J0N1j05m5J09j01Kr7
$$ -20 -34 14 -55 6 102 55 64 31 55 37 -57 -54 -97 -60 -90 -49 34 -38 7 66 89 78 88 139 34 -11 98 -3 -1 -98
3813i8O5j4j0J04m3o0J20j0o2K4M6Nj45j5J16o9j0L7J09p4j8J35m7p3rM4q8n5
$$ -98 -33 -47 -57 47 4 -56 64 54 -8 16 62 67 -78 -93 23 -46 -56 -19 90 16 -2 133 86 13 4 48 -40 -95
3841i5P5m8o5J25O3n2k0O7J0jJ7K8k4j54J16l4p6j4P0p1l4J53k3o4Q9J4L3j22
$$ -95 -20 -68 -133 -8 55 3 -17 50 60 59 76 104 80 -74 42 8 -68 -82 -12 -83 -117 36 13 -51 38 52 85 -37
3869c7M4J9r2jJ8P0j6k2M7K9K0L0Lm2k5l3l8l7L7k9m6K9P9m0j2K9O8K6k4j5K9
$$ -37 7 26 -66 -67 -49 21 5 -17 30 59 79 109 112 70 45 12 -26 -63 -26 -55 -101 -72 7 -33 -45 -16 52 78 54 39 68
3900F8j18qP7k1n0JL9oN3k6Q1k9rl0pl8k3L4rn5RL3LL0O2m2J5L9j8n6l8P4p3l5
$$ 68 -50 -58 19 -2 -52 -51 -12 -18 35 9 90 61 52 22 15 -23 -46 -12 -21 -76 -67 -34 -31 -1 61 19 34 73 55 -1 -39 35 -38 -73
3934g3J7N0m2qP8j4K1nl9M0j5L3n3j6m6L8m6L6j1Q9Ll6O3nm1J4k8m6M5l4n2O2
$$ -73 -56 -6 -48 -56 22 8 29 24 -15 25 10 43 -10 -26 -72 -34 -80 -44 -55 34 37 1 64 59 18 32 4 -42 3 -31 -83 -21
3966b1m2Q5k2l1K6M2P9q5l4pL0m3j2k1K9k0K2j1jR7o9k2N6Om2o4R3L6j28P6%O3
$$ -21 -63 22 0 -31 -5 37 116 31 -3 -10 20 -23 -35 -56 -27 -47 -25 -36 -37 60 -9 -31 25 31 -11 -75 18 54 -74 2 2 65
3998F5m5q7J77p5Ol6O9q4K9n6ON0n0lJ5j3N7l3K4Q1j9r5J8O9n6j17R5Ql8J6j2
$$ 65 20 -67 110 35 41 5 74 -10 19 -37 -31 19 -31 -34 -19 -32 25 -8 16 97 78 -17 1 70 14 -103 -8 0 -38 -22 -34
4029c4N3n4NK0P7k8k7jJ7r2K5k8P8l6j8K9N6m4J3l9Q5j3n5l9R2o9m1N2L%k4J6
$$ -34 19 -35 -30 -10 67 39 12 11 28 -64 -39 -67 11 -25 -43 -14 42 -2 11 -28 57 44 -11 -50 42 -27 -68 -16 -13 -13 -37 -21
4061b1K1Qj4j4Q5Nr3j5J11m3p8J9J0L0m4R6Mm9J1j1m8L6K2p5O1j5l6k0M4M3m6
$$ -21 0 8 -6 -20 65 70 -23 -38 73 30 -48 -29 -19 11 -33 63 67 18 29 18 -30 6 28 -47 14 -1 -37 -57 -13 30 -16
4092a6J8J12l8n5N4m4l8M2l9l2K6j7L0n9P4j1M8j10Q0Pq6K5J4Kn0L1K4l4L1Q5
$$ -16 2 114 76 21 75 31 -7 35 -4 -36 -10 -27 3 -56 18 7 55 -55 25 32 -54 -29 -15 -13 -63 -32 -8 -42 -11 74
4122G4n8L0m4M6k3K1l1l8L3K6p6O0n0pP4pk0K2L0p8JK4M2r4M2j04L1N6j2J3OJ3
$$ 74 16 46 2 48 25 46 15 -23 10 36 -40 20 -30 -37 37 30 10 32 62 -16 -15 9 51 -43 -1 -105 -74 -18 -30 -17 -11 2
4154Bk9O5K7m5m0n0N1m6J8J08p5lM4Pm3O7l5J0o3N1Lq7P7J3j13L3P5j4k2P0K4
$$ 2 -27 38 65 20 -20 -70 -19 -65 -47 61 -14 -17 27 34 -9 58 23 33 -30 21 24 -63 14 27 -86 -53 22 8 -14 56 80
4185H0r2l2R1m3k0N4m9k8J7M7l5l4O1L0j02Q9N1mp5K7l6j12J31j3k5J1L9o1jO6
$$ 80 -12 -44 47 4 -16 38 -11 -39 -22 25 -10 -44 17 47 -55 34 85 81 6 33 -3 -115 16 3 -22 -11 28 -33 -34 32
4215C2m9K0l4O0l6k4K4Op2L8K3O4m6K1k9K9n4mP0k2o5K8j1O9r5K1K5JJ0N9RK5
$$ 32 -17 3 -31 29 -7 -31 -7 -1 -73 -35 -12 52 6 27 -2 27 -27 -31 39 17 -48 -20 -31 38 -57 -36 -11 -10 0 59 68 93
4247I3p7l2kN7j5j16Q4M0p6j7O6L4r0R8M0n4k3K5J3j00M1K4j8mK8n3N1N1l0o1
$$ 93 16 -16 -18 39 24 -92 -8 32 -44 -61 5 39 -51 47 87 33 10 35 48 -52 -11 13 -5 -9 19 -34 17 68 38 -23
4277b3O4j8p2qK0K5n9J9P8j07M9M2J8k6L0j9J2M4o3m4J4L2l6LJ0N9q2J6R7k2j4
$$ -23 41 23 -49 -57 -37 -12 -71 -52 26 -81 -32 10 28 2 32 13 25 69 6 -38 -24 8 -28 -25 -15 44 -38 -22 75 53 39
4308C9o1L0K3j01M1pL3k1l0L3N5K4m5M5l3MJ9j9J2n5k3N4o7M2p7O7MP0j06P9M2
$$ 39 -22 8 31 -70 -29 -36 -3 -24 -54 -21 34 58 13 58 25 29 48 29 41 -14 -37 17 -50 -8 -85 -18 -14 56 -50 29 71
4339G1m7oK1rk8k6K1q0K5J10k7L4o2N0J9L8j08l9N2o3J3k8O1m2K5L7K9n9J9O2
$$ 71 24 18 39 30 2 -24 -3 -83 -58 52 25 59 -3 47 66 104 -4 -43 9 -54 -41 -69 -8 -50 -25 12 41 -18 1 63
4369F3m2lK3j9p3n2N1oO2k3k1N0j3P4j1p9N9Jp1RK1k8J7k8O6l6N4M9l9l8K3J6
$$ 63 21 18 41 22 -51 -103 -52 -58 4 -19 -40 10 -3 71 60 -19 40 41 -30 -21 0 -28 -11 -39 27 -9 45 94 55 17 40 56
4401E6k9m7J9Mj9pomm2P1k1RQ6qn7N0Op3j0j0k3N2Mr%K8j0J7R9o6o1J5qk1J2L1
$$ 56 27 -20 -1 3 -16 -23 -29 -33 -75 -4 -25 -16 70 62 5 55 61 -12 -22 -32 -55 -3 1 -8 -8 20 10 27 126 60 -1 14 6 -15 -3 28
4437B8p3j4N7J0L3mj5j3J1qqo1M1j7k8L7P6r4M5M4L7j43R1R7o3j19J08k0j36M9
$$ 28 -45 -59 -2 8 41 37 22 9 20 12 4 -57 -16 -33 -61 -24 52 -42 3 47 84 -59 32 129 66 -53 55 35 -101 -52
4467e2P8r3k8J32K9r0Q3o4L4MJ5k3r7M4po0P6%OL5J4J9nrj4K1l3j7p5J1O1p8M1
$$ -52 26 -67 -95 37 66 -24 59 -5 29 33 48 25 -72 -28 -35 -95 -19 -19 -13 22 36 55 50 41 27 48 15 -2 -77 -66 -5 -83 -42
4500d2J39r5m6J08N7q4M8l3o2o7lO2J3m8N1l7P4K1l2l4O2nl8PK6r6oO7j9j2O3
$$ -42 97 2 -44 64 121 37 85 52 -10 -77 -80 -18 -5 -53 -2 -39 35 56 24 -10 52 47 9 16 42 -54 -60 7 -12 -24 39
4531C9j4m7J29k6j09L0J10j39l2O0n2j2oJ37j10RJ01j2q2J25k2j90R2J09j24p1
$$ 39 25 -22 107 81 -28 2 112 -27 -59 1 -51 -63 -69 68 -42 -33 68 56 -26 99 77 -113 -21 88 -36 -107
4557a07J23J0l7L3P0o5l0J30j07m3K2K9q0L7l3l5N6N2j3n0N6M9p9O6M4j30K6M8
$$ -107 16 26 -11 22 92 27 -3 127 20 -23 -1 28 -52 -15 -48 -83 -27 25 12 -38 18 67 -12 54 98 -32 -6 42
4585D2o0n1J13o7q7J30J9n6J1Q0k9j15J57p7p4L5O3r2l0J37k1j24J38K6j09P8
$$ 42 -18 -69 44 -23 -110 20 39 -17 -6 74 45 -70 87 10 -64 -29 34 -58 -88 49 28 -96 42 68 -41 37
$$ [...]
8191B2
##END NTUPLES=NMR FID
##END=
