##TITLE=1H_AM_NV64.3
 DMSO-d6
 8 sc, 
 24.10.2023
##JCAMPDX= 6.0         $$ Bruker NMR JCAMP-DX V2.0
##DATA TYPE= NMR FID
##DATA CLASS= NTUPLES
##ORIGIN= UXNMR, Bruker Analytische Messtechnik GmbH
##OWNER= root
$$ XWIN-NMR		Version 3.5
$$ Tue Oct 24 14:32:44 2023 Russian Standard Time (UT+4h)  she@DPX200
##.OBSERVE FREQUENCY= 200.13135
##.OBSERVE NUCLEUS= ^1H
##.DELAY= (6, 6)
##.ACQUISITION MODE= SIMULTANEOUS
##.ACQUISITION SCHEME= undefined
##.AVERAGES= 8
##.DIGITISER RES= 18
##SPECTROMETER/DATA SYSTEM= spect
##.PULSE SEQUENCE= zg30
##.SOLVENT NAME= DMSO
##.SHIFT REFERENCE= (INTERNAL, DMSO, 0, 15.7039)
##AUDIT TRAIL= $$ (NUMBER, WHEN, WHO, WHERE, WHAT)
$$ ##TITLE= Audit trail, XWIN-NMR		Version 3.5
$$ ##JCAMPDX= 5.01
$$ ##ORIGIN= Bruker BioSpin GmbH
$$ ##OWNER= she
$$ F:/spectra/data/she/nmr/H-F/1/audita.txt
$$ ##AUDIT TRAIL=  $$ (NUMBER, WHEN, WHO, WHERE, WHAT)
(   1,<2023-10-24 14:31:29.20 +0400>,<she>,<DPX200>,
      <created by zg, POWCHK disabled, PULCHK disabled
       configuration hash MD5:
       00 E9 B6 7A A2 85 ED C7 34 08 36 98 17 FE 4E 26
       data hash MD5: 16K
       35 92 72 80 DD 00 B4 65 76 D1 33 E5 D9 33 59 4C>)
$$ ##END=
$$ 
$$ hash MD5
$$ 63 4E 1A AD 45 A1 38 C4 06 5C A7 C2 34 B4 3A 3B
##$RELAX= 
##$RELAX= 
##$RELAX= 
##$RELAX= 
##$RELAX= 
##$RELAX= 
$$ Bruker specific parameters
$$ --------------------------
##$DU= <F:/spectra>
##$EXPNO= 1
##$NAME= <H-F>
##$PROCNO= 1
##$TYPE= <nmr>
##$USER= <she>
##$AMP= (0..31)
100 100 100 100 100 100 100 100 100 100 100 100 100 100 100 100 100 100 
100 100 100 100 100 100 100 100 100 100 100 100 100 100 
##$AQSEQ= 0
##$AQ_mod= 1
##$AUNM= <au_zg>
##$AUTOPOS= <>
##$BF1= 200.13
##$BF2= 200.13
##$BF3= 200.13
##$BF4= 200.13
##$BF5= 200.13
##$BF6= 200.13
##$BF7= 200.13
##$BF8= 200.13
##$BYTORDA= 1
##$CFDGTYP= 0
##$CFRGTYP= 5
##$CHEMSTR= <none>
##$CNST= (0..31)
1 1 145 1 1 1 1 1 1 1 1 1 1 1 1 1 1 1 1 1 1 1 1 1 1 1 1 1 1 1 1 1 
##$CPDPRG= <>
##$CPDPRG1= <>
##$CPDPRG2= <>
##$CPDPRG3= <>
##$CPDPRG4= <mlev>
##$CPDPRG5= <mlev>
##$CPDPRG6= <mlev>
##$CPDPRG7= <mlev>
##$CPDPRG8= <mlev>
##$CPDPRGB= <>
##$CPDPRGT= <>
##$D= (0..31)
0 1.2 0 0 0 0 0 0 0 0.06 0 0.03 0 0 0 0 0.0002 0 0 0 0 0 0 0 0 0 0 0 0 
0 0 0 
##$DATE= 1698143488
##$DBL= (0..7)
120 120 120 120 120 120 120 120 
##$DBP= (0..7)
150 150 150 150 150 150 150 150 
##$DBP07= 0
##$DBPNAM0= <>
##$DBPNAM1= <>
##$DBPNAM2= <>
##$DBPNAM3= <>
##$DBPNAM4= <>
##$DBPNAM5= <>
##$DBPNAM6= <>
##$DBPNAM7= <>
##$DBPOAL= (0..7)
0.5 0.5 0.5 0.5 0.5 0.5 0.5 0.5 
##$DBPOFFS= (0..7)
0 0 0 0 0 0 0 0 
##$DE= 6
##$DECBNUC= <off>
##$DECIM= 32
##$DECNUC= <off>
##$DECSTAT= 4
##$DIGMOD= 1
##$DIGTYP= 9
##$DL= (0..7)
0 120 120 120 120 120 120 120 
##$DP= (0..7)
150 150 150 150 150 150 150 150 
##$DP07= 0
##$DPNAME0= <>
##$DPNAME1= <>
##$DPNAME2= <>
##$DPNAME3= <>
##$DPNAME4= <>
##$DPNAME5= <>
##$DPNAME6= <>
##$DPNAME7= <>
##$DPOAL= (0..7)
0.5 0.5 0.5 0.5 0.5 0.5 0.5 0.5 
##$DPOFFS= (0..7)
0 0 0 0 0 0 0 0 
##$DQDMODE= 0
##$DR= 18
##$DS= 0
##$DSLIST= <SSSSSSSSSSSSSSS>
$$ [...]
##$SUBNAM2= <"">
##$SUBNAM3= <"">
##$SUBNAM4= <"">
##$SUBNAM5= <"">
##$SUBNAM6= <"">
##$SUBNAM7= <"">
##$SUBNAM8= <"">
##$SUBNAM9= <"">
##$SW= 18.05172834244
##$SWIBOX= (0..15)
0 0 2 0 0 0 0 0 0 0 0 0 0 0 0 0 
##$SW_h= 3612.71676300578
##$TD= 16384
##$TD0= 1
##$TE= 0
##$TE2= 300
##$TE3= 300
##$TEG= 300
##$TL= (0..7)
0 120 120 120 120 120 120 120 
##$TP= (0..7)
150 150 150 150 150 150 150 150 
##$TP07= 0
##$TPNAME0= <>
##$TPNAME1= <>
##$TPNAME2= <>
##$TPNAME3= <>
##$TPNAME4= <>
##$TPNAME5= <>
##$TPNAME6= <>
##$TPNAME7= <>
##$TPOAL= (0..7)
0.5 0.5 0.5 0.5 0.5 0.5 0.5 0.5 
##$TPOFFS= (0..7)
0 0 0 0 0 0 0 0 
##$TUNHIN= 0
##$TUNHOUT= 0
##$TUNXOUT= 0
##$USERA1= <user>
##$USERA2= <user>
##$USERA3= <user>
##$USERA4= <user>
##$USERA5= <user>
##$V9= 5
##$VALIST= <valist>
##$VCLIST= <CCCCCCCCCCCCCCC>
##$VD= 0
##$VDLIST= <DDDDDDDDDDDDDDD>
##$VPLIST= <PPPPPPPPPPPPPPP>
##$VTLIST= <TTTTTTTTTTTTTTT>
##$WBST= 1024
##$WBSW= 4
##$XGAIN= (0..3)
0 0 0 0 
##$XL= 0
##$YL= 0
##$YMAX_a= 125390
##$YMIN_a= -95479
##$ZGOPTNS= <>
##$ZL1= 120
##$ZL2= 120
##$ZL3= 120
##$ZL4= 120
##$ABSF1= 10
##$ABSF2= 0
##$ABSG= 5
##$ABSL= 3
##$ALPHA= 0
##$AQORDER= 0
##$ASSFAC= 0
##$ASSFACI= 0
##$ASSFACX= 0
##$ASSWID= 0
##$AUNMP= <proc_1d>
##$AZFE= 0.1
##$AZFW= 0.1
##$BCFW= 1
##$BC_mod= 2
##$BYTORDP= 1
##$COROFFS= 0
##$CY= 11.3945322036743
##$DATMOD= 1
##$DC= 2
##$DFILT= <>
##$DTYPP= 0
##$F1P= 15.7292609196834
##$F2P= 12.9074282941183
##$FCOR= 0.5
##$FTSIZE= 0
##$FT_mod= 4
##$GAMMA= 1
##$GB= 0.15
##$INTBC= 1
##$INTSCL= 1
##$ISEN= 128
##$LB= 0.24
##$LEV0= 0
##$LPBIN= 0
##$MAXI= 10000
##$MC2= 0
##$MEAN= 0
##$ME_mod= 0
##$MI= 1.114404
##$NCOEF= 0
##$NC_proc= 0
##$NLEV= 6
##$NOISF1= 3.799351
##$NOISF2= 2.8
##$NSP= 1
##$NTH_PI= 0
##$NZP= 0
##$OFFSET= 15.70392
##$PC= 1
##$PHC0= -23314.78
##$PHC1= 14.6527
##$PH_mod= 1
##$PKNL= yes
##$PPARMOD= 0
##$PSCAL= 0
##$PSIGN= 0
##$REVERSE= no
##$SF= 200.130013532006
##$SI= 16384
##$SIGF1= 3
##$SIGF2= 2
##$SINO= 400
##$SIOLD= 16384
##$SREGLST= <1H.CDCl3>
##$SSB= 0
##$STSI= 0
##$STSR= 0
##$SW_p= 3612.71676300578
##$SYMM= 0
##$S_DEV= 0
##$TDeff= 0
##$TDoff= 0
##$TI= <>
##$TILT= no
##$TM1= 0
##$TM2= 0
##$TOPLEV= 0
##$USERP1= <user>
##$USERP2= <user>
##$USERP3= <user>
##$USERP4= <user>
##$USERP5= <user>
##$WDW= 1
##$XDIM= 8192
##$YMAX_p= 0
##$YMIN_p= 0
$$ End of Bruker specific parameters
$$ ---------------------------------
##NTUPLES= NMR FID
##VAR_NAME=  TIME,          FID/REAL,        FID/IMAG
##SYMBOL=    X,             R,               I
##VAR_TYPE=  INDEPENDENT,   DEPENDENT,       DEPENDENT
##VAR_FORM=  AFFN,          ASDF,            ASDF
##VAR_DIM=   8192,          8192,            8192
##UNITS=     SECONDS,       ARBITRARY UNITS, ARBITRARY UNITS
##FACTOR=    0.0002768,     1,               1
##FIRST=     0,             0,               0
##LAST=      2.2672688,     0,               0
##MIN=       0,             -95479,          0
##MAX=       2.2672688,     125390,          0
$$ Real data points
##PAGE= N=1
##DATA TABLE= (X++(R..R)), XYDATA
0@%%%%%%%%%%%%%%%%%%%%%%%jOj3J6j6J6j6J6k0K7l1L2l6M4m9N4o2O9p6Q5r7J08
45E6j18J30j42J56j73J92k12K34k58K83l10L41l78M20m64N12n68O33p08P89q68
66d53R22q34j6R442J16329n4035j27250K0251N1583K6186K2770m3949q9937J4381
80e4610P5495J2198k6153k9021m1784L1157R7709J381r4166k3976M5860K6569
92B0659J5064r071o6934k9634P2371O5553k8858o6311k4328M5401O7003n823p4968
105a9876l5920L1119L8138J7948j8899n8376j7619O8427N8120k9601n9615j3785
117c9939L9968M8965m352n5185l0952K0077L2623K2215j0321n3880k6110N5012
129a879N5192k2975n6409k2162K8581N4058J1254n5658l8732L0449M3008J3754
$$ plain form
0 0 0 0 0 0 0 0 0 0 0 0 0 0 0 0 0 0 0 0 0 0 0 0 0 -1 5 -8 8 -8 8 -8 8 -12 15 -16 16 -20 24 -25 29 -33 36 -40 45 -52 56
45 56 -62 68 -74 82 -91 101 -111 123 -135 148 -162 179 -199 221 -243 269 -299 334 -374 415 -453
66 -453 469 -365 -381 9061 125390 71355 -55895 -35644 15939 42125 64895 20946 -68991 -54610
80 -54610 20885 33083 6930 -22091 -63875 -32718 64991 66372 -27794 -51770 -5910 20659
92 20659 35723 26652 -40282 -69916 2455 68008 39150 -27161 -51489 -6088 60915 55092 -19876
105 -19876 -55796 -24677 13461 31409 12510 -45866 -63485 4942 63062 33461 -26154 -39939
117 -39939 29 48994 44642 -10543 -41495 -21418 11205 33420 23099 -30781 -56891 -1879
129 -1879 53313 30338 -26071 -48233 -19652 34406 45660 -9998 -48730 -18281 24727 38481
141C8481j2630m3090k7454M5289N1903k6586n4015j2421J7405L6026K9537l5856
153F589o1089J7910O8424J7023l4968l6982j3443L4464N0198j5846o2304j3860
165d3884L7031L0729Q003k3957m4864J528N7265K6120l7867m2538m448L2653L9695
178C5466o250n1780k2446L6807M1569K449l2843l5193P289M6087J9898l2484l8286
191b9717l883K9230L4480l721m4174k3350L0045M0042M449l1816l4320P191M4228
204A8684J9291k9577l3483k596K5235L1820p16m1636k4898K6146L5445M786k4813
217C688l5103k129M7132K9977l3324m0202M685K8948K4589j332l8935k7616K9505
230a0117L7945o645k5314j6771l398K8176L4475j8543m6201j812L2887J9726l258
$$ plain form
141 38481 25851 -17239 -44693 596 52499 25913 -28102 -40523 -23118 12908 42445 6589
153 6589 -54500 -36590 31834 48857 13889 -23093 -36536 -2072 48126 32280 -30024 -43884
165 -43884 -6853 23876 31879 7922 -36942 -35414 21851 47971 10104 -32434 -36882 -4229 35466
178 35466 29216 -22564 -45010 -8203 33366 35815 2972 -32221 -24932 21155 41053 8569 -29717
191 -29717 -33600 -4370 30110 26389 -17785 -41135 -11090 28952 33401 1585 -32735 -25544 18684
204 18684 37975 8398 -25085 -27681 -2446 29374 28658 -12978 -37876 -11730 23715 28501 3688
217 3688 -31415 -33544 13588 43565 10241 -29961 -25276 3672 28261 26929 -12006 -39622 -10117
230 -10117 27828 21183 -4131 -20902 -24300 3876 38351 19808 -26393 -28205 4682 24408 21150
243B1150k6876l0715J4349M6323P446l5160k3607P116K8533K7466j4734m5928
255b4637q430L7717K4108j2506k7703j9878J3415L9281J0318l3095k5397J0327
267a6480K7678J8984j3943l7897r273L2042K2925j0379k1834j6692N892L5113
279A6136J9459k9478l3830P848L1468J8181j3965l6937j3623L2978L0836j3042
291A6031l0236j0850J3828K8253J2554k5431k9823P500K9090J3679j2852k7789
303a6046j2334K3770K9709n050k8123j5859J0588K8332J4477k4631l2547N964
315b1750L1036J4594j2600k6195j3009K3000L2792n041l2329j4439J4066K4634
327A4759J1567k1401l2224M331L3677J3722j6734k2149q156J7608K8375j097l0916
$$ plain form
243 21150 -5726 -36441 -22092 24231 31677 -3483 -27090 -19974 8559 36025 21291 -24637
255 -24637 -33067 4650 28758 16252 -11451 -31329 -17914 21367 31685 -1410 -26807 -16480
267 -16480 11198 30182 16239 -21658 -30931 1111 24036 13657 -8177 -24869 -18977 16136
279 16136 35595 6117 -27713 -19865 11603 29784 15819 -21118 -34741 -1763 29073 16031
291 16031 -14205 -25055 -11227 17026 29580 4149 -25674 -18174 10916 24595 11743 -16046
303 -16046 -28380 -4610 25099 20049 -8074 -23933 -13345 14987 29464 4833 -27714 -21750
315 -21750 9286 23880 11280 -14915 -27924 -4924 27868 22827 -9502 -23941 -9875 14759
327 14759 26326 4925 -27299 -22968 10709 24431 7697 -14452 -22608 -5000 23375 22278 -8638
340h638j5894J5124K2541Q915j5661k8360j533L1798J9041j6508k5363p361J7262
353d637K6474j31l1335j7679J7832K3746M751j4786k2531k745K7524K0486j4997
366A1972k6024o228J5883K3086K684k7919k1146J6328K7495L981j7558j9997j589
379a9032K4178K0008j3910k6821m908J7463J9568J977k2338k0046J2052K7273
391A5464O391j7909k0554k101K2110K0078j1884k7810o085J8754K0206J483k1467
404c324j9590J1706K7265N395j8423j8645j954J9448K0573r702k8599o147K0204
417a793J8263L03j8447j9753Q222K8331O162k1137j6567J278J5239J9020l481
430A5640k8186j0809K2566K0189l954j7457j6396L748K6177J1545k2697k0881
$$ plain form
340 -8638 -24532 -9408 13133 22048 6387 -21973 -23506 8292 27333 10825 -14538 -21899 -4637
353 -4637 21837 21706 -9629 -27308 -9476 14270 19021 4235 -18296 -21041 6483 26969 11972
366 11972 -14052 -20280 -4397 18689 21373 -6546 -27692 -11364 16131 20112 2554 -17443 -19032
379 -19032 5146 25154 11244 -15577 -20485 -3022 16546 18523 -3815 -23861 -11809 15464
391 15464 21855 3946 -16608 -18709 3401 23479 11595 -16215 -22300 -3546 16660 18143 -3324
404 -3324 -22914 -11208 16057 21452 3029 -15616 -17570 1878 22451 12749 -15850 -21997 -1793
417 -1793 16470 16773 -1674 -21427 -13205 15126 21288 151 -16416 -15138 101 19121 15640
430 15640 -12546 -23355 -789 19400 15446 -2011 -18407 -14659 11518 23063 366 -20515
442b0515O427J7404J2467k144k1980j4392J9569K4245n944k0695j0297M444J8347
455F936J4103j4956k5512K396K3124J1863p599j8207j1987J3144K4523q32k4013
468g017j2187J0345J7219R010r945k1352l549K1984J6634j0045k1536p910J3178
481e171J9107J362j9679j5321Q527K0781Q349j2816j8561j749J8134J5941o885
494A2019k1713r353J4528J9172mj7602j3607N586J9278J0724j3019k1301r52J9524
508C280J3424p569j8197q803J1908J9928J978j8038j3371O505J7207R716j0357
521G611k1163l980J9943J4999r178j8396o270J0615J7343M114j6620j5801O842
534i941J9150P747j1198j7597l632J6839J5967o823j9628o950J1697J5957K542
$$ plain form
442 -20515 -14088 3316 15783 13639 -8341 -22733 -3164 21081 15137 -5558 -15855 -11411 6936
455 6936 21039 6083 -19429 -17033 6091 17954 10355 -7852 -19839 -6695 17828 16996 -7017
468 -7017 -19204 -8859 8360 17370 7425 -13927 -17476 4508 21142 11097 -10439 -18349 -5171
481 -5171 13936 15298 -4381 -19702 -11175 9606 17955 5139 -13422 -15171 2963 18904 12019
494 12019 -9694 -19047 -4519 14653 14649 -2953 -16560 -10974 8304 19028 6009 -15292 -16244 3280
508 3280 16704 9135 -9062 -17865 -5957 13971 15949 -2089 -15460 -8955 8252 17968 7611
521 7611 -13552 -17532 2411 17410 8232 -10164 -16434 -5819 11524 15638 -982 -16783 -9941
534 -9941 9209 16956 5758 -11839 -15471 1368 17335 10512 -9116 -16066 -4369 11588 14130
547A4130j4962j5334M514J9158Q985j1897j7411j665J6102J4162n191j7502q272
560a5183J0375J6905K964j5738j5017N048J7902Q197j0587j6923l061J5918J4702
573A5502n998j7482o721R884J5225M140j3938j5783M782J8890P230j1128j4783
586a0180l260J3016J5103l978j9030p690J1679J4218K405j1663j4454K333J8818
599G317R218j2088j5080j110J1744J3177j569j7743j0309J1829J6106M35j2570
612f43j1932J627J6091J0497j0716j6695n95J3262J1193j888j4597j0494R293
625e597J7112J685j4006j1539K694J4219R748q499j6899k238J4149J1590l305
638I114j3976q983Q014J6129K756j3731j1743L439J3757Q743p509j5619l272J3393
$$ plain form
547 14130 -832 -16166 -11652 7506 16491 4594 -12817 -14482 1620 15782 10591 -6911 -15183
560 -15183 -4808 12097 15061 -677 -15694 -10646 7256 15453 4866 -12057 -15118 800 15502
573 15502 9504 -7978 -14699 -4815 10410 14550 612 -15171 -10389 8501 15731 4603 -10180
586 -10180 -13440 -424 14679 10701 -8329 -16019 -4340 9878 12283 620 -13834 -11501 7317
599 7317 16535 4447 -10633 -11743 1 13178 11609 -6134 -16443 -4614 11492 11927 -643
612 -643 -12575 -10948 5143 15640 4924 -11771 -12366 896 12089 10201 -4396 -14890 -5597
625 -5597 11515 13200 -806 -12345 -9651 4568 14316 5817 -11082 -13320 829 12419 9114
638 9114 -4862 -13845 -5831 10298 13054 -677 -12420 -8981 4776 13519 6010 -9609 -12881 512
652E12J2194l568j4279q239P689J5081K965j3040j1692L628J3432Q021o837j4472
666h605l835J2480J2446l235j4121q149P446J4643L147j2634j1727L619J3328
679D803P397o774j3694l725J1657J2095k955j3424p697O755J3781L943j1736j2206
693a1780L045J3477P285o628j3350m005J1394J2253l019j3565o832O912J2318
706G505L788j0180j2125J914J3400P585o836j2750l749J0434J2124j977j3647
719d514p284P308J2233K856r713j1057J351J2451P917o429j2676l596J0218J1464
733A0529j764j2696p471O677J2200L101r801j1009J736J2250P248o294j1695l310
747a0299R099J1013j116j2157p620O169J1851L476r148j1140J037J2517P648o706
$$ plain form
652 512 12706 9138 -5141 -13380 -5691 9390 12355 -685 -12377 -8749 4683 12704 5867 -8605
666 -8605 -12440 40 12486 9251 -4870 -13019 -5573 9070 12217 -417 -12144 -8525 4803
679 4803 12200 5426 -8268 -11993 -336 11759 8804 -4620 -12317 -5562 8219 12162 426 -11780
693 -11780 -8735 4742 12027 5399 -7951 -11956 -562 11691 8672 -4893 -11725 -4813 7505
706 7505 11293 1113 -11012 -9098 4302 11887 5051 -7699 -11448 -1014 11110 9133 -4514
719 -4514 -11798 -4490 7743 10599 886 -10171 -8820 3631 11548 5119 -7557 -11153 -935 10529
733 10529 8765 -3931 -11402 -4725 7475 10576 775 -10234 -8498 3752 11000 4706 -6989 -10299
747 -10299 -1200 9813 8697 -3460 -11080 -4911 6940 10416 1268 -9872 -8835 3682 11330 4624
761D624j1889k669R133J0207j132j1620p444O026J1537K987q645j0191P50J1263
775B937P931n817j1700l068Q523J0101m07j1204q255N731J2118L015r084r905
789i084R03J1049P726n688j1663k532Q701R160q16r989p609M711J1414L235q526
804I92r255M32R599P925m013j1834m100Q991J0120j036j0310p339M902J1497L258
819I829r075r147J733R322O022l986r963m091P496R584n34r441o662L629J0275
834D991M506p428j0172M71J0190O980m478j0298l805P580R666p95j0039o536M649
849d518R675L008p049q587L25Q943O638l689r382l656O720Q975K36q791p182L377
865d957R726M155o972r688k45R543P139m202j0067l262P468Q868n31q838o098
$$ plain form
761 4624 -7265 -9934 -801 9406 8274 -3346 -10790 -4764 6773 9760 1115 -9076 -8326 2937
775 2937 10868 5051 -6649 -9717 -1194 8907 8500 -2704 -10959 -5228 6890 9905 821 -9084
789 -9084 -8181 2868 10594 4906 -6757 -9289 -588 8572 7756 -2233 -9842 -5131 6283 9518 992
804 992 -8263 -7831 1768 9693 5680 -6154 -10254 -1263 8857 7821 -2489 -9828 -4926 6571 9829
819 9829 754 -8393 -6660 2662 8684 4698 -5265 -9356 -1860 7724 7190 -2251 -8913 -5284 4991
834 4991 9497 2069 -8103 -7632 2558 9538 5060 -5238 -9043 -1463 8203 7408 -2631 -9167 -4518
849 -4518 5157 8165 1116 -7471 -7146 1797 8435 4746 -4636 -8292 -1572 7403 7639 -1152 -8334 -4957
865 -4957 4769 8924 1952 -7736 -7981 1562 8701 4499 -5568 -8830 -1362 7506 6975 -1863 -7961
880g961L914Q991L206o204q299n09Q006O881k927r484m389O441R164L58q889o963
896h664L528R736L989o903q895N12Q930O080l753q623l372N880Q147J36q309o357
912g938L096Q533L762n645q466n76Q547O758l410q859l305O021Q159L13q238o484
928g732L440Q703L066n952p836k59P711O156l181q391l235N622P691O07p346o266
944g202K912Q512L480n600p818n69P466O124l007q370l360N477P522M35p115o056
960g169K739Q175L352n172p275p75O991O260k353q317l549N523P285L85o863o034
976f797K119Q028L606n459p264l17O674N723j779p575l880N037P617O70o874n880
992f351J992P669L717n126p663m95O990N600k377p318l370M778P217O11o548n453
$$ plain form
880 -7961 -4047 4944 8150 1946 -6353 -6862 1144 8025 5098 -4386 -8775 -2334 6830 7188 -1701 -8664
896 -8664 -5136 4600 8589 1686 -7209 -6697 2233 8313 4560 -4063 -7435 -1555 6592 6728 -1581 -7938
912 -7938 -4842 3691 7453 1808 -6658 -7234 1313 8071 4661 -4198 -7503 -1482 6677 6990 -1248 -7732
928 -7732 -4292 4411 7477 1525 -6311 -6570 1141 7297 4116 -4275 -7510 -1888 5803 6410 -936 -7202
944 -7202 -4290 4222 7702 2102 -5716 -6285 1181 7305 4298 -4072 -7432 -1955 5567 6002 -1113 -7169
960 -7169 -4430 3745 7097 1925 -5350 -6125 866 7126 4773 -3544 -7093 -1570 5715 6100 -763 -6797
976 -6797 -4678 3350 6956 1497 -5767 -6084 590 6313 4534 -3041 -6921 -1884 5733 6403 -471 -6351
992 -6351 -4359 3310 7027 1901 -5762 -6257 733 6333 3956 -3362 -6732 -1954 5263 5874 -674 -6127
1008f127K028P150L707m559p190p54O525N621k116p171l811M471P291O38o659
1023i56n636K349P168L440m402o942m81O469N304k257o719l237M055O477R18o209
1039f59n388J923O656L343l965o527j189O100N648j865o886l281M230O643R04
1054E687o066n326K047O729K966m250o193q76N394N167j630o439l281L868O367
1069D164J117n357n282J544O492L452l865o454j027N617N167j784o414l183L727
1084b086O143Q86n340n145J553O273L234l649n902r51N323N005j291o100l217
1099e264L542N833J006n187n102J072O039L387l632o033r10N388M841j329n739
1114b088l083L386N812J110n044m925J314N771L018l315n711j155M832M744j239
$$ plain form
1008 -6127 -4099 3051 6758 2199 -4991 -5745 780 6401 4285 -2886 -6697 -2226 5065 5703 -956
1023 -956 -6592 -4243 2925 6365 1963 -4979 -5460 1009 6313 4056 -2663 -5900 -1845 4632 5550 -659
1039 -659 -6047 -4124 2532 5875 1910 -4617 -5806 294 5942 4077 -2809 -6090 -1860 4783 5687
1054 5687 -379 -5705 -3658 3071 6037 1787 -4406 -5282 112 5279 3649 -2790 -6071 -2203 4164
1069 4164 5281 -76 -5358 -3814 2678 6130 2265 -4189 -5216 401 5568 3784 -2630 -5813 -2086
1084 -2086 4057 4943 -397 -5542 -3989 2284 5518 1869 -4033 -4984 339 5344 4053 -2047 -5264
1099 -5264 -1722 4111 5117 -70 -5172 -4100 1939 5326 1694 -4339 -5249 139 4980 3651 -2088
1114 -2088 -5171 -1785 4027 5137 93 -4832 -3518 2253 5271 1956 -3755 -4910 -78 4666 3427
1129C427n701l069L206N550J261m628m822J184N801L224l321n440j077M619M488
1144D702j047n486l394K968N619J114m745m670J261N531L036l002n221j024M472
1159A14M376q60n046l210K663N299J417m422m804P88N389L012k931n311j166M295
1175c97M585q20n097l044K965N280J182m264m350Q32M843K919k669n090j321L847
1191e99M413m78m898l225K627N241J393m159m387P54M957K982k641m937j220L922
1207b55M314p22m715k978K502M784J108l859m108N44M512K995k234m729j322L764
1223c99M372m70m600l052K321M713J237l815m139L97M569K991k358m577j154L634
1239c30L952l60m319k919J968M602J337l530m021L54M302L035k042m509j385L408
$$ plain form
1129 3427 -2274 -5343 -2137 3413 4674 46 -4776 -3592 2209 5433 2112 -3328 -4405 214 4702
1144 4702 3655 -1831 -5225 -2257 3362 4476 -269 -4939 -3678 1853 4889 1887 -3334 -4358 114
1159 114 4490 3630 -1416 -4626 -1963 3336 4753 331 -4473 -3685 1704 4716 1785 -3526 -4692 -397
1175 -397 4188 3368 -1729 -4773 -1808 3472 4654 390 -3960 -3128 1715 4634 1965 -3125 -4446 -599
1191 -599 3814 3336 -1562 -4787 -2160 3081 4474 315 -4072 -3318 1639 4621 1980 -2957 -4177 -255
1207 -255 4059 3337 -1378 -4356 -1854 2930 4038 179 -3929 -3385 1127 4122 1888 -2841 -4163 -399
1223 -399 3973 3503 -1097 -4149 -1828 2885 4122 307 -3832 -3435 1134 4125 1767 -2810 -3964 -330
1239 -330 3622 3262 -1057 -3976 -2008 2594 3931 401 -3620 -3266 1036 4071 2029 -2480 -3865 -457
1255d57M013l02m259k992J956M451J431l333m038L64M262K897j988m334j325L169
1271d85L647j44l919l080J738M541J541l291l825L59M070K776j808m264j527L046
1287f25L675j59l914k867J639M253J720l148l807L89M046K570j818l943j435K812
1303f12L542J6l690k915J553M200J573l081l773L39L715K450j661l746j387K651
1319h26L610K06l504k873J535M106J527k983l753L08L507K308j672l513j478K429
1335a066L555K15l366k757J473M012J569k877l353K12L341K240j332l396j705
1350c235K180L540L03l532k789J361L814J584k678l382K99L365K272j329l058
1365a285j481J889L458N41l565k858J488L624J186k562l061j0L031K347j211l077
$$ plain form
1255 -457 3556 3254 -1005 -3997 -2041 2410 3841 508 -3530 -3166 1096 3993 2005 -2329 -3654 -485
1271 -485 3162 3018 -901 -3981 -2243 2298 3839 548 -3277 -2918 1152 3928 2120 -2144 -3671 -625
1287 -625 3050 2891 -1023 -3890 -2251 2002 3722 574 -3233 -2844 1202 3772 1954 -1989 -3424 -612
1303 -612 2930 2946 -744 -3659 -2106 2094 3667 586 -3187 -2848 867 3317 1656 -2090 -3477 -826
1319 -826 2784 2990 -514 -3387 -1852 2254 3781 798 -2955 -2647 860 3168 1496 -2017 -3495 -1066
1335 -1066 2489 2704 -662 -3419 -1946 2066 3635 758 -2595 -2383 958 3198 1866 -1530 -3235
1350 -3235 -1055 2485 2788 -744 -3533 -2172 1642 3226 548 -2834 -2535 830 3102 1773 -1285
1365 -1285 -2766 -877 2581 3122 -443 -3301 -1813 1811 2997 435 -2626 -2636 395 2742 1531 -1546
1381a546j426J942L228O97l111k757J294L784J153k510k970k1K633K251r32l316
1397a607j685K039L377L26l041k497J411L508J292k370k751K6K552K091q85k985
1413a199j850J947L371K98l245k407J523L087R54k113k385j76K324K311n98k854
1429a012j611J781L116N10k846k682J145L206Q90k215k444j44K190K318m25k980
1445a203j666K160K953K40k585k380R57K946J262k056k606j25K226K132l60k948
1461a053j811K032L044j60k684j786R15K441J250j313k426m13K170K265m09k738
1477f76j936J636L021K18k941j992J181K404R53j163k112n65J924K421k39k890
1493g56j713J597K777L34k602k143J013K592J063j516k144l50J917K069l93k643
$$ plain form
1381 -1546 -2972 -1030 2198 2895 -216 -2973 -1679 2105 3258 748 -2222 -2243 390 2641 1709 -1607
1397 -1607 -3292 -1253 2124 2450 -591 -3088 -1677 1831 3123 753 -1998 -1972 580 2671 1786 -1199
1413 -1199 -3049 -1102 2269 2567 -678 -3085 -1562 1525 2479 366 -2019 -2195 129 2440 1842 -1012
1429 -1012 -2623 -842 2274 2784 -62 -2744 -1599 1607 2497 282 -2162 -2306 -116 2202 1777 -1203
1445 -1203 -2869 -709 2244 2484 -101 -2481 -1524 1422 2684 628 -1978 -2103 123 2255 1895 -1053
1461 -1053 -2864 -832 2212 2052 -632 -2418 -1503 938 2188 875 -1551 -1964 206 2471 2062 -676
1477 -676 -2612 -976 2045 2263 -678 -2670 -1489 915 1868 705 -1407 -1972 -48 2373 2134 -756
1493 -756 -2469 -872 1905 2239 -363 -2506 -1493 1099 2162 646 -1498 -1848 69 2138 1745 -898
1509h98j592J569K605J95k246j693O96K168J414j133k428o08K047K057n29k589
1525i65j473J433K557K52k235j575Q52J897J165p48k197j096J981K461n93k742
1541a026j341J562K351K71k123j739Q11K127R00j014j809p53J521K238k78k579
1557h81j409J549K200K61j761j602K74K047J308j109k126n14J766J732k49k231
1573g45j346J251K178L78j710j577K62J843J400q17k409p86K021K009o81k186
1589i15r62J216J831M33j518j629L03J886J038p83j936q16J553K074l62k201j074
1606a862J299J688L57j232j754O7K018J259j096j872m87J409J713m8k085j218
1622a844J165J894K96j290j511j14J759J527r98k076m08J578J426k33j563j220
$$ plain form
1509 -898 -2490 -921 1684 1879 -367 -2060 -1364 804 2218 1085 -1343 -1951 96 2153 1624 -965
1525 -965 -2438 -1005 1552 1804 -431 -2006 -1154 743 1908 1160 -1037 -2133 -152 2309 1716 -1026
1541 -1026 -2367 -805 1546 1817 -306 -2045 -1234 893 1793 779 -1030 -1783 -262 1976 1698 -881
1557 -881 -2290 -741 1459 1720 -41 -1643 -1369 678 1986 877 -1249 -1763 3 1735 1486 -745
1573 -745 -2091 -840 1338 1716 6 -1571 -1309 534 1934 1117 -1292 -2078 -57 1952 1271 -915
1589 -915 -1877 -661 1170 1603 85 -1544 -1241 645 1683 900 -1036 -1852 -299 1775 1413 -788 -1862
1606 -1862 -563 1125 1482 250 -1504 -1437 581 1840 744 -1128 -1615 -206 1507 1459 -626 -1844
1622 -1844 -679 1215 1511 221 -1290 -1404 355 1882 884 -1192 -1600 -22 1404 1171 -392 -1612
1638a612P70J869N85j458j556J81J594J211o35j964p05J649J581l54j660r95P07
1655g92J699N44j187j593J64J576J196p56j733o74J363J672k87j659j138Q94J704
1672I93M52j241j580J70J724R88q23j561m38J073J418M3j608j141P97J694L46
1689A306j128j294l2J489J224q15j850k29J314J099k03j094j011M47J536O81j249
1706A91j367L06J190Q90m03j564q07J275J662l49j548o17N87J228N12r57j294
1723a065N3J351P92n16j139o42P41J439K51j461j156N10J588N80j090j400O9J409
1741C14R11n37j309n55Q97J368L0j361j064N77J306N04p90j297r9J334J121n38
1759H12j407n25R52J161J06j305j193N02J692L72j197j075L99J030P98k97j271
$$ plain form
1638 -1612 -842 1027 1612 154 -1402 -1221 373 1584 949 -1015 -1720 -71 1510 1156 -504 -1499 -792
1655 -792 907 1451 264 -1329 -1165 411 1607 851 -882 -1556 -193 1479 1192 -467 -1605 -711 993
1672 993 1445 204 -1376 -1206 518 1506 683 -878 -1316 -243 1175 1218 -390 -1531 -734 960 1306
1689 1306 178 -1116 -1148 341 1565 750 -1100 -1329 -15 1084 881 -213 -1224 -777 759 1440 191
1706 191 -1176 -870 320 1210 807 -757 -1564 -289 1373 1024 -524 -1141 -554 674 1186 229 -1065
1723 -1065 -1012 339 1131 615 -524 -1166 -425 1014 1265 -196 -1352 -842 746 1326 236 -1164 -1095 314
1741 314 1225 688 -621 -1176 -279 1089 1119 -242 -1306 -729 577 1081 291 -1006 -1105 229 1350 812
1759 812 -595 -1120 -168 993 1099 -206 -1399 -897 795 1167 -30 -1105 -706 324 1122 825 -446
1776d46p81R73J443l90j366o07O01Q90N85n79j116j53J319Q73n33j142n49M72
1794e06J323L06j639j085J026J466j25p40n44rP55Q61l71j254l24O00O62L16p32
1813a4j011J49J304O63o75j038j71Q77J048l03j526n60J119J024l31q11n28K59
1831e25R30N70n94r64p9O59P73O4j042j027O93J485j9j167o65L88R19N90n66j197
1851g74k28J322P02o39q60k37M55Q30L64r08j065L58J122L26o74o95k06P48J006
1870I47j39j215m57P64Q23j40o94o83n0J038P28p29j024J71R64N45l23p81m31
1889f86M71P99K2q84m89J58P39N54l69p36j60O63P29p4r44o86M45R84J55r37o35
1910h81M59P29L97l93p04j43O83O00l71n82l58R8O77N53o10j018K51J093L22o24
$$ plain form
1776 -446 -1227 -254 1189 799 -567 -1174 -573 317 902 323 -793 -946 373 1246 713 -429 -978 -506
1794 -506 817 1123 -516 -1601 -575 891 766 26 -518 -527 228 1089 718 -536 -860 -260 402 718 -14
1813 -14 -1025 -876 428 1091 416 -622 -793 84 1132 829 -697 -1257 -138 886 555 -256 -784 -525
1831 -525 405 975 381 -583 -662 -3 770 834 -208 -1235 -542 943 924 -243 -908 -520 399 989 423 -774
1851 -774 -1002 320 1022 383 -477 -714 -259 571 935 27 -1038 -680 442 768 94 -601 -807 -59 947
1870 947 808 -407 -864 -100 723 583 -111 -794 -844 194 922 193 -831 -660 304 849 526 -255 -686
1889 -686 -215 584 606 -278 -767 -609 130 684 315 -421 -581 82 811 737 -207 -893 -448 536 691 -246 -881
1910 -881 -422 307 704 311 -393 -536 147 747 376 -206 -564 -466 211 764 154 -864 -613 480 802 178
1930A78n54j99M25P28N2r44n74P30P55j93m04l02k53N54Q57m22j189rR08L75j30
1951C89m70m96J21J180J73j114m63N64K28L6J54n39o41O54J067k89q30j17K96
1970i7M61L67n87r05J46R21J15m43m14k7M00O58L4o97l30L11L66J97l79p47j46
1991g96Q53N14l35o31p0N28O73r8p65m43M92L85r1j81m93j84O17O85k71p46j08
2012d65N85L77K0n27o09J73P93J59o97l91K74N16K56j14n29k33L71N77j73o05
2032b42k17J33M61L45l02p50J20Q17K10m82m10L0K41K34P1l23l93K23N12J44k58
2053A64m90j45N16M64l43n62j4L59L30M6l10m01J35N49J67m07l30k9K70L97j06
2074B60n17k07L79L77P8k44m93m4P42K13n75m64K69K87J68j5l14k87K44N13K1
$$ plain form
1930 178 -376 -575 -150 578 630 -314 -888 -158 597 404 0 -302 -555 -1 856 434 -755 -764 144 519 389
1951 389 -81 -577 -456 724 897 -217 -680 -116 112 148 302 -237 -878 -224 843 554 -276 -393 -97
1970 -97 364 731 144 -761 -615 306 421 -22 -436 -463 -63 595 629 -68 -398 -87 279 476 97 -650 -796
1991 -796 57 571 236 -395 -465 63 736 638 -127 -570 -78 307 216 35 -458 -642 -25 660 389 -357 -465
2012 -465 120 497 517 -10 -619 -446 347 506 -191 -582 -308 208 464 350 -179 -412 -41 536 363 -242
2032 -242 -459 -326 135 480 178 -572 -452 365 575 93 -317 -287 -46 188 259 -64 -457 -234 278 422 164
2053 164 -326 -471 45 509 166 -396 -410 -51 279 325 15 -386 -251 298 465 58 -272 -301 -31 366 260
2074 260 -257 -464 -85 292 370 126 -367 -411 331 544 -31 -495 -226 61 229 214 -100 -387 -143 370 391
2095C91l17m07K0M01M17l82o71J30O42K08l75k93J0K08K76J23m00l32P3M27K56
2116D05k90m71n6M62L34j62m15k24L57L56K9m53k77J82M34Q5k99k90J02K57J61
2137B27m6k58j21M7L44J47k67m28M0N57J93m74l09K60K06P4l3r5l09L7M10J61
2159C63l29l28O3L88K14k10m74pM76P9k01m1j61n6K71L29l87m21L01L76o9r0j32
2182d6k01P0M18M1l81j84J46L43J01k49l89J02M41k2k50r4O0P8O5K79l14l75J33
2205b28N25Rl42k63J51K88R6k01k12m1J66J67Q4k61k26J68L56M8l45j23R9J43
2227E8Q6J1k57j94K21L49o3l03q6J25J75O9j85j80Q6P7N9Q7j56k28O9M43L3m10
2251a14j69K46K41r1j05j31k6J55J81j06j62j4M0J60J57k44k78J51K69Pj57j21
$$ plain form
2095 391 74 -333 -313 88 505 123 -548 -418 224 432 57 -236 -226 -18 258 381 -19 -351 -278 149 405
2116 405 115 -356 -412 50 384 222 -193 -417 -60 296 325 -128 -405 -223 211 296 -3 -293 -191 66 227
2137 227 181 -77 -198 -151 193 340 73 -355 -315 242 435 -39 -348 -88 118 192 159 64 -245 -208 202 363
2159 363 34 -294 -231 157 371 161 -313 -320 156 235 34 -7 -168 -224 47 376 -11 -432 -131 245 176 86 -46
2182 -46 -247 -177 241 282 -99 -283 -137 206 307 58 -331 -229 212 190 -60 -154 -94 -16 49 328 14 -361 -228
2205 -228 297 306 -36 -299 -148 140 236 35 -177 -218 -52 115 199 -62 -288 -120 236 284 -61 -184 -85 58
2227 58 144 155 -102 -296 -75 274 211 -92 -178 -53 122 191 6 -174 -88 -11 48 135 -21 -249 -180 263 296 -114
2251 -114 -283 -37 204 113 8 -123 -149 6 187 81 -81 -95 -55 105 262 18 -260 -109 160 167 10 -111
2273a11k3R7K12Ol15r1K66J64j01j17j25M5J47N9n4j65p1K35Q4j1k01q0L6L16
2297B02n1k85n4J20J26L6l9j21o4J33J87j14j35k5l8J69J18p7k73K4K96Nj21n5
2321c6n0MK17n7j46r6J30N9O8l1j54j44L70R6k44j29Q5J02j1N8r4j84J92J12n4
2346F3p0K3o1l3K75j18k33QK03m6Q5k5k19K4K36Q5k59m4J29J5m1J17j62j14J26
2371c6J03j7n9l5o4J27J37j6l01L1J48N7j8r8m7N0J32L6j43n5NP7N2kj39p2J15
2398c2J80j22j7q1J03k1R4o3r8p1R3J12j17no4P2R4R1j73o8M4Q6N9l4p2q2J01
2425IJ10r2j31l4J21L6L8k3o5lQ2K3m4K3q8j8J42L5j74M3rJ18j4m7p7p3J06O3
2453E7n7n9k3L5J16k0j04KMP5K6K1j55k7J10O1jo7j27P4J48m4o9m9k9J45P6o4
$$ plain form
2273 -111 -134 -37 175 181 -134 -225 41 205 104 -13 -138 -93 54 113 59 -106 -177 58 142 131 -70 -150 -114 202
2297 202 151 -134 -188 -68 58 94 55 -66 -130 3 190 76 -59 -84 -122 47 165 88 -185 -161 135 140 19 -36
2321 -36 -86 -82 135 78 -68 -164 -34 25 93 62 -92 -236 134 230 -14 -143 -58 44 33 91 -3 -187 5 117 63
2346 63 -7 16 -45 -78 197 79 -154 -146 57 11 96 71 -148 -124 112 197 -62 -106 23 38 -3 114 -48 -162 -36
2371 -36 67 50 -9 -44 -108 19 156 140 -161 -130 18 75 57 -41 -88 -38 94 130 -13 -68 -63 14 66 64 -75 -147 -32
2398 -32 148 26 9 -72 31 10 104 41 -57 -128 -35 77 -40 -45 -109 -37 57 148 -25 -93 -49 37 96 62 -10 -92 9
2425 9 119 27 -104 -138 -17 19 57 34 -31 -34 48 71 27 50 -38 -56 86 121 -53 -10 -19 99 85 38 -39 -112 -6 57
2453 57 0 -59 -82 -47 69 49 -55 -53 -49 26 52 73 -82 -109 1 62 61 -6 -133 -59 89 45 -24 -73 -102 43 119 55
2481E5j86N1Q0R9p6p6j2O8Q8qr0m6k7L7P8j1q1m4P4J36j0p6j51M0J79K2q5j50
2509a22O8J00M8j13n6qJ22K5j8Lj08k6O1J24j0j79j1J09R6N0j52p2M9O3R9j48
2535fj04K9R6P8m5q5l8J03R4p5mo9q5J52L6lj70OJ05Q0l9r9j24J41R9J8j27j38
2563a74J81M4N7j66p5N2J57Jj7n5k9M6J9Ql1j10m0J86R3j39j48L2J26J05n4j19
2589e0l2M2J22J8j28j01NJ69N6m6j03k8J03R0m4j32p7L4J55N6p0k08J08J75L5
2614A49r8j59N9P3M3Jr3j16M3J44J00j55p2k1J30P1l0r5j29P4J65jj85n8R4J32
2640F6N6j01j81L6K02k6Nj37n5J09N7P5j44q5L4J36J26r3j07o9Q7J49m5k27k2
2665a54J18J35j7j35p1Q9J20L9j20j18K1N2J20Jj64j4L7J53J10k34j31K8J47R2
$$ plain form
2481 55 -131 -80 0 99 23 -53 -65 3 91 83 -7 -53 -80 -43 35 24 -57 -101 -27 109 99 23 -128 -88 91 113 28 -122
2509 -122 -54 46 94 -19 -75 -83 39 64 46 49 -59 -85 -24 100 90 -89 -100 9 105 155 3 -69 -20 43 142 -6
2535 -6 -110 -81 15 93 48 -37 -75 28 122 47 43 -26 -111 41 77 74 -96 -90 15 95 56 -43 -167 -26 73 91 -36 -174
2563 -174 7 51 108 -58 -133 -81 76 77 60 5 -24 22 41 49 18 -92 -132 54 147 8 -140 -108 18 123 69 -50
2589 -50 -82 -40 82 100 -28 -129 -124 45 101 55 -48 -76 27 117 73 -59 -136 -102 53 109 39 -169 -61 114 149
2614 149 51 -108 -49 24 67 68 -25 -141 -98 46 146 -9 -81 -102 28 99 69 -26 -155 -81 84 83 -102 -160 -66 66
2640 66 122 21 -160 -124 78 52 57 -80 -135 -26 31 106 -38 -123 -89 47 173 80 -27 -96 -9 140 95 -132 -154
2665 -154 -36 99 82 -53 -124 -35 85 124 4 -114 -93 -41 79 80 -84 -98 -61 92 202 -32 -163 -135 12 104
2689A04j15j47lK05J15k2k00k9P6J23J9j32j10K3J58N0q1j22%Q6J15L2j80j15
2713a50P4J95L3j69j59N3J46J77j64j95J9K03M3m7q9j38Q9J39N5k05j4K2J46O2
2737A26p5j35l4J39J44l1k30q9R7J71O3j36j37N0Q8J96j36k20QJ38J68o0j66j60
2761b21J14K71k2j17j40mJ99M6m0j96r4J72J59jk20o5P3K01L6j28j87P6J89P1
2785A72j31j47o8J13K31q8j18j35Q2J61R0j13j76L3J03J22q1j53o1J18K03N8k36
2808b1j49R3J72O3j49j32OJ77J11r7j86k3J13K00l1j85j07O0J91O8j77j51MJ72
2832B2J27r6j43o5J30J46lj37k05J05K47J5j65j60Q9J57L8m1j71q9J60K19j9k49
2856h8p9N5J97N7q7j95K5J52J15k1j93j00J08K32K5k45j80J76J89j1j15j13r6
$$ plain form
2689 104 -11 -158 -161 44 159 137 -63 -92 -16 107 126 -6 -116 -93 65 115 34 -88 -88 -2 113 145 -35 -150
2713 -150 -76 119 152 -17 -176 -123 23 200 36 -159 -140 63 106 59 -30 -168 -79 60 115 -90 -104 -82 64 126
2737 126 51 -84 -118 21 165 134 -96 -185 -88 83 146 10 -127 -77 11 207 71 -149 -141 -3 165 105 -61 -221
2761 -221 -107 164 142 25 -115 -119 80 126 86 -110 -204 -32 127 126 -94 -159 -86 115 151 23 -164 -88 101 172
2785 172 41 -106 -174 -61 170 82 -36 -171 -89 72 162 49 -127 -94 9 131 50 -103 -164 -46 157 215 -21
2808 -21 -170 -77 95 158 9 -123 -117 60 171 74 -112 -135 -22 178 147 -38 -145 -85 106 174 -3 -154 -150 22
2832 22 149 53 -90 -155 -25 121 118 -19 -224 -119 128 143 -22 -182 -93 64 102 61 -110 -199 -39 180 161 -88
2856 -88 -167 -112 85 142 55 -140 -115 37 152 131 -62 -162 -54 178 203 -42 -222 -46 143 132 17 -96 -192
2879a92K23J41l0k11j14J16K50n4j24k14J01K05R4j67j46J3J09J44j8j97j33Q5
2901a19K52P2j87j67P4J66O3r1j43p3J35J66l6k48j19K56K01o4k07p0Q6J15R0
2924A52j05j99l0J54K39n8j97j60K06J62m7j59j39L5K17Q2j13k04j6J57K27o1
2946A43k29q0J87J91n6k10j01O3J10J82q8k87k9K47K35j52k26j39K08J79J2j76
2968a6j10m1K05J68j57j69n2K41J13m1k87j6J29J96k7j48j29j2J61J86o2k47p4
2991a89K21J51o4j64j48J53K03J6j71j27LJ85J14n2k20p5J79J53n8k53j11J80
3013g4J93J9j38k05K5J89J72m1k76q2K53J50m4k55p3Q8K50N3j82j91N8K29J09
3036B27j66k34K3J42J88rk29j01J70J03N9j29k79Q8K24J22j22j86r7K12J93p3
$$ plain form
2879 -192 31 172 142 -69 -183 -67 183 129 5 -209 -108 97 191 24 -122 -109 0 144 126 -71 -204 -119
2901 -119 133 205 18 -149 -75 91 154 63 -80 -153 -18 148 112 -136 -255 1 202 138 -69 -139 -53 62 152
2924 152 47 -152 -182 -28 211 153 -44 -204 2 164 117 -42 -181 -146 71 153 40 -164 -180 -23 204 143
2946 143 -86 -166 21 212 156 -54 -155 -92 18 200 112 -175 -204 43 278 126 -100 -239 -31 148 160 -16
2968 -16 -126 -167 38 206 49 -120 -172 69 182 141 -146 -162 -33 163 136 -12 -141 -153 8 194 132 -115 -189
2991 -189 32 183 119 -45 -193 -40 163 179 8 -119 -116 69 183 131 -89 -164 15 168 110 -143 -254 -74
3013 -74 119 138 0 -205 -180 9 181 140 -136 -218 35 185 141 -114 -187 -99 151 204 22 -169 -111 118 227
3036 227 61 -173 -150 -8 180 171 -58 -159 11 114 173 44 -235 -147 77 199 77 -109 -206 6 199 126
3058A26k01j34N0K57J04k09j70k2K95P8o8j91r9J66K35j11k12q7O6K50P9j58j76
3081a32J2J53K63k07j64j05K49M4Pj63j33J14J70N6m2k60j4K67J85k20k87O7N4
3104h6K18J4j79j65J29J93N0j24k64R2J66J71j37k47o1K19J22M0j98j61J49K12
3126A53L0j65j71PK08J23j12k44o4J86J65Qj78j44J44K33l1n8k92N2J87J65r7
3149A05k31j06J96J98j0j86j07O9K02P9k47j29L6K00O8o2j92p5J88K38j7k24j28
3172a35M9K39N0j83j73J6K07J20r3k34r3J96K19j7k01j65J04K56l4j62j97P7J55
3195AJ98j01j63p3J55J97q4k00j16L9K43M7j37k10M5K44J34r5k18o8J17K40l3
3218A62j59j92P2K31Q3j92j92k7K53J66p7j88p3J14J82Ok11j75P8K73M7j42j86
$$ plain form
3058 126 -75 -209 -159 98 202 -7 -177 -199 96 174 106 -85 -184 -18 217 106 -106 -193 -127 123 202 44 -132
3081 -132 -120 33 296 89 -75 -180 69 113 120 -43 -176 -62 108 164 122 -138 -152 115 300 80 -207 -140 -86
3104 -86 132 146 -33 -198 -69 124 174 50 -214 -122 44 215 78 -169 -230 -11 111 151 -47 -208 -59 153
3126 153 183 18 -153 -146 62 185 73 -171 -235 -49 116 124 -54 -198 -54 179 148 90 -202 -150 37 202 105
3149 105 -126 -232 -36 162 152 -34 -141 -72 130 209 -38 -167 -131 69 137 75 -117 -192 -4 234 217 -7 -135
3172 -135 -86 153 203 20 -153 -137 70 190 97 -137 -230 -34 185 168 -33 -198 -94 162 128 -34 -231 -154 1
3195 1 199 98 -65 -138 17 214 130 -70 -186 -147 96 143 6 -204 -159 85 219 124 -94 -162 -45 195 162
3218 162 3 -189 -117 114 197 5 -187 -214 39 205 128 -60 -133 -19 163 169 -42 -217 -139 134 181 39 -147
3241a47J2K11R0l4k12q2J09K21k4j93j09O9K05M8j42j41k7J92J92j15k47m4J43
3264b5K16l9j86j16P0J87L5n5j97m2K09J59q7k64o8J27J63L6j76j70J18K08O9
3287A72j40k22J1K17J13kk67m0J02K20j8j68j43Q1J81J40k04j91MJ57J68p0k57
3310a56l7J43J97J8k29q2rK44J02j65j52oJ29J75q9k37rJ21K05Oj84j15J7J82
3334F9J61j87j72jJ98J04m3j94j26J40K03j9j30j67O1J82M5l2k14n2J58K09j31
3357F2j66q9J59J94L8j67j93PK88Q9k04j80l2J65J99j01j31j12J25J85O7k24j11
3380a32K3J87J20j80j56n2K30R0kj76j37R5K76j3j52j54J4J44J30j10j74j29K38
3403b0K09l4k10r5R5K16Jj70j83L0J94R9p3j88j3J33J55J0j92j12J14J28K3j19
$$ plain form
3241 -147 -135 76 166 132 -80 -162 -53 168 144 -49 -158 -89 116 164 22 -119 -146 46 238 123 -124 -168 -25
3264 -25 191 152 -34 -150 -80 107 142 87 -110 -152 57 216 129 -135 -203 -76 87 123 -53 -223 -105 103 172
3287 172 32 -190 -179 38 151 149 -118 -158 -56 164 146 -22 -165 -84 97 237 33 -158 -154 3 171 101 -156
3310 -156 -193 -50 147 165 -64 -146 -155 89 191 26 -126 -132 -3 172 83 -154 -163 -42 163 169 -15 -130 -113 69
3334 69 230 43 -129 -130 68 172 129 -65 -191 -51 152 133 3 -164 -103 79 124 92 -122 -174 -16 193 62
3357 62 -104 -193 -34 160 198 31 -162 -155 133 222 18 -162 -194 -29 170 69 -62 -174 -49 136 203 -21 -132
3380 -132 -109 78 198 18 -138 -190 40 130 128 -48 -185 -90 186 173 21 -133 -119 25 155 45 -129 -258 -20
3403 -20 189 155 -55 -150 -55 161 162 -8 -191 -161 33 132 59 -129 -142 -9 146 156 -36 -148 -34 94 117 -2
3427bj91J9K42J23j25j86n7J73K27n7k66p4J49J63k3j44j39L3K25O7p4j78n2J11
3451c6K00o2k18r2J49K49k8j66j61J8K12R6o4j91q3K34J21Qk43j53J82J71J4j36
3475B1j88N7J89J04j11j92l9J75J83q9k00p2J17J87N3j99j62K3J56J75j03k04
3497a19q0K06J74p7k47l9J21K02k1j42j38K4K05J08q0k01m7J60J51o9j52j07P8
3520i0J97L0j60j62Q7J43J13o4k12m2J81J62l3k25j24J08J85N6j82j22m1K45J04
3543A54r2k03j0J52J49j3j54j78J22J89O4j81j13k8K01J10m3k73J0J32K03q8j86
3566g6l5L0J59R3j64j70N1J84M0n1j46j05J84J50m2j80p1J4K63j0j11j42N1J77
3590I3P1p5k53j7J39J62L5j79j51L3K79Pj12j69L7J65J12q6k53K0J32J93o2j58
$$ plain form
3427 -2 -193 -174 68 191 66 -120 -177 -4 223 166 -100 -174 -25 138 115 -29 -168 -135 90 157 83 -95 -147 -36
3451 -36 164 102 -116 -208 -59 190 162 -4 -165 -147 65 161 97 -94 -177 57 178 186 -57 -210 -28 143 157 21
3475 21 -167 -110 79 183 72 -120 -159 16 199 110 -90 -162 -45 142 195 -4 -166 -143 13 188 85 -119
3497 -119 -199 7 181 104 -143 -182 -61 141 120 -22 -160 -136 69 177 97 -104 -151 9 160 91 -61 -168 -90
3520 -90 107 137 -23 -185 -98 45 158 94 -118 -160 21 183 150 -75 -199 -91 94 150 -32 -154 -195 50 154
3543 154 62 -141 -151 1 150 137 -17 -195 -73 116 180 -1 -114 -142 59 169 126 -147 -137 -5 198 110 -76
3566 -76 -111 -81 78 171 7 -163 -112 72 112 61 -85 -190 -6 144 102 -78 -149 -135 128 118 7 -135 -84 93
3590 93 164 89 -164 -181 -42 120 155 -24 -175 -142 137 144 32 -137 -100 65 177 91 -162 -142 -10 183 121 -37
3614c7j43O5K27O1j01k02mJ82J12q2j73o0P9K38m2k01r3R0J78L0j21j61O6J60
3638F8Q6n9j53p6Q3J91J1k06j44R4K65L4j77j56lJ80R5o2j26j07J48J94j9j81
3662b0j84J56J53M8j22j78j8J69J36o9j93n4J46J50K3j70j67R3K03R4j64j55l1
3685a54J75R7Pj79j18J09K11k2j25j69N3J88N3q9j97J11J01J00p7j85o7J54J44
3708A21N0j75j73O7J84J21j35k60R6J24J46o4j66p5J17J40K8j76r7jK15K7n3k17
3732a56K0K28Q6r1j60p8J00J79j3j55j45M9J53J38j04j93j8K29P9l2j91j39J24
3755i0K17j4j85j13J04J77M2n9k20kJ25J64n7j42q4J00J14P8j81j43L6K24Q8j16
3779F3j72j0J61J38p2k29o1J35K41m1j77q8l8K19O4p8j92j2J48J14m8j55m3J30
$$ plain form
3614 -37 -180 -115 112 173 72 -130 -134 48 160 78 -95 -155 -76 162 120 -81 -174 -84 94 124 3 -158 -92 68
3638 68 154 95 -58 -134 -51 140 151 -55 -199 -105 160 194 17 -139 -142 38 133 71 -55 -162 -14 180 161 -20
3662 -20 -204 -48 105 153 31 -147 -165 4 140 71 -122 -176 -30 120 143 -27 -194 -101 102 196 32 -123 -154
3685 -154 21 118 125 -54 -172 -63 148 126 1 -168 -115 73 126 37 -160 -49 52 152 75 -110 -177 -23 121
3708 121 171 -4 -177 -110 74 195 60 -200 -104 20 166 102 -64 -139 -22 118 146 -30 -127 -128 87 114 61 -156
3732 -156 -136 92 178 87 -73 -151 -51 128 115 -40 -185 -136 17 155 51 -142 -160 69 148 116 -75 -214 -90
3755 -90 127 113 -72 -185 -81 96 138 79 -141 -143 -18 146 89 -53 -137 -37 77 155 -26 -169 -133 91 179 63
3779 63 -109 -119 42 180 108 -121 -182 -47 194 153 -24 -112 -150 69 133 55 -137 -149 -1 113 65 -90 -133 -3
3803cJ30lj20j56N8J42J05j44j19k7J25K16o3j74j33Q3K11M3k04j26M0J27J59
3826A67j52j55k7K25J36l6k08j13J13J57N2j96j49Q7J58P9j32j11m7J60J45m3
3848A10k02q0R1J55M3j29j45M2J89R0j18j69l1K16Q1k3k14r1J01J72N7j49j83
3871a87J56J01N9o4j63o1J01J52o6j39p6J35J92Oj42j52N6J68R6j38j37l5J59
3894B1J00n8j99J2R6J63K2j68j50O4J80N2r7j33l0J07J78r3j17p1P6J86k3j32
3918a4j36N2J57O5r6j31L9P5R7kj51p1P1J29Q7j64j26pJ62N1jj45r9J88N1j6j14
3945d9p0O2J90kj20j55qK20Q2j16j34JR1J22l5j37j01R9J35k5m0j76O7J26J11
3970A38p9j53J1R6J25k0j98m5P2J76l6o5r9J4J20Q9k8k47o8J92J29o5r7r0N1J66
$$ plain form
3803 -3 127 124 4 -152 -94 48 153 9 -110 -137 -12 204 141 -33 -166 -83 128 171 -33 -159 -119 8 167
3826 167 15 -140 -167 58 194 158 -50 -163 -50 107 159 -37 -186 -99 59 138 6 -105 -152 8 153 110
3848 110 -92 -172 -81 74 117 -12 -157 -115 74 164 46 -123 -154 62 143 120 -94 -185 -84 88 145 -4 -187
3871 -187 -31 70 129 65 -98 -159 -58 94 28 -111 -187 -52 140 146 4 -148 -92 76 172 34 -103 -138 21
3894 21 121 63 -136 -124 -28 135 157 -11 -161 -97 83 135 38 -95 -125 -18 160 67 -50 -121 -45 141 118 -14
3918 -14 -150 -98 59 124 28 -103 -64 11 108 106 -45 -116 -45 84 171 7 -119 -126 36 87 86 -59 -158 30 81 65 -49
3945 -49 -119 -57 133 131 11 -144 -152 68 150 34 -100 -99 -8 114 79 -58 -159 -60 75 50 10 -166 -99 27 138
3970 138 59 -94 -83 13 138 118 -80 -125 -53 123 87 22 -77 -63 57 146 118 -129 -197 -5 124 59 -38 -128 -77 89
3996H9J0j34m6K1J08J00j32p7o0Q1J59m0j44r9J35J04N9j66j35N8J44J32j15j20
4020f8o0R0J37K8j64p9N8K22o1p7j73N0J08J29q7j35m6J06J43Lj28j27O0J77J8
4045A24j29j36R3J41Q2j44j81J8J23J72o9j45j02O5J78lj28o0PJ31R4m0j49q6
4069a44J75Q6L3j83p2J13M9J07j70q9J3J65J2q4n9q3P1K18o3j23j01L6J84J4q4
4094B1j23mJ27R4o5j09l1J03R4oj46p3N7Q6R7r7j39K5J39Q7j16q7o3J65J13j16
4120C3p2o7M8R2N3o2j47j0J79J03j04j40l8J08J10k8o0j18N6J81Nj24j04MR9J30
4146A27j4j92p6J85N9Qj20q5M3J08R5j78j7l1J43J17j23j34l8J19J41j8j70j04
4170a55P1J19P3j14j30N3J59pj8j29m5O3K12o9j16j14O3J29N9j19r6NJ55Q8j10
$$ plain form
3996 89 99 -35 -81 -60 48 148 16 -61 -121 -40 119 79 -65 -164 -29 75 134 -32 -167 -109 35 167 52 -68
4020 -68 -128 -38 99 127 -37 -116 -58 164 103 26 -147 -97 11 140 53 -82 -128 -22 121 124 -4 -131 -71 106 124
4045 124 -5 -141 -48 93 175 31 -150 -132 -9 163 94 -51 -153 -88 90 87 -41 -101 -94 37 131 91 -58 -144
4069 -144 31 117 150 -33 -105 8 57 164 -6 -95 -82 83 95 11 -48 -131 -60 158 95 -28 -129 -93 91 105 21
4094 21 -102 -106 21 115 50 -59 -90 13 107 101 -45 -118 -61 25 122 25 -114 -89 50 137 21 -66 -129 36 149 33
4120 33 -39 -106 -58 34 87 25 -122 -132 47 150 46 -94 -132 -24 86 58 -2 -120 -64 117 122 -2 -106 -102 -3 127
4146 127 113 -79 -155 30 89 97 -23 -108 -65 43 138 -40 -57 -88 55 172 49 -85 -123 -4 137 119 -51 -155
4170 -155 -84 35 108 -6 -136 -83 76 69 51 -78 -123 -60 152 83 -33 -147 -84 45 104 -15 -111 -106 49 137 27
4195B7j10l2R3P6J4r7o7L2J38j9r2o7PR2J34j9j82m2R5J34l7j24k1M3Q3P5j48
4222a4q7M2Q3L7L2j74m4J27Q9k4n9j15K9J30j1Rj79M3J06Q7p4j02o1J01J00K1
4248I2n4j28L3J17L4n9j14l2J17J27q3j11q1J27J63o0j46m2j3J54M5r4j15MJ71
4273E2P2r0j01p4J33J46n5r3j17K8J27Q7j31r8j7J30J21o1j04m2O6J46mj79l9
4298i7M6J02O2p3j63L6J21Q8n2j41l4J25OM1p4j27R1M8Q5n5j29l4J10R5J5j40
4324d8p2J01Q3j0n5j18N6J09Q3j23p1p8J57J05r1j01l0R7J07K0j25j38L9J55O7
4349A19r1j44M2J15O8l3j41q4J02J59lj30p3N7Q0J11j23j07J7P9P9p4q4l3J04
4374A2Q7l5l4j01j0J47K3n7j41l1K33M0n3j60RM7J07oo4j14Q0J07k3n7j16O4M8
$$ plain form
4195 27 -83 -115 -22 54 68 -29 -96 -64 74 55 -37 -104 -97 -5 129 110 -72 -114 -19 115 78 -46 -67 -24 59 134 -14
4222 -14 -101 -59 24 61 93 -81 -125 2 91 67 8 -107 -78 52 41 50 -129 -86 20 107 33 -69 -130 -29 71 92
4248 92 38 -90 -57 60 94 35 -79 -111 6 133 50 -61 -142 -15 148 88 -58 -100 -113 41 86 -8 -123 -119 52
4273 52 124 34 -67 -141 -8 138 83 -10 -127 -99 28 115 -16 -114 -131 -1 120 59 -45 -87 -21 125 121 -58 -97
4298 -97 -51 51 113 40 -123 -87 34 122 70 -71 -105 20 26 67 -7 -134 -43 5 90 35 -94 -128 -18 77 92 -48
4324 -48 -120 -19 64 54 -1 -119 -63 46 129 6 -65 -143 14 119 28 -73 -103 -6 101 121 -4 -142 -103 52 119
4349 119 28 -116 -74 41 109 76 -65 -149 -47 112 109 -21 -94 -37 43 154 31 -76 -59 20 99 25 -59 -92 12
4374 12 99 64 30 -71 -81 66 89 32 -109 -140 93 133 80 -80 -71 -24 83 77 13 -101 -21 86 63 6 -110 -46 2
4401BJ12n6r8o5J05J14m7l9j13K8J00M6o5j05O6M3N4k5j21l0L5J37K0j22l3J6
4427d1R2M9p6j24MJ52K4p1p5lK3J34L1j34o1JJ05Q6o6j52K8J52J6J9j97o6J47
4454cK2J03j30q8M0J00M8o0j77O5R8K2K2j04MM8R0Qr9j14N1Q4P0m5k11O6P1J01
4482H2J8j19p6O5J00K1r2j40N0R2N3k3q3l4M5J11n5o4N0qQ7Mr9m2K0J12N7j04
4510B8j01m2J38R9oj28r5Q0J25J5j30j5j9N6R6p2o4J0P5O5p3p4q1O9Q2L7j14n8
4538i7R7O1k3j3j19P2L8O2Lq4j06Q7L9N5q4l8L3N8M7o5m2j01J40M9m9p5m6P1N1
4567B1M6o8p9M1K6J07n7j36KP5O8J1n5q5O5N5N6j02n3L9R3K3j05k9p5J14J04k6
4595G6j32j3KJ27K1m5j33L4Q3N3j8j20p8J44J03q0r7l0P2J09rm0q6k9J25O6n7
$$ plain form
4401 2 114 58 -40 -105 0 114 67 28 -85 -57 43 89 24 -81 -15 28 82 57 -64 -94 -59 78 98 -24 -57 -41
4427 -41 51 100 24 -100 -96 56 80 9 -66 -69 -46 88 119 -15 -76 -75 30 116 50 -102 -74 78 94 113 -84 -150 -3
4454 -3 19 122 -8 -96 -56 44 92 32 -145 -80 18 40 62 -42 -38 10 100 108 9 -105 -54 30 100 55 -156 -90 -19 82
4482 82 100 -19 -95 -30 70 91 -1 -141 -91 1 54 31 -52 -86 -41 70 15 -49 1 -7 80 84 -15 -57 -37 75 132 28
4510 28 -73 -115 23 122 116 -12 -107 -27 98 113 -17 -32 -51 5 101 29 -35 -25 50 115 42 -32 -113 -44 38 75 -39 -97
4538 -97 0 61 38 25 -94 -22 16 78 81 -3 -109 -22 17 72 -12 -50 -17 41 88 23 -19 -120 20 69 20 -55 -101 -30 21
4567 21 67 -1 -80 -39 -13 94 37 -99 -97 -22 46 57 2 -83 -18 37 93 -9 -62 -23 70 93 -12 -41 -116 -2 102 76
4595 76 -56 -69 -67 60 81 36 -97 -63 20 73 55 -65 -143 1 104 24 -73 -103 -31 78 69 29 -57 -86 39 105 48
4622D8p3m6R1O9l5j25jP7N4M2q7q8j9J14O9n1p1n3J06L6j2j13mO9K0P1r5j06L4
4651g9J10M9q6q6M2Q3M3k9m8j49J11O6kk1r1J7Q3J16n1j11m8R0N2nr8n0Q0L1k0
4680aK4r9O0L7O9n9j62J17pJ03k8j24LL2P3Lo1j10N6J46l1L3j53J9N1P1p6l2m5
4709i1O0Q6J6p6p8N0O8N1o0q7j9P4P6kq5p6Q6N0M0Oj85K6J15K9l5q6rL5J14k5
4739F8o8p0Q2O7j4o1j12J8J06M4J9r3k5P4L6Rj20n9P0J29n3m1m9k7Q4K5j1l6n8
4768f6M3P8M2j21j4MK3O3p6m5J5J43M4j31o4o6J48M0L0j37j4O3L2M5r0lm1N9K9
4797C3Rj00j2M8J09n7n2l8J9R3K3o9j09M5P9L2J3j25J1L6O3J7j40J0M4Q9Jo0j44
4826a32J34K2J8m5j0n0N9P9o5n8l9O9M7O9j26q1P1O4L1l2o1l6O9J04l6o4n7j4
$$ plain form
4622 48 -25 -71 20 89 54 -71 -72 5 59 101 14 -74 -93 21 90 39 -32 -85 21 57 45 -68 -72 -3 17 88 -7 -113 -79
4651 -79 31 80 -6 -92 -50 33 76 47 -1 -150 -39 27 25 4 -87 -70 13 129 78 -33 -81 9 61 56 -42 -92 -12 19 -1
4680 -1 23 -76 -16 21 90 31 -131 -14 -21 82 54 -70 -67 -35 38 41 -20 -130 -74 72 41 74 -79 -60 -9 62 -14 -46 -91
4709 -91 -31 55 71 -5 -83 -33 35 86 26 -61 -80 -6 70 68 -17 -93 -7 43 83 89 -96 -70 45 74 39 -47 -56 -21 93 68
4739 68 0 -70 12 79 65 4 -108 -90 16 60 79 -14 -39 35 71 80 -40 -99 -29 100 47 6 -43 -70 14 39 28 -8 -66
4768 -66 -23 55 97 -24 -38 -34 -11 52 -24 -69 -54 89 133 2 -62 -128 20 60 90 -47 -61 2 34 79 -11 -14 -55 4 33
4797 33 42 -58 -70 -22 87 30 -22 -60 -41 52 75 6 -103 -58 21 53 66 -59 -48 -12 51 68 -72 -62 -18 71 72 12 -132
4826 -132 2 24 42 -3 -13 -63 -4 75 10 -48 -87 -18 29 98 -28 -109 -38 26 57 25 -36 -72 -3 101 65 1 -56 -70
4854g0J20L8k3j13J3M9N3n0p7j2N4J05k8r6k8N2J5N9l5j43O8O0P0m4q2m7O5N9
4882C2Kq7m0M6Q8N2q0j06M8L9O7nn5p2K5R9J0n2p5M9O1M2j00k6k2M4J12m7j05
4911e6k0O5J07p0n0o6M1J03N9j13o5nP5J12n6n6n4O7J09o8o7r9M8J00Pk4m8k5
4939d9K6N5K8o2n6L7J31l2n5j02P2K6O4j02n3L5M3N9l3j03k4M8J28l7n1n0M3J00
4967H6J6j11m7K5M7N1l4o4n6P9P1N7j85j5L8Q5oj9o8k1O7R2j5r6mJ7R4l9n3m9
4997e7M1N1K8l6j10L8M3N2lj07K4L4O1Rq2o1M7M9K1oo6k1M5M9Nj46O3L5O8o4K0
5028B4j03j1J43K2n9Pp5J2O9Lr2k5J13%J4q8l2K4Q2O3j16k7%M1P8l1p3J8K6M8
5058E5M7j04n2P2J2M0o9o2K4L6Q1J1j40k0Q8Q6J9j17l7k3O4P1r2n2L8M6O4n7l9
$$ plain form
4854 -70 50 88 65 -48 -35 14 67 17 -60 -72 -18 87 59 -37 -65 -13 2 61 26 -117 -49 11 81 37 -45 -92 -27 32
4882 32 34 -53 -93 -47 41 93 13 -93 -45 -6 61 56 1 -71 -46 53 63 11 -64 -15 46 88 -12 -38 -60 -16 96 49 -56
4911 -56 -76 -11 96 26 -24 -90 -49 54 113 0 -65 -70 5 117 61 5 -49 18 127 59 -8 -107 -59 41 48 24 -24 -49
4939 -49 -23 32 60 -2 -58 -21 110 78 23 -79 -7 19 83 -19 -72 -37 6 65 32 -71 -95 -47 81 44 -7 -57 -14 86
4967 86 102 -9 -56 -31 16 67 33 -31 -87 -8 63 120 -65 -80 -42 43 37 18 -50 -71 -4 88 73 -23 -27 -10 84 45 -8 -57
4997 -57 -16 35 63 27 -83 -45 -2 50 47 -60 -36 -2 59 68 -14 -75 -28 21 42 36 -30 -51 -6 43 48 -98 -35 0 68 4 24
5028 24 -79 -90 53 75 16 23 -52 -40 29 32 -60 -85 28 28 42 -46 -78 -54 28 91 -25 -52 -52 -11 67 36 -37 -19 7 55
5058 55 102 -2 -54 18 30 70 1 -61 -37 -1 80 91 -49 -69 19 105 124 7 -30 -53 11 82 -10 -62 -24 22 86 29 -10
5087a0j5nO1J9o9l0J9J02m8k8l4p1J28M6m9r3L9K9L8O2j02k9L4P5L4o5r1PR9M3
5117I6k7r3n0N2J01p9pn4j3R0L3k2j12K7N9J3N0p9o0J03k1M3m4l4J4Q8l2K3j21
5146e6K9O5j0k6l9NK2Q8j4m8qk7M9Q3j05j1J9J1Jk4l3k3M1L0K0o0p9R4n9J34j4
5177E5o1n8N2K2lo9oOJ42p2k8n0L1Q2jK3q9l4O9P1p2j7o0M9O5pj12J0NJ44m8K4
5209F3n6k6K9N6k5m6o9M9O8k2m8mJ8J5R5j34mK5K3K1j4k5j8QO3K0j19k0L6L4O7
5240F0j9j40M1L6R2n1n5o0P7M1L6p8LML2K7j0r2K3P8K5j4r3l1L2O4J8n9l8l0J26
5271D5M1p6n4j1J00Pj9k3k7N1M5Mn8n7j3J14jp0Kn3P3K5n9L1o8J02K5rp6j5K1
5302cJ4J3nl1k0K5J00n5k2k2l1N0N0j2r3N6pL9r3K7k1P4M9l2p0m0P2L8J8n2J4
$$ plain form
5087 -10 -25 -30 31 50 -19 -49 -30 72 24 -4 -38 -109 19 65 16 -77 -38 -9 29 91 -11 -40 -6 69 103 38 -53 -46 53 96
5117 96 69 -24 -74 -22 79 0 -7 -61 -74 16 49 27 -85 -58 1 14 64 -15 -75 28 7 50 6 -28 -14 74 42 65 -56
5146 -56 -27 38 28 2 -37 -32 -10 78 64 16 8 -19 30 113 8 -3 16 27 28 4 -29 -52 -11 19 39 -21 -100 -6 -65 69 55
5177 55 -6 -64 -12 10 7 -62 -68 -62 80 8 -20 -70 -39 43 42 65 -24 -58 11 82 10 -7 -67 -18 47 40 -72 -62 -57 87 39 63
5209 63 7 -19 10 66 41 -5 -74 -25 43 21 -27 -31 -13 2 97 -37 -41 -16 7 28 14 -11 -29 -21 42 62 -57 -77 -41 -7 60
5240 60 41 -99 -58 -22 70 19 -36 -96 -19 22 58 -20 -17 -13 19 46 36 -56 -33 45 70 56 -37 -68 -36 28 46 -13 -51 -81 45
5271 45 86 10 -44 -55 45 52 33 10 -17 34 79 83 25 -32 -45 69 68 -2 0 -53 20 45 -14 17 -51 51 76 67 -9 -24 -3
5302 -3 11 24 19 -12 -32 -7 93 38 16 -6 -37 13 63 51 -42 14 7 46 -47 -20 -41 33 82 50 -20 -60 12 50 68 16 30
5333C0l9N5j7K0r1J3N4K1K0j06l2O0N0k8o2j6N1O4j0m3n4K0K3N8jl9o4J3P9M1
5363G0n0n8M2j5J10j05kl0R9Pm9m1mJ0M9m3Nlm3Q0mp6k5J3N2M4K1n1o3K8N2rj
5396A0m8M3oL9m7m0K9oJ08n2j6n4K9J17l4m9k9m3J01kn8lK0oK1J1m3j2qP6Jo6
5428a7o6P1N8l5K9o6J9J2M1%q0l1RQ2K9p6K0o5L0Q5l8k1n4J01J2k5l2m5L0M4J2
5459C3J3p7K4P2m6J9j01L9N5ljqk6J8QM6m8n5L8L8L1j2j02N8k6J14k6q7rJ7L8
5490C4l2k7jK4J7M2pm3k1N7Jk5K7p7J6M3J1qp9N7N5mn2k7k0OM9k2n8l0P4J0N1
5523D1r4L8k5O9Om5on1O3P7m4j0l4j6N8nj2ql0J9O4qq2L0M8mK0l6k5j4P8l2kn6
5557b8L0j1R3j11L1k2LP2m2l0k4J4P1j8j2p1N1L9L6p5proO0M2q5j3LP6k2n5L9
$$ plain form
5333 30 -9 46 29 49 -42 -29 25 46 66 -40 -72 -12 38 10 -52 -68 -17 47 37 -6 -60 -40 -17 41 40 1 -63 -50 29 70
5363 70 20 -38 4 -11 99 -6 -8 -38 61 68 19 -22 -26 -16 33 -10 -5 -8 -51 29 25 -51 -76 -63 -11 33 54 3 -60 -32 20 11 10
5396 10 -38 5 -1 38 -9 -49 -20 -26 82 30 14 -40 -11 106 72 23 -6 -49 52 50 -8 -11 9 3 24 35 -8 -20 -28 48 49 -17
5428 -17 -83 -12 46 11 40 -26 -7 5 46 46 -34 -65 -56 26 55 -21 -1 -66 -36 49 11 -10 -64 37 49 24 -8 -53 -23 21 33
5459 33 46 -31 -7 65 19 38 -63 -24 31 28 27 19 -7 11 19 65 17 -38 0 38 69 57 -45 13 -13 101 75 -12 -21 -4 34
5490 34 2 -25 -26 -2 15 57 50 7 -14 43 44 19 46 -31 -15 28 39 31 -48 9 64 60 8 -19 -39 -33 16 -6 -64 -94 -20 -10 41
5523 41 -53 -15 -40 29 35 -10 -16 -67 -4 73 29 19 -15 -31 27 22 10 2 -28 -9 55 47 -35 -5 43 39 59 23 -2 -16 62 30 28 -28
5557 -28 2 -9 84 -27 4 -18 -15 57 15 -15 -39 -25 46 28 16 -55 -4 35 71 -4 -11 -20 -26 34 76 -9 -22 -19 57 35 -20 19
5589A9n1Q7m1K0m5l6mM5K5nk4NQ3n4Mj02J1O8K2p8K9M4l6O7m3k0km2Q9kJ3p3J6
5622a1M1K3oj9j21J15N7Jq7j9l2R4K8n2m7N4K7K7o3q4R0oL%n3Rl8Q3L9m6n8K0
5654c1O3l7L4k9l6jJ01j6n5p0R4M4k6n7M9r4R5Mm9M2q4J08qJ1n6L2n1M9k1J7l8
5685a6NJ03r7K5m7l4Q1l1J6Lk6KN6jK4j15PJ10n0m0Lk0L4N5Kr1L5K0J4Rp7M8n7
5718e0N1n0L4L1m3J4N1J9l5m4J9N2m3Ro5k0O3K4l8K3J0l8O7J9k3p5K0J1N6j9l1
5749an2Q0kn2l8R0k0JOPJ5k6PK2jq7P3j5L3On6LpK2O7r8jL8L5n4oL4l1%M2l4m0
5786d0N2k8J5M0l4Nk9L2K5j8lp5J11j5l8Qn1N7N0K3o8L2o2kQ9p4lp7J44k5o9K
5818b6k7K6%Q1p0n2J4O0M7qp3LM2M0l1j9m9J9J7K7qo4N4K1J2l1J0l0L4K6k8J7
$$ plain form
5589 19 -32 55 14 34 -11 -47 -51 -6 19 14 -10 -5 78 24 28 -74 -63 5 27 -51 -22 22 -14 53 10 -10 -12 -54 35 33 46 -27 -11
5622 -11 30 53 47 28 -93 22 79 80 -7 -26 -58 36 64 12 -35 19 46 73 10 -74 16 10 13 13 -40 -31 -69 14 53 7 -51 -31
5654 -31 32 -5 29 0 -36 -37 64 48 -7 -77 17 61 35 -22 27 -67 28 32 -17 25 -59 49 41 52 -4 28 -23 26 5 22 -16
5685 -16 -11 92 -5 20 -27 -61 20 -11 5 8 -18 -16 40 39 63 -52 -45 65 15 -25 -22 -42 -8 47 49 -42 -7 13 27 36 -41 7 -50
5718 -50 1 -49 -15 16 -27 -13 38 57 22 -22 -3 49 6 15 -50 -70 -7 17 -21 2 12 -26 41 60 37 -38 -18 -7 49 30 -1
5749 -1 -53 27 25 -27 -65 25 5 6 12 19 34 8 15 37 36 -51 22 7 40 46 -10 -7 -14 8 75 -23 -24 14 49 -5 -11 23 -8 -8 34 0 -40
5786 -40 12 -16 -1 39 5 10 -19 13 38 20 17 -58 53 38 0 8 -43 14 64 87 19 51 -11 -13 76 2 -1 -78 66 41 -28 -26
5818 -26 -53 -27 -27 54 -16 -68 -54 6 53 45 -28 -25 17 57 26 7 -42 -23 -6 21 13 -51 3 24 36 5 15 -15 19 45 17 34
5850C4q8N1R5j01L0n8J1O5k5j3rn4Q9k8L9p3J8L4j5N9l1o6j3M5N3l4k3L5J0m4
5880gM4Jq9M1j2N0jm5%qL1Kll6N7M2q2m2%K0O5k9K3n3Q4k6k5K2m8k2M9LRl0LL3
5916B1J4M6j27k0J0MR1k6k1J6J2mPl5N9m6L8j4m1om4J27l0ql1j0K6M0j2ro1M5
5948A1MM1o7j2J0N4K3n7p6M7L0M4l0n6L8pK8k2J6o2O0qJ3J7q1O4k6L2J4l2q6N5
5980b1N7J4q1M8l0K4K8n4n4Q1l3M6J7n0n5J2J23k6n8J6j6%P5m3j9m6N4k4N7j17
6010g5N9L8K5L7q7JK1N7L4j15o0K0J11j1J4p0n3L9L2qj0n4RM3K2J2m3lj7J01j6
6041E3o5M%L8k6M0m2m3N2N5q0K2n4jR2l4l5RJ9OK7q1M8l6J0R1m1l1J3L7On7nj1
6075b0K8j0O0r0J2nN6m3kj9j4oN5L7p1K4rO3o3M3j02P2L4J1J5p5NK3P0m5j2k2
$$ plain form
5850 34 -54 -3 92 -9 21 -37 -26 39 14 1 -8 -62 27 -1 38 -35 -17 17 2 61 30 -36 -49 -4 49 15 -8 27 37 -7
5880 -7 37 38 -51 -10 -22 28 27 -18 -18 -26 5 7 4 -32 25 67 -15 -57 -57 -37 28 -1 22 -31 53 27 2 24 -24 -46 3 6 15 -15 -12 21
5916 21 35 81 -46 -66 -56 -52 39 13 -8 8 20 16 23 -12 47 1 39 25 -16 -22 -66 61 31 23 -8 -18 8 48 36 27 -34 11
5948 11 15 56 -11 -23 -13 41 64 7 -69 -22 8 52 22 -34 4 -3 25 3 19 -43 17 9 22 39 -42 22 -4 28 42 10 -76 -21
5980 -21 36 50 -31 17 -13 11 39 -15 -69 12 -21 25 42 -8 -63 -51 72 46 -12 4 -12 -12 63 20 1 -45 9 -15 42 -75
6010 -75 -16 22 47 84 -3 -2 19 76 110 -5 -65 -45 66 55 69 -1 -54 -15 17 9 -1 -55 -46 -3 19 31 -12 -15 -32 69 53
6041 53 -12 -8 -8 30 4 44 2 -41 11 66 -14 8 -46 -47 45 11 -24 -15 4 10 37 -44 4 -32 -22 69 28 -3 10 47 53 -4 -9 -20
6075 -20 8 -2 58 -32 -20 -25 31 -12 -14 -33 -47 -53 2 39 -32 -8 -17 46 -17 26 -76 -4 30 41 56 -19 -14 9 79 34 22 0
6107@lj4P7l3k9j0J4k2RQn9NN4N3l6k1j3N6l4k8J9m1R6J2p6K7rJ4j7%j2l1K3N9
6141C8op9K8K6j2N0l4nnkL6m9j0kK6P1j6j9r6N8L7Ml4m1O9n9lN1Om1j5L5p3R1
6175B5n9j5M3P5m3k8NK2pk5N3n3k9M3J0J0k9k7L7P9o4m3OJ9K5K4o3n2K8Q0L5j02
6207b0k8M1K1K1p1M1j7OL2j2m0Oj2N1L1Qr6L0J3N2n2l3k7J07k1k8qm6J03m2po
6239cJ0m1P6n4K5k7l5K7P7m3Pp4L3M0l2M2n3N4l7J2J8l7k3N7J7j9qk0LK9P1p1
6271B1m8O0rNpm4LK5J2l8K0k0J9J0J5Nl6k5L8Nn9N2L2m5N4J0n4k8KK0l3K1k1N0
6305A2l9M3j9L3q6M3K7Qk4pj0J7P3k4p0k5L7L1On5QM6n2R8n9k6J6j8L5k4K4l8
6337a9RN1l6m4K1j7N1J5o1l0QK0P1k3n3jN1N9j2p0j7K1L9Po7l1P2K4Mn0K0o8P4
$$ plain form
6107 0 -3 -17 60 27 -2 -12 2 -20 -11 -3 -62 -57 -3 50 14 -7 -20 36 2 -26 -7 -48 48 60 -16 11 2 16 -1 -1 -13 -44 -21 38
6141 38 32 -47 -19 7 -5 45 11 6 1 -1 35 -14 -24 -26 0 71 55 36 -60 -2 35 39 5 -36 33 -26 -29 22 28 -13 -28 7 -66 25
6175 25 -34 -49 -6 69 26 -2 3 25 18 -7 46 -7 -36 7 17 27 -2 -29 8 87 23 -20 -14 5 30 54 -9 -61 -33 47 82 -20
6207 -20 -48 -7 14 35 -36 5 -12 -6 26 14 -26 -20 -32 19 50 58 -38 -8 5 57 5 -28 -55 52 31 3 -5 -51 52 10 3 -3
6239 -3 7 -34 42 -12 13 -14 -49 -22 55 12 19 -55 -22 18 -14 28 -25 29 -8 4 22 -15 -38 19 36 17 9 -11 -8 21 92 21
6271 21 -27 33 24 29 22 -22 -19 6 18 -20 0 -20 -1 9 24 29 -7 -32 6 11 -48 4 36 -9 45 55 1 -27 -25 -5 -38 -17 -38 12
6305 12 -27 16 -3 30 -56 -13 14 22 -2 -9 -19 -2 71 47 -23 -48 -11 20 26 -29 -21 25 -27 71 12 -14 2 -16 19 -5 19 -19
6337 -19 -10 41 5 -39 -18 -35 16 31 -30 -60 -52 -32 39 16 -37 -38 13 72 60 -10 -27 -6 33 40 -27 -58 14 38 42 -8 12 -56 18
6370A8M0r5O1q8J10k7qmm1k7MQ9j5l5L7j8M6l8nk5jM0Nnj1l1L6L5p0M2l6J5J4
6403A2J8m3J3l6P0n7N8m4lK9j6po5R8qj4J6J6nl2l7Q9o5Qm2L5N3l8l0J5KN0J7
6436E7l1n3j9K4Q5m5l9M0jk5P8m9m5N2m2KlN9m2l2J6j2L0K5J4m7l9R9p4J5O4r1
6468b9jK1NM8l9J3m4J9j8O4o3M2k2m2J21o1J8k1pJ7J1j3j6o0N5j0J7j4l8L0Q9
6499G2r2O2j15J9J04k7Ml1j8M4K0l4j3j9LJ6N2o1rQL8j0o4O5k0K2l9L7Kl1L3R
6531B7mk4l8K9J3n8R5r3J7L4J9Krp5RO8mJj4OL6l3J7k9l8N7K2Lo0J8LJ8K9k4n5
6566c5J4oM9J4o1mK0P4o2Rj7K9K5o5k4K5M3LJ9o8Ol9K7mJ02n1n1QO1l7k1N9m5
6599cL7m0K8l8qL5jj8%kj0N3l2k9R5l3n9M9j9j7N2J4m9J8m0K2l3M8pm1M7J5m5
$$ plain form
6370 18 58 -37 24 -64 46 19 11 7 -34 -61 -57 32 17 -18 19 1 47 9 4 -21 -22 18 23 18 7 -24 12 47 -23 19 -17 -2 12
6403 12 30 -13 0 -36 34 -23 35 -9 -12 17 1 -6 -71 27 19 5 21 37 32 0 -37 52 -13 -5 -47 -12 41 3 -27 -12 -10 40 57
6436 57 26 -27 -46 -22 63 18 -21 19 18 -7 71 22 -23 29 -13 -11 -14 45 3 -29 -13 -25 5 30 44 -3 -42 57 -17 -2 62 -29
6468 -29 -30 -9 -4 44 5 18 -26 -7 -25 39 -24 18 -4 -46 75 14 32 11 4 21 32 19 3 -57 -2 -12 5 -9 -47 -17 72
6499 72 -20 42 -73 -54 50 23 27 -4 -22 22 42 8 -5 -24 -21 -5 47 -14 -23 -15 23 13 -51 14 -6 16 -23 14 16 -15 18 27
6531 27 23 -1 -39 -10 3 -55 40 -53 -36 -2 17 19 10 -65 -56 12 8 9 -5 1 37 4 21 -8 -46 11 33 36 -24 -6 -3 15 44 20 -35
6566 -35 -21 -27 22 36 -25 -29 -9 65 3 12 -5 24 49 -16 -40 -15 28 31 50 -18 -12 -51 -24 -28 74 23 -28 -20 41 4 -17 42 -3
6599 -3 34 -6 22 -16 -24 11 10 -8 -8 -10 -20 33 1 -28 67 34 -25 24 5 -12 40 54 5 23 -17 5 -28 20 13 -28 19 34 -11
6632a1j7K9k6K5L7j4q4L2M1k1j9N5l6jJ9k3L3Lnl6O6l3J4k1nK6J8j04P4n9L7k1
6664b7L7N5o1l3NOQOL6j8Nl5K9l5L5pk8L8l5P0q6pl5N4pJ8KL4k9Pn6R7n0j5m1
6699f3K6K8R7r4j2ljJ9L6l3J8Oonj0k1M%K0K6jn6L1Lm1N6k7l8L8K8j1k3lK5J5
6734B8m9M4Mm2O0Pp0RL9k4M4j9Jl9oPK0l5M6j6KN1o1pn8N9L4k5k4pL7K6J3p7L2
6769Dj1K7Jrl2L1K0o9L0L8p3J0J3K6l3Q1l0n5M6Qk8m3P3j2m4j1jN9j2j5n4J11
6801D6o8N4n3N4q4P7J4n6N7j8mj8n2O2j6M8n7m1K6P3m1K2m1N5o4L2oJ1k8O9k6
6832B7n4O5k1kK0m3o8J00Jp7K6L1m3R2o6m7P4j7j3l4O8l6nP7l3lml9J5m0L7J0
6864bRkn7K4J0N2n3K0lj0qL8nJ9l4K8%m5L5Pm0j2K8j1L3l0K3j3J4l3pJ2j1P2m2
$$ plain form
6632 -11 -28 1 -25 0 37 23 -61 -29 12 -9 -28 27 -9 -10 9 -14 19 22 17 -19 47 14 28 7 2 28 46 -58 16 -43 -6 -27
6664 -27 10 65 4 -29 -24 -18 -10 -4 32 14 19 -16 13 -22 13 6 -22 16 -19 51 -35 -42 -77 -23 -30 -12 -10 24 -5 2 -54 43 -7 -22 -63
6699 -63 -37 -9 88 -6 -18 -21 -22 -3 33 0 18 24 18 13 3 -18 -14 -14 6 32 31 -25 6 9 -32 24 -3 -41 -3 25 14 -9 -12 13 28
6734 28 -21 23 27 -15 45 52 -18 -9 30 6 50 31 32 -7 -13 -6 14 -21 25 9 11 62 1 -6 -64 -5 29 4 -20 -27 10 36 49 -28 4
6769 4 -7 20 21 12 -20 11 31 -38 -8 30 -43 -33 -20 6 -27 54 24 -31 15 23 -5 -48 25 13 -31 -42 -43 16 4 -11 -65 46
6801 46 -22 32 -21 33 -51 26 40 -16 41 23 19 1 -51 11 -5 43 -14 -55 -29 44 3 25 -16 39 -25 7 1 12 -16 53 27
6832 27 -27 38 17 15 35 -8 -76 24 25 -52 -26 5 -38 54 -12 -59 15 -2 -15 -49 19 -17 -22 55 22 19 15 -24 -9 -49 -12 -2
6864 -2 7 5 -52 -28 -18 34 -19 1 -2 -12 -20 18 13 32 -2 26 26 -19 16 23 -17 -29 -1 -12 21 -9 14 1 15 -18 -25 -13 -24 48 6
6899FL5m7J0LroKj7K4OJ4O2j17J7K7k6QL9o2k6M2N0j0m9JjM8k1K0j4k4L8mj1L
6934A1k8OJ5J5k8J2J2Opk9n2O5N1kl0rl1P6m3j5k6NJ8Pm3QM5j0M7m6rJ2PK0j2
6969A8P%m0K6O7m7l6K1j5j3Rj5J1MOKM9l4n6K8o2L1O6n8K3JMj8l0Q4j8mpJl4O2
7005C3j8j0K5p2Q2j0L8m2m4l7L5N5m5pL3K5l5nK1j6j9j6J7K8Mp7L6N4n6N8o1O
7037b0M4j1m5N7k7J1mJ2K5r4M6nk5L2m1N8L7l5k1j7J14r8Rk8Pl3N3J8k1n3O2j3
7069fRj4K9%n1N5L5p3l0M2K2k1j4K6rjJ2K1l5rj1J2J4J5Ok7kOK7k2K1k2n9R2m4
7104fJ3m1R3l2n5%P2j7n0Kk1N0NK9n9J4NJ9j7L5o3kK3j8L2%k3J2j0pJ15q1Kl3
7138a4M2o8R3r1K8j9KN7J0n8Q8n2l4n4N7J2J2l4J03p5m6K3L8rKl7L1nl5j2j5J08
$$ plain form
6899 6 41 -6 4 7 -2 -8 -6 -23 1 7 21 83 -34 -17 10 -16 -8 31 -31 -57 -15 35 25 -24 -23 -24 24 3 23 9 -15 23 19 8 11
6934 11 -17 -11 4 19 -9 3 15 21 14 -15 -67 -2 49 47 17 8 -23 53 10 -5 -31 -26 -8 -1 -44 -36 9 -1 46 0 -9 3 10 30 18
6969 18 25 25 -15 11 78 31 -5 16 1 -12 -3 -18 -7 -3 3 5 54 20 -36 -8 -70 -39 27 -31 -8 -7 -3 -21 -51 33 15 11 4 5 -29 33
7005 33 15 5 30 -42 40 30 68 26 -18 -55 -20 35 -10 -17 16 41 6 1 22 6 -13 -29 -12 16 20 -57 -21 33 -23 35 -26 -20
7037 -20 24 13 -32 25 -2 9 5 17 42 -52 -6 -11 -36 -4 -45 13 50 15 -6 -23 91 -7 2 -26 -19 -52 1 19 -2 -55 7 -6
7069 -6 3 -11 18 18 -33 22 57 -16 -46 -4 18 -3 -17 9 0 -1 11 32 -3 -12 -23 -11 3 18 24 -3 -5 1 28 6 27 5 -54 38 -6
7104 -6 7 -34 59 27 -28 -28 44 27 -23 -21 -42 8 13 42 -17 -3 2 21 4 39 -24 -26 -3 -21 11 11 -12 0 -10 -17 98 17 19 -14
7138 -14 28 -40 53 -38 -10 -29 -27 30 40 -18 70 18 -16 -70 -13 -1 11 -23 80 5 -41 -18 20 11 13 -24 7 2 -33 -45 -60 48
7170D8Kl6j0ll5L7oJ9l3k3K5M5p6L5Jl4P3l4j2m4O2mPK3m6N4l7L2Qq3K5L5m2L4
7204GKk5j6J0J4J0j0MK8k6k7M9J9n3N1j9k8M2k3j0k2R6q3oJ4J5m9P9j9l0k6Q0
7236D8k9orrM3p6L0PnQM3m5po7Q3j0kk4L6J1Pn3KJ3J6k2K1J2j0K7K4n0L3k2k4
7271fj3j5N7M3l1n8K9ok5L1J2n4O4j1m6k2O3J8n%j4n7J24n8j9k8J5O9m9rrqL0
7304A2mk1k1nJ1M3j3PL2n7Q5o2ql1N9MJ3m6l0M4m8L1K0m6L8m0J6PK0k3N9m3j5
7337a2j3L7mn0M4j0k3j6M6Oj6M9l6k2lM0k6%L4l9L5K1Lp6K5qJ2N6n2k1KK8k6k8
7371d3Q2p3O0J%l0K3k2rN6l5k6P2l9n8j2L5M4%N5m2o8RL2J9jJ4J2j02K8kL7j2
7404El0RO3j24J00n0L1n4J8K8K6Ml9L6K0Jq2L9m0N9j8k0j6QL0J3m5O0Kpo9P2j1
$$ plain form
7170 48 50 14 4 1 -34 3 -3 16 -17 -40 -15 30 -46 -11 -10 -44 29 -5 -17 -61 1 -3 4 27 -19 35 -2 30 38 -45 -20 15 -27 7
7204 7 9 -16 -32 -22 -8 2 -8 -4 24 -2 -29 20 39 -14 37 18 -10 32 9 -1 -23 73 -10 -16 -2 13 -36 43 24 -6 -32 48
7236 48 19 13 4 -5 38 -38 -8 -1 -6 2 45 0 -7 -74 9 -1 -3 -27 9 20 27 -26 -24 -11 5 -17 4 16 6 33 57 7 40 18 -6
7271 -6 -19 -34 23 66 35 -23 6 0 -25 6 18 -36 28 17 -29 -51 12 30 25 25 11 -46 78 20 1 -27 -12 57 8 -1 -10 -18 12
7304 12 8 -13 -34 -39 -28 15 2 9 41 -16 69 7 -1 -32 27 31 44 -2 -32 12 -36 -5 15 -31 7 -33 -17 -10 10 -13 46 3 -12
7337 -12 -25 12 8 -42 2 -8 -31 -47 -1 5 -11 38 2 -20 -23 17 -9 -9 25 -14 21 42 45 -31 -6 -14 -2 54 2 -19 -17 11 -15 -43
7371 -43 39 -34 26 27 27 -3 20 -2 -11 45 10 -16 56 17 -41 -53 -18 26 26 81 39 -29 -20 12 31 30 44 56 -46 -18 -20 17 5
7404 5 -25 -16 47 -77 23 -27 4 -50 -32 -4 22 26 -13 23 43 44 -38 1 -39 20 2 -18 -34 -26 4 17 -28 32 34 27 -42 30 19
7437A9l0M4Rl1k2PK1j7J7Kn0K6JK5o3QJ7MJ0J4J1m7K6j3J0m0K2L1K0k1o8K9kK9
7471bk2jPL8J1rm6J0K2OJ1lm0kKRL3m8J5P0j7n5M5l0PJ1%n0K9k0j4K5K4l9QJ1
7507dqk4L8qK8l7PoK4j2J7J5j4K3l3k6RM8nn4O8l4jj6kL9jp0L2K5j6K3oj2m7J
7543c9LK9k2O1l7K3j1jL8ok9k7K8K1k6p8Q8k5J0%J7Kj8O6q6J6J4k1PL0j7K8m7
7576iQoM7o4P4p1oK5j5Lm0J1P0o6Q1p3M8ROk7k5Po7P8J0m2J4N0Rk0kK4k4n8P6
7611C5pk8Qnl0L8k5NO9q1pM3r0Q0lJ2m3N7n8j9L7L0Jk0J1jj3K1rOK1k1K8p6N3
7646A9K2j8l9KL8km2%n4M7QN3J6j8J9p4J8QL2l8j6N0l7K9j6K5k7k7Q2q8M0oJ1
7679A7ql6P7l4Rqk5Nj1N7l5j0KO5q4Q1n8RL7o3K1m3M7l9J9J7k4K5Kl2M0l8M5j11
$$ plain form
7437 19 -11 33 42 11 -11 -4 17 0 17 19 -31 -5 -4 21 -42 -34 -17 -13 -3 11 22 -25 1 -12 -2 -42 -20 11 31 10 -58 -29 -31 -2
7471 -2 -24 -25 -18 20 31 22 -24 -14 8 14 25 22 -18 -20 -18 -9 24 -24 -9 61 44 -11 34 4 11 22 22 -28 1 -19 -33 -8 16 -23 -15 -4
7507 -4 -12 -36 2 -6 22 -15 -8 -14 10 -2 15 30 16 39 6 -20 -11 37 32 -22 46 12 11 -5 -7 32 31 -39 -7 18 2 25 19 7 -40 -39
7543 -39 -36 -7 -29 32 -5 18 7 6 44 38 9 -18 10 31 5 -73 15 -10 0 0 17 19 1 67 -19 -3 11 -10 -3 27 10 38 -9
7576 -9 -1 -7 40 -24 50 -21 -27 -2 -17 -14 -54 -43 27 -39 42 -31 17 26 32 5 -20 -13 -80 -2 8 -34 -20 30 39 19 17 41 17 -41 35
7611 35 28 0 8 3 -27 11 -14 -9 60 -21 -28 15 -75 5 2 14 -29 28 -30 -49 -12 18 19 -1 10 9 -4 17 8 14 35 14 42 -34 19
7646 19 41 23 -16 -14 24 22 -20 -20 -74 -27 -19 34 50 32 51 -23 -5 3 35 -3 -19 31 -6 23 7 32 5 -22 60 -28 12 6 17
7679 17 9 -27 50 16 25 17 -8 -3 -14 43 8 -2 0 65 -19 62 4 13 50 -13 8 -35 12 -27 -8 9 -15 10 12 -20 20 -18 27 -84
7713h4R2lj0K4N8q3oN3k2K5m8l0N0o9OL9k5l1N5L4m7Q2n5l0P8k6KJ6l9m2K4J8
7745FK6K1n6K2J9Pp3kP2o4j0O3k8j4kJ2k1J3J6l9Qj7K7J1Pl8MK2K9j3m9K7l6K3
7779b7J0%P9p3L9l5M1l0j5OK8Lk3l2k7O5L2l5n0k1P3l3K7l4LK9j1orL7J4L0k5
7812C0j5k0m6N9k4M5K6k7l2MJ9K6j7j2L0q3L9Rn6L8l1O4j4J6m5l8K7N7K0o5l%
7844a9L4k4KJm2P0K2m7k0PJ6J4n4N3n1N7k2l7k7P8k8L7Lm6j4M7M2l1j5j0M2j2
7876B6oj3P%l7lM6j8L0l8nL7k5n2M1N3p5Q2l4k5Ml4J6L5j3L8l1Ol0N6l1K5k2m1
7910c1J5J7l8L8k5M5J0m9P0k1rJ4n5K0M3n6L4m1K5J2lk0j7N4q6J8N5m9J10n9k4
7941cJ8n2K3m5N3K5l4M7l0l5P6j6k8L8m8M7k9K2j7k8Mj2L5j3k3J7l0MmK2K0k1
$$ plain form
7713 -84 8 5 -5 19 77 -6 -12 41 19 44 -4 -34 16 -53 -47 -8 -33 -64 -9 25 -22 60 5 -25 53 27 29 45 6 -36 -12 6
7745 6 32 53 -3 19 38 45 -28 -30 42 -22 -32 31 3 -11 -13 -1 -22 -9 7 -32 -24 -41 -14 -3 4 -34 -30 -8 21 8 -41 -14 -50 -27
7779 -27 -17 -17 62 -11 28 -7 34 4 -11 -5 23 26 3 -29 -56 9 41 6 -44 -65 8 -25 2 -32 -29 0 -11 -17 -26 11 25 55 30
7812 30 15 -5 -51 8 -16 29 55 28 -4 0 19 45 28 16 46 -37 2 11 -45 -7 -38 26 12 28 -17 -55 -28 29 49 -16 -19 -19
7844 -19 15 -9 -7 -6 -48 22 44 -3 -23 -16 0 14 -40 13 -38 19 -3 -40 -67 11 -17 20 23 -23 -37 10 52 21 6 -4 38 26
7876 26 20 7 14 14 -23 -26 20 2 32 -6 -11 26 1 -51 -10 43 -32 50 16 -9 -5 -39 -23 12 -1 37 6 12 -18 38 7 32 10 -31
7910 -31 -16 1 -37 1 -24 21 31 -18 52 31 22 36 -19 1 44 -12 22 -19 6 18 15 -5 -22 32 -54 -36 19 -30 80 21 -3
7941 -3 15 -37 -14 -59 -6 19 -15 32 2 -33 43 27 -1 37 -11 36 7 29 12 -16 -12 -24 11 -2 -25 -8 -38 -34 -38 -16 4 -17
7973a7J3k0K1J7j2L1rn8L9l4k8L9k7N3L0k6o5J3M9k0O4n1l3J1PJ5nk1K1p0J16
8004D3m5l8JqO4n4L9k7M1l3K6k4k3K0J7lL8p8K8k5K8M3o1K7J2q8P1J7m8N7L9m0
8036A6j0N0p4K0N9j6nk1l7M4m7M0rk5k7L9Oj7O8m8J6J3l6M2n0j3J7LJ7Nk9l0p
8069d6L0l7L2M1M2o9k9P0n1J0K8J0rJ9k8Lk0l9K3rM7n8L1J9j8k9J1J2qL1K3l5
8101cM4m9J4j9M0n0L6J2m4J2k7L0j3L0rrrL7J1J3oo3j2L4j8N7l7L5mo7L6nL5k4
8135Hj1O8p3kK6l3M2r1O2km0K7L1K2qk4Jn9J8N9k7j8ML7k9J8L3j9j1m0N0j3O0
8168F6r6L8k9K1pJ9m1M9j6k9O1nn0M7m2kL6k9M5K7n2j7N3
$$ plain form
7973 -17 -4 -24 -3 14 2 33 24 -34 5 -29 -57 -18 -45 8 38 12 -53 -40 9 -11 53 2 -31 -20 -13 2 -3 -24 -3 -73 43
8004 43 -2 -40 -39 -47 17 -37 2 -25 16 -17 9 -15 -38 -18 -1 -4 34 -44 -16 -41 -13 30 -31 -4 8 -80 -9 8 -40 17 56 16
8036 16 6 56 -18 2 61 45 40 19 -18 26 -21 19 10 -15 -42 -3 3 -14 54 6 22 35 -1 41 -9 -22 -5 -2 15 20 -9 -39 -46
8069 -46 -16 -53 -21 20 62 -7 -36 34 -17 -7 21 31 22 41 13 16 -4 -43 -20 -29 18 -40 -9 10 -8 -37 -26 -14 -22 9 32 -3
8101 -3 41 -8 6 -13 27 -23 13 25 -19 -7 -34 -4 -17 13 4 -5 -14 23 34 47 41 -22 -34 0 -18 39 2 37 33 -34 2 -3 32 8
8135 8 -3 65 -8 -10 16 -17 25 -66 -4 -6 -46 -19 12 34 26 2 3 -56 -38 21 -6 -24 -20 17 -12 6 39 20 9 -31 19 6 66
8168 66 -30 8 -21 0 -7 12 -29 20 4 -25 36 31 -19 28 -14 -16 20 -9 36 63 11 -6 47
8191D7
$$ Imaginary data points
##PAGE= N=2
##DATA TABLE= (X++(I..I)), XYDATA
0@%%%%%%%%%%%%%Qj6J6j6J6j7K5l2M0m8N6o4P2q8J02j16J34j52J70j94K19k46
35a31K78l16L55l95M42m91N46o07O74p45Q22r09J003j105J217j341J477j627J795
54I42j982K192k431K705l022L393l835M374n045N909p074Q730j1289J5810k6118
69a6741R2064M926j75728N1843P6907J0696k4324l6267o8850L6619Q7932N006
81D4083n5522j7409q244L7152P3391j4988j05573j4218P1665K8657j7022j9694
93B278m5393p459P6354N1455n5132o9757Q08N7982M7026k8009p8456j7873N6833
106i343M2353n258k9502l9214L806P0073M1218n2792o3557O442N1167L2604k4547
119B3450n8080j6375M0746L6028J685k3617m0424o842N9288M3464m1996n9611
$$ plain form
0 0 0 0 0 0 0 0 0 0 0 0 0 0 0 8 -8 8 -8 8 -9 16 -16 24 -24 32 -32 40 -48 54 -62 72 -80 90 -104 115 -131
35 -131 147 -169 186 -209 233 -258 288 -319 355 -390 432 -477 526 -579 638 -703 774 -853 942
54 942 -1040 1152 -1279 1426 -1596 1797 -2038 2336 -2709 3200 -3874 4856 -6433 9377 -16741
69 -16741 75323 80249 -95479 -43636 33271 43967 19643 -16624 -85474 -48855 39077 44083
81 44083 -11439 -28848 -37092 60 73451 58463 -47110 -61328 10337 38994 21972 2278
93 2278 -43115 -50574 25780 77235 22103 -47654 -46846 11136 58162 30153 -48303 -66176 -9343
106 -9343 33010 27752 -1750 -40964 -37158 32915 74133 21341 -42216 -35774 15393 47997 23450
119 23450 -34630 -51005 -10259 25769 27454 3837 -36587 -43429 15859 59323 17327 -42284
131d2284N06M5711M1479q247n8518k7293M6331M4745r112l1641l2269q826M6664
144G246M1613l9182n7192P826M0024K7985P503l7888m7203K9721O9473r62n6142
157g178l0330J0062L7761L3855k7282o0598J113N3999K5229j4904l0041k8693
169c7007J3979N4670J2432n1473l7157J7935M0887K4700k0273m8777q135M8084
181I865L4695j8666m0830k1469K0676M3185O435m2896l1687J5658L7303K1645
193C3914j7202m1967r951M0325L4223j3939l9086k1386K0514M2206O621m0007
205e735k8958J4468L2151J8812j4168l9970j3035L6840L2684j1625l2593k1213
217c2342J2787M4359J7306m3061l7918K0007L6983J0760j6586l4633j4459L6930
$$ plain form
131 -42284 -41778 3933 45412 37165 -21353 -48646 -2315 42430 33318 1677 -30592 -39418 7246
144 7246 48859 9677 -47515 -39689 335 28320 35823 -2065 -49268 -19547 49926 48964 -7178
157 -7178 -37508 -27446 10315 44170 16888 -43710 -42597 11402 36631 21727 -8314 -37007
169 -37007 -23028 31642 44074 -7399 -44556 -26621 14266 38966 18693 -30084 -38219 9865
181 9865 44560 25894 -14936 -36405 -15729 27456 33891 -9005 -40692 -25034 12269 33914
193 33914 16712 -25255 -35206 5119 39342 25403 -13683 -35069 -14555 27651 34272 -5735
205 -5735 -34693 -20225 11926 30738 16570 -23400 -36435 405 33089 21464 -11129 -32342
217 -32342 -19555 24804 42110 -951 -38869 -18862 18121 28881 12295 -22338 -36797 133
229A33L5791j8765l4132n743J2518K4786K0096k5805m3772Q660M2212J1520j9660
242G839k5322j4558K2979M2128l405m3470j6592K2758K8062J0512k4011m0112
254c3192K909M4695J7634k6692k7769l814K2888L2708j438l9017j9454K3081K8274
267B0813M214k2918l1197K188L7988J8057k2431k4040l057J5933K8412O696l5285
280d627k8897J9648L4515N017k4783k9740L21L7932K4590k4020l2610J303K3945
293B594K1457r13k9450k3433J7412L1614L273k2769k2473M67K8389K2992j5449
306A3711l1350n922K0968K3693J765k8759k5449J6485L4508N005k3326k1923p3
319b0667K6824K4698j5261l5410n428K4719K0895j457k4985k3557J3975L5764
$$ plain form
229 133 35924 17159 -16973 -22716 -10198 14588 34684 8879 -34893 -26233 15979 27499 7839
242 7839 -17483 -32041 -9062 33066 29661 -13809 -30401 -7643 20419 30931 6920 -33192
254 -33192 -30283 14412 32046 5354 -22415 -26229 -3341 29367 27929 -11088 -30542 -7461 20813
267 20813 25027 2109 -29088 -26900 11088 29145 6714 -17326 -20383 -4450 23962 30658 -4627
280 -4627 -33524 -13876 20639 25656 873 -28867 -28546 9386 33976 9956 -22654 -21351 2594
293 2594 24051 23138 -6312 -29745 -12333 19281 22554 -215 -22688 -22221 6168 29160 13711
306 13711 -17639 -23561 -2593 21100 22865 -5894 -31343 -14858 19650 24655 1329 -20594 -20667
319 -20667 6157 30855 15594 -19816 -25244 -525 20370 18913 -6072 -29629 -15654 20110
331B0110N508k6864j9424M560K1688J9815j0338l2239q231K4834K0841l310k0734
344c784k0086P854L2533J1085k6141k4075M750K2918J8127r424l1084r456K6546
357b37K2791o669k0786j4785O652K7172J2220k3231k5420M532K2478J5746p184
370A3279k7380j2701K4023K6439o307k4237j3125Q512K3910J1648k0847k5419
382b2205M823K3992J3443q229k2606j1882J8671K5649l269k4640j4710Q276K2917
395A0230J1992j8386k5749L441K5384J4487r074k2439j1400J7808K5194l625k4994
408g131j3332Q806K0627J2150j5679k6361K123K6457J3459j0760j9895j0885J4211
421f210K5834j106k6659j2545J2177J7516R792j0176k5372l883K7251J6594j4426
$$ plain form
331 20110 25618 -1246 -20670 -16110 5578 25393 15055 -17184 -25415 -581 20260 16950 -3784
344 -3784 -23870 -16016 16517 27602 1461 -22614 -17864 5054 23181 13757 -17327 -26783 -237
357 -237 22554 15885 -4901 -19686 -13034 14138 26358 3127 -22293 -17761 4717 20463 13279
370 13279 -14101 -26802 -2779 23660 17353 -6884 -20009 -11497 12413 24061 3214 -22205
382 -22205 -17382 6610 20053 11824 -10782 -22664 -3993 21656 18387 -6253 -20963 -12687 10230
395 10230 22222 3836 -21913 -18472 6912 21399 12325 -10114 -21514 -3706 21488 17863 -7131
408 -7131 -20463 -11657 8970 21120 5441 -20920 -18797 7660 21119 10359 -9536 -20421 -6210
421 -6210 19624 18518 -8141 -20686 -8509 9007 18799 8623 -16749 -20632 6619 23213 8787
434H787k0585o851J1266K2953M268k6237j7334J5837K1025L665j0605j8777o641
447a9229K2439K0558j3798k4451k708J3600J5697N247j8031k1265R430K6293N236
460A9018j6690j6412k460J7002J9758p521k6090o112J8644J6148m02j4958j6486
473a6561L502K3195J0537j7563k0799J020J8725J4850o156k0787q749J5422J9786
486A6422M2j8250j4640N797J9733R280j3758k0437j323J9558J5562p696j9809
499i519p288J2572J7808K655j7562j7419O418K1991P909j4538j7033n43J6615
512B066J5699n305k0560q395J3170J6325J446j5254j6841L449K2107J0314j5465
525B756j7900J707J5869J3161l378j8441j0755J2627J8858L16j6609j3871M040
$$ plain form
434 8787 -11798 -18649 -7383 15570 19838 -6399 -23733 -7896 13129 16794 6189 -12588 -19229
447 -19229 3210 23768 9970 -14481 -17189 -3589 12108 17355 -676 -21941 -12511 13782 19018
460 19018 2328 -14084 -16544 458 20216 12695 -13395 -19507 -863 15285 14883 -75 -16561
473 -16561 -13059 10136 20673 3110 -17689 -16669 2056 16906 10750 -10037 -18786 -3364 16422
486 16422 16464 -1786 -16426 -10629 9104 18384 4626 -15811 -17134 2424 17986 10290 -9519
499 -9519 -16807 -4235 13573 16228 -1334 -18753 -12335 9656 17565 3027 -14006 -14549 2066
512 2066 17765 12460 -8100 -16495 -3325 13000 14446 -808 -17649 -14200 7907 18221 2756
525 2756 -15144 -13437 2432 15593 12215 -6226 -16981 -4354 14504 14820 -1789 -15660 -11620
538a1620J8491J0595j2726j9322r4J6933J2549m957j6717r637J0683J8780K340
551A5298j6706j4157N510J8035Q706j1554j7261j750J5053J3510m125j7699r774
564a6914J1286J7793J681j5302j3568M075J7839R738j1726j7454m15J4970J1945
577A3948l121j5861j0797J0075J8545J316j6362j2086M234J4948R928r123j8392
590a2748j896J6684J2106m874j4011r092P639J7968L697j6824j3278N754J4530
603E655P689p307j6708m731J6001J4295n921j5603o704P725J5278M776j4447j4713
617a4715N477J6133O473q097j4054m710J2869J4883m132j6842p239Q981J3995
630I022L797j2323j4392L455J6847P549r424j3826l083J1950J3582k891j6118
$$ plain form
538 -11620 6871 17466 4740 -14582 -14676 2257 14806 9849 -6868 -16505 -5822 12958 15298
551 15298 -1408 -15565 -10055 7980 16686 5132 -12129 -13879 1174 14684 10559 -7140 -16914
564 -16914 -5628 12165 13846 -1456 -15024 -10949 6890 16628 4902 -12552 -12967 2003 13948
577 13948 10827 -5034 -15831 -5756 12789 14105 -2257 -14343 -10109 4839 14767 5644 -12748
590 -12748 -14644 2040 14146 9272 -4739 -13831 -6192 11776 15473 -1351 -14629 -8875 5655
603 5655 13344 6037 -10671 -15402 599 14894 8973 -6630 -13334 -5609 9669 14445 -2 -14715
617 -14715 -9238 6895 13368 5271 -8783 -13493 -624 14259 10127 -6715 -13954 -4973 9022
630 9022 12819 496 -13896 -10441 6406 13955 4531 -9295 -12378 -428 13154 10263 -5855
643e855p885R249J3883K797j1596j3231K310J5695Q413r186j4334k535J1840J2646
657A2211k491j5164p853R041J3611K465j0985j2245J518J4588Q763q589j4361
670i491k673J1699J2271k151j4694q057Q679J3691K060j0975j1479J613J3748
683D241Q576p926j3782k638J1068J1681j591j3790q693P981J3803K358j0921j1237
697a0870J380J3407Q808p732j3978k083J1109J0423j689j2226q593O562J3782
710H300L063j0943j1018J661J2585Q535o722j3893k908J1267J0637k369j1923
723c728p585O032J2729L551j0194j1154J576J2365Q142o448j3086l134J0526J0623
737A0215j920j1919p690O291J2582K995j0051j0191J589J1267P730n522j2519
$$ plain form
643 -5855 -13740 -4491 9392 12189 593 -12638 -10328 5367 13780 4594 -9740 -12275 -435 12211
657 12211 9720 -5444 -13297 -4256 9355 11820 835 -11410 -9892 4696 13459 4870 -9491
670 -9491 -12164 -465 11806 9655 -5039 -13096 -4417 9274 11334 359 -11120 -9507 4241
683 4241 12817 4891 -8891 -11529 -461 11220 9629 -4161 -12854 -4873 8930 11288 367 -10870
697 -10870 -9490 3917 12725 4993 -8985 -11068 41 10464 8775 -3451 -12044 -5482 8300
710 8300 11363 420 -10598 -8937 3648 12183 5461 -8432 -11340 -73 10564 8195 -3728
723 -3728 -11313 -5281 7448 10999 805 -10349 -8773 3592 11734 5286 -7800 -10934 -408 10215
737 10215 8295 -3624 -11314 -5023 7559 10554 503 -9688 -8099 3168 10898 5376 -7143
750g143l600R973J0517j492j1394p871N580J2773L626j0450j0629K187J1387O950
764A0414n510j1785l497R551J0345j641j0939p071N027J1629L900r294j0585J397
778h059J0909P165m923j1496m187R164J1021j361j1495o951N407J1350L707r066
792A185j0476J561J1128O321n226j0380l747P995J0336p79j0827o778M810J0280
806E403M062p446j0606J8J1331P641n365j1088l442Q258J0148q47j1207o789N823
821d106R970K323p175q777qR591P385m320j0267l302P220R206L99r554p914M253
837e076J0841L519p968r414L08R686P273m452j0731l091Q011Q800q57r013o267
852h431L963R607L472o845q771Q2Q771O725l549r699m087O603R136L43r070p499
$$ plain form
750 -7143 -10743 -770 9747 8255 -3139 -11010 -5430 7343 10969 519 -10110 -7923 3464 10414
764 10414 4904 -6881 -10378 -827 9518 7877 -3062 -10133 -5106 6523 10423 1129 -9456 -8059
778 -8059 2850 10015 5092 -6404 -10591 -1427 9594 8233 -3262 -10213 -4806 6544 10251 1185
792 1185 -9291 -7730 3398 9719 4493 -5887 -9634 -1639 8697 7918 -2909 -9687 -4877 5403
806 5403 9465 2019 -8587 -8569 2762 10403 5038 -6050 -9492 -1234 8914 8067 -3140 -9929 -4106
821 -4106 5864 8187 1012 -7765 -7773 1818 9203 4883 -5384 -8686 -1466 7740 8139 -1415 -9329 -5076
837 -5076 5765 9284 1316 -8098 -7790 1896 9169 4717 -6014 -9105 -1094 7706 6849 -2164 -8431
852 -8431 -4468 5139 8611 1766 -7005 -6923 1848 8573 5024 -4675 -8762 -2159 6977 7320 -1750 -9249
868i249L724J0451L994p323r258N36R547O607m302r543l159O867Q144l69q325
883a658o309L045Q879L946n943q825p61Q670P343l317r738l829O715R080K50q887
899a339o995L899R632L026o893q072Q6P860O265l167q981l492O213Q219L51p595
915i83o582K816R217M057o524q455NP977O207l135q904l758O257Q220k21p868
931a674n914L057Q401L514n802p818q2P672N964k689q151l629N579P826L11p712
947a147o152K685Q176L568n660p901m8P458N962k605p876l521N410P708M28p340
963h55n796K432P679L776n129p941n63P396N818k729p687l500M851P641P63p271
979a115n780K813P609L335m566p170j149O806O200k404p908l674M777P284R34
$$ plain form
868 -9249 -5525 4926 8920 1597 -7661 -7125 2422 9029 4727 -4816 -7975 -1108 7036 6667 -1658
883 -1658 -7967 -4922 3957 7903 1960 -6865 -7626 1044 8387 5070 -4668 -8497 -1782 7298 7548 -1339
899 -1339 -8334 -4435 5197 8223 1330 -6742 -6656 1204 7469 4302 -4679 -8171 -1958 6261 6612 -983
915 -983 -7565 -4749 4468 8525 2001 -6454 -6449 1528 7735 4600 -4304 -8062 -1805 6415 6194 -1674
931 -1674 -7588 -4531 3870 7384 1582 -6236 -6318 1354 7318 4629 -3522 -7151 -1572 6254 6565 -1147
947 -1147 -7299 -4614 3562 7130 1470 -6431 -6479 979 6941 4336 -3540 -7061 -1651 6057 6485 -855
963 -855 -6651 -4219 3460 7236 2107 -5834 -6397 999 6817 4088 -3599 -7099 -2248 5393 6156 -1115
979 -1115 -6895 -4082 3527 6862 2296 -4874 -6023 783 6983 4579 -3329 -7003 -2226 5058 5992
994E992o911o138K543P989L269n003o876n85O612N721k266p395l389M659O876
1009E098Q29o351n932K045P406L379m681o952r28O307N980k021p403l390M901
1024a713O854P34o219n567K036P211L126m722o672n69N845N270j756o868l348
1039f358M375O600P56n690n367J598O839L671m253o753q25O025N384j883o841
1054b722l431M339O436N03n940n043J837O376L240l813o163q58N632N325j535
1069D183o318l441L662O348J053n678n465J477O541L294l913o331p48N514N082
1084E260j493o160l285L797O178R58n353m919J423O075L225l605o082j086N144
1099G7M939j520n965l289L362O097J258n182n031J586O188L150l609n744r05M868
$$ plain form
994 5992 -919 -7057 -4514 3475 6744 1741 -5135 -5720 892 6613 4347 -3048 -6437 -1778 5098
1009 5098 5927 -424 -6356 -4311 3095 6474 1793 -5159 -6087 220 6200 4179 -3224 -6614 -1713
1024 -1713 5141 5875 -344 -5911 -3875 3336 6462 1740 -4932 -5501 344 5614 3858 -3010 -6358
1039 -6358 -1983 4617 5373 -317 -5684 -4086 2753 6424 2171 -4582 -5407 618 6002 4119 -2722
1054 -2722 -6153 -1814 4622 5125 -815 -5858 -4021 2355 5595 1782 -4381 -5239 393 5718 4183
1069 4183 -2135 -5576 -1914 4434 5487 -191 -5656 -4179 2362 5656 1743 -4588 -5336 178 5260
1084 5260 3767 -2393 -5678 -1881 4297 5255 -98 -5017 -3594 2481 5706 2101 -3981 -5067 77
1099 77 5016 3496 -2469 -5758 -2396 3701 4959 -223 -5254 -3668 2520 5670 2061 -3683 -4588 280
1115B80M821j291n946l292L394N796Q66m951m682J176N687L179l209n605r33M792
1131H2M790j036n490l265L094N772J068m950m797J220N367K908l018n475j249
1146d979M620M876j007n485l141L322N502J041m563m502J052N246K894k883n159
1161c166j360M175M607p20n294l387K845N463J290m478m454R75N134L222k665
1176B187n221j215M343M532r77n243l046K655N004J010m112m278O91M937L157
1191D424k353m984j397M101M600p57n014l180K639N025J220m108m316P86M838
1206A524K877k524m827j347L954M147o87m657k917K496M681J364l624m095M99
1221c136M578L035k310m854j441L755M113o32m588k937K293M710J428l673m068
$$ plain form
1115 280 5101 3810 -2136 -5428 -2034 3762 4628 -323 -5005 -3829 1858 5037 1828 -3777 -4710 82
1131 82 4872 3836 -1654 -4919 -1825 3947 5015 65 -4732 -3512 1855 4763 1745 -3730 -4979
1146 -4979 -359 4517 3510 -1975 -5116 -1794 3708 4749 186 -4316 -3264 1982 4876 1993 -3166
1161 -3166 -4526 -351 4256 3536 -1758 -5145 -2300 3163 4453 -25 -4479 -3504 1630 4852 2187
1176 2187 -3034 -4249 94 4626 3649 -1594 -4640 -1985 3019 4029 -83 -4361 -3670 1267 4424
1191 4424 2071 -2913 -4310 -209 4391 3634 -1380 -4560 -1921 3104 4324 216 -4100 -3314 1524
1206 1524 4401 1877 -2950 -4297 -343 3804 3117 -1540 -4457 -1961 2720 4084 460 -3635 -3136
1221 -3136 1442 4477 2167 -2687 -4128 -373 3740 3108 -1480 -4417 -2124 2586 4014 341 -3727
1236c727O57M459K758k192m495j372L396M067m27m317k925K100M559J480l466
1251E55m062L38M305K909k089m433j404L303M041k90m224k868K012M370J420l381
1267E02l962L82M049K681j782m095j593L113M095j2m229k866J928M209J315l245
1283D90l876J52L868K820j712m002j389L015L895J02m016k992J910M221J137l115
1299E08l661J31L676K766j516l954j583K868L883J6l956k885J827M059J190k959
1315D10l379K01L495K789j356l846j632K764L637m7l876k889J692L857J148k688
1331B80l205R6L269K836j152l641j629K613L666M6l754k779J645L608J116k619
1347C96l166j61L112K846j131l678j639K707L556J14l425k673J583L639J112k545
$$ plain form
1236 -3727 -3070 1389 4147 1955 -2540 -3912 -516 3551 3124 -1193 -4118 -2018 2541 4021 555
1251 555 -3507 -3169 1136 4045 1956 -2477 -3881 -578 3463 3173 -1051 -3919 -1907 2463 3883 502
1267 502 -3460 -3078 971 3652 1870 -2225 -3818 -705 3390 3378 -851 -3717 -1789 2420 3735 490
1283 490 -3386 -3234 634 3454 1742 -2260 -3649 -634 3261 3363 -653 -3645 -1735 2486 3623 508
1299 508 -3153 -3022 654 3420 1904 -2050 -3633 -765 3118 3134 -822 -3707 -1880 2179 3369 410
1315 410 -2969 -2768 727 3516 2160 -1686 -3318 -554 3083 3036 -840 -3729 -2037 1820 2968 280
1331 280 -2925 -2829 440 3276 2124 -1517 -3146 -533 3133 3179 -575 -3354 -1709 1899 3015 396
1347 396 -2770 -2931 181 3027 1896 -1782 -3421 -714 2842 2956 -469 -3142 -1559 2080 3192 647
1363F47l022j28K730K648q33l747j794K616L514q9l325k298J319L405J305k278
1379F70k951j21K820K563p46l396j874K318L483o7l378k346J206K994J314j922
1395E67k993l78K964K748q31l361j492K396L214j01l136k325J214K854J143j874
1411F09k843n45K751K791q68l566j396K516L055k58k779j862J048K608J302j579
1427I84k776n66K563K508p32l353j695K148L168j49k894j897J162K624J359j363
1443A091k874n92K732K524j039l102j337J814K848J67k737k056R91K646J288j527
1459H37k702p29K697K546j153l003q79J969K295K26k004k052N16K440J448j452
1475A000k711q94K339K637p78l131j179K231K413J3j888j781L63K246J618j347
$$ plain form
1363 647 -2375 -2503 227 2875 2042 -1705 -3499 -883 2631 2542 -783 -3081 -1762 1643 2948 670
1379 670 -2281 -2402 418 2981 2235 -1161 -3035 -717 2766 2699 -679 -3025 -1819 1175 2489 567
1395 567 -2426 -2804 160 2908 2077 -1284 -2776 -380 2834 2733 -403 -2728 -1514 1340 2483 609
1411 609 -2234 -2779 -28 2763 1895 -1671 -3067 -551 2504 2246 -533 -2395 -1347 1261 2563 984
1427 984 -1792 -2358 205 2713 1981 -1372 -3067 -919 2249 2100 -794 -2691 -1529 1095 2454 1091
1443 1091 -1783 -2375 357 2881 1842 -1260 -2597 -783 2065 2232 -505 -2561 -1570 1076 2364 837
1459 837 -1865 -2594 103 2649 1496 -1507 -2386 -417 1878 2104 100 -1952 -1436 1004 2452 1000
1475 1000 -1711 -2605 -266 2371 1593 -1538 -2717 -486 1927 1940 52 -1729 -1366 880 2498 1151
1491A151k857p91K361K403p14k911j259J982K542J09k246j728O34K214J197j234
1507H53k525o50K245K327p57k563j006J583K153L81j886k010J87K408J415j411
1523G44k510n42K256K154n96k544j015J704J955J79j473j836k46K266J788j379
1539I05k720n06K325K041o42k357j101J550K170O8j806j436J04J815J590r45k606
1556a551o29K230J968p28k081j012J117K039M85j695j939M00J976J285j068k142
1572a345n75J866J900m53k117r67J078J786O47j511k049o4K388J501j415k309
1588a639q7J856J536m61j730j180R76J935M23j442j651%J838J566j020k324l29
1605a733J806J549m18j658j206P23K109N88j720j708M17J731J165q20j940o26
$$ plain form
1491 1151 -1706 -2497 -136 2267 1553 -1358 -2617 -635 1907 2016 -230 -1958 -1324 890 2087 853
1507 853 -1672 -2322 -77 2250 1493 -1070 -2076 -493 1660 2041 155 -1855 -1668 740 2155 744
1523 744 -1766 -2308 -52 2102 1506 -1038 -2053 -349 1606 1785 312 -1524 -1770 496 2284 905
1539 905 -1815 -2321 4 2045 1403 -954 -2055 -505 1665 1733 -73 -1509 -1405 410 2000 1055 -1551
1556 -1551 -2180 50 2018 1290 -791 -1803 -686 1353 1838 143 -1796 -1396 580 1865 797 -1345
1572 -1345 -1920 -54 1846 1393 -724 -1691 -613 1173 1820 309 -1740 -1804 584 2085 670 -1639
1588 -1639 -1726 130 1666 1205 -525 -1705 -729 1206 1629 187 -1464 -1464 374 1940 920 -1404 -1733
1605 -1733 73 1622 1204 -454 -1660 -937 1172 1760 40 -1668 -1251 480 1645 825 -1115 -1741
1621a741J680J689m87j733r06O55J706Q67j502j848K95J956J008j023j584n60
1637a528J304J655q3j843j121Q77J696O01j230j776K3J858J328j100j755l10J235
1654a69J479m1j613j179P31J762N69j294j574l1J671J244p71j841m62J380J491
1671A352k23j478j191P42J790M79j347j464K08J515R97n80j647o28J342J494j88
1688A173j536r72O04J454P69j208j759L53J703P68r08j169l80P80J462P8j559
1705c47j062Q37J380L65q62j348k76J537J356r08j710j90J217R94p0j144r99N24
1723g06J490L72r95j110l2J060J084k88j501p25J021J477%j445j004O29J529L83
1741A239j047j207K9J156J007n28j369n68J018J188N8j164r28M18J403O77j021
$$ plain form
1621 -1741 -61 1628 1141 -592 -1498 -843 863 1730 228 -1620 -1325 631 1639 616 -968 -1528
1637 -1528 -224 1431 1348 -495 -1616 -739 957 1558 328 -1448 -1425 433 1761 661 -1094 -1404 -169
1654 -169 1310 1269 -344 -1523 -792 970 1539 245 -1329 -1360 311 1555 784 -1057 -1519 -139 1352
1671 1352 1129 -349 -1540 -798 992 1471 124 -1340 -1132 383 1380 800 -847 -1475 -133 1361 1173
1688 1173 -363 -1335 -731 723 1492 284 -1475 -1122 581 1349 441 -728 -1108 -328 1134 1212 -347
1705 -347 -1409 -572 808 1173 311 -1037 -1313 224 1580 672 -1038 -1228 -11 983 913 -231 -1230 -706
1723 -706 784 1156 161 -949 -981 79 1163 875 -626 -1351 -330 1147 1147 -298 -1302 -673 856 1239
1741 1239 192 -1015 -986 170 1177 649 -720 -1288 -270 918 976 -188 -1116 -698 705 1382 361
1758C61j395n5J259R31m75j332o93R61J584j0j442q45Q41J120L02q00j147k41
1776a076J157J176p76j454j22J064Q62M1p28r76K27J321M99j012j063j55Q97R67
1794H49q1j533p14J474J368n52j142l22M00O83N20p07j171k1R65O60k66p29n89
1813i08M79J278K99j123r26L26R52O40o28j405j54J368R27p43r46j67O28P82K24
1832I03q66q39K29Q22M84l46r73n45R18J311l19j367m14Q21R00J27p93j029J46
1851h30J375N51j018r05K30O86O09n7r25q04P32J228j17r01n72K91P53O78n28
1870D76j215j69J107O23n28q05l32L67J038M50r82r63M43J183J73p29p42j33O86
1889e2P16l45p92k68N43P03K49o00o54M5P78M27m46q69l16P15Q71j20j061l80
$$ plain form
1758 361 -1034 -1089 170 1101 626 -706 -1399 -438 1146 1136 -306 -1151 -310 810 1112 312 -835 -1076
1776 -1076 81 1257 481 -973 -1095 -31 831 872 144 -832 -605 716 1215 203 -860 -1015 -118 849
1794 849 768 -765 -1479 -5 1363 811 -331 -653 -253 430 950 243 -928 -949 16 676 410 -319 -908
1813 -908 -429 849 1148 25 -901 -575 377 1017 389 -1016 -1170 198 1125 382 -564 -731 -103 679 903
1832 903 37 -802 -573 249 733 387 -586 -1131 -213 1098 779 -588 -1002 -181 719 846 53 -976 -830
1851 -830 545 1096 78 -827 -597 89 698 641 -284 -1088 -356 872 755 -146 -718 -427 326 1004 476
1870 476 -739 -908 199 822 294 -511 -843 -476 562 1012 30 -933 -490 693 866 137 -605 -738 -52
1889 -52 664 319 -473 -741 -198 505 754 154 -500 -455 323 750 304 -565 -881 -166 705 585 -476 -856
1909h56P73P72qo72n61J12P79L13n73o56n0M48N86J87o33q01M66J139J3r41m85
1930f48K65M92M40j46r35l14R73O66n27n94m0O4N00N36n49j050K05J127K56n63
1950A58m06k75L24R00K0j203m22Q90M08j93j10l19l78O77R25m84j041P5N30K91
1970C67k4n11p25L78J082J1p14k85K33M31L84j94p84k37N22M08r3l90n55J79Q84
1991C67M07o16n96K01N46L73l48q16k14O62M26k71l37k12J33N80N32n69p78J56
2011c74O96J73l51n14l67M11P73rp48l02N80N09m5k89m66m0M56L59l24n47o8M00
2033h7M01J63m81n97K90Q66J5p15l83L19L00J19om06k20L89M47on17k42L5M89
2055A73L13m49n04L6N48K65j37l57k57K52N29m6n07k49J65L13K68j98m43r4M66
$$ plain form
1909 -856 -83 689 681 9 -552 -440 339 652 79 -577 -627 -179 407 594 -39 -840 -374 765 778 -163 -648
1930 -648 -383 109 549 403 -532 -846 127 793 266 -328 -368 -304 196 732 183 -867 -662 465 721 158
1950 158 -248 -523 -199 701 721 -482 -904 -14 394 201 91 -228 -606 71 996 512 -529 -454 76 367
1970 367 343 -168 -893 -515 567 578 -136 -421 -188 243 627 433 -351 -588 -66 342 249 -141 -696 -517 367
1991 367 774 158 -438 -237 309 682 334 -482 -696 -34 392 121 -216 -428 -295 285 817 248 -530 -374
2011 -374 322 495 144 -370 -737 -326 447 438 -310 -612 -32 477 432 143 -323 -363 93 452 128 -419 -487 -87
2033 -87 314 477 -4 -601 -311 555 570 -145 -528 -209 91 210 204 -202 -422 -33 414 408 -109 -351 -316 173
2055 173 486 37 -467 -431 117 382 245 -112 -369 -117 412 366 -141 -390 -225 88 356 158 -285 -379 87
2076H7L21j30l45k77J46N13J55o97l48L85M50jj72k27j98L65M81j75n03k57J99
2097b28M48K27m46n80K34P29J12n66k49J60L26J62j07l36k71J99M13O4l48l76
2117d33K22M38K35k88m97R9L86K47k38l29j92K95L67j3m07k64K64L76l8j63k23
2138a56j36K27K86M3l55l13K14M84M8m64k84L52L00r5j06p4j62M9M03j4l24k11
2160b88J39L45J62k96l89J11M55P9l45j18L8pK77J92m43k92K85M32j57k43l7j34
2182b34J51L66rn17j23L78L00p8l23k79K44M62j11l93p9K22J6R1J36k42l01K37
2204h6M32n7m33j37K71J89M9k99j21J16J78Q2q7j83j31J38L60o4l83j08J80K46
2226A52n2o7j89j13K97K78j96k62m2K51J48l6k71j23J69K65j34p3oj19M2L25M
$$ plain form
2076 87 408 278 -67 -344 -198 315 470 -227 -575 -190 260 259 87 -140 -338 27 508 333 -170 -427 -228
2097 -228 220 447 1 -579 -345 384 496 -70 -319 -159 167 329 222 -114 -385 -186 227 291 -57 -433
2117 -433 -211 227 462 174 -323 -224 162 409 171 -158 -350 -55 312 299 -108 -372 -108 268 230 67 -156
2138 -156 -292 -65 221 264 -91 -404 -190 294 342 -122 -406 -54 246 151 45 -29 -191 -142 261 247 -77 -288
2160 -288 -149 196 358 62 -327 -216 239 318 -27 -145 -107 -114 163 355 -88 -380 -95 337 180 -63 -100 -234
2182 -234 -83 283 274 -243 -366 12 312 234 -89 -368 -124 338 227 -166 -245 -23 -7 84 220 -22 -323 -86
2204 -86 346 289 -144 -281 -10 179 228 -71 -192 -76 102 184 97 -86 -217 -79 281 217 -166 -274 -94 152
2226 152 100 33 -156 -269 28 306 110 -152 -194 57 205 169 -102 -225 -56 209 75 2 -4 -123 -81 244 248
2249B48m30j41M46J25j78j40n7Q4J07J39j72k42J44J04J37Nk45k13J93K51m7k07
2271h9q5J17R3J59q3l05qK70Q8j50j53O6L2R6J28j69j23M0J53R4j12j53q8K02
2295B0J88q5k19j22K10J35n5p8q3j9J82O0j17j22j0Q7J36L6j57k29J50K69m6j97
2319f6n9N3J23N2Pk44j2J90L1m5L2j22j39K72J95k59k34J82J35k7K4j39q1O0K31
2344A60p2j94K5L5O4J21q4k62P6K04K3q0l0r2o1K47M3j88p7J16J07o9M7j40j6
2369i7J44O3l3j46N0QpJ40p1j80j3K40J1j28o5j3J29J12k3j78l7R1M8N2m8j05
2395e6q0J45J21o2j42OR7O9kj39j05O7R7M3n9r2M0K5J17N8k12jO0R7j5n5q0k9
2423h7J18J04j43j11L7J42J7Jr7j7lL8P3o3m2Qo2K11k0j71p5J52J6L8j14j7l7
$$ plain form
2249 248 -182 -323 123 248 70 -70 -127 -43 64 203 31 -211 -67 37 174 179 -66 -279 -86 165 118 -89
2271 -89 -174 -57 36 195 112 -193 -201 69 157 7 -146 -80 -48 48 176 7 -116 -76 77 171 59 -94 -182 20
2295 20 208 123 -96 -218 -8 127 72 -6 -89 -108 74 134 17 -105 -115 -28 108 144 -13 -242 -92 177 131 -66
2319 -66 -125 -72 51 103 110 -134 -146 44 75 30 62 -60 -199 73 268 9 -225 -43 92 65 89 -50 -131 -71 160
2344 160 88 -106 -81 -46 18 139 55 -207 -131 73 96 16 -14 -106 -167 80 123 -65 -142 -26 81 12 59 -81 -97
2369 -97 47 110 77 -69 -19 -11 -18 122 51 -129 -142 98 109 -19 -84 -97 32 144 121 -57 -94 -3 45 97 49 -56
2395 -56 -136 9 130 68 -74 -68 29 98 96 -43 -148 -81 16 59 0 -92 -52 -27 90 148 -64 -65 -5 92 77 22 -58 -87
2423 -87 31 135 -8 -119 -82 60 77 78 -19 -36 -39 -1 72 9 -33 -25 -87 124 104 -67 -142 10 26 64 -50 -67 -104
2450a04J64N9r9q9k7Q4J00j3q5o0J06L5k1m3r4m3Q6J13L4k21L8J04M3J4j25l0
2476g4L5Q3M3j01j02N9J07O2q5r9rO7L6K7j06o2L4O9Q2n2o7q7J39R9L8j76n7P7
2504b0L5Q9j98l0J16J23k0o1j03P3K6L6K3j46j3J4L3Q7Mj41m9J74K1kj05r9J04
2531b9J06L5k11j8O3J30o5ro5K4Q2Q1j07o5L8o8J57j2q7j07L0J53R5q7j59M2P6
2558B3Q6k7j36j34K21N1k2q0q3O8R1K2o8j21K1J59j2l9q5r4Q1J56Or1j26N7J43
2585F7M2j03j00j7Q2J26j4j23j13J45J31K1q2j64L8P5J26j34j17l1M8K04J3j31
2609a1j57J73J07j9j04j20K5J56K4l6j38j5O6J17O6j53j29J24Q6O1j13j69k1J80
2633@J51n8j36n9R3J75j01j15p9J23J07l1m2r5k4J33L4K2j29j08R2J28J9j38j59
$$ plain form
2450 -104 60 119 20 -69 -96 -12 88 75 -10 -70 36 71 50 7 -87 -130 -44 69 103 -118 -80 24 67 81 -44 -74
2476 -74 -39 44 87 -14 -116 -57 50 112 27 -72 -81 -14 22 49 -57 -119 -85 -16 66 14 -53 -140 -1 98 136 -40 -97 -20
2504 -20 15 104 -94 -124 -8 115 95 34 -69 4 30 66 89 -57 -70 -56 -23 64 68 -73 -122 52 73 71 -34 -133 -29
2531 -29 77 112 -99 -117 -54 76 11 2 -63 -39 43 124 17 -48 -10 -78 79 67 -20 -127 -97 56 151 64 -95 -53 23
2558 23 109 82 -54 -188 33 84 62 -18 -101 -33 58 80 12 -109 -88 71 59 20 -65 -159 -78 78 84 -7 -133 -76 67
2585 67 109 6 -94 -111 -29 97 83 -40 -153 -8 123 144 62 -102 -64 11 137 3 -114 -145 -97 107 120 -11
2609 -11 -168 5 112 93 -11 -131 -106 50 74 38 -100 -115 -49 68 134 -19 -148 -24 62 123 10 -159 -180 0
2633 0 151 93 -43 -102 -9 166 65 -50 -129 -6 101 70 28 -67 -91 42 76 98 -31 -139 -47 81 100 -38 -197
2658a97N1J50J39j01j80M2J18J64j31k02j5J29J61l5j58j05P4J59L2k5j34m9R0
2681b3J52pj71j32J37J34j6j02j57Q1K55K3j50j95O5J45P3o2j12q8R2J31Jn5j01
2706h2K3O9J21o9q4j21J54J19q9j16j22R9K06R6k14j24O1J55J20j42j14q3J04
2729c3J30Mj66n1N3J33J23j78j25n5K37J02j41j14m5Q1J73Nj63j05N7J80K5j21
2753Fj75M6J82J03j64j99M9J70J63p9j48r0J07J29Q6j67j53J4J86J33r2j87r4
2776a74J64J43N7k02j62J36J63K1j55j62K1J75J02r9j17n1J68P7j8j55l3J7J23
2799C9J38j77j82Q2J41J06n0k25k6J81R8L6j94j62J72J43J2p6j95M7J68P4l8k27
2823a15q1J85J46l8j75r0Q0J64N7q0j80NJ55J22o6k46nJ06K10j5j99r9J03J21
$$ plain form
2658 -197 -146 4 143 42 -138 -96 22 186 55 -147 -162 -33 128 93 -65 -170 -96 63 95 70 -64 -113 -23
2681 -23 129 122 -49 -181 -44 90 74 -28 -185 -104 151 174 24 -171 -106 39 112 50 -62 -150 -58 73 74 19 -82
2706 -82 -59 10 131 62 -22 -143 11 130 41 -75 -197 -98 108 204 -10 -134 -73 82 202 60 -54 -137 -33
2729 -33 97 101 -65 -116 -63 70 193 15 -110 -165 72 174 33 -81 -126 -45 128 133 -30 -135 -78 102 127 6
2753 6 -169 -123 59 162 -2 -201 -152 18 181 102 -46 -136 -29 100 186 19 -134 -120 66 199 107 -80 -174
2776 -174 -10 133 190 -12 -174 -38 125 146 -9 -171 -150 25 127 28 -89 -140 28 105 87 -68 -101 -84 39
2799 39 177 0 -182 -100 41 147 97 -128 -154 27 125 161 -33 -195 -23 120 132 56 -139 -92 76 150 112 -115
2823 -115 -196 -11 135 97 -78 -168 -88 76 133 53 -127 -122 33 155 89 -157 -162 -56 154 139 -60 -159 -56 65
2847F5J01j04j50l6J97J14j03j62q5J64J29K3j75j39R9J83Q1j75k14J6J91J64
2869A84o7k41l8J32J52%j59j06J9J70K01j75k83P2J58J82p2k15q1J44K52m7j85
2892cj70P0J56J28l5k51p4K17J96j38j55j20J46K43j32p0j93N5J94J40j11k96
2914b03L3K25J63j34k62k9J94J31k1j02j58K2K39J10p9l07J3K29J61j25j89o5
2936a54Q5K52k4j58j37K6J69J69j86k40LK42J44j03k37MQ8J33R4j28k07k6K94
2959A03Q8j29k24j5J69J47j6k28n0O8K31O8j76k14P8J78J48j54k84Q5J34J77q0
2982A04j79r4R9J72J18j77k38J5K79J20j33k24m0J38J84J4k08j65J67J56P5r0
3004I3k65k8K57J53j49j92l9J72J71l5k12o9K1K40R1k12j86M6K67R1j86j43n3
$$ plain form
2847 65 166 62 -88 -124 73 187 84 -78 -163 1 130 153 -22 -161 -62 121 202 27 -187 -171 20 184
2869 184 117 -124 -162 -30 122 122 -37 -143 -124 46 247 72 -211 -139 19 201 129 -86 -167 -23 229 182 -3
2892 -3 -173 -103 53 181 146 -105 -179 38 234 96 -59 -179 -33 210 78 8 -185 -130 64 204 93 -203
2914 -203 -170 55 218 84 -178 -207 -13 118 97 -5 -163 -141 98 208 129 -178 -165 64 225 100 -89 -154
2936 -154 -69 183 159 1 -136 -110 59 228 42 -198 -195 47 191 88 -149 -145 -57 76 170 42 -165 -191 103
2959 103 191 62 -162 -177 -8 139 123 -105 -155 -87 144 212 36 -178 -100 78 226 72 -212 -127 7 184 104
2982 104 -75 -169 -70 102 220 43 -195 -180 99 219 86 -138 -178 -40 144 158 -50 -215 -48 108 183 93
3004 93 -172 -200 57 210 61 -131 -170 2 173 138 -74 -143 -122 118 209 -3 -189 -143 124 215 29 -114 -167
3027a67J51J99l7j68j31R2K31k3j11j31m5K60J45k06k64J4J75Q4L4j50k03J75
3049g6J99N6j71j98M5K33R8j76j54n9K36J23oj67j29Q1K19P7j68k70N6K82Q3j61
3073E3j94l2J29J92j0j51j59L4K59J08j92k51N3K26R1n2k43p4J92K06k6j81j76
3096a98O5K48R0k12j87K3K13J35m3k28p1J66K12m8j48k22Q4K71L9k03j86LK98
3119A01R7q6k37k9J21J93o4j42j65J22K23N9k13j92Q8K06J30j07j54j10J00K46
3141A87j5k79m7J4K58P2j85j91N8K07J10j00j68p6J11K21n9j57j55P4K44R5j72
3164D7k52L0K76J04j22k05l7J01K26Nk73j44J11K08R1j20k30N9J75J57r3k28p6
3187a90J57J37L2j82k09J59K51L0j69j54P2J56J35j35k21m4R7K43l8j39j75O6
$$ plain form
3027 -167 -16 183 146 -22 -153 -61 170 147 36 -95 -140 120 265 59 -205 -191 -16 68 102 -48 -251 -76
3049 -76 123 179 8 -190 -145 88 186 10 -144 -203 33 156 150 -17 -146 -65 154 231 63 -207 -151 131 214 53
3073 53 -141 -173 -44 148 138 -13 -172 -138 121 229 37 -214 -161 65 156 104 -139 -213 -21 185 159 -22 -198
3096 -198 -133 115 205 -7 -194 -171 42 177 134 -94 -165 1 213 165 17 -205 -121 150 189 -14 -200 -197 101
3119 101 198 112 -125 -154 -33 160 96 -46 -211 -89 134 193 -20 -212 -124 82 212 105 -49 -159 -59 187
3141 187 172 -107 -154 -140 118 190 5 -186 -128 79 189 89 -79 -155 -44 177 118 -39 -194 -120 124 219 47
3164 47 -205 -175 101 205 83 -122 -159 -58 168 173 -100 -244 -133 75 166 46 -184 -125 50 207 114 -114 -190
3187 -190 -33 104 136 -46 -255 -96 155 185 16 -138 -66 90 225 90 -131 -175 -78 165 127 -12 -187 -121
3209a21K91K7j63j87j5K27J10r1k15o3J22K16mj36k17J17K66Q5k41j98L6J61J69
3232A76j02k27r0J77K59J0k02j69O3K17J09k13j54k0J62J33n0j93n6J57J61J9
3254A67j90j48Q1J96Q0j79j82l4K12J97j34k03l2J42J64pj77j21P1J95Q9j00k65
3277a78K6K02J07p7j98j4J19J92m6j74k06R8K99O1j98j99j5K17J50p4j75j00J89
3300FQ7O9j90j67O5K06O9j57j70j0K48J33j02j57o9Q9J84J2j68k18J35J81Q3q9
3324G0k11o6K20J82n4k08j14J51J84rj35j94Q6J76J02j63j83kJ61K05ok45j48
3347b01Q5K50L4k07j93J31J61R8j06k14p0K14J96n6j95j24J69J93k3j89j02M2
3369a07K29Q8j82j69k2J55K51q9k28p9J76J25kj99j44O0K14J02j63j56k7J78J71
$$ plain form
3209 -121 170 197 34 -153 -168 59 169 78 -137 -200 -78 138 134 -2 -219 -102 164 249 8 -190 -154 7 176
3232 176 74 -153 -243 -66 193 203 1 -168 -105 112 221 8 -146 -166 -4 129 79 -114 -170 -13 148 167
3254 167 -23 -171 -90 106 186 7 -175 -209 3 200 66 -137 -169 -27 137 130 -47 -168 -97 98 187 87 -178
3277 -178 -152 50 157 80 -118 -132 -13 179 133 -41 -247 -149 150 211 13 -186 -201 16 166 92 -83 -183 6
3300 6 93 162 -28 -195 -130 76 145 -12 -182 -192 56 189 87 -70 -139 -50 134 146 -22 -240 -105 76 159 70
3324 70 -141 -207 13 195 141 -67 -181 -30 154 145 10 -184 -98 78 180 17 -166 -168 -7 198 192 -53 -201
3347 -201 -116 134 168 -39 -232 -101 60 158 52 -162 -232 -18 178 122 -73 -197 -28 165 142 -47 -149 -107
3369 -107 122 210 28 -141 -163 -8 243 154 -74 -153 23 148 146 -53 -197 -137 77 179 16 -140 -167 11 182
3392A82r1k19j40J93K14K1j64j51K3J82J53j38k09k7J77J54l6k16q7Q9J96M1j44
3415Cj16oK42J10j19k33r7K45J39k3k52q5J35J65Qq1k05M9K25J04j55j87n2K04
3439A8J73p6k19j09J55J63J35k34j41L3J61P8q5k17jK17P5L4j99j83J51K24J9
3462A72j64j54L1K01Q3m3l11k1K15J74j24j48q6J02J67R3k27j73P9J70P9j0k30
3485a25k8J75J59q0j87q9Q6J92L1p3j80j5K30R5j16j91p6K12J67n3k02q4Q6K06
3509A40J9j84j30PK06J58j83j87j1J72J75r4j54q5P8J96N6j59j85K8J70J25j11
3532D7j56m9J77J64j04j42j01J01J66M8r8k26J4K90L8j31j62KJ06J27N2k00j63
3555b00R5K55lj25j33k1J70J09n1k22l1J51J84n7j63j39R7J54J21k31j51J04Q1
$$ plain form
3392 182 91 -128 -268 -75 139 160 -4 -155 -132 50 203 65 -144 -171 6 160 124 -92 -179 -90 106 147 3
3415 3 -113 -119 123 233 114 -119 -216 29 168 145 -107 -192 -57 108 116 35 -170 -121 104 208 53 -134 -186 18
3439 18 191 115 -104 -213 -58 105 240 6 -135 -102 59 137 52 -165 -166 51 126 160 -39 -222 -71 153 172
3462 172 8 -146 -115 86 169 126 -185 -206 9 183 59 -89 -175 -73 94 187 -40 -213 -134 36 115 105 -125
3485 -125 -153 22 181 101 -86 -175 -89 103 134 61 -119 -134 96 191 75 -116 -192 20 187 134 -68 -152 -66 140
3509 140 159 -25 -155 -148 58 216 33 -154 -165 7 182 88 -66 -151 -73 123 179 20 -165 -137 33 158 47
3532 47 -109 -158 19 183 79 -63 -164 -63 103 151 53 -173 -159 131 169 38 -124 -122 -16 111 163 -37 -200
3555 -200 -105 150 147 22 -111 -132 38 147 96 -126 -157 -6 178 121 -42 -181 -84 70 191 -40 -191 -87 -6
3578fJ91j01j89o1J49J73j0j67j32K5K64M6j91r8l9J87J55j14k12l8J72J66m5
3601A25j88j84J41K35N0j50k12P7J04J17o3j43p1J34J59N8k41j86J74J61Q5j59
3623B3j55QJ86J18o9k55k8J81J04K5j52j70R7J89j2r7j20nK06J5Kj43j12J25K13
3648A74n5k09j01J22J76J1j45j36M3J68J17r7k04k0O3K39m6r8k28J62J67P6j59
3671B0k07N4J79J49j57j20p7J32J62M0j89j44R4J83L1j26j79kK05J19o4k63l2
3694a92J65J62k7j45r3K5J83L4p7j58k1J70J09j2k97RJ28J66N9k29j01L2K07R0
3718A87j52j40n3J31J97q1k00p8J94R7L9k07j26J13J92K6j47q5q0J89J66r2k27
3741a37o9J53J52Q6k77l2O1J27O6r1j72k4J57J51m9j47j47J95J29K7j55j52P6
$$ plain form
3578 -6 185 84 -105 -166 -17 156 146 -21 -153 -128 136 182 -9 -107 -146 41 196 82 -130 -168 4 170 125
3601 125 -63 -247 -106 129 179 29 -183 -106 -2 115 52 -91 -162 -28 131 189 -52 -238 -64 97 182 23
3623 23 -132 -124 62 180 111 -144 -172 9 113 138 -14 -184 -87 102 90 -7 -127 -132 74 89 91 -52 -164 -39 174
3648 174 119 -90 -191 -69 107 118 -27 -163 -120 48 165 68 -136 -156 -93 146 100 2 -226 -64 103 179 20
3671 20 -187 -133 46 195 38 -82 -159 -27 135 175 -14 -158 -64 119 150 24 -155 -157 48 167 103 -160 -192
3694 -192 -27 135 108 -37 -130 -105 78 112 35 -123 -144 26 135 123 -174 -165 -37 129 188 -41 -142 -110 97 187
3718 187 35 -105 -158 -27 170 89 -111 -189 5 102 141 -66 -192 -79 113 139 -8 -93 -173 16 182 90 -137
3741 -137 -206 -53 99 185 -92 -124 -63 64 130 39 -133 -157 0 151 102 -45 -192 3 132 159 4 -148 -72
$$ [...]
8191b2
##END NTUPLES=NMR FID
##END=
