##TITLE=1H_AM_NV63.2
 CDCl3
 8 sc, 
 6.10.2023
##JCAMPDX= 6.0         $$ Bruker NMR JCAMP-DX V2.0
##DATA TYPE= NMR FID
##DATA CLASS= NTUPLES
##ORIGIN= UXNMR, Bruker Analytische Messtechnik GmbH
##OWNER= root
$$ XWIN-NMR		Version 3.5
$$ Fri Oct  6 16:04:08 2023 Russian Standard Time (UT+4h)  she@DPX200
##.OBSERVE FREQUENCY= 200.13135
##.OBSERVE NUCLEUS= ^1H
##.DELAY= (6, 6)
##.ACQUISITION MODE= SIMULTANEOUS
##.ACQUISITION SCHEME= undefined
##.AVERAGES= 8
##.DIGITISER RES= 18
##SPECTROMETER/DATA SYSTEM= spect
##.PULSE SEQUENCE= zg30
##.SOLVENT NAME= CDCl3
##.SHIFT REFERENCE= (INTERNAL, CDCl3, 0, 15.7039)
##AUDIT TRAIL= $$ (NUMBER, WHEN, WHO, WHERE, WHAT)
$$ ##TITLE= Audit trail, XWIN-NMR		Version 3.5
$$ ##JCAMPDX= 5.01
$$ ##ORIGIN= Bruker BioSpin GmbH
$$ ##OWNER= she
$$ F:/spectra/data/she/nmr/H-F/1/audita.txt
$$ ##AUDIT TRAIL=  $$ (NUMBER, WHEN, WHO, WHERE, WHAT)
(   1,<2023-10-06 16:03:02.00 +0400>,<she>,<DPX200>,
      <created by zg, POWCHK disabled, PULCHK disabled
       configuration hash MD5:
       00 E9 B6 7A A2 85 ED C7 34 08 36 98 17 FE 4E 26
       data hash MD5: 16K
       7E 54 CE B7 F8 59 A2 48 57 CC 45 19 E6 E7 4F 0E>)
$$ ##END=
$$ 
$$ hash MD5
$$ 62 83 AE E5 5B C9 64 0C C4 12 EA 9C 1E 6F 4E AD
##$RELAX= 
##$RELAX= 
##$RELAX= 
##$RELAX= 
##$RELAX= 
##$RELAX= 
$$ Bruker specific parameters
$$ --------------------------
##$DU= <F:/spectra>
##$EXPNO= 1
##$NAME= <H-F>
##$PROCNO= 1
##$TYPE= <nmr>
##$USER= <she>
##$AMP= (0..31)
100 100 100 100 100 100 100 100 100 100 100 100 100 100 100 100 100 100 
100 100 100 100 100 100 100 100 100 100 100 100 100 100 
##$AQSEQ= 0
##$AQ_mod= 1
##$AUNM= <au_zg>
##$AUTOPOS= <>
##$BF1= 200.13
##$BF2= 200.13
##$BF3= 200.13
##$BF4= 200.13
##$BF5= 200.13
##$BF6= 200.13
##$BF7= 200.13
##$BF8= 200.13
##$BYTORDA= 1
##$CFDGTYP= 0
##$CFRGTYP= 5
##$CHEMSTR= <none>
##$CNST= (0..31)
1 1 145 1 1 1 1 1 1 1 1 1 1 1 1 1 1 1 1 1 1 1 1 1 1 1 1 1 1 1 1 1 
##$CPDPRG= <>
##$CPDPRG1= <>
##$CPDPRG2= <>
##$CPDPRG3= <>
##$CPDPRG4= <mlev>
##$CPDPRG5= <mlev>
##$CPDPRG6= <mlev>
##$CPDPRG7= <mlev>
##$CPDPRG8= <mlev>
##$CPDPRGB= <>
##$CPDPRGT= <>
##$D= (0..31)
0 1.2 0 0 0 0 0 0 0 0.06 0 0.03 0 0 0 0 0.0002 0 0 0 0 0 0 0 0 0 0 0 0 
0 0 0 
##$DATE= 1696593781
##$DBL= (0..7)
120 120 120 120 120 120 120 120 
##$DBP= (0..7)
150 150 150 150 150 150 150 150 
##$DBP07= 0
##$DBPNAM0= <>
##$DBPNAM1= <>
##$DBPNAM2= <>
##$DBPNAM3= <>
##$DBPNAM4= <>
##$DBPNAM5= <>
##$DBPNAM6= <>
##$DBPNAM7= <>
##$DBPOAL= (0..7)
0.5 0.5 0.5 0.5 0.5 0.5 0.5 0.5 
##$DBPOFFS= (0..7)
0 0 0 0 0 0 0 0 
##$DE= 6
##$DECBNUC= <off>
##$DECIM= 32
##$DECNUC= <off>
##$DECSTAT= 4
##$DIGMOD= 1
##$DIGTYP= 9
##$DL= (0..7)
0 120 120 120 120 120 120 120 
##$DP= (0..7)
150 150 150 150 150 150 150 150 
##$DP07= 0
##$DPNAME0= <>
##$DPNAME1= <>
##$DPNAME2= <>
##$DPNAME3= <>
##$DPNAME4= <>
##$DPNAME5= <>
##$DPNAME6= <>
##$DPNAME7= <>
##$DPOAL= (0..7)
0.5 0.5 0.5 0.5 0.5 0.5 0.5 0.5 
##$DPOFFS= (0..7)
0 0 0 0 0 0 0 0 
##$DQDMODE= 0
##$DR= 18
##$DS= 0
##$DSLIST= <SSSSSSSSSSSSSSS>
$$ [...]
##$SUBNAM2= <"">
##$SUBNAM3= <"">
##$SUBNAM4= <"">
##$SUBNAM5= <"">
##$SUBNAM6= <"">
##$SUBNAM7= <"">
##$SUBNAM8= <"">
##$SUBNAM9= <"">
##$SW= 18.05172834244
##$SWIBOX= (0..15)
0 0 2 0 0 0 0 0 0 0 0 0 0 0 0 0 
##$SW_h= 3612.71676300578
##$TD= 16384
##$TD0= 1
##$TE= 0
##$TE2= 300
##$TE3= 300
##$TEG= 300
##$TL= (0..7)
0 120 120 120 120 120 120 120 
##$TP= (0..7)
150 150 150 150 150 150 150 150 
##$TP07= 0
##$TPNAME0= <>
##$TPNAME1= <>
##$TPNAME2= <>
##$TPNAME3= <>
##$TPNAME4= <>
##$TPNAME5= <>
##$TPNAME6= <>
##$TPNAME7= <>
##$TPOAL= (0..7)
0.5 0.5 0.5 0.5 0.5 0.5 0.5 0.5 
##$TPOFFS= (0..7)
0 0 0 0 0 0 0 0 
##$TUNHIN= 0
##$TUNHOUT= 0
##$TUNXOUT= 0
##$USERA1= <user>
##$USERA2= <user>
##$USERA3= <user>
##$USERA4= <user>
##$USERA5= <user>
##$V9= 5
##$VALIST= <valist>
##$VCLIST= <CCCCCCCCCCCCCCC>
##$VD= 0
##$VDLIST= <DDDDDDDDDDDDDDD>
##$VPLIST= <PPPPPPPPPPPPPPP>
##$VTLIST= <TTTTTTTTTTTTTTT>
##$WBST= 1024
##$WBSW= 4
##$XGAIN= (0..3)
0 0 0 0 
##$XL= 0
##$YL= 0
##$YMAX_a= 214557
##$YMIN_a= -233623
##$ZGOPTNS= <>
##$ZL1= 120
##$ZL2= 120
##$ZL3= 120
##$ZL4= 120
##$ABSF1= 10
##$ABSF2= 0
##$ABSG= 5
##$ABSL= 3
##$ALPHA= 0
##$AQORDER= 0
##$ASSFAC= 0
##$ASSFACI= 0
##$ASSFACX= 0
##$ASSWID= 0
##$AUNMP= <proc_1d>
##$AZFE= 0.1
##$AZFW= 0.1
##$BCFW= 1
##$BC_mod= 2
##$BYTORDP= 1
##$COROFFS= 0
##$CY= 11.3945322036743
##$DATMOD= 1
##$DC= 2
##$DFILT= <>
##$DTYPP= 0
##$F1P= 15.7292609196834
##$F2P= 12.9074282941183
##$FCOR= 0.5
##$FTSIZE= 0
##$FT_mod= 4
##$GAMMA= 1
##$GB= 0.15
##$INTBC= 1
##$INTSCL= 1
##$ISEN= 128
##$LB= 0.24
##$LEV0= 0
##$LPBIN= 0
##$MAXI= 10000
##$MC2= 0
##$MEAN= 0
##$ME_mod= 0
##$MI= 1.114404
##$NCOEF= 0
##$NC_proc= 0
##$NLEV= 6
##$NOISF1= 3.799351
##$NOISF2= 2.8
##$NSP= 1
##$NTH_PI= 0
##$NZP= 0
##$OFFSET= 15.70392
##$PC= 1
##$PHC0= -22586.15
##$PHC1= 8.052712
##$PH_mod= 1
##$PKNL= yes
##$PPARMOD= 0
##$PSCAL= 0
##$PSIGN= 0
##$REVERSE= no
##$SF= 200.130013532006
##$SI= 16384
##$SIGF1= 3
##$SIGF2= 2
##$SINO= 400
##$SIOLD= 16384
##$SREGLST= <1H.CDCl3>
##$SSB= 0
##$STSI= 0
##$STSR= 0
##$SW_p= 3612.71676300578
##$SYMM= 0
##$S_DEV= 0
##$TDeff= 0
##$TDoff= 0
##$TI= <>
##$TILT= no
##$TM1= 0
##$TM2= 0
##$TOPLEV= 0
##$USERP1= <user>
##$USERP2= <user>
##$USERP3= <user>
##$USERP4= <user>
##$USERP5= <user>
##$WDW= 1
##$XDIM= 8192
##$YMAX_p= 0
##$YMIN_p= 0
$$ End of Bruker specific parameters
$$ ---------------------------------
##NTUPLES= NMR FID
##VAR_NAME=  TIME,          FID/REAL,        FID/IMAG
##SYMBOL=    X,             R,               I
##VAR_TYPE=  INDEPENDENT,   DEPENDENT,       DEPENDENT
##VAR_FORM=  AFFN,          ASDF,            ASDF
##VAR_DIM=   8192,          8192,            8192
##UNITS=     SECONDS,       ARBITRARY UNITS, ARBITRARY UNITS
##FACTOR=    0.0002768,     1,               1
##FIRST=     0,             0,               0
##LAST=      2.2672688,     0,               0
##MIN=       0,             -233623,         0
##MAX=       2.2672688,     214557,          0
$$ Real data points
##PAGE= N=1
##DATA TABLE= (X++(R..R)), XYDATA
0@%%%%%%%%%%%%%%%%%%%%Mj2J6j6J6j6K1k9L2l6M4n0N7o7P5q3R6j10J22j36J53
$$ 0 0 0 0 0 0 0 0 0 0 0 0 0 0 0 0 0 0 0 0 0 4 -8 8 -8 8 -8 13 -16 16 -20 24 -26 31 -36 39 -44 52 -58 64 -72 81
41H1j72J91k13K36k60K89l21L55l90M28m70N18n72O28o89P60q39R27j023J130
$$ 81 -91 100 -113 123 -137 152 -169 186 -204 224 -246 272 -300 328 -361 399 -440 487 -536 594
61E94j253J391j544J705j859J936j662l57K0708J94898k38744j82243L12432K7702
$$ 594 -659 732 -812 893 -966 970 -692 -1049 19659 214557 -24187 -206430 106002 133704
75A33704k75962Q7359J94386j68252o8112J76953m8970j33645J41735M5989j80762
$$ 133704 -142258 -54899 139487 -28765 -96877 80076 31106 -102539 39196 85185 -95577
86i5577N1205J72357j38854j17137J91793L9693k03769M3103J71890j06298j10670
$$ -95577 -44372 127985 -10869 -128006 63787 103480 -100289 -57186 114704 8406 -102264
97a02264J38701L4877j33481L2640R8361p9348m6336R5973n467q7295M4178O1328
$$ -102264 36437 71314 -62167 -29527 68834 -10514 -56850 39123 33656 -53639 -9461 51867
109E1867o2750l1316O2630O285m9054Q414L0311j2707j1032R705n123j366J8314
$$ 51867 -10883 -42199 20431 26716 -22338 -13924 16387 3680 -7352 2353 -2770 -4136 14178
122A4178j0015k7710K4134L2926l9681l2722N4412K6547o5764j6423P1027M261
$$ 14178 4163 -23547 587 33513 -6168 -38890 15522 42069 -23695 -40118 30909 35170
134C5170p0201O268O3316j3390n3308J5734M1506j3066l0768O259K2779L969j9042
$$ 35170 -35031 -28763 34553 21163 -32145 -16411 25095 12029 -18739 -12480 10299 14268 -4774
147d774j5127K1401K4673k8534k8837L8915K6063m7469j6499N0939L581m6872
$$ -4774 -19901 1500 26173 -2361 -31198 7717 33780 -13689 -30188 20751 24332 -22540
159b2540Q268L5947j5176k1855J4861Q555q997k81J18k472P238O5j1015M170J0244
$$ -22540 -14272 21675 6499 -15356 -495 8060 -937 -1218 -1100 -3572 3666 3731 -7284 -3114 7130
174G130p920n970R467J70q133N738N051j0225l65J3467m247j4731Q719J4979j1841
$$ 7130 -790 -6760 2707 2877 -5256 482 5533 -4692 -5057 8410 4163 -10568 -1849 13130 1289
189A289j4498J3863J4140j4826j4742J5447J6080j7175j7798J9833J7843k3215
$$ 1289 -13209 654 14794 -32 -14774 673 16753 -422 -18220 1613 19456 -3759
201c759j6301K5450J2393k5274q184K1824N415j5882n863R805J0129n594j6398
$$ -3759 -20060 5390 17783 -7491 -15675 6149 11564 -4318 -10181 -376 9753 4159 -12239
214a2239N315K3155q821k7359J5412K7915k2325k4067K7661J7077k9867q448K7758
$$ -12239 -6924 16231 7410 -19949 -4537 23378 1053 -23014 4647 21724 -8143 -16591 11167
227A1167J45k2202N584J3723p759n143N750k348o05O383o444o056J2707J573j5961
$$ 11167 11312 -10890 -5306 8417 658 -4485 1265 -1083 -1688 4695 -1749 -7805 4902 6475 -9486
242i486N540J5020j2539r536J7722J295j8610P933J5698j5559r376K0310J723
$$ -9486 -3946 11074 -1465 -11001 6721 8016 -10594 -2661 13037 -2522 -11898 8412 10135
255A0135k1435N790J9200j1793j4491J4824Q316j4821k526J1181j755n464K867
$$ 10135 -11300 -5510 13690 1897 -12594 2230 10546 -4275 -6801 4380 2625 -2839 28
268B8j644m53P785n290j1387J3019J1384k0794p217K6646M49k8773P802K7117
$$ 28 -1616 -2069 5716 426 -10961 2058 13442 -7352 -14569 12077 12526 -16247 -8445 18672
282A8672j5104k1339J9797J3459k0559n069J7386j872j1009N452K953n282M541
$$ 18672 3568 -17771 2026 15485 -5074 -10143 7243 5371 -5638 -186 2767 -2515 2026
295B026R31r706N592J0917j3075q124J8728J935k1180N839J9511j2842j4101J7471
$$ 2026 2957 -6749 -1157 9760 -3315 -11439 7289 9224 -11956 -6117 13394 552 -13549 3922
309C922O869j8400R42J6089o914j1166J0578N285j0936K24Q843m133n074N568
$$ 3922 10791 -7609 -6667 9422 2508 -8658 1920 7205 -3731 -3507 5336 1203 -3871 1697
323A697Q21m874K632K037m821J488M747n192l170P788L44r247K814R277n828q098
$$ 1697 2518 -2356 276 2313 -2508 -1020 3727 -1465 -4635 3153 3497 -5750 -2936 6341 513 -7585
339g585Q221O371r547m027J0193J981r898J71R280j804p823K996O172l661m248
$$ -7585 636 7007 -2540 -6567 3626 5607 -4291 -4120 5160 3356 -4467 -1471 4701 1040 -3208
354c208L532K240k549j026Q31L57R20r82k512K059L285l844l260N457K455o754
$$ -3208 324 2564 15 -1011 -180 177 1097 115 -2397 -338 2947 -897 -4157 1300 3755 -2999
370b999j098P586n05p473K092P249l328o434M528N710n485m394O286K939o703
$$ -2999 -4097 3489 2984 -4489 -2397 4852 1524 -4910 -382 5328 -157 -4551 1735 4674 -2029
385b029j187O509q55n529K463L624l725j022L448k000j864M057j001m997M320
$$ -2029 -3216 3293 2438 -3091 -628 2996 -729 -1751 1697 -303 -2167 1890 889 -4108 212
400B12M186p780j190R919l006r734P679P302j1281k490J2940l274j1384Q815O970
$$ 212 4398 -3382 -4572 5347 2341 -7393 286 7588 -3693 -6183 6757 3483 -7901 914 7884
415G884j1987p46J2189n692r001J0355L013j1850L355R659q810m628J1090j992
$$ 7884 -4103 -4849 7340 1648 -7353 3002 6015 -5835 -2480 7179 -1631 -6259 4831 2839
429B839r980P799N565j1356O71J1652o938q642J1701L266j3292K973J1826p952
$$ 2839 -7141 658 6223 -5133 -4462 7190 252 -8390 3311 6577 -6715 -3742 8084 132
443A32p372J0728J812j0135L318O926o499k022O789k950m353O040J95o820L790
$$ 132 -7240 3488 5300 -4835 -1517 5409 -1090 -3112 3677 727 -3626 2414 2609 -4211 -421
458d21N105o729k098P434j187o329L307M099m019j686L559j50j975R37N37n76
$$ -421 4684 -2045 -4143 3291 2104 -4225 -918 3181 -838 -2524 1035 885 -1090 -153 384 -192
474a92O76j42r14J057O46j479P4J451p93q79J013p8q77P88k7j211R79O68j882
$$ -192 484 342 -572 485 1131 -348 -274 1177 384 -495 518 440 -437 351 324 -887 92 760 -1122
493a122K63J888j481j117K128k40j893J730Q31k445Q78K370k129j190K957l51
$$ -1122 -859 1029 -452 -1569 559 319 -1574 156 987 -1458 -580 1790 -339 -1529 1428 1077
509A077k450J633J461k148oJ794j161q54J584m98j454J487N26k193M58K238j800
$$ 1077 -1373 260 1721 -427 -433 1361 200 -654 930 432 -1022 465 991 -1202 -744 1494 -306
526c06j610K552M30k784P45K310j788r74K267m26j720J827N45k269J113J736k032
$$ -306 -1916 636 1066 -1718 -973 1337 -451 -1425 842 416 -1304 523 1068 -1201 -88 1648 -384
543c84n66K527o96k170J709J017k072q4J759o30j306R06M65q72j65N56n8l94J59
$$ -384 -950 1577 881 -1289 420 1437 -635 -719 1040 410 -896 10 475 -397 -562 -6 -64 -458 -299
562b99K46k36j94L81L05n25q1Q25j27p10M56P81q01m20J177J0j464O92J294j538
$$ -299 -53 -289 -483 -102 203 -322 -403 422 295 -415 41 822 21 -399 778 788 -676 16 1310 -228
582b28p43K028l65k070J308J217k132k0K151j417j369K194J53k286J205J642k034
$$ -228 -971 1057 692 -1378 -70 1147 -985 -1005 1146 -271 -1640 554 707 -1579 -374 1268 -766
599g66m41K338p66j677J869P90k299O56K007j647j094K254k51k225J591J262k651
$$ -766 -1207 1131 365 -1312 557 1347 -952 -296 1711 64 -1030 1224 973 -1252 339 1601 -1050
616a050K35K502j804j691K705Nk803J574J753k719j5K810j768j746L012J76l139
$$ -1050 -815 1687 -117 -1808 897 902 -1901 -327 1426 -1293 -1308 1502 -266 -2012 1000 1176 -1963
633a963J626K391k732q22L229p43k783K219J721l067j25L061j544k316K836O06
$$ -1963 -337 2054 -678 -1500 1729 986 -1797 422 2143 -924 -1049 2012 468 -1848 988 1594
649A594l403J228K814l007j510L882m97l704K221K465l333n57L406j149k451K441
$$ 1594 -1809 -581 2233 -774 -2284 1598 1101 -2603 -382 2083 -1250 -1807 1599 450 -2001 440
665D40J047k739N53K431j639j425K366L63k580Q82K114j778j378K293K75k368
$$ 440 1487 -1252 -699 1732 93 -1332 1034 1397 -1183 -301 1813 35 -1343 950 1225 -1143
681a143O75J807j629r14J891l68j614J235P63j694J87J694j042j161J625M83j580
$$ -1143 -468 1339 -290 -1204 687 319 -1295 -60 703 -991 -804 890 -152 -1313 312 795 -785
698g85L07J334o75p13Q70K67p36J45N49n01j81O74l33n93O01K55q11j32R24m39
$$ -785 -478 856 181 -532 338 605 -131 14 563 62 -119 555 222 -371 230 485 -326 -458 466 27
718B7p32O70K44o51Q8L12j95k5L10l18M7M31j51j81L04R0j48N2m0jK87k32k40
$$ 27 -705 -35 209 -442 -354 -42 -237 -262 48 -270 -223 208 57 -124 180 270 122 174 134 133 420 188 -52
741e2L25J13m20j11M37k45l02J58N1j37Mp5m2J84O9k88o2M77k9m23J86N33k66
$$ -52 273 386 -34 -145 292 47 -255 -97 -46 -183 -179 -254 -296 -112 -43 -331 -393 84 55 -368 -182 351 85
764H5l19L71J40k48J47J52k68K01J76n39J05N97o28l57O79j1q69M61M22p96J21
$$ 85 -234 137 277 29 176 328 60 261 437 -102 3 600 -28 -385 294 283 -586 -125 297 -499 -378
785c78O41n68l27Q18p8q31N62O83q32k31Q68N6p00L25N15m20j80M76j30l91M82
$$ -378 263 -305 -632 186 108 -723 -161 522 -310 -541 327 383 -317 8 523 103 -77 399 269 -122 360
806C60M2o75K61N34n41m41O35R8n92p9K69K36k94l63L90M77o66l51R98N4r74N08
$$ 360 402 -273 -12 522 -19 -460 175 273 -319 -398 -129 107 -187 -550 -160 317 -349 -700 298 352 -622 -114
828a14P68q60j51J083m41r01J294K51j698O32J591j517j101J999K23k282P09J920
$$ -114 654 -206 -357 726 285 -616 678 929 -769 -137 1454 -63 -1164 835 1058 -1224 -515 1405
846A405j658j171K132k3k172J121J550j998m88K490p80k187J952J422k525j89
$$ 1405 -253 -1424 708 685 -1487 -366 1184 -814 -1302 1188 408 -1779 173 1595 -930 -1119
862a119K685r01k113J835J151k103j9J822r03j231J495K91j717N66J415j446q58
$$ -1119 1566 665 -1448 387 1538 -565 -584 1238 335 -896 599 890 -827 -261 1154 -292 -1150
879a150J727J22j850N49J501j077r84J296M20j130M0J041m79m73O29J43n05K92
$$ -1150 577 699 -1151 -602 899 -178 -1162 134 554 -576 -536 505 26 -447 182 325 -180 112
897A12M00n57r9P77l26o66N05M51p00k69O02L3n78J53K73l26L8J42k62J0M01k26
$$ 112 512 -45 -144 633 307 -359 146 597 -103 -372 230 263 -315 -162 111 -215 -177 -35 -297 -287 114 -112
919a12m11N64L42p53nP63j96n43N66K81o51J53N87n52j22P59m25p97Q48N38j323
$$ -112 -523 41 383 -370 -375 388 192 -351 215 496 -155 -2 585 33 -89 670 245 -552 296 834 -489
940d89j13J403n86j233R80P28j231k26J212m16r00R47L24j116M28J026j016n42
$$ -489 -602 801 215 -1018 -38 690 -541 -767 445 29 -871 76 400 -716 -288 738 -278 -820
958h20J625j89j500Q70J277j403o80J681n5j533O91J001j120m28J169l40j017
$$ -820 805 616 -884 -14 1263 -140 -820 861 806 -727 -36 965 -155 -583 586 246 -771
975g71R43M43j396K17J248p41j032J273M59j390J24J279n76q40R56L06q66L02
$$ -771 172 615 -781 -564 684 -57 -1089 184 643 -747 -623 656 80 -760 196 502 -364 -62
993f2P13o96k10Q52l25o90P45L98j018mQ34k76p55M34L83n16j57L93j23j83K17
$$ -62 651 -45 -255 597 272 -418 327 725 -293 -297 537 261 -494 -60 323 -193 -350 43 -80 -263 -46
1014d6j61j70L95J45n57K08N32l10m04N48J31l95J61K25l03J00K25l65%N39l34
$$ -46 -207 -377 18 163 -394 -186 346 36 -368 180 311 -84 77 302 -1 99 324 -41 -41 498 164
1035A64n49N26L32q61m5Q25l35o19M48K89n37J9N36l75k37N44L0o14L85O45p37
$$ 164 -385 141 473 -388 -433 392 57 -562 -114 175 -362 -343 193 -182 -419 125 155 -459 -74 571 -166
1056a66l20J059l0r81M14Q51p79m65R35q5p14K79M19n07j32L72k15l41M48Q0n21
$$ -166 -486 573 543 -438 -24 827 48 -417 518 433 -281 -2 417 -90 -222 150 -65 -406 42 122 -399
1077c99NM64pn15J51N59j82m80L52L85l91j58M17J04l09L6L46j88k31K34J49m07
$$ -399 -394 70 63 -452 -301 258 76 -404 -52 333 -58 -216 201 305 -4 32 378 190 -41 193 342 -65
1099f5K5L59l32l92O49J75r07J65Q29o05o95Q38K96r13J57P37l56m42N34K19m65
$$ -65 -40 319 -13 -405 244 419 -488 -323 506 -99 -794 44 340 -573 -416 321 -35 -477 57 276 -189
1120a89J73L94l60j55M05R7m56J08L97k89m02M60K37o13m6M79j66m02K28Q5r6
$$ -189 -16 378 18 -137 268 365 -91 17 414 125 -277 183 420 -193 -239 240 74 -328 -100 -15 -111
1141a11j29R7N2n7n3J42K6j37N1K84j08k26L17J99m43M7N11l33l30M01L01o95
$$ -111 -240 -143 -91 -148 -201 -59 -33 -170 -119 165 57 -169 148 347 -96 -49 462 129 -201 200 501 -194
1163a94LO46l05n80M89K95o90n8N99k51n54M80L70o28n4P31l10o10P02M41q38
$$ -194 -191 455 150 -430 59 354 -336 -394 205 -46 -600 -120 250 -378 -432 299 -11 -621 81 522 -316
1184c16nQ76l66o40O86L39p42l6Q08m42n42N82J83o29J07M45l15l29M11Q0n28
$$ -316 -321 555 189 -451 235 574 -168 -204 604 162 -380 202 385 -244 -137 308 -7 -336 75 155 -373
1205c73J11M45m17k40M88Q2m41J64M20k19k74L03K06k81L1K64l8j96N4R9J6j19
$$ -373 -262 183 -234 -474 14 96 -345 -181 239 20 -254 49 255 -26 5 269 231 35 89 188 204 85
1227H5j07J10J6j26K9Jj42jJ76j91j11K99r9k49J43K86k26j92L29M6k63J8L38
$$ 85 -22 88 104 -22 7 8 -134 -135 41 -150 -261 38 -61 -310 -167 119 -107 -299 30 76 -187 -169 169
1250A69j21j30K61R7l41J94K63l53k39M59j4m73K15L53m57k63M74N5m42M4L13
$$ 169 48 -82 179 276 -65 129 392 39 -200 259 245 -228 -13 340 -117 -380 94 149 -293 -249 64
1271F4j78k29L20Q1l80K64K81l57j56N36K6n46K98N13o19k18P42j6o93K28N15
$$ 64 -114 -343 -23 58 -322 -58 223 -134 -290 246 272 -274 24 537 -82 -300 442 426 -267 -39 476
1292D76m62l06N40kn57K46L51m34k04N17p3n43L66L54n73r3O45j50n25L81L84
$$ 476 14 -292 248 246 -311 -65 286 -148 -352 165 92 -451 -85 269 -304 -397 248 98 -427 -46 338
1313C38m78j20N59n2l52K46J22j90o4K14r6j13O6mr2p3Q9Q8j86j94K97J6l11k7
$$ 338 -140 -260 299 247 -105 141 263 73 9 223 127 14 80 76 -16 -89 0 88 -98 -292 5 21 -290 -317
1337c17L91n5l59K05M02l36j96L78Q5l74J31L73l22p5L78n9m85M02K69n72j52
$$ -317 74 19 -340 -135 267 -69 -265 113 198 -176 -45 328 6 -69 309 250 -235 167 436 -136 -288
1358b88P21j58q34M39O21p09l18P41o7o47K63N04m66k20O04j61m10M27L00o09
$$ -288 433 275 -559 -120 501 -208 -526 215 148 -499 -236 268 -198 -418 186 25 -385 42 342 -267
1378b67K0O72k48n46N40L19o09n0N59k62l16L38J35m68J27L47l89j88M63j99l69
$$ -267 -247 425 177 -369 171 490 -119 -169 390 128 -188 150 285 -183 -56 291 -98 -286 177 -22 -391
1399c91L16K48m09p0M33j32l05K37K07k00Q0P4k05J57K29k66m2L66r7m42K73L70
$$ -391 -75 173 -236 -306 127 -5 -310 -73 134 -66 14 88 -117 40 269 3 -39 327 230 -212 61 431
1421D31m76j15L97o8l92K03J50l40M9K83k86j32L00K1l33K05K45k58j15L61R9
$$ 431 -45 -160 237 169 -223 -20 130 -210 -161 122 -164 -296 4 25 -308 -103 142 -116 -231 130 229
1442B29m29J70L39k74j32M30j60k53J99J65k92m5L07j53l06J94J94k80j38K52
$$ 229 -200 -30 309 35 -97 333 173 -80 119 284 -8 -53 254 101 -205 -11 183 -97 -235 17
1462A7l9j78R3Q5q7k7L4JQ2Qn3L7J39lj33O2J23j11k9J13k9k4N1K8j41R9K1k84
$$ 17 -22 -200 -107 -22 -109 -136 -102 -101 -19 -11 -64 -27 112 109 -24 38 161 50 21 134 105 81 132 160 19 118 139 -145
1490a45J16K19k43k80M96n3m55K46L01l72k06N35o4l99K58L25l79j46M78lm26
$$ -145 -29 190 -53 -333 163 110 -345 -99 202 -170 -376 159 95 -304 -46 279 -100 -246 232 229 -197
1511a97K55L14l27k12N18j23m77L76K78n75kM41k46m19M41K35p09J25O35l62n33
$$ -197 58 372 45 -167 351 228 -249 127 405 -170 -172 269 23 -396 45 280 -429 -304 331 -31 -564
1532e64O71K24o90N1O60k97m66N18L32o66K1N85k10m16M86J15n00J73L41m43j25
$$ -564 107 331 -359 -308 352 55 -411 107 439 -227 -206 379 169 -247 239 354 -146 27 368 -75 -200
1553b00M85j41n47L88K68m80j82O04j53m95L86K62l92p8M63j27k82K39J39k30
$$ -200 285 144 -403 -15 253 -227 -409 195 42 -453 -67 195 -197 -275 188 61 -221 18 157 -73
1573g3M1K15j55p9K57j37q1J87l4k65K29J06l37o2M48k33l40L48J69n18J75L12
$$ -73 -32 183 28 -51 206 69 -12 175 141 -124 105 211 -126 -188 260 27 -313 35 204 -314 -139 173
1595A73l30p3K63j11k25L55R5l94J44M62m46k32P11Op94L92N71n68l32P69q8o97
$$ 173 -157 -230 33 -78 -303 52 147 -247 -103 359 -87 -319 392 398 -396 -4 567 -1 -333 436 348 -349
1617c49L88M54o78j71O57k11n49M94K06o65K15N12n27k16P09j55n94N15M41o86
$$ -349 39 493 -185 -356 301 90 -459 35 241 -424 -209 303 -224 -440 269 114 -480 35 476 -210
1637b10j34Q54k94o68O07M32p90rP05m06m19N18P9n91L24L18n31j5N02k84m14
$$ -210 -344 510 216 -452 155 587 -203 -212 493 87 -332 186 265 -326 -2 316 -215 -230 272 -12 -426
1658d26N08J48o95K90N87n12l82P56J7p08L20M95m41k37N91o6m65L49K13m54J02
$$ -426 82 230 -465 -175 412 -100 -482 274 291 -417 -97 398 -43 -280 311 245 -220 129 342 -112 -10
1679a0L19l46j57M79j42m73L78K27n10n5N44k16n09M79J84m59j1M65j58l68L88
$$ -10 309 -37 -194 285 143 -330 48 275 -235 -290 254 38 -471 8 192 -267 -278 187 29 -339 49
1700D9Q5k18O2K21k08MK75k14j46L50k8l62J37L09k92k29L39k9l80J16L00k74
$$ 49 134 -84 -22 199 -9 -5 270 56 -90 260 232 -130 7 316 24 -205 134 105 -275 -159 141 -133
1722a33j38K97j9k15J26Q8j54J08J46j94J1K98j84j80L28M6l34O8L84k46k43K92
$$ -133 -271 26 7 -208 -82 6 -148 -40 106 -88 -77 221 37 -143 185 231 -103 -35 349 103 -140 152
1744A52R9m17L5L96k27k77K96L7k95J06J58j83o0K43j36j24K48M3k69O6L36k78
$$ 152 251 -166 -131 265 38 -239 57 94 -201 -95 63 -120 -180 63 -73 -197 51 94 -175 -109 227 -51
1766e1j69M14J1m15K48K57k53j25L12o9k57J33J11k29O6Q5j66oR3k3j77J40J34
$$ -51 -220 194 205 -210 38 295 42 -83 229 160 -97 36 147 -82 -16 69 -97 -103 -10 -33 -210 -70 64
1789F4k47L3K42j03k32K87N5k14J08K06j67p9K33p3j76J30Q8k26J43J48k05m9
$$ 64 -183 -150 92 -11 -243 44 99 -115 -7 199 32 -47 186 113 -63 67 155 -71 72 220 15 -34
1811c4J88r6j98J42J22k78k6K92j07k92K41J75k38o9K81o0k39K37P3j42N8J60
$$ -34 154 58 -140 2 124 -154 -180 112 5 -287 -46 129 -109 -178 103 43 -196 41 114 -28 30 190
1833A90j76m2J47K5j51M6J40j12j66J99K4k35Q3J23p9k62K68P1k41KK25j79j10
$$ 190 14 -28 119 144 -7 39 179 67 -99 100 124 -111 -28 95 16 -246 22 93 -148 -146 79 -100 -210
1856b10K55l0j88J39J42k01J5J94m6j67J90L1j06j8J98j66q0J30L8j64L6J35k00
$$ -210 45 15 -173 -34 108 -93 -78 116 70 -97 93 124 18 0 198 32 -48 82 120 -44 -8 127 -73
1879g3k0J13l3j15Q6Oj27N1J46j91L2J40k7j38J84J68l18Q8K14j50j25K38mk29
$$ -73 -93 20 -13 -128 -42 -36 -163 -112 34 -157 -125 15 -12 -150 34 202 -116 -28 186 36 -89 149 145 -84
1903h4K11Q9k94M4J78j22j56J99O0l00J14J75k00j46K85N0k92P5K20r9k06K98
$$ -84 127 216 -78 -34 144 22 -134 65 125 -175 -61 114 -86 -232 53 103 -189 -114 106 7 -199 99
1925I9Lk50J45K15k27n3K50o5j29J14K8j99J09J26j58j05K01o6q6K2K1q9j6J33
$$ 99 102 -148 -3 212 -15 -68 182 117 -12 102 130 -69 40 166 8 -97 104 38 -48 -26 -5 -94 -110 23
1949B3j12qR4j02j1J24k4j33J56P4j07m3K52j62j53K47J36l35K7L08j95k90L89
$$ 23 -89 -97 -3 -105 -116 8 -16 -149 7 81 -26 -69 183 21 -132 115 251 -84 -57 251 56 -234 155
1972A55J12m63J07L20l22k01M30K8m83K30L11m39m8N08j63n16M74K58o10K8P17
$$ 155 267 -196 -89 231 -91 -292 138 166 -317 -87 224 -215 -263 245 82 -434 40 298 -312 -284 433
1993D33k99n94O46L12p17j1P88m73m67O55J45p64J58O40n55l22P12o4o79L41M58
$$ 433 134 -460 186 498 -219 -230 558 85 -382 273 418 -346 -188 452 -103 -425 287 223 -456 -115 343
2014C43n59j98O85r5o46M39L61o07K6N84k44m84N13K61o35O0O22l92l39M90J19
$$ 343 -216 -414 271 176 -470 -31 330 -277 -251 333 89 -395 118 379 -256 -196 426 34 -305 185 304
2035C04n43J87L83l52k49M49q9l50K21K42l78l2L47j04l00L02J02l02K3L23j84
$$ 304 -239 -52 331 -21 -270 179 90 -260 -39 203 -175 -207 140 36 -264 38 140 -162 -139 184 0
2056@j94L67j9k28M5K61k24p3K09k7k28J76N8k00J00P5j04r5Q0R4j70P8L6j41
$$ 0 -194 173 154 -74 -29 232 8 -65 144 117 -111 65 123 -77 23 98 -6 -101 -21 73 -97 -19 17 -124
2080a24lJ53n3m8M5O4q1R0oK6p3M5J2k0O4j00J13j3p2l3J14j1j51j5K32j51j78
$$ -124 -127 26 -27 -75 -30 34 -47 43 37 63 -10 35 47 27 91 -9 104 91 19 -14 100 89 -62 -77 155 4 -174
2107a74K31o5j92J35J41k23k4K74j60j35K45K7k54J30K75k48j43L95m0l90K45
$$ -174 57 -8 -200 -65 76 -147 -171 103 -57 -192 53 80 -174 -44 231 -17 -160 235 195 -195 50
2128E0K47l50j08M35j24m17L19K76m74o3M84k70l10L63J10m57J38L65l25j67M33
$$ 50 297 -53 -161 274 150 -267 52 328 -146 -209 275 5 -305 58 168 -289 -151 214 -111 -278 155
2149A55p7m13L37K96m56o1N04j57m26M14L04n03r1N04j65l62K45J82l73l4M07
$$ 155 78 -335 2 298 -158 -219 285 128 -298 116 420 -83 -174 330 165 -197 48 230 -143 -177 230
2170B30k21j99K09J11l33J30J60k12l6K32q2j63J67J01k18M4K55r9j74J43O4p6
$$ 230 9 -190 19 130 -203 -73 87 -125 -161 71 -11 -174 -7 94 -124 -80 175 76 -98 45 109 33
2192C3m1R6j8q4J6M8l0k6k9M4J5o4q1R4P5k11L4J67m5j61J08R8q0q0J70L0q5k4
$$ 33 -8 88 70 -14 2 50 20 -6 -35 9 24 -40 -121 -27 48 -163 -129 38 -7 -168 -60 38 -42 -122 48 78 -7 -31
2220c1J20o0lL8n7M8M7n7j10J74L9k19K0J73p9k92J76K36k17k24K93N1k83J12
$$ -31 89 29 26 64 7 55 102 45 -65 109 148 -71 -51 122 43 -249 -73 163 -54 -278 15 66 -217 -105
2244a05J22k4j17M0J21o9L0L1j1NK4k6J5J13j29p6J01J28k34j4J71n2k04L8K36
$$ -105 17 -7 -124 -84 37 -32 -2 29 18 23 47 21 36 149 20 -56 45 173 -61 -75 96 44 -160 -122 114
2269A14j86oN0J29k34LJ06Mj18M0J54q3m1P0K8K6j8ml3J35m8j50J56N9j91n6K02
$$ 114 -72 -78 -28 101 -133 -130 -24 -20 -138 -98 56 -27 -68 2 30 56 38 34 1 136 88 -62 94 153 -38 -94 108
2296A08J5k16L1J24k2k15J33J66j73j49J95M7j29rR5o4mN2L7nQ2j19L5J09l3j02
$$ 108 123 -93 -62 62 40 -175 -42 124 -49 -198 -3 44 -85 -94 1 -63 -67 -15 22 17 99 -20 15 124 91 -11
2322a1KJ33q1j39J21J13j80o2J40K0j56J9J02l3j50R2O5j7p0K6J12l7p9N3Q9p1
$$ -11 -9 124 43 -96 25 138 -42 -104 36 56 -100 -81 21 -12 -162 -70 -5 -22 -92 -66 46 9 -70 -17 72 1
2348Aj23J41Q5l7j17J50L1r9k3N2k7prj02P7Q2j63l7K53j23k38J69K15k63j18
$$ 1 -122 19 104 67 -50 100 131 32 9 61 34 27 18 -84 -7 75 -88 -125 128 5 -233 -64 151 -112 -230
2373b30L08J5l16J41K30j58j24K42k4j81J62O4j63N5K14k57k8K81j78k09J96J53
$$ -230 78 93 -223 -82 148 -10 -134 108 84 -97 65 129 -34 21 235 -22 -50 231 53 -156 40 193
2395A93l05n3L69j43k93K08K00k65j07K91o6j87J29Q4j06q2K57q8q5J60n5j08
$$ 193 -112 -165 204 61 -232 -24 176 -89 -196 95 29 -158 -29 55 -51 -133 124 36 -49 111 56 -52
2417e2J09J15k30L6J81j18k09K21J22k46p1K67o8j85J2K04m5j75J52K5r4l8Q3
$$ -52 57 172 -58 -22 159 41 -168 53 175 -71 -142 125 57 -128 -116 88 43 -132 20 45 -49 -87 -4
2440dK4n7J8J1L1KK0j4RM1r0O9%l4j9N7o7k3N4n3j2O3j05%J22q4j14J28J57k03
$$ -4 20 -37 -19 -8 23 25 45 31 40 81 -9 60 60 26 7 64 -3 -26 28 -25 -37 26 -79 -79 43 -41 -155 -27 130 -73
2470g3r2K78n9k00P4K11j30k10L47L0k46P7J51j56j06K26qk55J47J54k89O9K17
$$ -73 -165 113 54 -146 -72 139 9 -201 146 176 -70 7 158 2 -104 122 114 -141 6 160 -129 -60 157
2493A57j66k07K76J20l77L2L54j33l40K63J70k78jK70j67r4J76K1j74R3J06k6
$$ 157 -9 -216 60 180 -197 -165 189 56 -284 -21 149 -129 -130 140 -27 -121 55 76 -98 -5 101 75
2515G5j27J78n7j11Q4P1j51M0O6n7n5N9j0p1O8j6j02M8J1k8N9J2o1k3J78j13l1
$$ 75 -52 126 69 -42 42 113 -38 2 68 11 -44 15 5 -66 2 -14 -116 -68 -57 -85 -26 -14 -75 -98 80 -33 -64
2542f4J49J4j65J2K22j39j39K82o4k19J34J02j79o7K52l9k45J34J18k52j0L29
$$ -64 85 99 -66 -54 168 29 -110 172 108 -111 23 125 -54 -121 131 92 -153 -19 99 -153 -163 166
2564A66k39j66K83Q7l37J10L22k78j78L71J1l46J75K91k91j60L79l0l76K61K03
$$ 166 -73 -239 44 131 -206 -96 226 -52 -230 141 152 -194 -19 272 -19 -179 200 170 -206 55 258
2585B58l00j06L45j30k66J68J81l05K6L39j49k89K62J01l28R8L28k63j96L05Q9
$$ 258 -42 -148 197 67 -199 -31 150 -155 -129 210 61 -228 34 135 -193 -95 233 -30 -226 79 168
2606A68l69J54K32j67j56K76N5k96J31J80j97j42J95J9j66O2J77j91j42K60m1
$$ 168 -201 -47 185 18 -138 138 193 -103 28 208 11 -131 64 83 -83 -21 156 -35 -177 83 42
2627D2k19J13J66j56o6J38J8j61L9J82j59m3J60J9j13Q4J06j19q0J12K9j13N3
$$ 42 -177 -64 102 -54 -120 18 36 -125 -86 96 -63 -106 54 73 -40 44 150 31 -49 63 92 -21 32
2650C2J11j90nN7kn7J6J0J6l7N9J8q4JM6J0p4O5ml6O2L6r8P3L5jj7J1m3L1l4N0
$$ 32 143 -47 -52 5 3 -54 -38 -28 -12 -49 10 28 -56 -55 -9 1 -73 -8 -12 -48 14 50 -48 25 60 59 42 53 10 41 7 57
2682E7k9j07J24m4l2J9j0m2P6K8p9j2lM3l9K9Rn4LQ7Nj15J57k3n9J5Q3q7j6J16
$$ 57 28 -79 45 1 -31 -12 -22 -64 12 40 -39 -51 -54 -11 -50 -21 -12 -66 -63 24 29 -86 71 48 -11 4 87 0 -16 100
2712A00j4j21LJ13j09P0J1j1j33R2M3j32J3O0kj15P9Q6j20N3O6p1n1J17N5j01
$$ 100 86 -35 -32 81 -28 42 53 42 -91 1 44 -88 -75 -15 -17 -132 -53 33 -87 -34 32 -39 -90 27 82 -19
2738a9Q4j4k1l2K2P2q8ML5Ql6o8Q5m4%k9K4J5j10J23lr1K5Q7n2j7qJ20j03j0J57
$$ -19 65 51 30 -2 20 92 4 8 43 51 15 -53 32 -12 -12 -41 -17 -2 -112 11 8 -83 -58 29 -23 -40 -48 72 -31 -41 116
2769A16p5j16J66j2j01M5O7j41RJ48p1q0M4J28j82mP4L5j68R6M0p1LP1j5j26J44
$$ 116 41 -75 91 79 -22 23 90 -51 -42 106 35 -45 -1 127 -55 -59 15 50 -118 -22 18 -53 -50 21 6 -120 24
2796B4M1q4o3J35K2r9nJ03q5l5J30o8o1R0P5j04r4P2M3j34J15j2o0L9J9L0j01
$$ 24 65 -19 -82 53 75 -24 -29 74 -11 -46 84 16 -45 45 120 16 -78 -6 37 -97 18 6 -54 -15 4 34 -67
2823f7L3R3r4l8P6O7p2m5J00mn8KO2n1j8O6l2n0R7Ql2m5M9Oq0QM6n9o3J10L1j79
$$ -67 -34 59 -35 -73 3 70 -2 -47 53 49 -9 -7 55 4 -14 52 20 -30 67 75 43 -2 47 53 -27 -19 27 -32 -95 15 46 -133
2855a33P1J18r3p1J58L7j39L5J36j22r5J15L3j35O9J80j40j25J63l0j00R7O5j12
$$ -133 -62 56 -37 -108 50 87 -52 -17 119 -3 -98 17 50 -85 -16 164 24 -101 62 32 -68 29 94 -18
2879a8m4J59p9j06R6O7j64L1O9n6k6J33jj51O1R2j05MR8O5j64K5P4q6kJ42m5n8
$$ -18 -62 97 18 -88 8 75 -89 -58 11 -45 -71 62 61 -90 -29 63 -42 -38 60 125 -39 -14 60 -26 -28 114 69 11
2907A1K8k4k1M3n8m8rR0p7kQ6m8J1l4L8o6N1O6o4pK4L8o7R0n8j2M1k3j2J5P7o4
$$ 11 39 15 -6 37 -21 -69 -78 12 -65 -67 19 -29 -18 -52 -14 -80 -29 37 -27 -34 -10 28 -39 51 -7 -19 22 -1 -13 2 79 15
2939A5k0KJ6l6l9J06J8q7MK8Pp9J7Q4o3l7N7m4j8P1M3n6L2N6l4k0kK1j6Qn2N8
$$ 15 -5 -3 13 -23 -62 44 62 -25 -21 7 14 -65 -48 36 -27 -64 -7 -51 -69 2 45 -11 21 77 43 23 21 42 26 34 -18 40
2971D0r5O4N2q2j1J05r2o0J03L5j19L0L7m3MK2L3r6kJ23l6n2J18m2j13P9J43j30
$$ 40 -55 9 61 -21 -32 73 -19 -79 24 59 -60 -30 7 -36 -32 -10 23 -73 -75 48 12 -40 78 36 -77 2 145 15
2999A5m0L2M1n2L4Q0j61K5Q8m9j38J24N7j01l2Q5L5j31O7P1o1l0L2Q2j11kJ03
$$ 15 -25 7 48 -4 30 110 -51 -26 62 13 -125 -1 56 -45 -77 8 43 -88 -21 50 -11 -41 -9 73 -38 -40 63
3026F3o2j1L3L9q6P7J2o9j7J14n8p4N4k4l9J3J05p4j6j2K6l3oK7n3lR9k4o2P9
$$ 63 1 -10 23 62 -24 53 65 -4 -21 93 35 -39 15 -9 -48 -35 70 -4 -20 -32 -6 -39 -45 -18 -71 -74 25 1 -61 18
3056A8l5l8L7R6j31P1P7r1l0O0N4j06J9Q1p9p6J32l5q5O2O3j32N6P9j06o3Q9R2
$$ 18 -17 -55 -18 78 -53 18 95 4 -26 34 88 -18 1 82 3 -73 59 24 -61 1 64 -68 -12 67 -39 -102 -13 79
3084G9j81Q1J30j60m2J83k2j81R3J40r8r4K31n0k55J32J70j55p6K15r7j23J17
$$ 79 -102 -21 109 -51 -93 90 68 -113 -20 120 22 -72 159 109 -146 -14 156 1 -75 140 43 -80 37
3107C7O2j90M3J44n0k13K08J8j76N8J16n8j08J54N8j81N1Q4k6j17J91k3j72O7
$$ 37 99 -91 -48 96 46 -167 41 59 -117 -59 57 -1 -109 45 103 -78 -27 57 31 -86 105 82 -90 -23
3131b3J59j65j04K32o1j15P2J34j94K5R8j10j09J89P0k57P5J54r2r1J44N0j53
$$ -23 136 -29 -133 99 38 -77 -5 129 -65 -40 58 -52 -161 28 98 -159 -84 70 -22 -113 31 81 -72
3154g2M1J07p9n9J32k5q9P3P9j34l5J06l4n2R3J8j37N2J16j44n1J35l9q9Q6N7
$$ -72 -31 76 -3 -62 70 45 -44 29 108 -26 -61 45 11 -41 52 70 -67 -15 101 -43 -94 41 2 -87 -1 56
3180E6j24L2J26j61m4J46K5j46Q2J17j38n6J60O0k33J43M1j18MJ18j0k20J68O2
$$ 56 -68 -36 90 -71 -115 31 56 -90 -8 109 -29 -85 75 135 -98 45 86 -32 -28 90 80 -140 28 90
3204I0j75jK28r6k09J75K7j72L5K31j70q5J68Pj72J62L1o8o4J37l1j51J12N7j35
$$ 90 -85 -86 142 46 -163 12 39 -133 -98 133 -37 -122 46 53 -119 43 74 6 -58 79 48 -103 9 66 -69
3229f9M9J46j20n0J27K3k21N7J71p8j45J93j6j65K8J58j15q9J72l2j46J34Q6j68
$$ -69 -20 126 6 -44 83 106 -115 -58 113 35 -110 83 67 -98 -70 88 -27 -116 56 24 -122 12 98 -70
3253g0Q7O7m6p6P9M3j31O9O2j18k3J42j7j60J43M6j37lJ33j09p4J10J5q7K7Q2
$$ -70 17 84 38 -38 41 84 -47 22 84 -34 -57 85 68 -92 51 97 -40 -43 90 -19 -93 17 32 -55 -28 54
3279E4n6r6R8J8l7k3P7l2m6J04k8k3L2M7r8J4N1Kj23L3Q9j04MP1Jl3K7qmm6J8
$$ 54 -2 -98 0 18 -19 -42 35 3 -43 61 33 10 42 89 -9 5 56 58 -65 -32 57 -47 -43 28 29 -4 23 15 11 -35 -17
3310a7L3m7M6J9j21N7N7Pp3O0Ko9J04j5m0m9O4jl3N0K1q5L1O9q8j1K9o4M7J6N
$$ -17 16 -31 15 34 -87 -30 27 34 -39 21 23 -46 58 43 3 -46 18 17 -16 34 55 -30 1 70 -18 -29 0 -64 -17 -1 4
3341Do5N2L6o0K3k0O1o1O2j2m5MM4j9j1N1lp5R4n1oK8J3rn3N4k3p5M8K9r0M3R7
$$ 4 -61 -9 27 -33 -10 -30 31 -30 32 20 -25 -21 23 4 -7 44 41 -34 60 9 3 31 44 35 -18 36 13 -62 -14 15 -75 -32 65
3374F5o0o7O8K3j18O7Q4j08K9R7m3j44J28Q0j53J9J08j26K3P1N5j63%J41q4p3
$$ 65 5 -62 6 29 -89 -22 62 -46 -17 80 37 -107 21 101 -52 -33 75 -51 -28 43 98 -65 -65 76 -8 -81
3400h1J27m2j45N5J60j25q5K12p0j19J69j4p0j4J24p1r6J78m9o0L0J01j27k5N6
$$ -81 46 4 -141 -86 74 -51 -136 76 6 -113 56 42 -28 -42 82 11 -85 93 44 -16 14 115 -12 -37 19
3425A9J21k21O8Q7j00j7J15n5q4M0N1p5j7J14q4m0O4O3o8m2J06m4K5Nk2Pl7J32
$$ 19 140 -81 -13 74 -26 -43 72 17 -67 -27 24 -51 -68 46 -38 -78 -14 49 -19 -61 45 1 26 31 9 16 -21 111
3453A11l6m3kmn9K8N2o5KR1q5jj1L1m6N7l5Kj5M0k9l5K1J00j37J9P9L4o7O4l3
$$ 111 75 32 30 26 -33 -5 47 -18 -16 75 -10 -11 -22 9 -37 20 -15 -13 -28 12 -17 -52 -31 69 -68 -49 30 64 -3 61 28
3484B8n4M1J4l0k9Q%LL5Jj4JJ5m7jK3o0N6j6k4pP8o1K2OL2q7L0J19m6p6O6K9m2
$$ 28 -26 15 29 -1 -30 -22 -22 -19 16 17 3 4 19 -28 -29 -6 -66 -10 -26 -50 -57 21 -40 -18 -12 20 -67 -37 82 36 -40 26 55 13
3518A3o4M0L3n8O2L6q8J1J01r5l0N7Mj19M0J77j38m4Q9j6m2q6J81n1p8J35N1j56
$$ 13 -51 -11 22 -36 26 62 -26 -15 86 -9 -39 18 22 -97 -57 120 -18 -62 27 11 -31 -117 64 13 -65 70 121 -35
3546c5P3k4l3m3J38Lj93J03K6q6N0M6J5o3N3J4j46Q2M8r1j9P0O9j43M6N2l3o1
$$ -35 38 14 -19 -62 76 79 -114 -11 15 -71 -21 25 40 -23 30 44 -102 -20 28 -63 -82 -12 57 -86 -40 12 -21 -82
3574h2J23lo6Q9J3p3j2N0r1%R1Rj02O0M9r3lP8Oj27J43J4j46K3J22p9j08J38L7
$$ -82 41 38 -28 61 74 1 -11 39 -52 -52 39 48 -54 6 55 -38 -41 37 43 -84 59 73 -73 -50 72 -7 -115 23 60
3603F0p3o8J94j39lP2J1j63J23J26j62l0Q3kj52J38J03j45l7J30n9j09J45J0j28
$$ 60 -13 -81 113 -26 -29 43 54 -109 14 140 -22 -52 31 29 -123 15 118 -27 -64 66 7 -102 43 53 -75
3628g5O9J07j23o3J24N5j80J6J58p5j10J46m7j19M5J43q4n9J54o1j53R7J41j71
$$ -75 -6 101 -22 -85 39 94 -86 -70 88 13 -97 49 2 -117 -72 71 -13 -72 82 21 -132 -35 106 -65
3652f5k5J54m8j01J53Oj23j0J47j02r4J10Ok2m7J31q7p9J18L0j11K4J01m0m4N2
$$ -65 -90 64 16 -85 68 74 -49 -59 88 -14 -108 2 8 -14 -61 70 -17 -96 22 52 -59 -35 66 26 -18 34
3678C4k1k6mN0q1M2M4nr5N1L2k7ONom4oJ00o6m5M1q7J36k5mk0P6o2L6m7l1J01
$$ 34 13 -13 -17 33 -48 -6 38 33 -62 -11 21 -6 0 5 -1 -45 -51 49 -17 -62 -21 -108 28 3 -1 -21 55 -7 29 -18 -49 52
3710E2l7M2l0%m4PN3j1l0j7M7j5n3k5M2KNL4n1kj1O4j18J02J0l5K9p7Q7j0OpN
$$ 52 15 57 27 27 -17 -10 43 32 2 -15 32 17 -36 -61 -19 -17 -12 22 -29 -31 -42 22 -96 6 16 -19 10 -67 20 10 16 9 14
3743A4l6Q4lq8N6M1n2m1P8p2lN3J7j11Q7Or1N8k1J7m0N0q%k2MQ2m9M0k5l1J1N3
$$ 14 -22 62 59 -29 27 68 16 -25 53 -19 -22 31 48 -63 24 30 -61 -3 -24 -7 -47 3 -5 -5 -27 -23 59 10 50 25 -6 5 58
3776E8m6kp%n4O2K3l0j6K1Np6LJ5O7p3K0M5l4lQ5mn6KK2l0r1J60nj21N0K3m6J1
$$ 58 12 10 3 3 -51 11 34 4 -12 9 14 -62 -59 -44 23 -50 -30 15 -19 -22 63 59 3 5 27 -3 -94 66 61 -60 -10 13 -33 -22
3810b2J17p7n1Q7Oj11M4J6J5o2O5Qr4M2P8j40kJ37p2M0Jj4m3N6j4M0r0J05m2k6
$$ -22 95 18 -33 54 60 -51 -7 9 24 -38 27 35 -59 -17 61 -79 -81 56 -16 24 25 11 -32 24 10 50 -40 65 23 -3
3840cM2Nk1m4Q4n9l4R8n8j8lJ3K3n1J0pk7O5j0Ml6nN3l2mK9j8oN5m6LP3j6j57
$$ -3 39 44 23 -21 63 4 -30 68 10 -8 -11 2 25 -26 -16 -23 -50 15 5 9 -27 -32 21 -11 -15 14 -4 -10 45 -1 2 75 59 -98
3874i8J14k2J4l7R6Jn0K6k4l4lj1M3m4k6P5jj3j9NL3K2k5%k1J9k6p6J24K3r4J1
$$ -98 16 -6 8 -29 67 68 18 44 20 -14 -17 -28 15 -29 -55 20 19 6 -13 -8 25 47 22 22 1 20 -6 -82 42 65 -29 -18
3906a8J6j1j1J0J5Ok1M6j0Kn7P3o8K3M5o6K6oK3J2n2RNK7J8j4qm3R6q5%M2Jo0
$$ -18 -2 -13 -24 -14 1 7 -14 32 22 24 -33 40 -28 -5 40 -26 0 -6 17 29 -23 -14 -9 18 36 22 14 -29 67 -18 -18 24 25 -35
3940c5L3m1N6qj3O7r7J9J6l4L3l8qM9J1k3j2lM7j1p0N8j7N1Lk6l4J6N6o5L8L0
$$ -35 -2 -43 13 5 -8 59 -38 -19 -3 -37 -4 -42 -50 -1 10 -13 -25 -28 19 8 -62 -4 -21 30 33 7 -27 -11 45 -20 18 48
3972D8K3p3m8N7mK0n1L9n6O5o9K4N1J3q1K8Kl3KK3K3QJ1J7j2j6N7j04O1K0o0L2
$$ 48 71 -2 -50 7 3 23 -28 11 -45 20 -49 -25 26 39 -42 -14 -12 -45 -43 -20 3 11 22 39 27 11 68 -36 25 45 -15 17
4004A7j9O3r2Q3Jm9n7P2lo1Q5l5o7P6lJ7n7O5r6qK7N2m1k2M8K0k7RR1p8M4k3j8
$$ 17 -2 61 -31 52 53 4 -53 19 16 -45 40 5 -62 14 11 28 -29 36 -60 -68 -41 11 -30 -52 -4 16 -11 -2 89 11 55 32 14
4037A4n5P9l1k9J7K2o0oM2M2l4J2l1O2q4L9k1j4O9J8r2NL3N6m1p0J06j4j10J08
$$ 14 -41 38 7 -22 -5 17 -43 -49 -7 35 1 13 -18 44 -40 -1 -22 -36 33 51 -41 -36 -3 53 12 -58 48 34 -76 32
4067C2j2k0n9R4n1j3N7j5r2P6R0r9j0M6l5n6O5Q3p5o5J08J0j26J35p2j7jJ01q0
$$ 32 20 0 -59 35 -16 -29 28 13 -79 -3 87 -12 -22 24 -11 -67 -2 81 6 -59 49 59 -67 68 -4 -21 -22 79 -1
4096ak6J38j00n1jR6j11PJ12o9pM9Np8J1P8n1o8O9Pp5J14Qn9n0M2M1m4j2O1j05
$$ -1 -27 111 11 -40 -41 55 -56 -49 63 -6 -13 36 41 -37 -26 52 1 -67 2 9 -66 48 56 -3 -53 -11 30 -14 -26 35 -70
4127g0J0R3qq7R2l2kKL2L2q1RmQj2K3j8j9pO2m3J7k7J5k8j7L5K0K8q0L7L7o9P5
$$ -70 -60 33 25 -62 30 -2 -4 -2 30 62 -19 -10 -14 -6 -18 5 -13 -32 -39 23 -20 -3 -30 -15 -43 -60 -25 -5 23 -57 -20 17 -52 23
4161B3oJ4j2j0K2n1PLK8m1Q8l6n1k0M3j4M9j7j2j8Op5P3L3rm%o1N3N4p4Jj4R3
$$ 23 17 31 19 9 31 -20 -13 -10 18 -23 65 29 -22 -42 1 -13 36 19 7 -11 -5 -80 -7 26 17 13 13 -48 5 59 -15 -14 -28 65
4195F5n5M6l3kj5n0R2l3qNk5J1k0lJ5L5n4QO1k7q1L2K0Rl8K1O3l6J2L1j6n2M9
$$ 65 10 56 23 21 6 -44 48 15 7 12 -13 -2 -22 -25 -10 25 -29 -21 40 13 -68 -36 -16 -7 -45 -24 39 3 15 46 30 -22 27
4228B7l4pQJ7M5p9M8K4p3Nl6P2n1M1o4J7K0J4j1QK6k8J1j4mk5N8m7O9k0j9RJ9
$$ 27 -7 -14 -6 11 56 -23 25 49 -24 -19 -55 17 -34 7 -57 -40 -20 -6 -17 -9 17 -11 0 -14 -18 -43 15 -32 37 17 -2 7 26
4261B6k4oK3M0m3jl2j0M3J5k3n3QK8kk0J4K3m1P2j1n7J6J4K8k5lK7j9o6P5Ln0
$$ 26 2 -4 19 59 16 15 -17 -27 16 31 8 -45 -37 -9 -11 -31 -17 6 -35 37 26 -31 -15 -1 27 2 -1 26 7 -59 16 19 -31
4294c1NR0rp0%o1R4L9p0oM7K0o2K3K9k2k7L5n5K7M4k8q3K6P5n8K2k5j3K9KM7j4
$$ -31 -26 64 55 -15 -15 -76 18 57 -13 -19 28 48 -14 9 38 16 -11 24 -31 -4 40 12 -71 -45 30 -28 -6 -31 -44 -15 -13 34 20
4327B0K1mN3j20M9rk0k1J9k1J4L7k9K3j7J2lo4N7N1p3lj8N5K6p8K9l1L7M4m7k6
$$ 20 41 37 90 -30 19 10 -10 -31 -12 -33 -19 18 -11 12 -5 7 4 -60 -3 48 -25 -28 -46 9 35 -43 -14 -45 -8 36 -11 -37
4359c7kJ13l8l2QRn0M2M4r3N3k5n4L0P2n7jL8p7P3n6J06l9p6L0L5j5K5rj1lK4
$$ -37 -39 74 36 4 12 21 -29 13 57 -36 17 -8 -62 -32 40 -17 -18 20 -57 16 -40 66 27 -49 -19 16 1 26 17 6 3 27
4391B7n2J2M0J3n1K4LK2p1K5O4j19M0j9K8m3O8J4m6JL4m6J4QlK5J1K1o3k1N8k6
$$ 27 -25 -13 27 40 -11 13 16 38 -33 -8 56 -63 -23 -42 -14 -57 11 25 -21 -20 14 -32 -18 -10 -13 12 23 44 -19 -40 18 -8
4423hk3Q8o0k3J3M6Ll4jjk4OL2p5L6M3K0j09O0P0n5k9POj8L3J2mM1m4Lk3Pj0L0
$$ -8 -31 57 -3 -26 -13 33 36 2 1 0 -24 -18 14 -61 -25 18 38 -71 -11 59 4 -25 -18 -12 -30 3 15 11 52 8 11 -12 -5 -15 15
4458A5lKm5J5Q5o3j7OK3j4KMKo0Q5p5L9J6ll5jP2p6N6l0J6qj2j0K7J4m9J8k0P1
$$ 15 12 14 -31 -16 69 6 -11 -5 18 4 6 10 12 -48 37 -38 1 17 14 -21 -22 50 -26 30 0 16 8 -4 -14 13 27 -22 -4 -24 47
4493D7o4K9Rl2l0R6m2l1R0l8l3Q2j52R9o0K8KJj6L7o5L0kl3L5O3mq9O9n8O1q0
$$ 47 -17 12 21 -11 -41 55 13 -18 72 34 1 83 -69 30 -30 -2 0 1 -15 22 -43 -13 -15 -48 -13 50 46 -43 26 -32 29 -51
4525e1N0Q0n1q7L4L7l7N1k0j5n8J04r5Q4p2P0po8N9Rl8j6M9Po1Q8k0n0L5J9k9
$$ -51 -1 79 28 -59 -25 12 -25 26 6 -9 -67 37 -58 26 -46 24 17 -51 8 17 -21 -37 12 19 -42 46 26 -24 11 30 1
4556AN7m4%nK1o8K9M4m1K2l6K1K9l4l5K2K6Kr0N1J7l1O0k5j1k8L0L2m8k9N2J9
$$ 1 58 14 14 9 30 -38 -9 35 -6 16 -20 1 30 -4 -39 -17 9 11 -79 -28 -11 -42 18 -7 -18 -46 -16 16 -32 -61 -9 10
4588A0K1j8Jj8Lk1Q2l2l9N1j1n6j2P1m4K5k4pK8K8o3j4K6j1J9PK5o1j3J18k6m6
$$ 10 31 13 14 -4 -1 -22 60 28 -11 40 29 -27 -39 32 -12 13 -11 -18 10 38 -25 -39 -13 -24 -5 2 27 -34 -47 71 45 -1
4620aq%J0L8l6p%Jm7O6On0mj3M3j1J0J0n4k3O1M1k1njL4j6Jl2J5K7n3M8k7MK9
$$ -1 -9 -9 1 39 3 -4 -4 -3 -50 16 22 -28 -32 -45 -2 -13 -3 7 -47 -70 -9 32 11 6 5 39 23 24 -8 7 34 -19 29 2 6 35
4656C5m4j7L4q0N0L7o7K7k1J8l3Q5m0j3J5j6njK8J3mrK3J4j4Ql8P7q7M8om1l5
$$ 35 -9 -26 8 -72 -22 15 -52 -25 -46 -28 -61 24 -16 -29 -14 -30 -35 -36 -8 5 1 -8 15 29 15 23 -15 62 -25 23 17 -24 -59
4689e9Q1nPo8O1ql8M6o3L2Mk9K8j8MJ0k4O8nm8N0j2rk5%qJ5Jk9O7j8%k7RRpPk0
$$ -59 22 17 24 -44 17 9 -29 17 -46 -14 -10 -39 -11 -29 -25 -15 -39 29 24 -24 26 14 5 -20 -20 -28 -13 -12 -41 26 8 8 -19 -10 -1 -8 -1 -21
4727b1M8ll7j3J1j0M3j01P5N6m8J0Po8M1J11r7J6k1M7p6PM9l9j6P3Nk0n3N4m2
$$ -21 27 24 -13 -26 -15 -25 18 -83 -8 48 0 10 17 -51 -10 101 4 20 -1 46 -30 -23 26 -13 -29 44 49 29 -24 30 -12
4758a2Kk8N5p8K0M6m5J1M3j7K2n5J8Ok4O4j5RQj9l2L8l0K9k4j5L4rm9J20Rq9N2
$$ -12 -10 -38 17 -61 -41 5 -40 -29 14 -3 19 -36 -18 -12 -36 28 13 22 30 11 -21 17 -13 16 -8 -23 11 2 -47 73 82 -7 45
4791D5o3J8k8N2o5R2m2k8NM2m9jk5N7k1%K4qj7L2j3lm0L5J3rK7n1OM0qj7rk2J6
$$ 45 -18 0 -28 24 -41 51 9 -19 -14 28 -21 -22 -47 10 -11 -11 13 5 -12 20 7 4 -36 -1 12 3 30 -21 -15 25 17 0 -9 -31 -15
4826a5N2p2L0kl1N5k9J4j5L3rj8j4K9l0MN0l3j6P4L0q6k9J10r9j2j8M2j0L5L1
$$ -15 37 -35 -5 -7 -38 17 -12 2 -13 20 11 -7 -21 8 -22 -18 32 -1 -17 57 87 1 -28 82 -17 -29 -47 -5 -15 20 51
4857E1q0O3m1Qpn7O1J8l6k4M8j0L6pj1m5j1O9l3J5n0L3L9l3k9O5p3L1QL1o4K3
$$ 51 -29 34 -7 1 -6 -63 -2 16 -20 -44 4 -6 30 23 12 -33 -44 25 -8 7 -43 -10 29 -4 -33 32 -41 -10 -2 29 -35 -12
4889a2LJ9l2J1l2L8j5M9pmK3n8M2j8pl5K3P4p8R0k2o1j5J7K5r1L9P9l6pL5km4
$$ -12 -9 10 -22 -11 -43 -5 -20 29 22 18 41 -17 25 7 0 -35 -12 62 -16 74 52 -9 -24 -7 18 -73 -34 45 9 2 37 35 -9
4922im0K5M6n8M2n9M6K9kl4K4L0o6N0j6J4l5LM3jo5O8k6K1n5L6L8j04R0j8l2J
$$ -9 -49 -24 22 -36 6 -53 -7 22 20 -14 10 40 -26 24 8 22 -13 -10 33 32 -33 35 9 30 -25 11 49 -55 35 17 -15 -14
4954a4n3M4p0Q9Jm6N2kq2RL2O1l5M0%k1k5L2nJ8%qk6J4k0%K6k5L1Kj8K3l1L1l1
$$ -14 -67 -23 -93 -4 -3 -49 3 1 -81 -72 -40 21 -14 26 26 5 -20 12 7 25 25 17 -9 5 -15 -15 11 -14 17 19 1 24 -7 24 -7
4989gM%L0j9k9OPL6n8N7l1RjL0jl6j5pN3m0M7j5n0P6o7L9K8o3M7m3m8O2L7n2K1
$$ -7 -3 -3 27 8 -21 -15 -8 28 -30 27 -4 5 4 34 33 -3 -18 -25 28 -12 35 20 -30 46 -21 18 46 -17 30 -13 -61 1 38 -14 7
5024Gj5J2Ll6L8n2K5L9J2j0K4p6Pm5R7l7k3J8j1KlN9m5kJ4j9J2j1K4l6j8kL1O2
$$ 7 -8 4 7 -29 9 -43 -18 21 33 23 47 -29 -22 -67 30 -7 -30 -12 -23 -21 -24 35 -10 -12 2 -17 -5 -16 8 -28 -46 -48 -17 45
5058D5l4J9m5L7l1mPJQ5p6j2k8N5j3K5K8n4m9O2K3r2KQ0k1j6j1m%L5M8r8K1%j4
$$ 45 11 30 -15 22 -9 -13 -6 -5 80 4 -8 -36 19 6 31 59 5 -44 18 41 -51 -49 31 10 -6 -17 -21 -21 14 62 -36 -15 -15 -29
5092b9M7k3n7Q3k2l0J0NPK2k1k4L6M4n5J1L8o8m0N2L9k3OL1n9lNn5Q5jl6l2N1
$$ -29 18 -5 -62 21 -1 -31 -21 -16 -9 13 -8 -32 4 48 -7 4 42 -26 -66 -14 25 2 8 39 -20 -23 -18 -73 12 11 -25 -57 -6
5125foL4o7L9j0L4qKk1Rlk9nM2j6J0k1L0l8Q5p2K0n6K2PK9J7nJ4rL6m6k7N2l3
$$ -6 -12 22 -45 -6 -16 18 10 12 -9 0 -3 -32 -37 5 -11 -1 -22 8 -30 55 -17 3 -53 -31 -24 5 22 17 31 22 58 12 -15 37 4
5160DJ9L3n4%k6L2K7o2j8O9K6p6k0J5l7P6m8RP4p8N1p1PN4k6N3n7K5ojPL3l1N
$$ 4 23 56 2 2 -24 8 35 -27 -45 24 50 -26 -46 -31 -68 8 -40 -31 43 -35 16 -55 -48 6 -20 33 -24 1 -5 -6 1 34 3 8
5194HJoK8Pk5l5J3j2N3mk7j8qN5n4K1J0j0j2j6M6k1j1J8nn0L2L4j7l8Q9p9M5K
$$ 8 9 3 31 38 13 -22 -9 -21 32 28 1 -17 -25 30 -24 -3 7 -3 -15 -31 15 -6 -17 1 -4 -54 -22 12 -5 -43 46 -33 12 14
5228A4lrK7J1m9L3o9M0n8K6K4QRJ9o0O2q0J4RK6L2j5k5j9N0jqj6k4j0M9l3M9l3
$$ 14 11 2 29 40 -9 24 -45 -5 -63 -37 -13 -5 4 23 -37 25 -55 -41 -32 -6 26 11 -14 -33 17 16 8 -8 -32 -42 7 -26 23 -10
5262a0kQN0j7k4k4O0m3L0j7j6l3RK5l4mM7k2M2m4K2J1K4o9K9J6j3J3K4n1k2L5
$$ -10 -12 -4 46 29 5 -19 41 -2 28 11 -5 -38 -29 -4 -38 -42 5 -17 25 -19 3 14 38 -31 -2 14 1 14 38 -13 -35 0
5294@n7L5l7N0j2Pj4J4L1J4l2M7r6j4P7qk1kN3n2J9L8n3j0j3Q2l2o3M3k0l5O3
$$ 0 -57 -22 -59 -9 -21 -14 -28 -14 17 31 -1 46 -50 -64 13 5 -16 -18 35 -17 2 40 -13 -23 -36 46 14 -49 -6 -26 -61 2
5326BJ1l7O3J1m3l0K0M4n6m6O3m8K9j3N2l2L7o8M7J0k9K0n1K6K9Omk6N6n1k4J6
$$ 2 13 -24 39 50 7 -23 -3 41 -15 -61 2 -46 -17 -30 22 -10 27 -41 6 16 -13 7 -44 -18 11 17 13 -13 43 -8 -32 -16
5358a6K3l0L5mk2%L6J8m9K8m1Q5o0K6l6k8K5L0j6L5n7m5L8K5J9KJo9M6K9k8j1
$$ -16 7 -23 12 8 -14 -14 22 40 -9 19 -22 63 3 29 -7 -35 -10 20 4 39 -18 -63 -25 0 19 21 22 -47 -1 28 0 -11
5390a1JN4k7J4k6qo0O6j9j0O2pj3k7O1l2j6k4N2j0Jr0O5L3M1m3m9O4Kn2J5kKQ
$$ -11 -10 44 17 31 5 -3 -63 3 -16 -26 36 29 16 -11 50 18 2 -22 30 20 21 -69 -4 29 70 27 -22 42 44 -8 7 5 7 15
5424A5k0K0j0k2K6m7K3Jk2j9N5K5n2J7k5M7l1oL8j0k3k0J5L0J4lRj5j8JL7j0q1
$$ 15 -5 15 5 -17 9 -38 -15 -14 -36 -55 0 25 -27 -10 -35 12 -19 -25 13 3 -20 -40 -25 5 19 16 25 10 -8 -7 30 20 -61
5457f1O2O3Jq3LL7Nk7k6O9m1k7j2L4j1L9l5k2j4O1j15O9%M1K0k2K2k9n3J7L8k
$$ -61 1 64 65 -18 -15 22 27 0 -26 43 2 -25 -37 -3 -14 25 -10 -32 -46 15 -100 -31 -31 10 30 8 30 1 -52 -35 3 1
5489AN7n1k0k0k9P5pn9L2P3q8L7ln9N5lj5JJ1K9k2lJ1Mk7qM2J3qjj5L1PJ8n9k7
$$ 1 58 7 -13 -33 -62 13 6 -53 -21 52 -36 1 -2 -61 -6 -9 -24 -23 -12 17 -5 -8 3 7 -20 -28 14 27 19 18 3 34 41 59 0 -27
5525b7K4M9m2K0J8n4nK8K5k2k2M8k2l8M2M4p7k7N3J2ql9N3j3k4POj2J0N4r3L5
$$ -27 -3 46 4 24 42 -12 -17 11 36 14 -8 40 18 -20 22 66 -11 -38 15 27 19 -20 33 20 -4 3 9 -3 7 61 -32 3
5557Cl7k9Q3l3N4p3L5nK4m4J1L9n9P0o2rK8j0pPJL7k7pM3j2m1KK3J8j7j1N4k8
$$ 3 -34 -63 20 -13 41 -32 3 -2 22 -22 -11 28 -31 39 -23 -32 -4 -14 -21 -14 -13 24 -3 -10 33 21 -20 -18 5 23 6 -5 49 21
5591B1Oj4L4q8R5k1r1K4L7J4m1L2k5K1l0Nj1k2N9k2kjk2L9ln3N8j1P0k6J3k5m7
$$ 21 27 13 47 -41 54 33 -58 -34 3 17 -24 8 -17 4 -26 -21 -32 -54 5 -17 -19 -20 -42 -3 -6 -59 -1 -12 58 32 45 20 -27
5624b7P1m1LJ2k5OOl5K9L0l3k6K2j3ll1J00j9l0k3j0O5k4ql5M4J2k9JplL9k5l
$$ -27 44 3 6 18 -7 -1 5 -30 -1 29 -4 -30 -8 -21 -24 -55 45 26 -4 -27 -37 28 4 -4 -39 5 17 -12 -11 -18 -21 18 -7 -10
5658a0J7J4j1Mj5l2j3N0L5m1l1N7o1L8Jk1L5l9M8p0L4KjJ3M4p1l0O3k4O1m9k0
$$ -10 7 21 10 14 -1 -33 -46 4 39 -2 -33 24 -37 1 2 -19 16 -23 25 -45 -11 -9 -10 3 47 -24 -54 9 -15 46 -3 -23
5690b3K0l7Q9j2n7j4J6K3J9k2j4M1KJ1p4L1j1N0Lq3QP1j4k0J0Mk8qM3m8L4L2m6
$$ -23 -3 -40 49 37 -20 -34 -18 5 24 2 -12 29 31 42 -32 -1 -12 38 41 -42 -34 37 23 3 13 17 -11 -19 24 -24 10 42 -4
5723dJ0k3j0N2n4j3M7Rl7J2L5n8M1k2ORj4rj4M1opj3k1N6J3l3qN4l0l0N0kp2O7
$$ -4 6 -17 -27 25 -29 -42 5 14 -23 -11 24 -34 7 -15 -9 0 -14 -23 -37 4 -2 -9 -22 -43 13 26 -7 -15 39 9 -21 29 27 -45 22
5758B2l6K4J1m0k2P4l0p4P1K1j4Rn0N3L4r4Q5n3j4K2J7nJ3%Kj7K7q1P9k0m1M0
$$ 22 -14 10 21 -19 -41 33 3 -71 0 21 7 16 -34 19 53 -41 44 -9 -23 -1 16 11 24 24 26 9 36 -45 34 14 -27 13
5790A3Ml6oL2l9L0Kk3O6k3j6j5k4N0j9j3L1Om0N9qk2J3k4Kk9L7l3kL0j4J5n0N0
$$ 13 17 -19 -25 7 -32 -2 0 -23 43 20 4 -11 -35 15 -4 -17 14 20 -20 39 31 9 22 -2 0 -29 8 -25 -27 3 -11 4 -46 4
5824Dk2NJ1Nl3M0k5N0jn0OP7j10O9l4km7O4L1m7J6j0j6L7k0J2L0o9J6K7o6P6k8
$$ 4 -18 -13 -2 3 -30 10 -15 35 34 -16 -10 67 -43 26 -8 -10 -57 7 38 -9 7 -3 -19 18 -2 10 40 -29 -13 14 -52 24 -4
5857djJ5p6P4Nk2j5j8N0m0K2j3J1J2L8n1P3o5J0PJm4K4M4j5n9R2l3k9N5m5n7m1
$$ -4 -5 10 -66 8 13 -9 -24 -42 8 -32 -10 -23 -12 0 38 -13 60 -5 5 12 13 -31 -7 37 22 -37 55 22 -7 48 3 -54 -95
5890i5Q1K4j5KKM0m9nJ6p9J20o6RK2j5l4J6L0M5n1%j2J3j7P2j3q8N2k4qL8j2J7
$$ -95 -14 10 -5 -3 -1 39 -10 -15 1 -78 42 -24 -15 7 -8 -42 -26 4 49 -2 -2 -14 -1 -18 54 41 -47 5 -19 -27 11 -1 16
5923A6N1p2K3Pj9l5P6n1jmJ2j9L3j7j3O2l1k0N0m7k7k2K8P7j0l3K2p4M7j3nJ1
$$ 16 67 -5 18 25 6 -29 47 -4 -5 -9 3 -16 17 0 -13 49 18 -2 48 1 -26 -48 -20 57 47 14 36 -38 9 -4 -9 2
5955Bl1N6k4J8jm7J3N7l8Pl1M3m2j4N1J2jOk0j6j1j7J4O0p5O3n9k6J6K0L0m9K2
$$ 2 -29 27 3 21 20 -27 -14 43 5 12 -19 24 -18 -32 19 31 30 36 16 0 -11 -28 -14 46 -29 34 -25 -51 -35 -15 15 -34 -12
5988a2k9N2j7l9M9n7JJ18n9j4L7n0N3n1QJ4J2L4m3Jm4K6M0o8j0K6K7k4j0J5j2
$$ -12 -41 11 -6 -45 4 -53 -52 66 7 -7 30 -20 33 -18 -10 4 16 50 7 8 -36 -10 30 -38 -48 -22 5 -19 -29 -14 -26
6019b6L3L9Km4R9o9p0M0k2k0nmO8j2j9N9K1j04L4Ml5PK4L8m3k9J0K9M3o3NL4m1
$$ -26 7 46 48 4 103 34 -36 4 -18 -38 -43 -47 21 9 -10 49 70 -34 0 4 -31 -24 0 38 -5 -34 -24 5 48 -15 -10 24 -17
6052a7K8mL8k5k1LKnMQm1K9l5K0J8k3nM3J4J6k1M5o8j4j3M0k8K2Qk0M0q7L4j7
$$ -17 11 7 45 20 -1 2 4 -1 3 11 -30 -1 -36 -16 2 -21 -26 17 31 47 26 71 3 -11 -24 16 -12 10 18 -2 38 -49 -15 -32
6086c2L2L4l0k6N8k9K6m5K2k6L8N0n4OlM4p4K2j3lk3j1j2J0N3j3Kj7K4lm6OL1
$$ -32 0 34 4 -22 36 7 33 -12 10 -16 22 72 18 24 21 65 -9 13 0 -3 -26 -37 -49 -39 14 1 3 -14 10 7 -39 -33 -2
6119bk6M4m1N4j6L2l5L2o0rJ5J5oN0m8Rl0N8KkL4r4PnJ2O5j9l0J9p0M7j5M2p2
$$ -2 -28 16 -25 29 13 45 10 42 -18 -27 -12 3 -3 47 -1 8 -22 36 38 36 70 -24 -17 -22 -10 55 36 6 25 -45 2 -13 29 -43
6153d3M6m8K3QK0o7K6Q6j18O9kK2k6n9J14n7NJ6Nk3j0Lo7M8jON7o2J0L8k4J3k2
$$ -43 3 -45 -22 -14 6 -61 -35 51 -67 2 0 22 -4 -63 51 -6 -1 15 20 -3 -13 -10 -77 -29 -30 -24 33 -29 -19 19 -5 8 -14
6186a4J2j0J2%J4k6M2Rr8N8l2jL1Rl3M2j8J1J2Mm5J8rN2o4pO4k0K9J2n2M6m0j8
$$ -14 -2 -12 0 0 14 -12 30 39 -59 -1 -33 -34 -3 6 -27 15 -3 8 20 24 -21 -3 -12 40 -24 -31 33 13 42 54 2 48 8 -10
6220a0L4k2mpk3oO0j8Nl7JL9L0k6ml9pO5k0K6p9Q8p2m6N2mM4j2J4l3p9J11p3J8
$$ -10 24 2 -2 -9 -32 -38 22 4 9 -28 -27 12 42 16 12 -27 -34 31 11 37 -42 46 -26 -72 -20 -24 20 8 22 -11 -90 21 -52 -34
6254c4N4k2M5k3J3lm%KJ0o2P0l9km9L1l5N5K3n7N4n4J0K8Qoj3j5K7n7MM7k9jJ
$$ -34 20 -2 43 20 33 30 26 26 28 38 -24 46 7 5 -44 -13 -48 7 30 -27 27 -27 -17 11 19 13 0 -15 12 -45 -41 6 -23 -24 -23
6289b3Mj4J05p6Rmj9k1M9l0%L1k5JO9o0m3O1l9j0J1l4J20r3K8Qm0K4J0N2o7NR5
$$ -23 -19 -33 72 -4 5 1 -18 -39 10 -20 -20 11 -14 -13 56 -4 -47 14 -25 -35 -24 -58 62 -31 -3 5 -35 -11 -1 51 -16 -11 84
6322H4p6Nl4%Kj0k0O1rJ8Ro1L6o6O3K5p3O7j2RJ2J1k9k3K1k6M7j2k2Rl9Q4m1j4
$$ 84 8 13 -21 -21 -19 -29 -49 12 3 21 30 -31 5 -61 2 27 -46 21 9 18 30 41 12 -11 10 -16 31 19 -3 6 -33 51 10 -4
6356dM0o9MQlOl1N2l9l9Q1j8M3q5N5N2n1jrPJ5k5L8n6K2M2l1JL1p9L1JJ2K5n%
$$ -4 36 -33 -29 -21 -24 -18 -49 3 -36 -75 6 -12 31 -54 1 53 2 1 -8 -1 14 -11 27 -29 -7 35 4 5 36 -43 -12 -11 1 26 21 21
6392B1J7m5RM1m5lK9l8J5K3j8k7k5N7j2j0j8M0l1J8K2m1P7q3P9j05P9mlJ2l9M
$$ 21 38 -7 2 43 -2 -5 24 -14 1 24 6 -21 -46 11 -1 -11 -29 11 -20 -2 20 -21 56 -27 52 -53 26 22 19 31 -8 -4
6424dJ6j1l3M7mMj8K9k9k5M7l9L1oRn5K7J6l0N2p9P0m1qO1j8j4j3N4kj7MJ5l9
$$ -4 12 1 -32 15 11 15 -3 26 -3 -28 19 -20 11 5 14 -41 -14 2 -28 24 -55 15 -26 -34 27 9 -5 -18 36 34 17 21 36 -3
6458cM4L1q4M6J0m3l0N5kn5K1K2qLk4J9J8Nm2K5J9m7M1k8K0j2l4M8p4Q9k1mk0
$$ -3 41 72 -12 34 44 1 -29 26 24 -31 -10 12 4 7 -17 2 20 25 -17 8 27 -20 21 -7 13 1 -33 15 -59 30 9 5 -15
6491a5K7o1N2Rm2L2l9K8L0j3n1M1L2k3k5k6L0K2l0K5M9n7J0J8k3L1m1M8l8Jm1
$$ -15 12 -49 3 12 -30 2 -37 -9 21 8 -43 -2 30 7 -18 -44 -14 8 -22 3 52 -5 5 23 0 31 -10 38 0 1 -40
6522d0M7RJ9m2kM3Kk1k9J6Rm0L8p2M3M6kl5L0j9j9L0k0J4nL2n7O1n4K7j8M2l2
$$ -40 7 16 35 -7 -9 34 36 15 -14 2 11 -29 9 -63 -20 26 24 -11 19 0 -19 11 -9 5 0 32 -25 36 -18 9 -9 33 1
6555AK0j7K1j0Mm1L0KK9p2M3jk0l4N2K9o6K7j9KJ3k9O4j3k7K8J1m7J9P4n1l3J3
$$ 1 21 4 25 15 19 -22 8 10 39 -33 10 9 -11 -45 7 36 -30 -3 -22 -20 -7 -36 28 15 -12 16 27 -20 -1 73 22 -11 2
6588BmL0k1k1K9o2kP8pqkMm1MK8pk9M8l4L1JOj8K9k4J8l8J6k0LL0l7j7J1k9Q4
$$ 2 -2 28 7 -14 15 -47 -49 29 22 14 12 16 -25 -21 7 0 -29 19 -15 16 17 23 5 34 10 28 -10 6 -14 -11 19 -18 -35 -24 -53 31
6624C1l2l9K3L1m8M2nJJ0Pl8L0o3N8l7OQL0j4qK6l3M0r3N9q4M6O8n3K0K4pRn7
$$ 31 -1 -40 -17 14 -34 8 3 4 14 21 -17 13 -50 8 -29 -23 -15 15 1 -7 19 -14 26 -67 -8 -92 -46 22 -31 -11 13 6 15 -42
6658d2k0N2L4J3m9jl0M6n0oM4N4n3NL3q3P5K2j1l4LM7m0j7j3L2mMl9K2o9O2M7
$$ -42 -62 -10 24 37 -12 -13 -43 3 -47 -53 -9 45 -8 -3 30 -53 22 44 33 -1 2 49 9 -8 -21 11 7 11 -28 -6 -75 -13 34
6691C4k6ko8J24o9%mK2k0K2o8L5PoK0k3L9L0j8m7%n5L4K3M4K3p4J5K1lj9k8J7
$$ 34 8 6 -62 62 -7 -7 -11 11 -9 13 -55 -20 -13 -19 1 -22 17 47 29 -18 -18 -73 -39 -16 28 51 -23 -8 13 10 -9 -37 -20
6724b0J1K4m9N4llL7o4J3L2o6M7n5L9M0J7l3J5qL9o0m8N1lml6N6q6P1k2qJ5j5
$$ -20 -9 15 -34 20 17 14 51 -13 0 32 -34 13 -42 -3 37 54 21 36 28 67 7 -41 10 7 3 -33 23 -63 8 -14 -22 -7 -22
6757b2P6o1j0K8k6OK9j4Rk6J8Ml3M0L1p2O4l3MKL6o8M1jn9L4j7nlK1Pk5P0n8n3
$$ -22 54 -7 -17 11 -15 -9 20 6 15 -11 7 11 -22 18 49 -23 41 8 12 14 50 -18 23 22 -37 -3 -20 -25 -28 -7 0 -25 45 -13 -66
6792f6M4K6j9J8l9j1Q3k8o9O5J2N2o5N6o8M3k7l3J8j5N0L6Kp0k6k7Q4m0K2K4n3
$$ -66 -22 4 -15 3 -36 -47 36 8 -61 4 16 68 3 59 -9 34 7 -26 -8 -23 27 63 65 -5 -31 -58 26 -14 8 32 -21
6823b1N1k8k0r%L5m5O7l1k3N9J4l7rJ7j4n9L0l3P0L7q4M6MjL7p6M5m4M1k3K7j3
$$ -21 30 2 -18 -27 -27 8 -37 30 -1 -24 35 49 12 3 20 6 -53 -23 -56 14 51 -33 13 17 16 53 -23 22 -22 19 -4 23 10
6856A0o9K5K6J3orkN6m5Pl8P3l1Qm9Q1q2K2k6L1rJ1L9m3n3O2j2M2l2kk0L8k9J9
$$ 10 -59 -34 -8 5 -1 -10 -12 44 -1 6 -32 41 10 18 -31 50 -32 -10 -36 -5 -14 -3 36 -7 -60 2 -10 32 0 -2 -22 16 -13 6
6890FMOk9j5RQ1o1K6m4M0m3M9k8j3M0k3L6q9L8O4K9m8j2m3k6J7L4j7k0L8r%J4
$$ 6 10 16 -13 -28 -19 62 1 27 -17 23 -20 29 1 -12 28 5 41 -48 -10 54 83 35 23 -20 -46 -29 5 -12 -32 6 -3 -3 11
6923A1m3O5j19J08m4N1l0K7L8q1QJ2J1n2O6l9nP5o5KoJ0j5M4l1J5L6m0Pol5K5
$$ 11 -32 33 -86 22 -22 29 -1 26 64 -17 -9 3 14 -38 28 -11 -16 59 -6 -4 -10 0 -15 29 -2 13 49 9 16 10 -25 0
6955@L8p7N3k3rL1j6J4K8k7j8kL3o3P9m8m4K6J3J0j8L9jj6j1j1RrJ4j6Q9r2J7
$$ 0 38 -39 14 -9 -18 13 -3 11 39 12 -6 -8 25 -38 41 -7 -51 -25 -12 -2 -20 19 18 2 -9 -20 -11 -20 -6 -22 67 -25 -8
6988hK7k9KjK9k1K4OL3n5k2N0r1J6N4Rn0K5NK7J8k1n9j6R0p5M4o1M2J9j3oL8l8
$$ -8 19 -10 -8 -9 20 -1 23 29 62 7 -15 35 -56 -40 14 23 -27 -2 3 30 48 27 -32 -48 42 -33 11 -50 -8 11 -2 -8 30 -8
7022hJ7KmL9oj8K7m1lj8L0K2o6N9l4kJ3j5qPj2oj5L5KK7qj3Qj5k1M5j2m0O4j1
$$ -8 9 11 7 46 40 22 49 8 5 -13 17 39 -27 32 -2 -4 9 -6 -14 -7 -19 -25 -40 -5 -3 24 16 3 11 -4 -25 20 8 -32 32 21
7058B1j5M3p6R6j05J3J2J9n0K0J2Kl8RP7l7jj4oKK6l7qj7P5mp3M6J5j9Qmn6P9
$$ 21 6 49 -27 69 -36 -23 -11 8 -42 -22 -10 -8 -46 -37 40 3 2 -12 -18 -16 10 -27 -35 -52 23 19 -54 -8 7 -12 -4 -8 -64 15
7092A5n7k1P7Mk3K9m6P0q4mpL5L5k4m9L3J3%M8p1M4n1J8j3mL6J7k4Kj5oM1l8K3
$$ 15 -42 -63 14 18 -5 24 -22 48 -36 -40 -47 -12 23 -1 -50 -17 -4 -4 44 -27 17 -34 -16 -29 -33 3 20 -4 -2 -17 -23 18 -20 3
7126Cl4M7rj0qK9k8J1M3l1o4K3J2LK2Kl4RJ8oL6l6l8O6o4oL2RJ0j1Rj6nK6k3Q
$$ 3 -31 16 7 -3 -11 18 -10 1 44 13 -51 -28 -16 -13 9 11 -23 -14 4 -2 34 -2 -40 26 -38 -44 -12 -3 7 -4 5 -11 -16 10 -13 -5
7162ej5J6Oj3lNJ5k8j5j7Q7m0m5Q4k6J0nj1N4n6J8l6j3K4j9P1l7pL6p5L4J7Km
$$ -5 -20 -4 2 -11 -14 -9 6 -22 -37 -54 33 -7 -52 32 6 16 11 0 54 -2 16 -20 -33 -9 -28 43 6 -1 35 -40 -6 11 13 9
7196Ik7RQ0n4j9J6K2q4O3J4l9K9lJr9Q7k3kN3Qq9J5kn1Q9Nl3N7ok2Nl8NK4K0J3
$$ 9 -18 -9 71 17 -2 14 36 -48 15 29 -10 19 16 17 -82 5 -18 -20 33 41 -48 -33 -35 -86 3 8 -25 32 26 4 9 -29 -24 0 20 33
7232C3o6L9n4K0M6J1m9j1R5m8p2J14q9N1q7J18o7K7Pk3n6P3o4J3N9Rn4k2O4o1
$$ 33 -33 6 -48 -28 18 29 -20 -31 64 16 -56 58 -31 20 -67 51 -16 11 18 -5 -61 12 -52 -39 20 29 -25 -47 17 -44
7262d4nO6k6j8L6l5L3j3mN2np7P5l8m6M3O1n6Ol6K7Rn2RJ0rL8m1M3l7M4k0k7K5
$$ -44 -49 17 -9 -27 9 -26 7 -6 -10 42 37 -40 35 -3 -49 -6 55 -1 5 -31 -4 5 -47 -38 -28 -37 1 -40 3 -34 10 -10 -37 -12
7296a2j4N9m6N0k7J6j8O8n8Onm0m5OM2k9P4m5PP0k3k8J7Nkl2N1n3QN2m7L4m2M
$$ -12 -26 33 -13 37 10 26 8 76 18 24 19 -21 -66 -60 -18 -47 27 -18 -11 59 36 8 25 30 28 -4 47 -6 2 54 7 41 -1 3
7330Ck0L0J2l3L7l1L0q9L4pK8QJ0l7O5m5K1p7L0M3Om4O4o7J8j0NrM7q6L5J0mJ7
$$ 3 -17 13 25 -8 29 -2 28 -61 -27 -34 -6 2 12 -25 40 -5 16 -61 -31 12 18 -26 38 -29 -11 -21 -16 -25 22 -64 -29 -19 -23 -6
7364fk5k5O5J3k6J4p6M6qM2pL6p4%M1Rl1kl1R6q4R5o3jk2RK2k8M3n1M1N9p0l5
$$ -6 -31 -56 9 22 -4 10 -66 -20 -28 14 7 43 -31 -31 10 19 -12 -14 -45 51 -33 62 -1 -2 -24 -15 7 -21 22 -29 12 71 1 -34
7398c4J5L5l6K9K2o4MjP3m1ql8R5m2pk7LL6j4%n2J2N0N1n8LJ6n7L1j2K1Nj1J2
$$ -34 -19 16 -20 9 31 -33 -29 -30 43 2 -6 -44 51 9 2 -25 -22 14 0 0 -52 -40 10 61 3 6 22 -35 -4 -16 5 10 -1 11
7432A1o9Q0l8j6J3O2k6J4m8M7L6n0oK6k4k6L9l2j6K6K2J8m3k4K4%Jk8L0Q7r7j3
$$ 11 -58 22 -16 -32 -19 43 17 31 -17 30 66 16 10 36 12 -14 25 -7 -23 3 25 43 0 -24 0 0 1 -27 3 90 -7 -20
7464b0J8j0Q0l6n2j9N5j2l4PJ3N6o2M9K9q1K1Lj2M0%l9JOK4mm0M2l0J0J8lo4O4
$$ -20 -2 -12 68 32 -20 -39 16 4 -30 -23 -10 46 -16 33 62 -19 2 5 -7 33 33 -6 -5 1 25 21 -19 23 -7 3 21 18 -46 18
7498A8m1P1l4L8m7M5n4ok0L5j8N7m0l1J2P4o9j1N0j2K1n4L0K9k5o6N7j5k1P0p2
$$ 18 -23 48 14 52 5 50 -4 -10 -30 5 -13 44 4 -27 -15 59 -10 -21 29 17 38 -16 14 43 18 -48 9 -6 -27 43 -29
7529b9Q7m6Rp3M6O4r1J10n6J0p8N5L1m6J3L1p5kM2m2K6M7p3J6JL8k3M0j7oL5p9
$$ -29 58 12 21 -52 -6 58 -33 77 21 31 -47 8 39 -7 6 37 -38 -40 2 -40 -14 33 -40 -24 -23 15 -8 32 15 9 44 -35
7561c5L3j7M6j7m1Q5j04R4p0j4O8p5N2j8K1M1o7P5k7NnMPl7K3l4K3JK7l2j4M2
$$ -35 -2 -19 27 10 -31 54 -50 44 -26 -40 28 -47 5 -13 8 49 -18 57 30 35 30 34 41 4 27 -7 16 17 44 12 -2 40
7593D0l4k8P7j33O0J4Jj3N9k5n1O7Qkp2O3j7l2Nk6J7N4q4N3J8K0j7l7L1pN7o1
$$ 40 6 -22 55 -78 -18 -4 -3 -16 43 18 -33 34 42 40 -32 31 14 -18 -13 -39 -22 32 -52 1 19 39 22 -15 16 9 66 5
7625EmK9k3k7M3k4N0n7N0l2k9Rj1J1krN2k1l2J8O1l1j0o8L3k1M2L8m1M0m8j2N3
$$ 5 1 30 7 -20 23 -1 49 -8 42 10 -19 -10 -21 -10 -12 -21 31 10 -22 -4 57 26 16 -52 -19 -40 2 40 -1 39 -9 -21 32
7658C2m2j5O4j3k9l0M3J0K5l0l4l9L9ln1P0n3L2JL7J8m7Q2m3on4J9J6j9mK2K8
$$ 32 -10 -25 39 26 -3 -33 10 20 45 15 -19 -58 -19 -22 -73 -3 -56 -24 -23 14 32 -15 67 24 18 -36 -17 -1 -20 -24 -2 26
7690B6l6J6j5P6o1L0p3j0P0m2J3k3R6k0p8J9O4o2J0N1m8LLjk8N7k0q2O6n2M5K9
$$ 26 -10 6 -9 67 6 36 -37 -47 23 -19 -6 -29 67 47 -31 -12 52 -10 0 51 3 6 9 8 -20 37 17 -65 1 -51 -6 23
7722B3o8QO4l0m4L1L1pL1l1k2K5nnl1J6l4K2O1p2OK0j1K9p4J7L0O2p6K0N6m0K6
$$ 23 -45 -37 27 -3 -47 -16 15 8 39 8 -14 11 6 1 -30 -14 -48 -26 35 -37 -31 -11 -22 7 -67 -50 -20 42 -34 -14 42 2 28
7755B8j7Kk9k8L6kk1M5k9Qpk1M3ok7pJ8jJ6K4l0k5J6j0RpO0k9M2qm0rn0K3M2l5
$$ 28 11 13 -16 -44 -8 -10 -31 14 -15 -7 -14 -35 8 2 -25 -32 -14 -15 1 25 -5 -30 -14 -24 -15 -22 38 9 51 43 3 -6 -56 -33 9 -26
7791b6kL6m0M3l3j3j2L0M7j3K3j1j8r4P9NL7k4l0l1L0J7k8O0n6M1MoQJmrL0k7
$$ -26 -28 8 -32 11 -22 -35 -47 -17 30 17 40 29 11 -83 -4 1 38 14 -16 -47 -17 0 -28 32 -24 17 21 15 23 24 20 11 41 14
7825A4l9MM1j5J1j7M0no4Q5n3KoO3m6J4m2K1k8N5l9o3O5k9LN0q5M6l7M7L6m0J5
$$ 14 -25 -21 20 5 16 -1 39 34 -30 55 2 4 -2 61 15 29 -13 8 -20 35 -4 -67 -2 -31 -28 22 -63 -17 -54 -7 29 -11 4
7858Dmk8J1M7k1j6j0J7QK3j2Oo8L4J1Jm7N2Ql5J9n9L1M6J6p9L7K0n3K1k0M4jK6
$$ 4 0 -28 -17 30 9 -7 -17 0 8 31 19 25 -43 -9 2 3 -44 8 16 -19 0 -59 -28 18 34 -45 -8 12 -41 -20 -40 4 3 29
7892B9m8nO2o4N3J3q4N9m6P3r6M8K9K4k6m3J8kn6J03p3P6n3j3N0l6j5O3j1l9l
$$ 29 -19 -24 38 -26 27 40 -44 15 -31 42 -54 -6 23 47 21 -22 -4 -6 -62 41 -32 44 -9 -22 28 -8 -23 40 29 -10 -13
7923a3l0M4n2O3J2o7J00q7L8m8N7K0l0j4k1lJ1J6%j3pK8NK6jq7M1k2M9k5L1JK
$$ -13 -43 1 -51 12 24 -43 57 -30 8 -40 17 37 7 -7 -28 -31 -20 -4 -4 -17 -24 4 9 35 34 -53 -12 -34 15 -10 21 22 24
7956B4KL9q6O7j0Rj1n7M0o0K8j5K2RM2nm3k9M1J8k3n2P9j0l3M0m0L2l1j8K4NL3
$$ 24 26 65 -21 46 36 45 34 -23 17 -43 -15 -30 -8 1 43 38 -5 -34 7 25 2 -50 29 19 -14 26 -14 18 -13 -31 -7 -2 31
7989C1K5j02O9n5K7%N8o9K1K0o2K5M2k6j4J6M3n0Jk9K4Rl5jO8p6K2Oj8j9L9j8
$$ 31 56 -46 23 -32 -5 -5 53 -16 5 25 -37 -12 30 4 -10 6 49 -1 0 -29 -5 4 -31 -32 36 -40 -18 -12 -30 -49 -10 -28
8021b8K3l4Q0j6q5P9p3K3J6k4M3k5pJ0K4j7OmqO2o8N8j3J3Nk6n8P2m4J0m5R3n4
$$ -28 -5 -39 41 25 -60 19 -54 -31 -15 -39 4 -21 -28 -18 6 -11 -5 -9 -17 45 -23 35 22 35 40 14 -44 28 -16 -6 -51 42 -12
8054a2J0J0k3PMNm1k9M2L1J6jm9J7j9N1j2L2k7r%p4R4m1m5L4L0Mj8OQl9O9n7N0
$$ -12 -2 8 -15 -8 -4 1 -40 -69 -27 4 20 19 -30 -13 -32 19 7 39 12 3 3 -71 23 -18 -63 -29 1 5 -13 -7 1 -38 31 -26 24
8089B4k8j6Q1q3J5j6M7n2K4l3O1m5K4K3m0RJ1L0o1K9j8J3m1K8jplJ3M3Qn5J7j4
$$ 24 -4 -20 61 -22 -7 -23 24 -28 -4 -37 24 -21 3 26 -14 -5 6 36 -25 4 -14 -1 -42 -14 -15 -22 -25 -12 31 39 -16 1 -13
8122a3K5%J1j7J6l5M4k8NO4q2N6l9K2%p0M6J3l8K3jj5N4nm0K8n5L0k8N5l8rQ0
$$ -13 12 12 23 6 22 -13 31 3 8 72 -10 46 7 29 29 -41 5 18 -20 3 2 -13 41 36 -4 24 -31 -1 -29 26 -12 -21 59
8155E9j11MPKP0n2J0N5k1k1j1m4P4jm2R1m9n2K5K3p6Q7mJ4l3NL2j4k4l4O8j6M
$$ 59 -52 -48 -41 -39 31 -21 -11 44 23 2 -9 -53 21 20 -22 69 20 -32 -7 16 -60 27 23 37 4 9 41 27 3 -31 37 21 25
8188B5pN4n6
$$ 25 18 72 16
8191A6
$$ Imaginary data points
##PAGE= N=2
##DATA TABLE= (X++(I..I)), XYDATA
0@%%%%%%%%%%%Qj6J6j6J6k4L2l4M2n6O5p3Q8j04J21j40J64j88K14k47K85l25L67
$$ 0 0 0 0 0 0 0 0 0 0 0 0 8 -8 8 -8 8 -16 16 -18 24 -32 33 -40 48 -56 65 -75 89 -99 115 -132 153 -172 195
34A95m14M67n25N86o58P38q20R10j010J120j239J370j513J667j838K026k230K455
$$ 195 -219 248 -277 309 -349 389 -431 479 -531 589 -650 720 -793 874 -964 1062 -1168 1287
52A287k706K984l297L647m043M499n025N642o377P272q388R823j1750J4484j8678
$$ 1287 -1419 1565 -1732 1915 -2128 2371 -2654 2988 -3389 3883 -4505 5318 -6432 8052 -10626
67a0626K5992m2227J38680p4327k71115L14491Q5248k88188K1811K51290j43972
$$ -10626 15366 -26861 111819 37492 -233623 80868 166116 -122072 -100261 151029 7057
78G057j26098J73973J2933j66901J05123Q8990j64304o33J85804j00697j46624
$$ 7057 -119041 54932 67865 -99036 6087 95077 -69227 -69860 115944 15247 -131377
89a31377J68187Q2334k05019M475J91231p6425j45259J28366P2217j39545R4J19804
$$ -131377 36810 119144 -85875 -81400 109831 33406 -111853 16513 88730 -50815 -50721 69083
101F9083o0022p2879R0777J9867r4938K7401P5091n5901m6509O4856J7448n7009
$$ 69083 9061 -63818 26959 46826 -48112 -20711 54380 -1521 -48030 16826 34274 -22735
113b2735K215M0027j1884k0311J1810K744n977J2173l934k3330J6947L1069l1724
$$ -22735 -20520 19507 7623 -12688 -878 1866 -4111 8062 4128 -19202 -2255 28814 -2910
126b910l3487M7416L0457o0603k1829O9193J0346p1314J332O7245j0513n8654
$$ -2910 -36397 11019 41476 -19127 -40956 28237 38583 -32731 -31399 35846 25333 -33321
138c3321J5036M7310j5134l6048J0118K6072j451k0353r649J9489K0337k4383
$$ -33321 -18285 29025 13891 -22157 -12039 14033 12582 -7771 -17420 2069 22406 -1977
150a977k7564L3659K8431m3560k1890N0184J0391m9786K952M2204j2547k8934
$$ -1977 -29541 4118 32549 -11011 -32901 17283 27674 -22112 -19160 23044 10497 -18437
162a8437J5993J4826j2467l620M506j825L845J605r710J806J1043o349q569Q916
$$ -18437 -2444 12382 -85 -3705 801 -1024 2821 4426 -5284 -3478 7565 1216 -7353 1563
176A563L037r185K809O777q215k834J2122j948j4240O683J5138j0499j4651J3211
$$ 1563 4600 -4585 -1776 5001 -3214 -6048 6074 4126 -10114 -3431 11707 1208 -13443 -232
190b32J4316j4286j4295J5225J5370j6053j6978J8315J8118k1567j7382K4456
$$ -232 14084 -202 -14497 728 16098 45 -16933 1382 19500 -2067 -19449 5007
202E007J4415k5763j0263K3741O343j9081n299J2692P448p343j3112M915J9987
$$ 5007 19422 -6341 -16604 7137 13480 -5601 -10900 1792 9240 1897 -11215 -6300 13687
215A3687o617k5680J1943K8293j8800k6454K5418K0994k9158j2734K9381M137
$$ 13687 7070 -18610 -6667 21626 2826 -23628 1790 22784 -6374 -19108 10273 14410
227A4410k5343L136J8192p082r488P299R00l554M771k897o806R645M200j4950
$$ 14410 -10933 -7797 10395 3313 -6175 1124 2024 -1530 3241 344 -6462 3183 7383 -7567
241g567J756J5991r260j2814J5553N693j8700L421J7665j2041j2781J8502N738
$$ -7567 -5811 10180 920 -11894 3659 9352 -9348 -5927 11738 -303 -13084 5418 11156
254A1156k1243K309K0741q976j7053J3776J1501j5279n285J3335K37q696K607
$$ 11156 -10087 -7778 12963 3987 -13066 710 12211 -3068 -8353 4982 5219 -3477 -870
267h70J904k119M762k058j0077Q777J1980j7129r830K4015M095k8270L769K8443
$$ -870 1034 -1085 3677 1619 -8458 319 12299 -4830 -14660 9355 13450 -14820 -11051 17392
281A7392j1648k4562J7860J7748k0618r121J9507J369j4448M096P195n853R99
$$ 17392 5744 -18818 -958 16790 -3828 -12949 6558 7927 -6521 -2425 4770 -1083 -84
294h4L570p557K102J0803r415j0213J6283N226k0515J764K0769r562j7233J5496
$$ -84 3486 -4071 -1969 8834 -581 -10794 5489 10715 -9800 -8036 12733 3171 -14062 1434
308A434J0544j8376k869J7636m197j3793R178Q234j1041k217J0231k418o979N248
$$ 1434 11978 -6398 -9267 8369 4172 -9621 -443 7791 -3250 -5467 4764 2346 -4633 615
322F15K913n418J140L715l942l97N018l449m168O578J764q763J205R327m471q936
$$ 615 3528 -1890 -750 2965 -977 -1374 3644 195 -3973 2605 4369 -4394 -3189 6138 1667 -7269
338g269P062P283r094n238J0016L011j0216q73R779r84q576K561P089l349n110
$$ -7269 -207 7076 -2018 -7256 2760 5771 -4445 -5318 4461 3477 -5099 -2538 4551 1202 -3908
353c908L783L260l063j546J798N85P9n88j796J441K918l007l488M664K893o261
$$ -3908 -125 3135 72 -1474 324 909 988 400 -1396 45 2963 -44 -3532 1132 4025 -2236
369b236j918P201K52p673J252P489k817o874M031O121m999n002N995L759o441
$$ -2236 -4154 3047 3299 -4374 -3122 4367 1550 -5324 -1293 4828 -171 -5173 822 4581 -1860
384a860k019O777J57o057J783M709l263k233L637m91k906L099O09m836K601M701
$$ -1860 -3879 2898 3055 -3002 -1219 3490 227 -2006 1631 1140 -1766 1333 1942 -2894 -293 4408
400D408o224k999Q974q49j0079N323Q841r756n156J2540l76j2469O281R537j0699
$$ 4408 -1816 -4815 4159 3310 -6769 -1446 7395 -2361 -7517 5023 4647 -7822 -1541 7996 -2703
415b703l944J2597k469j0942Q403O266j1499K93J1141o288p505J0356J342j1037
$$ -2703 -6647 5950 3481 -7461 942 7208 -4291 -3998 7143 855 -6650 3706 5048 -5989
429e989N059Q042j0092k633J1918m021j0597R705O004j2943j17J2928n694r875
$$ -5989 -930 7112 -2980 -5613 6305 2284 -8313 1392 7396 -5547 -5664 7264 1570 -8305
443h305R779M730j0755R66Q914n233m452P034n01n804M770K465o754J936O143
$$ -8305 1474 6204 -4551 -3585 5329 96 -4356 2678 2177 -3627 1143 3608 -3146 -1210 4933
458D933n493l730P316M13p260K395N290m039k928L948O18k856O46J183q75K43
$$ 4933 -560 -4290 3026 3439 -3821 -1426 3864 -175 -3103 845 1463 -1393 -747 436 -439 -196
474a96K73r39O76R78j296k86J619l27j271J086N11r84M49M41j032N36R35j503
$$ -196 77 -862 -186 792 -504 -790 829 502 -769 317 828 -156 293 734 -298 238 1173 -330
492c30l05J961r59j658J713M94k156Q94J435k156j49K504j560j816K711M21k812
$$ -330 -635 1326 367 -1291 422 916 -1240 -346 1089 -1067 -1216 1288 -272 -2088 623 1044 -1768
509a768J102K129k001o15K176n70j351J560K18j558J017J058j913p1K346j268
$$ -1768 -666 1463 -538 -1153 1023 453 -898 662 880 -678 339 1397 -516 -587 1759 491
525D91j981K181R87k839M7K669j502j703K078K48k120J234J123k075L07K173j667
$$ 491 -1490 691 1678 -1161 -1114 1555 53 -1650 428 676 -1444 -210 913 -1162 -855 1318 -349
542c49j194K428Nk292J264J673j864n45J990k96j528Q78Q66r58l68O60J4n36Q2
$$ -349 -1543 885 890 -1402 -138 1535 -329 -874 1116 820 -708 170 1036 78 -290 370 384 -152 -70
561g0K36k29k91K42J90m38k28O74m1p22K22Q75n45o74J112K65j260L55J573j189
$$ -70 166 -63 -354 -112 78 -360 -588 86 45 -677 -455 420 -125 -799 313 578 -682 -327 1246 57
581E7j081J934K74k092P84J756j844p34K281p34j970J838P31k433N41K012j739
$$ 57 -1024 910 1184 -908 -124 1632 -212 -946 1335 601 -1369 469 1200 -1233 -692 1320 -419
598d19j066K241k61k131J369J357k118p1K300j051j602K038N50k298R74J920k177
$$ -419 -1485 756 495 -1636 -267 1090 -1028 -1099 1201 150 -1452 586 1136 -1162 -188 1732 -445
615d45n58K696r59k239K277R53k947Q15K259k326q86K785r51k486K443J023l202
$$ -445 -1003 1693 734 -1505 772 1725 -1222 -407 1852 -474 -1360 1425 474 -2012 431 1454 -1748
632a748P25K775k252j653L156J13l113J579K391k681r39L223o75k683K309J529
$$ -1748 -1023 1752 -500 -2153 1003 1116 -1997 -418 1973 -708 -1647 1576 901 -1782 527 2056
648B056l278L82L209k192k239L502M53l946J388L128l038j552L440l75l067J908
$$ 2056 -1222 -840 2369 177 -2062 1440 1893 -2053 -665 2463 -575 -2127 1313 938 -2129 -221
664b21J765k706k55K653j082j957K179R12k529L60K423j292j712K077R33k437
$$ -221 1544 -1162 -1417 1236 154 -1803 376 1288 -1241 -881 1542 250 -1462 615 1548 -889
680h89L16K169j212j414J825J89j804P97J179j644l49J805p24j539J370P80j723
$$ -889 -573 1596 384 -1030 795 984 -820 -23 1156 -488 -837 968 244 -1295 75 855 -868
697h68jJ427m81r82Q10M83p57M6O71l34l09O09ln57M32N86q38k00J001k20r10
$$ -868 -869 558 77 -905 -95 388 -369 -323 348 14 -295 314 311 -246 186 772 -66 -266 735 515 -395
718c95M94N50p75j36N02k80j16K55k75k13M30j48l66L13J68k09K4O1k2K40m5k40
$$ -395 99 649 -126 -262 240 -40 -156 99 -176 -389 41 -107 -473 -160 8 -201 -177 -116 -138 102 57 -183
740a83L62K82m90l8N50j15m28K18K13k01m4j0j20Q7Q2k78j28K91Jm88N8N28k89
$$ -183 179 461 -29 -67 483 368 -60 158 371 170 126 116 -4 83 165 -113 -241 50 51 -437 -379 149 -140
763a40m11K96K95k95o5L91j99O4K93l57M2N94l01n38P38K06q24K27O08o13k07
$$ -140 -551 -255 40 -255 -320 71 -128 -64 229 -128 -86 508 207 -331 407 613 -211 16 624 11 -196
784a96O50l04n74O85N6q66K65P69o98m69P85J45q22J84N90l78k23N08l3l00L54
$$ -196 454 150 -424 261 317 -549 -284 485 -213 -682 103 248 -574 -390 200 -178 -401 107 74 -226 128
805A28K46n56J51O27l71m96N83L32o11k33M22J51l52l26L08M15n65n06P76K48
$$ 128 374 -182 -31 596 225 -271 312 644 33 -200 222 373 21 -305 3 418 -147 -653 123 371
825C71j060J56R76p21n08J140j99r92R08O78j466J79J749j006j441J908O55k196
$$ 371 -689 -533 443 -278 -786 354 155 -837 71 749 -717 -538 1211 205 -1236 672 1327 -869
843h69K61K197j272j591J961N42k274N76J895j671j122K278j79k448J407J813
$$ -869 -608 1589 317 -1274 687 1229 -1045 -469 1426 -245 -1367 911 732 -1716 -309 1504
859A504k277q19K628l45k420J455J633j922n26K029m06j559J288Q26j627J96J620
$$ 1504 -773 -1592 1036 691 -1729 -274 1359 -563 -1089 940 534 -1025 263 1089 -538 -342 1278
876A278j071j111J571M05j817K17J607q47j260J121O93j307j86J041k11q27N77
$$ 1278 207 -904 667 1072 -745 -528 1079 232 -1028 93 786 -521 -707 334 123 -704 -127
893a27L18n99J77M41l87j86O92p5o89M64N97n86l55O68J80o86J77M22k56j87J83
$$ -127 191 -408 -231 210 -177 -363 329 254 -435 29 626 40 -315 353 533 -153 24 446 190 3 186
914A86j78j54K75o0m86L42L32n85k12P08j03p20M50N14n81j47O61k52l64P40p0
$$ 186 8 -146 129 69 -417 -75 257 -328 -540 168 65 -655 -205 309 -272 -419 242 -10 -374 366 296
935B96p75O71O50j012l41J394k13j387P22J071j246n19J294j80j145P43N84j200
$$ 296 -479 192 842 -170 -511 883 670 -717 5 1076 -170 -689 605 425 -720 23 607 -593
953e93O1J118p72q65J419J89j565M86J494j177q94J623K99j583L93J425r89o86
$$ -593 -532 586 -186 -1051 368 557 -1008 -522 972 -205 -1099 524 823 -760 -367 1058 69 -617
971f17J243l0j164O97Q36j249j97J346n05j258J017P40j412k16J378m29j083P80
$$ -617 626 596 -568 129 965 -284 -481 865 360 -898 119 859 -553 -769 609 180 -903 -123
989a23N98r72m6Q84m22m32P68k9p99O43N57q29j94R90j20q08L81N79n70k22M05
$$ -123 475 -497 -543 341 -81 -513 255 226 -573 70 627 -202 -396 594 474 -334 47 626 56 -166 239
1010B39j8l00K14j13k00J99J17m21r8N91k98m10M21K64m86J0M37k35q4L08j78
$$ 239 221 -79 135 22 -178 21 138 -283 -381 210 -88 -498 -77 187 -299 -289 148 -87 -171 137 -41
1031d1r5M81j45m95N58M77q29k25R13j73q13M26M63n75k11M66j50m04L69J20n82
$$ -41 -136 345 200 -295 263 740 -89 -314 599 426 -387 39 502 -73 -284 182 32 -372 -3 117 -465
1052d65J66O19n77m39Q37K09r49K12J054o58o29R02K52p84J33N97l97j62M60r2
$$ -465 -299 320 -257 -696 141 350 -599 -387 667 9 -620 282 534 -250 -117 480 83 -79 381 289
1072B89m34L15K21m68j13M71l4o11J04M97k66m36K26M51m23k48M42J47l92M0L15
$$ 289 -145 170 391 -77 -190 281 247 -364 -260 237 -29 -465 -239 212 -211 -459 -17 130 -262 -222 93
1093I3lk64K11K24k81qL76j33m53M87K82p85N2Q96m61p68O25M66q70j34P92k53
$$ 93 90 -174 37 261 -20 -28 348 215 -238 249 531 -254 -202 694 233 -535 90 556 -314 -448 344 91
1115I1o01M69K34n29N4M08j41l48M04J69m48P7M87j81m58M35L91n71p3N60r6m26
$$ 91 -510 -41 193 -336 -282 126 -15 -363 41 210 -238 -161 326 145 -313 122 513 -58 -131 429 333 -93
1137i3J20K99k86j32J17L6j37j29J36J6j46l1K36p2k80K51K32l53j01N41j38m62
$$ -93 27 326 40 -92 25 61 -76 -205 -69 -53 -199 -230 6 -66 -346 -95 137 -216 -317 224 86 -376
1159c76M53L60n73q2O67j19o42M45M04n60k12O62j51o10L62M50o77k10P27j40
$$ -376 77 437 -136 -218 449 330 -312 133 537 -23 -235 427 276 -334 28 478 -199 -409 318 178
1179A78p60M85M89p73j71Q84k12p78N47N52p38j46Q87k14o28M85M63o55J4O00
$$ 178 -582 -97 392 -381 -552 332 120 -658 -111 441 -297 -443 444 230 -398 87 550 -105 -91 509
1199E09l44m00L80K39m97J6M05k34m28L92K07n11OM43k69k99K86J76k84l2K50
$$ 509 165 -235 145 384 -113 -97 308 74 -354 38 245 -266 -260 183 -86 -385 -99 77 -207 -239 11
1220A1o6j4kL5P9l1K1J34n1r1J43L2j51J9J66j75j44K22J3l64J11K74k23k52L14
$$ 11 -55 -69 -71 -36 43 12 33 167 116 25 168 200 49 68 234 59 -85 137 150 -214 -103 171 -52 -304 10
1245A0O0l34oL34j16k45K06J61k59L8L34k06j53L57R0l94Q5M53k53l21M69O1n21
$$ 10 70 -264 -270 64 -52 -297 -91 70 -189 -151 183 -23 -176 181 271 -123 -38 415 162 -159 310 371 -150
1268a50N6M11k38k76K09J29l97N9L02k53k33M39Q9n95K23N81m67m62Q38J15q08
$$ -150 -94 317 79 -197 12 141 -256 -197 105 -148 -381 58 147 -448 -225 356 -111 -573 265 380 -428
1289d28K14P48m15m22N29J70n29Q9M61l65k46M79n2n35K86L40m49k37N15k2o37
$$ -428 -214 534 119 -303 226 396 -133 -44 417 52 -194 285 233 -302 -16 324 -125 -362 153 131 -506
1310e06L12M39m35k53M85M0l42J10K65j07j50K29J1j09L1J74q2r4J48N7j67j25
$$ -506 -194 245 -190 -443 42 82 -260 -150 115 8 -142 87 98 -11 20 194 112 18 166 223 56 -69
1332f9K31N2k98p4K86J7m10J24K70j21l52K74J95l64rK97j25k52M12J18m33J90
$$ -69 162 214 -84 -158 128 145 -265 -141 129 8 -344 -70 125 -239 -248 49 -76 -328 84 202 -231 -41
1354d1M75m80k37N99J26p72K99O37n21n10P43J20p07N8O19m16l67N37ro05L26
$$ -41 434 -46 -283 316 442 -330 -31 606 85 -425 318 438 -269 -211 408 -8 -375 162 153 -452 -126
1375a26L73n25j29O49j32o36M50M41n93j13O58m4n34K90L36m20k2M11k13k76M29
$$ -126 247 -278 -407 242 110 -526 -76 365 -228 -341 317 273 -261 29 365 -55 -77 334 121 -155 274
1396B74o0l79J91K68l76j76L76n1l46K16J16j84m7J24n9m9K47k15p6L20k7l51
$$ 274 214 -165 26 294 -82 -258 118 67 -279 -63 53 -131 -178 -54 -113 -162 85 -130 -206 114 87 -264
1418b64J93L75k92k25M65Q8m45J75K47l19l9L00j82k24K35N8l61P8L49k89l42
$$ -264 -71 304 12 -213 252 340 -105 70 317 -2 -41 259 77 -147 88 146 -215 -137 212 -77 -419
1439d19M63J42m63j6L73j81k78M06R3k63R5K97k70j38L87l4k33J42K11k68q0K30
$$ -419 44 186 -277 -293 80 -101 -379 27 120 -143 -48 249 -21 -159 228 194 -39 103 314 46 -34 196
1461A96q5j42K9J01p0o8q1J20p4k2p2L4N4Q9k17R0J92j29n0J44%m4N5k5jJ12J8
$$ 196 111 -31 -2 99 29 -39 -120 0 -74 -96 -168 -134 -80 9 -208 -118 74 -55 -105 39 39 -5 50 25 24 136 154
1488A54j93J40K06k51j90L52L4m49J20M54l72l00M00J54n66R0M09l12k62N02N7
$$ 154 -39 101 307 56 -134 218 252 -197 -77 377 5 -295 105 259 -307 -217 192 -120 -382 120 177
1509A77n43J87M77l44k96N07R6n26K90M00m27j68N96k24m66L75L27o08n0P07l48
$$ 177 -366 -179 298 -46 -342 165 261 -265 25 425 -2 -170 426 202 -264 111 438 -170 -220 487 139
1530A39n52M15L64o60o1O89k42o54M38M28m94j45N75j13m99L99K36m93J10M37
$$ 139 -413 2 366 -294 -355 334 92 -562 -124 304 -190 -335 240 127 -372 27 263 -230 -120 317
1550C17j87l66M84R0n50K26M09m45j83M94j09m47K09L55m40j83M61p4l98J98K61
$$ 317 130 -236 248 338 -212 14 423 -22 -205 289 180 -267 -58 297 -143 -326 135 61 -337 -139 122
1571A22l14k1K42q7q8J88J4j83J98J22l11J53K68k90j63M67r1l91K61K51m05m0
$$ 122 -192 -213 29 -58 -146 42 56 -127 71 193 -118 35 303 13 -150 317 226 -165 96 347 -58 -98
1593i8L60k10k87L53l0l74K49J27l59QM63k72l46N25J17o18J99O38m82m31P36
$$ -98 262 52 -235 118 88 -286 -37 90 -269 -261 202 -70 -416 109 226 -392 -193 445 -37 -468 268
1614B68J04p41K52O61n22l78P66j16o09L47M09o32j3N65l71m39O28L3p17L37N51
$$ 268 372 -369 -117 544 22 -356 410 294 -315 32 441 -191 -204 361 -10 -449 179 212 -505 -168 383
1635C83n98l18Q11q1q05M98N86o88j97P30q0o50N14K62n36J23M59l87j86N41j68
$$ 383 -215 -533 278 197 -608 -110 476 -212 -409 321 241 -409 105 367 -169 -46 413 26 -160 381 213
1656B13n18L96K99o18N6N41m19n01O56J82p44J96O43m72l36N93L1n13J82L78l16
$$ 213 -305 91 390 -228 -172 369 -50 -551 105 287 -457 -261 382 -90 -426 167 198 -315 -133 245 -71
1677g1j27M46j47l25M63Rm07J79L65m53j60N56q1n88L17L77m73j58M49n5m03K03
$$ -71 -198 248 101 -224 239 248 -159 20 385 -68 -228 328 247 -341 -24 353 -120 -278 171 116 -287 -84
1699h4K05l27PK93k13j02K01R7k16J74J22k94R0L57l01j65L72L5l89J39L09k85
$$ -84 121 -206 -199 94 -119 -221 -20 77 -139 35 157 -137 -47 310 9 -156 216 251 -138 1 310 25
1721B5j72K71L1l03O5J77k53J9K36j97n8K26j21k68L06J65l26OL78j51l37L89
$$ 25 -147 124 155 -148 -83 94 -159 -140 96 -101 -159 67 -54 -322 -16 149 -177 -171 207 56 -281 108
1743A08J84l86o4M57j49k95K43J99l59M1K48k14j39K43j14k32K45J33l53L5L17
$$ 108 292 -94 -158 299 150 -145 98 297 -62 -21 227 13 -126 117 3 -229 16 149 -204 -169 148
1764A48k02k95M16K0l67J24L41j94j83L22K0k67J45J39j26l6J31L2k51K02L1j54
$$ 148 -54 -349 67 87 -280 -156 185 -9 -192 130 150 -117 28 167 41 5 136 168 -83 119 150 -4
1786dN1Q8k25n2K89j66k57K63J06k69j3L05k16r6K23qj63J54Q5j75QK27j74o0
$$ -4 47 135 -90 -142 147 -19 -276 -13 93 -176 -189 116 -100 -196 27 19 -144 10 95 -80 -72 155 -19 -79
1810g9K38l7j86J22J46j87j08L05j42k27J03J83k06n4J84mj87P5J17j57j9J83
$$ -79 159 122 -64 58 204 17 -91 214 72 -155 -52 131 -75 -129 55 51 -136 -61 56 -101 -120 63
1832F3j41o6J73K4j40JK42j00j21J84Q3k32JK07p4j56J44O6j41q6K03q5j57J31
$$ 63 -78 -144 29 53 -87 -86 156 56 -65 119 202 -30 -29 178 104 -52 92 158 17 -69 134 49 -108 23
1856B3K3j91J5J81j48q8J62Mj84Q1J36j18J5J61l9o9J22M0q8jJ27p4j22J51m9
$$ 23 46 -145 -130 51 -97 -185 -23 -19 -203 -122 14 -104 -89 72 33 -36 86 126 38 37 164 90 -32 119 70
1881G0q8J00J7j55J9O5o8l4J48j04j20J19P7k10N5J50o9j55K39K4k48P9K20r7
$$ 70 -18 82 99 -56 -37 28 -40 -74 74 -30 -150 -31 46 -164 -109 41 -28 -183 56 80 -168 -89 131 34
1905C4o7J84k0j74J12J05k20k7K27j62j24J96Q8k56pK40j59k22K84P7l25J18K45
$$ 34 -33 151 131 -43 69 174 -46 -73 154 -8 -132 64 152 -104 -111 129 -30 -252 32 109 -216 -98 147
1928A47j85r6J51qj69J58Q8j32J3J10oj25J96k9j66J03R1j49J6NO0j01P5K7j63
$$ 147 -38 -134 17 9 -160 -2 86 -46 -33 77 71 -54 142 113 -53 50 141 -8 8 13 73 -28 47 74 -89
1953h9J4J17j36qJ11p5p1K07r2k13K14J71k58p7M10j38l30L14K25m23l2M91k36
$$ -89 -75 42 -94 -102 9 -66 -137 70 -22 -235 -21 150 -108 -185 225 87 -243 71 296 -127 -159 332 96
1976I6l69M71J40n89J73M08m45k13N30o3n31K78M68o29j61P56k08o04M43M97o95
$$ 96 -273 198 338 -251 -78 330 -115 -328 202 139 -392 -114 354 -275 -436 320 112 -492 -49 448 -247
1997b47j28P28j77o28M93M17p30M6P14l09o00O61J64p08J85N78m85l41N89O6o94
$$ -247 -375 353 176 -452 41 458 -272 -226 488 179 -421 240 404 -304 -119 459 -26 -367 222 288 -406
2018d06K97M48n71j71O91j96o03M60M16o47q1O74k13m69M34K85n12K7N15l04l20
$$ -406 -109 339 -232 -403 288 92 -511 -51 365 -282 -363 311 98 -371 63 348 -164 -137 378 74 -246
2039b46M52O2m22J39L32l80r2L73j59k69J96J65l00k2L76k53k34L36Q8l19K2K74
$$ -246 206 268 -154 -15 317 -63 -155 218 59 -210 -14 151 -149 -171 205 -48 -282 54 142 -177 -155 119
2061A19j34j75K06N0j69J31R2q5l2J35Nj72R0M3j15M9R1j17q3J53q4m6L6K5r6
$$ 119 -15 -190 16 66 -103 28 120 35 3 138 143 -29 61 104 -11 38 129 12 -71 82 -2 -48 -12 13 -83
2086h3j6Q1k0m5K8L6l8M7j5M0N0l6r7M5J16j66R2J19m3j56J78M1k04N1J31j68
$$ -83 -99 -18 -38 -83 -55 -19 -57 -10 -25 15 65 29 -68 -23 93 -73 19 138 95 -61 117 158 -46 5 136 -32
2112c2r9K40q5k04J36J21k68J7K95j71k09L42L9m05K31L46l05k36M52L2m28J58
$$ -32 -131 109 24 -180 -44 77 -191 -174 121 -50 -259 83 122 -283 -52 294 -11 -247 205 237 -191 -33
2134c3M14m36j08M56l4n48L03K43m25qM52k58k81L91N7m78J56L54l66j77M90n8
$$ -33 381 -55 -163 293 259 -289 14 257 -168 -176 276 18 -263 128 185 -293 -137 217 -149 -326 164 106
2156A06m35K96L45m13j57M97n5m13J83L69l86p4L37n2k71J93J21k20o8K25j56
$$ 106 -329 -33 312 -101 -258 239 184 -229 -46 323 -63 -137 200 148 -123 70 191 -29 -97 128 -28
2177b8j16K20q4k27J81J62j80o8K04l4k38J87J14j18q1K02n9n4pR2l7M5q4P6l3
$$ -28 -144 76 -8 -235 -54 108 -72 -140 64 30 -208 -21 93 -25 -106 96 37 -17 -24 68 31 76 -8 68 35
2202C5j4o1O3O9j10p7K00m2k20O4J78j19p2R9O6j34MQ1n0rN1j6lO5o4n6J03J21
$$ 35 21 -40 23 92 -18 -95 105 63 -157 -93 85 -34 -106 -7 59 -75 -71 10 -40 -49 2 -14 -17 48 -16 -72 31 152
2230A52k13J6K53q2k15O1J91j22j55K43qj96n1K26m5j79P8J23j97kJ24l4Kj8j5
$$ 152 -61 -45 208 126 -89 -28 163 41 -114 129 121 -75 -126 100 55 -124 -46 77 -120 -122 2 -32 -30 -48 -63
2255f3K0J12l9j19J60O3j58m3J92k5k12R0J82j34j00J42O1j72l4J38l6j39L6M7
$$ -63 -43 69 30 -89 71 134 -24 -67 125 100 -112 -22 160 26 -74 68 129 -43 -77 61 25 -114 -78 -31
2279c1l5nl0J17k6l6mjL6Rj26J47J62j59o4J89J0j58n3K95p7k42M4J16p1r4J20
$$ -31 -66 -71 -101 16 -10 -46 -50 -51 -15 -6 -132 15 177 18 -46 143 153 -5 -58 237 160 -82 -38 78 7 -87 33
2306C3R8j33r6J20m3m0oK7r0J18j7j12J79L9j58m2K28j03j28J86R3j66q3J93P4
$$ 33 131 -2 -98 22 -21 -61 -67 -40 -130 -12 -29 -141 38 77 -81 -123 105 2 -126 60 153 -13 -96 97 171
2331A71j62p4J55J9j86P4J24j12m2l3P7l8o7K9J43q5j35J18M1m8j14J53N4q4J8
$$ 171 9 -65 90 109 -77 -3 121 9 -33 -66 11 -27 -94 -65 78 -7 -142 -24 17 -31 -145 8 62 -22 -4
2356dM7J4l3j9J5L4P1j92M7J63m1k26P9K67k22j37J49J09l44P8K54j50j49J70
$$ -4 43 57 24 5 20 54 125 -67 -20 143 102 -124 -45 222 0 -137 12 121 -223 -145 109 -41 -190 -20
2380b0R6k14R3P9j44O7J60j08j08K27k3k11J69J22k11q2K84k0l25J77K44l16j39
$$ -20 76 -138 -45 34 -110 -43 117 9 -99 128 105 -106 63 185 -26 -108 176 156 -169 8 252 -64 -203
2403b03K93K1k98J24J96k17l5J97j25l3N2P2j81J33J43k00l2K57j24j99J65J96
$$ -203 90 111 -187 -63 133 -84 -119 78 -47 -80 -28 44 -137 -4 139 -61 -93 164 40 -159 6 202
2425B02k15p0K78o8j99N4J97j37j35J01J38j97o3R2J8o1OO0k8j1rJ7j2L2m1M6
$$ 202 -13 -83 195 127 -72 -18 179 42 -93 8 146 -51 -114 -22 -4 -65 -59 1 -27 -38 -47 -30 -42 -10 -51 -5
2451eM3j5LK9k2L9l9k3J18p0o8PJ02j9j46O5J65j65k06K17J07k81L5K52r1k47
$$ -5 38 23 26 55 33 72 33 10 128 58 -10 -3 99 80 -66 -1 164 -1 -207 10 117 -164 -129 123 32 -215
2477b15K18N6k12P5J92j44j17K18%j60Q8J86j68j20K56l2k42J92J64l27NK70j07
$$ -215 3 59 -153 -78 114 -30 -147 71 71 -89 -1 185 17 -103 153 121 -121 71 235 -92 -87 183 76
2500G6k80K34J65k98m3K56p4j97J44J13j94J6J22o6m4J28j6l3N9L6j24K5J15r3
$$ 76 -204 30 195 -103 -146 110 36 -161 -17 96 -98 -82 40 -26 -70 58 42 9 68 104 -20 5 120 27
2524B7l7R3j4m7j3R6r0o8N9k8O5n8n5L8R3j10l9N2M1j91P3K18j10j33K00N7k16
$$ 27 -10 83 69 22 9 105 15 -53 6 -22 43 -15 -70 -32 61 -49 -88 -36 5 -186 -113 105 -5 -138 62 119 -97
2551i7Q1J98j65j46K66J4k53J71R8k39l9K91p9k79K48J04l86J13K88k14k26K58
$$ -97 -16 182 17 -129 137 151 -102 69 167 -72 -111 180 101 -178 70 174 -212 -99 189 -25 -251 7
2573GJ27l60P5L51k75j75L40J01m22J80K94k69j00L53j28k51J73K25l23o4L04
$$ 7 134 -226 -151 200 -75 -250 90 191 -231 -51 243 -26 -126 227 99 -152 21 246 -77 -141 163
2594A63o6k92J95J92l78j1L84j97j85K11J15l46L2L69k09k09K72J53l28P6J84
$$ 163 97 -195 0 192 -186 -197 187 -10 -195 16 131 -215 -183 186 -23 -232 40 193 -135 -59 125
2615A25p9j84K37J8k22R2K26k15j47K27K1k13N2K06j56j24J61J15k42J5J54r2
$$ 125 46 -138 99 117 -105 -13 213 -2 -149 78 99 -114 -62 144 -12 -136 25 140 -102 -87 67 -25
2637b5n2P5K6p9L3JK0l3O4j1k2J10k4n0m7P5J4o7l8P7qk8l9P0p2J2K7k8j7L7j3
$$ -25 -77 -2 24 -55 -22 -21 -1 -34 30 19 -3 107 83 33 -14 61 75 8 -30 47 39 11 -28 42 -30 -18 9 -19 -36 1 -12
2668a2m7nL7M7j11Q1o0K5N2j4NRK9L8lJn6J5o0Q2m6k8M6L0o7jJ1lp7N3k4k1O5
$$ -12 -59 -64 -27 20 -91 -10 -70 -45 7 -7 -2 7 36 74 71 72 16 31 -29 53 7 -21 25 55 -12 -13 -2 -5 -82 -29 -53 -74 -9
2701iM8j21J13L1j25J6R6p6r7J89N9k24J42P9j13OJ8P1q3%O7m3p7P8Mj28L6N8
$$ -9 39 -82 31 62 -63 -47 49 -27 -124 65 124 -100 42 121 8 14 32 103 20 20 87 44 -33 45 49 -79 -43 15
2729A5o1p1J29o9j4P8M1j27N1L8m7J0J6N0K2r1O2lOkQM2j06NQK1o6Q9q0j9K0M4
$$ 15 -46 -117 12 -57 -71 7 48 -79 -28 10 -37 -27 -11 39 61 -30 32 29 35 33 41 83 -23 -18 -10 11 -55 34 -46 -65 -45 -1
2761aL4o9%J08j55N1L0l8o1P2O2l5j3M5J7j48J36L3q2N0J15r2j00R0Mj31J03N8
$$ -1 33 -36 -36 72 -83 -32 -2 -40 -101 -29 33 -2 -15 30 47 -101 35 68 -14 36 151 59 -41 49 53 -78 25 83
2789H3j11q4J57J1j24L2M3j2j14J48k8k5OQ1Oj10P7J1q8K5J03n7n5J30Jj16K2
$$ 83 -28 -112 45 56 -68 -36 7 -5 -119 29 1 -24 -18 63 69 -41 36 47 -41 -16 87 30 -25 105 106 -10 12
2816A2M7J7j05M5L2r6M1L7l4q8J19m7j3NK7l7m2O0km2M3N0J1p4j1R4m8J3l9R2
$$ 12 59 76 -29 16 48 -48 -7 30 -4 -92 27 -20 -33 -28 -1 -38 -80 -20 -22 -64 -21 29 40 -34 -45 49 1 14 -25 67
2846F7n1q1J98o1q9L2M1j13O1J13q2j30J38j9r2mJ15p1o7Q3P1j75L3J73q1j25
$$ 67 16 -65 133 72 -17 15 56 -57 4 117 35 -95 43 24 -68 -72 43 -28 -95 -12 59 -116 -83 90 9 -116
2872a16J55Q6k46Q8J82j39l2J20l7j29L8J17r1m8J58j67k6R5K4k08J58P7j48k4
$$ -116 39 125 -121 -33 149 10 -22 98 61 -68 -30 87 -4 -52 106 -61 -87 8 32 -176 -18 59 -89 -113
2896a13J54m6p9O4O0r3j8Q5m7L1K3Nn9O7L3o0j8N3n2lO5j6j01M9Q1r2LLL2l2j3
$$ -113 41 -5 -84 -20 40 -53 -71 14 -33 -2 21 26 -33 34 67 7 -11 42 -10 -13 52 36 -65 -16 65 -27 -24 -21 11 -21 -34
2927c4N4p8N5l2jk9J33r1rN5k2j0L8O2q5j01J13j6K6Pj8M3r0L5K3m0jj3j7kk6
$$ -34 20 -58 -3 -35 -36 -65 68 -23 -32 23 1 -9 29 91 6 -95 18 2 28 35 17 60 -30 5 28 -12 -13 -26 -43 -45 -71
2958g1O4m2K1Mkm6M8K5ln6R8m8o0J13L0r0J0J46p7j12J05K0o7JQ7p1j13M2R6j22
$$ -71 -7 -49 -28 -24 -26 -72 -24 1 -2 -58 40 -8 -68 45 75 -15 -5 141 64 -48 57 77 10 11 98 27 -86 -44 52 -70
2988g0Q2n4M2r7P6J5p5P3M0p4j5R1k4r0O5O8kn0Q3k1r7K1J29p2j24J09k1n7L2
$$ -70 12 -42 0 -97 -21 -6 -81 -8 32 -42 -57 34 10 -80 -15 53 51 1 84 63 -34 -13 116 44 -80 29 8 -49 -17
3017a7Q5q3n7P7J6q4K2L4%p6J7N1k7P6M0j24L3O1rr6L4P1j8l4N6Nq1P2J5r9OO3
$$ -17 68 -15 -72 5 21 -63 -41 -7 -7 -83 -66 -15 -42 34 74 -50 -17 44 35 -61 -27 44 26 -8 48 53 -28 44 59 -40 -34 29
3049B9K7j42P7k1n0L6K7l4K7M8l2j5N6k2l7L4N7r5OJ43o7p3P1N2j52K5J41j12
$$ 29 56 -86 -9 -30 -80 -44 -17 -51 -24 24 -8 -23 33 11 -26 8 65 -30 -24 119 52 -21 50 102 -50 -25 116 4
3077Dn4J28j17k6Q8Oq2n9J70n6j17J43k4j04j9K11j10p3J32K8j66J04N6p1l1Q6
$$ 4 -50 78 -39 -65 23 29 -53 -112 58 2 -115 28 4 -100 -119 92 -18 -91 41 69 -97 7 63 -8 -39 47
3103D7M9j67N9J85j82n8J98p2j27J02N2j69rJ89q1j94J94R0j51p3J81l8k00J90
$$ 47 96 -71 -12 173 -9 -67 131 59 -68 34 86 -83 -92 97 16 -178 16 106 -45 -118 63 25 -175 15
3127A5P9k41J28O3j4j22J65Pj74J39N1q4l4R9N3j88N0J29j24j35K01l5j46J56
$$ 15 94 -147 -19 44 30 -92 73 80 -94 45 96 12 -22 77 130 -58 -8 121 -3 -138 63 28 -118 38
3151C8L3j31k1K00j46o5J03J3n8P8K7j05rJ05o5m3L4J04j38L4Q4j05p4J51Q0k06
$$ 38 71 -60 -81 119 -27 -92 11 24 -34 44 71 -34 -43 62 -3 -46 -12 92 -46 -12 72 -33 -107 44 124 -82
3177h2K3J38j80O7J22p0j60J27J01j46rJ74q4j75J64J04j76L4J79j65l2K01n6
$$ -82 -59 79 -101 -34 88 18 -142 -15 86 -60 -69 105 21 -154 10 114 -62 -28 151 -14 -46 155 99
3200I9j87J17J04j80PK05q4j65J19J07j97lJ99j23j49J24N9k00R4J56j59p4J56
$$ 99 -88 29 133 -47 -40 165 81 -84 35 142 -55 -58 141 18 -131 -7 52 -148 -54 102 -57 -131 25
3223B5L7k05J25J49j80m9J56M1j88J49O9j71J4J84j08j14J59j6j77Q1J67j83l4
$$ 25 62 -143 -18 131 -49 -98 58 99 -89 60 129 -42 -28 156 48 -66 93 77 -100 -19 148 -35 -69
3246f9J52r0j17J40L7j26l1J59m5j03J33P6j91Q4J01q4r5J06K9j16Q2N2q4n4J20
$$ -69 83 -7 -124 16 53 -73 -104 55 10 -93 40 116 -75 9 110 26 -69 37 66 -50 32 84 0 -54 66
3271F6p9p1R2N3j08n2J14j8nN8l9j30J22O0p1p4J30m0j18J31j7j4J1J3L0k9QQ9
$$ 66 -13 -84 8 61 -47 -99 15 -3 -8 50 11 -119 3 63 -8 -82 48 8 -110 21 4 -10 1 14 44 15 23 112
3299A12j36k4Q8j2n4J2L8k8M2n0pjM3j0m9k0K6J1m5MJ07j01N4N0p4M3Mj2KM9n
$$ 112 -24 -48 40 28 -26 -14 24 -4 38 -12 -19 -20 23 13 -36 -56 -30 -19 -64 -60 47 -54 0 50 -24 19 23 11 13 62 57
3330E7Km9M2p1JO6m1n4O9k4l5m4P5k6LJ4jl4N1J5n4n4P5L8m9P0k2mj3R0j12L3
$$ 57 59 10 52 -19 -18 48 7 -47 22 -2 -37 -81 -6 -32 -29 -15 -16 -50 1 16 -38 -92 -17 21 -28 42 20 16 3 93 -19 14
3362A4L6j0rL1%q1P0l2l3n7J68r5p6P1N3n5kQ3j34l2J29k0j06P8J00j69m7K20
$$ 14 50 40 31 62 62 -19 51 19 -14 -71 97 2 -74 -3 50 -5 -7 76 -58 -90 39 19 -87 -9 91 -78 -125 95
3390I5o0n8M6J03j35m6J86j09q8J60Kj54P8R3r4j35J86J2j62J9J24j31J8J43k1
$$ 95 35 -23 23 126 -9 -55 131 22 -66 94 96 -58 20 113 19 -116 70 82 -80 -61 63 -68 -50 93 72
3415G2j95J19M3m1r1J08L8j04O8P1j09L2P9j01j5M0N7j16oJ09p3k6N7k8q2N5P5
$$ 72 -123 -4 39 -2 -93 15 53 -51 17 88 -21 11 90 -11 -26 14 71 -45 -51 58 -15 -41 16 -12 -94 -39 36
3442C6j20QJ17m1q3J18K8j27M7kkl1R6J1j02M0N2n4j5N4M8m4oJ6p1J20Rj38K7
$$ 36 -84 -76 41 0 -83 35 63 -64 -17 -19 -21 -52 44 55 -47 -7 45 -9 -24 30 78 34 28 44 -27 93 102 -36 -9
3471iN9l1n5L6j6l6j8N7k2J7kP9p3KL2o7O0K3j1p9J4O9j8k6J6Kn0M9j8qL9j0m3
$$ -9 50 19 -36 0 -16 -52 -70 -13 -35 -18 -20 59 -14 -12 20 -47 13 36 25 -54 -40 29 11 -15 1 3 -47 2 -16 -24 15 5 -38
3504c8R0r8K1m8Q6m8OM9k2jn6Q8M0j15N5K0o7M6mPrN6k1j1j5N2j36O8M3m0l7N7
$$ -38 52 -46 -25 -73 13 -35 -29 20 -2 -3 -59 29 69 -46 9 29 -38 8 4 11 2 58 37 26 11 63 -73 -5 38 -2 -39 18
3536A8K1j23N1P8k1r9J20pj33O9O7q0k2J15m4o6Q3kk5K6L7q3oN0L4p9L7M7j08
$$ 18 39 -84 -33 45 24 -75 45 38 -95 -26 41 -39 -61 54 10 -56 27 25 0 26 63 -20 -26 24 58 -21 16 63 -45
3565d5j1J06l8l8l9Q6o1n5R7k7mO5qr1K5J22j15n8J18J2n2KP8l3j29J15M7j08
$$ -45 -56 50 12 -26 -65 21 -40 -95 2 -25 -29 36 28 -63 -38 84 -31 -89 29 41 -11 -9 69 36 -93 22 69 -39
3593c9M8J38k05K5J17n6j22Q6J19j94L9J34q6j58J17Q8j09Q3N7q0j57J87P8j63
$$ -39 9 147 -58 -33 84 28 -94 -8 111 -83 -44 90 4 -154 -37 51 -58 25 82 2 -155 32 110 -53
3617e3K5J35j35j6J70o6j18Q5J26j91L5Q7n3j37J36O9j53J7J00n5j36J15L4r3
$$ -53 -28 107 -28 -44 126 60 -58 27 153 -38 -3 84 31 -106 30 99 -54 -37 63 8 -128 -13 21 -72
3641g2N5J18r8q8J18J3j11j8J20m5p2J79l6j38J04P1q2q4J62n8r8O5M7m9p0J12
$$ -72 -17 101 3 -85 33 46 -65 -83 37 -8 -80 99 63 -75 29 100 18 -66 96 38 -60 5 52 3 -67 45
3667D5n3n5J5Q1o2l8J40j18k8N8L5q2O3J06o8n1M8Pq4O8M6p3j1M4L5j13L9M2o9
$$ 45 -8 -63 -48 33 -29 -67 73 -45 -73 -15 20 -62 1 107 39 -12 36 43 -41 27 73 0 -11 33 68 -45 -6 36 -33
3696c3L7J5j6n5R4o0KjKk4oN0k7J2J6n1P3J5n2j0O9j6o7Q2j0n6L0J1k0k7K1nn5
$$ -33 4 19 3 -52 42 -18 -16 -17 -15 -39 -45 5 -22 -10 6 -45 28 43 -9 -19 50 34 -33 49 39 -17 13 24 4 -23 -2 -7 -62
3729f2J23rj13JN2m5K7N9n0n0O1km6JP4k2l8Q1M0j41O0Q2q4%N5j4p0M6Rk9J7q
$$ -62 61 52 -61 -60 -8 -53 -26 33 -17 -67 -6 -8 -54 -53 21 -1 -39 42 82 -59 1 83 -1 -1 54 40 -30 16 25 -4 13 5
3761EN1j11L3P7q4l2Q3j0p2N9Ol2k7O4MJ6pL6p0m8P7L5j43Q5O4o2PK1J7p5k9J39
$$ 5 56 -55 -22 55 -29 -61 22 12 -60 -1 5 -27 -54 10 14 30 23 59 -11 -59 18 53 -90 -5 59 -3 4 25 42 -33 -62 77
3793G7p8m5R8j3j32N9N8o0K1j0L3r7J02O9j53M7M9k7m7L6O7j10J0J08m0o1J31
$$ 77 -1 -46 52 39 -93 -34 24 -36 -15 -25 8 -89 13 82 -71 -24 25 -2 -49 -13 54 -56 -46 62 22 -39 92
3820I2j5j19J2O7p6L4J6Q2o6p4J01o7pL1Qk7j3R0o4r0Q5k3J6lJ7j02J07N0r2N4
$$ 92 77 -42 -30 37 -39 -5 11 93 27 -47 54 -13 -20 11 19 -8 -21 69 5 -85 0 -23 -7 -10 7 -95 12 62 -30 24
3850B4J6o9lM7N5j25O5QNq8P3qk3K3j0j2m8M1MJ0L7j3q1P8qk5j9L4P8o8K3k8K2
$$ 24 40 -29 -32 15 70 -55 10 18 23 -65 8 0 -23 0 -10 -22 -70 -29 -25 -15 22 9 -72 6 -2 -27 -46 -12 66 -2 21 -7 15
3883A5m3O9l2j00O2N4m6j1N9n6j0O8j6n7P4p3M4l2J4k2jM2L6p0J2K0M8l2o2Q8
$$ 15 -28 41 9 -91 -29 25 -21 -32 27 -29 -39 29 13 -44 30 -43 1 -31 -17 -39 -40 2 38 -32 -20 0 48 16 -46 42
3913D2l8j6RK4l1M0l5k6L9K9n8J7pKk2PJJ3n0N4k5K2m2Q3oo0K2LL9j5%J9k4o0
$$ 42 4 -12 -3 21 -10 30 -5 -31 8 37 -21 -4 -11 -9 -31 -24 -23 -10 -60 -6 -31 -9 -51 32 26 -34 -12 -9 30 15 15 34 10 -50
3947e0P4m4k1K0L6k6J8Nl4L6m0KL1PJ2j0n0N7o2L2Ll3K1O5K7n1rj9rN9p3K9jO7
$$ -50 24 -20 -41 -21 15 -11 7 12 -22 14 -26 -24 7 14 26 16 -34 23 -39 -7 -4 -37 -16 49 76 25 16 -3 -12 47 -26 3 2 69
3981F9j07P3n3N9m5JO3n0k9K4j9Pj1j7O9j4pn1m9J26k7k3L9Mk2k6Q8p8J2j7K4
$$ 69 -38 35 -18 41 -4 -3 60 10 -19 5 -14 -7 -18 -35 34 20 13 -38 -87 39 12 -11 28 32 10 -16 72 -6 6 -11 13
4012A3r5P1P4l9j13R4L7j01N0J0n7K6K7j9m2J04n7j6j5O2m1mM5J7m7L8Nj4l1N6
$$ 13 -82 -11 63 24 -89 5 42 -59 -9 1 -56 -30 -3 -22 -64 40 -17 -33 -48 14 -27 -31 14 31 -16 22 27 13 -18 38
4042C8l7j1K2L2q8N7J1L0p6J2jk9K1L4k4j00J13k7NrL1Nk4j3O1j04K8Q7n3LL5
$$ 38 1 -10 12 44 -44 13 24 54 -22 -10 -11 -40 -19 15 -9 -109 4 -23 -18 -27 4 9 -15 -28 33 -71 -43 44 -9 -6 29
4073B9M3j52M4Q5l5rpL1r1M1P5l3n0lM2p1M0J03j07n4J32n3j04R4Nk7j3N5l9j7
$$ 29 72 -80 -36 49 14 5 -2 29 -62 -21 54 21 -29 -32 10 -61 -21 82 -25 -79 53 0 -104 -10 -5 -32 -45 10 -29 -46
4103d6R8n2o6R7J9q9OQ3l8o5Q3Jk3k2M0k6p6N6M0o2M3K0q3N3L4k4k5Q2q2jJ6%
$$ -46 52 0 -66 31 50 -39 -33 50 12 -53 30 31 8 -14 26 0 -76 -20 20 -42 1 21 -62 -9 25 1 -24 58 -24 -25 -9 -9
4135ik6N1j2Qk1K9J0n5j0O9j0p5J08n2m1N7n2L2mj2n6O2JRj6NO4n0j1Q4n2l1L3
$$ -9 -35 16 4 12 -9 20 30 -25 -35 34 24 -51 57 5 -36 21 -31 1 -3 -15 -71 -9 -8 1 -15 -10 54 4 -7 77 25 -6 27
4168B7Ll9MM7L0r9K1%L5ro9O6J0K1n0J6k2j2M4l4K5m0K9k1K0jj2oPK8l3K9m2o
$$ 27 30 -9 -5 42 72 -27 -6 -6 29 20 -49 17 27 48 -2 14 -8 -20 24 -10 15 -25 4 -17 3 2 -10 -16 -9 19 -14 15 -27 -33
4202c3P9j3n5J3pO7r0OP0k2oJm9M9qk0j3j3N2j1l4N9l8JJ8M9p1O3J0m6ok2J9J2
$$ -33 46 33 -22 -9 -16 51 -39 -33 37 15 9 10 -39 10 2 -18 -31 -44 8 -3 -37 22 -16 -15 3 52 -19 44 54 8 2 -20 -1 11
4236A1J9No2j6P5j02N3J1M8j04Q1Kk3j6N7m7QM3k3n0mJ2O0n0K7o0P9k7J5m8K9
$$ 11 30 35 -27 -43 32 -70 -17 -6 42 -62 19 21 -2 -18 39 -8 0 43 20 -30 -34 -22 38 -12 15 -45 34 7 22 -26 3
4267CM3k0Ln9L7k7J9k9L1n3M4%l4J5qK1Pk0q2Q0M2l0l9N2jl7M2M7p9KN9k4oJ8
$$ 3 46 26 29 -30 7 -20 -1 -30 1 -52 -8 -8 -42 -27 -35 -14 -7 -27 -109 -29 13 -17 -56 -4 -5 -42 0 47 -32 -30 29 5 -1 17
4301A7MJ4k9Jk1KL6m5j8M5k5j5QJ5J3m2J7J3l5j7J01j3j5m6O1o0RO5p4J09m5k5
$$ 17 21 35 6 7 -14 -12 24 -21 -39 6 -19 -34 -26 -11 2 -40 -23 -10 -45 -62 39 26 11 -35 26 -34 -25 40 -34 75 30 5
4333EjK6mj3K6k0K7o1P7n4pj9L3Nn9J3L5Mk7K9k5ML0o4JL8M1n8mL8J3m1N2k5m5
$$ 5 4 30 26 13 39 19 46 -15 62 8 1 -18 15 20 -39 -26 9 13 -14 15 -10 -6 24 -40 -39 -1 40 -18 -22 16 29 -12 40 15 -30
4368c0j0P2j4j1NOk2K1J5k5OJ4K4o2L0j6JP%j6J5K0j6k5Ll9L7l8J30n9n5j0J04
$$ -30 -40 32 18 7 12 18 -4 17 32 7 13 27 51 -11 19 3 4 11 11 -5 10 30 14 -11 -8 -47 -10 -48 82 23 -32 -42 62
4401F2p7l7N8pjj9K2p6M2P4m8l9J5k2J2N0K5q9M5K8oJ6l4Qk8M0Ql7j7P5Lq4O1
$$ 62 -15 -52 6 -1 -2 -21 1 -75 -33 41 -7 -46 -31 -53 -41 9 34 -55 -10 18 12 28 -6 2 -26 14 22 -15 -32 43 46 -38 23
4434B3L0m9k4J5K7r3Q1l6j8Q0k1m8k7Q4m6P0k2j0q6L1M8k7k4N4Q9j21J9N8o5k
$$ 23 53 4 -20 -5 22 -71 10 -26 -44 36 15 -33 -60 24 -22 48 26 16 -70 -39 9 -18 -42 12 101 -20 -1 57 -8 -10
4464a0L5l3J2%J9L6p8L6l8M0J3l5K7o6N7o3J2K2ql8KL5K4J2j7J6l1Ml4mN1j9j9
$$ -10 25 -8 4 4 23 59 -19 17 -21 19 32 -3 24 -42 15 -48 -36 -14 -22 -60 -58 -23 1 13 -4 12 -19 -15 -49 -53 -2 -21 -40
4497d0J1N8o8lQ1p0L5N3j30P4j0O1r3L5K7n0mO9l1k8pN9j8j1J3j7K5J8k1l1K5
$$ -40 -29 29 -39 -42 39 -31 4 57 -73 1 -9 52 -41 -6 21 -29 -33 36 5 -23 -30 29 11 0 13 -4 21 39 18 -13 12
4528A2L2l7l9J04p2k3N8p6M7j3l1M5m8K1M9mk5N1J3p3M8o7k9rJ6Q1n6LQ4Ro5N
$$ 12 44 7 -32 72 0 -23 35 -41 6 -7 -38 7 -41 -20 29 25 0 51 64 -9 39 -28 -57 -66 -50 31 -25 -22 62 71 6 11
4560A1M4q7P6l2k2k9J2J0j5j0O3l2Oj5OJ8k0K7rj4KnK5l6K5MjJ6Lj8n1J08p0P1
$$ 11 55 -32 44 12 -10 -39 -27 -17 -32 -42 21 -11 -5 -20 -14 4 -16 11 2 -12 -10 -15 10 -26 -1 3 2 18 21 3 -48 60 -10 61
4594F1j1o5K5L9p8L1K9l2K6n8RJ1mMl0L8J7o7O3K4l1L8m1k3k3O9J1m4LK2pj2M5
$$ 61 50 -15 10 49 -29 2 31 -1 25 -33 -24 -13 -17 -13 -43 -5 12 -55 8 32 1 39 -2 -25 -48 21 32 -12 -9 13 6 -6 39
4627C9n4j3rJ01q1j8M9qm2O5l2rKL9m0J9K6j8l0j2lL9jrMn8LO5rm4N5m2N8j3K7
$$ 39 -15 -28 -37 64 -17 -35 14 6 -36 29 -3 -12 -10 29 -11 8 34 16 -14 -26 -29 10 9 0 4 -54 -51 14 5 -39 16 -26 32 19 46
4662D6p5Q9l6j0l8M0m9J4RJ4pl8J2NM8o3N4o0J0O6qm8k2N2m0O0ln1M0l3j7N5p
$$ 46 -29 60 24 14 -24 16 -33 -19 -10 4 -3 -41 -29 -24 24 -39 15 -45 -35 31 23 -25 -47 5 -35 25 22 -29 11 -22 -39 16 9
4695Ik1k5N7n%Np2L2l4P0j3n5P9p0J2O2l1N6m1j9K6pm8Q5qq4Q8l7m8L0K1j2OJ6
$$ 9 -12 -37 20 15 15 20 -52 -20 -54 16 3 -52 27 -43 -31 31 0 56 15 -4 22 15 -33 52 44 -40 48 11 -37 -7 14 2 8 24
4729B4K1J4l6n1J6j1RK8pj5M0o7j8O7q4rQ2j9k0P2l4mL2o1P4qK9j9l1M2p6lL5
$$ 24 45 59 23 -28 -12 -23 -14 14 7 -8 32 -35 -53 14 -70 -79 3 -16 -36 36 2 -2 30 -31 43 35 64 45 14 56 -20 -23 12
4762A2n0K8m1P5ro5Q6o8RO8j9l5k4m6N6M4pk4l2Q2k3Kk3L0j0Mk7%l8J1j1P8p5
$$ 12 -38 -10 -51 24 15 -50 36 -32 -23 45 26 -9 -33 -79 -23 21 14 -10 -42 40 17 19 -4 26 16 20 -7 -7 -45 -34 -45 33 -42
4795d2N9KJ5rl0Ml7Q2ko6j6J59r4p0L2N0j3m5N7K1q3kK9L6J8K1o1m5Q5l1l8K2
$$ -42 17 19 34 25 -5 -1 -38 44 42 -24 -40 119 25 -45 -13 37 24 -21 36 57 -26 -28 1 37 55 76 15 -30 55 24 -14 8
4827Hj7M1m3K7k5pk3K3l7L8PK0jk3j9K1J6J6N5o0RK0o0k2L1j2L6r3P4m9L8k2j2
$$ 8 -9 32 -11 16 -9 -16 -39 -16 -53 -15 -8 12 11 -12 -31 -10 6 22 77 17 26 46 -14 -36 -5 -17 19 -74 0 -49 -11 -33 -45
4860d5J4M2j8j8K7k7L1l1j0O2k3j7K7%k3K2L0mn1K5o1J03p2j5L7j7K6jl9k2NN1
$$ -45 -31 11 -7 -25 2 -25 6 -25 -35 27 4 -13 14 14 -9 13 43 39 -12 13 -48 55 -17 -32 5 -12 14 13 -26 -48 -43 8
4892Ho3K8M9km3J4rm8M0k2J7L8m7Q6j7k8PJ6kj9K0j4pL8k7k3K5M3p0M2pk9o0P8
$$ 8 -55 -27 22 20 -23 -9 -18 -66 -26 -48 -31 7 -40 46 29 1 8 24 22 3 23 9 2 40 13 -10 15 58 -12 30 23 -6 -66 12
4926A2Pr7P9n0K2m9P2qM7J8n0l1lL3l6J3N1L9p8n2J05j0m3K1J0l4j8L5noJ4J5
$$ 12 19 -78 1 -49 -27 -76 -4 -12 35 53 3 -28 -31 2 -34 -21 30 69 -9 -61 44 34 -9 12 22 -12 -30 5 0 -6 8 23
4958B3m2j9N9l8nL9K0nk3jJo7M5k6N1K1m8O3o9M3j4l4K7j4J8j01N8O3n8lR8n4
$$ 23 -19 -38 21 -17 -22 17 37 32 9 8 9 -58 -13 -39 12 33 -15 48 -21 22 8 -26 1 -13 5 -96 -38 25 -33 -36 62 8
4990Hk0MJ6o1Q8mm3Qk3P6o7MK2j2O3m0l9k6K4M5K0n1M5Jm4j1K8l5M7m4L4k0j5
$$ 8 -12 -8 8 -53 35 31 -12 -4 -27 49 -18 -14 8 -4 59 19 -20 -46 -22 23 43 -8 37 38 -6 -17 11 -24 23 -21 13 -7 -22
5023b2N0p9K8k4Q6l7pJ1k5J1L7k0l9J2J9K9Km7J1jl7N6J1J5l9j9L6p9K4mO6l3
$$ -22 28 -51 -23 -47 39 2 -5 6 -19 -8 29 9 -30 -18 1 30 32 -15 -4 -5 -42 14 25 40 1 -18 18 -61 -37 -41 25 -8
5055hrJ3m1M2rj4J1K2K4o1lM9l7O3j3o9k0R3k3J8J4p6L4J5j2j3NM6k2Qo2J7Jk8
$$ -8 -17 -4 -45 -3 -12 -26 -15 7 31 -30 -33 16 -21 42 29 -40 -60 33 10 28 42 -34 0 15 3 -10 -5 41 19 27 -35 -18 -17 -45
5089d5L0J2n7P1Ol1N4k5l1j5j8OM8K2J5l3%n4M6rNKLj1k4NP4p0N9n6J3OJ5k1J3
$$ -45 -15 -3 -60 11 17 -14 40 15 -16 -31 -49 -43 5 27 42 9 9 -45 1 -8 -3 -1 2 -9 -33 -28 46 -24 35 -21 -8 -2 13 -8 5
5124En6R1n9L9On8M4o2j2M2N2lPl2lK0j3nK0jrk9K0ql1M9L1lnn0%m0L2j6K8rP
$$ 5 -51 40 -19 20 26 -32 12 -50 -62 -20 32 29 36 4 1 21 8 3 23 22 13 -16 4 -4 -35 14 45 42 37 -13 -13 -53 -21 -37 -9 -18 -11
5161a1P9q2L5k3pkM4m8O8m0J4m4OO6q3J9J2k8J5RmL8l4J4L0j13O0N4m7n4K3P6
$$ -11 68 -14 21 -2 -9 -11 33 -15 53 13 27 -17 -11 55 -28 -9 3 -25 -10 -1 -5 33 -1 13 43 -70 -10 44 -3 -57 -34 42
5193D2n7k9M7%o5N0M6k7K3K3n1j4J8ql4K9N4j9n2nl4L7J3N2p1lRm8O4J3j0Qk0
$$ 42 -15 -44 3 3 -62 -12 34 7 30 53 2 -12 6 -2 -36 -7 47 28 -24 -29 -63 -26 -13 39 -32 -35 -26 -74 -10 3 -7 1 -19
5226a9l1O0j4ml0P3m3M0m3k1M6k5K5kNK0Jj2rQm2j4O2l5L2l7j1QL1o2j5J8J4j3
$$ -19 -50 10 -4 -8 -38 35 -8 32 -11 -32 14 -11 14 12 17 37 38 26 17 25 -17 -31 31 -4 28 -9 -20 -12 19 -43 -58 -40 -26 -39
5260c9J8L5j8j5J2K1p0O8k4N9j10O2Pn1K2K7M0q2J1K2l7O2o2L3L2L7o4j5O0J1
$$ -39 -21 14 -4 -19 -7 14 -56 12 -12 47 -63 -1 6 -45 -23 4 44 -38 -27 -5 -42 20 -42 -9 23 60 -4 -19 41 52
5290E2K0j10Q8m2j2m6M2J1K2j9LK3rJ4Ln6JK5m7%P2n8Q8n6m0mJ0L2l4N8k2k8k
$$ 52 72 -38 50 8 -4 -50 -8 3 25 6 9 32 23 37 40 -16 -15 10 -37 -37 35 -23 65 9 -31 -35 -25 7 -27 31 9 -19 -21
5323b1QL8n4L4j7M0k8k8L9L0o4j6N2PKk2Qn8J6Ql1O0k3Kj6PL1M5n3mJ6l1k6O3
$$ -21 -13 25 -29 5 -12 28 0 -28 11 41 -23 -39 13 20 22 0 8 -50 -34 -26 -57 3 -20 -18 -34 -27 4 49 -4 -8 8 -23 -49 14
5357A4j6nL1k3M4q8N0N5m1j4L9n2K1J0Pk9L2qj5L0m7j6rL9l3j8Q9m7J0p2N4J7
$$ 14 -2 -7 24 1 45 -43 7 62 21 7 46 -6 15 25 32 3 35 27 12 42 -5 -21 -30 9 -24 -42 47 0 10 -62 -8 9
5389Ik4k9J7K4N4k7MJ1q0O7j8pj2noN5m5J0k8N0n6k2R9l7j1L8o3K7j3k4O2pK9
$$ 9 -15 -44 -27 -3 51 24 28 39 -41 26 8 1 -11 -16 -22 33 -12 -2 -30 20 -36 -58 41 4 -7 31 -32 -5 -18 -42 20 13 42
5422D2o5J4L5M2j05J3J8J1M5p1L4n0O6p9L3K2pk%K1rKjk1l2N6m8j8Q6l8j1L8k9
$$ 42 -23 -9 26 68 -37 -24 -6 5 50 -21 13 -37 29 -50 -17 5 -2 -4 -4 17 8 10 9 -12 -44 12 -36 -54 32 -6 -17 21 -8
5455hO8p1qK8j7J4k6L8l4qJ02j47O9J7rmL8l2l8N7qn6k5P6Kj0o4N4kOM5m8l5N
$$ -8 60 -11 -19 9 -8 6 -20 18 -16 -24 78 -69 0 17 8 4 42 10 -28 29 21 -35 -60 16 18 8 -56 -2 -4 2 47 -1 -36 -31
5489c1L0l0J6K5m2K7O7o9J5l3kJ3O3Nn5k5RL9n0J9K3RL9n8n9M4J0J8j2m0M5m1
$$ -31 -1 -31 -15 10 -32 -5 62 -7 8 -25 -27 -14 49 54 -1 -26 -17 22 -28 -9 14 23 62 4 -55 -11 -1 17 5 -35 10 -31
5521c1O1j5p1J5J02o4KJ8J7j5j4Qm3M0j9m2L5L1K9m2k1LM9q5M5J6K0l6K1N9n5
$$ -31 30 15 -56 -41 61 -3 -1 17 34 19 5 13 -30 10 -9 -51 -16 15 44 2 -19 -16 33 -52 -7 9 29 -7 14 73 18
5552A8lk1ok7K2mJ8Oll9QO6n6NL7n1kM0M3k7j0Pon8N5k8J6m9M7K1n5P9l4mL2r
$$ 18 15 -6 -12 -39 -17 -21 -3 3 0 -39 -31 35 -21 -16 21 -30 -32 8 51 24 14 21 15 -43 12 -16 0 -49 -2 19 -36 43 9 5 37 28
5588B8j3o1P7o5OK7qJ1L4j5n8N4l5K6j3N3m4Olok0k5N6pJ8Ml9Pk1M3K7j5p3M1
$$ 28 15 -46 31 -34 -28 -1 -9 2 36 21 -37 17 -18 8 -5 48 4 10 7 1 -19 -44 12 5 23 27 -12 -5 -26 17 44 29 -44 -3
5622cL5m9j1L3L0k8j2J8L1k1j6r8P3k6N7qj9Nj0M7l0L9qpn2J7L4k6M2Mk3j0J7
$$ -3 32 -17 -28 5 35 7 -5 13 44 23 7 -91 -18 -44 13 5 -14 -9 -19 28 -2 37 29 22 -30 -13 21 -5 37 41 18 8 25
5655B5o6M8k9J1j9%OQm5K4Q6l4m6L0J9KJ2n9L1j7K2l8LK1K2l4JM3o1K4K5m1J1
$$ 25 -41 7 -22 -11 -30 -30 -24 -16 -61 -37 49 15 -31 -1 18 20 32 -27 4 -13 9 -29 -26 -5 17 -17 -16 27 -34 -10 15 -26 -15
5688a5K4j5N7m8J4K2o3nJ0M6p1K7L9j4mk4J1j6L7j3k7J7j1K0oN5J4n6j4NlO2n8
$$ -15 9 -6 51 3 17 39 -24 -29 -19 27 -44 -17 22 8 4 -20 -9 -25 12 -1 -28 -11 -22 -2 -8 47 61 5 -9 -4 -7 55 -3
5721cO8l1o4j1N8k1M4n7L6p3RL8j7RN4qp1R1j9%l4J1ojK3l8J1m6JN0o5J6J00o1
$$ -3 65 34 -30 -41 17 -4 40 -17 19 -54 -45 -7 -24 -15 39 31 -40 51 32 32 -2 9 3 2 25 -13 -2 -48 -47 3 -62 -46 54 -7
5755gK0lp7N5K3k3K1Jl3L1K6n0J6oJ1l3J8K2llj1j9L1j3N9l8L5m0k0K2l7J8l6
$$ -7 13 10 -67 -12 11 -12 9 10 -23 8 34 -16 0 -6 5 -28 -10 12 9 6 -5 -24 7 -6 53 15 50 10 -10 12 -25 -7 -43
5788d3N4k5L2L2l9o0N7kk7M9p8P1m0OJ2K0o6N4q4P2k2Nk5K5N6pl5j6O0m9K6j8
$$ -43 11 -14 18 50 11 -49 8 6 -21 28 -50 21 -19 -13 -1 19 -47 7 -77 -5 -27 -22 -47 -22 34 27 -8 -24 36 -13 13 -5
5820enJ4L0l2ok7N8q6N4M2m2m8J4N2o4K6M4r3O7J2jK8m3N7k2o5K0L0jl4L9Nl6
$$ -5 -10 4 34 2 -4 -31 27 -59 -5 37 -5 -53 -39 13 -51 -25 19 -74 -7 5 4 32 -11 46 24 -41 -21 9 8 -26 13 18 -18
$$ [...]
8191b7
##END NTUPLES=NMR FID
##END=
