##TITLE=1H_AM_NV63.1
 CDCl3
 8 sc, 
 5.10.2023
##JCAMPDX= 6.0         $$ Bruker NMR JCAMP-DX V2.0
##DATA TYPE= NMR FID
##DATA CLASS= NTUPLES
##ORIGIN= UXNMR, Bruker Analytische Messtechnik GmbH
##OWNER= root
$$ XWIN-NMR		Version 3.5
$$ Thu Oct  5 14:09:53 2023 Russian Standard Time (UT+4h)  she@DPX200
##.OBSERVE FREQUENCY= 200.13135
##.OBSERVE NUCLEUS= ^1H
##.DELAY= (6, 6)
##.ACQUISITION MODE= SIMULTANEOUS
##.ACQUISITION SCHEME= undefined
##.AVERAGES= 8
##.DIGITISER RES= 18
##SPECTROMETER/DATA SYSTEM= spect
##.PULSE SEQUENCE= zg30
##.SOLVENT NAME= D2O
##.SHIFT REFERENCE= (INTERNAL, D2O, 0, 15.7039)
##AUDIT TRAIL= $$ (NUMBER, WHEN, WHO, WHERE, WHAT)
$$ ##TITLE= Audit trail, XWIN-NMR		Version 3.5
$$ ##JCAMPDX= 5.01
$$ ##ORIGIN= Bruker BioSpin GmbH
$$ ##OWNER= she
$$ F:/spectra/data/she/nmr/H-F/1/audita.txt
$$ ##AUDIT TRAIL=  $$ (NUMBER, WHEN, WHO, WHERE, WHAT)
(   1,<2023-10-05 14:08:59.93 +0400>,<she>,<DPX200>,
      <created by zg, POWCHK disabled, PULCHK disabled
       configuration hash MD5:
       00 E9 B6 7A A2 85 ED C7 34 08 36 98 17 FE 4E 26
       data hash MD5: 16K
       FB 22 A0 56 59 08 56 42 B8 A4 59 8A 6A 41 E5 36>)
$$ ##END=
$$ 
$$ hash MD5
$$ 0C 5C DF 89 EB 11 5E 3A 27 EC A7 50 59 AA 13 DD
##$RELAX= 
##$RELAX= 
##$RELAX= 
##$RELAX= 
##$RELAX= 
##$RELAX= 
$$ Bruker specific parameters
$$ --------------------------
##$DU= <F:/spectra>
##$EXPNO= 1
##$NAME= <H-F>
##$PROCNO= 1
##$TYPE= <nmr>
##$USER= <she>
##$AMP= (0..31)
100 100 100 100 100 100 100 100 100 100 100 100 100 100 100 100 100 100 
100 100 100 100 100 100 100 100 100 100 100 100 100 100 
##$AQSEQ= 0
##$AQ_mod= 1
##$AUNM= <au_zg>
##$AUTOPOS= <>
##$BF1= 200.13
##$BF2= 200.13
##$BF3= 200.13
##$BF4= 200.13
##$BF5= 200.13
##$BF6= 200.13
##$BF7= 200.13
##$BF8= 200.13
##$BYTORDA= 1
##$CFDGTYP= 0
##$CFRGTYP= 5
##$CHEMSTR= <none>
##$CNST= (0..31)
1 1 145 1 1 1 1 1 1 1 1 1 1 1 1 1 1 1 1 1 1 1 1 1 1 1 1 1 1 1 1 1 
##$CPDPRG= <>
##$CPDPRG1= <>
##$CPDPRG2= <>
##$CPDPRG3= <>
##$CPDPRG4= <mlev>
##$CPDPRG5= <mlev>
##$CPDPRG6= <mlev>
##$CPDPRG7= <mlev>
##$CPDPRG8= <mlev>
##$CPDPRGB= <>
##$CPDPRGT= <>
##$D= (0..31)
0 1.2 0 0 0 0 0 0 0 0.06 0 0.03 0 0 0 0 0.0002 0 0 0 0 0 0 0 0 0 0 0 0 
0 0 0 
##$DATE= 1696500539
##$DBL= (0..7)
120 120 120 120 120 120 120 120 
##$DBP= (0..7)
150 150 150 150 150 150 150 150 
##$DBP07= 0
##$DBPNAM0= <>
##$DBPNAM1= <>
##$DBPNAM2= <>
##$DBPNAM3= <>
##$DBPNAM4= <>
##$DBPNAM5= <>
##$DBPNAM6= <>
##$DBPNAM7= <>
##$DBPOAL= (0..7)
0.5 0.5 0.5 0.5 0.5 0.5 0.5 0.5 
##$DBPOFFS= (0..7)
0 0 0 0 0 0 0 0 
##$DE= 6
##$DECBNUC= <off>
##$DECIM= 32
##$DECNUC= <off>
##$DECSTAT= 4
##$DIGMOD= 1
##$DIGTYP= 9
##$DL= (0..7)
0 120 120 120 120 120 120 120 
##$DP= (0..7)
150 150 150 150 150 150 150 150 
##$DP07= 0
##$DPNAME0= <>
##$DPNAME1= <>
##$DPNAME2= <>
##$DPNAME3= <>
##$DPNAME4= <>
##$DPNAME5= <>
##$DPNAME6= <>
##$DPNAME7= <>
##$DPOAL= (0..7)
0.5 0.5 0.5 0.5 0.5 0.5 0.5 0.5 
##$DPOFFS= (0..7)
0 0 0 0 0 0 0 0 
##$DQDMODE= 0
##$DR= 18
##$DS= 0
##$DSLIST= <SSSSSSSSSSSSSSS>
$$ [...]
##$SUBNAM2= <"">
##$SUBNAM3= <"">
##$SUBNAM4= <"">
##$SUBNAM5= <"">
##$SUBNAM6= <"">
##$SUBNAM7= <"">
##$SUBNAM8= <"">
##$SUBNAM9= <"">
##$SW= 18.05172834244
##$SWIBOX= (0..15)
0 0 2 0 0 0 0 0 0 0 0 0 0 0 0 0 
##$SW_h= 3612.71676300578
##$TD= 16384
##$TD0= 1
##$TE= 0
##$TE2= 300
##$TE3= 300
##$TEG= 300
##$TL= (0..7)
0 120 120 120 120 120 120 120 
##$TP= (0..7)
150 150 150 150 150 150 150 150 
##$TP07= 0
##$TPNAME0= <>
##$TPNAME1= <>
##$TPNAME2= <>
##$TPNAME3= <>
##$TPNAME4= <>
##$TPNAME5= <>
##$TPNAME6= <>
##$TPNAME7= <>
##$TPOAL= (0..7)
0.5 0.5 0.5 0.5 0.5 0.5 0.5 0.5 
##$TPOFFS= (0..7)
0 0 0 0 0 0 0 0 
##$TUNHIN= 0
##$TUNHOUT= 0
##$TUNXOUT= 0
##$USERA1= <user>
##$USERA2= <user>
##$USERA3= <user>
##$USERA4= <user>
##$USERA5= <user>
##$V9= 5
##$VALIST= <valist>
##$VCLIST= <CCCCCCCCCCCCCCC>
##$VD= 0
##$VDLIST= <DDDDDDDDDDDDDDD>
##$VPLIST= <PPPPPPPPPPPPPPP>
##$VTLIST= <TTTTTTTTTTTTTTT>
##$WBST= 1024
##$WBSW= 4
##$XGAIN= (0..3)
0 0 0 0 
##$XL= 0
##$YL= 0
##$YMAX_a= 439240
##$YMIN_a= -439911
##$ZGOPTNS= <>
##$ZL1= 120
##$ZL2= 120
##$ZL3= 120
##$ZL4= 120
##$ABSF1= 10
##$ABSF2= 0
##$ABSG= 5
##$ABSL= 3
##$ALPHA= 0
##$AQORDER= 0
##$ASSFAC= 0
##$ASSFACI= 0
##$ASSFACX= 0
##$ASSWID= 0
##$AUNMP= <proc_1d>
##$AZFE= 0.1
##$AZFW= 0.1
##$BCFW= 1
##$BC_mod= 2
##$BYTORDP= 1
##$COROFFS= 0
##$CY= 11.3945322036743
##$DATMOD= 1
##$DC= 2
##$DFILT= <>
##$DTYPP= 0
##$F1P= 15.7292609196834
##$F2P= 12.9074282941183
##$FCOR= 0.5
##$FTSIZE= 0
##$FT_mod= 4
##$GAMMA= 1
##$GB= 0.15
##$INTBC= 1
##$INTSCL= 1
##$ISEN= 128
##$LB= 0.24
##$LEV0= 0
##$LPBIN= 0
##$MAXI= 10000
##$MC2= 0
##$MEAN= 0
##$ME_mod= 0
##$MI= 1.114404
##$NCOEF= 0
##$NC_proc= 0
##$NLEV= 6
##$NOISF1= 3.799351
##$NOISF2= 2.8
##$NSP= 1
##$NTH_PI= 0
##$NZP= 0
##$OFFSET= 15.70392
##$PC= 1
##$PHC0= -22228.28
##$PHC1= 12.05271
##$PH_mod= 1
##$PKNL= yes
##$PPARMOD= 0
##$PSCAL= 0
##$PSIGN= 0
##$REVERSE= no
##$SF= 200.130013532006
##$SI= 16384
##$SIGF1= 3
##$SIGF2= 2
##$SINO= 400
##$SIOLD= 16384
##$SREGLST= <1H.CDCl3>
##$SSB= 0
##$STSI= 0
##$STSR= 0
##$SW_p= 3612.71676300578
##$SYMM= 0
##$S_DEV= 0
##$TDeff= 0
##$TDoff= 0
##$TI= <>
##$TILT= no
##$TM1= 0
##$TM2= 0
##$TOPLEV= 0
##$USERP1= <user>
##$USERP2= <user>
##$USERP3= <user>
##$USERP4= <user>
##$USERP5= <user>
##$WDW= 1
##$XDIM= 8192
##$YMAX_p= 0
##$YMIN_p= 0
$$ End of Bruker specific parameters
$$ ---------------------------------
##NTUPLES= NMR FID
##VAR_NAME=  TIME,          FID/REAL,        FID/IMAG
##SYMBOL=    X,             R,               I
##VAR_TYPE=  INDEPENDENT,   DEPENDENT,       DEPENDENT
##VAR_FORM=  AFFN,          ASDF,            ASDF
##VAR_DIM=   8192,          8192,            8192
##UNITS=     SECONDS,       ARBITRARY UNITS, ARBITRARY UNITS
##FACTOR=    0.0002768,     1,               1
##FIRST=     0,             0,               0
##LAST=      2.2672688,     0,               0
##MIN=       0,             -439911,         0
##MAX=       2.2672688,     439240,          0
$$ Real data points
##PAGE= N=1
##DATA TABLE= (X++(R..R)), XYDATA
$$ [...]
811A94n34P36p39o22J882n9k685R93K742j800k390K484J331k360k14J710p32l66
$$ 194 -340 396 -343 -965 917 858 -1827 -834 1908 108 -2282 202 1533 -827 -1041 669 -63 -429
829d29J393j089j170K376O63l386K60L827j151l546J925K586k263j592J948L44
$$ -429 964 -125 -1295 1081 1744 -1642 -1382 2445 1294 -2252 -327 2259 -4 -1596 352 696
845F96j350P83K49j684R95K110k274k119L469J588m333m34M382o42l803J845K578
$$ 696 -654 129 378 -1306 -311 1799 -475 -2594 875 2463 -1870 -2304 2078 1436 -2367 -522 2056
862B056k511n78K512j209j689K765L52l670J304L441k731k632L526J069l453L73
$$ 2056 -455 -1033 1479 270 -1419 1346 1698 -1972 -668 2773 42 -2590 936 2005 -1448 -1075
878a075K510j594j079K122o95j888J987J291k920k77L089n76k590J087J921j159
$$ -1075 1435 -159 -1238 884 189 -1699 288 1579 -1341 -1618 1471 895 -1695 -608 1313 154
894A54q61Q32M9K9M61q48n05J505L17j816KJ637l45j231K65O43l7k53l27j60O62
$$ 154 -707 125 174 203 664 -184 -689 816 1133 -683 -681 956 611 -620 -355 288 251 -2 -329 -489 173
915A73L21j057l48J251K57j152j24J091Q2q84P6O56k6m65K43K21m10J98M19p11
$$ 173 494 -563 -911 340 597 -555 -679 412 494 -390 -314 342 316 -149 94 315 -95 103 522 -189
935a89k03J123k61j346P79J261j538p79J856r8j762Q04J364j577n15J818l67j542
$$ -189 -392 731 470 -876 -97 1164 -374 -1153 703 605 -1157 -353 1011 -566 -1081 737 370 -1172
953a172J220R52j654L0J699r64j109J718L66k145O89K038j549j477J970O94j958
$$ -1172 48 1000 -654 -624 1075 111 -998 720 1086 -1059 -370 1668 119 -1358 612 1306 -652
970f52N4J413o92o88Q44k74q09J010N02j698M5J918m63j843Q59J556r38j187R65
$$ -652 -598 815 123 -565 279 5 -804 206 708 -990 -945 973 510 -1333 -474 1082 144 -1043 -78
989g8P11n74k21J62k9L61K73q91j15J214K4j438k3J517k75j319J83J030j30q00
$$ -78 633 59 -162 0 -29 332 605 -286 -401 813 837 -601 -624 893 618 -701 -518 512 382 -418
1009d18kL94K32j40m93q4P36J95r43j57R97R6p08K8L60J33J56k94n19N89P23r96
$$ -418 -420 -26 206 66 -427 -511 225 420 -523 -680 317 413 -295 -267 93 226 382 88 -431 158 881 -115
1031a15n14J118J62j002J03N43m70J70M44r38j49J509m80j778J086J663j653j163
$$ -115 -629 489 651 -351 -248 295 -175 -5 439 -499 -648 861 381 -1397 -311 1352 -301 -1464
1049a464J922M50j705K58J345r27l92J230n04j051J367O26k000K12K095j010j753
$$ -1464 458 908 -797 -539 806 -121 -513 717 213 -838 529 1155 -845 -633 1462 452 -1301
1066a301J535R29j579k27J268n59p16Q96M0r63L79Q81p21o42P14O23o36n97M81
$$ -1301 234 1163 -416 -643 625 66 -650 246 286 -677 -298 583 -138 -780 -66 557 -79 -676 -195
1085a95P42l36q55M60R60m77p12M74N21m50o8J00l93M37M11j157k60J674k31k044
$$ -195 547 211 -644 -184 776 299 -413 61 582 132 64 164 -229 208 619 -538 -798 876 645 -1399
1105a399Q47K079j582j616K027Q43k004K4J449o07p26Q41j56n81Q83J86j213O03
$$ -1399 -552 1527 -55 -1671 356 1199 -805 -781 668 61 -665 176 20 -561 322 508 -705 -102
1123a02J250j058q16J307M25j424l9J114l18q38K90N55l00l22J21K41K2j94k14
$$ -102 1148 90 -726 581 1006 -418 -457 657 339 -499 -209 346 46 -276 -155 86 108 -86 -300
1142c00L32J45m81k2M57j62l45K71J31j89J78K52l52J77M47n05k08O67j20p48
$$ -300 32 177 -304 -326 131 -31 -376 -105 26 -163 15 267 -85 92 539 34 -174 493 373 -375
1162c75L33N61o19m62Q30P5o20J1N52j04n49O9N17k16n19K72L94m63m0N37j48
$$ -375 -42 519 -100 -562 268 343 -277 -266 286 182 -367 -298 219 3 -516 -244 150 -313 -353 184 36
1183C6l53O55N6o84M99M92q19l18R98k37j012N91P42p66l06P89O5n84K32K67m28
$$ 36 -317 338 394 -290 209 701 -118 -436 562 325 -687 -96 646 -120 -426 363 428 -156 76 343 -85
1204h5q4L07m14k40L59M8n03L44M91l29o2N81L3l17J33P4j99k2k80k25L06J37
$$ -85 -169 138 -276 -516 -157 -109 -612 -268 223 -106 -168 413 446 129 262 336 137 115 -165 -390 -84 53
1226E3n95K62P64l73l22P59J36p36J79L73o86k73K85k98k99N14o0m65O83O89o21
$$ 53 -542 -280 484 111 -211 548 684 -52 127 500 -186 -459 -174 -472 -771 -257 -317 -782 -99 590 -31
1247c1p4J074j05q75K26M62o62o04L65J20m09j67N58K96j76J30M17O8j58j3j94
$$ -31 -105 969 864 -11 215 677 15 -589 -224 -104 -513 -680 -122 174 -2 128 545 613 455 442 248
1268B48l19J39l15p38K47O33n55n58J244P88j072N3J590k81j472O52Q70j298p51
$$ 248 -71 68 -247 -985 -738 -105 -660 -1218 26 814 -258 -205 1385 1104 -368 284 1154 -144 -895
1287h95R44p4r66N40N05m38M69P08p61m2J410n77j772J050J089j970r84J916J78
$$ -895 49 -25 -991 -451 54 -384 85 793 32 -10 1400 823 -949 101 1190 -780 -1764 152 330
1306C30j779M51J719m64p94P63O52l57k10k87J29M48o72q75O76Q15q53n41R17
$$ 330 -1449 -998 721 257 -537 226 878 521 311 24 153 601 -71 -946 -270 545 -308 -849 68
1325F8O79m91n82L98Q82l67j386K82J384p56j712J147J620j521j205J961R61j780
$$ 68 747 256 -326 72 954 587 -799 -517 867 111 -1601 -454 1166 -355 -1560 401 1362 -418
1343d18m70J569J79j208k50N68J81Q2m45m93J044R15j407p40J899M94k412j88
$$ -418 -888 681 860 -348 -598 -30 151 233 -212 -705 339 1254 -153 -893 1006 1500 -912 -1100
1361a100K252n65k459R30K054j071j547J364J281p11q20O51M84l35l97l57j13
$$ -1100 1152 587 -1872 -942 1112 41 -1506 -142 1139 428 -392 259 743 408 11 -346 -459
1378d59L08m2q06J90J089j02o97J084R77j234m94J755j78k463J86J873j195j915
$$ -459 -151 -193 -999 -809 280 178 -519 565 1542 308 -186 1569 1391 -1072 -886 987 -208 -2123
1396b123J065J361q99l37J025O04l3R9k89J99N15j125j165J006O35k082o84K341
$$ -2123 -1058 303 -596 -933 92 696 663 762 473 672 1187 62 -1103 -97 538 -1544 -2228 113
1414A13O88j858J51K132N33j060l84O27M49o24j441k92Q61m09j291N35J243n01
$$ 113 801 -1057 -906 1226 1759 699 315 942 1391 767 -674 -966 -105 -514 -1805 -1270 -27 -528
1432e28k62J538M45q97K79J044o59j151J40Q1o90l95qJ78M89o6o9J210Q26j195
$$ -528 -790 748 1193 296 575 1619 960 -191 -51 30 -660 -1055 -1063 -885 -396 -462 -531 679 1505 310
1452C10k00J818K5k575l10J975l53k609l35K053P49j465r23J953J989j241j809
$$ 310 110 1928 1953 -622 -932 1043 690 -1919 -2254 -201 548 -917 -1840 113 2102 861 -948
1469i48J403J847j653k070J072J341j509j386J072J311o04r11Q18J482n0j252
$$ -948 455 2302 649 -1421 -349 992 -517 -1903 -831 480 -124 -1035 -217 1265 1215 -37
1485c7o4J444Q8j830n40J283M7j449r1J046j42l81O56M38o13PJ056q6j206o0R81
$$ -37 -101 1343 1431 -399 -939 344 391 -1058 -1149 -103 -245 -626 30 468 -145 -138 918 832 -374 -434 547
1506E47L4j281l27J011N83q29m31O94Q28l04r11J21J210j52j659J39J854m68k184
$$ 547 581 -700 -1027 -16 567 -262 -693 1 829 525 -386 -265 945 793 -866 -727 1127 659 -1525
1525a525P08K120q62j844Q44J554o25j094L05N35K26j38q42j8J464J20j742J10
$$ -1525 -817 1303 441 -1403 -559 995 370 -724 -419 116 342 204 -638 -656 808 928 -814 -704
1543g04J874m05j632O18J144r99n82Q47O4p48M37M47m86J05M91l53l12N77l1p78
$$ -704 1170 765 -867 -249 895 -104 -686 161 225 -523 -86 361 -125 -20 471 118 -194 383 352 -426
1563d26K08L79m97k35N07q8m23N40N61n22k95R37L06r19l53O90K65q03n31M50
$$ -426 -218 161 -336 -571 -64 -152 -575 -35 526 4 -291 646 952 33 -320 370 635 -168 -699 -249
1583b49N57m52n61M49Q47l03o24M30N18l04m00jK13r5m40k69M79L70n49k67R37
$$ -249 308 -144 -705 -256 591 288 -336 94 612 308 -92 -93 120 25 -415 -684 -205 165 -384 -651 286
1604B86L23p73N5Q43m7q30J98N47o03n36N68R4o92J45O77k77l30N44J78l77L16
$$ 286 609 -164 -109 734 687 -143 55 602 -1 -537 31 125 -567 -422 255 -22 -352 192 370 -7 309
1625C09N5o02K35M65q45n06J094L9j092L23J075m53n80R23K44p70L07M56o33k69
$$ 309 364 -238 -3 462 -383 -889 205 244 -848 -525 550 97 -483 440 684 -86 221 677 44 -225
1645b25N71l65o08M93L20p54K24Q39m37l89O80J39n76K04J94n20RK95n22k16O06
$$ -225 346 -19 -627 -134 186 -568 -344 495 58 -331 349 488 -88 116 310 -210 -201 94 -428 -644 -38
1666c8n3m41M89M54l93M2O47k47n03L78J02n95m8J16k59K4J44k63J89O44k94m44
$$ -38 -91 -532 -43 411 18 60 707 460 -43 335 437 -158 -206 -90 -349 -325 -181 -444 -255 389 95 -349
1688c49P74N28r34k56P32k88p95O0M01k48j68R6K66M19Lk49L65P47m75p91M82
$$ -349 425 953 19 -237 495 207 -588 -528 -127 -375 -543 -447 -181 238 241 -8 357 1104 629 -162 320
1709C20M57r10o52N32K60o14j51N62L71j25L1K96K94j25l60j11K29j90p40j35
$$ 320 777 -133 -785 -253 7 -607 -758 -196 175 50 81 377 671 546 186 75 304 114 -626 -761
1729g61N18j36n16K24Q82O0m05M48P14k43m92K50Q9o00m04R9j38l03J26J00M2
$$ -761 -243 -379 -895 -671 211 271 -134 314 1028 785 293 543 632 32 -372 -273 -411 -714 -588 -488 -446
1750d46M96K41k50L77O83n29p07O56J07j345j26Q45o19n51O97M06l46N07M74k74
$$ -446 50 291 41 418 1101 572 -135 521 628 -717 -843 2 -617 -1168 -471 -65 -411 96 570 296
1770B96L92L81q14j17P45p21j099N85O04j152k91J131J56m98M09N31q8J73j07
$$ 296 688 1069 255 138 883 162 -937 -352 252 -900 -1191 -60 96 -402 7 538 450 623 516
1789E16n08L10K66j007n18J035o9j269M21J441o77o55J179M29p81K09M02m36j39
$$ 516 8 318 584 -423 -941 94 25 -1244 -823 618 -59 -714 465 894 113 322 724 288 149
1808A49K00o13k60O59m35p01Q66N57j005J06J170k86q33O04N40o85l96M97Q2m55
$$ 149 349 -264 -524 135 -300 -1001 -135 422 -583 -477 693 407 -426 178 718 33 -363 134 216 -239
1828b39j00K48O0j23j17R9L62k9j63j7L22J02l33j61M06R8n19l28N42J92q90j15
$$ -239 -339 -91 -31 -154 -271 -172 190 161 -2 -19 303 405 72 -89 317 415 -104 -432 110 302 -588 -703
1850g03Q80j52p78L90P89l45m25N37L46l27o6J43k10k0Pn53P2M94l75m55P55N06
$$ -703 177 25 -753 -363 426 81 -344 193 539 212 146 289 79 59 66 -487 -415 79 -296 -751 4 510
1872E10p14P1R10n7o64K52L12m40l73q9r4j2k02j88K96N72l06r0Q57K93o30Q8
$$ 510 -204 -133 777 720 56 308 620 180 -193 -282 -376 -388 -590 -778 -482 90 -216 -306 551 844 214 302
1894C02O02m76o52K35jo31Q4K7j23M00M13l90L01R83l99p18P07M36j243m00P49
$$ 302 904 428 -224 11 10 -621 -537 -510 -633 -233 180 -210 91 1074 675 -43 664 1100 -143 -543 206
1915B06l17j024L32N35l04o9N97K47N6L76n9k08M17j37q57m3M18n64o27N49M22
$$ 206 -111 -1135 -803 -268 -572 -641 -44 203 259 635 576 368 785 648 -209 -252 166 -398 -1025 -476 -54
1936e4n23J04P73R7j76L22J53k16nk04m48l8O5n46k30O13Jm48N33P35l50j64P67
$$ -54 -577 -473 300 397 221 543 696 480 475 271 -177 -215 -150 -696 -926 -313 -312 -760 -227 508 158 -6 761
1959G61J16p71Q0N04o96n09M83j32o74M99M25n54K25R45l87n95R93K94j342J75
$$ 761 877 106 186 690 -6 -515 -32 -164 -838 -339 86 -468 -243 702 315 -280 713 1007 -335 -160
1979a60J072r74j014J072K76j375L62J307q60m69J372J2j085P80Q37j337j33J227
$$ -160 912 -62 -1076 -4 272 -1103 -741 566 -294 -763 609 621 -464 316 1153 -184 -317 910
1997I10p22j141J101L87j380K13J368p42q58J310L76j290K88J113o97p50Q60j3
$$ 910 188 -953 148 535 -845 -632 736 -6 -864 446 822 -468 -180 933 236 -514 346 333
2015C33r55M23M72p81rP61m31l98Q91J37q37M04Q25p74m15Q19J08r79J85N88m19
$$ 333 -622 -199 273 -508 -517 244 -187 -585 306 443 -394 10 835 61 -354 465 573 -406 -221 367 -52
2036e2m09L60J22l00K15J28j88K68K89n08j47P87l32p70L98O41q41m05R00J04
$$ -52 -461 -101 21 -279 -64 64 -124 144 433 -75 -222 565 233 -537 -139 502 -339 -744 156 260
2056B60q59L37P52m10k52N66n6l31L51q6n64L72L40r21q0R67m02q55R01O95j098
$$ 260 -599 -262 490 80 -172 394 338 7 358 272 -292 80 420 -501 -581 386 -16 -871 30 725 -373
2077c73q8J184l61q27O73K67p91J18M36o30p5Q35n71m97J121K08j181M38J202
$$ -373 -461 723 362 -465 208 475 -316 -198 238 -392 -467 368 -203 -700 421 629 -552 -114 1088
2096A088r51o81J154K9j199L89P27r54j61R26n13n40R94O8r74O26Q24j025l43
$$ 1088 137 -544 610 639 -560 -171 556 -398 -559 367 -146 -686 308 376 -598 28 852 -173 -516
2115e16J237l31j260Q13P55j247p5J175m77q01R69K98q97L98P28q87j63J043n26
$$ -516 721 390 -870 -57 698 -549 -624 551 74 -727 242 540 -357 41 769 -118 -281 762 236
2134B36j036R11O31j401o3J411n43j082R75P31j102j51R92k97o08O26J60p54K62
$$ 236 -800 111 742 -659 -722 689 146 -936 39 770 -332 -483 509 212 -396 230 390 -364 -102
2153a02M95o83k23R88k18r58Q58O80j070l34J317j79j172M97Q31r43m03R98q2
$$ -102 393 -290 -513 475 257 -701 157 837 -233 -567 750 571 -601 -104 727 -216 -619 379 297
2172B97q95M32M83n53r3O93l25l35N91l8p17M24O06q25k68R57j52r00N73P06p56
$$ 297 -598 -166 317 -236 -329 364 39 -296 295 257 -460 -36 570 -255 -523 434 282 -618 -45 661 -95
2193i5l64Q79m6o43K22M40l60k38K42J6j88R0j7j89L18J09m35J44M58k66m86M77
$$ -95 -459 420 374 -269 -47 393 33 -205 37 53 -135 -45 -62 -251 67 176 -259 -115 343 77 -409 68
2215F8L42o36j36O41k3n05J27L87k04j56J32Q7j0o9o3K4J94j13k81J09L15l46
$$ 68 410 -226 -362 279 256 -249 -122 265 61 -95 37 124 114 45 -18 6 200 87 -194 -85 230 -116
2237a16k24M06K10n18j04N53o2m49J68L89k99j01K76j7j91J69j3j63J35N2j67
$$ -116 -340 66 276 -242 -346 207 145 -304 -136 253 -46 -147 129 112 -79 90 77 -86 49 101 -66
2258f6KL35k09k15K59J87m75k5L28m5l03J21J34j29L3P7j24j7K44p6k44K17K26
$$ -66 -64 271 62 -153 106 293 -182 -207 121 76 -227 -106 28 -101 -68 9 -115 -132 112 36 -208 9 235
2281B35k80j68L15N9k91pK79q8j22J25Km6J43j26j57K46J01m17J5M49q9n32J68
$$ 235 -45 -213 102 161 -130 -137 142 54 -68 57 59 13 156 30 -127 119 220 -197 -182 267 178 -354 -186
2304a86N16l61l14L77K25l41j43L53N1l05J32J04m1r3m2M9R6J00l23l3M75p9n69
$$ -186 330 -31 -345 32 257 -84 -227 126 177 -128 4 108 67 -26 -68 -19 77 177 -146 -179 296 217 -352
2327c52K31N93m39n04N27L09n89j06M83M6m74Q5L57r9j15p4P8J69l3k67J20L16
$$ -352 -121 472 33 -471 56 365 -224 -330 153 199 -275 -190 167 68 -47 -121 -43 126 93 -174 -54 262
2349B62j36m07K71L46m57j72M96j2l36O8K25p6k01J52JLK6k56R9K83j81k91K33
$$ 262 126 -281 -10 336 -121 -293 203 191 -145 -77 148 72 -129 23 24 27 53 -203 -104 179 -2 -293 -60
2372f0K46m09j19N60j00l55K77K04k76n9L36k11j29K38j08k17K58J84m31J06L66
$$ -60 186 -223 -342 218 118 -237 40 244 -32 -91 245 34 -95 143 35 -182 76 260 -171 -65 301
2393C01l20k12M63o4m73K52K92l68j85M57j3m74K39L33l35j50M35p6l30L00J44
$$ 301 -19 -231 232 168 -305 -53 239 -129 -314 143 130 -344 -105 228 -107 -257 178 102 -228 72 216
2414B16k81K6K83k18j71K75K1l47K58J65l47q0M53j64l77L16K68m67o7L85j2l71
$$ 216 -65 -39 244 26 -145 130 151 -196 62 227 -120 -200 253 89 -288 28 296 -171 -238 147 135 -236
2436b36J36K49k32q8K16O5j69R2N2j61J33N2j39k1K27j05k09K07P8j70n0J72o5
$$ -236 -100 149 -83 -171 45 110 -59 33 85 -76 57 109 -30 -51 176 71 -138 69 147 -23 -73 99 34
2459C4j46J81J1j99Q1J18j18k0J12o2o6J57r8k33L10J18m13J18L69l10j31L10
$$ 34 -112 69 80 -119 -38 80 -38 -58 54 -8 -74 83 -15 -248 62 180 -233 -115 254 -56 -187 123
2481A23J15m64K14L31l30j75L24J2l16J81P5k02K8K50j65j86K83l1l08R3L42k59
$$ 123 238 -226 -12 319 -11 -186 138 150 -166 15 90 -112 -84 166 1 -185 98 67 -241 -148 194 -65
2503f5k33L43R5l83J37L80k34j77J89J51k35n9K34k7j71J06Q6j38lP4k7j21R5
$$ -65 -298 45 140 -243 -106 274 40 -137 52 203 -32 -91 143 116 -55 51 137 -1 -4 70 43 -78 17
2526A7O9j98N0J32j66q8K00Q5k70L6K18k1k26K11P9j32l6J01Mj17P4K6M1Jo0l3
$$ 17 86 -112 -62 70 -96 -184 16 101 -169 -133 85 64 -162 49 128 -4 -40 61 65 -52 22 48 89 90 30 -3
2552cJ26j53M5P3n8j34J88Lj98J28J21k69j7L34j36l07K75J45l88J66L16l24j73
$$ -3 123 -30 15 88 30 -104 84 87 -111 17 138 -131 -148 186 50 -257 18 163 -225 -59 257 -67 -240
2575b40L37J21m13K01K95m23o1M33j02m32K81K82m11o0M25k78k13L24J00l72J07
$$ -240 97 218 -195 6 301 -122 -183 250 148 -284 -3 279 -132 -192 233 -45 -258 66 166 -206 -99
2596i9L14l00j13K83L0k83P9K97k68j00K56Lj98R3J63j14p5R5N3j56L1P7n6q1
$$ -99 215 -85 -198 85 115 -168 -89 208 -60 -160 96 99 -99 -6 157 43 -32 63 116 -40 -9 68 12 -69
2620f9R5J7j33qJ34m5j12R0J69k50m4K32m9j63J85J32l23O0J97L1k25R9J42k13
$$ -69 26 43 -90 -98 36 -9 -121 -31 138 -112 -156 76 27 -136 49 181 -142 -82 115 146 -79 20 162 -51
2644e1qJ45n7j4L0N2j11K5N7o3p3P8N0r4j6N9Lj34R0O9j13N7N1k9p7M5J13j22
$$ -51 -59 86 29 15 45 97 -14 11 68 5 -68 10 60 -34 -50 9 12 -122 -32 37 -76 -19 32 3 -74 -29 84 -38
2672c8p3J71Lp2L0J00j36m2J11P8j63J0R4r1n1P5L9j36M2N4j30J42M6j15oJ20
$$ -38 -111 60 63 -9 21 121 -15 -57 54 132 -31 -21 73 -18 -69 6 45 -91 -49 5 -125 17 63 -52 -58 62
2698F2m1j09P4J03j40nJ15k9n9J44m5q4L8Q0r7pJ16q9j12M6J21j63L3J03o9j08
$$ 62 21 -88 -14 89 -51 -56 59 30 -29 115 70 -14 24 104 7 0 116 27 -85 -39 82 -81 -48 55 -14 -122
2724a22J04J3m4P3j2n4M4L3j39M8J37r7l7O7P3j3p2O0N6j06k6N3jj8j12N7O4p3
$$ -122 -18 -5 -49 24 12 -42 2 35 -104 -56 81 -16 -53 14 87 74 2 62 118 12 -14 39 38 20 -92 -35 29 -44
2752d4PN7j1p1P0kl8k8O5p1L1Q5q4k7M8J67j77j6J76qk00L7K70k20r7J77Nj92
$$ -44 -37 20 9 -62 8 6 -32 -60 5 -66 -35 50 -34 -61 -13 154 -23 -39 137 129 -71 -34 236 16 -81 96 101 -91
2780i1J9K00j64n0J52j06k1R7J2j87O4K24k15q1K68m7j62j3K37j16o5k3K01j08
$$ -91 -72 128 -36 -86 66 -40 -61 36 48 -139 -75 149 -66 -147 121 74 -88 -101 136 20 -45 -68 133 25
2804B5p9P9J07m9j52N8P6Pj03K4k3Q9q2k3p9J88k8r3M3P8o7j25J65R7j71j07K49
$$ 25 -54 25 132 83 -69 -11 65 72 -31 -7 -30 59 -23 -46 -125 63 35 -58 -15 63 -4 -129 36 133 -38 -145 104
2831A04k9j71M2J58j39n1J04N4q8J8JJ7N8q5o3J8R6Lj39J19O1j04p3J09M8j41
$$ 104 75 -96 -54 104 -35 -86 18 72 -16 2 3 20 78 -7 -70 -52 44 47 -92 27 88 -16 -89 20 68 -73
2857g3j1J08N1j08j04J97M2j85j4J71Pj14K3J21n1q4K8M5p0M8o9n6J48Nk26J06
$$ -73 -84 24 75 -33 -137 60 102 -83 -97 74 81 -33 -10 111 60 -24 4 49 -21 27 -42 -98 50 55 -171 -65
2883f5J96j24j95K46N2k00l0J63n8j09Q3L8QL7k0l4M9Mq4k8J62j4j85J49Q1k13
$$ -65 131 7 -188 58 110 -90 -120 43 -15 -124 -41 -3 5 42 22 -12 37 41 -43 -71 91 77 -108 41 122 -91
2909i1k4J74L5j49LQ6L4q7m0m4J98o3j87J36J57k00j18J68J41j16p5J34N4j35
$$ -91 -115 59 94 -55 -52 34 68 -19 -59 -103 95 32 -155 -19 138 -62 -180 -12 129 13 -62 72 126 -9
2933iL5r8J73J2j60nJ30P2k49M4K33j87k18K77Q2j11j45J99L1j68j8R5N6p5n0
$$ -9 26 -72 101 113 -47 -52 78 150 -99 -55 178 -9 -227 50 132 21 -124 75 106 -62 -80 15 71 -4 -54
2958e4l3J78l0j21m4K08o8j46J78M5j08l7L9J94j04k11J0J84n8j25Q4J85r8j42
$$ -54 -87 91 61 -60 -104 104 36 -110 68 113 5 -32 7 201 97 -114 -104 80 22 -103 -19 166 68 -74
2982g4j0K34j41p8Q6N0p7%k2lP7q2m9J53R7j78m4J90J0k04R5J24j26j62Q5J13
$$ -74 -84 150 9 -69 17 67 -10 -10 -32 -35 42 -40 -89 64 161 -17 -61 129 139 -65 30 154 28 -134 -49 64
3008F4j33J4K7O7m8m4M9N9L0j23j9OK9k8j8Q0K2m1n4J11K0q1M4K2K8p4l0R8p7
$$ 64 -69 -55 -28 39 -9 -53 -4 55 85 -38 -57 -51 -22 -50 -68 12 34 -7 -61 50 70 -11 33 55 83 9 -21 77 0
3037@n6J2K1J7m9M9k3J0P0l5o5R6j7j90J53M8j17n0J67j1j62J50R0j19L0J58j48
$$ 0 -56 -44 -23 -6 -55 -6 -29 -19 51 16 -49 47 30 -160 -7 41 -76 -126 41 30 -132 18 108 -11 19 177 29
3064B9n1J01r1l7J7Q2j68L3J72r1j39K49pj78O2J73j17j78J69l5j10M4M8p1N7
$$ 29 -22 79 -12 -49 -32 50 -118 -85 87 -4 -143 106 99 -79 -17 156 39 -139 30 -5 -115 -71 -23 -94 -37
3089c7J19j00qJ11J0q1J6N4j15j1R0n1j14J00L2N3j08P2L7n7m7J32mj65M4Q2j20
$$ -37 82 -18 -26 85 95 14 30 84 -31 -42 48 -3 -117 -17 15 68 -40 32 69 12 -35 97 93 -72 -28 54 -66
3116f6o5J43q0o4J38N8j17M6J48r2q5J08j8j72O4J55j79j29K07M9j77J03K11j62
$$ -66 -131 12 -68 -132 6 64 -53 -7 141 49 -36 72 54 -118 -54 101 -78 -207 0 49 -128 -25 186 24
3140B4n2J79j01r4N1m6n9PL3r9L2K08m1m8J53N0k03J2J45j25j46O3J04j72nJ09
$$ 24 -28 151 50 -44 7 -39 -98 -91 -58 -157 -125 83 42 -6 147 197 -6 6 151 26 -120 -57 47 -125 -130 -21
3166b1J4M6l9J9P3L3q6q6J12oj81k9J83k8j55OJ85Or2Q3J22l9j18M6L9m6q2k3
$$ -21 -7 39 0 19 92 125 39 -47 65 59 -122 -151 32 4 -151 -145 40 46 -46 37 159 120 2 48 87 41 -41 -64
3194f4P1n2j5K8M0J18j29L0J18Lk03l9K54j23k64J03J21j08j49K68L6o5Q0J4l
$$ -64 7 -45 -60 -32 8 126 -3 27 145 148 -55 -94 160 37 -227 -124 -3 -111 -260 8 44 -21 59 73 70
3219G0J8Oj80qJ74j06k29K28J56k48n9M02r3k35J97J50j51j13L7p2m0N1m1p3J63
$$ 70 88 94 -86 -94 80 -26 -255 -27 129 -119 -178 224 131 -104 93 243 92 -21 16 -56 -96 -45 -86 -159 4
3244DMj44J22K59j56j50J77R8k76k8J14l1j36MJ02P0n7N3Q2j5K8j02L4O1q9j14
$$ 4 8 -136 -14 245 89 -61 116 214 -62 -90 24 -7 -143 -139 -37 33 -24 29 111 96 124 22 56 117 28 -86
3270h6k9J03r3n1N3J49k7q2R8J54j57m9J04N4j86q7R8Oq9LQ2P8lJj4J01qj19N7
$$ -86 -115 -12 -105 -156 -103 46 19 -63 35 189 32 -17 87 141 -45 -132 -34 -28 -117 -114 -32 46 43 44 30 131 123 4 61
3299F1P3j12j59P0J2q4lJ27M6M0l6lkQ0n2%Nkj72L7R9p0o7J18P4o4L9M5k1j3j5
$$ 61 134 22 -137 -67 -55 -139 -142 -15 31 71 35 32 30 110 58 58 63 61 -111 -74 25 -45 -112 6 80 16 55 100 79 66 51
3330E1q5O6j4r0p7M7P9p4m6K12n6RL9Oj6k2n6M1K1q6m2NR9r2N6K7R9rl5k3N5n5
$$ 51 -34 32 18 -72 -149 -102 -23 -97 -143 69 13 22 61 67 51 29 -27 14 35 -51 -93 -88 11 -81 -25 2 101 92 57 34 89 34
3362C4p3j6L9j8l7P5j04K3R2L8Oop2O3JK2j51L2O3n2k5M7P4m3oL6M3m3l4R4p5
$$ 34 -39 -55 -16 -34 -71 4 -100 -77 15 53 59 53 -19 44 45 67 -84 -52 11 -41 -66 -19 55 12 6 42 85 42 8 102 27
3393B7j7Qo3kL0L4j45R4J02j12j1J13%r2P1P6r2j45Q3N3r6L5N7k5L4M2l7kO4k8
$$ 27 10 18 -45 -47 -17 17 -128 -34 68 -44 -55 58 58 -34 37 113 21 -124 -41 12 -84 -49 8 -17 17 59 22 20 84 56
3423E6j35J38N2j74j6M0P9j10nR6J7r5J12q8L1O0p4QK3k0o6M6KN3p5M7R2p5kK1
$$ 56 -79 59 111 -63 -79 -39 40 -70 -75 21 38 -57 55 -33 -2 58 -16 -8 15 -5 -71 -25 -23 30 -45 2 94 19 17 38
3453C8L4mo7j0Q5r0j7P9k7Pp4O9P6m2l8k7O7k4j31N4J22q3r7N4P2o0k9N6P0m2
$$ 38 72 68 1 -9 76 -14 -31 48 21 28 -46 23 99 57 19 -8 59 35 -96 -42 80 -3 -100 -46 26 -34 -63 -7 63 21
3483B1J1oM3k5j03L4K5M0j05j5J14k1p7NJ33p0r0J37j6j3p0L0J0L8n1n9O8N8j22
$$ 21 32 26 69 44 -59 -25 0 40 -65 -80 34 13 -64 -59 74 4 -86 51 35 22 -48 -18 -8 30 -21 -80 -12 46 -76
3512g6l2J32L1r1K6Q5l3l3K8jpo9K8lL1l2m2K2J34j08j26J90O9j65m2J40pj15
$$ -76 -108 24 55 -36 -10 75 42 9 37 36 29 -40 -12 -15 16 -16 -58 -36 98 -10 -136 54 123 -42 -84 56 49 -66
3540f6RJ11q2J7J0M3J0m3O0k4kj6q9J14m0n3k2Q7j2n4n2Q0N8q7kO8P2j05J1M9
$$ -66 -57 54 -28 -11 -1 42 52 9 69 45 43 27 -62 52 12 -41 -63 24 12 -42 -94 -14 44 -43 -45 23 95 -10 1 50
3570E0l2p3pQL1RL0j9K8N2n7J1J60j29j40J38K6j12KK3M7r5N2Q4q4K4o6O5k2J8
$$ 50 18 -55 -62 -54 -23 -14 16 -3 25 77 20 31 191 62 -78 60 86 -26 -24 -1 46 -49 3 87 3 27 -39 26 4 22
3600B2m9r4J43K7j77P3J54j50j7J12K6o3J9P5n3n1O1k7m5K8k9o9K4O3q5M0J24
$$ 22 -27 -121 22 49 -128 -55 99 -51 -68 44 70 7 26 101 48 -3 58 31 -14 14 -15 -84 -60 3 -82 -42 82
3627H2l1q8Q0O5n9j14O2N3j07j6M1O9r7j2M1P0Pm9O6rj0k2p9Q5j3j06Q4nL6j09
$$ 82 51 -37 43 108 49 -65 -3 50 -57 -73 -32 37 -60 -72 -31 39 46 -3 63 54 44 22 -57 28 15 -91 -7 -12 24 -85
3657h5Q1P3p1q4J16O2j16l2P4qo5J1J8L1l5K1jM8l2l3k2J51l5j07O6K2r1L5k5
$$ -85 -4 69 -2 -86 30 92 -24 -56 18 10 -55 -44 -26 5 -30 -9 -10 38 6 -27 -49 102 67 -40 26 48 -43 -8 -33
3686c3K1K3j6qO8j5n5PM4j2n0OL9m8l0M5L6l7J0J4QL0j9k3N0l1k7oL8Q2j45L0
$$ -33 -12 11 -5 -13 55 40 -15 -8 36 24 -26 -20 19 -29 -59 -14 22 -15 -5 9 17 47 28 5 55 24 -3 -9 29 111 -34 -4
3718dP6q2j1J2Q4j39N0lmK2n3P3j8j7k3k2L5Q6q8K2N6Pq9K8N0o9l8O1J8m2M7J5
$$ -4 72 -10 -21 -9 75 -64 -14 -17 -21 1 -52 21 3 -14 -37 -59 -24 62 -26 -4 52 59 -30 -2 48 -21 -59 2 20 -22 25 40
3750D0K8p4O1pl1K4n6op6J47r9q3J47k3r1J13Nn2L2J7L2m0J7J2m4j6j1JN6r7Q2
$$ 40 68 -6 55 48 17 41 -15 -21 -97 50 -49 -132 15 -8 -99 14 19 -33 -1 16 48 8 25 37 -7 -23 -34 -33 23 -74 8
3781Hn1P1NJ8m7M7M9j48j7O1Pj06P5J0ko6J16K0o6L8l2J5nJ5Pj2Oj4rk0OrqL0
$$ 8 -43 28 33 51 4 51 100 -48 -65 -4 3 -103 -28 -18 -20 -86 30 50 -16 22 -10 5 0 15 22 10 16 2 -7 -27 -21 -30 -38 -8
3815hO1m5o3N1K4o8M7M2q9M8Nk3mM0k9l7N4Jl0j6Q2L0q5PJ0K6rK1m5J1J3Pj1L5
$$ -8 53 8 -55 -4 20 -48 -1 41 -48 0 5 -18 -22 18 -11 -48 6 7 -23 -39 43 73 -12 -5 5 31 22 43 -2 9 22 29 18 53
3849E3m8j5J7K5p6N1o7L4pO4l0mJ1m6kK6M3j1j0l3M4j0J4L0l2M2o3L3j4m0jrJ
$$ 53 5 -10 7 32 -44 7 -60 -26 -33 31 1 -3 8 -38 -40 -14 29 18 8 -25 19 9 23 53 21 63 0 33 19 -21 -22 -31 -30
3882c0K0MK7pqPk3j6K3J5l4l9R7q4P3j2L1q9R3J5k0m1j3JPJ7m8N7JK6j01O8j5
$$ -30 -10 -6 21 14 6 13 -10 -26 -3 12 -22 -61 36 -48 25 13 44 -45 48 63 43 2 -11 -10 -3 14 -34 23 24 50 -51 17 2
3915BK9m5L0o3O9mk6n5R7m4pJ2L0j7n2Q5k1k9N6km3J0M4ko8nm1L9jJ6l6K9j2N3
$$ 2 31 -14 16 -47 22 18 -8 -63 34 -10 -17 -5 25 8 -44 41 20 -9 47 45 2 12 56 54 -14 -19 -60 -21 -22 -6 -42 -13 -25 28
3949B8l8Rj0j1%N5o8J9oL8Qn3lO3r9N9Q8p9JJ1o8R9m1j3k1J8M6k4oK5n1N4j6P
$$ 28 -10 -1 -11 -22 -22 33 -35 -16 -22 16 24 -29 -32 31 -68 -9 79 0 1 12 -56 43 2 -11 -32 -14 32 8 2 27 -24 30 14 21
3983B1o2J9K2K8p9R3p2N6n2pN7J0jk3J6m3K7K8m3j6K2m2M8Nk4PJ0O6m2j4K0m5
$$ 21 -41 -22 0 28 -51 42 -30 26 -26 -33 24 34 33 10 26 -17 10 38 -5 -21 1 -41 7 12 -12 -5 5 71 29 15 35 -10
4015a0J4k7J3jm9Qk6N3rK9m9O5l7L8Nm1N0k3k6L4j5K9k1J5l3K1M4j7k7J5J7n3
$$ -10 4 -23 -10 -11 -60 -52 -78 -25 -34 -5 -54 11 -26 12 17 -24 26 3 -23 11 -4 25 4 19 -14 7 51 34 7 22 39 -14
4047a4K4M8j10L7K7J0n1L1l2Q0p9L2M1p9J5%P3n7Km3J01l4J4k0L2l5%m6K4Q2q2
$$ -14 10 58 -52 -15 12 22 -29 2 -30 50 -29 3 44 -35 -20 -20 53 -4 -2 -45 56 22 36 16 48 13 13 -33 -9 73 -9
4078im5N4nl3pP7j0n6P6l2j9M3k2l8M9m8K0JP2o9m8M7kk1L6k7Mm%L5l4L7j1k8
$$ -9 -54 0 -5 -38 -45 32 22 -34 42 10 -9 34 12 -26 23 -25 -5 -4 68 -1 -49 -2 -4 -25 11 -16 -12 -16 -16 19 -15 22 11 -17
4112a7J2m1R6p6J3J9n1L6qj7Q3l1l1l2L0J5O1q5R7l1p1M2M4p3M0pj7K0j3j4k0
$$ -17 -5 -46 50 -26 -13 6 -45 -9 -17 -34 49 18 -13 -45 -15 0 61 -24 73 42 -29 13 57 -16 24 17 0 20 7 -7 -27
4143b7K9j5J6ll0L0j8O0n1Ol9J8M6k5k1JJ4K4J6l6K9j1Pm3mNK2N7q7M3KJ0qn0
$$ -27 2 -13 3 0 -30 0 -18 42 -9 -3 -42 -24 22 -3 -24 -23 -9 15 31 -5 24 13 20 -23 -27 -22 0 57 -30 13 15 25 17 -33
4177c3L0k7L1O9r9N4K6k8j2j1O5p9J9l4J9K3N3o6j6M0o8j1M6L5m6J5K5PK0l8o1
$$ -33 -3 -30 1 70 -29 25 51 23 11 0 65 -14 5 -29 -10 13 66 0 -16 24 -44 -55 -9 26 -20 -5 20 27 47 9 -52
4208e2N0j5K8n6KN7m0N6L9j00L7k1K4J7J7k2L9o4J9O3r1J0K0k6J7K1l9L4o7K9
$$ -52 -2 -17 11 -45 -43 14 -26 30 69 -31 6 -15 9 26 43 21 60 -4 15 78 -13 -3 17 -9 8 29 -10 24 -43 -14
4238a4j2L0l2K4KpjK8p0O1J1m4j7M3m0J5n7P3nM7l4M1j4j7K9q4MK7jN6L0o5k9
$$ -14 -26 4 -28 -4 -2 -9 -10 18 -52 9 20 -24 -41 2 -38 -23 -80 -7 -12 35 1 42 28 11 40 -44 -40 -13 -14 42 72 7 -22
4271b2PJ1P1j00N1k3n8K7mN4L3l3M0j01l0J11p0J2J7N3j8o6kM9J3l2j0N0l4MR
$$ -22 -15 -4 67 -33 18 -5 -63 -36 -40 14 47 14 54 -47 -77 34 -36 -24 -7 46 28 -38 -40 9 22 -10 -20 30 -4 0 9
4302Ik3%NK7l3L7n0l4N9jj5N5l6k3K6J2n9K3O4Pm3k1rJ6n8K6N1l2M9l6Lm7J05
$$ 9 -14 -14 -9 18 -15 22 -28 -62 -3 -4 -19 36 0 -23 3 15 -44 -21 43 50 7 -14 -23 -7 -65 -39 12 -20 29 -7 -4 -51 54
4335E4m1o5Q5k4PK0m7%Qk8j7K5mL4o5L9M1ooqj2j4L1m4K0K7qJ7k4pj8ML0k3J3
$$ 54 13 -52 33 9 16 36 -11 -11 -3 -31 -48 -23 -27 7 -58 -19 22 16 10 2 -10 -24 7 -37 -17 10 2 19 -5 -12 -30 -26 4 -19 -6
4370fj8k8K8J2rrK7j6O1Ro2J5J6M1l0l9J8OJ5n8N6j1oN8k4m2L9q3J3lO7q3j6Q8
$$ -6 -24 -52 -24 -12 -21 -30 -3 -19 42 51 -11 4 20 61 31 -8 10 16 31 -27 29 18 12 70 46 4 43 -40 -27 -30 37 -46 -62 26
4404B6l0L0k4l0Rj9O7p1%O0mk5m3M1L2j8J5m0jJ2M0lLNl4N5n1qo2J24j6o5J9J
$$ 26 -4 26 2 -28 -19 -38 29 -42 -42 18 14 -11 -54 -13 19 1 16 -24 -25 -13 27 24 27 32 -2 53 2 -6 -68 56 40 -25 -6 -5
4438ek9M1koNj9J2Mj0j3J3PrJ4l5N8j7oJ3%l4L1o5O4n0R3n7MK6l3L8m7K9k3mN6
$$ -5 -34 7 5 -1 4 -15 -3 1 -9 -22 -9 -2 -11 3 -32 26 9 3 16 16 -18 13 -52 12 -38 55 -2 2 28 -5 33 -14 15 -8 -12 44
4474D4n8J3L3n1K4Jk2J4l0K7l5N0m9N8J5k5K7j5pj4K4p3M3j3K8L1q5L1rL2NOk7
$$ 44 -14 -1 32 -19 5 6 -16 -2 -32 -5 -40 10 -39 19 34 9 36 21 14 0 24 -49 -6 -19 9 40 -45 -14 -23 9 14 20 -7
4507gn8P7l7L9p2P3J7j01P7l8O1L8p9NJ5Jj2K7m0M0o2M5oOJ9n2L4o3Q3k1l3K6
$$ -7 -65 12 -25 14 -58 15 32 -69 8 -30 31 69 -10 -5 10 11 -1 26 -14 26 -36 9 3 9 28 -24 10 -53 30 9 -24 2
4539Bn6K2J2JJ2NL5m9k8J4O5l5J2L4q7N2J3k1K1m8n9Q3J5j0LK3M4l9j0m8oK5l8
$$ 2 -54 -32 -20 -19 -7 -2 33 -16 -44 -30 35 0 12 46 -41 11 24 3 24 -24 -83 0 15 5 8 31 75 36 26 -22 -28 -3 -41
4572d1%O7l4j7N3jJ2pro8K0Pk5N4Qk3mJ9M8r5M2JRqJ7j5m3L9j5M6Mj06N3Pm5L0
$$ -41 -41 26 -8 -25 28 27 39 32 23 -45 -25 -18 -43 11 19 -4 -8 11 59 -36 6 7 16 8 25 10 -33 6 -9 37 41 -65 -12 -5 -50 -20
4608b0N3m3rN5J3n4j3M9k3k8PRM1k4n2j1J00r4K4O2o1N1o6M5p2J00j4j9m3L9n4
$$ -20 33 -10 -19 36 49 -5 -18 31 8 -20 -13 -4 37 13 -39 -50 50 -44 -20 42 -19 32 -34 11 -61 39 25 6 -37 2 -52
4639e2Q2m8L6jk8L3l7JON3J9r2PKkJ6pm0N1P7n7r0P1k7J5k9kOk2R0K2o1o0O5l4
$$ -52 30 -18 18 17 -11 22 -15 -14 -8 45 64 -28 -21 -19 -21 -5 -12 -52 -1 76 19 -71 0 -27 -12 -41 -43 -37 -59 31 53 -8 -68 -3 -37
4674c7qL4pM7MJ0o4K5lKk5MqO4q1P6nk7L0j0l2mnk3NO7j1j11N8KM6q0P1Km0k2
$$ -37 -45 -11 -18 29 33 43 -21 4 1 3 -22 -18 -26 38 -43 33 28 1 31 21 -11 -15 -20 -43 -38 29 18 -93 -35 -33 13 -67 4 6 -34 -56
4710e6Q1kn4N5l5l0L3K5l2J4Po1O0k2K4JNk6K0K6o3L3n9J10k9k7M1qQl2K2j9k9
$$ -56 25 23 -31 24 -11 -41 -8 17 -15 -1 6 -55 5 -17 7 8 13 -13 7 33 -30 3 -56 54 25 -2 39 31 39 7 29 10 -19
4743a9Rl5P3Oq0lN1KK2l5J7k6O5m8k1MK6m7L1k0N4L4K1m8p7O9l8NoN7m9qL4l0
$$ -19 -10 -45 28 34 -46 -49 2 4 26 -9 8 -18 47 -1 -22 -18 8 -39 -8 -28 26 60 81 33 -44 25 -13 -8 -14 43 -6 -14 20 -10
4777a0RqJ6L8j1m7J7k9K7o1N6K9n6j7J7N2q0M8KjL0n4K1k9QqL9l5R5l4n0N4m1
$$ -10 -1 -9 7 45 34 -13 4 -25 2 -59 -3 26 -30 -47 -30 22 -58 -10 -8 -9 21 -33 -12 -41 -33 -41 -2 -37 58 24 -26 28 -13
4810a3nRJ3K7n7L1k5JK2%K0N0m5jl3p1N7L7l0j0J3P3o0J3l4RN4L0n7n2L2j7l7
$$ -13 -18 -9 4 31 -26 5 -20 -19 3 3 23 73 28 27 -6 -77 -20 17 -13 -23 -10 63 3 16 -18 -9 45 75 18 -34 -2 -19 -56
4843e6J8QrK5Ml8%R5l4J9n1M3n2P2m2mo5J39r1l9J07j0J7l8k4L3j5lm%m2L1J2
$$ -56 -38 -30 -39 -14 -10 -48 -48 47 13 32 -19 24 -28 44 2 -2 -67 72 -19 -58 49 39 56 18 -6 27 12 9 5 5 -37 -6 6
4876FK7j7j6PK0Nl6k4QKj6O6p8RJ1M2K9p0lmjKL5J6J3l3rM3j5p7P2Lp2R7o1J8
$$ 6 33 16 0 7 27 32 -4 -28 -20 -18 -34 32 -46 -37 -26 16 45 -25 -28 -32 -33 -31 4 20 33 0 -9 34 19 -58 14 17 -55 42 -19 -1
4912aNqOK5p9N9j8j2jk8K4K1JlJ9K6l0l4L1oN5o0Qj1K4J1K0l7Qql9M2K1Jn0l7
$$ -1 4 -4 2 27 -52 7 -11 -23 -24 -52 -28 -7 -6 -9 10 36 6 -28 3 -3 52 -8 0 -11 13 24 44 7 15 7 -32 10 31 32 -18 -55
4948e5M0K1l9j8L7m6O1J3Jj1l6M5k3k1mJ00m4K0n6Ol3N4j1jm2L7M2j6mj5J3K0
$$ -55 -15 6 -33 -51 -14 -60 1 14 15 4 -32 13 -10 -31 -35 65 21 41 -15 -9 -42 12 1 0 -42 -5 37 21 17 2 15 35
4980C5j8l9J5L5k1l6L1Rmm3M4L5p0J11p2Lk3m8P5o9Q8l8m8M7O3o4qj9L9k3N5m0
$$ 35 17 -22 -7 28 7 -29 2 11 7 -36 8 43 -27 84 12 15 -8 -56 19 -50 38 0 -48 -1 62 -2 -10 -29 10 -13 42 2
5012BJ2Po0K0O0p4k1N7PK8m2K1L9J0p1J1krJ6j2k1j4M2NP3p8l2L3l0J9k7O6o7
$$ 2 14 21 -39 -19 41 -33 -54 3 10 38 -4 17 56 66 -5 6 4 -5 11 -1 -22 -36 6 11 84 6 -26 7 -23 -4 -31 35 -32
5045c2m1J08p1M9lJ1k2J3k7J7J0m0lP0j9l5Mj2J8qK1K5j4mJ8L6o1J4l0QK3o4J4
$$ -32 -73 35 -36 13 10 21 -1 12 -15 2 12 -28 -31 39 20 -15 -11 -23 -5 -13 8 33 19 15 33 69 8 22 -8 0 23 -41 -27
5078b7lJ1pOKk5N0qj7jK3k3K2qk5QM2lMK6k0l6Ok9J3L6n3M4L8l8j9K8k9J2k3P5
$$ -27 -30 -19 -26 -20 -18 -43 7 -1 -18 -19 4 -19 3 -5 -30 -22 20 17 21 47 27 -9 -3 -32 -19 17 -36 8 46 8 -11 17 -12 0 -23 52
5114E2m5pJ2K0Kn9K1K2k8K1jm2PK2J5n4J28l4k3j3Nk9l0M9m5P5pq2M8L3oo2P9
$$ 52 7 0 12 32 34 -25 -4 18 -10 11 10 -32 -25 -3 12 -42 86 52 29 16 21 -8 -38 11 -34 41 34 -48 0 33 27 -35 44
5147D4m5JNJ4m3K6o3L7K1NJK1k0J9j0n3P9l2K8Rm1q8R8l6L8J5n6N0j22M3J9QK7
$$ 44 -1 0 5 19 -24 2 -61 -24 -3 2 3 24 4 23 13 -40 39 7 35 44 3 -85 13 -23 15 30 -26 24 -98 -55 -36 -28 -1
5180aM5J4m2n4L7j7J9%K5m3NnK2N3m2rn8J00l5k4Q2o2L7l4l6k6M7M4Qq2M7m1m2
$$ -1 44 58 16 -38 -1 -18 1 1 26 -17 -12 -17 5 58 16 7 -51 49 14 -10 72 10 47 13 -23 -49 -2 42 50 -32 15 -26 -68
5213f8P3J8k3k5R2q4j3%L8j3pm3Q2m2QOlO3p7MP0jr1Q3m6L9n4L2nM3q5On9N6N4
$$ -68 5 23 0 -25 67 -17 -30 -30 8 -5 -12 -55 27 -15 -7 -1 -4 59 -18 -14 56 55 -36 47 1 40 -14 18 13 56 -29 -23 -82 -26 28
5248B8k0j6NK1m1J3J1n6O4mo4M0k3L5L1lk8K4np9M2M6lo1O3k9J4k7L4J3k8J4l
$$ 28 8 -8 -3 18 -23 -10 1 -55 9 5 -59 -19 -42 -7 24 21 -7 17 12 -67 -25 21 18 -43 20 -9 5 -22 12 25 -3 11 8
5281HLLk2K1M0K1r7J7J6j1L4j9k0PJ5j2j4k1O2l1J1j8KJ3L3o2J7J1Mk3RO2o5M3
$$ 8 11 14 -8 13 53 74 -23 -6 10 -1 33 14 -6 1 16 4 -10 -31 31 0 11 -7 -5 8 41 -21 -4 7 11 -12 -3 59 -6 37
5315C7o7M5k2O2l9K6k2jL6m7J0J6jk2l9R4p3k0K4O6o7OL3lk4L8p2KO6o3Pk9Q9
$$ 37 -30 15 -7 55 16 42 20 19 55 8 18 34 33 11 -28 66 -7 -27 -3 63 -4 2 35 32 8 46 -26 -24 42 -21 -14 -43 46
5348D6k8rn3O0j3l3L3J6m7M8K3k3m0k8Q6m2K6k3Rlnj6M2rj3Qj0lj2k7K4l8O6m5
$$ 46 18 9 -44 16 3 -30 3 19 -28 20 43 20 -20 -48 38 -4 22 -1 8 5 0 -16 26 17 4 12 2 -1 -13 -40 -16 -54 12 -33
5382c3L2Q7q7rK9po1J0L8nK2J3n0l9Q0K8p7Lk1N2l8M6n9L8prK5k7K5lQ5m6j9j9
$$ -33 -1 86 -1 -10 19 12 -49 -39 -1 -6 16 29 -21 -60 20 48 -29 -26 -47 5 -33 13 -46 -8 -15 -24 1 -26 -1 -4 81 35 16 -3
5416cmk3K0j8K1J5l7M1lL9l3k9oK0J9K0k4k4N3p2M2mO4q6k8L6J7np5P2Pl7M7%
$$ -3 -7 -30 -10 -28 -7 8 -29 12 9 48 15 -14 -20 0 19 39 15 -9 44 -28 14 10 74 -12 -40 -4 13 8 -67 5 12 -25 22 22
5450B2j2J7pn5M6Oj8Rl5J0J7J4kL9p3n0PN3rK2J4m3L5N4r0J0nN9r2M4N9o5j0j8
$$ 22 10 27 20 -35 11 17 -1 8 -27 -17 0 14 12 51 -22 -72 -65 -12 -21 1 15 -28 7 61 -29 -19 -24 35 -57 -13 46 -19 -29 -47
5484d7Q2l8rk8O5k4M1m6J1J8k3k0K5Rk0M0rJ0J9r1R0o1K2k6j4jrj0N8l5RM7m4
$$ -47 35 -3 -12 -40 25 1 42 -4 7 25 2 -18 7 16 -4 36 27 37 56 -35 55 -6 16 -10 -24 -25 -34 -44 14 -21 -12 35 -9
5517iPo4J10r4P7m1K4j3K5j0k4nJ4J7p5M8%O4j4m0m1J4NL1lj6RN5Lj1o8qnO3n3
$$ -9 -2 -66 44 -50 27 -14 10 -3 22 12 -12 -17 -3 14 -61 -13 -13 51 37 -3 -44 -30 -25 6 3 -13 -4 51 54 43 -25 -33 -38 25 -28
5552b8K1MJnl7L6Nj9NP3n9nN8m0l6%K1L9m5j2j0K5M0J5m6p2N3l1O4l3J2j6M5K4
$$ -28 -7 -3 -2 -7 -44 -8 -3 -22 -17 56 -3 -8 50 10 -26 -26 -5 34 -11 -23 -33 -8 32 47 1 -71 -18 -49 15 -18 -6 -22 23 47
5586D7n2J2j0J7j3j2j3k9KL2j5K7qJ4l8M2LJ0k6l5R9p8J6k4N1p6R0n7K6L1p9Q3
$$ 47 -5 7 -3 14 1 -11 -24 -53 -51 -19 -34 -7 -15 -1 -39 3 6 16 -10 -45 54 -24 -8 -32 19 -57 33 -24 2 33 -46 37
5618C7k8Mj8k4L1JK0K1m6m5L3lJ4j6l5O9j7m3O4m4K8Pl0k7N2p8R1k0m0L6Oj5p
$$ 37 9 13 -5 -29 2 3 23 44 -2 -47 -14 -17 -3 -19 -54 15 -2 -45 19 -25 3 10 -20 -47 5 -73 18 -2 -42 -6 0 -15 -22
5651b2nK1J0l6j4M5jjl2N8l1M%J8p5N3M5o0K9k1M7n1N1m8j2L9%PKm1J2m0J01q
$$ -22 -27 -6 4 -32 -46 -1 -2 -3 -35 23 -8 -4 -4 14 -61 -8 37 -23 6 -15 32 -19 32 -16 -28 11 11 18 20 -21 -9 -49 52 44
5685D4k%ql5qN5n5%j9pJ3J8J4o8J2P4k2j0K5K0Jp1J0J0N3j5k4k0K2L5o4M5j2K7
$$ 44 42 42 34 -1 -9 46 -9 -9 -28 -35 -22 -4 10 -58 -46 28 6 -4 21 41 42 -29 -19 -9 44 29 5 -15 7 42 -22 23 11 38
5719C8m3L1k2oJ6J1o1L9l1o2J53km4ml8L9j4K7j7l3J3mK6J6lk8OJ6K5o4K3L9L0
$$ 38 -5 26 4 -2 14 25 -36 3 -28 -90 63 61 17 13 -25 14 0 27 10 -23 -10 -14 12 28 25 -3 3 19 44 -20 3 42 72
5752G2o4J8%plO0p3l1KJO4l6n0M6l9M5l1k6Q7n4N2l0j5kM6l5Kj4K8l4MK5O4o0
$$ 72 8 26 26 19 16 76 3 -28 -26 -25 39 3 -47 -1 -40 5 -26 -52 35 -19 33 3 -12 -14 32 -3 -1 -15 13 -21 -17 8 72 12
5786A2n7K6L1m8P1r9O3J1n3P1K0n7j2m3P4j1j6K4K1m0j4L2m1O1J4q3M4J6k4J1
$$ 12 -45 -19 12 -36 35 -64 -1 10 -43 28 48 -9 -21 -64 10 -1 -17 7 28 -12 -26 6 -35 26 40 -43 1 17 -7 4
5816DL6k2l5L8k1jm0N0j7M7r0M7J3J3m9MR9n8j2J9K2j40Q6J1k8N8k2m7K1PL5l9
$$ 4 40 18 -17 21 0 -1 -41 9 -8 39 -51 -4 9 22 -27 -23 76 18 6 25 47 -93 -7 4 -24 34 12 -35 -14 -7 28 -11
5848a1P1m2l0Opk4mL8lL5o1k5j5M0J3j9M1K0l1l5M8Mn0L7PmK2j6n4L0K5j8J1n
$$ -11 60 18 -12 -6 -13 -37 -41 -3 -6 29 -32 -57 -72 -32 -19 -38 3 23 -8 -43 5 9 -41 -4 3 -1 21 5 -49 -19 6 -12 -1 -6
5882fk6L9Jk8M2N4j49Q5n0L1J6o6Q7rk5L6o8LQJ0n0M1L7k1N3k3M%k2K8l7K7rk4
$$ -6 -32 7 8 -20 22 76 -73 12 -38 -7 9 -57 30 21 -4 32 -36 -33 -25 -15 -65 -24 13 -8 45 22 26 26 4 32 -5 22 13 -11
5916a1k9M4N7m7k1j0N7Mk4k6pL9J2n5qL4j0K9n6M4m0j3K0Pj4k0RK3m5M4J9Kj3
$$ -11 -40 4 61 14 -7 -17 40 44 20 -6 -13 26 38 -17 -25 9 -1 28 -28 16 -24 -37 -17 -10 -24 -44 -35 -12 -57 -13 6 8 -5
5949en8N8J5K2l3mo9M8M8j5j6l1M7k8K1pl4L1N3m5K7j4k3JK0l5j2O1k2LLNq0M8
$$ -5 -63 -5 10 32 -1 -5 -74 -26 22 7 -9 -40 7 -21 0 -7 -41 -10 43 -2 25 11 -12 -11 9 -26 -38 23 1 4 7 12 -68 -20
5983b0lNj2M8m6J7K3Kn3j0O0m4M5Ml6Nj1LK6M1q5L4K6m5P1k0qJ3m6l7N0J5k2j7
$$ -20 -23 -18 -30 18 -28 -11 12 14 -39 -49 11 -33 12 16 -20 -15 -26 -23 3 44 -41 -7 19 -26 45 25 17 30 -16 -53 -3 12 -10 -27
6017b7j0l3J8O1KL4o8j4L5J0rl7ML7l1O4p4J7RM6j9k4k6L8j1K5k4kQ1p9K4M5n9
$$ -27 -37 -70 -52 9 11 45 -23 -37 -2 8 -1 -38 -34 3 -28 36 -38 -21 -12 34 15 -9 -35 3 -8 17 -7 -9 72 -7 17 62 3
6050CM5o5LrJ0M3n3J4m9J6K1K6l9Q3o5K9n2N9o0pM2j7K6r%n0M4pKj0J0k5O0k7
$$ 3 48 -17 -14 -23 -13 30 -23 -9 -58 -42 -21 5 -34 49 -16 13 -39 20 -40 -47 -5 -22 4 -5 -5 -55 -11 -18 -16 -26 -16 -41 19 -8
6084hl2KL6l0k1K3M0n4L9J2n6M7L0j9J1j4l9k6O6l6M7orM9l8L0p2J8K1n7L2l2
$$ -8 -40 -38 -2 -32 -53 -30 10 -44 -5 7 -49 -2 28 9 20 6 -33 -59 7 -29 18 12 3 52 14 44 -28 -10 11 -46 -14 -46
6116d6N6J9l1J7pj1k6N0J4l1L0n2pM5L1r0J4JM8n8P4Pk4j1k8PK3nl6J1j4M2K1
$$ -46 10 29 -2 15 8 -3 -29 21 35 4 34 -18 -25 20 51 -39 -25 -24 24 -34 40 47 23 12 -16 -9 14 9 -27 -16 -30 12 33
6149C3o5J6K7M6r4j3L1J4L2j3m3N2o9j3R9o9O5n0QlK2k0Kj3L8p5R3o0L8j7K1k
$$ 33 -32 -16 11 57 -37 -50 -19 -5 27 14 -29 23 -46 -59 40 -29 36 -14 -6 -9 13 -7 -5 -18 20 -55 38 -22 16 -1 20 18
6181A8n4N9k0n6M2j5Q3p4K4k3L3l0M5l3on1N9M4j16R7m2K4J1j0K7o9O1l5m0K8
$$ 18 -36 23 3 -53 -11 -26 57 -17 7 -16 17 -13 32 -1 -7 -58 1 45 -71 26 -16 8 19 9 36 -33 28 -7 -47 -19
6211a9JN5m3j1J0K6kq%J4l2L8m4K8j0p5L9P7n1J7k2N0p9L3j4M3m9R6n7nlj1K0
$$ -19 -18 37 -6 -17 -7 19 17 9 9 23 -9 29 -15 13 3 -72 -33 44 -7 10 -12 38 -41 -8 -22 21 -28 68 11 6 3 -8 12
6244A2n6J5N8J6l8j9j3%J4oL6m0M6j7j1Pl9MK4M1m4L1Pm2j0jL4l0K5k8J8M5m7
$$ 12 -44 -29 29 45 7 -12 -25 -25 -11 -17 19 -21 25 8 -3 4 -35 -31 -7 34 -10 21 28 -14 -24 -25 9 -21 4 -24 -6 39 -8
6277hNM1q1LP9o1P8q9k4PoOR2n2N2m0l4M4l6K4l8M5m5K3jK8k%j7lm9O6l8N9Mj1
$$ -8 -3 38 -43 -40 39 -22 56 -33 -57 -50 -56 -50 42 -10 42 2 -32 12 -24 0 -38 7 -38 -15 -16 12 10 10 -7 -10 -59 7 -31 28 32 21
6313B1Rj07P4n5P2k9K9Kl6K0k0RNl6N1l6N3m2j3N7o2N7m6K7J8k4O1l6pm1K1J1
$$ 21 30 -77 -3 -58 14 -15 14 16 -20 0 -20 -11 -6 -42 9 -27 26 -16 -29 28 -34 23 -23 4 22 -2 59 23 16 -25 -4 7
6345GJ9Jjj2K5m8J8Lk0mqK0Mk6j5M1j9j7M1Pj9J3n9L1N9n3qm6N9lM2Nk4Mp2M2
$$ 7 26 27 26 14 39 -9 9 12 -8 -12 -20 0 4 -22 -37 4 -15 -32 9 16 -3 10 -49 -18 41 -12 -20 -66 -7 -10 32 37 13 17 -55 -13
6381a3K2j0L3ol6j4L3j9k9O2k1nN7n7j0L6%j0j1k5M7K2n2j7M4p2Mj5K6M9Rj4j6
$$ -13 9 -1 32 26 -10 -24 9 -10 -39 23 2 -3 54 -3 -13 23 23 13 2 -23 24 46 -6 -23 21 -51 -47 -62 -36 13 22 8 -8
6414hj3P0p0l6L3P4o4L9k6m4M4M3j7kj3j4k5J8K0k6P7n2k6J8k6N8o0M3k4l2N0
$$ -8 -21 49 -21 -57 -24 50 -14 25 -1 -45 -1 42 25 23 10 -4 -29 -11 9 -17 60 8 -18 0 -26 32 -28 15 -9 -41 9
6445In7OnK4j6Q0n8j4NJ2j7L9m6K0M7n6Ql9O3mp6O8qL2JK2j2j6O2l7l9k3J5oP1
$$ 9 -48 -42 -47 -23 -39 41 -17 -31 -26 -14 -31 8 -38 -18 29 -27 -19 -58 5 1 -75 -7 -15 17 18 40 28 12 74 37 -2 -25 -10 -16 55
6480E5p6NO6k2j2l6Q1l9l1j3MM3o4K3L6j3%L0m5kM5q1O3l6k4j9K1K8K0j8j1K5
$$ 55 -21 -16 50 28 16 -20 61 22 -9 -22 -18 25 -39 -16 20 7 7 37 -8 -10 35 -46 17 -19 -43 -62 -41 -13 7 -11 -22 3
6512CK2N4j03M7mkqPK3l6J2l1K5pK6n4J4O9q2K7L0q4J3J1K4L0mlk1K5m6j6J3J3
$$ 3 25 79 -24 23 19 17 9 16 39 3 15 -16 9 2 28 -26 -12 57 -25 2 32 -52 -39 -28 -4 26 22 19 -2 23 -23 -39 -26 -13
6546a3K0m2L2N2o7L0l8J1J6j1j6O6k4n3L9N9n8j2rM1O0r8L5K5p0K8J1J4m3K4%
$$ -13 7 -35 -3 49 -18 12 -26 -15 1 -10 -26 40 16 -37 2 61 3 -9 -18 23 83 -15 20 45 -25 3 14 28 -15 9 9
6577Im5R6r5JK7N0J2m1l4L0ON0n9kk7M8n2N3M0o9K8n0N1k6k7k0Q5q1N2J5K1m1
$$ 9 -36 60 -35 -34 -7 43 55 14 -20 10 16 66 7 5 -22 26 -26 27 67 -2 26 -24 27 1 -26 -46 39 -42 10 25 46 5
6609ELm8J2Pk5N9l1O1n3Pj6j2K3k6nO5o7O1o4M0k0N2m6QJ0J6j4l8O8n8R0n8j8
$$ 5 8 -40 -28 -21 -46 13 -18 43 -10 -3 -19 -31 -8 -34 -39 26 -41 20 -44 -4 -24 28 -18 -10 0 16 2 -36 32 -26 64 6 -12
6642a2j7O1Kp9M3J4L9l1k6O9n9k5OqL1J9m2j0L6K0n8M3QJ1k9j3mk3J8L9l6mL3
$$ -12 -29 32 34 -45 -2 12 51 20 -6 63 4 -21 -15 -23 8 27 -15 -25 11 31 -27 16 24 35 6 -7 -11 -34 -16 23 -13 -17 16
6675A6j8j8J0J0oL0k9N4n4k6KK1N0k8J0j8j0L1Mk6Lm6J0L6j4n7N5j9kj1J6M8j4
$$ 16 -2 -20 -10 0 -6 24 -5 49 -5 -31 -29 -8 42 14 24 6 -4 27 31 5 8 -38 -28 8 -6 -63 -8 -27 -29 -40 -24 24 10
6708A0q1rL9l0L4N9m7K2K3j5K0J4p0jLJ8K7PRk1k5Rj5O2q1M5K4m5L5m2L5O5n1
$$ 10 -71 -80 -41 -71 -37 22 -25 -3 20 5 25 39 -31 -32 -29 -11 16 23 32 11 -14 -5 -20 42 -39 6 30 -15 20 -22 13 78 27
6741B7l2J2k5j4k1K4M4n3R1q1k2R2m5k1plM4ml6J2L6n0J4N5q4K6O5l8k6pM3L1
$$ 27 -5 7 -18 -32 -53 -29 15 -38 53 -28 -50 42 -3 -24 -31 -34 10 6 -30 -18 18 -32 -18 37 -47 -21 44 6 -20 -27 16 47
6773D7p4j8M9L1Jj1j2l1j5M3Pj2Rk9oKOJ5l0P4o0qM3p5N6m5O8j4l5M1NMql1J8
$$ 47 -27 -45 4 35 36 25 13 -18 -33 10 17 5 14 -15 -21 -19 -13 2 -28 46 -14 -22 21 -54 2 -43 25 11 -24 17 22 26 18 -13 5
6808Ekm7P6p0N2%Qk0K6k2l8%L7k1QrQK0j6K6n3L3%L1l5k2j7L4j3%L3J7j6k0K4
$$ 5 3 -44 32 -38 14 14 22 2 28 6 -32 -32 5 -16 -8 -17 -9 11 -5 21 -32 1 1 32 -3 -25 -42 -8 -21 -21 12 29 13 -7 17
6843A7rj9K3m0K1RqnOK6m3L3j5JJ0Pj8K6l2N5m5J3ln3Q0o7L1J1k4J0L5l1Ql2J4
$$ 17 8 -11 12 -28 -7 2 -6 -11 -5 21 -22 11 -4 -3 7 14 -4 22 -10 45 0 13 10 -43 37 -30 1 12 -12 -2 33 2 10 -22 -8
6878hRn7R4q0O7m5J5J6K9p7OO3m5J5J2qMj9oK6K3l6Jpj9M1K0qRl7J9j8L6p6m0
$$ -8 1 -56 38 -42 25 -20 -5 11 40 -37 -31 32 -13 2 14 6 10 -9 -15 11 34 -2 -1 -8 -27 14 34 26 35 -2 17 -1 35 -41 -81
6913h1L4P0p7J4O4k8p5K2N1l2MM6n4M9l7O1k4nj0k1N0m0jk2O3j7J9j1n6M7l1P2
$$ -81 -47 23 -54 -40 24 -4 -79 -57 -6 -38 -34 12 -42 7 -30 31 7 2 -8 -29 21 -19 -20 -42 21 4 23 12 -44 3 -28 44
6945D4j7K3l3q0N3J8j0q1P6kJ2n8P7o1JM1M3q0RL4j5m1O1k8lP5p2k2M5m8P1n6
$$ 44 27 50 17 -63 -10 8 -2 -83 -7 -9 3 -55 22 -39 -38 3 46 -34 -25 9 -6 -47 14 -14 -17 58 -14 -36 9 -39 32 -24
6977b4L3Pj2J7j3k1nlKJ6K4l7k4J1M5oQqk9j1O4n3M2k7l7K1j1JLO1l3mPN2m2R
$$ -24 9 16 4 21 8 -13 -18 -21 -19 -3 21 -16 -40 -29 16 10 18 10 -19 -30 34 -19 23 -4 -41 -20 -31 -30 -27 34 1 -3 4 56 14 23
7013B3J1Rpo0KRnJ9J6QQn7Q2p2L8j2l0j0mO0j8j2m3K1m2J01l8m5QkL5M5n9KL9
$$ 23 34 43 36 -24 -22 -13 -18 1 17 25 33 -24 58 -14 24 12 -18 -28 -32 28 10 -2 -45 -24 -66 35 -3 -48 -40 -42 -7 38 -21 -19 20
7048B0m5O0n7%LJ8qRK2k1N6o3P0m6k2j0K1N3m1j9K2j5K5J3r3J6P1o5N5k7rnK4
$$ 20 -25 35 -22 -22 -19 -1 -9 0 22 1 57 -6 64 18 -4 -14 7 60 19 0 22 7 32 45 -48 -32 39 -26 29 2 -7 -12 12
7081A2Jk0MJ0J0l8N4nj5jl5qK5K2k0j1O0n4J5%N1j3j7k0Ml5K9K0j0oJ2j7jJN6
$$ 12 13 -7 -3 7 17 -21 33 28 13 12 -23 -31 -6 16 -4 -15 45 -9 6 6 57 44 27 7 11 -24 5 25 15 9 21 4 3 4 60
7116F0o8M8j13K9N7k0j1ONO3k3l8oK7kn2KN7o6j2M6QkL5n5J8J3L0n7j1OQ1k3j6
$$ 60 -8 40 -73 -44 13 -7 -18 -12 -7 56 33 -5 -11 16 14 -38 -36 21 -45 -57 -11 -3 -5 30 -25 -7 6 36 -21 -32 -26 55 32 16
7150A6km0O1o1O8m2j5K4kj3qk8PK0qJ9L2p3J5M3m6J4j3P0q1N3k2k4P2o2L7k7J8
$$ 16 14 -26 35 -26 42 0 -15 9 7 -6 -14 -42 -35 -15 -23 -4 28 -45 -30 13 -33 -19 -32 38 -43 10 -12 -36 36 -26 11 -16 2
7183BM8k4l6J8Rk6m2N6o2O3n8R7J1jm7L0Mo6JJ4JjK3J2Qn1J9k4K5l3RP6o5K1K4
$$ 2 50 26 -10 8 17 -9 -51 5 -57 6 -52 45 56 55 8 38 42 -24 -23 -9 -8 -9 14 26 34 -17 2 -22 3 -30 -21 55 -10 11 35
7218C5k2l1jL1l8L9n1K5qJk3O7J6k0k6kL4l9k1J2Kk5Q7L3p7M5k3J2l1K3n9J9J6
$$ 35 13 -18 -19 12 -26 13 -38 -13 -21 -20 -43 24 40 20 -6 -8 26 -13 -34 -22 -20 -45 42 75 -2 43 20 32 1 24 -35 -16 0
7251@K1R%p2O6k5J3K0mm9Jk0LJ1j2Q2k3%j3J1r0N7k2P0k8K3n3P3nOJ2k0n3K1Q
$$ 0 21 30 30 -42 24 -1 12 32 28 -21 -20 -40 -37 -26 -38 44 21 21 8 19 -71 -14 -36 34 6 29 -24 49 44 50 62 42 -11 10 18
7286A8k4kk7K3l4mK3L3l6K4j2J7j1J4K4j4n2L0J6Ok3k6J02p2J2J0k9RqL6j4m2
$$ 18 -6 -8 -35 -12 -46 -50 -27 6 -30 -6 -18 -1 -12 2 26 12 -40 -10 6 12 -11 -37 65 -7 5 15 -14 -5 -13 23 9 -33
7318c3M3J7L1r1N6j9J7l2L7j9rK8n1j3J1M2k4N8n2J3L1o1Qj3Qm8O3k3L7oK3k0
$$ -33 10 27 58 -33 23 4 21 -11 26 7 -2 26 -25 -38 -27 15 -9 49 -3 10 41 -20 -12 -25 -17 -65 -2 -25 12 6 29 9
7350Im0M2j1j5j8K3Ppl5KM3K6M3j09Q4n1ML8o7J9kj8K6k5J0%N6q7N7K5o7Q1l9
$$ 9 -31 11 0 -15 -33 -10 -3 -10 -45 -43 0 26 69 -40 44 -7 -3 35 -32 -13 -15 -33 -7 -32 -22 -22 34 -53 4 29 -38 43 4
7383Dq0N1k5rM8k6K9O0m7k4K1%qj2l6O2Nn1P1k8m2J2RLLQ8n8Qk1rj2k4Q6k0m1
$$ 4 -76 -25 -50 -59 -11 -37 -8 52 5 -19 2 2 -6 -18 -54 8 13 -38 33 5 -37 -25 -16 -13 -10 78 20 28 7 -2 -14 -38 48 28 -13
7418a3oK4mL4l5M3j0j4J2n8K7J5J0m7qoJ5OK6Lk5L2nlj6m4O5K7q7Q2l6ok8J2N3
$$ -13 -19 5 1 35 0 43 33 19 31 -27 0 15 25 -22 -30 -36 -21 -15 11 14 -11 21 16 13 -3 -47 18 45 -42 40 4 -2 -30 -18 35
7453C5K1n4J4l9OM1MJ1k1l3mK4K0l9M2r1O6n1P2n7O5l5m7P4k7N3p4N5qk3J5l8
$$ 35 56 2 16 -23 -17 24 28 39 18 -15 -19 5 25 -14 28 -63 3 -48 24 -33 32 -3 -50 24 -3 50 -24 31 23 0 15 -23
7485b3K7K1o0K4l6L2pO7k3l7J0o2M8k6J5M1k4%LJ7K3q5K9J6L6k2k5J2K2m5N2l8
$$ -23 4 25 -35 -11 -47 -15 -22 45 22 -15 -5 -67 -19 -45 -30 11 -13 -13 -10 7 30 -55 -26 -10 26 4 -21 -9 13 -32 20 -18
7517a8LK4Rm2oM6l1%j3M8k6k8N6l2JrM1K5n4Ll9N0j0N6k1j6k7M9l4pL2m5j4PJ6
$$ -18 -15 9 18 -24 -30 16 -15 -15 -28 20 -6 -34 22 -10 -9 -18 23 48 -6 -3 -42 8 -2 54 33 17 -10 39 5 -2 30 -15 -29 -22 -6
7552fLJ5k1J9j5l5j2J7J23j04j5L3K4n5J1OK1mK5Jn6N8l1j3P1k4j9nN2o5OM7m9
$$ -6 -3 12 -9 10 -5 -40 -52 -35 88 -16 -31 2 26 -29 -18 -12 9 5 30 31 -25 33 2 -11 60 36 17 12 64 -1 5 52 3
7585CrK8%n3L6o9PJ5KN0mj2k0k6M9k7J7L2n8nK6M8Mj3%j3l8N8j5k5jk6L5KJ8J
$$ 3 -6 22 22 -31 5 -64 -57 -42 -40 10 6 -6 -26 -52 -3 -30 -13 19 -39 -44 -18 30 34 21 21 8 -30 28 13 -12 -13 -39 -4 -2 16 17
7621A7Qj0J6mqo8M5K0N9o0K1k1%K0m1ok7K3mPL2k9j1k3M3L9k2l7J1j6RLj5N6l9
$$ 17 25 15 31 27 19 -49 -4 16 75 15 36 15 15 35 -6 -12 -39 -16 -20 -13 19 -10 -21 -44 -1 38 16 -21 -10 -26 -17 -14 -29 27 -12
7656a2M9Kp3N2l0OL7o7N8k3j8K6j0M9knl3qJ3K0k0l9lL1l2M4o7P4l4K1j6l8M9
$$ -12 37 39 -34 18 -12 -6 31 -36 22 -1 -19 7 -3 46 44 39 6 -2 11 31 11 -28 -31 0 -32 12 -55 19 -15 6 -10 -48 1
7689Al7K2J1jl3N2j5l1ll1M7lK5K7o9Q3m8n1N4k1N1J4n2k1K9K9J6m2Mn7M4k4M5
$$ 1 -36 -14 -3 -4 -37 15 0 -31 -34 -65 -18 -21 4 31 -38 45 -3 -54 0 -21 30 44 -8 -29 0 29 45 3 7 -50 -6 -30 15
7722A5j0m1M7l3OjN4n3l0K1j8N2j3j7J5mQN0n7J0L1K1r2K7M1k2K1rk9K9m0J5J0
$$ 15 5 -36 11 -22 -16 -17 37 -16 -46 -25 -43 9 -4 -21 -6 -10 -2 48 -9 1 32 53 -39 -12 29 7 28 19 -10 19 -21 -6 4
7755DLN0o0m6M8j3M5k1m3K3M9q1O5m0k4L2J1J4j8L0o4L1mm5K6O7m7rJ5m6M1K4
$$ 4 7 57 -3 -49 -1 -14 31 10 -33 -10 39 -42 23 -17 -41 -9 2 16 -2 28 -36 -5 -9 -54 -28 39 -8 -17 -2 -48 -7 17
7787A7l5M2n9P4j3qj1j7L4l2j7K0J0qk7N5nk4l2j5M1m0J5KM9o2nK1L4K0plp1Q5
$$ 17 -18 24 -35 39 26 18 7 -10 24 -8 -25 -5 5 -3 -30 25 20 -4 -36 -51 -10 -50 -35 -33 16 -46 -51 -30 4 24 17 14 -57 28
7821B8k6l9N7l9Q0n7k2kK9J9POm6j9L8mkJ1j9L4m9JM8n0J1Q1r0L6k8O5p5M0j3
$$ 28 2 -37 20 -19 61 4 -18 -20 9 28 35 41 -5 -24 14 10 8 19 0 34 -15 -14 34 -16 -5 76 -14 22 -6 59 -16 24 11
7854A1J4k1J5Pl3k1J1M8m4l9PP0j9k4L5lk8kjJ2jJ4L1j5m2J8kN1j3o4KJ3L7l3
$$ 11 25 4 19 26 -7 -28 -17 31 -13 -52 -45 25 6 -18 17 14 -14 -16 -17 -5 -6 8 39 24 -18 0 -2 49 36 -28 -26 -13 24 -9
7888iL1N9p7Mk4jJ3k6L6m7L4K3q4R0k5M7p5K3J0j6L4k1j4j9Q1o2P0r0L2k4N0L8
$$ -9 22 81 4 8 -16 -17 -4 -30 6 -41 -7 16 -68 22 -3 44 -31 -8 2 -14 20 -1 -15 -34 47 -15 55 -35 -3 -27 23 61
7920F1n1k9K5j7L9l3j4L7l9N7k2j5J4k4L4j6j7M5p1k1P0j4N0n3L8k5Ql6L0J2m5
$$ 61 10 -19 6 -11 28 -5 -19 18 -21 36 14 -1 13 -11 23 7 -10 35 -36 -57 13 -1 49 -4 34 9 17 -19 11 23 -22
7951b2L6l7j6M0j6K6n1N0k1j5J5K5jJ8N3j52P8Ql2K1k0j1m3P3j2m1N4n2J7L7o5
$$ -22 14 -23 -39 1 -15 11 -40 10 -11 -26 -11 14 13 31 84 -68 10 18 -14 7 -13 -24 -67 6 -6 -47 7 -45 -28 9 -56
7982e6O8qk5K6J4jn7KK4K2KJ2Jj8kj8N8ko8J3M2J6L3p3k7rN0M4m9j6RK9J1r2P0
$$ -56 12 4 -21 5 19 18 -39 -37 -13 9 11 23 24 6 4 -14 44 42 -26 -13 29 45 78 5 -22 -31 19 63 14 -2 7 36 47 -45 25
8017B5k9j1MM0K4p2K1l0M9Lj6l2K2o9N5L8km3J1L2o7N4j4K7o2P9k8l0K8k2O3p6
$$ 25 -4 -15 -11 29 53 -19 2 -28 21 24 8 -24 -2 -71 -16 22 20 -23 -12 20 -47 7 -7 20 -42 37 9 -21 7 -15 48 -28
8049b8M3m0%O7j5l8M2k6nL0m2L3Kj2n5M7l0M4p6R5n3j9K3pJ4j9oM3k7J0j8K1q
$$ -28 15 -25 -25 42 27 -11 31 5 0 30 -12 21 23 11 -44 3 -27 17 -59 36 -17 -36 -13 -20 -6 -25 -31 12 -15 -5 -23 -2 -10
8082a0nQK8n2L7J3n9K9Pj3M2rJ9m5J5J7K1o5PqO0j1m9LK8l1nO1n8OKJ3k4J6J1
$$ -10 -15 -7 21 -31 6 19 -40 -11 -4 -17 25 16 35 -10 5 22 43 -22 -15 -23 37 26 -23 -20 8 -23 -28 33 -25 -19 -17 -4 -28 -12 -1
8117aK9m6P0n3k6J9L2pq8R2%j4nK9j9k4N5n0J2L2k3l7plN8J8o8K3J5p7Q0m5J1
$$ -1 28 -18 52 -1 -27 -8 24 17 -71 21 21 7 2 31 12 -12 43 -7 5 37 14 -23 -30 -33 25 43 -25 -2 13 -64 16 -29 -18
8150a8L5j4Rn9L1o0R9j3J0K0m8K1m2L7j4L4m9Q3o1k7M6m1N7o3M7Qm1qK3K3k2r
$$ -18 17 3 12 -47 -16 -76 23 10 20 40 -8 13 -29 8 -6 28 -21 62 1 -26 20 -21 36 -27 20 28 -13 -21 2 25 3 -6
8182fL9o4N4J2qp9lJ8L9
$$ -6 33 -31 23 35 27 -52 -55 -37 2
8191B
$$ Imaginary data points
##PAGE= N=2
##DATA TABLE= (X++(I..I)), XYDATA
0@%%%%%%%%%%qJ6j6K4l2M0n0N9p3Q9j07J30j60J87k15K53k98L46l97M55n21N95
$$ 0 0 0 0 0 0 0 0 0 0 0 -8 8 -8 16 -16 24 -26 33 -40 49 -58 72 -88 99 -116 137 -161 185 -212 243 -278 317
32C17o78P69q69R80j102J236j381J541j717J909k120K350k600K873l171L497l853
$$ 317 -361 408 -461 519 -583 653 -728 813 -904 1005 -1115 1235 -1365 1508 -1663 1834 -2019
49b019M245m678N153n680O267o921P654q487R443j0549J1845j3390J5270j7615
$$ -2019 2226 -2452 2701 -2979 3288 -3633 4021 -4466 4977 -5572 6273 -7117 8153 -9462
63i462K0634k4687L0443l9301N4797q9423K97070j05926n74056N73780J98407
$$ -9462 11172 -13515 16928 -22373 32424 -56999 240071 134145 -439911 133869 332276
74C32276n11623l1665L99798k08936j58528K41729l1072j89876K36021M5288k63865
$$ 332276 -179347 -211012 188786 -20150 -178678 63051 31979 -157897 78124 123412 -140453
85a40453J34397K52521k92510j38793L47841n031l72545J07972K75639j77185
$$ -140453 -6056 246465 -46045 -184838 163003 157972 -214573 -106601 169038 -8147
95h147j72773J93495O8837j31921K6362Q9278n1332j9269M7961j3325k8697M644
$$ -8147 -180920 12575 81412 -50509 -24147 65131 13799 -5470 42491 29166 469 5113
107E113k1129l09K7106l0625l7237M0829L6072j7761j7727N447L4588K8705m7958
$$ 5113 -16016 -16325 10781 -19844 -57081 -16252 19820 2059 -15668 -10221 24367 53072 5114
120E114l6249O3902R156q3516K1633O0203p4923k5491J03768k5542r4801Q3154
$$ 5114 -31135 32767 41923 -41593 -19960 40243 -34680 -60171 43597 18055 -76746 6408
132F408O5865j01904M4R8273n8906o2169R1738K073r9113M1402N9695o9123k865
$$ 6408 72273 -29631 -29587 68686 9780 -52389 39349 41422 -57691 -16289 43406 -25717 -28582
145b8582O1157n4690j7435R9043l6252j04246R2151P8618j24154l0386J20496
$$ -28582 32575 -22115 -39550 59493 23241 -81005 11146 89764 -34390 -64776 55720
156E5720k5541q7835O3973L4086p4169K0255N5230n5147j4968N9969k9853l7406
$$ 55720 30179 -57656 6317 40403 -33766 -13511 41719 -13428 -28396 31573 1720 -35686
168c5686N9072l970o3364M4897M3197o5930l315O4623l3758l7288N8088k757o4511
$$ -35686 23386 19416 -43948 949 44146 -21784 -25099 39524 5766 -31522 26566 23809 -40702
181d0702L2667M4772n2246k2350M4875K080j7371R633q404N176L6994k4651m3398
$$ -40702 -8035 36737 -15509 -37859 7016 9096 -8275 1358 -7046 -1870 35124 10473 -32925
194c2925M9661K9380p2643r740P0740k3751o2688M1981M0412m3374j1725L7096
$$ -32925 16736 46116 -26527 -36267 34473 10722 -51966 -9985 30427 -12947 -24672 12424
206A2424L326p330J690j5705J1411K8190l8791l5848N2454J6024o7691L577O4300
$$ 12424 15750 8420 10110 -5595 5816 34006 -4785 -40633 11821 27845 -39846 -36269 28031
219B8031k1384m3727L8899K9647l0055o822K0583L21n577r747j3643J5739R863
$$ 28031 6647 -37080 1819 31466 1411 -5411 15172 15493 9916 169 -13474 2265 12128
232A2128l5894n975M3376o351l6812K5955L1437k6371q958K6981m794j6765P743
$$ 12128 -23766 -29741 13635 7284 -29528 -3573 27864 1493 -7465 19516 14722 -2043 5700
245E700l333j0715P263p077j2977J9877M488k5813J8052L2225k9721j4845M5962
$$ 5700 2367 -8348 -1085 -8162 -21139 -1262 3226 -22587 -4535 27690 -2031 -16876 29086
258B9086k690m6772J9518K9735l7596j5051L2095r428k0689K1876J325j6082K4546
$$ 29086 26396 -20376 -858 28877 -8719 -23770 8325 -1103 -21792 84 1409 -14673 9873
271I873N417l2008K2627L2019m6791j8132N8078j0147o2906K9080M4684m5161
$$ 9873 15290 -16718 5909 37928 -8863 -26995 31083 20936 -41970 -12890 31794 -13367
283a3367k0877M6645o85k9099K1117J1352k0638J2175J0822k6779N551K5520k8519
$$ -13367 -34244 12401 11716 -17383 3734 15086 -5552 6623 17445 -9334 -3783 21737 -6782
296f782j9139L8352J006m1309J5204L4903k2025j7906K4827O595j5024K717K737
$$ -6782 -25921 12431 13437 -27872 -12668 22235 210 -17696 7131 13726 -1298 1419 4156
309D156n049M858l091j0866Q935N634j5022L315J5886j0292p723J6643L47j2113
$$ 4156 -893 3965 874 -9992 -1057 4577 -10445 -7130 8756 -1536 -9259 7384 7731 -4382
323d382Q853K725j2222Q032O271j9388J833K0525j4165j4513K2514K860k1726
$$ -4382 4471 7196 -5026 3006 9277 -10111 -8278 12247 -1918 -16431 6083 8943 -12783
336a2783J2799J5039k2127n85K4081j4551j7113K3449J432k6109J3266J7542k4660
$$ -12783 16 15055 -7072 -7657 16424 1873 -15240 8209 9641 -16468 -3202 14340 -10320
349a0320l428K7824j0037j9324K0915O969k1134P918J3303j8353r31J9178j3309
$$ -10320 -13748 14076 4039 -15285 5630 12599 -8535 -617 12686 -5667 -6598 12580 -729
362g29j3699K0863J513k1174J0508J4522j6897k105J7548p769j0296J3004m25
$$ -729 -14428 6435 7948 -13226 -2718 11804 -5093 -7198 10350 2581 -7715 5289 4864
375D864j1744Q546K834j3069O726R615j4788p06J7489q716j1318J7309J990j8156
$$ 4864 -6880 1666 4500 -8569 -1843 7772 -7016 -7722 9767 1051 -10267 7042 9032 -9124
389i124R702J2439j8473k701J9058r856j4180J7869K788j9876R826J5372j8425
$$ -9124 578 13017 -5456 -8157 10901 1045 -13135 4734 7522 -12354 -2528 12844 -5581
402e581m032K2182p619j7474J7299P005k2215M242J8614j5613j1033K1166O26
$$ -5581 -9613 12569 4950 -12524 4775 11780 -10435 -6193 12421 -3192 -14225 6941 7567
415G567k0348J0105J5761j5472o846J7604q93j4711O762Q741j0014l346Q302k672
$$ 7567 -12781 -2676 13085 -2387 -9233 8371 7478 -7233 -471 8270 -1744 -5090 3212 540
429E40n847O026J833p049L102P639o248o090R615L754j2348j041J3381l108j3755
$$ 540 -5307 719 2552 -4497 -1395 6244 -4 -6094 3521 7275 -5073 -6114 7267 4159 -9596
444i596O714J1528j0214p711J2096L107j0630K455P876n527k425O488l955m378
$$ -9596 -2882 8646 -1568 -9279 2817 5924 -4706 -2251 5625 98 -2327 4161 206 -4172
458d172Q397p02j1055O952J0151j2943o342J6618J34j6939O133J3693j0557p583
$$ -4172 4225 3523 -7532 -580 9571 -3372 -9714 6904 7038 -9901 -3768 9925 -632 -8215
472h215J2153O83j0044N141N252q182R77P980o542m759R983o35j1181N725R176
$$ -8215 3938 4621 -5423 -282 4970 -3212 -2235 5745 -797 -5556 4427 3792 -7389 -1664 7512
487G512r743n220J2328J064j1444L485R235o493n426P657L77p912L288N109p481
$$ 7512 -2231 -7451 4877 5941 -5503 -2018 7217 724 -4702 2955 3332 -4580 -1292 3817 -3664
502c664j964Q973k110p991P010O195q864r06J0183l856q597P538L939j0463J71
$$ -3664 -5628 3345 1235 -6756 254 6449 -2415 -3321 6862 3006 -5591 1947 5886 -4577 -4406
517d406R205n625o373R126K148r473M336R324p787m988J0647j96j1079M072O694
$$ -4406 4799 -826 -7199 1927 4075 -5398 -1062 8262 475 -4513 6134 5938 -5141 -1069 5625
532E625r071k851R197l566p200Q715L710r729L217R979o939n366R790k91j0275
$$ 5625 -3446 -6297 2900 -666 -7866 849 4559 -5170 -1953 8026 1087 -4279 5511 5220 -5055
547e055M086O032q789k529Q899j976o791N907M837n779j49O197k009l948L183
$$ -5055 -969 5063 -3726 -6255 2644 668 -6123 -216 4621 -1158 -1307 4890 2881 -1067 2116
562B116Q86m701r1K631k916k316L357J039k884J435L961j149k042K656J517k823
$$ 2116 3002 -1699 -1790 841 -2075 -4391 -1034 5 -2879 -1444 2517 1368 -674 1982 3499 676
578F76r30J690q75k093J39N83r99J71J368k49j64K099R84j731M5J861j149k228
$$ 676 -254 1436 561 -1532 -1393 -810 -1809 -1638 -270 -519 -683 1416 2400 669 714 2575 1426 -802
596h02P40K92k025K08J076j611rK917o51k045K975K146l352j95L502k045l036
$$ -802 -62 230 -1795 -1587 -511 -2122 -2131 786 135 -1910 1065 3211 -141 -336 3166 1121 -1915
613a915K771N50m197J258L423l018j631M307K7l223K354J941l257N79K879l406
$$ -1915 856 1406 -2791 -1533 1890 -1128 -2759 1548 1575 -1648 706 2647 -610 -31 2848 -558
629e58k132M740p43n858K836N173m736l329O173J415n372J171M032k461j279K647
$$ -558 -2690 2050 1307 -4551 -1715 3458 -1278 -4607 1566 2981 -2391 -1220 2812 351 -928 1719
645A719j630j784L843o81n146L067M986n321l523O675J342o303J038M784k637
$$ 1719 89 -1695 2148 1467 -3679 -612 4374 -947 -4470 2205 3547 -2756 -1718 3066 429
660D29k511L445m44l099K621J647m273N7M469j680l850K941K655l404n09L176
$$ 429 -2082 1363 919 -2180 441 2088 -2185 -2128 2341 661 -3189 -248 2407 -997 -1506 1670
676A670j215j928K870L87l648J634L683l466l203M534J629n028k61M371j161k910
$$ 1670 455 -1473 1397 1784 -1864 -230 3453 -13 -3216 1318 2947 -2081 -2342 2029 868 -2042
692b042J947J016j637J047P13k579R03L130k652k840L477J759l901m88L308n64
$$ -2042 -95 921 -716 331 1044 -1535 -632 2498 -154 -2994 483 2242 -1659 -2147 1161 597
708E97j688J371J86r94J622K94k479P92K697j986k374K286J156k410m2J310p38
$$ 597 -1091 280 466 -528 1094 1388 -1091 -299 2398 412 -1962 324 1480 -930 -972 338 -400
725d00L6J096j267n96K473j50k950J030K555j626j899J462R10r59j56K45j70Q98
$$ -400 -364 732 -535 -1131 1342 1192 -1758 -728 1827 201 -1698 -236 674 -285 -441 -196 -366 532
743E32M14j396j39K025j38k228L98J847o65j629M43J101m32q14J19M75L03j66
$$ 532 946 -450 -589 1436 1298 -930 -532 1315 650 -979 -536 565 133 -681 -562 -87 216 50
761E0n03NQ71N8j107j95J381l8j471K07J568m39j214P14Q74o69j34M86l12J47
$$ 50 -453 -448 423 481 -626 -821 560 522 -949 -742 826 387 -827 -113 761 92 -42 444 132 279
781B79N51r24n02J519k04k026Q51J703j474j187J719L01j387N08M89p63O46N08
$$ 279 830 -94 -596 923 719 -1307 -456 1247 -227 -1414 305 606 -781 -273 216 -547 99 607
799F07j591K69K038j062j982J725J616k022o57J815q7r83O59j39p47J311L64k358
$$ 607 -984 -715 1323 261 -1721 4 1620 -402 -1059 756 669 -314 345 206 -541 770 1134 -1224
817a224M42K752j474k670K103J892k405r13K184l42j134J161l41j402J862J111
$$ -1224 -782 1970 496 -2174 -71 1821 -584 -1497 687 345 -789 372 31 -1371 491 1602
833A602l079j45L747p60l723J659L146k078k127K076J041j675J97Q14j325L93
$$ 1602 -1477 -1622 2125 1365 -2358 -699 2447 369 -1758 318 1359 -316 -119 695 -630 -237
849b37J858j685k251K990J837l981j124M356j1m277J319L264k259j589K698l40
$$ -237 1621 -64 -2315 675 2512 -1469 -2593 1763 1752 -2525 -1206 2058 -201 -1790 908 568
865E68k213K156J155l299N26L656k093l041L273J907l626l44L101j051j900J884
$$ 568 -1645 511 1666 -1633 -1107 2549 456 -2585 688 2595 -1031 -1375 1726 675 -1225 659
881F59K07k138J323J631k576p88K996j57k949Q35K347j222j329R76M07l60K57
$$ 659 866 -1272 51 1682 -894 -1682 1314 1157 -1792 -957 1390 168 -1161 -185 222 -138 119
898A19m28m42J277M99j766j34J834j09j490K81J045k34m65j46R0M03K70r54l53
$$ 119 -309 -751 526 1025 -741 -875 959 850 -640 -359 686 452 -13 -159 -69 334 604 -350 -703
917g03J133K28j149k10J064L4r20n8Q53j30n28J69L37k28pM16m03k94J009q5j250
$$ -703 430 658 -491 -701 363 397 -523 -581 272 142 -386 -217 120 -108 -115 301 -102 -396 613 528 -722
938g22N68J391j211j027J644L66j886N35J525j334r32J752L1j836Q07J327j502
$$ -722 -154 1237 26 -1001 643 1009 -877 -342 1183 -151 -1083 669 700 -1136 -329 998 -504
955e04n87J805m53j476J409P21j931K13K134j039j783J809J135j913l46J755m22
$$ -504 -1091 714 261 -1215 194 915 -1016 -803 1331 292 -1491 318 1453 -460 -806 949 527
972E27j057Q24J66q55O42O31j433k58J845l11j955O89J677r61j427R85R47q22
$$ 527 -530 294 460 -395 247 878 -555 -813 1032 721 -1234 -545 1132 171 -1256 -271 676 -146
990a46l97M44J1J19J96o21j85J123J86j377L3J516p2j400J38J240k31r03J09N92
$$ -146 -543 -99 -88 31 227 -394 -579 544 730 -647 -614 902 830 -570 -432 808 577 -326 -217 375
1010C75N7l20l87k1O38P5q34k82R66J85q80j27N59J23j78j23k78M20O85q10o17
$$ 375 432 112 -275 -296 342 417 -417 -699 267 452 -428 -555 4 127 -51 -174 -452 -32 653 -157 -774
1031g74J092M58j118j5Q28l12j98N17m82m90J267j28j738P47J743j369j520J797
$$ -774 318 776 -342 -357 471 159 -39 478 -4 -494 773 645 -1093 -346 1397 28 -1492 305
1049C05Q17j897l6J535o50q16J027k4j204J076R00j770k03K121n50k006J394J320
$$ 305 1122 -775 -811 724 74 -742 285 261 -943 133 1033 -737 -940 1181 631 -1375 19 1339
1067A339j519n70J482k65r60Q02K60r34J48R39o65q21P02O12o86o00N61O21l66
$$ 1339 -180 -750 732 467 -493 309 569 -365 -217 722 57 -764 -62 550 -136 -736 -175 446 80
1086H0q31M02R47m13q40M66P20n34k80M04j94J28M85p69m13J530M9j882M72K107
$$ 80 -751 -349 598 185 -655 -189 531 -3 -283 121 -73 55 540 -229 -642 888 937 -945 -473 1634
1106A634j252j855J750J164k079m50J767l89j123P70K59p78N73M53j087K55J309
$$ 1634 382 -1473 277 1441 -638 -1088 679 290 -833 -63 196 -582 -9 444 -643 -388 921
1123I21r11r82J190O19j368j99J371j77j043L91Q02l61m19K82J78k8k21j32K21
$$ 921 10 -972 218 837 -531 -730 641 464 -579 -188 614 253 -166 116 294 266 45 -87 134
1142A34J27n40r6M55j9m21J71K56k01K9K34l18L7M51m30k95O23P2p45K44Q03n16
$$ 134 261 -279 -375 80 61 -360 -189 67 -134 -105 129 -189 -152 299 -131 -426 197 269 -476 -232 571 55
1164E5n00Q05K75p59L1O30j71o06Q8M28j71n27L09L98m36j25M51p9m43M41J56
$$ 55 -445 360 635 -124 -93 537 366 -240 -152 276 105 -422 -113 285 -151 -276 175 96 -347 94 250
1185B50o96K25O28o72m46J072J1j082N33R82o56m78P73J77p01J07L00m46j51L45
$$ 250 -446 -221 407 -265 -711 361 372 -710 -177 805 149 -329 444 621 -80 27 327 -119 -270 75
1205G5k51k54M27J61m37K35M85k78m06M65M6n85K7J99j91o1Pq8L09L73l55O6Q22
$$ 75 -176 -430 -3 158 -279 -44 441 163 -243 222 268 -317 -290 -91 -282 -343 -336 -424 -115 258 -97 -31 791
1228G91k61n92N98J55q59o7M85m97m42M93J6l99N97K41m10M51N46o76m73Q42j43
$$ 791 530 -62 536 691 -168 -235 250 -247 -689 -196 -180 -579 18 259 -151 300 846 170 -303 539 396
1249C96j126J21O39m45o47N98N44k47k2O28L50k30j28K39r7m17k02j12k40K6o5
$$ 396 -730 -609 30 -415 -1062 -464 80 -167 -189 439 789 559 431 670 573 156 -46 -158 -398 -372 -437
1270d37l07L21P64k69n67J020P23j161m50J311l42j665L99J032j036q19J212M91
$$ -437 -744 -423 341 72 -495 525 1248 87 -363 948 606 -1059 -660 372 -664 -1483 -271 220
1288B20q54N00Q66l71P3P30p54n32J150n02j739P60J298j533j068K046O41j803
$$ 220 -634 -134 732 361 434 1164 410 -122 1028 526 -1213 -453 845 -688 -1756 290 931 -872
1306h72K42J913m80j201N80N93o56n32oN1K84l46o13P86R19o33o13J048O27p03
$$ -872 -630 1283 803 -398 182 775 119 -413 -419 -368 -84 -430 -1043 -257 662 29 -584 464 1091 388
1326C88o26M06O09m19j174J89J384n13j506R16J717j269j383J714J086k000p41
$$ 388 -238 168 777 358 -816 -627 757 244 -1262 -346 1371 102 -1281 433 1519 -481 -1222
1343a222J729K44j498j26Q73J94q4k89k42P35Q51j320q51J636N84k158m71K378
$$ -1222 507 751 -747 -873 0 194 110 -179 -421 314 1165 -155 -1006 630 1214 -944 -1415 963
1361I63j58k262P52K338j002j664J261J368j161j132O49M52o38m93n0J51L08J57
$$ 963 805 -1457 -705 1633 631 -1033 228 1596 435 -697 -48 404 -234 -727 -777 -626 -318 -161
1379a61m21L10J037k7p88O44P90j257q52J363Jk261J48K169o13j882J414J833
$$ -161 -582 -272 765 738 -50 594 1384 127 -725 638 639 -1622 -1474 695 82 -1800 -386 1447
1397A447q27p99J103M54o50l85l83j63J34p95r49J065R68j421m09K393R06j856
$$ 1447 620 -179 924 1378 728 343 -40 -203 -69 -864 -1813 -748 220 -1201 -1610 783 1689 -167
1415a67j32K022J61j744n85N72K09p33j111J5J315J30r47O89J556l88o17J073
$$ -167 -299 1723 1884 140 -445 127 336 -397 -1508 -1493 -178 -48 -995 -306 1250 862 245 1318
1433A318K76j439k82O93p37j254K23N48l28o7M46N20N30J47j22O22M33j177p12
$$ 1318 1594 155 -127 566 -171 -1425 -1202 -654 -982 -1049 -603 -83 447 594 472 1094 1527 350 -362
1452c62J314j51k454j56K218p8k228K93K460P78j583p84J824J432j708k075J131
$$ -362 952 801 -1653 -1809 409 331 -1897 -1604 856 1634 51 -733 1091 2523 815 -1260 -129
1469a29J635j805k078J313J621j209j156J469J496o45r44P77J239m57j476j16
$$ -129 1506 -299 -2377 -1064 557 -652 -1808 -339 1157 512 -432 345 1584 1127 -349 -465
1485d65J147l3j755l35J540L26j272P5J315J09o42M60M46p17k69O90k09j275p0
$$ -465 682 649 -1106 -1441 99 425 -847 -772 543 652 10 470 916 199 -70 620 411 -864 -934
1504i34J121K4j077j73J198N54q38m84P86P36n06q80J92J025j57j422P3J706k79
$$ -934 187 211 -866 -1039 159 713 -125 -609 177 913 407 -473 -281 744 587 -835 -762 944 665
1523F65j975P04K115q04k008Q81J673q22j316M29Q25l5l29n63QJ175J97j657k0
$$ 665 -1310 -606 1509 705 -1303 -422 1251 429 -887 -458 367 332 3 -560 -552 623 820 -837 -857
1542h57J766l00j723M92J447q52q09R83M03q51K92O27m19j63M59l12l80M04J7
$$ -857 909 609 -1114 -622 825 -27 -836 147 550 -301 -9 618 199 36 495 183 -197 207 224
1561B24p44N7N82l61k66N50J61m15L47M66m98m96P09K88j037l72Q23K80p80l09
$$ 224 -520 -463 119 -242 -508 42 203 -212 135 601 103 -393 316 604 -433 -805 18 298 -482 -791
1581g91P09O40m07n40M80Q94m47o95L13M43m52n65J07K67p3l09j61N66L26m38
$$ -791 -82 558 151 -389 91 985 538 -157 156 599 147 -418 -311 -44 -117 -426 -587 -21 305 -133
1601a33k31P58L59q73j61P42r8q79J00O41m77m78O30L86n85J49P72j73n55N40
$$ -133 -364 394 753 -120 -281 461 363 -516 -416 225 -252 -730 -100 286 -299 -150 622 449 -106 434
1621D34J49n51L0K01n60l4N64n63n28R24L27r91K32J201n02q37P99L77r62l7O42
$$ 434 583 32 62 263 -297 -331 233 -330 -858 66 393 -598 -366 835 333 -504 295 672 -290 -327 315
1642C15n20m31O95jo20N13M98n70J23P66l17n92N08J17o50m1L63m92j17M41k62
$$ 315 -205 -636 59 58 -562 -49 449 -121 2 768 451 -141 367 484 -166 -207 156 -336 -453 -12 -274
1663b74l13P18J41n36L56M94m54k56N15j91p05L50K59n18m8L84o9L7L01l8R9N08
$$ -274 -587 131 272 -264 92 586 132 -124 391 200 -505 -155 104 -414 -462 -78 -147 -110 191 153 252 760
1685G60k62n90M33L71q74m64P09p7q35J71O48j20k21L07L55J41nm46J92M71n54
$$ 760 498 -92 341 712 -162 -626 83 6 -829 -658 -10 -130 -351 -44 311 452 447 1 193 664 110
1706A10q58M42M88p54m04P37M87m12m5P06L31k75k27K21J3l33m82j33J64j71m35
$$ 110 -748 -306 182 -572 -976 -239 248 -164 -209 497 828 553 326 547 560 227 -255 -388 -224 -395 -830
1727h30J8O95J10l50L09P90k5n41J19M68m27p79J87J70n36l48N31K17j82L44M40
$$ -830 -812 -117 -7 -357 -48 742 717 176 295 763 336 -443 -256 -86 -622 -970 -439 -222 -404 -60 380
1748C80O4K57J99l82j14L41o27q05M50K70j138r8J174k70n21R31O41n06J36M20
$$ 380 444 701 900 518 404 745 118 -687 -237 33 -1105 -1203 -29 -299 -820 111 752 246 382 802
1768H02l97j09J73p90l56O72k65j017O88R92o89l32J264L91q38J91N48l98k79
$$ 802 405 296 469 -321 -677 -5 -270 -1287 -599 393 -296 -628 636 1027 189 380 928 530 251
1787B51j21n36P5L17p71m05J108L28r78K27J484m29r72R10N73j063k14N48m03
$$ 251 130 -406 -331 -14 -785 -1190 -82 246 -732 -505 979 550 -422 488 1061 -2 -216 332 -71
1806g1m23L44k70k78Q03m9o42O99P76q02k81J113k44j129M09O71p18o22N86K23
$$ -71 -494 -150 -420 -698 105 56 -586 113 889 87 -194 919 675 -454 -45 626 -92 -714 -128 95
1826I5m85j11M11K06j82r0J37K85o2j81m6L02jl23j95L79J67n67k84O46J93p25
$$ 95 -390 -501 -90 116 -66 -156 -19 266 204 23 -23 279 278 -45 -240 139 306 -261 -545 101 294 -431
1848d31m5Q45P5p77K42Q14k71o83M08L54n98k55K04j81o0N2j72J0N98j07l98O34
$$ -431 -476 369 444 -333 -91 723 452 -231 177 531 -67 -322 -118 -299 -359 -307 -479 -469 129 22 -376 258
1870B58N99o60j92O89pr18M3L89m32m24K14J35Q9j5N8L12N60k64l69N87J27q44
$$ 258 857 197 5 694 687 -231 -188 201 -231 -655 -441 -306 -217 -232 -174 138 698 434 65 652 779 -65
1892f5k41N85n03p42L78L30l88J28N14J8K57M63k75m3O21l90r79L24M21j022n55
$$ -65 -306 279 -224 -966 -588 -258 -646 -518 -4 14 271 734 459 416 1037 647 -332 -8 413 -609 -1164
1913a164R54R1q31M75R20k34j61N47J12k34K6j94m84J59l7q43J4O55k59m05P35
$$ -1164 -210 -119 -950 -475 445 211 50 597 709 475 501 307 -177 -18 -55 -898 -884 -229 -488 -893 -158
1934a58P08m43N3O93M7m95M3l8l81k13r2k58o9K85k07k1O76K61m42L14O22l95
$$ -158 550 107 160 853 900 405 448 410 29 -184 -276 -534 -603 -318 -525 -546 130 391 -51 263 885 490
1956D90n14M62N5r55n0N13n05m31O83J59m48M93O66m89o2R16l32q83O29M23j306
$$ 490 -24 438 493 -462 -512 1 -504 -935 -252 -93 -541 -48 618 129 67 983 651 -232 397 820 -486
1977d86j93J161n51j147J048P14j214J14J442n91q60J204K38j325K73R65j101
$$ -486 -679 482 -69 -1216 -168 546 -668 -554 888 297 -563 641 879 -446 -173 792 -309
1994c09o24J223k56j160R39Q30j182m5J480m44j152J155N79j378l7J226o56j007
$$ -309 -933 290 34 -1126 -187 643 -539 -584 896 452 -700 455 1034 -344 -381 845 189 -818
2012h18Q76L07r69K02P01n26k64Q84k06o44P25L47r34J40Q35o42p20Q26L10r47
$$ -818 58 365 -604 -402 299 -227 -491 393 187 -457 268 615 -319 -179 656 14 -706 120 430 -517
2032e17K1P71k38n20N13L36l54J33K58k93O5K68m32k62M89p3q27K88P44o66m07
$$ -517 -496 275 37 -483 30 366 12 145 403 110 175 443 11 -251 238 165 -662 -374 370 -296 -703
2053g03Q69K92r04K96P86m04m87N28J1m77K12P1n04K29M94o90j15R53j20q61O96
$$ -703 166 458 -446 -150 636 232 -255 273 284 -193 19 90 -414 -185 309 -381 -496 457 337 -524 172
2074A72Q25j071l48J150j97j120M60N59q60j67P57m10k96Q49j62p21Q41M93j128
$$ 172 997 -74 -422 728 531 -589 -129 430 -430 -597 160 -250 -546 303 141 -580 261 754 -374
2093c74O5J211p68r64J104L16j282K30R94o92m52J023p9p50P83L39j021K44R36
$$ -374 -309 902 134 -830 274 590 -692 -462 532 -160 -612 411 332 -418 365 704 -317 -73 863
2112H63j001n90J213j04j336O49R41j030l94J249q0r57O87N65q92M2Q17o92n36
$$ 863 -138 -728 485 381 -955 -306 635 -395 -789 460 380 -577 110 675 -217 -175 642 -50 -586
2131e86J011j57j065P27Q17j130l06J433k40j209P03R25j065m40J138k01r67N31
$$ -586 425 268 -797 -70 747 -383 -689 744 504 -705 -2 923 -142 -582 556 355 -612 -81
2149h1M34p57K0P10n16l79R70o4r66N91R16r87n71J263J0j213L17J026p79o71
$$ -81 353 -404 -384 326 -190 -569 401 337 -629 -38 878 -109 -680 583 593 -620 -303 723 -56 -727
2169g27J033K53r46J76P43n42l00O63j79m85M08J80o77J48O61o11m05Q59J11r19
$$ -727 306 559 -387 -211 532 -10 -310 353 174 -311 97 277 -400 -252 409 -202 -607 252 363 -556
2189e56L27Q79o43n17P33K62p99J37N67k79l95L56P4k11J00oj32K03J26m00L2
$$ -556 -229 650 7 -510 223 485 -314 -177 390 111 -284 72 146 -65 35 29 -103 100 226 -174 -142
2210a42M98k50n33L74L80n63j95N95O9n92R2M79j48k20J68J11k6m8n6l7J70Lk83
$$ -142 356 106 -427 -53 327 -236 -431 164 233 -359 -267 212 64 -156 12 123 97 49 -7 -44 126 129 -154
2233a54Q9L94k90l28L59K74m41j45N30o4m71J30L93k17k92K72N1k90J50O8j58
$$ -154 -65 329 39 -289 70 344 -97 -242 288 224 -247 -117 276 59 -233 39 90 -200 -50 18 -140
2254a40J20J23j20j11L90j45l14K69K33m27n8L38J7l47J32K21j71l4J13j36n3
$$ -140 -20 103 -17 -128 262 117 -197 72 305 -122 -180 158 175 -172 -40 181 10 -24 89 -47 -100
2275a00K35m1k91J22K74k50k37L46R4l25J4K99n4k12J62M9m7O8p3j44K19J57l67
$$ -100 135 94 -197 -75 199 -51 -288 58 152 -173 -159 140 86 -126 36 85 38 106 33 -111 108 265 -102
2298a02j03M40l1m87J45M96k43m41L58K88m23j61M03kl36P5J89n5r3Q1q5J10P4
$$ -102 -205 235 204 -283 -138 358 115 -326 32 320 -103 -264 139 137 -199 -124 65 10 -83 -2 -87 23 97
2321I7k22p6M37K0n44K15N31l15n44M38L81n01k65N17J47n00M0L53j67j81N3N8
$$ 97 -125 -201 236 256 -288 -73 458 143 -401 37 418 -83 -348 169 316 -184 -144 209 42 -139 -86 -28
2343b8J17p3k41L6L65j22m04K80L52l75k44N12J59m64k5L77p2k45J00P5k8j5j10
$$ -28 89 16 -225 -189 176 54 -350 -70 282 -93 -337 175 334 -130 -155 222 150 -95 5 80 52 37 -73
2366g3j3K54p6l33J73L75l51k16L97N9m17J29L39l54q6L06o3k67K40N5k64J63
$$ -73 -86 168 92 -241 -68 307 -44 -260 137 196 -221 -92 247 -107 -193 113 50 -217 23 78 -186 -23
2388b3J62k02l8L49j53k90L15J54m58P1M19l21k46M01R4m89J55M44l42k90L67
$$ -23 139 -63 -101 248 95 -195 120 274 -184 -113 306 -15 -261 140 234 -255 -100 344 2 -288 79
2409G9R1m31K56J58l01J4K68j51j76K51O3k75P2L39k71j98M16J9m49K09L99l71
$$ 79 170 -261 -5 153 -148 -134 134 -17 -193 58 121 -154 -82 257 -14 -212 204 223 -226 -17 382 11
2431A1k64L68J27l92K5L25k03j83J85O6j19M0K8k4n0R4j12o1K44k7k22J05J94
$$ 11 -253 115 242 -150 -125 200 -3 -186 -1 65 -54 -14 14 -10 -60 34 -78 -139 105 78 -144 -39 155
2454A55k10n1K99o6j56Q9O0j56qJ89j54n3J39n1o3J19m7k22K17R9l19Q6K74j61
$$ 155 -55 -106 193 127 -29 60 120 -36 -44 145 -9 -62 77 26 -37 82 35 -187 30 129 -190 -104 170 9
2478Ik68L32J06m36J29L37k02k47L40P4l08K01J45k25j13K99j25k13K41O2k84
$$ 9 -259 73 179 -257 -128 209 7 -240 100 174 -134 67 212 -13 -126 173 48 -165 76 138 -146
2499a46N0K84k01j80K28K04m36N9K52p9k60K02K36k87j08K33J8j88Q7J66j23r9
$$ -146 -96 188 -13 -193 35 239 -197 -138 114 35 -225 -23 213 -74 -182 51 69 -119 -32 134 11 -88
2521h8J48l9m3N1J07k06O4J37j19j15J59Q0k39l5J91l7j70J32R6j17q0J50J3q0
$$ -88 60 21 -22 29 136 -70 -6 131 12 -103 56 136 -103 -138 53 16 -154 -22 74 -43 -123 27 40 -40
2545d0J4J9J9m3m6L1J57j39OJ34r5p3J22O8j68j7J94k14n2K31m3k97L12J18l65
$$ -40 -26 -7 12 -31 -77 -46 111 -28 -22 112 17 -56 66 134 -34 -51 143 -71 -123 108 65 -232 80 198 -167
2570a67j9M51k64l66M32J04l60J08L18l04j65M15pm50K36L78m18j25M67r1l73
$$ -167 -186 265 1 -365 67 171 -189 -81 237 -67 -232 183 176 -274 -38 340 -78 -203 264 173 -200
2591b00K68K05m22P5K89k56j83K75R1l44J27K14j65k03L03K7k51P2J93q6j18J69
$$ -200 68 273 -149 -74 215 -41 -224 51 142 -202 -75 139 -26 -229 74 101 -150 -78 115 29 -89 80
2613H0L4j43j5J59n3o4j7J00l3p5J58n7j95O7J34r2q2J52j1k22P4K03k14r6K99
$$ 80 114 -29 -44 115 62 -2 -19 81 48 -27 131 74 -121 -54 80 -12 -94 58 47 -175 -101 102 -112 -208 91
2638I1m6j96J40P2p6j12K05j7j53Q2N5m5l6J32m9j20J29N4j62K2J02n7l7rN9m0
$$ 91 45 -151 -11 61 -15 -127 78 61 -92 -10 45 0 -36 96 47 -73 56 110 -52 -30 72 15 -22 -31 28 -12
2664a2m7M1L3q2N1M6p0l8L6L2j5L5rk9l4O4K6l6OM2Lj16J02Rp6L9L8l0o2J12j16
$$ -12 -59 -18 15 -67 -16 30 -40 -78 -42 -10 -25 10 1 -28 -62 2 28 -8 -2 40 43 -73 29 38 -38 1 39 9 -53 59 -57
2695e7n9J42L3k01P1J88j76q9J51L7j08Q2K3r2JJ33j38K8J61j00q6J41K1k01K1
$$ -57 -116 26 59 -142 -71 117 -59 -148 3 40 -68 14 37 -55 -54 79 -59 -31 130 30 -56 85 106 -95 -74
2720g4K33r0j14J13n1k1L0Jq4R1lj20jQ1L6q0M6K6m9p9J18P9p1Ql8O5K6n5n7R0
$$ -74 159 69 -45 68 17 -4 26 27 -57 34 31 -89 -90 -9 27 -53 -7 19 -30 -109 9 88 17 25 -13 52 78 23 -34 56
2750E6n0m4L5P3k5k6k2OrkN2j08O9ro9j1J69j14j60K39N9j74r6K83j51j10J84
$$ 56 6 -38 -3 70 45 19 -3 3 -6 -8 44 -64 5 -4 -73 -84 85 -29 -189 50 109 -65 -161 122 -29 -139 45
2777D5M4j70QJ86j19n3J10L7j88J27N3j20j9J52p4j93K05R9l19J01J65k3j52K1
$$ 45 89 -81 -73 113 -6 -59 51 88 -100 27 80 -40 -59 93 19 -174 31 130 -189 -88 77 54 -98 -77
2801g7J44q7p5O3Q8m1r1N2P7Jq4J0J11o6j9j8L4R4r2j15J01R6j04j77J79J16k07
$$ -77 67 -20 -95 -32 56 15 -76 -24 53 54 -30 -20 91 25 6 -12 22 116 24 -91 10 106 2 -175 4 120 -87
2828h7n8J69L0k00M8K00q4j07J5Q3MJ5j5q8R0N3r5j6J46o1j55J15J51j49j12J62
$$ -87 -145 24 54 -146 -98 102 18 -89 -74 9 13 28 13 -75 15 68 -27 -43 103 42 -113 2 153 4 -108 54
2854E4O8j67k7K8J22j12q0J14N7j67k0J96N0k27L5Q6LJroJ9O9m8j22J62L8k28
$$ 54 122 -45 -72 -44 78 -34 -114 0 57 -110 -130 66 116 -111 -76 10 13 14 5 -1 18 87 39 -83 79 117 -111
2881a11R7J54n6k41J95J17k16o3J85m7j13M9J00j20J8mJ3K2L9p1K0J08o0p5N3
$$ -111 -14 140 84 -157 38 155 -61 -124 61 14 -99 -50 50 -70 -52 -56 -43 -21 18 -53 -33 75 15 -60 -7
2906gJ41j75o9J54J26j74j6M8L5m5j10J07P8p9j02M1J60j20j98J96J14k16K8J31
$$ -7 134 -41 -110 44 170 -4 -20 28 63 18 -92 15 93 14 -88 -47 113 -7 -205 -9 105 -111 -83 48
2930D8k8o0k5K5L1L0p0k0J51J9k81J25K31j77j75K54J35k19j12J60M7j66O2M2
$$ 48 20 -40 -65 -40 -9 21 -49 -69 82 101 -180 -55 176 -1 -176 78 213 -6 -118 42 89 -77 -15 27
2954B7Qn9o0K0R3P1j80N1J40o5j94J31J72j51j20O9J73j08j27L9J77l5k14J29
$$ 27 35 -24 -84 -64 29 100 -80 -29 111 46 -148 -17 155 4 -116 -47 126 18 -109 -70 107 72 -142 -13
2978a3K50j35j90Q0J46j93o0J20R4j75L6M7l0M8l8m4N1P4q7j17J97M9k26L3K20
$$ -13 237 102 -88 -8 138 -55 -115 5 99 -76 -40 7 -23 25 -13 -57 -6 68 -19 -136 61 110 -116 -83 137
3003A37j04j89J19J61m4r9P2K3lr4O2J5j3q0mL7L5j01%P5Ono8J00O2j06p1J08
$$ 137 33 -156 -37 124 80 -19 53 76 73 -21 41 56 43 -37 -41 -4 31 -70 -70 5 11 6 -62 38 100 -6 -77 31
3031C1O2j34k7J75j06q2M4Q6l1k1O8L9m7N8o9j43J56l0j45J02O8j07p8J67K1j07
$$ 31 93 -41 -68 107 1 -81 -37 49 18 -3 65 104 57 115 46 -97 59 29 -116 -14 54 -53 -131 36 57 -50
3057e0K7J58j12j26J29j5j43J47n2j65J75J09j49J9J30J3j74J75Q9k06OQ7q0j13
$$ -50 -23 135 23 -103 26 11 -132 15 -37 -202 -27 82 -67 -48 82 95 -79 96 185 -21 -15 72 -8 -121
3081a21J36k5r5M0O0lj3R5Kj19Q1M5j03p1R9o5j15J23J09o7KJ02k3r0J30M6j30
$$ -121 15 -10 -105 -65 -5 -8 -21 74 76 -43 38 83 -20 -91 8 -57 -172 -49 60 -7 -5 97 74 -16 114 160 30
3108C0l2N2rj64M6J10j33pJ28Kn2K7Q0q0J4M6n4n4M3J2j41M4J35j00j9K32j2j34
$$ 30 -2 50 41 -123 -77 33 -100 -107 21 23 -29 -2 78 -2 12 58 4 -50 -7 5 -136 -92 43 -57 -76 156 144 10
3136A0N7J79j84j34J38j3j23K2O7r6qQ5k4N8M9j5j55J76k9j73K5J72j58q5Q1R6
$$ 10 67 246 62 -72 66 53 -70 -48 19 -77 -85 0 -24 34 83 68 -87 89 60 -113 -88 84 -74 -159 -78 18
3162A8q4K5P4J7K9M0r9L9lr0m1O6K8j52k1K11oj69R7K02o5j37K2J50r0j20n6M4
$$ 18 -66 -41 33 50 79 119 20 59 56 -34 -75 -9 19 -133 -154 57 51 -118 -21 181 116 -21 1 151 61 -59 -115 -71
3190g1j9o7P5j1J56o0j3J21O0j14n0J20K9k52m2J60N7k99R8K73j47r6J71J06j47
$$ -71 -90 -157 -82 -93 63 3 -10 111 171 57 7 127 156 -96 -138 22 79 -220 -122 151 4 -92 79 185 38
3215C8K0l8J1Mqj48mJ82o8k17K11K07k68k9L60l3k43j7K08j30j96O8P7q6M9j5
$$ 38 58 20 31 35 27 -121 -125 57 -11 -228 -17 190 -78 -107 253 220 -23 -40 168 38 -158 -90 -13 -99 -50 -65
3241f5N1J65L1j54MJ93j51k08J23L8j67n3J92J2j42R1J67k5l9qR5m9l3o0RK0n1
$$ -65 -14 151 182 28 32 225 74 -134 -11 27 -140 -193 -1 11 -131 -40 127 102 63 55 150 101 68 8 17 37 -14
3268a4r8L2R3l3r0P1J46k9r4Q2J36k08j22J21K1j78J0J64k3q3O2J30Kj6j8m8J06
$$ -14 -112 -80 13 -20 -110 -39 107 78 -16 66 202 -6 -128 -7 14 -164 -154 10 -13 -96 -34 96 98 82 64 16 122
3295A22l6j22jQ5j09r7N4J18j6r9K31Qn7o1O9K0r7p2m0N3L7p9J8M0N6j07Q8J11
$$ 122 86 -36 -37 48 -61 -158 -104 14 -2 -101 130 138 81 20 89 109 12 -60 -100 -47 -10 -89 -71 -31 25 -82 6 117
3323A17n1k1J3K6K8j85N6k2j1k4mL1P5J4l3J09j7p8M6lq3p0l0P5l1j0J8K5R7o0
$$ 117 66 45 58 84 112 -73 -17 -39 -50 -74 -78 -47 28 42 9 118 101 23 69 66 -17 -87 -117 -42 -73 -83 -65 -40 57 -3
3353cPM6L5l7p9P0Ml0j01JJ03r0nJ33j7n1N1N0n2N5r1lpQj26M2J03o6l5K2J68
$$ -3 4 50 85 48 -31 39 43 13 -88 -87 16 -74 -79 54 37 -14 37 87 35 90 -1 -4 -11 -3 -129 -87 16 -50 -85 -63 105
3384A05n2jL3K3j55L0O1p5p2J17k4l7R0l4l6Q5Q1j29n5J29m0j70K8J45p3r5O9
$$ 105 53 52 85 108 -47 -17 44 -31 -103 14 -10 -47 43 9 -27 58 139 10 -45 84 44 -126 -98 47 -26 -121 -52
3411e2O4p2K7Q8l3j0K9nn5O9j9j24K1P9j6j00J18N4r0K6P3M3r7n0N9j5k4m0K0
$$ -52 12 -60 -33 55 22 12 41 36 -19 50 31 -93 -72 7 -9 -109 9 63 -27 -1 72 115 18 -32 27 12 -12 -52 -32
3440c2jqk9L4P7o1j1L4P2q1pk9J10n5n2K3N1n0kK1%PM0m2N6m1no7J21Nj59K2Q1
$$ -32 -33 -41 -70 -36 41 -20 -31 3 75 -6 -13 -42 68 13 -39 -16 35 -15 -17 4 4 11 51 9 65 24 19 -48 73 78 -81 -59 22
3473B2j1o0M3M3m0l2N6R7q5l1Rj3K1p4k2O6O0r4m5J49k3p6Q8Q0m3j00J2P8p9p1
$$ 22 11 -49 -6 37 -3 -35 21 118 33 2 11 -2 19 -55 -77 -11 49 -45 -90 59 36 -40 48 128 85 -15 -3 75 -4 -75
3503g5K7M5k4k9m2P1Q5p8n0J36Jr4j2J65j46j9LJ02n1o6L8K1Nk1J%J13l6j46Q0
$$ -75 -48 -3 -27 -56 -98 -27 58 -20 -70 66 67 -27 -39 126 -20 -39 -36 66 15 -51 -13 8 13 -8 -7 -7 106 70 -76 4
3533DP9j12n0Q7Oj05N5L0L9p0OL9N4j01O7Rl4nn5R4j9m5o4Q4J09r2PL7j5j0nK7
$$ 4 83 -29 -79 8 14 -91 -36 -6 33 -37 -31 8 62 -39 28 37 3 -2 -57 37 18 -27 -91 -7 102 10 17 54 39 29 24 51
3565E1K2j21J3K9J4j00O9J3N4n8Oj3O1Oq2j9J36o2j32R1R6r8p8J26L0r4rJ64l9
$$ 51 73 -48 -35 -6 8 -92 -23 -10 44 -14 -8 -21 40 46 -36 -55 81 19 -113 -22 74 -24 -102 24 54 -40 -49 115 76
3594G6jn3N7n2k7k8n2J6J08j31K8J40j17j5J03J7j05j9J17j5j04K0L0Ok0oJ8M2
$$ 76 75 22 79 27 0 -28 -80 -64 44 -87 -59 81 -36 -51 52 69 -36 -55 62 47 -57 -37 -7 -1 -21 -27 -9 33
3622C3J4l3n4R8J0q4J5N3o3o8R2j6m6m5N1P5j2m3J7R1n5m4J12j01n2NpO8n9L0
$$ 33 47 14 -40 58 68 -16 -1 52 -11 -79 13 -3 -49 -94 -43 32 20 -23 -6 85 30 -14 98 -3 -55 -50 -57 11 -48 -18
3652a8L2O7n0n9J8J37j19k0N0j8km6N5oo9pO9m7j3Q6q6Q9M8j13l8J22Np9j6R3
$$ -18 14 81 31 -28 -10 127 8 -12 38 20 18 -28 27 21 -48 -55 14 -33 -46 40 -46 43 91 -22 -60 62 67 -12 -28 65
3682F5j20J5O5%j2k1K8M3l3m4K4O0n5j9j5P6p0n0M6O0j8k5J8K0n4k5M8q5J18l5
$$ 65 -55 -40 25 25 13 -8 20 63 30 -14 10 70 15 -4 -19 57 -13 -63 -17 43 25 0 18 38 -16 -41 7 -78 40 5
3712El9M7Q6p1p2J16m7p0Q1O9j19j5P1o4l2N1J4kL3%n7O5oo4m2Q3l3m9K8L5J0
$$ 5 -34 13 99 28 -44 72 25 -45 36 105 -14 -29 42 -22 -54 -3 11 9 42 42 -15 50 44 -20 -62 21 -12 -61 -33 2 12
3743A2q6R0M8p2j5M6N3n3Jl0M1k1nm5OK7rj8N1l0PK2K3j9o6L0J1k4K1L4k4m7L1
$$ 12 -74 16 64 -8 -23 23 76 23 24 -6 35 14 9 -36 -30 -3 -12 -30 21 -9 -2 20 43 24 -42 -12 -1 -25 -4 30 6 -41 -10
3776a0kO9l1k6LN6p5N5l7j0K2j3k1N5m0mj1M0n4M4K3j8Mm9N7J7j05K5K0J1L5K3
$$ -10 -12 57 26 0 3 59 -16 39 2 -8 14 1 -20 35 -5 -9 -20 20 -34 10 33 15 19 -30 27 44 -61 -36 -16 -5 30 53
3808E3n7m4L3L0Nm2O1k5rNj5m1M3m1J4j3M5L8o7n8J27k6k1k5O8k8mk8L8l4pNm7
$$ 53 -4 -48 -15 15 20 -22 39 14 5 10 -5 -46 -3 -44 -30 -43 2 40 -27 -85 42 16 -5 -30 38 10 6 -22 16 -18 -25 -20 -67
3841f7O1J9n3M4P7n1rL0l7K8j8J1ll0k7L9k8K9m2J8m1M9l7L4J8Rm5jN8m6K9l5
$$ -67 -6 13 -40 4 81 30 21 51 14 42 24 35 32 2 -25 14 -14 15 -27 -9 -50 -1 -38 -4 14 23 -22 -23 35 -11 18 -17
3873a7Pl0M7J7j5K8l6K9Lj3j3M9n2k7J8n7R1p6L4J2NM1pm0K5j7l1M7l7Lm2O4o0
$$ -17 -10 -40 7 24 9 37 1 30 33 20 7 56 4 -23 -5 -62 29 -47 -13 -1 4 45 38 -2 23 6 -25 22 -15 -12 -54 10 -50
3906e0K5N2Mm2N2l0OqK1N5m2Qpn4L2J8m0pk1k5P9l3k5N6k9l4M8OpK6k2m4L4k6
$$ -50 -25 27 31 -11 41 11 17 9 30 85 43 51 44 -10 22 40 0 -7 -28 -53 26 -7 -32 24 -5 -39 9 15 8 34 12 -32 2 -24
3940b4L6j1j8K4M6o0J7Rn1K0M4N0p2M1r1pP6l1j5k0N4n2mnL3L5%l0K2ml4J9k6
$$ -24 12 1 -17 7 53 -7 10 19 -32 -12 32 82 10 51 -40 -47 29 -2 -17 -37 17 -35 -39 -44 -11 24 24 -6 16 12 -22 -3 -29
3973b9M0OK3kr1K0J9L6k1K4l4k3R9r6K2K6j5j6o5N2jkL8k7%ML0k3N8m8j9n0J10
$$ -29 11 17 40 38 -53 -33 -14 22 1 25 -9 -32 67 -29 -7 19 4 -12 -77 -25 -26 -28 10 -17 -17 -13 17 -6 52 4 -15 -65 45
4006D5k1n6M9M1k1J4l9m0J7L0o0L2Q8l1m6K7n2N0M6p6l1L2nnk3L2l9Q4q8QQ4n1
$$ 45 24 -32 17 58 37 51 12 -28 -11 19 -41 -9 79 48 2 29 -23 27 73 -3 -34 -2 -7 -12 -35 -3 -42 42 -46 -38 46 -5
4038eK9ol2m1P9m2K0O4m3l4L7oMl6LmlmL3m6L0JK6k3L6j1l3N3m4l3K5K0j4L6q
$$ -5 24 18 -14 -55 24 -18 2 66 23 -11 26 20 24 -12 -9 -13 -16 -20 13 -33 -3 -2 24 1 37 26 -7 46 2 -31 -6 14 0 36 28
4073B8K9o1N7m6k3K7L1n3MJ2j1l2K0Q8j13L5K5rLj0J1l1O5n6n1J01m1L5o6P8l0
$$ 28 57 -4 53 7 -16 11 42 -11 -7 5 -6 -38 -18 70 -43 -8 17 8 11 1 12 -19 46 -10 -61 40 -1 34 -32 46 16
4104A6Rk6P7l1n8j%O1k0L8o5J0Rn1L0K0m5NJ6l1l5K7P8j1pl0k3K6N1m2qk6O3j8
$$ 16 25 -1 76 45 -13 -14 -14 47 27 65 0 10 19 -32 -2 18 -27 -22 -6 -37 -72 -45 33 22 15 -15 -38 -12 39 -3 -11 -37 26 8
4138HOJ2j3n1O1j5o0K5QK0K2M6q0L8j8j1K6pp3L3L6j7k5Q4Jr3K3J8OK9k2j7LK2
$$ 8 14 26 13 -38 23 8 -52 -27 -19 1 23 69 -11 27 9 -2 24 17 -56 -23 13 -4 -29 55 56 -37 -14 4 10 39 17 0 3 25
4172B5k5K1j5ok2j9P1k0J5k5L5Nl8J4J6jpj6L3ln7j6M7k1j6Qj0M3%nJ3J2k7L4
$$ 25 0 21 6 0 -22 -41 30 10 25 0 35 40 2 16 32 31 24 8 41 38 -19 -35 12 -9 -25 -17 -27 16 16 11 24 36 9 43
4206D3pj3k9N4o7J4K5j3j1nK4L0k8j9j0mm2J8K8nOl6N7L3o9M5k9O0j1jp1Q9p2
$$ 43 36 23 -6 48 -19 -5 20 7 -4 -9 15 45 17 -2 -12 -16 -58 -40 -12 -17 -11 -47 10 43 -26 19 -10 50 39 38 -33 56 -16
4239a6O8m8k2M5k3J1l6L1l2P4q7M2K0j4p5P1k2L8p0L9j3O0J4p0O8k2o%l9N3m5
$$ -16 52 4 -18 27 4 15 -21 10 -22 52 -35 7 27 13 -62 9 -13 25 -45 -6 -19 41 55 -15 53 31 25 25 -14 39 -6
4270fJ5n4J13o0k2K9j4l3M3jo6O1Mj2lJ9%k0KM3n6N0j1j3L0o4K4j8N0rm4N1L3
$$ -6 9 -45 68 8 -14 15 1 -32 11 10 -56 5 9 -3 -6 13 13 -7 -5 38 -18 32 21 8 38 -26 -2 -20 30 21 -23 28 61
4303F1o3K5kpJ2l4jj0M4l9J0J4l1Q0n6n3L3Nj5O3j1o7J8QL3l0K6MJl7R1r1N5m6
$$ 61 -2 23 21 14 26 -8 -9 -19 25 -14 -4 10 -21 59 3 -50 -17 -12 -27 36 25 -42 -24 -16 17 -13 13 17 18 -19 72 -19 36 -10
4337a0J3m1k4J05n5k7P4k8j1M0K1o7k2K9Kk7JL4J9n5J5M1j5J4K4m6K0K4M0q5J8
$$ -10 3 -38 -62 43 -12 -39 35 7 -4 36 57 -10 -32 -3 -1 -28 -27 7 26 -29 -14 27 12 26 50 4 24 48 88 3 21
4368B1k5pK8Oj1KN8q3J3j6J1k6KRPk3M9J5rK2m7j8k6M3j9J5%J0K7n0m4R8l0L9
$$ 21 -4 -11 17 23 12 14 72 -11 2 -14 -3 -29 -27 -18 -11 -34 15 30 21 43 -4 -22 -48 -5 -24 -9 -9 1 28 -22 -66 32 2 41
4402D1rM1n2Pl2j4K8m0N2m1K6K6k5nJ3pmopj4oL2l2nO3J8lo8J9J8k4n3M8RJ3o8
$$ 41 32 73 21 28 -4 -18 10 -30 22 -19 7 33 8 3 16 9 5 -1 -8 -22 -28 4 -28 -33 30 48 45 -23 -4 14 -10 -63 -15 -6 7 -61
4438f1M2K6m2K8K1L9o8l3N7N7o4jk8L4L3n2K7j2K8jJ3m9M4k5J7k5oP3j17Q5n3
$$ -61 -19 7 -35 -7 14 53 -15 -48 9 66 2 1 -27 7 40 -12 15 3 31 30 43 -6 38 13 30 5 -1 72 -45 40 -13
4469a3N9J3m1p1Q7l5MJk9N2j5lJ6o4L9O2p7MOk4M6L6q2O3r5O9K1m0K3nl0%j3m
$$ -13 46 59 18 -53 34 -1 3 4 -25 27 12 9 25 -39 0 62 -15 -11 -5 -29 17 53 -29 34 -61 8 29 -11 12 7 -23 -23 -36 -40
4503d0K2K1j1KK7m0%K5k1l5Q0j9l2l4N3j3k0P8o6L3j7J0K2j6lM9o7j8K2l1J1K2
$$ -40 -18 3 -8 -6 21 -19 -19 6 -15 -50 30 11 -21 -55 -2 -15 -35 43 -23 10 -7 3 25 9 6 55 -12 -30 -8 -39 -28 -6
4535fj4k6M4qNL9J4m2l9J8M6n4M6Ll8K7o6M1ql0R1l4j1k6N9j4m8m7R5rM6o1J1
$$ -6 -20 -46 -2 -10 -5 34 48 6 -33 -15 31 -23 23 26 -12 15 -51 -10 -18 -48 43 9 -2 -28 31 17 -31 -78 17 8 54 -7 4
4568DJL0o0j5J4LK1K9o8N3l6mL7J7J6n3JM6j6k1K5QPn2M3j2l1j7J6N3Mm6L2k3
$$ 4 5 35 -25 -40 -26 -23 -2 27 -41 12 -24 -28 9 26 42 -11 -10 36 20 -1 24 32 39 -13 30 18 -13 -30 -14 39 43 -3 29 6
4602Flj0O2m1Lj5J0k3j7KO8j01N1N1j7jjl0N4k3k8K8L0l9n8N7j4k5O4l1j7Qj9
$$ 6 3 -7 55 14 17 2 12 -11 -28 -26 42 -59 -8 43 26 25 24 -6 48 25 -3 25 55 16 -42 15 1 -24 40 9 -8 0 -19
4635a9J2J8j7K6m2M8k8j5LQl1oqM6J7j8l4j0N7OL7l7L0p4Oj0j2M5L0k2K6m6K8
$$ -19 -7 11 -6 20 -22 26 -2 -17 -14 -6 -37 -43 -51 -5 12 -6 -40 -50 7 13 50 13 43 -31 -25 -35 -47 -2 28 6 32 -14 14
4668A4M7n5Nj2j9%N6k7k1P5o5rm6O1Om8J6L1k2mJJ7k8M2m3Q2m7J1m4JK2J1j2j4
$$ 14 61 6 11 -1 -20 -20 36 9 -12 63 -2 -11 -57 4 10 -38 -22 9 -13 -17 -16 1 -27 15 -28 54 7 18 -26 -25 -3 8 -4 -18
4702a8nK3k3L4J6q4L0K4L7q8K4O8J5k1p1N6j7mJ9k4k8N6j5k7l5O0l4NQ7p2K1l8
$$ -18 -23 0 -23 11 27 -57 -27 -3 34 -54 -30 38 53 32 -39 17 0 -4 15 -9 -37 19 4 -23 -58 2 -32 -27 60 -12 9 -29
4734b9%K7j6K7k4mN0j6m0JL3l2pM2Qj4lpP9j00J0K2J6j7J6J4l9k4M3j1N6m6k7
$$ -29 -29 -2 -18 9 -15 -19 31 15 -25 -24 9 -23 -30 12 20 6 3 -4 75 -25 -15 7 23 6 22 36 -3 -27 16 5 61 15 -12
4767a2M7l2j7O1n1p0J02p0L0K8J3n2O2ml6M1j9l8N0n4N7p6M6k0J1k9L5P3r2j0
$$ -12 35 3 -14 47 -4 -74 28 -42 -12 16 29 -23 39 35 -1 40 21 -17 33 -21 36 -40 6 -14 -3 -32 3 76 -16 -26
4797b6kK4P2q2J9oK7j1Oj9J8rn5M4ROOn2O4j6J4m5K6o2N7o5J7O2Ln1Q3q9k6L5
$$ -26 -28 -4 68 -14 5 -1 26 15 21 2 20 11 -44 0 9 15 21 -31 33 17 31 -14 12 -50 7 -58 -41 21 24 -27 56 -33 -59 -24
4831b4K9K4j5M0r9O3k8k3N8J8q9N9L9k1n3J6M1k1L1k8l0K7K5J6p4O7r0K5RK8k7
$$ -24 5 29 14 54 -45 18 -10 -33 25 43 -46 13 52 31 -22 -6 35 14 45 17 -13 14 39 55 -19 48 -42 -17 -8 20 -7
4862gJ9km6lN8Pl4M8r8O6Kl3M7q2O6L5n2K7k3lo4J15l7M5p9j3O9oj5PPLm6L1J3
$$ -7 12 10 -36 -39 19 26 -8 40 -58 8 10 -23 24 -58 8 43 -9 18 -5 -8 -72 43 6 51 -28 -41 28 22 7 14 21 24 -22 9 22
4897B2j3L9m4n6K2RJK2OK9p1K0j4R7p8J9J5p3O5j5L3j2m5K4MNJ8%k9J9K1n7NK
$$ 22 9 48 4 -52 -30 -21 -20 2 8 37 -34 -14 -28 69 -9 10 25 -48 17 2 35 23 -22 2 6 11 29 29 0 19 40 -17 -12 -10
4931a0j1ON2l3l1L1L8o5Lj0Q0o4oO3ll8Pl1L4l0jKK6N1n1m1P0k1j8J8j1j9k4J5
$$ -10 -21 -15 37 4 -27 4 42 -23 -20 -30 50 -14 -20 43 40 2 9 -22 12 -18 -19 -17 9 60 9 -32 38 17 -1 17 6 -13 -37 -22
4965b2L0Okj0Mj5N1m5MN4m2mj7k7M6ol1N2m7N1n6N3l2K2Mk6j5L7M3m6l3m1M8K6
$$ -22 8 14 12 2 6 -9 42 -3 1 55 13 9 -8 -35 11 5 -26 26 -21 30 -26 27 -5 17 21 -5 -20 17 60 14 -19 -60 -12 14
4999A4kj5O3Kn1m2k5N5j8%j9PKK4K5l4J9PK9m0kK6o9P7n7J8N1o5j8%O5n4PM0j9
$$ 14 12 -3 60 62 11 -31 -56 -1 -19 -19 -38 -31 -29 -5 20 -14 5 12 41 1 -1 25 -44 33 -24 -6 45 -20 -38 -38 27 -27 -20 20 1
5034AoLM4K5n4k5J1pk9N2Mj3n2L4K6pk8L1M9p7k7K3j5K0n2J09n5jO2q2M4l5LO8
$$ 1 -5 -2 42 67 13 -12 -1 -8 -37 15 19 6 -46 -12 14 7 -21 10 59 -18 -45 -22 -37 -17 -69 40 -15 -16 46 -36 8 -27 -24 44
5068D4o2K3K4n5O6n2K0J5k8j8K9NOJ3o4O6r4L3J8K4Nk5J1J5k0Ok6O7l3k4K2N6
$$ 44 -18 5 29 -26 40 -12 8 23 -5 -23 6 11 17 30 -34 32 -62 -29 -11 13 18 -7 4 19 -1 5 -21 46 13 -11 11 67
5100F7p7Mj3jK0ROl7K2L9o7J9J2qK8J3m6k1N6m8KN3J4ro9N2l7J5J7QK7j1j9L8
$$ 67 -10 -6 -19 -20 0 9 15 -22 0 39 -28 -9 3 -5 23 36 -10 -31 25 -23 -21 32 46 37 -32 20 -17 -2 15 23 50 39 20 58
5134E8o7Ml5NNR2n9k4JM6K5l4k0oRK9k1n0N3m4J7L4Knpl2P8j5m0k0J7J2Ol1Oj4
$$ 58 -9 -5 -40 -35 -30 62 3 -21 -20 26 51 17 -3 -9 0 29 8 -42 11 -33 -16 18 20 15 8 -24 54 39 -1 -21 -4 8 14 -17 -11 -25
5170b5Q2k2J1k2l1lK1%o5Q1lrk5Oj9M9j9p1K8lK7L4k0K8l2p2P0l1M6j2K4o7k0
$$ -25 57 35 46 24 -7 -10 11 11 -54 27 24 15 -10 -4 -23 26 7 -64 -36 -39 -12 22 2 30 -2 -74 -4 -35 11 -1 23 -44 -64
5203f4N4pPL7p0M2Qj3L0k9M3o0%L2Pk8jqk3Q2m6J6j9M4n7Pj4N4nm7pM8k4m0N6
$$ -64 -10 -17 -10 27 -43 -1 7 -6 24 -5 38 -22 -22 10 17 -11 -12 -20 -43 39 -7 9 -10 34 -23 -16 -30 24 19 -28 -35 13 -11 -51 5
5238EOkn1N7j8P1k8k6rRmL5m5l2Q0m4k4k6R3p5M6l1k9O4J4rMK1l0N6n9o9Q7p9
$$ 5 11 9 -42 15 -3 68 40 14 5 14 10 45 0 -32 48 4 -20 -46 47 -28 18 -13 -42 22 36 27 31 52 22 78 19 -50 37 -42
5272d2Q9m4j3Kl2N0J9l0%J0l5L9LOr1R9J2m2kj0rL8q0N0oPl4k3J11l3o6L1P3k6
$$ -42 47 3 -10 -8 -40 10 29 -1 -1 9 -26 13 16 22 -69 30 42 0 -2 -12 -21 17 -63 -13 -19 -12 -46 -69 42 9 -57 -26 47 21
5306B1m7L8k3lQ0r0J21q4k6J0%K2lm8M8m5O1m4L5k6N7o2l2N1kqk6J8NJK4L5l0
$$ 21 -26 12 -11 -14 66 -24 97 13 -13 -3 -3 19 16 -32 16 -29 32 -12 23 -3 54 -8 -40 11 9 1 -25 -7 -2 -1 23 58 28
5339B8j4Jm3J6N0l2L7o4j4J4j0L2nMjJ0Ll9j2N9K2k1j6m3J08k1n3N2n3pJ1jk5
$$ 28 14 15 -28 -12 38 6 43 -21 -35 -21 -31 1 -4 0 -1 9 12 -27 -39 20 42 21 5 -38 70 49 -4 48 -5 -12 -1 -2 -27
5372b7K4j5K9j9J8k0Kl1nrP0Pq1O5j0l0J9N1Ll3nmJ6ok1K2L4l2J1j2k6M0k2j2
$$ -27 -3 -18 11 -8 10 -10 -8 -39 -44 -53 17 24 -57 8 -2 -32 -13 38 41 8 3 -1 15 9 -12 10 44 12 23 11 -15 25 3 -9
5406iM1n4j0nN0K0pLk9k3k1N0oRO1o8rKkJ3j0L7l0OK6qj2lRJ5rl5k3P7j25N6N0
$$ -9 32 -22 -32 -37 13 33 26 29 0 -23 -44 6 0 9 70 2 -7 -5 -7 6 -4 33 3 9 35 27 15 12 21 36 27 -8 -31 46 -79 -23 27
5443B7om7J9k1Qk1rN2M4m9L2o7j0K1JN0J1n5k8O1n1pL7k7K2L3mk8n1J51p4j6p
$$ 27 21 -26 -7 -28 -20 -41 -50 2 46 -3 29 -38 -48 -27 -26 24 35 -20 -48 13 -38 -45 -8 -35 -13 20 16 -12 -63 88 14 -2 -9
5476ik2N3Kk9m0J01o5M9ml0J8k6K4j8j9n9Q8k1J2j7jN4j1q3J03o3lJ7Rmj4k5N0
$$ -9 -31 22 24 -5 -45 56 -9 40 36 6 24 -2 22 4 -15 -74 14 -7 5 -12 -13 41 30 -53 50 -13 -16 1 10 6 -8 -33 17
5509A7l3k7L7M0j2Qp6M7K1k3J2k7L9k8l4OL4Mm7O4k8O6k4M2o1k6L5k6j3K8jl3
$$ 17 -16 -43 -6 34 22 30 -46 1 22 -1 11 -16 23 -5 -39 -33 1 5 -42 22 -6 60 36 78 17 -9 26 0 -13 15 14 -19
5541a9P3p1O9q2j8K4k6P3l7Om6M3O4l6l8LK5oL0nm0j8L4j2J5M6p7J8m3O9J8o2
$$ -19 54 -17 52 -30 -48 -24 -50 23 -14 -8 -54 -11 53 17 -21 -18 7 1 31 26 -14 -32 2 -10 5 51 -26 -8 -51 18 36 -26
5573b6K1jK4p1O3K1m7L6N2q4J0J6m0kM5o6K9L7m4NJ2K3o5L6N6n9J4M7r3N1j0q
$$ -26 -5 -6 18 -53 10 31 -16 20 72 -12 -2 14 -26 -28 17 -49 -20 17 -27 -22 -10 13 -52 -16 40 -19 -5 42 -51 0 -10 -18
5605a8N2n8M4Pn7LL8l4K2m9R6o5O0p2MO2j7j8j1KK7k5m2J2j6QJ4J21j54L2M3l2
$$ -18 34 -24 20 27 -30 -27 11 -23 -1 -50 46 -19 41 -31 -27 35 18 0 -11 -9 18 -7 -49 -37 -53 -45 -31 90 -64 -32 11 -21
5637b1M1l2j8P4m2m3L9K7j9N2o0k2k2Q0pk9Rj0L1n3R8r5k2R5o1M7j7j6%l1K2R
$$ -21 20 -12 -30 44 2 -41 -2 25 6 58 -2 -24 -46 34 27 -2 7 -3 28 -25 73 -22 -44 51 -10 37 20 4 4 -27 -5 4
5669Dk7K9jJ5l6j9J3K9ll0JK7K5l4M0o3P7k8j8L2k4O2n9o6M8j2L1K3m5J8Rj3m
$$ 4 -23 6 5 20 -16 -35 -22 7 4 -26 -25 2 27 -7 33 -30 47 19 1 33 9 71 12 -54 -6 -18 13 36 -9 9 18 5 1
5702Aj8NOk6L4K5m8M1m3j8O3m7kM6k9J7MO7p6K9o9LJ3J1k2%O4j9MQm5KK0k0j5
$$ 1 -17 -12 -6 -32 2 27 -21 20 -23 -41 22 -25 -27 19 -10 7 11 78 2 31 -38 -35 -22 -11 -33 -33 31 12 16 24 -21 -19 1 -19 -34
5737c4J2L4m0L9n7P1j4j7j0J0N0J8m3Ql9J8m1N7k4L9j5k2l9k1M3lO0j07P0k5M1
$$ -34 -22 12 -28 11 -46 25 11 -6 -16 -6 44 62 19 27 -12 6 -35 22 -2 37 22 0 -39 -60 -17 -20 40 -67 3 -22 19
5768A9q3Q7K4k1j6nM4l3l3k9J11k7pp8L2L1J0l9j4M7m6J2P0p6%OrK9m5M9l1N6
$$ 19 -64 23 47 26 10 5 49 16 -17 -46 65 38 31 -47 -15 16 26 -13 -27 20 -26 -14 56 -20 -20 -14 -23 6 -39 10 -21 35
5800C5k6k5J0Om4J20j00M4j7j5M9n7J6J7p5Q5J4n9L3O1o2K9n3J1L7l7oL1J5p6
$$ 35 9 -16 -6 0 -44 76 -24 20 3 -12 37 -20 -4 13 -62 23 37 -22 11 72 10 39 -14 -3 34 -3 -9 22 37 -39
5830c9N7m5K6pnJ4m4P8j6J1l2noj3M6l6O5q4J4%J6l6M7j4MJ9l5O3r4L7Q6o0rl0
$$ -39 18 -27 -1 -8 -13 1 -43 35 19 30 -2 -7 -13 -26 20 -16 49 -35 -21 -21 -5 -41 6 -8 -4 15 -20 43 -51 -14 72 12 3 -27
5864b7MO0p2N1L3p2N0j0k5L2Rm5nj7M6J0j1k7P3rn3Pl8J3PQj3j4J02m9lJ3j7l
$$ -27 -23 37 -35 16 49 -23 27 17 -8 24 33 -12 -17 -34 12 22 11 -16 57 48 -5 2 -36 -23 -16 -8 -21 -35 67 18 15 28 11 8
5898HRN0m7k8J4n2J08j32J05k4n0N3j1J3J6l3L4j5j3kj6K1J2j8j1kML4k2j2L3
$$ 8 17 67 20 -8 6 -46 62 -70 35 11 -39 14 3 16 32 -1 33 18 5 3 -13 8 20 2 -9 -11 -7 27 5 -7 26
5929B6jK4j12J04j5j7k4lLj1N2k8k6k1M1M2p8N1Rm0Qm6J02l0K8n6M0KoK1k2k2
$$ 26 25 49 -63 41 26 9 -15 -18 -15 -26 26 -2 -28 -49 -8 34 -44 7 16 -24 -16 -62 40 10 38 -18 22 24 18 39 17 -5
5961eRPk2l0P2o1L0j0j5PPL0m8Q1r2M2MK1k4L1k5P0j26K0j0J9L8qn9P9K3m8qk
$$ -5 4 11 -11 -41 31 -30 0 -10 -25 -18 -11 19 -29 52 -40 2 6 27 3 34 9 79 -47 -27 -37 -18 20 12 -47 32 55 7 -1 -3
5995cmL1K0p5M8j8J1l6N4j4k5n2J09k2jj7rl9N8ln6P1n2M2j0K0q9O3m6J9P7n3
$$ -3 -7 24 44 -31 17 -1 10 -26 28 14 -11 -63 46 24 23 6 -3 -42 16 13 -43 28 -24 18 8 28 -61 2 -44 -25 52 -1
6027am2M3j7K5o2M7m%L5k1m2J4J5k5O0k4J2qo8P4l1l5O9J8m1k1O8m1m5M8kj7O0
$$ -1 -43 0 -17 8 -54 -7 -11 -11 24 3 -39 -25 -10 -35 25 1 13 5 -63 11 -20 -55 14 32 -9 -30 38 -3 -48 0 -2 -19 41
6060D1n4K0J1L0l4n9J12o7j1Ml0P3l1J0m1O2l9n2PP0n1L1qRmJ3j8j5j5j1K3L9
$$ 41 -13 7 18 48 14 -45 67 0 -11 -7 -37 36 5 15 -26 36 -3 -55 -48 22 -29 2 -6 3 -1 12 -6 -21 -36 -47 -24 15
6092A5j8j7J0jJ1k6L8n1L6Ll9N0J2mm6M7r1L5L1O7p0O6r3O6l9rK1J5l4J1k0O5
$$ 15 -3 -20 -10 -11 0 -26 12 -39 -3 0 -39 11 23 19 -27 20 -71 -36 -5 62 -8 58 -35 31 -8 -17 4 19 -15 -4 -24 41
6124D1k5l0M7n6R4q7O8q0P8k3Jn5L9J8m3l6L6mj0K1P4o2j9K4qJ0K2n0L4p6R1n
$$ 41 16 -14 33 -23 71 -16 52 -28 50 27 28 -27 12 30 -13 -49 -13 -17 -27 -6 68 6 -13 11 3 13 35 -15 19 -57 34 29
6156B9%L2k5m0M0l5j5kj2N9q2M2J2k6K2K1m3RM5jj4qK9Kk8n2M2j9j7P9l8ql9M5
$$ 29 29 61 36 -4 36 1 -14 -16 -28 31 -51 -9 3 -23 -1 20 -23 -14 31 30 16 8 37 39 11 -41 1 -18 -35 44 6 -2 -41 4
6190DrJ8%Qonk3k8K5M1n5K1j6M9pj3k0M5jl0L9j7j6k1K7j4L8l1J9J1k8m0K6K8
$$ 4 -5 13 13 21 15 10 -13 -41 -16 25 -30 -9 -25 24 17 4 -16 29 28 -2 37 20 4 -17 10 -4 34 3 22 33 5 -35 -9 19
6224A9k2K2k7O2l2k2k2j8Q3Jm2L8l6J0n3P4k8j8N3l8L8kp9RN2o3Rk5N5l4L5M0
$$ 19 -3 19 -8 54 22 0 -22 -40 43 44 2 40 4 14 -39 35 7 -11 42 4 42 40 -39 -30 22 -41 -32 -57 -2 -36 -1 39
6256C9k0ml5jK2%m7P3l4Q5j20j4J12q3K7Oj6J6k4n1R5k1JJ2mn6Q0n6%J7L7k8M5
$$ 39 19 15 -20 -21 1 1 -46 27 -7 78 -42 -56 56 -27 0 6 -10 6 -18 -69 26 5 6 18 14 -42 38 -18 -18 -1 36 8 53
6289E3m9M1j1o2K2K2k0q1R8L4l3l4RM1p2J6N2l7m0JL0J6K9j6k2mqK8kl7MK3Rl4
$$ 53 4 45 34 -28 -6 16 -4 -85 13 47 14 -20 -11 30 -42 -26 26 -11 -51 -50 -20 -4 25 9 -13 -17 -25 3 1 -36 -32 -9 0 -34
6323c4mO6j5kko4Q8q1L3nrL1j1L9k%l1L1lnLj7L8p4kO9L9q2K8k1l7K9mN3j9o7
$$ -34 -38 28 13 11 9 -55 33 -48 -15 -20 -29 2 -9 30 28 28 -3 28 25 20 23 6 44 -30 -32 37 76 -6 22 1 -36 -7 -11 42 23 -44
6359d4J5J2JOj0K9k4K8K1q5K7L7k3k7Q0n7K6MJ7l6N1j9M1p7J8l0J8J7%K1k0l4
$$ -44 -29 -17 -16 -10 -20 9 -15 13 34 -51 -24 13 -10 -37 43 -14 12 16 33 -3 48 29 70 -7 11 -19 -1 16 16 37 17 -17
6391a7j7O6l4k2M4k0K7j0KJ5Kj7l8k1K5m6M6L1n0M7o4O8j0L8k1p0j3K1L5L6j9
$$ -17 -34 32 -2 -24 20 0 27 17 19 34 36 19 -19 -40 -15 -61 -15 16 -34 13 -51 17 7 45 24 -46 -59 -38 -3 33 14
6422A4j9K2L7k0J0n2m3N0qN1p8R2o5k0m1L3N6kj8m1N1k2PM5l5L5o7J4K4Qk5j6
$$ 14 -5 17 54 34 44 -8 -51 -1 -9 42 -36 56 -9 -29 -70 -37 19 17 -1 -42 9 -13 -6 39 4 39 -28 -14 10 18 -7 -23
6454b3L9Nj2RJ2k3j8k9M5%N4r0P4pn2M2ml7K0L8n2l1P1n7QM0j5o4O9Rr8O4nJ6
$$ -23 16 21 9 18 30 7 -11 -40 5 5 59 -31 43 36 -16 26 22 -15 5 43 -9 -40 31 -26 -18 22 7 -57 12 21 -77 -13 -18 -2
6488bm7M0oqJ5j4J2PLk0M0k5J03m2o3L3n3M1k9m1R0o9mP1rj6J2J5m7J9L2K5q3
$$ -2 -49 -9 -15 -23 -8 -22 -10 -3 0 -20 20 -5 98 56 -7 26 -27 14 -15 -56 34 -35 -39 32 23 7 19 34 -13 6 38 63 -20
6521b0K4l1K0mJ5j9M6o6N5K0k0k6%J8ppN6q4L6k9j6O8K1l9l5qJ2L1Kk5M7k7Nk8
$$ -20 4 -27 -7 -11 4 -15 31 -35 20 40 20 -6 -6 12 5 -2 54 -30 6 -23 -39 29 50 11 -24 -32 -20 11 13 -12 35 8 13 -15
6555a5M6m0J2L5n8L3K6k2mj1k4J8l3N5k7k2J1K1L2o1M5jK3n4O0Pn9QmP0j09K2
$$ -15 31 -9 3 38 -20 13 39 17 13 2 -22 -4 -37 18 -9 -31 -20 1 33 -28 17 16 39 -15 45 52 -7 1 -3 67 -42 -20
6587b0J0L0K1l8KMjrl4O8o9MOKM2L7p9KJ8KM4j8p3N2Ok5J9J2oj8l9RkM9K5l9l
$$ -20 -10 20 41 3 5 9 8 -1 -35 33 -36 -32 -26 -24 18 55 -24 -22 -4 -2 42 24 -49 3 9 -16 3 15 9 -9 -48 -39 -41 8 33 -6 -9
6624iL7Lq3K1K2M6mKl0K3J5Pl8jk7QL1K0j2k6Ol2O6j1o4J8km2M6oO8n0qK0rJ4
$$ -9 28 31 -52 -31 -9 37 33 35 5 28 43 50 12 11 -16 -8 23 43 31 5 11 -21 45 34 -30 -12 -14 -56 -10 -16 52 2 -6 14 5 19
6660A9m9N2J7qL4m5qJ7m2J4jLl3L4N1k7n4K1PJ4L7o9K3k1N2l0K5j8m1L2k1L9j4
$$ 19 -30 22 39 31 65 20 12 29 -13 1 0 3 -30 4 55 28 -26 -5 2 16 53 -16 7 -14 38 8 33 15 -26 6 -15 24 10
6693A0j0J6k1K4j3J8m8M8n9M2Prj2j9l2P2L3l2j3lL9k0rj5nm1O1j4K2m2K5nk7
$$ 10 0 16 -5 19 6 24 -24 24 -35 7 14 5 -7 -26 -58 14 47 15 2 -1 38 18 9 -6 -11 -52 9 -5 17 -25 0 -5 -32
6726c2L2k2%J7OJ4m6J15p4m2O4n0J7K5L3n2l9K5mNj0J9M7l7M1n9LK6l9l7L7N5
$$ -32 0 -22 -22 -5 1 15 -31 84 10 -32 32 -18 -1 24 57 5 -34 -9 -13 -8 -18 1 48 11 52 -7 -4 22 -17 -54 -17 38
$$ [...]
8191A7
##END NTUPLES=NMR FID
##END=
