##TITLE=1H_AM_NV63
 CDCl3
 8 sc, 
 4.10.2023
##JCAMPDX= 6.0         $$ Bruker NMR JCAMP-DX V2.0
##DATA TYPE= NMR FID
##DATA CLASS= NTUPLES
##ORIGIN= UXNMR, Bruker Analytische Messtechnik GmbH
##OWNER= root
$$ XWIN-NMR		Version 3.5
$$ Wed Oct  4 16:24:25 2023 Russian Standard Time (UT+4h)  she@DPX200
##.OBSERVE FREQUENCY= 200.13135
##.OBSERVE NUCLEUS= ^1H
##.DELAY= (6, 6)
##.ACQUISITION MODE= SIMULTANEOUS
##.ACQUISITION SCHEME= undefined
##.AVERAGES= 8
##.DIGITISER RES= 18
##SPECTROMETER/DATA SYSTEM= spect
##.PULSE SEQUENCE= zg30
##.SOLVENT NAME= D2O
##.SHIFT REFERENCE= (INTERNAL, D2O, 0, 15.7039)
##AUDIT TRAIL= $$ (NUMBER, WHEN, WHO, WHERE, WHAT)
$$ ##TITLE= Audit trail, XWIN-NMR		Version 3.5
$$ ##JCAMPDX= 5.01
$$ ##ORIGIN= Bruker BioSpin GmbH
$$ ##OWNER= she
$$ F:/spectra/data/she/nmr/H-F/1/audita.txt
$$ ##AUDIT TRAIL=  $$ (NUMBER, WHEN, WHO, WHERE, WHAT)
(   1,<2023-10-04 16:23:03.04 +0400>,<she>,<DPX200>,
      <created by zg, POWCHK disabled, PULCHK disabled
       configuration hash MD5:
       00 E9 B6 7A A2 85 ED C7 34 08 36 98 17 FE 4E 26
       data hash MD5: 16K
       3E 6E E7 84 CB C4 80 33 C5 FC 4C D5 15 D2 90 BA>)
$$ ##END=
$$ 
$$ hash MD5
$$ 65 C5 23 A4 A6 31 1B 5E 71 2A 4C 45 39 A0 BD 5A
##$RELAX= 
##$RELAX= 
##$RELAX= 
##$RELAX= 
##$RELAX= 
##$RELAX= 
$$ Bruker specific parameters
$$ --------------------------
##$DU= <F:/spectra>
##$EXPNO= 1
##$NAME= <H-F>
##$PROCNO= 1
##$TYPE= <nmr>
##$USER= <she>
##$AMP= (0..31)
100 100 100 100 100 100 100 100 100 100 100 100 100 100 100 100 100 100 
100 100 100 100 100 100 100 100 100 100 100 100 100 100 
##$AQSEQ= 0
##$AQ_mod= 1
##$AUNM= <au_zg>
##$AUTOPOS= <>
##$BF1= 200.13
##$BF2= 200.13
##$BF3= 200.13
##$BF4= 200.13
##$BF5= 200.13
##$BF6= 200.13
##$BF7= 200.13
##$BF8= 200.13
##$BYTORDA= 1
##$CFDGTYP= 0
##$CFRGTYP= 5
##$CHEMSTR= <none>
##$CNST= (0..31)
1 1 145 1 1 1 1 1 1 1 1 1 1 1 1 1 1 1 1 1 1 1 1 1 1 1 1 1 1 1 1 1 
##$CPDPRG= <>
##$CPDPRG1= <>
##$CPDPRG2= <>
##$CPDPRG3= <>
##$CPDPRG4= <mlev>
##$CPDPRG5= <mlev>
##$CPDPRG6= <mlev>
##$CPDPRG7= <mlev>
##$CPDPRG8= <mlev>
##$CPDPRGB= <>
##$CPDPRGT= <>
##$D= (0..31)
0 1.2 0 0 0 0 0 0 0 0.06 0 0.03 0 0 0 0 0.0002 0 0 0 0 0 0 0 0 0 0 0 0 
0 0 0 
##$DATE= 1696422182
##$DBL= (0..7)
120 120 120 120 120 120 120 120 
##$DBP= (0..7)
150 150 150 150 150 150 150 150 
##$DBP07= 0
##$DBPNAM0= <>
##$DBPNAM1= <>
##$DBPNAM2= <>
##$DBPNAM3= <>
##$DBPNAM4= <>
##$DBPNAM5= <>
##$DBPNAM6= <>
##$DBPNAM7= <>
##$DBPOAL= (0..7)
0.5 0.5 0.5 0.5 0.5 0.5 0.5 0.5 
##$DBPOFFS= (0..7)
0 0 0 0 0 0 0 0 
##$DE= 6
##$DECBNUC= <off>
##$DECIM= 32
##$DECNUC= <off>
##$DECSTAT= 4
##$DIGMOD= 1
##$DIGTYP= 9
##$DL= (0..7)
0 120 120 120 120 120 120 120 
##$DP= (0..7)
150 150 150 150 150 150 150 150 
##$DP07= 0
##$DPNAME0= <>
##$DPNAME1= <>
##$DPNAME2= <>
##$DPNAME3= <>
##$DPNAME4= <>
##$DPNAME5= <>
##$DPNAME6= <>
##$DPNAME7= <>
##$DPOAL= (0..7)
0.5 0.5 0.5 0.5 0.5 0.5 0.5 0.5 
##$DPOFFS= (0..7)
0 0 0 0 0 0 0 0 
##$DQDMODE= 0
##$DR= 18
##$DS= 0
##$DSLIST= <SSSSSSSSSSSSSSS>
##$DSPFIRM= 0
$$ [...]
##$SUBNAM1= <"">
##$SUBNAM2= <"">
##$SUBNAM3= <"">
##$SUBNAM4= <"">
##$SUBNAM5= <"">
##$SUBNAM6= <"">
##$SUBNAM7= <"">
##$SUBNAM8= <"">
##$SUBNAM9= <"">
##$SW= 18.05172834244
##$SWIBOX= (0..15)
0 0 2 0 0 0 0 0 0 0 0 0 0 0 0 0 
##$SW_h= 3612.71676300578
##$TD= 16384
##$TD0= 1
##$TE= 0
##$TE2= 300
##$TE3= 300
##$TEG= 300
##$TL= (0..7)
0 120 120 120 120 120 120 120 
##$TP= (0..7)
150 150 150 150 150 150 150 150 
##$TP07= 0
##$TPNAME0= <>
##$TPNAME1= <>
##$TPNAME2= <>
##$TPNAME3= <>
##$TPNAME4= <>
##$TPNAME5= <>
##$TPNAME6= <>
##$TPNAME7= <>
##$TPOAL= (0..7)
0.5 0.5 0.5 0.5 0.5 0.5 0.5 0.5 
##$TPOFFS= (0..7)
0 0 0 0 0 0 0 0 
##$TUNHIN= 0
##$TUNHOUT= 0
##$TUNXOUT= 0
##$USERA1= <user>
##$USERA2= <user>
##$USERA3= <user>
##$USERA4= <user>
##$USERA5= <user>
##$V9= 5
##$VALIST= <valist>
##$VCLIST= <CCCCCCCCCCCCCCC>
##$VD= 0
##$VDLIST= <DDDDDDDDDDDDDDD>
##$VPLIST= <PPPPPPPPPPPPPPP>
##$VTLIST= <TTTTTTTTTTTTTTT>
##$WBST= 1024
##$WBSW= 4
##$XGAIN= (0..3)
0 0 0 0 
##$XL= 0
##$YL= 0
##$YMAX_a= 3390
##$YMIN_a= -1688
##$ZGOPTNS= <>
##$ZL1= 120
##$ZL2= 120
##$ZL3= 120
##$ZL4= 120
##$ABSF1= 10
##$ABSF2= 0
##$ABSG= 5
##$ABSL= 3
##$ALPHA= 0
##$AQORDER= 0
##$ASSFAC= 0
##$ASSFACI= 0
##$ASSFACX= 0
##$ASSWID= 0
##$AUNMP= <proc_1d>
##$AZFE= 0.1
##$AZFW= 0.1
##$BCFW= 1
##$BC_mod= 2
##$BYTORDP= 1
##$COROFFS= 0
##$CY= 11.3945322036743
##$DATMOD= 1
##$DC= 2
##$DFILT= <>
##$DTYPP= 0
##$F1P= 15.7292609196834
##$F2P= 12.9074282941183
##$FCOR= 0.5
##$FTSIZE= 0
##$FT_mod= 4
##$GAMMA= 1
##$GB= 0.15
##$INTBC= 1
##$INTSCL= 1
##$ISEN= 128
##$LB= 0.24
##$LEV0= 0
##$LPBIN= 0
##$MAXI= 10000
##$MC2= 0
##$MEAN= 0
##$ME_mod= 0
##$MI= 1.114404
##$NCOEF= 0
##$NC_proc= 0
##$NLEV= 6
##$NOISF1= 3.799351
##$NOISF2= 2.8
##$NSP= 1
##$NTH_PI= 0
##$NZP= 0
##$OFFSET= 15.70392
##$PC= 1
##$PHC0= -21855.53
##$PHC1= -9.34729
##$PH_mod= 1
##$PKNL= yes
##$PPARMOD= 0
##$PSCAL= 0
##$PSIGN= 0
##$REVERSE= no
##$SF= 200.130013532006
##$SI= 16384
##$SIGF1= 3
##$SIGF2= 2
##$SINO= 400
##$SIOLD= 16384
##$SREGLST= <1H.CDCl3>
##$SSB= 0
##$STSI= 0
##$STSR= 0
##$SW_p= 3612.71676300578
##$SYMM= 0
##$S_DEV= 0
##$TDeff= 0
##$TDoff= 0
##$TI= <>
##$TILT= no
##$TM1= 0
##$TM2= 0
##$TOPLEV= 0
##$USERP1= <user>
##$USERP2= <user>
##$USERP3= <user>
##$USERP4= <user>
##$USERP5= <user>
##$WDW= 1
##$XDIM= 8192
##$YMAX_p= 0
##$YMIN_p= 0
$$ End of Bruker specific parameters
$$ ---------------------------------
##NTUPLES= NMR FID
##VAR_NAME=  TIME,          FID/REAL,        FID/IMAG
##SYMBOL=    X,             R,               I
##VAR_TYPE=  INDEPENDENT,   DEPENDENT,       DEPENDENT
##VAR_FORM=  AFFN,          ASDF,            ASDF
##VAR_DIM=   8192,          8192,            8192
##UNITS=     SECONDS,       ARBITRARY UNITS, ARBITRARY UNITS
##FACTOR=    0.0002768,     1,               1
##FIRST=     0,             0,               0
##LAST=      2.2672688,     0,               0
##MIN=       0,             -1688,           0
##MAX=       2.2672688,     3390,            0
$$ Real data points
##PAGE= N=1
##DATA TABLE= (X++(R..R)), XYDATA
$$ [...]
555B43j70n65K48L31n25j64N96r5n27L36M49m13j26N56L0m82L46M28m19j20N14
576D71J5n55K23M74m77k86N35m7n87R5M14m40l20N24o6n06J19M64l50k77N33O5
598B1n26K81M28k37k75N62J22m73K02M56l20l17N55O6n33J31L25l73l26L84M4
619A97n48J42L63l34l06M04J51n80J60M29k63k78M63J85m38J47M18j62l41N41
639C50J37m83J11M28k38m14L59K13n53PM68m31k85L62J01n44nM66l18k99L92K25
661D9m55O0N15k21l36M63K36m15P1M92j42m19L94K34m45m1M44k48m39L41J56m88
683a94n7M32j91m60L38J99m93j0M77j07m26L12L17l89l3N13j00l22L48L03m21
704C6k9M93j39m37K87L17m63j22L72j14m65K02L07m68k16M51n6m49K24L35m27
$$ plain form
555 243 73 -492 -244 87 -438 -602 -6 -101 -628 -292 157 -256 -382 174 204 -278 68 496 77 -43 471
576 471 486 -69 154 628 151 -135 400 353 -234 -139 275 -165 -485 39 -27 -533 -414 50 -300 -577 -44 21
598 21 -505 -224 204 -33 -308 254 376 -97 105 561 241 -76 479 545 12 143 468 95 -231 153 197
619 197 -351 -209 154 -180 -486 -82 69 -511 -351 78 -185 -463 0 185 -253 -106 312 150 -191 350
639 350 487 4 115 543 305 -109 250 463 -90 -83 385 -46 -331 31 132 -412 -417 49 -269 -568 -176 49
661 49 -406 -346 169 -52 -388 75 311 -104 -33 459 317 -102 292 526 81 40 484 236 -203 138 294 -194
683 -194 -251 181 -10 -470 -132 67 -426 -436 41 -66 -492 -180 137 -252 -285 228 128 -194 154 457 36
704 36 7 500 361 -76 211 528 65 -57 315 201 -264 -62 245 -223 -439 12 -44 -493 -269 66 -361
725c61o0M64j4m41L43L12l31r8M80K5l82K37K81k94k02M60o3m47J93K57l43k20
747b04M20p5m71J78K95l75k81M93n7l95K59K58k28j50M20M1l56J99M26l40j43
768h6M67ol96K01L75l47k81L65M9m45O8K92l32k27M05o0m35J08L25k84k05L99
790e0L9l67J31M48k64k26M68J18m03J77M10k80k15L65Q2l66m2M17k92l25L75J5
812B15m47P9K68k54l16L58J29m73R5M11j69l03K44K55l37Q0M60j69k69L33J95
833C85l87M8M04j76l60L78J12m04l0L40k33l20K03K02m38m1L83j89l41K97K08
854D1l73J8M09j61k98L65K62l97N3M03r7l04K56K25l53KL39j28l29J84J71l73
876h5j38L98j51l74K63K07m52k2L28k9m38L45K80l72rL42pl02K34L02k82o2L76
$$ plain form
725 -361 -421 43 29 -412 -69 243 -88 -186 294 319 -63 174 455 161 -41 419 356 -91 102 359 16 -204
747 -204 216 141 -330 -152 143 -232 -513 -20 -77 -472 -213 45 -183 -333 87 128 -228 -29 397 57 -86
768 -86 381 375 -21 180 555 208 -73 292 341 -104 -36 256 -76 -303 102 42 -393 -285 40 -244 -449 -50
790 -50 -11 -378 -247 201 -63 -289 179 297 -106 71 481 201 -14 351 433 67 25 442 150 -175 200 215
812 215 -232 -153 115 -139 -455 -97 32 -441 -346 65 -104 -407 -163 92 -245 -165 295 126 -143 190 385
833 385 -2 46 450 274 -86 292 404 0 -30 310 77 -243 -40 162 -276 -317 66 -123 -464 -167 41
854 41 -332 -314 95 -66 -364 1 263 -134 -81 322 225 -79 177 402 49 51 390 262 -67 117 288 -85
876 -85 -223 175 24 -350 -87 120 -332 -354 -26 -55 -493 -148 132 -240 -249 93 86 -216 18 320 38 -24 352
899C52l3l24J76K46l46j09L81j44l40J18K55l50j88L52q3l27J77K45l23j04L42
920b7k6l00K16K90j78j96M16lk85J12L41k44j78L97nl27L9L37l33k12L37m4m05
943b78J42K49l01k19L48J15m37J27L26k46j75M37rl12K22K72j75k15L42Q8l32
964c1P9M14k88k33L08M6l63L7L24k44j95J51N6l91N1L32k34k24L62M2k93R7L54
987A57k49j60L24J74l00O3L48j85k46L55M4l03N9K32j73k14K16J21l45o1K87j42
1009Bl38K63Q3l40L1L07j25k78L11J66k84NM04j38k19K47J90l48Q3L10p9k70J94
1032A77K01l84k7L26j81k95K16J32l48j27L27r9k52J96J47k13j49L73r4j78K03
1053d9K39l21N9L33p2k51K34K02l47oK90p8l30K12K19l17j12K58n8l88J48K11
$$ plain form
899 352 319 -5 171 417 71 -38 343 199 -141 -23 232 -118 -306 46 -37 -364 -187 58 -265 -369 -27
920 -27 -53 -353 -137 153 -25 -221 195 192 -93 19 360 116 -62 335 330 3 42 379 46 -166 171 127 -278
943 -278 -136 113 -188 -407 -59 56 -381 -254 72 -174 -349 88 79 -233 -11 261 86 -129 213 301 -31
964 -31 48 462 174 -59 249 295 -68 -31 293 49 -146 5 61 -330 -279 53 -181 -405 -43 -1 -294 -197 157
987 157 -92 -252 72 246 -54 9 357 172 -74 281 325 22 81 313 140 -74 142 263 -82 -143 144 2
1009 2 -336 -73 10 -330 -299 8 -117 -395 -84 82 -202 -197 207 69 -150 97 287 -61 22 332 253 -17 177
1032 177 378 -6 -33 293 112 -183 33 165 -183 -310 17 -82 -334 -138 9 -204 -353 20 -74 -252 -49
1053 -49 190 -131 -72 261 189 -62 172 374 27 21 311 233 -97 115 334 17 -95 163 105 -283 -135 76
1075G6l29m2K70k1l04J74K13j69j10L79q1k31J39K68k34p0L21k2l04K07J97k22
1097A05j64L41n5l38J53J97l37j65K89Kl20R7K53k46j66L05Mk72J73K71k33p0
1119a76K37Q5k40J24K58j66j64K86Ok65L9L48l19j28J84Q9l97J08K56k66j81K22
1141f0N9l20M1K90j07k40L19Q3k63P1L44k04r2K10J38k51nL10j53k20K61N5k84
1164a8MJ97j28k15K29Ql19O5K34j66j94J91P2k26M5K58j27j53K77J47l12Q8L42
1187B99j45k07K32J34k98M0K48j48k43K46N2k51q5K55n4l52K52R9l42jK60j12
1209a21j74J89J86k14n1L45j13k57K11K55k74PK57o0k48K10J72l15j2J97jl69
1231a80J83J34j93j66K77j08k35K14O1k18o0K58J9k26R5L02k69J5K73M0k76J66
$$ plain form
1075 76 -253 -295 -25 -46 -350 -176 37 -132 -242 137 56 -175 -36 232 -2 -72 249 227 -77 130 327 105
1097 105 -59 282 227 -111 42 239 -98 -263 26 28 -292 -195 58 -188 -354 -49 -45 -317 -144 127 -106 -176
1119 -176 61 146 -94 30 288 122 -42 244 250 -15 24 372 53 -75 109 198 -199 -91 165 -101 -282 -60
1141 -60 -1 -321 -280 10 -97 -337 -18 65 -198 -127 217 13 -79 131 269 18 13 323 170 -50 211 266 -18
1164 -18 -14 183 55 -160 69 77 -242 -177 57 -109 -303 -112 -40 -266 -221 37 -90 -243 34 181 -131 -43 299
1187 299 154 -53 179 313 15 55 303 155 -88 158 210 -41 -126 129 75 -277 -25 74 -268 -269 -9 -121
1209 -121 -295 -106 80 -134 -185 160 47 -210 1 256 -18 -11 246 186 -62 148 320 5 -7 190 189 -180
1231 -180 3 137 -56 -222 55 -53 -288 -74 -13 -231 -291 -33 -14 -240 -145 157 -112 -97 176 216 -60 106
1253A06J69j63r8K31K0k76R7K03k42j59K80r6k83J24J74k53r2K38rk22R3J28j31
1276a61j08K39R2k91J48K74j54n8K53Jk54O7K35j58j32J98l0k10N3K09k18j86
1298a91K14J1k80J28K13k46j02J60N8j80N1K62j66j15K54N3k51L7L28j63q6K06
1320A95M4k37J07J51j24j87J34Q5k79M4J61j58j84K49L3l08O9K24j24j31J61J06
1342C1j37k9K61r3j70K12J26j68p0L36j77j56K05P2k36j7K31r1l10K52M8k38j17
1365b35L27j57k33J96J06j78n7K67k9k32K20J33j83k0K95q1k24K63J42k87j2K00
1387B21k6k22J64P6k18j52L53j08k87J63L9j57j15K40l7j84J27J37k17J0K09L6
1409E2k01J14K16k29j2L12p5j96J22J66k34jK51j14k57J03J87k88o9J70Rk64J43
$$ plain form
1253 106 275 112 14 245 265 -11 86 289 47 -112 168 72 -211 -87 87 -166 -258 -20 -29 -251 -158 -30 -161
1276 -161 -269 -30 62 -229 -81 193 39 -19 234 235 -19 48 283 125 -7 191 161 -49 4 213 -5 -191
1298 -191 23 34 -246 -118 95 -151 -253 -93 -35 -215 -164 98 -68 -183 71 124 -127 -90 238 75 -11 195
1320 195 239 2 109 260 136 -51 83 168 -111 -67 94 -64 -248 1 34 -274 -205 19 -105 -236 -75 31
1342 31 -106 -135 126 33 -137 75 201 33 -37 299 122 -34 171 243 7 -10 221 130 -180 72 120 -118 -235
1365 -235 92 -65 -298 -102 4 -174 -231 36 7 -225 -5 128 -55 -75 220 139 -85 178 320 33 21 221
1387 221 195 -27 137 213 -5 -157 196 88 -199 -36 3 -154 -269 -29 -66 -250 -123 14 -203 -193 16 52
1409 52 -149 -35 181 -48 -60 252 177 -19 103 269 35 34 285 171 -86 17 204 -84 -153 17 26 -238 -95
1432i5J32j93j54L17kk67J50J86j47j13K99Rj84Q9K25j85j20J88N8j92R0J56k11
1455C6q3J59Qk78N7J80j94n7J85m9k00P5K38k16j01K48M0k21J01K32j54o3K23
1478A66Kk09J03J84j29j53K19L3k25K0J30j25j10Q3N8j98K7J27j06j42K09J7j77
1501a96L3K53j38j19K21M0k04P1K15o8j00J26J01k15L0J55m6j76J73M5k96lK53
1524A55j77j91J62N1k61N3K10j04j10J64M7j67L0K14p9j46K32Q2j69o5K83o1j91
1547c8K01L5k07L1K31j13k62J87J28k62o7J35k6k02J22J55k67N8J52r8m4J59P8
1570H6j81L6J93m8j56J16J58j14r5K42l5k11J11J41k23q2J22mk26J75J28k60m3
1593a70J80q7j34J28J09j28o9K25Oj63P4K02j72p6K62k8k06J02J36j59n9J85m6
$$ plain form
1432 -95 37 -156 -310 7 5 -262 -112 74 -73 -186 113 122 -62 27 252 67 -53 135 193 1 91 247 36
1455 36 -47 112 120 -158 -101 79 -115 -172 13 -36 -236 -161 77 -139 -240 8 48 -173 -72 160 6 -57 166
1478 166 168 -41 62 246 117 -36 183 216 -9 11 141 16 -94 -11 47 -151 -124 3 -103 -245 -36 -19 -196
1501 -196 -163 90 -48 -167 54 94 -110 -39 176 108 8 134 235 20 50 205 159 -17 156 201 -95 -98 155
1524 155 -22 -213 -51 0 -261 -208 2 -102 -212 -48 -1 -168 -138 76 -3 -149 83 165 -4 -69 214 153 -38
1547 -38 163 198 -9 22 253 140 -122 65 193 -69 -136 -1 -27 -229 -107 48 -219 -161 -9 -107 -151 8 86
1570 86 -95 -59 134 86 -70 46 204 90 -5 237 202 -9 102 243 20 -62 60 56 -170 5 133 -127 -170
1593 -170 10 -77 -211 -83 26 -102 -171 54 60 -103 -29 173 1 -75 187 159 -47 55 191 32 -27 158 112
1616A12j78J02P6j40j01J80q3j65J04J46j56j19K09K9k62J50J57j11j06K34M4
1637A22j65O5J94j33r9J42Q4k58R6J76j80j23J79O6k81N4J53j13k27K07N5k17
1659b03L7J42q6j43K65K5j67L0J85p9j09J94M9j33K5J95j56j03J23J30k33M5J32
1682A65j64j51J86P4k39K8J43q1j49J56N1j60k0J69o7j18J40J02j43j6K84j19
1704G1j42K41K9j83J4J77j03j26J10N2j00q5J61k4k54J51Q5k09l7K17o8j64R5
1727i2J58k03L7J43qj32J09J42j81l1J94K0k21J47Q2j65j0J77q3j38L2P0j53J2
1751i4J34m3j58J17Q8j67n1J65K8j85J30Q4j41l5K23J0j67Q1J77j46j11K54o6
1774A27j49N8J14j17p9J58n4k29J45Q5j17j88J97N4k57J69J22j55m2J11Om3L2
$$ plain form
1616 112 -66 36 112 -28 -129 51 -32 -197 -93 53 -103 -222 -13 16 -246 -96 61 -50 -156 78 122
1637 122 -43 22 216 83 -16 126 210 -48 48 224 44 -79 100 166 -115 -61 92 -21 -248 -41 14 -203
1659 -203 -166 -24 -110 -253 12 37 -130 -100 85 6 -103 91 140 7 32 227 71 -32 91 221 -12 33 165
1682 165 1 -150 36 110 -129 -101 42 -39 -188 -32 19 -141 -161 8 -59 -177 -37 65 -78 -94 190 71
1704 71 -71 170 199 16 30 207 104 -22 88 140 40 -45 116 92 -162 -11 74 -135 -172 45 -23 -187 -92
1727 -92 66 -137 -100 43 35 -97 12 154 -27 -58 136 156 -65 82 164 -1 -11 166 83 -55 -23 47 -106 -94
1751 -94 40 -3 -161 -44 44 -123 -174 -9 19 -166 -36 48 -93 -128 95 105 -62 19 196 50 -61 193 127
1774 127 -22 36 150 33 -46 112 58 -171 -26 59 -58 -246 -49 5 -252 -83 39 -116 -158 -47 -41 -84 -52
1797e2J80j59m3J82k5j13P5J54j39j16J85M0j98M5J63j77j40J87qj80J9J69r5
1820d6j83K07J5j70L7J87q9r7J51J6j17J5K11l4q8J12M4j41K7J35j08j78J89K2
1844A17j75J6P9l8j46J00N2j75N9P8l4j42J65O3j22j9J88n7q1J51L7j83M5J37
1868A15Jj66J51M8j67N1N4qj82J08Q7j85l2J95q4j39R6J07k19%J93k5j19P7P2
1893B9q6J1J46l3q8N0P7j42J2J55k5j42J05J4o9n5J56l4k24J39Q3j81l0J99j22
1918e5j56J38R4j21k2J37J1j21J30J29j37j21K12J4j49J31N8j58m4J49q9n8M7
1941A9J16k07o4J74l0j47O1J09j14r0K21o4j77J16J33j36j5J48Qj08M9J41j29
1964A4m4K06l9j49L5J11j01r8J60o1n1L6P9q0j47J56M1k51L5J65j39l9J86j4j49
$$ plain form
1797 -52 128 -31 -74 108 83 -30 45 199 60 -56 129 169 -29 16 179 2 -138 49 41 -139 -120 49 -46
1820 -46 -229 -22 -7 -177 -140 47 -42 -139 12 28 -89 -74 137 103 15 127 171 30 57 192 84 -94 95 117
1844 117 -58 -42 37 -1 -147 -47 5 -170 -111 -33 -67 -209 -44 19 -103 -122 66 9 -72 79 116 -67 -22 115
1868 115 116 -50 101 149 -18 33 87 79 -103 5 92 -93 -125 70 -14 -153 -57 50 -169 -169 24 -1 -120 -43 29
1893 29 -57 -46 100 67 -21 29 106 -36 -24 131 106 -36 69 83 14 -41 115 81 -143 -4 79 -102 -132 67 -55
1918 -55 -211 -73 21 -100 -122 15 26 -95 35 164 27 -94 118 132 -17 114 172 14 -30 119 30 -28 19
1941 19 135 -72 -136 38 8 -139 -78 31 -83 -173 48 -16 -193 -77 56 -80 -95 53 61 -47 2 143 14
1964 14 -30 176 137 -12 23 134 33 -65 95 34 -17 19 98 18 -129 27 68 -183 -148 17 -122 -161 25 11 -138
1989a38L3K12q8r8J07R6j68K8J86q0j45J46R7k23K8R0m6j02P8Pj40j3J76j01j09
2014a67J20M8j38O9J23j06j01J88j7o4l9K33q6p1R5J4r4J8J46n6j24Q7N0j21m4
2039c7J12p2r5N9R3j75J7J44j06q8Q1Q1j45K7J28n2m0Q6J33j90nJ74q3q8J24N0
2065A33j41MR9j10p1J27R2j68m4P5Pj68J64n1m7o2J46j9j10J53O3j14kJ03k7q5
2091e3J34M6r5j4R4k6j21R0M4j14oQ4l0j13Q3R1j59PP2k3j48P8J24j13n4J38M
2118B0j38R0O9q5K4J40Jj23O6P4n2j21J27K3j31M8J52j77k5P1j6j29jR3p8o7J02
2145d3L9j15nJ11n9k2J50m5r0J02N4l8j06J39M9j70J17M5j10K2RJ06j85O7N2p3
2171Aj21J44k8o2kO1l0p1R9K8j41M6J37j23j5J34nqj8J13j1j69J21M9j62P5P7
$$ plain form
1989 -138 -105 107 19 -79 28 124 -44 -16 170 90 -55 91 188 -35 -7 83 37 -65 13 20 -120 -133 43 -58 -167
2014 -167 -47 1 -137 -68 55 -51 -152 36 19 -45 -84 149 63 -8 87 101 7 25 171 115 -9 78 128 7 -37
2039 -37 75 3 -92 -33 60 -115 -98 46 -60 -148 -67 14 -131 -104 24 -28 -68 18 151 -39 -44 130 47 -41 83 133
2065 133 -8 -4 95 -15 -86 41 133 -35 -79 -4 3 -165 -1 -52 -99 -161 -15 -34 -144 9 72 -42 -44 59 32 -53
2091 -53 81 127 32 18 112 86 -35 55 99 -15 -21 63 33 -80 3 94 -65 -58 14 -9 -157 -79 45 -68 -122 16 20
2118 20 -118 -28 41 -44 -20 120 121 -2 64 138 86 -35 92 115 -16 32 184 7 -18 53 37 -92 -93 0 -78 -145 -43
2145 -43 -4 -119 -124 -13 -72 -94 56 11 -79 23 77 39 -67 72 121 -49 68 113 3 25 34 140 -45 22 74 1
2171 1 -120 24 -4 -66 -68 -7 -37 -108 -9 19 -122 -76 61 -62 -77 57 52 44 26 139 128 -41 80 129 -33 42 119
2198A19o8j06J16o7l4o2J95j32p0R1j9j25N1Q8J2j21J61%j17P3N8rq5J33M8j23
2224GKJ31r0n5Q9Kj39j8K00j69n2J60o7j20L5R5k2j03Q7O1j63K1J30Kj61J14R7
2251G4p2m5J25l9m5N6P5j01m6J59j12n8P1O6j36o2J37o8r1R8J02j73K6P2k5r6
2277a08O2O3j13NJ49m0o9R9M2q4o7K25j24m0N5J7p7j3J23J2j35Q7k8n4n2R4q2
2304e3r5J27L7j13k5J23j4r4Q4P8n4n7J50J7j24NJ37j15k3J26l2p3M2Ll8n7P4
2331C6n5q9M5Q0o0m3K9mo5N5Q7j00k9P8P1p9K4R9l6r0Q9J11j28L2P7o5j29J11
2359E2O6j31oQ4n6j30J25l0n5j0J42r6j1R3n8k8l9J00np8P4Q5j01K8R3j06j0R1
2387H3j3q6L7K9k7m6M4ln6l5J64j15j06J14l9rm8R2m5n8J19M4r6mO3k7m9P9Q5
$$ plain form
2198 119 51 -55 61 -6 -40 -102 93 -39 -109 -18 -37 -162 -111 -23 -11 -132 29 29 -88 -15 43 34 -51 82 130 7
2224 7 9 140 50 -5 84 86 -53 -71 129 -40 -92 68 1 -119 -84 11 -11 -114 -27 34 -129 -108 22 24 -137 -23 74
2251 74 2 -43 82 43 -2 54 129 28 -18 141 29 -29 42 108 -28 -90 47 -21 -112 -14 88 -85 -59 13 -12 -108
2277 -108 -46 17 -96 -91 58 18 -51 48 90 6 -61 164 40 0 55 72 -5 -18 105 117 -18 69 41 -13 -65 29 -53
2304 -53 -148 -21 16 -97 -122 1 -13 -107 -23 55 1 -56 94 111 -13 -8 129 14 -9 117 85 12 54 57 19 -38 36
2331 36 -19 -108 -63 17 -43 -86 -57 -61 -126 -71 16 -84 -113 -35 36 -43 -19 80 44 -46 43 154 26 58 135 70 -59 52
2359 52 118 -13 -19 65 9 -121 4 -26 -81 -91 51 -45 -56 37 -21 -49 -88 12 7 -71 3 88 -13 15 108 2 -8 83
2387 83 70 -16 21 50 23 -23 21 18 -38 -73 91 -24 -130 -16 -55 -64 -112 -20 -65 -123 -4 40 -56 -60 3 -24 -73 6 91
2416I1j10k6J69n0r1K2J15j68N1N6k7m9l8J15j27l2J11k6r5K0J00q3M5L1Rj16
2442a03J03L1j21N1J20J0j13P8Q7j44q7J88m9p5Q1K8p9l0J4%o8LP9q1j3Q7j2j35
2470a50J42Q5j39LJ29k7p2N3P8n8j8O5po9J7Q7j13q2J22l7m2K2Q2r5n0J07k1q1
2498f9M4Pn9l8J15J2r2O6O8q0j4J7%J5M8J21j81OQ8Rm7j4J4J7K3l3J7r7j4O2l2
2529b1J7ml8l3J6P7l8kK4Pl3PL1l8K9P2Oj00J2R6l9k5k9P1j06N7P6m3j22J06k9
2560Dj7mL1n2p7O0J01j03j7J01m7p7J25O0q8k0R1l5p3R8M1j01L0R3q6j2j3P3j05
2589a9j9Q9q6p7L1O5n3J8Q7n2r8R5J6j1J5J2N7j59J31R4j37l3R5k6m1L4K2j6q4
2618e0R9l4m5J8J3p5k1J19o9m5K4LK1m8O5J4o9L2J02m8JK8m6K1L0O8r9LQ2j8q3
$$ plain form
2416 91 -19 -45 124 74 -17 5 120 -48 3 59 32 -17 -55 60 -67 -99 12 -14 -109 -89 11 -72 -27 4 13 -103
2442 -103 0 31 -90 -39 81 91 -22 56 143 -1 -88 100 51 -24 57 85 6 -24 -10 -10 -78 -75 4 -77 -90 -3 -15 -150
2470 -150 -8 77 -62 -59 70 43 -29 24 102 44 26 91 84 15 32 119 6 -76 46 9 -33 -11 71 -24 -74 33 12 -69
2498 -69 -25 -18 -77 -115 0 12 -80 -14 54 -26 -40 -23 -23 -8 40 161 -20 -14 74 83 36 22 36 53 76 43 60 -37 -51 11 -21
2529 -21 -4 -8 -46 -79 -63 14 -24 -26 -2 5 -28 -21 10 -28 1 73 79 -21 -9 87 48 23 -6 65 -41 16 92 49 -73 33 4
2560 4 -13 -17 14 -38 -115 -55 46 -57 -74 27 -20 -97 28 88 0 -20 71 36 -37 61 102 1 31 124 38 26 13 86 -19
2589 -19 -38 51 -35 -112 -81 -16 -69 -51 36 -16 -114 -19 -3 -14 1 13 70 -89 42 136 -1 -34 61 35 -6 28 50 34 -50
2618 -50 49 15 -30 -12 1 -74 -95 24 -45 -90 -66 -63 -42 -90 -25 -11 -80 -48 54 6 7 35 -11 10 40 108 9 12 94 76 -7
2649gL2M1r6QQ6n6n3L0K0o7m7J02j2o9N3N1j9m2J13q0Rm4J10r3jJ46p2o4K6P6
2679H1p2m6R4K0o8qQ1j22l0K7M3m8k3J08j10LK7J7k2J4K1pn3J44m1j9mO6m3o3
2709c3N2N9n9j7L5J8j06R1mq6M1M9p0k1L6Np2l0J17k2k3QN4n5k7R7j6k0L1O0o1
2740C1k2P1l4p2N5N8p3J1K1l1q0O8k9rL7J0l0m3qQ0j7n8M7J1p0KJ46q6jO3mk6
2772A8L8km7l4J40q1p6Q7kj5j2k0K9o9K7K3j0r3J55p1o1J1J3m4O1oP4m2j2P0j3
2803C6n5J08kj04N0N2n6n5J12j10j3K2O4l1n1mL5m0J9O1q2j2O9rr0O4L6QprN8
2834F4n1k4Q7p8rM5L7m7j6N5n1M5l6J3n3J6k4Rj9N9jq5K8K2l6J1mN1l5l6J09p4
2866b8J6P0J0m0L0Kk4l8J0M4k2j4P7j45K7j0R2j25PN5o0KJ28o8l6M8MJ6r1Q7Q
$$ plain form
2649 -7 25 66 -30 -22 64 8 -45 -15 5 -62 -109 -7 -19 -88 -35 16 -3 -45 68 -12 -3 -47 63 -30 -31 115 43 -21 5 81
2679 81 9 -37 57 77 9 1 82 -40 -70 -43 0 -48 -71 37 -73 -70 -43 -26 -48 -34 -13 -20 -73 71 30 11 7 73 30 -33
2709 -33 19 78 19 2 37 55 -51 40 36 -50 -9 40 -30 -51 -15 -10 -82 -112 5 -17 -40 -32 22 -33 -60 37 21 1 32 92 31
2740 31 9 80 46 -26 29 87 14 25 46 15 -65 3 -26 -35 2 12 -18 -61 -69 11 -6 -64 -17 -6 -76 -74 72 -14 -15 48 44 18
2772 18 56 54 7 -27 113 32 -44 43 41 26 14 -6 23 -46 -19 4 -6 -99 56 -15 -76 -65 -52 -96 -35 -41 33 -9 -21 49 36
2803 36 -19 89 87 -17 33 85 29 -26 86 -24 -37 -15 49 18 -33 -37 -2 -42 -23 38 -44 -56 13 4 -86 -22 14 22 15 6 64
2834 64 13 -11 76 -2 -11 34 71 24 8 63 12 57 21 34 -19 -3 -27 -18 -37 22 21 -64 -36 -14 -50 -39 -43 8 -27 -63 46 -28
2866 -28 -12 58 68 28 58 60 36 -2 8 52 30 16 93 -52 -25 -35 57 -68 -61 -6 -66 -64 64 -4 -40 8 12 28 -63 24 32
2897C2r2N1Q0n6j8P0Nk2o3P4k4m9J4N0l1o8O6L1j27P5Kn4%N8m5l7M0L7m0%N1K2
2929C2j32J39l1J6k5Q1m7k6RQ6j24n2J23mj26N2P2n3j0prk9P2K6p7j3N1lj8L1
2959DLKj9j2P0r3N9L5q3N3K1k5k6K1J6qr3Q4l1k7M4L0l0j11J05L0r0O1On9j1O2
2991a2K5j10R9mk0M6K8r8L9M0L8o2o1P2K2n6M0%n2J9nop3%L4O3p8O4k0l5L8J1
3023a4N5j03R5J5p5K7L5Jl7N8J2l8k0K8k7J2M9l0q8J00M3r0p3N3L6r0k6N2Pn2
3053h5J5M8l3J0P0m5JM4M4r6K5N5l9j5J7N6o1k6O3J9p3%nj4N0J1q3j9M5M1k8l6
3085d4K4km4Q6Lo3J7M2n3K3O9l1m6QROj1J5N8j9p8N9J5o9j2N9q7M2P9q7j5J1P0
3118C4p0rJ05q6K4L7l5K3oN3j06mO2K0l0o1Q6pl6J6lJ8j08O5L3r6O4M5o0QJ7n7
$$ plain form
2897 32 -60 -9 71 15 -3 67 72 50 -13 61 37 -12 2 52 21 -47 19 50 -77 -2 0 -54 -54 4 -41 -78 -38 -1 -41 -41 10 32
2929 32 -100 39 8 24 -1 80 33 7 16 102 -22 -74 49 45 -81 -29 43 -10 -20 -27 -36 -65 7 33 -44 -57 -6 -9 -27 4
2959 4 7 9 -10 -22 48 -45 14 49 -34 19 40 15 -11 10 26 18 -75 9 -22 -49 -5 25 -5 -116 -11 19 -71 -10 -4 -63 -74 -12
2991 -12 13 -97 2 -2 -22 24 52 -46 -7 33 71 9 -52 20 42 -14 26 26 -26 -7 -12 -18 -91 -91 -57 6 -72 -8 -28 -63 -25 -14
3023 -14 41 -62 33 48 -27 0 35 36 -1 57 69 31 11 39 12 24 73 43 -45 55 98 8 -65 -12 24 -66 -92 -40 -33 -85
3053 -85 -70 -22 -55 -45 25 -20 -19 25 69 -27 -2 53 14 -1 16 72 11 -15 48 67 -6 -6 -11 -25 25 36 -47 -66 -21 20 -8 -44
3085 -44 -20 -22 -66 20 23 -40 -23 19 -34 -11 58 27 -19 -11 -2 4 -7 8 66 47 -31 28 43 -26 -38 21 -66 -24 55 -32 -47 -36 34
3118 34 -36 -45 60 -26 -2 35 0 23 17 70 -36 -40 22 42 12 -49 37 30 -6 10 7 25 -83 -18 15 -81 -17 28 -32 -24 -7 -64
3150f4M6M4qo4J5N6K8n8L0oL6l9L9m2L3Nn4j5n7O6J2l5o0J26j03%M1Lk9M9Mj8
3182a9l1N5Po0M9J2M0o7O5JK7o5O9m4n8P8p5j1M7N8o1o6L0N5m3J5k2L3o6M3j3
3213a7J2l7P0Qo6k7O8m2K4K3QrJ0k9K3p7O1K6k5NQ1j27L2J3nl5J2j1j9L4nK5m8
3246d4M8Nk4k9M8O0k0m5L6Om6O3J2k1oN9j19m0Q8k7J5J2L9j09N5Pno3J5Q0o3n
3278a8%M2m1O3lp7K9O6p7N3pN0j4r4P1ll3K7L6o6l4O9m5o8M5J2Nl7J18n8k2pO4
3311D6o1k5R4l4k1jP2o0j7N6j3j04O1P6n4K4kP3j21k6N2o3L4m9Q6q1N8Qj6p4P5
3342gO7l3kQk2Rm4N3l3k0R5k3p3P9n6j7M1N2q1K4m8J5J7l9N2k1l0Q6qo4j0MO8
3375C9p6K6O3p9J1M8Lr0M9K6l9M8n7R8r0L6L4l0k8jL5l4K%L9m0J0Nl4QMK8m2J8
$$ plain form
3150 -64 -18 26 18 -46 -31 25 53 -5 25 19 55 16 55 13 46 51 -3 -18 -75 -9 3 -32 -92 34 -69 -69 -28 -25 -54 -5 -1 -19
3182 -19 -50 5 12 -48 1 13 53 -14 51 52 79 14 83 39 -19 59 -16 -27 20 78 17 -49 -19 36 -7 8 -14 19 -47 -4 -17
3213 -17 -5 -42 28 36 -30 -57 11 -31 -7 16 24 15 25 -4 19 -58 3 29 4 9 90 -37 -5 8 3 -32 -20 -31 -50 -16 -21 4 -44
3246 -44 4 9 -15 -44 4 64 44 -1 35 41 -5 58 70 49 43 102 -17 -57 31 4 19 31 70 -39 16 23 18 -45 -30 50 -13 -18
3278 -18 -18 24 -17 46 43 -34 -5 61 -16 37 30 80 66 -28 43 40 7 34 70 4 -30 39 -6 -74 -29 -17 -12 -49 69 11 -11 -18 46
3311 46 -15 -40 54 20 -1 -2 70 10 -7 49 36 -68 -7 69 15 39 37 110 -11 -37 15 -48 -14 -63 23 -58 0 8 -8 -82 -7
3342 -7 60 27 25 33 11 20 -24 29 -4 -24 71 48 -25 54 -2 -19 22 74 -7 17 -31 -16 1 -38 14 -7 -37 49 41 -23 -33 -29 39
3375 39 -37 -11 52 -27 -16 32 35 -55 -6 20 -19 29 -28 70 -20 16 50 20 -8 -9 26 -8 -6 -6 33 -7 3 8 -26 -18 -14 14 -28 -10
3409a0qoN5k2JjK0lo7M0N9r2L3K3L5m6J1K3m1j4Mo2J1M1JL7p9R9o4m1O4Lm9OQ1
3444D2m7j9Q2Pp9m1J12l7n1O9P%p1J05n7o0K7J12j44j9RP2j02Q2J7j04P6N0m4
3473fo3Q7k0J7l4M7J7q5L8O1k3o9J29p5l8PL8pm8K1J6rKJ1l8L4j5L4o2J0L5k2
3505a0mj8Q3n6m1N2M0n2PQ8j00LJ8qj9M7M1q7J9L7jJ0k2ql0j5Orl9O0RJ5Knm7
3540c4k0J22n2l1qN8k4j5J4N0k7n4L4Rj5mk2K5j6M8m6m3L5k8JM9j8n1L2j8J02
3571E3p1K3N0n1rO1k9qoM3j5o1N6k1rK1k3K5q6LP6n5K3N4l1j03R1jL6o3L7l9j1
3604d0P9Rj10LO2M0k8k6M6jJK8j1n7K4k6J9MnLMnk3J5o9O7kk2j0O5o6L7J1jk0
3639ek9J00n2L2J3n5l6K9L0j8n7R9lk3k2N5k6n1L6rr7Q5J6%k6M8m5l1Q4m0j4J3
$$ plain form
3409 -10 -18 -24 31 9 10 9 29 26 -41 -1 58 -34 -1 22 57 11 22 45 4 -10 -6 -68 -57 -16 -15 22 -57 42 -22 -63 1 4 -45 -39 42
3444 42 -5 -24 58 65 -14 -55 57 20 -31 38 45 45 -26 79 22 -38 -11 101 -43 -62 -53 19 -83 -1 16 -88 -12 38 -6
3473 -6 -69 18 -2 15 -19 28 45 -40 -2 59 36 -33 96 21 -17 -10 28 21 -27 -6 10 1 3 14 -24 10 -5 29 -33 -23 12 -10
3505 -10 -14 -32 51 -5 -46 6 46 -6 1 89 -11 -8 10 2 -17 30 71 -16 3 40 39 49 27 19 -11 -26 -20 -29 -68 -8 1 16 18 13 -34
3540 -34 -54 68 16 -15 -23 35 11 -4 10 60 33 -21 13 22 7 3 -19 6 -10 38 -8 -51 -16 -44 -43 6 -12 -63 -31 -49 53
3571 53 -18 5 55 4 -5 56 27 19 13 56 41 -20 36 15 6 27 4 29 -57 -54 22 -33 -10 44 13 -90 1 0 36 -27 10 -29 -40
3604 -40 39 48 -62 -59 3 43 15 -11 35 34 35 63 52 -5 19 -7 12 16 11 14 18 13 -10 5 -64 3 1 -21 -31 34 -32 5 16 15 -5
3639 -5 -34 66 14 46 59 4 -32 -3 27 9 -48 51 48 25 3 58 32 -19 17 8 -89 -4 12 12 -14 34 -11 -42 42 2 -12 1
3671AQJ4k2J1J1J0n8N6l6k7K0J12k7q2K8m6pO9NJ4m1k2J0m1K7K7j9J4j2k0j2k7
3703f2N0K6Kj5Kp0O7K8k0l3N0l6j3L0Mm4M7m2L7mn9K5K2j4J7L5j03J13kn5n0P9
3735A2K0k7k9K2M0k3k2N1o2M4Pk7p6N6J2j2J2J3Nm6M4l0l3j3J24r1k8O9Jk0on
3767a8%j0M5j6k2M2Om3m4R3K2m6pL7J9p1oK3On7O0K0k7j3K9m6J9J4oql4M5k0L8
3801B4j1n4K0K0l1O5m8M7Po5KQ0m9MRk6QJ6k1j8kL1J3n3L4J4j1m4N5Pl5M2N6q9
3835cL2Rj3j1j2J6m3K9M2n7j8j2Q5q7qJ6L5o3Q1p1O9n4L2k1j6K8k1J9L4o0R5n6
3867djqL7n5L0L4k5O6j3j0n6M2k5rL4rm7k4M3kOprL1k7k2l0J8N4j3L3l9P9n2m5
3902b5J5J6O6o9LK3m0M0j0k4nQK0j4j6L1m3m9R1n2J8Rj0j7M6j3kL8j2j0kK1j7
$$ plain form
3671 1 9 23 1 12 23 33 -25 31 -5 -32 -12 100 73 -9 19 -27 -34 35 40 54 13 -9 1 -40 -13 14 -5 9 -3 -23 -35 -62
3703 -62 -12 14 16 1 3 -67 0 28 8 -25 25 -11 -24 6 10 -34 13 -29 8 4 -55 -30 -8 -22 -5 30 -73 40 38 -17 -67 12
3735 12 32 5 -24 -2 38 15 -7 44 -18 26 33 6 -70 -14 -2 -14 -2 11 16 -30 14 -16 -49 -62 62 -29 -57 12 13 -7 -13 -18
3767 -18 -18 -28 17 1 -21 21 27 -16 -60 33 55 9 2 39 58 -13 -19 4 10 -47 13 33 6 -7 22 -24 -5 9 3 -5 -39 6 -14 24
3801 24 13 -41 -21 -1 -32 33 -15 32 39 -26 -24 56 7 11 20 -6 2 18 -3 -21 -23 8 21 -32 2 16 5 -39 16 23 -12 30 86 -3
3835 -3 29 38 25 14 2 18 -25 4 46 -11 -29 -41 44 -43 -51 -35 0 -63 18 -53 16 -38 -6 -27 -43 -15 -36 -17 17 -43 52 -4
3867 -4 -5 -13 24 -31 -1 33 8 74 61 51 -5 37 12 3 37 28 -19 -43 0 -2 4 -3 -12 19 -8 -30 -60 -42 12 -1 32 -7 72 20 -25
3902 -25 -10 6 72 3 6 29 -11 29 19 -5 -10 -2 18 4 -12 19 -24 -73 18 -34 -16 -7 -17 -34 12 -1 -3 35 23 13 11 32 15
3935A5m7JJ4RJ2mN8o0Pm3M9J8k4nL3o2RM5m7M2m4M1j5pLj5%K7K3n0J9L2n6J0K3
3970A1N0r3N4m6K5k4pN5j2j0J9m3n9Q9j1K4m3J2K4m0K6j0j9J5L6oJ4m6L0Mm4L3
4002Hl1O3j2k3j5K6K2mm1m5R7jl0o1L9j9P0o9n%j1l4N0J6J2k5J1k6M9k1K5j2J1
4035A4k7M2k2n5O4k3kpJ9J0m0l4J11k2qj9k0j8K2oL3l4LM4n2NPJ4L7n7k3O0m2
4068b6Nl6kL7J09j35J0K3J8jL3nm7J7J6l3p0O5J2K2Qj3l3J7J6j7LnpLmJ1L8m8
4102a9Q2j18O0q6M7O9j6k5k8K5l3M0M1m7J4k7K9m4O3n7QK6N9m9l4M2K9l2oK0l0
4133Ck7O6k7k3LJ7p0K4L3J7Jn4kl6L0mN2o1K8M5M7k8o6N6n8O8j3o4P6m2N5m8j5
4166a7M7k5j7N5j1j2j4J4pn5P2j8j45J06opN6n2jN7l7oK4l6M3L3o8l8J27n3l2
$$ plain form
3935 15 -32 -31 -17 -8 4 0 58 -2 5 -38 11 29 5 0 33 -29 -20 25 -22 20 -24 17 2 -5 -2 -17 -17 10 33 -17 2 34 -22 -12 11
3970 11 61 -32 22 -24 1 -23 -30 25 13 3 22 -21 -80 9 -2 22 -21 -9 15 -25 1 -9 -28 -13 23 17 31 -15 15 19 -25 8
4002 8 -23 40 28 5 -10 16 38 34 -7 -52 45 44 14 -47 -8 -27 43 -26 -31 -31 -42 -76 -26 -10 2 -23 -12 -38 11 -10 15 3 14
4035 14 -13 29 7 -48 16 -7 -9 -16 3 13 -27 -61 50 28 20 1 -19 -37 -15 -21 12 -22 -19 25 -27 -22 -15 -1 36 -21 -44 16 -26
4068 -26 -21 -57 -59 -22 87 -48 -38 -15 3 2 35 30 -17 0 16 -17 -87 -22 -10 12 20 7 -26 -9 7 -10 -7 -12 -19 -16 -20 -9 29 -19
4102 -19 63 -55 5 -81 -34 35 19 -6 -34 -9 -42 -2 39 -8 6 -21 8 -36 27 -30 -22 4 63 14 -20 22 51 19 13 33 3
4133 3 -24 42 15 -8 -5 12 -58 -34 -1 16 17 -37 -39 -75 -45 -49 3 -58 -30 15 62 34 -32 24 -34 34 21 -43 33 -9 46 -2 -17
4166 -17 30 5 -12 43 32 20 6 20 13 -42 30 12 -133 -27 -33 -40 16 -36 -37 20 -17 -23 1 -35 8 41 -27 -65 62 9 -23
4197b3N6nl4RK7n0N7p0O1Pj6J8j2m0Mj5P4m5kL8n5OP2J2n3k0NK8n0L9k5kN4k7
4231B3r2M3O5n2L7j8j4KK0N7j40J2MR1n2L1Rm1J9l8mPL1%K5j9K4q0Q9rk0K2q6
4264e4L3J2J2J1k1L4l1K5%m3K5L1j9nk7k2M3qj5j1K8MK7n5j4N1qK5J0k1J7m1J3
4297Fj5M5Nj4k8J9j1j9MOJ6l0J3%k2k2K5J8j2J0Q0q2mKL0K4l3JlJ3j7qM1l8PN
4333A2k0L8j2n1K1OOk4L2joj5Rj6qJ5kK4n5M5Ok4J8M3j6nK7o3J6l9O9J7n4L7q0
4368e0J02l4O6n9n2pk2K2K8J5l6K3ORM2m0K6k5K8m3O0k3jJ5k7o4N0K3o1P6j6o6
4400c5M9LJ0q3N4M1j0m4L6J3l8k8L2j1K2j7K7mMMj3j1M2p8L9M6J2j08K6M7o1J4
4432b0J1j6j0J0N0l4mL0J7m5J8mN9m1K6o1L6J4L1m4l9ON0k5NM0k9l3L8J9m9k4
$$ plain form
4197 -23 33 28 -6 3 30 -20 37 -33 28 35 19 37 25 -15 -11 -26 48 3 1 39 -16 -10 62 74 21 1 6 34 -16 23 -2 -4 50 23
4231 23 -69 -26 39 -13 24 6 -8 -6 14 71 -69 -57 -53 38 -14 17 26 -15 4 -34 -38 -31 0 0 25 6 30 -50 39 30 10 32 -54
4264 -54 -21 -9 3 14 -7 27 -4 21 21 -22 3 34 15 10 -17 -39 4 -4 -19 -30 -2 2 29 -26 -40 11 3 28 38 17 34 -7 6
4297 6 -9 36 41 27 -1 18 7 -12 -8 -2 14 -16 -3 -3 -25 -47 -22 -4 -16 -6 74 -8 -12 -10 20 44 11 12 9 22 5 -3 38 0 7 12
4333 12 -8 30 18 -33 -12 -6 0 -24 8 7 1 -14 -5 -21 -29 -14 -16 8 -47 -2 4 -20 -2 41 25 20 47 -16 0 -39 30 47 -7 30 -50
4368 -50 52 18 84 25 -27 -34 -56 -34 -6 9 -27 -4 2 11 53 13 39 14 42 -1 59 36 35 50 23 -41 9 32 -29 47 31 -35
4400 -35 14 17 27 -56 -2 39 29 -15 21 34 -4 -32 0 -11 11 -6 21 17 21 25 12 1 43 -35 4 50 62 -46 -20 27 -34 -20
4432 -20 -9 -25 -35 -25 25 -9 -13 17 34 -11 7 3 62 21 47 -14 22 36 67 23 -16 -10 40 15 20 60 31 -2 36 55 6 -18
4464a8j0M4m1mKM8l6K9p0K4M3m4O7m7L8k6pk3K1N4k2M7%m4l1L0k2l7L0L2k6j3
4496a2KNJ0jM8r3LkM8m4N8J5l3L8n9R5q6J3Mnqj0O4Ml3K5q5M8k3O0m5J0L7o8M1
4531B1J9j4l6j8J2J2j8M2l6N6m3%LKK1J8r1N3J8rJ2Lj1Jkm7M8n6Q4o0O2l3l5k
4565b4L0K6m5l5oO0k8j4O0J4o9J8L5Pn9O0J2n8J1L4rk7K9K9l3J7k9o3O8n0K2K4
4597G%rNl0L5MK2n9j1P0l5oMK3qk4kLl0K8O5n0nL7m1J9L4k9l0L8M3j11M3J5Ml6
4633a7j0P8q2N3L3q4J5M8m0LJ5Jj8PM7q8J02j02L9QLn3N1l6j6N7l6O2o0ko5J02
4665A5l6M5j6nnRk4K6Rj3Mk7N9j2q1P6k9M4m7pN6on7J5rK9J0l9J2Rj4jk0O0k2
4700HMmq6J05q5O3K4n9O0k4j7N7l1J9qnM1q9N4j3pmk0pN4k7j5l2M1L3j05Q2jk8
$$ plain form
4464 -18 -28 16 -25 -29 -27 21 -15 14 -56 -32 11 -33 34 -13 25 -1 -8 -31 -10 44 22 69 69 25 -6 24 2 -35 -5 27 1 -12
4496 -12 -10 -5 5 4 52 -41 -38 -40 8 -36 22 37 4 42 -17 78 -8 5 9 4 -4 -14 50 54 21 46 -39 9 -14 46 1 11 48 -20 21
4531 21 40 26 -10 -28 -16 -4 -22 20 -16 40 -3 -3 0 2 23 41 -50 3 21 12 24 27 16 17 15 -32 16 -40 44 -16 46 13 -22 -24
4565 -24 6 32 -13 -48 -54 6 -22 -36 24 38 -31 -13 22 29 -30 30 42 -16 -5 29 20 -7 22 51 18 35 6 -57 11 -39 -17 7
4597 7 7 -2 3 -27 8 12 34 -25 -36 34 -1 -7 -3 20 12 -12 -14 -11 -41 -13 52 2 -3 34 -7 12 46 17 -13 25 68 -43 0 15 19 -17
4633 -17 -27 51 -31 22 55 -29 -14 34 -6 -3 12 13 -5 2 49 -39 63 -39 0 8 11 -42 9 -27 -43 14 -22 40 -20 -22 -87 15
4665 15 -21 24 8 3 -2 7 -17 9 18 5 9 -18 41 29 -52 24 -5 39 -8 -15 41 35 -22 -7 -16 13 23 -16 -4 5 -9 -10 -30 30 8
4700 8 12 8 -78 27 -58 5 29 -30 30 6 -11 46 15 34 26 21 62 -27 27 14 7 3 -17 -24 30 3 -12 -44 -3 30 -75 7 6 -22
4734b2M3ol8L8l7P9o7M3R%j5%j2m8N2M3l7l3K3j2M3m2K9n9RJK3mL2n8j0J9M6j3
4768A9k5pk3K1N1k4N9m5m2J5O8j05O2p2N8m5oK1k1L1k0pL8j9K4mJ1M9n2j6LL3
4800C0pk5j1L0knK3lo7J4OL2k4m1P3N0q9J9l4R9m0m6O0rj9o1R0l2j7M5k8Ml4M8
4834B9JJ2n6J9K5k1k1P3p7J5k0j3K4rj3N2mL6o6Ok6J2P3j02Q7j1J3J0m1j9RJ8
4866A5k6qj2P1m2L5n2N6k2Lj7L7lr0N0K4m8N6j8j0j6L2k3Nok8J5J0L4l2K9M0n6
4899Ck0nN2j8oJ5LQl0Rl3Q5q3O1o9K3M2l6k7Q5o3j4K6m2N6m2R5l0mK8m6j6QJ9
4933C4j4K5j7J7m5QN1r3J02l4n9j5R3k5j8l9M9k3rJ1k7j5K7L5l5M9j0J8J2j8M5
4964H0o8n6P0oK6j5K6p4OQm4J06q1L9j1l9P0n3L5j9m0N2n4L0m9O4J1k4mMk5R2
$$ plain form
4734 -22 21 15 -23 15 -22 57 -10 33 42 42 27 27 15 -33 19 62 25 -8 15 3 46 4 33 -26 -17 -16 7 3 35 -23 -33 -14 32 19
4768 19 -6 -13 -36 -15 36 12 71 26 -16 -1 67 -38 24 -48 10 -35 -41 -20 -41 -10 -30 -37 1 -18 6 2 13 62 10 -6 -3 30
4800 30 23 -2 -13 17 15 10 33 30 -37 -23 -17 15 -9 -50 23 73 -16 3 -31 68 28 -18 42 33 14 -47 43 11 -6 39 11 15 -19 29
4834 29 30 42 -14 5 30 9 -12 61 -16 -1 -21 -34 -10 -19 -32 20 16 52 -14 -8 -34 -22 51 -51 36 25 38 48 7 -12 -3 15
4866 15 -11 -19 -31 40 -2 33 -19 37 15 18 1 38 35 -55 -5 19 -29 27 9 -1 -17 15 -8 -3 -9 -37 -22 -12 22 -10 19 59 3
4899 3 -17 -22 30 12 6 21 24 32 2 11 -22 63 -20 41 -28 -5 37 1 -26 59 -4 -18 8 -34 22 -20 75 45 41 69 23 7 15 34
4933 34 20 45 28 45 0 8 59 -34 68 34 -25 -40 53 28 10 -29 20 -3 -12 -1 -28 -43 -16 19 -16 33 23 41 53 35 80
4964 80 12 -44 26 20 46 31 57 -17 -11 -3 -47 59 -22 17 6 -33 37 -16 19 0 -40 12 -42 -12 -61 3 14 -10 -14 -10 -35 57
4996E7l2L6n6K4j5n2N3j7N8n4Rn9J7L4Nj9L1j4j0pkM6l9%k1J2M4Nm1J2j5LJ8l5
5030b4N2Ml9L5k2M8p9L4J2Qm0K9jj0J5p3P8n3M6lj9J6K1n5J4rP3m9MK5K4n7LK6
5064C4n6j8O0%k8M5j4j7j3l8J8P2m3J3o2P9n5j3O7J3%n2nL0j5l%n%o3Q7l2mM6
5098B8j0j3Pl2pPJ0J9%o2R2o7kL2mrk5P8n7L4n7K6kjM5K2m9Rk2K9%k8M2l6Q2l8
5134D1o3J8L3l4k0M5l8J5O2qn5rL2kq9P9k9K6j2n2K5O9j5k8n0M2J3j5mpPM3nk7
5168a2M8qOk9oM0j9N4k3n1J6Ok7L7pk4j2k6JQ0j0k0Nk2L1k4K4k6L2n2N4n3K6r
5202@J1J3m2K7L3q3O2k5OJ3n9J01nj24J18k8L9j2kl7K0J1n0O9n6N6p4J4QM2n7
5233a1N0o5J8M7j13N6K9Qm1LJ0ML1o4M7J4j4l5P6l1j4J0J6n6N2N0j15P1j0n1Q
$$ plain form
4996 57 25 61 5 29 14 -38 15 -2 56 2 11 -48 -31 3 8 -11 20 6 -4 -11 -13 33 -6 -6 -27 -15 29 34 -7 5 -10 -7 11 -24
5030 -24 28 32 -7 28 6 54 -25 9 21 29 -11 18 17 7 22 -51 27 -26 20 17 -2 14 35 -20 -6 -15 58 9 13 38 62 5 8 34
5064 34 -22 -40 20 20 -8 37 23 6 -7 -45 -27 45 2 15 -47 32 -23 -36 31 44 44 -8 -13 17 2 -1 -1 -6 -6 -69 18 -14 -18 28
5098 28 18 5 12 -20 -27 -20 -10 9 9 -53 39 -28 -30 2 -2 -11 -36 42 -15 19 -38 -12 -14 -15 30 52 3 12 -10 19 19 -9 33 -3 79 41
5134 41 -22 -4 29 -5 -25 20 -18 -3 59 51 -4 -13 19 17 -72 7 -22 4 -8 -60 -35 34 19 -9 -59 -17 -4 -19 -23 -30 -23 20 15 -12
5168 -12 36 28 34 5 -1 39 20 74 51 0 16 22 -5 32 25 1 -11 -37 -36 44 34 14 19 -3 28 4 28 2 34 -18 36 -17 9 0
5202 0 11 24 -18 9 42 -41 21 -4 2 15 -44 57 52 -72 46 18 57 45 43 6 26 37 -13 56 0 56 -18 -4 4 46 -11
5233 -11 39 -26 -8 39 -74 -18 11 19 -22 -19 -9 -5 26 -38 9 23 9 -26 50 19 5 15 31 -25 27 77 -38 33 23 -28 -20
5264b0K8l9P4J6j02Q7p0P5k7j8Pj2k7K3Ol9L3JPk8L8Rk0J8k9K6l0J3Lkl1K2l5
5297d3N6Jkj8J5KKj9N3m3J2rK1K0j5j9JM1l6m6K3JM0%m2j1J5j3k9O1l3P2n6j2
5331a0M1Qo9J6K4n8J3jM0KJ2J6m6K5lk3%O4n8J3J2m6J9N6m0J6m1j5O9j8l8K5j0
5364ep7N8K8m9J6J3K6ll9M5k0Lk8N7k5J7ml6L5pJ8n8O3n0PN6l5j2J6O0q8J8k2
5397b2K3L0n5j0l0M3J7Oj6pl%M3rj7L2k2J9l7Mj1LkN7m9L0o2N8p9N2j2NPL8j3
5432A1K0l3N6n1k8O7l1J8n6N8J2Ro7pM4j8M5l6l6L4j3K4j06R2L6l7k3K8k8J0L1
5463B5j0k1k8K8j1L9Jm4L8K7l0j4l1O5m8NN5j9Rk8J3j1M2p9j0O2Kj9J2j6L4r4
5495e6L0L6j4Nl4QN4o6QP3n3J1qRk5k3L5M1nl2j5M7l2l0O7j3l7L1k2RP4q0p7P6
$$ plain form
5264 -20 8 -31 43 59 -43 44 -26 49 22 4 11 -1 -28 -5 1 -38 -5 -4 3 -25 13 22 2 20 -9 17 -13 0 3 1 -30 -8 -43
5297 -43 13 14 12 -6 9 11 13 -6 47 4 16 7 28 48 33 14 15 56 20 -26 -3 -2 38 38 -4 -15 0 -13 -42 19 -14 58 2 -10
5331 -10 31 39 -30 -14 10 -48 -35 -36 4 6 18 34 -12 13 10 -13 -13 51 -7 6 18 -28 -9 47 7 23 -18 -33 36 18 -20 5 -5
5364 -5 -82 -24 4 -45 -29 -16 10 7 -32 13 -7 -4 -32 25 0 17 13 -23 12 5 23 -35 28 -22 -15 41 6 -6 10 70 -18 0 -22
5397 -22 1 31 -24 -34 -64 -21 -4 2 -14 -21 -24 -24 19 10 -7 25 3 22 -15 -11 -22 -19 -21 36 -13 17 -45 13 -66 -14 -26 -21 -14 24 11
5432 11 31 -2 54 3 -25 42 11 29 -27 31 43 52 -15 -22 22 4 49 13 -23 11 -2 22 -84 8 44 7 -16 12 -16 -6 25
5463 25 15 -6 -34 -6 -17 22 23 -21 17 44 14 0 -31 34 -14 -9 46 27 36 8 21 10 52 -27 -37 25 27 8 20 4 38 -56
5495 -56 -26 10 -4 1 -33 -25 29 -37 -29 44 -9 2 -6 3 -22 -45 -10 31 26 -6 -21 26 -6 -36 31 18 -19 12 -10 -1 73 -7 -84 -8
5529hJ4QMn1M2K5o4mN5N5j23O6l2k9M4j3j7N0p9Q5qL4j1p3K3kL4k1K8Ok5j3N4
5562E4o3N1m5L7m3K7j5Nqjj6O8o5K9j3j6rL3m8oK4M0j3n9N2M4p6P5k3j6j1k2L2
5595CkO2n5L3n1K3L0j8j5o1N9J6n5pP3j01P9lK5m8L4Rm5lkoP1Jp5lM8j2K6l1j6
5630a7J5L2Pm0mJ1K3k5rK5n7R6j6o8L3l1O0q5M9Kl7N0M3r6K1mN4n4L2M6o3j4o
5663b7L7kk0j3K0l3O9Mo7L0J5m8M8L0j5o4M8k8L9m3K3KK2j9j9L7l1l1j9M2K3j
5695Ino9K8L0J6k6j9lK8Lk6K3L8l4j4MKK4L0l5J0l0J3JK1J2n2N3q3L8K4k5L2m1
5729b3N9J8p5L3k2j4NkK1Oj4L7l5LJ5l2K7KM4p5k0N5l5k7K0M6n1K5j2mL3LQm0
5763b1M0l9l1O1j8OL0o2R3p2P8o2L0ml3k7k9J08k6Po0K3K0Q%j7J2j4nj1J3n0L5
$$ plain form
5529 -8 6 14 18 -33 9 34 -30 -34 21 76 -47 19 -13 -42 2 -11 -28 22 -57 28 20 54 43 -30 -7 -9 25 4 32 38 13 0 54
5562 54 -9 42 -3 34 -9 18 3 8 0 -1 -17 51 -14 15 2 -14 -23 10 -38 -44 -20 20 7 -52 0 44 -32 43 20 4 -7 -29 3
5595 3 1 63 8 41 -10 13 43 25 10 -51 8 24 -31 -38 35 -66 13 10 35 -13 21 30 -15 -18 -20 -26 45 46 -29 -32 16 4 30 -1 -17
5630 -17 -2 30 37 -3 -7 4 27 2 -7 18 -39 57 41 -27 6 -25 35 -50 -1 1 -36 14 57 -39 -18 -22 32 -22 10 56 -7 -21 -27
5663 -27 10 8 -12 -25 -5 -38 31 35 -32 -2 13 -35 13 43 28 -36 12 -16 23 -20 3 5 27 8 -11 26 -5 -36 -55 -13 10 9
5695 9 4 -65 -37 -7 9 -17 -36 -39 -11 -8 -34 -11 27 -7 -21 -17 -15 9 39 4 14 -16 -3 -2 19 31 -21 32 -51 -13 11 -14 18 -23
5729 -23 36 54 -21 12 -10 -24 -19 -21 0 6 -8 29 -6 -3 12 -20 7 9 53 -22 -42 13 -22 -49 -29 17 -34 -9 -21 -25 8 11 19 -21
5763 -21 19 -20 -51 10 -8 -2 28 -34 59 -13 65 3 33 29 -4 -31 -60 48 22 29 -31 -8 12 20 20 3 15 1 -4 -15 -2 -52 -17
5796a7L0K1n3k0N3l3L5l8J9qj6P0j4KLr7Q8K0k5j0J1k9m0mK5RJ9K2J2j7n0N1J8
5829C7r0P2o7J3O4k9L7l0NqK9k6LNJj7Rl8l8M7L6J0n5J05p1k3P6o6l1N8j9L4l9
5862fK6l2L6n1K5K4m7K9Lj2mJ5rK8m3j5lQ8Ln8KM1l2l6O2l0k6J1J7j4M4M6n1m9
5896a8J3Lkm4L7MM3m3l3J5K4omJ9l6K7Mo6L2P3p6LN7mm6L4k5mJ8L1K0n5K8j2j9
5931hm4N6j1jJ6k7P5o7j2J8K3J8l9JJ9o2K3J3J9j9KK3l0Mk1Q1l8j3J9L2l6k7K7
5964A4prN2n0J2NL5m1j0l3M8j6k8J12p2l3M1j4Jkj8M4Nn9O0J3k1Jk9j0NKqk3J04
5999G1p5RJ6l0L4k5j2k1R1p8j5O7p0kP8Jm0OK6m3j7J1L5k6oR8n5n2M1j3j7J6J1
6032A4j9k2Q7k9n7M4j7l9J8N5m2J3nplj9K6J1LJ0l2K7o0J2J2M1m6J3R0p5O3k9
$$ plain form
5796 -17 13 34 -19 -39 14 -19 16 -22 -3 -11 -27 43 29 31 34 -63 25 45 20 10 21 -8 -48 -52 -27 -18 1 23 35 18 -32 19 37
5829 37 -53 19 -48 -35 29 0 37 7 12 4 33 7 10 15 16 -1 8 -30 -68 -21 15 25 -30 75 4 -19 57 -9 -40 18 -1 33 -6
5862 -6 20 -12 24 -27 -2 22 -25 4 7 -5 -9 6 -3 25 -18 -33 -36 52 55 -3 -1 40 8 -28 34 4 -22 -11 6 -8 36 82 31 -18
5896 -18 -5 -2 -4 -48 -11 -7 36 -7 -40 -25 -1 -7 -11 8 -28 -1 3 -63 -31 42 -34 -31 26 22 -24 10 -15 -19 -1 30 50 -5 23 11 -8
5931 -8 -52 4 -7 -8 8 -19 56 -11 -23 -5 18 36 -3 -2 17 -45 -22 -9 10 -9 -7 16 -14 -10 -31 50 12 -1 18 50 14 -13 14
5964 14 7 -2 50 0 12 17 52 11 1 -32 16 0 -28 84 12 -21 20 6 7 5 -13 31 36 -23 37 50 29 30 1 -9 -4 -2 -10 -33 71
5999 71 -4 5 21 -9 25 0 -12 -33 58 -20 -35 32 -38 -40 38 39 -1 5 31 -12 -29 -18 17 -9 -15 83 28 -24 17 4 -13 3 14
6032 14 -5 -27 60 31 -26 18 1 -38 -20 35 -7 6 1 -6 -9 -28 -2 9 12 22 -10 17 -43 -31 -19 22 -24 -11 79 4 67 38
6064C8k3j9l2M8L0m1K4KJ9l1lm8M6n1Q7K1n1j01J11k4rK1rM0n0K4Nj2qJ7K1k6
6096A6jj8K3j3P8o6J5k9oPpQ7q2j5L4o9O8m7Nk3K7M6m8K0J4J5n4pO1l9MN0o4J2
6130fj2K5l1jJ3Qrl5R1m6Oj4j6O4n5M7Nm5NK9J9l3PNkL4r1J9MM7k2jk%l1rK0J9
6168Fo7J20j07N9M2o4k5lK7K1K8j2k9j5olJ3K3Jm0M7Ol1M0l2Pk9L9J3n3j2K8P6
6201F8j13jO4m3KRN0k6j4l9N2j9k1rKO7Kk0nj0j9J1J8n4M7L5o3N4j3j3rJ6k8L5
6235A3oKqL5k4k7J0j4L3m9JP2j9l4j6O2k3j3M9p1L0qL2m7KK7Lkj8%k1L0Km7L7
6270goL2o4N6k6O3k7POPm2J1Ok1rJ4J8l5N4m4K2J7mp6P0k3j2l2N6m9J9K6k2LM5
6305C3Nk6m7K3rJ7m4Q0n8N5k2qj7O8m9N4l9N0q8jj6N8j5Ol5J1N6j9m3L6m2m0N7
$$ plain form
6064 38 15 -4 -36 12 42 1 25 27 46 15 12 -36 10 -41 46 67 16 -85 26 2 -7 14 5 45 -5 19 24 12 4 21 42 16
6096 16 15 -3 20 7 85 19 34 5 -1 6 -1 86 4 -11 23 -46 22 -25 -20 -43 -16 30 -18 2 16 31 -23 -30 31 -8 -4 46 -18 -6
6130 -6 -18 7 -24 -25 -12 -4 -13 -48 43 -3 3 -11 -27 37 -18 29 34 -11 -6 23 42 9 16 21 19 53 -38 -19 -15 32 10 9 7 7 -24 -33 -13 6
6168 6 -61 59 -48 11 53 -11 -36 -39 -12 9 37 25 -4 -19 -25 -28 -15 8 9 -31 16 22 -9 31 -1 6 -23 16 29 -24 -36 -8 68
6201 68 -45 -46 18 -25 -23 -14 36 10 -4 -43 9 -10 -31 -40 -38 29 31 11 6 -4 -23 -12 6 -48 -1 34 -29 25 12 -1 -10 6 -22 13
6235 13 7 9 1 36 12 -15 -5 -19 14 -35 -34 38 19 -15 -31 31 8 -5 44 -27 3 -5 27 -20 -18 9 12 10 -8 -8 -29 1 3 -44 -7
6270 -7 -13 19 -45 11 -15 48 21 28 34 41 -1 10 16 -5 -14 0 18 -17 37 -7 15 32 28 -48 22 -1 -13 -45 11 -38 -19 7 -15 -12 33
6305 33 38 12 -35 -12 -21 -4 -48 32 -26 29 7 -1 -18 50 1 55 16 66 -22 -23 -39 19 4 10 -25 -14 42 23 -20 16 -26 -66 -9
6338ik8N3n5M2k1L5Jj3j9k0K4J1mRl1O2p4M6j6K4kJ9p6P1o7N8qLKm2P6l0l1l5
6372d5J9J4K8k1jN9Jo2qlL2n0O3j6mK8k8L1k5j5M3ln6J1M7l1l5O2k7l1J6M1j6
6405A8N4p8K7p5P4J5n0K2oNj4k7R2j3k9m2M6k8k4J09q6mO1o6j2NpjL9Om6K3JN0
6439C9j05LN6M7p3J2L8K6k4j9NLN8l3n5L4O3p9pJ7jkJ2m3N1p6j0P8k5J0J5l6p
6472b8Q4j44R2j4j6O6m9j9N2J5l8rM1l8L6m2jKL0j2j7L1K1m4L6m1M9j8J0p1rL1
6504a4rQ4j09N3M9r6O0m8QL0j0J6L5m7M0n7K9p2M4L5l5M1l0k9M3j3L3mJ4Kj0k3
6536A0l9O7l1mj3j4JM2%k9J0K8n6k3N5K7o3K1l2m5M7L9J7m5J7O3m5J2%K7p2K4
6568dkK4jJ0k3MN1n9qN4p1K5nK4l1j9mM5Ql0N6o0JK1l1J6Pm5P1l9kK9j8KL1m1
$$ plain form
6338 -9 -37 16 -39 3 -18 17 18 5 -14 -34 -10 1 -3 6 -25 37 -37 9 -7 17 15 34 -42 29 -38 20 12 15 17 -25 51 21 -10 -45
6372 -45 -26 -12 16 -5 -6 53 54 -8 -16 -19 13 -37 26 10 6 34 6 37 12 -3 40 37 -19 -8 39 8 -27 35 8 -23 -7 34 18
6405 18 72 -6 21 -54 20 35 -15 7 1 6 -8 -35 57 44 15 -27 19 -9 -33 76 -10 -14 47 -19 -31 -26 -33 -34 5 11 -35 -12 -11 39
6439 39 -66 -63 -7 40 -33 -21 17 43 19 0 5 8 66 33 -22 12 75 -4 -11 6 5 3 15 -28 23 -53 -63 15 -10 0 15 -21 -28
6472 -28 56 -88 4 -10 -26 40 -9 -28 24 39 1 -8 33 -5 31 -11 -12 -10 20 8 -9 22 43 -1 35 -6 43 25 35 -36 -45 -14
6504 -14 -23 61 -48 5 54 -42 18 -30 -22 8 -2 14 49 2 42 -15 14 -58 -14 21 -14 27 -3 -32 11 -2 31 27 41 43 33 10
6536 10 -29 38 7 3 -10 -24 -23 19 19 -10 0 28 -28 -51 4 31 -32 -11 -43 -88 -41 -2 15 -30 -13 50 5 17 17 44 -28 -4
6568 -4 -6 18 17 27 4 8 59 0 -8 46 -25 0 -5 19 -12 -31 -35 10 18 -12 44 -16 -15 6 -25 -9 -2 -47 24 -15 -17 12 -6 -4 27 -14
6604a4L8m8k1M9N1n0J9PJ7Mo8k0J6M8%Mn1M3o7R7k2k8K4K4j00L5k3J0M2k4J3j7
6636a2J5K0j7J3M4n9k9K2M4q9R1m4j1LM7j2j9J7l3O6p5K0m4nM5J8on1O6m2P1o1
6668gLj9mM8K7m7PJ4j5l8oN8o4M5N5j37Q6j5N9k0n1K0K6Kr2R0llK4p3K5J1j2j1
6702a7J6K3J9l9J2l7K5m1L8o0L9PRk3M5n1M0Nj7M1l1L1n5JN5j9n0K3l2KJ1MN1
6735B5lNj0K6k9l8J3l8O4k9N1k8j0ql8L8M8l2MK5o8L8k6L0m6K5L2mnl4QK8l4j4
6769c4J9J9l8N7k8n9P8J6l9L4m6J8m7N7nQ2p5m7L1K9kl1Nj4J2J1l3lL2JK1qj6
6802cK0j5k2P1r1K1K8Loj3L5Pk6%Jj2j4M6k0K1L0o1L0m2J7n1N2j5K6k5l0M2L1
6835C5m3K0Lmlok2k0K3rL0rl8M2j6M3nn7J00p3k7K6J6noj8K9J3k4J5qK8k5j2q
$$ plain form
6604 -14 24 -24 -45 4 55 5 24 31 48 52 -16 -36 -20 28 28 32 -19 24 -43 54 32 4 28 52 -48 -13 -36 -26 16 -8 5 -12
6636 -12 3 23 6 19 63 4 -25 -3 41 -48 43 -1 -12 -9 38 26 7 24 -9 57 -18 2 -42 -47 -2 16 10 -41 25 -17 54 -7
6668 -7 -4 -23 -27 21 48 1 8 22 7 -31 -37 21 -43 2 57 -80 6 -9 50 30 -21 -1 25 27 -65 25 22 19 43 -30 -5 6 -6 -17
6702 -17 -1 22 41 2 14 -23 2 -39 -1 -61 -22 -15 -6 -29 16 -35 5 10 -7 34 3 34 -21 -20 35 16 -34 -11 -43 -41 -30 -26 25
6735 25 22 27 17 43 14 -24 -11 -49 15 -14 37 9 -1 -9 -47 -9 39 7 11 36 -32 6 -20 10 -36 -11 21 17 12 -22 -14 14 -20 -34
6769 -34 -15 4 -34 23 -5 -64 14 30 -9 25 -21 -3 -50 7 2 84 9 -38 -7 22 20 -11 -6 -20 -8 3 -30 -33 -1 0 21 13 -3
6802 -3 17 2 -20 51 -40 -19 9 12 6 -7 28 35 9 9 10 -2 -16 30 10 31 61 0 30 -12 5 -46 6 -9 17 -8 -38 4 35
6835 35 -8 12 15 11 8 2 -20 -40 -17 -26 4 -5 -43 -1 -17 26 21 -36 64 -9 -36 -10 6 1 -5 -23 6 19 -5 10 2 30 5 -7 -15
6870a5L8l9M1k4l4L2k4J4J5l0M2jn6M4j5J1lN9k2n7M8Kpp3K6O7Pl7k6O6j0Rl1
6903A7l1K2K2rL0p0J01k6p2L1Mo5L6L7o2M7J0Ol3L3Nk2L1k6n3K1mJJ5L2L4n3L
6936A2l3K4J9m7J2M4Mp5P5m5L7kk9k4P5l0L3n0k4M3lk1J0K3q9O0M2J9j5j6l0n
6968fL1no4Q4m2lnN8q0kM1K0n6L7NL4l1l9K5kj4M1J0n2L6j8k7L1rJ1L3rk4j7L8
7003C0K1l4j7pn0O4j0k7LM1l9K4k5QJ9J1Qo8K2J3pn7J03j1oj0J6j4k2L4L2o8K6
7036C%j9M4n2K9j3J7L3m4M5Rm3kj4L7n7Ql7O5m2J3N4j8m8K9j7M5Pn8J7j0N1l9
7069gk5M9p3N8j3N0o1KrL3j2K8o0M2k4J4J4n6R3l0n6N9k9j3L1mnJJ2n1N1j8l0
7102c9K5K9l0N5n1L6k4Nj9MOJ0mJ7p1L1PO0j3l9J3qNjj1l4J9J7M5n8J3KL3K8j7
$$ plain form
6870 -15 23 -16 25 1 -33 -1 -25 -11 4 -26 16 15 -41 3 -12 -1 -4 55 33 -24 24 26 19 -54 -28 39 46 9 -17 49 39 48 17
6903 17 -14 8 30 21 51 -19 82 56 -16 15 19 -46 -10 27 -35 12 22 28 -5 28 33 11 42 16 -37 -16 -20 -19 -4 28 62 9 12
6936 12 -21 3 22 -25 -13 31 35 -40 35 -10 27 25 -4 -28 47 17 50 0 -24 19 16 -5 5 28 -61 -1 41 60 45 29 -1 -6
6968 -6 25 20 -44 40 -2 -5 -10 48 -32 -34 7 27 -29 8 13 47 16 -23 2 0 -14 27 37 -15 21 3 -24 7 -2 9 42 33 9 -8 30
7003 30 51 17 0 -7 -57 7 -3 -30 -27 14 -25 -1 -26 -18 1 12 20 -48 -26 -13 -20 -77 26 15 9 -1 15 1 -21 13 45 -23 3
7036 3 3 -16 28 -24 5 -8 9 42 -2 43 52 9 7 -7 30 -27 -19 -56 9 -33 -20 34 16 -32 -3 -20 25 32 -26 -9 -19 32 -7
7069 -7 -32 17 -56 2 -11 39 -22 -20 -29 4 -8 20 -40 2 -22 -8 6 -50 43 13 -43 16 -13 -26 5 1 -4 -3 9 -42 9 -9 -39
7102 -39 -14 15 -15 40 -11 25 1 6 -13 -9 -3 7 3 20 -51 -20 -13 47 34 -5 8 0 5 4 -7 -41 -22 -5 40 -18 -5 -3 30 58 41
7137D1k6j0j4j2KlK8K3J7j01N5OK7o6N3n4L0k6P2m5rM3L7n7Pj4l3P8m5lJ8k8P7
7170F8o0o5N7L0k1k6N6n7K6j9M1NJ5k3j9LK3o6K2O7p0j0L9mk1K3J6lm3M7Nn2L5
7203A9l9M9J4m5M2j0n5N0l4M5m4N0m8j2J5J4jk1L9r3O6pL4j9J3QK2o0O8k0m3L8
7235C5m0J1j7O5m5j9k7P0rj1K1k7rk0K9n1L1M5J9p7K5Kj5JnK0k0L4l3k1J9k2O0
7268A9J9l0J9J0J6o5l5O0k5P4n2Qj5Jn0N6k2J1M1n4O6m9MJ7m1oO8ml5Nm5MM5N0
7302F5r6M2n1N6Rp9O6o4L0N6nn6J0L3RK5n3j3PK5mJk6K1kO0n0j7j1pM1l3K6L9
7336E4r4J7N7o9K8K1m7lL7j6k3K4PN2l9qL3n9nL0j7L9k6J8MK0l4Ln1Q8j6n8rQ
7370c4pQ4j6n6N0L3p9J1K2oOk7J7K5rm0J2J0JJ6Kl3j8LK6nQj7K2Ql1L0n6O6n8
$$ plain form
7137 41 15 5 -9 -21 -19 -22 6 29 46 -55 0 6 33 -33 20 -34 -4 -30 42 -3 -12 31 68 11 18 4 -29 49 4 1 19 -9 68
7170 68 8 -57 0 30 9 -17 39 -18 8 -11 30 35 50 27 8 11 34 -32 -10 57 -13 -23 16 12 -9 14 30 27 -16 31 36 -16 19
7203 19 -20 29 43 -2 40 30 -25 25 -9 36 -8 42 -6 -18 -3 11 10 -11 28 -65 1 -6 28 9 22 30 52 -8 60 40 -3 35
7235 35 -5 6 -11 54 9 -10 -37 33 24 13 34 7 -2 -22 7 -44 -13 32 51 -26 -1 1 -14 -13 -18 2 -18 16 -17 -38 -19 -41 19
7268 19 38 8 27 37 53 -12 -47 13 -12 62 10 18 3 4 -46 10 -12 -1 40 -14 52 3 7 24 -17 -23 45 41 6 11 -34 -30 15 65
7302 65 -31 11 -40 16 25 -54 12 -52 -22 34 29 -27 -17 16 25 50 -3 -16 -9 16 12 13 -13 8 6 66 16 -1 -12 -19 22 -11 15 54
7336 54 -40 -23 34 -35 -7 14 -33 -36 1 -15 -38 -14 -7 45 6 -2 31 -28 -33 -3 -20 19 -7 11 15 35 1 4 -47 41 25 -33 -42 -34
7370 -34 -41 43 27 -29 21 54 -25 -14 8 2 8 -19 -2 23 14 -26 -14 -4 -3 13 15 -18 -36 -33 -7 -12 -4 -21 1 9 -22 8 -48 18 -40
7405d0KJ3M3k5ok0J8O2o0K2j6qP0o2J1n3oJ20k4p4NN1k8j3pL4J5O0o8l4K7npK
7439anL0Nr4O5Nk9K4j2m%J8rK1j5k9L2j3JN0roo7K7N0j6l8L0l2RJJ6Jm1K3oL7
7476A9m8K4J%L1l7M7l6nj4M2k9pK6l9oN8m4NM7j9l0M0j8j2N7o9k8Q3K1m0n1N7
7509B6o0O6o5M5M1o0J3nK8J1m0N4q2L6J1jm2L0l0J1k5N6Nj0j6pN3k7Qk2%L9k3
7542A8o0P0J3qk7K7k1k3j0M0N7o8j9nJ4N0j7k1L7p3pM5l3L6p5M8%j3L3j6NJ7k8
7575a4kL5J1Ppl7j5K5L8j6j7K7m7J8J2M2r6M1j8K3J2mRk0m3M7m7L9N6n1l5NL6
7608A4Jk9j0pK8m2M9k6M1Qqk4kqM2pk9M1j7j8JJ7j4kkK1j4lm2N0J6l1n2L2M1k6
7644a1J8j8Mj5M8o6K6M1o3M0l4j2RJ5L4k1L1j6l3O0mj2n2N3L7l5p5Q5J1k2o7K8
$$ plain form
7405 -40 -38 -25 18 -7 -13 -33 -15 47 -13 9 -7 -15 55 -7 4 -49 -55 65 41 -33 -28 23 -5 -18 -25 9 24 84 16 -18 9 4 -3 -1
7439 -1 -6 24 29 -65 0 5 -24 0 -12 -16 -16 2 -7 14 -1 -30 2 -11 -10 40 31 25 -42 -15 35 19 -19 11 -21 -12 -11 5 6 -35 -12 -18 19
7476 19 -29 -5 -4 -4 27 -10 37 1 -4 -18 24 -5 -12 14 -25 -31 27 -17 -12 35 16 -14 26 8 -4 53 -16 -44 39 60 20 -31 26
7509 26 -34 32 -33 12 53 -7 6 1 29 40 0 54 -28 8 19 18 -24 6 -24 -13 -38 18 23 13 -3 -10 43 16 24 2 2 41 18
7542 18 -42 28 41 33 6 33 12 -11 -21 19 76 8 -11 -16 -2 48 31 10 47 -26 -33 12 -21 15 -60 -12 -12 -25 8 -8 -3 14 -14
7575 -14 -16 19 30 37 30 -7 -22 3 41 25 8 35 -12 6 18 60 -36 5 -13 10 22 18 27 7 -36 11 -36 3 59 8 -27 -22 14
7608 14 15 -14 -24 -31 -3 -45 4 -22 19 27 19 -5 -7 -15 27 20 -9 32 15 -3 -2 15 1 -1 -3 18 4 1 -41 9 25 -6 -58 -26 15 -11
7644 -11 7 -11 -7 -22 26 -40 -14 27 -36 4 -30 -42 -33 -18 16 -5 26 10 -23 37 33 21 -31 22 59 24 -51 34 45 23 -44 -16
7676a6K7j2j7J8Lk0LK0j5j1nM8n4qK4L1rJ7RLp6mNk4M0j1M7k7M4J3l0l1P6o5l5
7711d2K2M6m8K7pL3l0J9n6P6j6pk9mM9k5J4Kk8K5k4Nk6K1K5ll7L4p3N4jK3j3k5
7745a9K6k6L6j3l0J3P9l9j8mPM4n1k1j0M1m9MqM9mK9o7LM0mk6o8J18Orm6M8m7
7779a6M9n7J4MpNJ6Rk7K3N7j33Q4pm9K0nK8J7m6M9j3J6o2K4j3kK3K7J8q7K9k9
7812d1M5j0L6j0j6l3M3j8j2J2OlJ1l6j3jO4m0j6K5k8Q3Rl7K4p8N5ML%j1l3k8Q1
7846C7K3m1j1KN6j6q0J3p9J20l5qj9RLj2M9J4%rKPn6J3M7j4%p2Q9l8N3j3k0j4
7880@Nj7Nm9O4k6N1k2j5pJ0qN2k0L1l6k5J4pJ3n2k2K6P6nk8m7N3j8l1O2J9o6L7
7914A7l1n2N8kPoJ3rNk5M1l8L1OKL5j8j7l1L6J5n5NL5k3qJ3RK5n0L2lj8k1QK9
$$ plain form
7676 -16 11 -1 -18 0 3 -17 -14 6 -9 -20 -25 23 -31 -39 -15 16 7 24 33 36 -40 -44 -39 -63 -23 -34 13 -14 30 43 13 -18 58 -7 -42
7711 -42 -20 26 -22 5 -2 31 1 20 -36 40 24 17 -12 -16 33 8 22 24 -4 21 -3 2 -24 -3 22 19 -18 16 -57 -3 -4 19 6 -19
7745 -19 7 -19 17 4 -26 -13 66 27 9 5 12 56 5 -16 -26 15 -34 -30 -38 11 7 36 -31 -28 12 8 -18 -86 32 38 29 -17 31 -16
7779 -16 33 -24 -10 -6 -13 -8 8 17 -10 13 70 -63 21 14 -35 -15 -20 8 25 -21 28 15 31 -31 -7 -20 -22 1 28 46 -41 -12 -41
7812 -41 4 -6 30 20 4 -29 14 -4 -16 -4 2 -1 10 -26 -39 -40 24 -16 -32 -7 -35 48 57 20 44 -34 21 25 28 28 17 -16 -44 37
7846 37 60 19 8 10 66 50 -30 -17 -96 24 -11 -19 -38 -29 -26 -38 11 25 25 16 18 25 -31 -18 29 15 15 -57 32 -6 47 34 14 0
7880 0 5 -12 -7 -56 8 -18 33 11 -4 -11 -1 -9 43 23 54 18 -7 7 0 13 -39 -61 -35 41 36 8 -39 14 -4 -35 27 46 -20 17
7914 17 -14 -66 -8 -10 -3 -9 4 -5 0 -25 16 -22 9 15 17 52 34 17 -14 22 37 -18 -13 22 -1 -9 4 13 38 -12 20 17 -1 -22 -14 15
7950A5K8nk9l2N1j1o1j2N6K2pMK9j5l6k3M5j6L5o5K2RL4k0K1k9J7n6m0%J2J9J1
7983b7J6jj9N3Lk7nN9o5K1M6l4k1qJ0L4n9NO0r1K9L7K6m2OJ1K5l2M1o0PJJ9l5
8017a7pN4Po0j2J1J8k9P1j9m8Mlk5P4m0K8L7l1j3Nk0M6pj8k8M3jJ7n5M1k1LK5
8051C0l5N9m9n0L6L9n6J8K2n2J0L4m3N9J0Rp8M6o2Q3l8J7ll6J0L5m9L8K3j3lJ6
8083B7j1j1pL0j7m2L4K5Mm0P5k8m8QO6m6M3l3j3k6L2%j2J6no5O2n3k1O4j9K4M
8116A7J2m5j3O4j04N1K6Lj2L9M6r3n7J15nl9j3J5O2n9k2O8k9l7oK3j6LJ6j5J2
8147Gj0l2K2M3j7Lm6Q6o5K4k2k0N7n2J2M4k5j0kLL8j6J0k5m3M9kl3k6O3J7j9N
8180A8j0K7l2J3k0m0M5jk3J8j1
$$ plain form
7950 15 43 38 9 -23 28 17 -44 -56 0 22 15 19 48 33 -3 -26 19 3 38 -27 -5 4 38 18 39 10 27 -29 -69 -69 -57 -38 -27
7983 -27 -11 -12 -31 22 25 -2 -7 52 -13 8 54 20 -1 -9 1 35 -24 -19 41 -50 -21 16 42 0 6 17 42 10 51 -9 -2 -1 18 -17
8017 -17 -24 30 37 -23 -35 -24 -6 -35 36 17 -31 -27 -30 -55 19 -21 7 44 13 0 5 -15 31 24 6 -22 21 20 37 -18 23 2 5 30
8051 30 -5 54 5 -45 -9 30 -26 -8 14 -38 -28 6 -37 22 32 41 -37 9 -53 30 -8 9 6 -30 -20 15 -34 4 27 14 11 27
8083 27 16 5 -2 28 11 -31 3 28 32 -8 67 39 -9 -1 65 19 62 29 16 -10 22 22 10 26 21 -44 18 -35 -56 8 -11 13 17
8116 17 29 -16 -29 35 -69 -18 8 11 -1 38 84 -9 -66 49 44 5 -8 7 69 10 -12 56 27 -10 -16 7 -9 -6 10 -5 7
8147 7 -3 -35 -13 30 13 16 -30 56 -9 15 -7 -27 30 -22 -10 34 9 -1 -3 0 38 22 32 7 -36 13 11 -22 -48 15 32 13 18
8180 18 8 35 3 16 -4 -44 1 0 -23 -5 -16
8191a6
$$ Imaginary data points
##PAGE= N=2
##DATA TABLE= (X++(I..I)), XYDATA
0@%%%%%%%%%%%%%%%%%%%%%%%%%%%%%%%%%Lj0J5j6J6j6J6j6J6j7K0k5L0l2L3l6
49a9M1m6M9n3O0o7P4q2R0j00J14j29J44j66J96k35K90l77N28q74L952j462k913
72i85K108O5j451j43J528j315j034J170M19j692K11J239q02r46J326L89j311L31
90h93J450o81q25J358N89j308K97J367m88j104J137N83j429K7J185o93j083Q08
108B97M97j332j96J086o01j110Q99N59j195j29J355l81j015R79P82j066m4J352
126G37k55r55R88P08j102p1J193l35j071P57N84j108l53J000l71j122O01O15j123
145f83l92J044j45j044N80P37q60k56J147j8q80P00Q26q28k67J156n2r18O09Q16
165A272r12m11J001j04j117M69O80r84n20R64j42j123M16O98q46m55R92O2j004
$$ plain form
0 0 0 0 0 0 0 0 0 0 0 0 0 0 0 0 0 0 0 0 0 0 0 0 0 0 0 0 0 0 0 0 0 0 0 3 -7 8 -8 8 -8 8 -8 8 -9 11 -14 16 -16 17 -19
49 -19 22 -24 25 -28 32 -35 39 -43 47 -53 61 -68 76 -90 106 -129 161 -216 312 -562 3390 1928 -985
72 -985 1123 1188 -263 -406 1122 -193 -1227 -57 362 -1330 -1119 120 -682 -1628 -302 87 -1224 -893
90 -893 557 -124 -949 409 998 -310 -13 1354 866 -238 899 1482 53 80 1265 572 -511 297
108 297 794 -538 -734 352 -249 -1359 -460 99 -1096 -1225 130 -251 -1266 -287 495 -571 -615 737
126 737 482 -473 515 1223 121 50 1243 908 -163 594 1178 70 -283 717 346 -776 -175 440 -683
145 -683 -1075 -31 -176 -1220 -640 97 -763 -1019 128 110 -770 -70 756 -72 -339 817 765 -153 456 1272
165 1272 360 -51 950 846 -271 198 878 -106 -626 338 196 -927 -511 187 -659 -1114 -122 -60 -1064
184a064N02Q10o85l08R71Q9p15M17R25o37m50R56P2r38L92P66p81n38Q61K5j032
205c62K00P58p87o47Q30M1r22K39Q01o64m74Q07K90r07L71P93m29m47R18L11q71
226a51K35Q72m75o00Q18K11r72Q7P78n77o13O71J47r40Q1O87n33o20O85K57q83
247h35J64Q44m63n30Q12L47p46J49Q42k89n47O93L64p66J39P16m08n89N81K76
267G54q95n1P31m10p14N32L01q34j31P81l37o32O48L41o96n5Q92k00n99O68N07
288F01o98l1R12l21n10N12L86p61l9O90l13o91M76L77q57j25O73k94p44M15M57
309A15o75j81P48j85o40N24N45o25j12Q38j33n40M69N80o73j39Q18j20o84M55
329C85M55p15k70O89j93o52K26M79p13k75O91j39p50L11O07o79j72P28n7o16M83
$$ plain form
184 -1064 -562 248 -437 -745 226 315 -400 17 942 305 -145 811 883 -55 337 1103 322 -216 645 670 -362
205 -362 -162 596 -191 -838 -8 33 -889 -650 151 -513 -987 -180 110 -797 -426 367 -62 -509 409 720 -151
226 -151 84 956 481 -119 699 910 -62 25 803 226 -387 284 431 -509 -428 259 -274 -894 -209 48 -835
247 -835 -671 173 -290 -820 -8 339 -407 -258 584 295 -252 441 805 39 178 894 486 -103 478 754
267 754 -141 -192 539 129 -585 -53 248 -586 -717 64 -273 -905 -257 84 -612 -667 225 25 -574 94 601
288 601 -97 -128 784 463 -47 465 851 90 51 741 428 -263 213 590 -267 -392 281 -13 -757 -342 115
309 115 -560 -741 7 -178 -818 -294 251 -374 -486 352 219 -321 148 728 55 -84 734 614 -70 385
329 385 840 125 -145 544 351 -301 -75 404 -309 -584 107 -32 -782 -471 136 -543 -715 13 -44 -660 -177
350a77N35n23j86P81j4o00M31N20m91k99O39m5o46K15M99o39k69N25l6o79J42
371c17N56n99l82O45R2p33K87O37m93k89O86J79o42K93O45m37k71O44J19o57K75
392B38N08m70l58N45M6p30J14N22m88m61N27J02o98J22O24m63m41O19K37o62J84
413c83O18k68m21O61K29n63J35O70l31m60O51J68o78O9N73m13m70M60J09o62j0
434c16N81l62n47M71K51o75KO67l05m40N76K56n80J30P06k75m03N49L25n88O3
455H6O26l31m66M83K51o42q7N08k13n66L46K18n60j28M89k23n21M57L72o13k6
476e40O25j73m50N13L94m97k5O20r9n34M39M53n95j64N67j76n50M07L44o47j60
497b48N49k32o20L87K93n62j44N94j54m87L49M18m36j05O21kn48L55M51m35q9
$$ plain form
350 -177 358 -165 -351 430 416 -184 247 767 276 -23 616 571 -75 140 639 0 -269 256 220 -459 -317
371 -317 239 -360 -742 -97 -5 -738 -451 186 -307 -596 90 269 -373 -80 565 128 -143 501 620 -37 238
392 238 746 276 -82 463 509 -221 -107 415 -73 -534 -7 95 -603 -481 143 -320 -761 -142 95 -567 -383
413 -383 235 -33 -454 207 436 -127 8 678 347 -113 538 706 28 97 670 257 -213 247 356 -306 -316
434 -316 265 -97 -644 -173 78 -597 -595 72 -233 -673 -97 159 -421 -291 415 140 -263 286 611 23 86
455 86 712 381 -85 398 649 7 -80 428 215 -351 -5 213 -347 -475 14 -209 -730 -273 99 -514 -540
476 -540 85 -88 -538 -25 369 -128 -153 467 368 -166 273 726 131 -33 534 358 -192 215 559 -88 -248
497 -248 301 69 -551 -164 129 -433 -577 17 -137 -624 -275 143 -293 -398 223 221 -327 28 479 44 -45
518d5N48On63L34L40m77k92O07r0o46K60L42m50l31N35j10n77K73M28l99k96N65
540c8Q3n62K87M60l58j74O30N4n32K81M96l38l22N23N4n72J93L95m19l99N21J1
562B74o41J61M00m91k98N04J00n55J13N00k88k88M92K04m82J98N53m01j87M37
582C05K43n55J44M48k82l77M65Q0m63o3M55l72l43M03L8n91J09M30k87l68L80
603b01K20n24M4O53k29m09N02K26l93N4N25j72m07M67J75m77J4M90k88m41L99
624B28J00n20K2M22k99l97L35K31n28k3M69k34l63M16K93m33%N66j96m17M96K70
646D38m42m6N34j52l94L10L19m99j76M82j15n05K90K22m84j54M82j77m93L88K17
667D5l78j19M87o2l87L42L42l43r9N16l6m13K94L27l94j11M91q3m73K63J88l72
$$ plain form
518 -45 503 509 -54 280 620 143 -149 458 368 -278 -18 324 -126 -457 78 -32 -609 -336 92 -307 -603 -38
540 -38 45 -517 -230 230 -128 -302 328 382 -150 131 627 289 -33 490 544 -28 165 560 141 -258 263 274
562 274 -367 -206 194 -297 -595 -91 9 -546 -433 67 -221 -509 -17 187 -295 -97 456 55 -132 305
582 305 548 -7 137 585 303 -74 391 471 8 -55 400 28 -315 88 126 -465 -356 74 -213 -581 -201
603 -201 19 -505 -461 192 -37 -446 56 282 -111 -57 468 296 -111 356 531 54 68 558 270 -171 228
624 228 328 -192 -170 252 -47 -444 -109 122 -406 -429 40 -194 -557 -141 152 -281 -281 285 89 -328 168 438
646 438 -4 -50 484 332 -62 248 567 68 -108 374 259 -246 44 266 -218 -372 110 -67 -560 -172 45
667 45 -333 -452 35 -27 -414 -72 270 -73 -172 344 308 -105 189 516 122 11 502 419 -54 209 397 25
689B5k41M44j57m38J91L31n07j51M46p8l64K36M21m35j35M94M2l74K50L48l13
710C5j12N09m4l96K06L55l67k38M11K7m84P4L86l89l06L93M8n38J74L07k87k52
732d88M64M0m30J35M75k66k78N17R6l94J60M01k14k21M16L6l94K8L86k90l24L64
754B19Km76P3L99l65k91L95M3m02R9L46k14k65L88J63m27J48M28j39l35M16J33
776C38l23M2M56k44l15L42R8m27N2L63k58m17L35J39n01L8L52k57k96L66J36l73
798c54L8M11j42l01L63K13l53K9M80k00k59L41K00m78J7M11j71l71K92K14m08
819b8p8K82r9m48K57J74l86p5M10j47k85K58K85l78J0M58r5l41K93L03l49p6M02
842C47M1m20K29K19l52p9M39j81m68K66K50l95j85L33q2m54K10L22l34j63M23
$$ plain form
689 25 -216 228 71 -367 -176 155 -352 -503 -57 -135 -499 -263 158 -277 -412 82 124 -250 0 348 35
710 35 -77 432 388 -8 198 553 186 -52 359 386 -98 -24 362 -27 -333 60 108 -430 -256 51 -236 -488
732 -488 -24 16 -414 -279 196 -70 -348 169 265 -129 31 432 218 -3 413 449 55 83 469 179 -145 219
754 219 221 -255 -182 217 -148 -439 -44 -1 -403 -304 42 -172 -437 -49 114 -313 -165 263 124 -211 205 338
776 338 15 57 513 269 -46 296 394 -33 19 382 124 -293 42 181 -320 -282 70 -187 -483 -117 19 -354
798 -354 -316 95 -47 -348 15 228 -125 -96 384 184 -75 266 466 -12 5 416 245 -126 166 380 -28
819 -28 -106 176 77 -371 -114 60 -326 -401 9 -138 -423 -165 120 -258 -248 210 115 -226 67 370 21 -55 347
842 347 388 -32 197 416 64 -15 424 243 -225 41 291 -104 -289 44 -38 -492 -282 40 -294 -457 -34
863c4nl64K54L22k91j31M76Rl20K27K09k87k4L44Jm41K05K72l91j47K97j7l84
886b20Q7L09l85j77L71k5l91J56L83l62j04L99P6l25J27L52k50j37M41p3l00J18
908G0L70k52k56L55Rl64J11K37l07k25K77Q1m29J06K85k58j90K90O7k87N8L49
930I7j65k30L67J37l71J92L25j90k04L04J26l98R4K42j61l08L03J02m40P7K39
951A38j92k77K38J19l86M7L49k04k49L46J47l06M0L54j28k20L23J80l15N9L26
972C89j21l23K32J62l66L3L25k14k88K14J11l67oK27q3k94K25J67k96q0L93r9
994e9k50K80J85l09KM49j03l00L20J88l25k2L20j11l08J77K08l87o5K53q4k78
1016b19J05K32l54l9L15p2l61K38J94k58p6L87j1l15K35K49k70m9L12Rk69K13
$$ plain form
863 -34 -39 -403 -149 173 -118 -249 227 236 -84 143 352 65 41 385 386 -55 150 422 31 -116 181 164 -220
886 -220 -133 176 -209 -386 -15 -40 -431 -275 108 -254 -358 41 117 -208 -81 271 21 -116 325 252 -48 70
908 70 440 188 -68 287 296 -68 43 280 -27 -252 25 106 -323 -217 68 -190 -380 -90 -23 -310 -252 97
930 97 -68 -298 69 206 -165 27 352 162 -42 262 388 -10 84 326 165 -143 160 262 -178 -101 138
951 138 -54 -331 -93 26 -360 -313 36 -168 -417 -71 76 -230 -190 164 36 -184 139 319 4 63 389
972 389 268 -55 177 339 -27 6 331 117 -171 43 154 -213 -219 8 -75 -369 -144 23 -273 -353 40 -59
994 -59 -309 -29 156 -153 -151 298 195 -105 215 403 78 56 376 265 -43 134 342 -45 -110 143 59 -219
1016 -219 -114 118 -236 -275 40 -32 -393 -155 39 -219 -295 92 81 -234 1 250 -20 -69 243 252 -17 196
1038A96J66k29j54L23p8k91J22J66l18j36L00k4l27J11K62k80j11L04K1l18J63
1059a32K18j59j17L11K9k65J90K76l02o8L02K7l14J17K63k83j60K06P3l88R2K33
1081A49l12r9K79Nl24L5K85k05j31L09P2k97J46K55j56j26L28J17l29L2K60j18
1103A75k00K17P4l24J09K79k57k68K63K3l28L9K23r7l01K89R2k97Q3K52j20j60
1125b34K58J65l07P0L08j46j47K37J51k83mK62j71k46K35J46l50l1K53j90k40
1146b64K37J11l26mJ73m7j99K39J52l14N0L53j67k15K68K50l22J2K85n6k40J92
1168A68P8k03kK66j04l19J99J14k90r0K91j91k02J76J31k26l8K71r6k07J77J79
1190H2j76r3M05q2k02J60K35k71o7L17p9k75J34J97k48j57K49p2k30J18J67k69
$$ plain form
1038 196 362 133 -21 302 224 -67 55 221 -97 -233 67 43 -284 -173 89 -191 -302 2 23 -295 -132
1059 -132 86 -73 -190 121 150 -115 75 351 49 -19 283 310 -4 113 376 93 -67 139 212 -176 -84 149
1081 149 -163 -262 17 22 -302 -267 18 -187 -318 -9 63 -234 -88 167 11 -115 213 330 1 33 293 175
1103 175 -25 192 266 -58 51 330 73 -195 68 91 -237 -198 25 -72 -373 -84 8 -289 -206 46 -74 -234
1125 -234 24 189 -118 -48 260 114 -33 204 355 72 68 330 159 -87 148 294 -56 -87 166 -24 -264
1146 -264 -27 84 -242 -246 -73 -120 -319 -80 72 -242 -192 161 -6 -221 47 297 -25 -13 272 216 -24 168
1168 168 246 43 41 307 203 -116 83 197 -93 -183 108 -83 -285 -109 22 -204 -242 29 -67 -274 -97 82
1190 82 -94 -187 218 136 -66 94 329 58 -9 308 229 -46 88 285 37 -120 129 57 -173 -55 112 -157
1212a57j19L02n9k97J73J97k03j42L32P1l06J75K80k55p3L10J0k57J13K54k27
1233A22j34L00q1k75Q1J92k03j55K51k8l70J29J61j65q7J85O9k54J01K22j59j15
1255b13L50n2j17P9K09r6j89K76Q8l41L2K54j70j74K05K9l42J45K16k56k05K89
1277A7L1l21OL20j95j68K50J14k72R5K04j08j16L00J13k87J15K26j56k13K63J28
1299C46l49J9K15j33j98J80N8k60l5K25j10k07K12N1k51n6L07m5j97K22J61k69
1321a14K7L27j88q6J49J52k22j3K24j36j83J66R5k18k8J94j13k13J14J20k87M
1343b29K32j10j34J57J42k14m4K80k7k50K15J50j96k6L03j41p9J10J45k44p2K32
1365B00r1j85J29J20k24o7K15r1k45J15J87k79q8K94Pk39J02K39j51j17K96k7
$$ plain form
1212 -157 -276 26 -33 -330 -157 40 -163 -305 27 98 -208 -33 247 -8 -81 229 239 -18 95 349 122
1233 122 -12 288 207 -68 13 205 2 -153 98 70 -300 -171 -10 -175 -262 -77 -8 -262 -161 61 -98 -213
1255 -213 137 85 -32 47 256 160 -29 247 335 -6 26 280 110 -64 141 170 -172 -27 189 -67 -272 17
1277 17 48 -273 -267 53 -142 -310 -60 54 -218 -123 81 -27 -143 157 270 -17 98 324 168 -45 218 346
1299 346 -3 16 231 98 -100 80 138 -122 -157 68 -42 -249 -37 14 -237 -293 14 -31 -228 -6 155 -114
1321 -114 -87 240 52 -34 115 267 45 32 256 120 -63 103 198 -20 -48 146 33 -180 -66 54 -233 -229
1343 -229 3 -107 -241 -84 58 -156 -200 80 53 -197 18 168 -28 -54 249 108 29 139 284 40 -32 200
1365 200 109 -76 53 173 -51 -118 97 6 -239 -124 63 -216 -304 -10 -3 -242 -140 99 -52 -169 127 100
1387A00j85J40K48k13j14K66k0k23R2J66k01j50K60o5k69J38J65k00j97K64l3
1408c1k69J22J92j51j08K18J8k23J76J39q2j12K86Jj93Q8J67j32j08J90j9j94
1430b5Q6J41j81j18J09O4k08M3J51r7j80J76N4k49R3K01j64q0K45N7k09O2J86
1453A57o0j48J89Q5k08lK35r6k11K41l5j78k3J89j64j38J45J05k70M1J58j24o8
1476a81J10J08k17N2K48j53p0J49J05j47j9J94k7k50K08J15j95p7K77j44j91J05
1498@J56k87J2J64r2j50R1J85l05L5J80p6j60J74K13k38J9K31n7q5J18J18k34
1521A2j2K52q6j71J06J01k15k7K02q1j77M9J11j67j20K94j33j79J51J02r3q0K16
1544E5m5j77J24K01j87lK12l6j35J04J45k23o4K66q7k29J57O3j52p3J70M1k79
$$ plain form
1387 100 -85 55 303 90 -24 242 222 -1 91 257 56 -94 166 101 -168 -30 135 -65 -262 2 -31
1408 -31 -300 -178 14 -137 -245 -27 -9 -232 -56 83 1 -111 175 176 -17 71 238 106 -2 188 169 -25
1430 -25 61 202 21 -97 12 76 -132 -89 62 -35 -215 -39 15 -234 -141 60 -104 -184 61 118 -91 -29 157
1453 157 97 -51 138 223 15 12 247 151 -60 181 146 -32 -55 134 -30 -168 -23 82 -188 -147 11 -113 -181
1476 -181 -71 37 -180 -128 120 -33 -103 46 151 4 -15 179 152 -98 110 225 30 -47 230 86 -105 0
1498 0 156 -131 -119 45 -47 -197 -106 79 -226 -191 -11 -87 -247 -73 140 -98 -79 152 95 10 128 246 12
1521 12 0 252 166 -5 101 202 -13 -40 162 81 -96 -47 64 -103 -223 71 -62 -241 -90 12 -81 -161 55
1544 55 10 -167 -43 158 -29 -32 180 144 9 113 258 35 -29 237 150 -79 78 141 -11 -84 86 127 -152
1567a52J0J84k08m9K10k9j77J16J26j62m1K60k7j85J41J35j50l0K16M4k83J28
1589G7J34j40j26J96m0j99J23R8j47j16J34j0j86Q5J57j71n8K00oj94J18J46l5
1612D0p2J79j3j08k5K09r6j51K12J5k28M6J68j64j60J84N2k23k4K07q1j74J96
1635a1J9j88K3K24j32j07K04Q9k29O9K19r3j29J20R2j69M7J55j04j39J47R5k41
1658c9L2J44j16j05N9O3j80pJ51r6j55J63J00j53N3J87j47q7J29J14k11Q5K14
1681A98j3k50K39M2j03p3Q8j6j67J19L3q8r7J44n4j55N5J71k40MJ37l1j18J51
1705b4J34j82q6J82N6j52J49J03j26m9K13n5j46M5J80k18o0K35j01j88P3J17j25
1728b5j56K15q1q3K9Q5j38p2K00j0j19P5K31j92o4K03rq9L8J25j35p8J88Lj85
$$ plain form
1567 -152 -142 42 -166 -215 -5 -34 -211 -95 31 -131 -172 88 61 -124 17 152 2 -28 188 232 -51 77
1589 77 211 71 -55 141 101 -98 25 123 -24 -140 -6 -16 -202 -117 40 -131 -189 11 5 -189 -71 75 40
1612 40 -32 147 134 26 1 210 114 -37 175 190 -38 8 176 12 -148 36 88 -135 -159 48 -33 -207 -11
1635 -11 8 -180 -157 67 -65 -172 32 121 -108 -39 180 87 -42 78 170 1 48 203 99 -40 107 202 -39
1658 -39 -7 137 21 -84 -25 38 -142 -149 2 -94 -249 -86 14 -139 -86 101 -46 -133 -4 110 -101 -16 198
1681 198 185 -65 174 216 113 40 128 112 -55 64 97 9 -88 56 2 -153 -98 73 -167 -163 -26 -57 -175 -24
1705 -24 110 -72 -158 24 80 -72 77 180 54 5 218 163 17 62 242 24 -36 199 98 -90 -17 100 -25
1728 -25 -181 34 -47 -130 -101 -16 -154 -226 -26 -36 -155 -80 151 -41 -105 98 89 0 38 163 28 -50 138 141 -44
1753d4R9J37k70PJ50nk15N0J72j68p7J88o9q7M5J61j17j17J64L5j07J01J00r0
1777D3n5J06K4j35M8J23j28m4J48J3k24O2J00j28j15J16M2j65N7J50j49j09J85
1800c5M6j62L2K27j55n2J14J04j48O8J55j08j21J42L9j26J7J42j54o9Q3M8j30
1823d3j3J52j68j23J51jj00MJ55o6q5Q3O7o7K8J13m9l1L9J07j19KJ58q8j05O4
1849F5J15j82m8J34j8j64J63qj51l2J29n6r0P9P4j43j2J97p7j18J11J34r5k4J42
1874A25k5j39J12R7j55K1J32n2j37M4J23j88o7K15p5j58N5J52j40p5J05k3j09
1897a62J20J20q9q4J28l1p0P3J33r8p4J36J3j18qJ49n1j47J57j3k08L1J81j67
1921g9k2J21L8k21R7J43j50o5J29J6j72Q6J04Ko9J53j8j34O6J58j42j4Q3Rj23
$$ plain form
1753 -44 55 192 -78 -71 79 74 -141 -91 81 -87 -164 24 -45 -132 -87 74 -43 -160 4 39 -68 33 133 43
1777 43 -12 94 118 -17 31 154 26 -18 130 143 -81 -19 81 -47 -162 -46 -4 -169 -112 38 -111 -220 -35
1800 -35 11 -151 -119 108 -47 -99 15 119 -29 39 194 86 -35 107 146 20 37 179 25 -44 39 87 -43
1823 -43 -56 96 -72 -195 -44 -45 -145 -141 14 -52 -137 -54 13 -54 -26 87 38 7 46 153 34 36 194 106 1 65
1849 65 180 -2 -50 84 66 -98 65 57 -94 -126 3 -53 -143 -64 10 -133 -145 52 -25 -143 -32 102 7 -17 125
1874 125 100 -39 73 170 15 36 168 116 -21 23 146 -42 -109 106 31 -127 -72 80 -60 -135 -30 -53 -162
1897 -162 -42 78 -11 -95 33 2 -68 5 138 40 -34 102 115 -3 -11 138 87 -60 97 84 -124 -93 88 -79
1921 -79 -101 20 58 -163 -66 77 -73 -138 -9 7 -165 -79 25 27 -42 111 93 -41 25 183 41 27 110 119 -4
1946dRJ49j47j12J21N2j35kQ8j32nJ32l5j84R5J05o0r6J62N6j32N7R5l0r4J77
1972A30j3q4N3R6p3r5R0M2j70m4J60j06j04O0O6p3n7J57j44n6J17R1j36k9J88
1997F6j24q6J64J7q2j8J67o7q8J14R4j23K0M9o0o7J15Rr0k9P5l4j47O4J18j60
2023a03LJ24n9j11J50L0j22l5J61K9j29J27K9q0o9K09n1j12J23K5r7j5R6o4j04
2048d5Q0L4j39m7J19l5j45J53M9j09j8J10n3p5J14O0r8m3J50j9m3P7P4o4n9O7
2074I5k3q4K6Q5j42K5O1m1q4M1M8q4j01J55L6j63M3J14o2o9K07m9p8P2Q7m8j07
2101d0K08j11n3L7J09j29LJ37l9j33k6J78j46j01Q8N8j37LJ05j14j7J30o5p7P6
2126e6J19r7m2N2N7o2J5J41m7p9O3N6j11M0N2k6q0J05k9j00QO6q3q3J49m5j12
$$ plain form
1946 -4 5 154 7 -105 16 68 -67 -69 19 -113 -118 14 -21 -205 -110 -5 -65 -161 1 57 -75 -18 77 47 -47 130
1972 130 117 33 86 182 109 14 104 146 -24 -68 92 -14 -118 -58 8 -65 -122 35 -109 -165 -48 43 -93 -122 66
1997 66 -58 -144 20 37 -45 -63 104 37 -51 63 157 34 54 103 43 -24 91 100 10 -19 56 22 -125 -61 57 -103
2023 -103 -100 24 -35 -146 4 34 -88 -123 38 67 -62 65 94 14 -55 154 103 -9 114 139 42 27 123 59 -45
2048 -45 35 69 -70 -117 2 -33 -178 -25 24 -85 -103 7 -46 -121 -7 53 -45 -88 62 43 0 77 151 87 28 95
2074 95 72 -12 14 99 -43 -18 43 2 -82 -41 7 -77 -178 -23 13 -150 -107 7 -55 -124 83 34 -44 28 115 67 -40
2101 -40 168 57 4 41 150 21 24 161 122 -11 -37 141 -5 -106 -18 40 -97 -94 11 -103 -120 10 -55 -132 -56
2126 -56 63 -34 -76 -24 33 -29 -14 127 80 1 64 120 9 49 101 75 -5 100 71 -29 -21 45 -38 -121 28 -17 -129
2153a29L1J05o2q9K05m9o3l5J67nj20J21kq7PJ57p9o9O2Q4j26m5P6q1m8Q1ko4
2181e9n1J11J7j31Q3L0p0rJ23m9p5P2P6k6m7J71q4r7J38M6j47m7J19k1q1O9L6
2208I7j56QJ06q3n3rJ17j27l1J07Qj47J26M2j02N2R8m1q1R0Q8k6p5J14k8j20J6
2235a0J36p8k2P0m7j26Q5k8M7j10J19k7j26J13N3j65M4L4L9j08O9J21j18OJ07
2260G8M1j44N6J17q8p1J33m2o1PR4q5n3N2L4j07J8N4p0q2Q8O4j68M0P6Ko5J45
2288F3n7r6M3J51p6o2P2N3j40P4P2j8q8N8N5j36k5J05l8j17J71p2r0M8O0Nj54
2315a39J37J0q1k4J78j02p2J52j8m4J00K0j02qJ16p1k2l4J32r1m9P3k2n0o4J06
2341C1l2o8N7L7j30R0L4l4o0J08j6q4J2J06l4l5P9J4m7J0P2m3q9N4R1r7K7KKj43
$$ plain form
2153 -129 -98 7 -55 -144 61 12 -51 -86 81 76 -44 77 75 -12 -5 152 73 4 66 150 24 -21 55 -26 -74 7 5 -59
2181 -59 -110 1 18 -113 -30 0 -70 -79 44 -5 -80 -8 68 42 -5 166 82 -15 123 169 22 -25 94 73 -8 61 97
2208 97 -59 -51 55 -28 -81 -90 27 -100 -131 -24 -16 -163 -37 5 -97 -45 53 12 -69 21 109 83 8 122 94 -26 -10
2235 -10 126 48 26 96 49 -77 8 -20 27 -83 36 9 -117 -4 49 -116 -72 -38 1 -107 -38 83 -35 -29 78
2260 78 119 -25 31 148 60 -11 122 80 19 26 120 35 -18 34 68 -39 -21 33 -37 -119 -31 33 -135 -95 -19 -17 -82 63
2288 63 6 -90 -47 104 28 -34 38 91 -49 25 97 79 -9 49 104 -32 -57 48 10 -107 64 -8 -98 -50 10 15 -139
2315 -139 -2 8 -73 -97 81 -21 -93 59 41 -3 97 117 15 7 123 52 30 -4 128 37 -12 61 39 -11 -75 31
2341 31 -1 -69 -12 25 -105 -15 19 -15 -75 33 17 -67 -55 51 17 -18 61 75 28 38 110 67 -22 32 123 26 53 55 57 -86
2371h6J05N2j15k3O6o3j13J11P9q6m0R5n9RL7R3r0m4J28Mp0P3O1j14jJ58r3j03
2399b9L4Q3j12qQ3o5n0P6J9j11m1P1L5q5P1Q3j09J8O9j5j19R6J02o2MJ07q9p7
2427b1O2O8j07j1R7n8n6O8L0m9o4Q0Lj38M9K0J0m8L9J8l0J1M3o3L1O9Lm8l6J17
2457H9j7p0J12j0j07lP2n4l9N3K6j00%P9q1r1J69j1j38J30mk7j21J71j5r8P4Q7
2485G6l7q9J01J4m5jP6m7K8K0k2j02J4R5m8p2N1Oq4l0K9M1m8O2J3r0J8O7K2o1
2515d3P5j6jn3J59n8j2J5O4j21K0R1k7j33J00L4p0j3R7q9j37P7N3o0j0J16q3p1
2543i6P5J9q1M8P7j9p5L9N7m2p1J94q0o5N1P2j08L1L1l8o9Q9K7j18j1P9op0P9
2572A9mp4K9J1nn6Q2N9j01J7O3j1m1N5O9j03m9J28o0nj0Q0j28OK1N9q7oJ01j03
$$ plain form
2371 -86 19 71 -44 -67 -1 -64 -177 -66 13 -73 -113 -18 -77 -68 -31 62 -28 -72 56 60 -10 63 124 10 9 167 74 -29
2399 -29 5 88 -24 -32 51 -14 -64 12 31 -80 -121 -50 -15 -100 -29 54 -55 -37 32 17 -102 -6 96 34 38 145 56 -21
2427 -21 41 109 2 -9 88 30 -26 42 72 23 -41 39 42 -96 -47 -27 -17 -65 -26 -8 -38 -27 16 -47 -16 53 56 8 -28 89
2457 89 72 2 114 104 -3 -6 66 12 -27 26 52 -48 -48 31 -50 -141 28 17 -121 9 5 -22 -143 28 13 -85 -11 76
2485 76 39 -50 51 65 20 19 95 48 76 96 74 -28 -14 81 33 -39 12 18 -66 -96 -67 -26 -74 -12 1 -89 -71 -4 18 -43
2515 -43 32 16 15 -38 121 63 51 66 130 9 29 120 93 -40 60 94 24 11 108 19 -118 -41 12 -48 -58 58 -25 -96
2543 -96 -21 -2 -83 -35 42 23 -52 -13 44 2 -69 125 45 -20 31 103 -5 26 57 19 -50 39 66 -52 -63 16 10 -60 19
2572 19 15 -59 -30 -19 -24 -80 2 61 -40 -23 40 29 -12 43 112 9 -40 88 28 23 13 93 -35 -29 -8 51 -36 -42 59 -44
2602d4J2j3K7Jn9P6j7J2J9K0n4J2M2j4q2J20K6q1J1J07n3p0P2oq1L8J1q6K1M2
2632Ij3n4o3O5J9r8J34k5o9L8R8m7n4P2L8o4PQ2j5n2O8j5m0j6J13n2r1J02nm0
2662C2r2J16o2p7M8N6q4lO7m4j2L2P7j01M3N2Pj03R2K0m2j1N5jj16J04L7q2OL3
2692D7%l8m2P9j18N8K8l3n7L4J02j56L5Q8j1p7O7J7m5N2L4l3o4J00K6p2L0Jo1
2721ilM8lp6J1J16j19J8J6N8n9k5L9J3l9j4N2n1mO8Mo4L1J01j11rN2K3m1lP9m0
2753E9n5P1n2q9Q4P8n5o1K5J6q4R1n4m2l9R9k5j03J38j8Jq3J57l6m6J08k9m0o4
2782d8J14j0m2k7N0l4QL0J2r6jP5j08lO0RoPM8r7j6J18l6p8M3M7K3l5L6j2q0Q2
2814C3N0Kj09P9j9j5O4n0ko3MP5o9J1M6j30K5J02l0o6J3N7O1j62J22K9r5OK8M7
$$ plain form
2602 -44 -32 -45 -18 -17 -76 0 -17 -5 14 34 -20 -8 34 20 -62 58 84 3 14 121 68 -2 70 64 -17 21 32 -54 -33 9
2632 9 -4 -58 -121 -56 -37 -135 -1 -26 -95 -57 41 -6 -60 12 50 -14 -7 75 60 8 76 61 21 5 118 66 -25 77 72 32
2662 32 -60 56 -6 -83 -35 21 -63 -66 1 -43 -55 -23 54 -47 -4 48 55 -48 44 64 22 11 66 65 -51 53 90 8 14 47
2692 47 47 9 -33 46 -72 -14 14 -19 -76 -42 60 -96 -61 27 16 -61 6 23 -22 30 64 31 -33 67 93 21 51 52 -9
2721 -9 -12 36 33 -43 -32 84 -35 -17 -1 57 -2 -27 12 25 -14 -28 24 -27 -31 37 41 -23 8 109 -2 -11 41 64 23 20 99 59
2753 59 4 75 23 -66 18 96 41 -20 5 21 -63 28 -26 -68 -107 -8 -33 -136 2 -16 -15 -98 59 23 -23 85 56 16 -48
2782 -48 66 56 14 -13 37 3 11 41 53 -43 -44 31 -77 -80 -20 -11 -17 -10 38 -59 -75 43 7 -71 -28 19 42 7 43 31 -49 33
2814 33 83 85 -24 55 36 21 85 35 33 -30 -26 49 -20 -9 37 -93 -68 34 4 -62 -49 8 69 -93 29 58 -37 -31 -3 44
2844D4n5M6L4m8oO6oj26N7M9n7qJ0J6o8O3J8p6J8P4p9j8N3O8j01J4P8Pj25J32
2874G4lo1o6R0J3p5N9J3p9K6O7p3l7R8l5l8NR1rj33L2N5n4l9R8l6pJ2Q4p9LN0
2906D6J0o2N8L1p7J8K4J6j26J09nn1m0R6o7m5K1O7k8o0JM9n7M8K0l1knJ02j22
2936f2L3J15q0k9J13k9m8M4L7j04J8L3j7j1K0M7r5k2N6N2j27J5K4j5k2K5n3Rj4
2965h7N4m6K0oJ09k3o9R9o0mK1L7J6p8Q6p8j4P2m2nJ5L2o4l8N5m1O7l2O0q7n3
2996h4J02l2k1K4LL2p5Q9K7l8J4Qm8k3O6n8L2o9J11k5o1K6N6j42Q5K3l4j3M4k9
3026a0j7j3O8l5PN6p6K7m8O0k2m5P5k9L9n7N5J9m0L0l0k3ML6n1QjM6q8K8Pk7m
3059e1K9k1N3o4R2o2L1qN7m2ppk6L0K4N0o7L0M6k6r6M9L5l1p0Q5k3p3L6M8p5j3
$$ plain form
2844 44 -11 35 69 21 15 81 75 -51 6 55 -2 -10 0 16 -52 11 29 -47 -29 45 -34 -52 1 69 -32 -18 60 67 -58 74
2874 74 71 10 -56 34 47 -28 31 44 -35 -9 58 -15 -52 46 11 -27 -22 69 60 -73 -41 14 -40 -79 19 -17 -24 -12 72 -7 -4 46
2906 46 56 -6 52 83 6 24 48 64 -62 47 42 -9 -49 47 -20 -65 -44 23 -5 -65 -64 -15 -72 -24 -4 -35 -37 -42 60 -62
2936 -62 -29 86 6 -23 90 61 13 57 94 -10 8 41 24 13 33 80 -15 -37 19 71 -56 -41 -17 -32 -54 -29 -82 -73 -87
2965 -87 -33 -79 -59 -65 44 21 -48 51 -9 -13 8 45 61 -17 69 -9 -23 49 7 2 17 49 -15 -53 2 -39 28 -4 56 -31 -84
2996 -84 18 -14 -35 -11 -8 24 -51 38 65 27 41 49 1 -22 44 -14 18 -51 60 35 -26 0 56 -86 -1 22 -12 -25 19 -10
3026 -10 -27 -40 28 -7 0 56 -20 7 -41 19 -3 -48 27 -2 37 -20 35 54 14 44 14 -9 -5 31 -20 -12 -13 33 -55 -27 -20 -47 -51
3059 -51 -22 -43 10 -54 38 -24 7 -1 56 14 7 0 -26 4 28 78 11 41 87 61 -35 14 49 18 -52 33 10 -63 -27 21 -54 -67
3091f7N4m0j0J0Q5m2J7M0l2l0K2K4Qo5Q5k7o8N0k3L0m5K8Mk8qLJ1K3p1P2j18P6
3123c2O8m6n3N6kl0L9L4m9j4R4j4n6P2j5qm6K4k0k0J9j9l7KM8J3n7M3lJ1q1R2
3155A3l9q6P8L6K4m9O8m0JK3O5j15N5L2J3j03mQ7l7j5M5j5p1J9N9p3QRJ3n6L6
3186a9j2J4l3nMj5K9M9J8r7P9K4m3k8J20kj22J16j7p5L4P9p4k9K7M0p2o6MO7l5
3217d0j9N0m8mO2m5JJ8Nl6LP6l9jj6J23o3l4J3K3l3M1L6j18K6K3J2l0JMl3rK5
3250b6m2K1%O0k7l0Q0m2rk1N9mm9O0k8k8J2O5m3L1l5Pm0pQ3p3k2Q0qj03L3N9m1
3283b8l7J01l8k7L2J5k4J2qM1J6p0N9ro9J00m1n8M9qLj4M6r8%mR6o3j7M0k1m3
3315f7N4Ro5nR1k1n8L0R3l2j6L1jj1o1P2l6pK4n0J3M1j6j9Kj4M5j7k1K2q5L4O
$$ plain form
3091 -67 -13 -53 -63 -53 32 -10 7 47 15 -15 7 31 39 -26 59 32 -36 14 -9 21 -24 4 8 -20 -28 -25 -14 9 -62 10 -108 -32
3123 -32 36 -10 -63 -7 -9 -39 0 34 -15 -29 65 51 -5 67 52 44 -2 22 2 -18 1 -18 -55 -53 -5 8 -49 -6 -9 2 -79 13
3155 13 -26 -112 -34 2 26 -23 45 5 6 29 94 -21 34 66 79 -24 -28 59 22 7 52 37 -34 -15 44 -29 -21 -12 1 -55 -19
3186 -19 -31 -17 -50 -55 -51 -66 -37 12 30 -67 12 36 -7 -35 85 83 -39 77 60 -15 19 98 24 -5 22 62 -10 -76 -72 -5 -40
3217 -40 -59 -9 -57 -61 1 -44 -43 -25 -20 -56 -53 23 -16 -17 -33 90 27 -7 6 29 -4 37 73 -45 -19 4 16 -14 -13 -9 -42 -51 -26
3250 -26 -68 -47 -47 13 -14 -44 36 -6 -15 -36 23 19 -30 30 2 -26 -14 51 8 39 4 11 -29 -36 47 -26 -48 32 24 -79 -46 13 -28
3283 -28 -65 36 -2 -29 3 18 -6 6 -2 39 55 -15 44 35 -34 66 25 -33 16 8 11 -3 43 -55 -55 -59 37 -26 -43 -3 -24 -67
3315 -67 -13 -4 -69 -74 17 -4 -62 -32 61 29 13 44 43 32 -29 43 7 0 24 -26 -13 28 12 -7 -5 -19 26 9 -12 10 -75 -41 -35
3348c5M2k5j0MJ1j3L2Pj7m5J05m1l3O6J4o2nJ8L7k6N7l5o9L8j1m7LO3l4l4OL7
3380bM0q4JP6%p2Q7p2m0L7j1K6L0M6l7m9Qk1J1mQ9n9kJ2M9o2j4Ojrj0P3p4M2l
3415Gj2j0J8qj9K3K1K2q9L8k4l2J15n9JJ5oN1o9l6N6ko7pL1K3k9L5j3o6R7qKj6
3449a7N6k9k1pN2Oo0K5J4l4J4K1j7j8O4l4nOM3r7L6J1Rpl9P1q9l5M0L6k8O2k5
3482DnKJ1kj2j2P0j4No2KJ5L6M3m6KlkPQok8m0OJ8nK6m5k5n1R6J6n2L6O7q9lK8
3520dN6o1l5O0ro5N7J6k6LL3J3o1P2l6k4J2M1o9ML5J8m9j5RM4rLK5p2N4m6k1K6
3554b1JM5k5Pk4N5n3J3K5m1m8J11q5L5j8L2o7PN5L5j18L3P5n9L3j8N8q5O0k4M5
3585C9k4PJ4k9O0l0M6j9k5j0n5N2o2P6n9M3k7n8K5N1J0m2ML2m9N9qm0j2K1K9j1
$$ plain form
3348 -35 7 -18 -28 -24 -13 -26 6 13 -4 -49 56 15 -18 48 62 0 -5 13 50 24 81 46 -23 15 4 -43 -40 23 -11 -45 -39 -2
3380 -2 38 -46 -45 31 31 -41 46 -26 -66 -29 -40 -14 16 62 25 -24 -16 -37 -26 -30 59 0 -2 10 59 -3 -17 -11 -12 -21 -31 42 -32 10 7
3415 7 -5 -15 3 -5 -24 -1 20 42 -47 -9 -33 -65 50 -9 -8 7 1 52 -17 -53 3 1 -66 -73 -42 -19 -48 -13 -26 -92 5 -3 -1 -17
3449 -17 39 10 -11 -18 34 40 -20 5 19 -15 -1 20 3 -15 49 15 10 16 59 -38 -2 9 18 11 -28 43 -46 -81 -41 -5 -33 29 4
3482 4 -1 1 12 10 -2 -14 56 42 47 -15 -13 2 38 81 35 37 34 32 39 47 41 13 -27 -21 -3 -8 18 -27 -52 -103 -7 9 -43 -7 60 -29 -32 -4
3520 -4 52 -9 -44 16 7 -58 -1 15 -11 -8 25 38 -23 49 13 -11 1 42 -27 -23 12 30 -19 -34 -25 19 10 13 38 -34 20 -26 -47 -21
3554 -21 -20 25 0 7 -17 38 -15 -2 23 -18 -66 45 -40 -5 -23 9 -58 -51 4 39 -79 -46 29 -30 3 -15 43 -42 18 -6 39
3585 39 15 22 36 7 67 37 83 64 39 29 -26 26 -36 40 -19 24 -3 -61 -36 15 25 -17 -13 19 -30 29 21 -19 -31 -10 19 8
3617HM5l4qO4j7m9J0n5M3k9M0Rl4l9K4R0m7K6o9j3n5N4N6j8q3L7lL4L0l8Oj3L7
3650Ij1j2J8nK6p4M7j2K2Kj0K3r5J13k5l5KK5k3mK9l8J3K4K6q2J9M3Pk4l0M9k8
3683a1L6J4l6l2L1j7pL8kK2l8qJ1l3l4M0m1N5l1N2mp7N7Jj9jJ2J1L8m2%L7k7M6
3717D1j3o9J24l5k3L4o0m3%P2rrp5J05n8JPM5q6qN5j9J9j0N6p9J25r4N0k3k5L7
3749C3k7k3M4J7n5M6%j0m1M4K3q5j2OK8M6m3%n9P5J0l6k6lM0l8O7kjo6Q0ll5k3
3783b9K2L3JO0o0k5k2N1j5n7P1J4m1N6m5j8mO4n9k0J5k9M8l7L2Mo6J7Q3l6m7K5
3815a4O9o6N0n0J9PM9r0lk5K8LmJ5L3l6K1JOn1l7Q6K5k7j5J0m6J08n8m8P5oJ3
3848D2o2P7r4M4oj0k2jJ6N8l7J1j5Rp8O7jm1RL0J6p4qN9NJ6qK5k1RNMnl1MK7j2
$$ plain form
3617 8 53 19 11 75 58 9 19 -36 7 -22 18 27 -7 -46 -22 68 21 47 -22 -35 -90 -36 20 2 -81 -44 -47 -13 17 -21 -15 -28 9
3650 9 -2 -14 4 -1 25 -49 -2 -14 8 10 0 23 -72 41 16 -19 -17 8 -15 -19 10 -28 -15 9 35 -47 -28 15 22 -2 -32 17 -11
3683 -11 25 39 3 -29 2 -15 -22 16 14 36 -2 -10 1 -32 -66 -26 -67 -12 -43 9 5 -72 -15 -14 -33 -34 -22 -11 27 -15 -15 22 -5 41
3717 41 28 -41 83 48 25 59 -1 -44 -44 28 19 10 -65 40 -18 -17 -10 35 -51 -59 -4 -23 -4 -14 42 -37 88 -6 44 21 -4 33
3749 33 6 -17 27 44 -11 35 35 25 -16 28 51 -34 -46 -40 -12 34 -9 -9 -68 7 17 -19 -45 -48 -8 -46 21 19 18 -48 32 29 -6 -29
3783 -29 -7 26 27 87 27 2 -20 31 16 -41 30 44 3 59 14 -4 -8 56 -3 -23 -8 -37 11 -26 6 10 -56 -39 44 8 -39 -14
3815 -14 55 -11 39 -11 8 15 64 -26 -29 -54 -26 -23 -27 -12 21 -15 6 7 13 -38 -75 11 36 9 -6 4 -42 66 8 -40 35 29 42
3848 42 -20 57 -37 7 1 -9 -31 -32 -16 42 5 16 1 10 -68 -1 -2 -43 -34 -4 12 -62 -70 -11 -6 10 2 27 6 15 20 24 19 -12 -8 19 7
3885GJ5J4l7M2k7l8K8k9N7p0L4m0M3l0L7m4%P6o7P2o2J7N3m1rK9l3l4M4qK0J4
3917C3j0l8J0RMKK3m9ML3j0k3n9K4L1j5N0K3k7m1pK3N0m1Nj6%J1O9n2m6O4k5R
3951A8JL7n0n5K7j1M3Jj2Kn1J08k0k1J1K9n9n6Q8l2jl4N5m9j1K1k9L3P1n6j3M
3983a1k2pm8R8J3j7k4J3ln%K4r4N8L7p3P1M1mn2N7k6J6pnk6JM1n4K3q0M2N6k5
4017HJj1J1n4L4Lk5mP9j09L2M7L2rj19J35r0NN5L4j5m0LP1o2J9ml2P1l5L8p1N1
4050D9j9%l6L1k4k8L5PJ7l8J4K2lp5K1O1l4nn3L1K5J2k9kRL2L0k0%j4n6L2jJ9
4084A0J0m5K8J0qj1K9m5p%KJ9M2p7L0J3Rk2KK0Qj6q5P9J2K7k4L3n7L1o8J9M6l2
4118a8J0J4k3m8J3R8o3n3L5Q1m3m2K0J6J3J3K1n6mO5m7K6J5Nr0L0J5jj4j3O0j5
$$ plain form
3885 7 22 36 -1 41 14 -24 4 -25 32 -38 -4 -44 -1 -31 6 -38 -38 38 -29 43 -19 -2 51 10 1 30 -3 -37 7 -1 19 33
3917 33 23 -15 -5 4 8 10 33 -16 -12 21 11 -12 -71 -47 -16 -31 19 42 15 -26 -33 -10 40 -1 4 -12 -12 -1 68 16 -30 34 9 18
3951 18 19 56 6 -49 -22 -33 10 11 -1 1 -50 58 38 17 28 57 -2 -58 30 -2 -3 -37 18 -31 -42 -21 -50 -17 54 -2 -15 -11
3983 -11 -33 -40 -88 10 23 6 -18 -5 -8 -13 -13 11 -83 -25 12 -61 10 51 47 -5 52 26 42 35 30 4 5 46 -8 15 -65 -23 33 8
4017 8 9 -2 9 -45 -11 -8 -33 -37 42 -67 -35 12 44 35 -84 51 -39 -34 21 55 40 0 3 74 12 31 27 -5 66 31 69 -2 49
4050 49 30 30 -6 25 1 -27 8 15 32 -6 8 30 27 -48 -27 34 0 -5 -58 -27 -2 10 -19 -21 -12 20 50 30 30 16 -40 -8 -9 10
4084 10 20 -25 3 13 5 -6 23 -22 -29 -29 -27 -8 34 -43 -13 0 9 -13 -11 9 17 1 -84 -5 7 34 10 43 -14 17 -51 -32 14 -18
4118 -18 -8 6 -17 -65 -52 46 -17 -70 -35 46 3 -39 -19 -3 10 23 44 -12 -16 49 2 28 43 48 -42 -12 3 2 -12 -25 35 20
4150B0n0K4K2j6k0J7n2N4nK7m6lK6j6K7k2N2n3M1K1n5j4O2k4ok5O2r2M8K5L4n3
4182A0m1Mk3j6J02n3k4K4N0m7j8qM1kOlNk9Np%O6j4p0K2P8l5j16K7J10l6J5k1
4215BN8l9m8J8k0L8lK1q1N1L1k7L4j9k2Lk3k4M5nmN4n4MM5j02L6J3LJ3l7L6k8
4248c1N4o0K9m0O9lj1j0j6MJ2n2R9j9L8p6P1o5OO9r8K4k1L9J1j5l9L6k3J1J0l6
4280c3k3OKL6j0J5N5p9MM8l8j7P9o0K9k2QL0k5M5n6KkL5K9n3K3j6k1K8ml7m3N1
4314a4l5L9J7Rn6K4N2p3PN3k1k6M4m8j4M7OM7n0jPN6m8J0L2m6j3LKj4R9j25O6
4347C6m8k3L0j2J5j0n7J39m1j1m8RM6l2olPK4J6l8l3MQK8o8Q4L3n7K7KOp5P5K9
4381E6n4j4P6r6K9M1m3k8L9M5Pp4L1Nj2j6m0K6MM0J4n2j9L1m8R0k8p2L0Ok1N5
$$ plain form
4150 20 -30 -6 16 0 -20 -3 -55 -1 -6 21 -25 -28 -2 -18 9 -13 39 -14 27 48 -7 -21 41 17 11 -14 48 -44 4 29 63 10
4182 10 -31 -27 -50 -66 36 -17 -41 -17 33 -14 -32 -40 1 -1 5 2 7 -22 -17 -24 -24 42 28 -42 -20 58 23 -93 -66 44 8 23 2
4215 2 60 21 -27 -9 -29 9 6 27 -54 -3 28 1 35 16 -6 -3 -26 -50 -5 -10 -14 40 -14 -10 35 -67 -31 -18 -15 -2 -39 -3 -31
4248 -31 23 -37 -8 -48 21 18 7 -3 -19 -15 -3 -55 44 25 63 -13 58 -7 -1 68 -30 -6 -27 12 23 8 -31 5 -18 -7 3 -33
4280 -33 -56 -50 -48 -12 -22 -7 48 -31 -27 21 -17 -34 45 -15 14 -8 0 30 5 50 -6 -4 -6 29 58 5 28 12 -9 19 15 -22 -65 -14
4314 -14 -49 -10 7 16 -40 -16 36 -37 -30 23 2 -24 20 -28 -42 5 11 58 8 7 14 70 22 32 64 18 5 8 10 -4 95 -30 36
4347 36 -12 -35 -5 -17 -2 -12 -69 70 29 18 -30 -21 25 -7 -13 -16 -9 15 31 -7 -40 -36 -28 0 -68 16 49 -8 19 21 27 -48 27 56
4381 56 2 -12 64 -32 -3 38 -5 -33 6 51 58 -16 15 20 8 -8 -48 -22 -18 22 36 -16 -35 -4 -52 38 10 -62 -32 -26 -47 8
4413Hn1N9k1k3K8j1kk8k2J12o1RJK8nj5K1lJl3K6j7l2M9k1K4n3N7m0L7Nl2l5K5
4447a5QKm4L8k6N4j7L3j08K7L3P5l9nJ8n6L3K2l9j4P1l4k0j3M1m2J3J1J1jl8J0
4479a1j2K1j4M1J6j06K8L4K3l7K9k7P6j3o8PM5l8J5k7K2Jk7J0J2o0M2NK3n3N6
4510A3m3M1jM9l5K2r6L2N9Lo3N9k5K6n2l6R0J4n6k5Nm4J24q6N5n7J3J2K6m4K6
4541FL2Qm6k6N4q6N8P5n1k0l8mN2l7O6j5j2k8J5k6K4j5k8M9K7K2p8nL2K1k6Pm
4574C%l8K6KKlL2Lm3K5J8m3KjK9K0pM%M7m7K9n9N9n6KkL2Nm7qQ9n8j6J8j7p2O2
4612hqP8o9K4po1J3k8R3l8J0K4Nl3mM7k7%L1k0o0R1m3K3m0J9k7jR5p5rK7j0nk7
4647b0M3j1j1j7kL3pp6O7NKj4m0O0pk4k2J7qQ6k3pl2j6J4M5j4J1j7L8m0l0N4j0
$$ plain form
4413 8 -43 16 -5 -28 0 -11 -13 -41 -63 49 -12 -3 -2 26 21 6 27 24 25 -8 18 1 -31 18 -3 21 -32 25 -15 22 27 -5 -40 -15
4447 -15 -7 -5 -49 -11 -37 17 0 33 -75 -48 -15 60 21 16 34 -22 11 33 -6 -20 51 17 -3 -16 25 -17 -4 7 18 17 -21 -11
4479 -11 -23 -2 -16 25 41 -65 -37 -3 20 -17 12 -15 61 48 -20 -13 32 -6 9 -18 4 5 -22 -12 0 -60 -18 -13 10 -43 13
4510 13 -30 11 10 59 24 46 -50 -18 41 44 -19 40 15 41 -11 -47 43 57 1 -24 -19 -63 61 -25 30 -27 -14 -2 24 -20 6
4541 6 38 46 0 -26 28 -58 0 75 24 4 -34 -38 14 -23 43 28 16 -12 3 -23 1 -14 -42 7 34 56 -22 -27 5 26 0 7 3
4574 3 3 -35 -9 -7 -5 -8 24 27 -16 9 27 -16 -14 -15 14 34 27 31 31 78 31 60 1 60 4 6 4 36 41 -6 -14 75 17 1 19 2 -70 -8
4612 -8 -16 62 -7 17 10 -51 -38 -66 27 -11 -1 23 28 -5 -9 38 11 11 42 22 -38 53 10 33 -7 12 -15 -16 79 4 -5 22 12 7 -20
4647 -20 23 12 1 -16 -18 15 8 -68 -1 4 6 -8 -48 12 5 -19 -41 -24 -32 54 31 24 -8 -24 -10 35 21 32 15 53 13 -17 37 27
4681B7Jj2j7kqN2j7l3M2o7J07q0N9m8l2J7l2P4OMq4K5j1K6m3M1m3M1J7Jl2L8k5
4714hpL8m1L5M0n1j5M5o1O6o0N2mPkp3P5%p1N6j1m0K2Rjl1Nk3R1q9M7J8k1l8K0
4749b1L3m7j7P8oqJ6l8N6n4%kqM5m2K3pJ4J02j49L7kK1Lk9J8j5j8JPNOK2k6n2
4784e4P6m0kL2n5j4N6K4k2J1L7J3o9RJ1j4l9J07l3l2j0M4jl2K0J7n0k7N8qK4k3
4816A4o4J7L3lll7J0N4k2l2PK2j8kK6k5pK7NK0Oj9OJ9n3M7rj7M9l3Lj4JQ2p6L5
4852D9l9j9K8n4N1J3%l2K9K1k4o6RM4k1mK1l4k2N9M1q7mP9j1j8oM0Oo8Q4j00O0
4885B5m6RO7m5L4q8O3l1L0O1p1Ol3N9q3Q9j2l8M0k1%J0K2m2m2L6kl1O2n5L7l4
4917b4L4OQK5n7l6O0%k9J9rL4p1L8l4M3k1l5J21q3J9pK3l3lO5q7RK6MrN5J6o6
$$ plain form
4681 27 28 16 -1 -3 -11 41 24 -9 33 -34 73 -7 52 4 -28 -11 -43 31 37 41 -43 -18 -29 -3 -46 -5 -48 -7 10 11 -21 17 -8
4714 -8 -15 23 -18 17 57 6 -9 36 -25 41 -19 33 29 36 34 -39 36 36 -35 21 10 -30 -8 1 0 -31 -26 -49 42 -47 0 18 -3 -41 -21
4749 -21 12 -35 -52 26 20 12 28 -10 46 -8 -8 -10 -18 27 -15 8 1 15 117 -32 5 3 24 27 -2 16 1 -17 -16 -9 -4 2 24 -2 -54
4784 -54 22 -18 -20 12 -43 -57 -1 23 1 12 49 62 -7 2 13 -1 -40 67 34 2 -8 36 35 3 23 40 -10 -37 21 13 37 14
4816 14 -50 -33 0 -3 -6 -43 -33 21 -1 -33 -26 -4 -22 -24 2 -23 -30 -3 2 22 28 9 15 34 -19 28 19 2 51 18 21 7 8 90 14 49
4852 49 10 -9 19 -35 16 29 29 -3 26 47 23 -43 -34 10 -11 -15 6 -28 -50 9 50 -37 -41 38 27 9 3 43 49 -19 65 -35 25
4885 25 -21 -12 55 10 44 -44 19 -12 18 79 8 14 -19 40 -43 46 34 -4 36 15 15 25 47 5 -37 -1 -3 -34 28 -27 10 -24
4917 -24 10 16 24 49 -8 -44 16 16 -13 6 -3 31 -40 -2 -36 7 -14 -49 72 -11 8 1 24 -9 -12 53 -34 -25 1 5 -4 51 67 1
4951AJ9q5M0K1k7J8rPJ4k6k7O1j5k7L5J6j4J3m2L7K5j9L6o0j7L1Rj1LK8nl7K4
4984A7k5L3k2Jj1lK7m2N6o9N2pm3m9O2j3N6k8J7l7L9j2J6oK4nl8J1j4L8l0N4l4
5017A5m2N2K5J8n9j8kjl4N3pOQlLn0LLj8K3oj9L2L9Po9O2k3%Nj1J2j0J6L3k8l7
5054b2k7M1m3K2J4K2m8N7J9Km7J9Nk0OPn3M9kK6Ln8R0p9K1kk8J2J3J2p0j5O5N
5088dOJ5k9K6j3M6l8Lk2k6OJ2M0pPpn0J8K1O0l8jm2Ll1L8j0k6N2Ll4K9Om5O4o7
5124c5MJ9lk3j9L0j1N8J6o8QLJ4J3N1m7pN3l6mm3J7k0K4L1m0K3J4mKo1J5J7nK3
5159IlmL3n5QJ6k6M4j02P5L5k7k2K6qN9o4P3km9J1n7M5L7m9K7p5K4N1m1k4K0M7
5192C2k3l5rO9j0L5o2K2m6M5l4LpK9m3O5o4j9L4j2J3rJ3J3L0l0k5J7M9k3l6J9
$$ plain form
4951 1 20 -65 -25 -4 -31 -13 -22 -15 -1 -27 -54 7 -8 -35 0 16 2 15 -27 10 35 16 52 -8 -25 6 15 4 7 35 30 -7 17
4984 17 -8 25 3 4 -7 -10 17 -25 31 -38 14 7 -36 -85 -23 -36 20 -8 9 -28 11 -1 15 9 33 28 -10 1 -13 25 -5 49 15
5017 15 -27 25 50 68 9 -9 -11 -12 -46 7 0 6 14 11 14 -36 -33 -30 -48 -25 -31 -50 -18 21 28 -41 21 -2 -2 3 -8 4 -6 10 43 15 -22
5054 -22 -49 -8 -51 -29 -15 7 -41 16 35 37 -10 9 14 -6 0 7 -46 3 1 27 30 -28 62 -17 4 2 -26 -14 -1 11 -59 -74 -9 -4
5088 -4 2 17 -12 14 1 47 9 12 -10 -36 -30 -18 22 15 22 15 -35 -17 4 64 26 25 -17 -14 -45 -7 -17 -43 9 12 -22 7 13 -32 32 -35
5124 -35 -31 -12 -15 -38 -57 -27 -38 20 36 -32 -24 -21 -7 6 57 10 3 56 20 16 -27 -10 -30 -6 25 -15 8 22 18 20 -41 -26 -9 -14 9
5159 9 6 2 35 -20 -12 4 -22 22 -80 -5 30 3 -19 7 -1 58 -6 67 65 16 27 -30 15 52 3 30 -45 -21 30 -11 -35 -15 32
5192 32 9 -26 -35 34 24 59 -3 19 -27 18 -16 -13 -20 9 -34 31 -33 -52 -18 -30 -17 -26 -13 0 30 0 -25 -8 41 18 -18 1
5224Ak1J9pL1plnLMmJ1qj6j2O9o3L8j5RPn8QmM5k9j8J8J4n1L9j7M7p1M4J5m7q
5261d2O0k3Lk6J0RJ5L3k3q8P8L0mo3L4lk5P0r6M5L7J9k1n1L1k6%j4l9N8n6J4O7
5294A3rJ6Mp8Q3r5K9O0Nrq1J31q4N5k4M2n8M3l0J9k2O2l9Rn2j5K8N0p1OJ9l9K6
5327fJ1J1K0n6Mj6k6M3J4K0k9J3k1L7l5M8n9KL5J6%n0M8K4p2ON2j1n1ON7o7N3
5360B1n0O1pJ7l2k0ml0R3q2mJM6J5n2J4L7l9K2l4K8Ll0J0J1J2K5m8K3PLPjJ5j18
5395h0J17p9M9rJ0m2K6K2k4j0N1Kn7L7j3p5J9M4j0J8nl5K7K6l2J2K2J0J2l4J7
5426A6K0r7N4Mk9MN6%j1O7k5p2L4j2n2M0K2m4M2Jo9L4M4Op4L4j7K2j6k0k4Q9j9
5459HL5k2q4O2j9K4j7M3j0Qj3q2L7R5o0j1j6N8Rn1J4K9m6M3n6%j2ON1J6l3K8l2
$$ plain form
5224 1 -20 -1 -8 23 16 13 8 11 15 11 22 14 -2 -14 55 -8 30 15 24 31 -27 -19 -23 22 -7 -25 -7 7 -44 -5 -22 25 -46 -2 13 -34 -42
5261 -42 18 -5 -2 -28 -18 -9 6 39 16 -72 6 36 32 -31 3 0 -25 45 -51 -6 31 50 29 -22 9 -17 -17 -31 -70 -12 -68 -54 13
5294 13 4 20 24 -54 29 -66 -37 23 28 19 -62 69 -15 40 16 58 0 43 13 32 10 72 33 42 -10 -25 3 53 -18 -12 7 -32 -6
5327 -6 5 16 36 -20 -16 -32 -58 -15 -1 19 -10 3 -18 19 -16 32 -27 -25 10 26 26 -24 24 48 -24 -18 34 23 -28 -22 35 -32 21
5360 21 -29 32 25 42 10 -10 -14 -44 49 -33 -37 -36 10 25 -27 -13 24 -15 7 -27 1 4 -26 -16 -5 7 32 -16 7 14 17 24 23 38 -80
5395 -80 37 -42 7 -2 8 -34 -8 14 -10 -20 31 33 -24 13 0 -75 -56 -12 -22 -4 -9 -44 -17 9 -23 -11 11 21 33 -1 16
5426 16 36 -61 -7 -3 -32 -28 28 28 17 84 59 -13 21 9 -43 -3 19 -25 17 18 -51 -17 27 33 -41 -7 -24 -2 -18 -38 -62 27 8
5459 8 43 21 -63 -1 -20 4 -13 30 20 28 15 -67 -30 65 5 -6 -22 36 45 -6 8 37 -9 34 -22 -22 -34 -28 23 39 6 34 2
5492Bn2J21r1K7qK4k0L7l9l1N4m1K7j4k5J7Mj5K6nn0M0Nnkk3R5r0R2n9Qm2KL4
5526CQJ6j5l6MPk3PM1j6L4l2o8K2OO6n0LL9l5J1j0j4L6k9K0lj3l1J7M8kJ0mN4
5561G1o2JrOk7M8j0K0m1j7j1J3N0l3mm6N4J7o9K7J5jJ2O3q2%Nk1N5Qk7o4N6K5
5595B2n6K7L5k3J4l4rJl8L6Om0N6L3k5krJj8L9n3P1m3m4L0K7n1P0m3j4M3j1L5
5628C3l0m4J6J3K5Qnl8N0n7j4M1rJ8l0kM9j1J5j7k7Rl0N3l1O7j2%k7L4r0L2L3
5661B2om0K3K1m8j3M7n6QJ6nJ3P4j11M2j5k1K8K7JKM1l1Qm5j4OQN0j7n0M3pj4
5695a3Lk3O3j9l3qj2NN5k2k0J0P4p7l5P1m8J0K5Qn3L0m8Q5k0m3K4nJ8KJ1o6j6
5728f7N2L4j9m5K9O9l0J5J9Kq1L8l1P3k9k1Nk0Lm0L5M9n4M6rjm8QRPj6L0k6NM
$$ plain form
5492 2 -50 71 -20 7 -1 23 3 40 1 -30 24 -17 10 -4 -29 -12 -8 -23 3 -2 -52 -12 -7 -12 -14 -37 58 -32 60 1 9 -33 -31 3
5526 3 11 27 12 -24 -20 -13 -36 -29 12 -4 30 -2 -70 -48 -42 24 -26 -23 16 -19 -8 -18 -32 4 -25 -5 -8 -21 -52 -35 13 11 21 17 71
5561 71 9 10 1 7 -20 28 18 38 -3 -20 -31 -18 32 -1 -5 -51 3 20 -49 -22 -7 -8 4 67 -15 -15 -10 -31 24 32 5 -59 -3 22
5595 22 -34 -7 28 5 19 -15 -24 -23 -61 -25 -19 -59 -3 30 5 3 -6 -5 -23 16 -37 34 -9 -53 -23 4 -47 23 -20 -34 9 -2 33
5628 33 3 -41 -25 -12 13 21 16 -22 28 -29 -43 -2 -11 7 -23 -25 24 13 28 11 -16 -7 -37 16 -15 52 40 40 13 47 -43 -11 22
5661 22 16 -24 -1 20 -28 -41 6 -50 -42 -26 -31 -18 56 -55 -13 -28 -49 -21 6 7 9 50 19 27 -18 -32 -26 -18 32 15 -35 8 1 -13
5695 -13 -10 -33 30 11 -22 -30 -42 -37 18 -4 -24 -14 60 -17 -52 19 -29 -19 6 14 -39 -9 -57 28 8 -35 -11 -16 2 4 15 -51 -67
5728 -67 -15 19 0 -45 -16 53 23 38 57 59 -22 16 -15 58 29 8 13 -7 -4 -44 -9 40 -14 32 23 22 -26 -18 -9 -2 -18 12 -14 -9 -5
5763ek2J2RL5j5j9m9L9K2L5o6l0R6o7L4M8q9P1j6K7k4j9Qj3k3JM2oj6j5m0L8K3
5796Fm1k8N5J2j5k5J0N9Jn2Rj3j8M5M0k9m6P0r4J1N8%L7n8M4l8QQl2L3MKp4K2
5830b9K9k4k8K9J8mlqL8j22J15l4KK5j1qk8O9j6L3k1k1K7l3j5K6J3n2K2noLP1
5863E2n8J5k8j6PJ3Q7m2k7k9K9m1L7j8j4K0J7M2p9J5M2o5QOM2j2k7rM3jL4n4J8
5896Gj3kPJ6NJ1k1k5kK0k7L1m7N6K9r4L1N8p5K2J2k4J0PK1l9N6q1O6j6M1m2qm
5930a4K7L1l9lOl4K9J8J8k0l8O2m5m2N9k2Pj2J6M5J3k7o1J9lJ9J3o7L2%K8Nm9
5963b9k4K5P1m1rj8qj1N3n8J9L8j4J4K0j1l9J6l6Q7Mo5L9k8L4j4l0j6J1J6j0K3
5995IN4m4r8M3P8j8m8P5o0J2j4J1l1kN6l2LL6p5M3j7OM6l7j6M7m0n5M8j7NN9l6
$$ plain form
5763 -5 -27 -15 -6 29 14 -5 -54 -15 7 42 -24 -54 42 -25 9 57 -32 39 23 50 26 7 15 2 -21 -20 22 16 0 -15 -55 -17 6
5796 6 -35 -63 -8 4 -11 -36 -26 33 34 -18 -9 -22 -40 5 45 16 -30 40 -54 -43 15 15 52 -6 38 0 8 16 -16 17 21 23 -51 -29
5830 -29 0 -24 -52 -23 -5 -9 -12 -20 18 -104 11 -23 -21 4 -7 -15 -43 26 10 43 22 1 28 -5 -20 6 19 -33 -11 -16 -22 -19 52
5863 52 -6 9 -19 -35 -28 -15 72 30 3 -26 3 -38 -1 -19 -33 -13 4 46 -33 -18 24 -41 -33 -27 15 3 -24 -33 10 9 43 -11 7
5896 7 -6 -8 -1 15 20 31 10 -15 -17 3 -24 7 -40 16 45 -49 -18 40 -35 -13 -1 -25 -15 -8 13 -26 30 -51 15 -1 40 -2 -10 -14
5930 -14 13 44 5 2 8 -26 3 21 39 19 -19 43 -2 -44 15 -7 0 -12 4 49 62 35 -26 -7 -10 9 22 -45 -13 -13 15 20 -29
5963 -29 -53 -28 43 2 -7 -25 -33 -44 9 -49 -30 8 -6 8 28 17 -22 -6 -42 45 49 -16 23 -5 29 15 -15 -31 -20 -4 -14 9
5995 9 63 19 -79 -36 42 24 -24 51 -9 3 -11 0 -31 -33 23 -9 -6 30 -45 -2 -19 -13 33 -4 -20 27 -13 -68 -20 -37 -32 27 -9
6028iN0k3j4J4Nn3%k1N8J6n5M8kj2n7J00n3j0Lj0J9Qj5K8Lp1P5p8L7LO1l0N0q3
6062a8N0Nl0L8o8nM8J6k6k7K1J3N2j9Jn3j3rL5n5J6K8m5N3n3L5l1mN4mlk0l5L7
6096a6K5l2L3n5N7%n1O5o8O5qm1L1kk3kM4Qo0M2K6k7j0m5K5N6pnm2Q0l5pL6J5
6130G2n0J2n1l0L6JoL1K6n3k3M0J0m3k7lQ9k6k5J8L5n2M9m1J6M5n3K1p7L8K9J9
6162B7n0L7l4k0O4qj8L1k3q8J33j22J01m4rk3P4k7kK0j2m2K3l6NM2k4j6M1PL5
6193D2m3L8l0j8J8N8r0N0j0J8k4j1K9n0QN5k6n4J7j4L7n6L4nL2l7M0m2m4P0J6
6224Hj9M0n5N1j4Oj5j4J4J0k4KJ9l3K7m2K3P3p4J8%o5P0j6M0o7P9l9p7J22oo9
6256b7L4j3K2J6l6mK1j1L2m7J9k3K7No0O0Ro4O0k0K2M0l8j1JM5m5K4m5J2oJ0M4
$$ plain form
6028 -9 41 18 4 18 23 -30 -30 -51 7 23 -32 16 14 2 -55 45 -8 -18 -15 -25 -6 2 -13 15 18 -53 22 -56 -19 -16 45 15 65 -18
6062 -18 32 37 7 45 -23 -28 20 36 10 -17 4 17 69 50 51 -2 -15 -24 11 -44 -28 0 -45 8 -45 -10 -41 -45 9 5 2 -18 -53 -16
6096 -16 9 -23 10 -45 12 12 -39 26 -42 23 15 -26 5 3 -20 -22 22 30 -30 12 38 11 1 -44 -19 37 30 25 -17 63 28 21 57 72
6130 72 22 34 -17 -47 -11 -10 -16 15 41 -12 -35 5 15 -28 -55 -58 31 5 -20 -2 33 -19 30 -11 5 50 -3 18 -59 -21 8 27
6162 27 -23 14 -20 -40 24 16 -2 29 6 -82 51 -71 30 -14 -23 -46 28 1 -1 19 7 -35 -12 -48 -43 -1 -25 -41 0 7 42
6193 42 -1 37 7 -11 7 65 -25 25 15 33 9 -2 27 -23 -15 40 14 -40 -23 -37 0 -56 -22 -27 5 -32 8 -34 -78 -8 8
6224 8 -11 29 -26 25 11 17 2 -12 2 12 -12 -10 9 -24 3 -39 -16 57 -17 1 1 -64 6 -10 30 -37 42 3 -74 48 42 -27
6256 -27 7 -6 16 32 -4 -8 13 2 34 -13 6 -17 10 15 -45 15 24 -40 20 0 22 62 24 13 14 59 14 38 -7 5 -1 9 53
6289E3k6K1l0K4m4%k4j2NJ7L2m8n2P8M7l7Qm6J25q4J3qL2n7k5O7m5j7J4M8Jo0
6321c0N3m8M7r4J2M8LO3j7k8l2M4kp9Q9o6J9n5J04m6K1Nk9J0k2K6J2rjqRm9O0
6354A0J4k3Np3J03q0K6K5J6m6M9rM4k9Mn3nL7L2k6n0J6K9nn3P4m2L8k5j6J5M3
6386D5j7j7j1n9O8j3m7Q6p7L0k8P5l0k1K7j5J1qlORPJ2j6JPlOl2l2J9N2l3n9K
6421e8K4PJ9J5J2l5J5j7N8l7Ml5L0KJ6o9Q1o9K1M9q9M4k6M3K0l2QJ1p9M9QK4p1
6454e7O7L3k2rn0M6j7K0jp6Q0Nj9M0r3M6Nl1J9O0o5L1l0J8%L4j1p0L4l1R6m1j9
6487hk2K6Pm9L5k8L5k2K8j4L9l8l8oN5k5J6M0k1J5J7n6J9k5K0l7k4L9J8PJ2j2
6519Ck4pJ4K8l9O3k7M4k8m9K8KJ1K8p2M8kKm3PJ1lj9M3j7l6K5m8O5K1j3nj7mK6
$$ plain form
6289 53 27 48 18 42 -2 -2 -26 -38 -33 -16 16 -32 -84 -6 41 4 12 -34 91 7 20 12 44 -13 -38 29 -16 -33 -19 29 30 -30
6321 -30 23 -25 22 -72 -60 -12 -9 54 37 9 -23 21 19 -60 29 -37 -18 -73 31 -15 6 11 -18 -8 -30 -4 8 -1 -2 -10 -1 -50 10
6354 10 24 1 6 -67 36 -44 -18 7 23 -23 26 17 61 32 36 -17 -22 15 47 21 -29 -13 16 11 -42 32 -10 28 3 -13 2 45
6386 45 28 11 0 -59 9 -4 -51 35 -42 -12 -40 35 5 -16 11 -4 7 -1 -4 2 11 18 30 14 15 22 19 25 -7 -39 -20 32 -1 -60 -58
6421 -58 -34 -27 -8 7 19 -16 -1 -18 40 3 7 -28 2 4 20 -49 32 -37 -16 33 -56 -12 -38 5 25 -7 1 12 -67 -18 -10 14 -57
6454 -57 10 43 21 12 -38 8 -9 11 10 -66 14 19 0 40 -53 -7 -2 -33 -14 46 -19 12 -18 0 0 34 23 -47 -13 -44 52 11 -8
6487 -8 -30 -4 3 -46 -11 -39 -4 -26 2 -12 27 -11 -49 -55 0 -25 -9 31 10 25 42 -14 5 -20 0 -37 -61 -22 -4 3 15 3
6519 3 -21 -28 -14 14 -25 38 11 55 27 -22 6 8 19 47 -25 23 21 23 -20 -13 -2 -5 -24 19 2 -34 -9 -57 8 29 16 11 -6 -10 16
6554A6NOm1m0P8l%%m1M2n0L4j7p6J18n3KN7J2l4l3J7l2K3pK8m5K2L1k8j9N2%o4
6588d0M3k6LJ0KL4o8pP6j17R2qL9j5o6M3K2m1OjjL1K6o8J7J4l9N6L7m7j7nM3J
6622B9m4K1l5L7J0J0Ol9j6Q6j51P3L6m0l1N2rl5M0J9j7J7k0j9MOM5l1pK3j06J05
6654A9pO%n5K3L8l7J2Q1p4K0o0N4l4M4m5M0n6J7Q1o6l9M0kl0pN6m7M5RmJ7p1L3
6688Al1M6j4J5m0K5l4J9n0N7K2l6OK4n8N7M4o5O1n2J5n9K2K7j4KMJ7m3K1J3Po0
6721e1K5pL7k6M5Rn2LNmO7j04P1k1olK7N3j06M0J0n8P7l4oJ5l1N2nj5p6L9L1q
6755gJ7Nj4K7l0kj7QLk0L5k0J6k5L5q5N2M7k8j0l4M1QN0l0o7J5Q0k0m8L5Qk7O
6789DL0kk6K0m7N3m4MJ4kL1n3m8M1K6k8N7n4L9m9L8j4mj5L6n5N0J8o2O3k7Ok6
$$ plain form
6554 16 21 27 -14 -54 24 21 21 21 -20 22 -28 6 -11 -87 31 -22 -20 37 49 15 -18 -1 -33 -10 -17 11 -34 -12 19 -9 -28 24 24 -40
6588 -40 3 -23 -20 -10 -8 26 -42 -49 27 -90 2 -6 33 18 -48 -5 17 -24 -18 -19 -20 11 37 -31 -14 0 -39 17 54 7 -10 -15 28 29
6622 29 -15 6 -29 8 18 28 34 -5 -21 65 -86 -13 23 -17 -48 4 -5 -40 0 19 2 19 -1 -20 -16 -10 35 4 -3 20 -86 19
6654 19 12 18 18 -37 -14 24 -13 -1 80 6 26 -34 20 -14 30 -15 25 -31 -14 67 1 -38 2 0 -30 -37 19 -28 17 26 22 39 -32 1
6688 1 -30 16 2 17 -23 2 -32 -13 -63 -6 16 -20 -14 10 -48 9 53 -12 49 -3 12 -47 -25 2 -12 -10 -6 11 -32 -11 2 9 -51
6721 -51 -26 -33 4 -22 23 32 -20 -17 -12 -16 51 -53 18 -3 -9 -12 15 68 -38 2 12 -46 31 -3 -9 6 -25 27 22 7 -69 -30 1 -7
6755 -7 10 15 1 28 -2 -4 -21 -13 -10 -30 5 -15 1 -24 11 -74 -22 25 -3 -13 -47 -6 2 52 22 -45 -30 50 30 -18 17 25 -2 4
6789 4 34 32 6 26 -21 32 -12 -8 6 4 35 -18 -66 -25 1 -27 30 -24 15 -34 4 -10 -14 -29 7 -48 2 20 -42 21 -6 0 -26
6822b6k1N8qk3J5k2K4KK2Jk3k1M6k7J5J5Om1NO4n2j14J03M1q4K3JL6o5O0k3k5
6854c8j3L8J4k5l6O8l2JK0J5j8M6No4k6Q3mj23J02l2MK4L8j3j6L4l6k1K4k6K7
6885B0l9O4l0O3r7J8o0N8J2j7j8M5k1K0n6P1m9N2q7M2K4m6J2k3K8m0P8k6N4k7
6915B5J5j2m7nN4J9j8o0j3L7jm7N3M3n5J9l3K6oj0K2k8Q4j01%N9q1J19m2j0M2
6946D8k5n6rJ6N3j4l0L9Nj4J0M2o9J1%j4nk4N8k8J5j5K4p2J13m7m1L2NkJ8o0M2
6979Fk9nM2m1OO4o1k7Q6j17P8qJ4j7RK8l5k2QL1kN8r4J4K5%k0N1n0J0L3l3K1J6
7013C9m6L4k9j9J9rMl4m0N8K6l5L0m5P7j9%k1J7j4k5J7J3pK6j8M3m1nJ2rJ1qK2
7047B4k4poJ5j2n8R8m8j5L7m4M0j1J0ml0J9l6kM1J1l0PL9k0j5M6p2N8J3m6Mk9
$$ plain form
6822 -26 -47 11 3 -20 -5 -27 -3 -1 21 22 -1 -22 24 -3 12 27 33 -8 -3 61 9 -105 -2 39 -45 -22 -21 15 -50 10 -13 -38
6854 -38 -51 -13 1 -24 -60 8 -24 -23 -3 12 -6 40 45 -19 -45 38 34 -89 13 -19 -15 9 47 34 18 52 16 -5 19 -7 20
6885 20 -19 45 15 78 -19 -1 -61 -3 9 -8 -26 19 -2 18 -38 33 -16 36 -51 -9 15 -31 -19 -42 -14 -54 24 -2 52 25
6915 25 40 28 -19 -24 30 49 31 -29 -42 -5 -6 -53 0 43 -12 7 -26 0 -6 -16 6 -22 62 -39 -39 20 -61 58 16 6 48
6946 48 23 -33 -42 -26 27 13 -17 22 27 13 23 65 -4 7 7 -7 -12 -36 22 -6 9 -6 18 -54 59 12 -29 3 8 6 24 -36 6
6979 6 -23 -28 14 -27 -21 43 -18 -45 41 -76 2 -6 8 -9 0 28 -7 -29 -21 10 8 66 -28 -14 11 11 -9 42 -8 2 35 2 23 39
7013 39 -7 27 -2 -21 -2 -11 -7 -41 -81 -23 3 -32 -2 -47 30 11 11 -10 7 -7 -32 -15 -2 -9 17 -1 42 1 -4 8 -1 10 2 24
7047 24 0 -7 -13 2 -10 -68 30 -18 -33 4 -40 0 -11 -1 -5 -35 -16 -52 -54 -13 -2 -32 -25 14 -6 -21 25 -47 11 24 -22 -18 -47
7080d7L7NN0o9M0j1j4J8n4Q4p8N4J3o2j1N0m6O9Kl7Kk3K3j9kk3K1Nj6j6L7QK1
7113A1j5K8j1m3J2M0j4k0N8n4k5j5L2O1o7O0j9m1P9j08P3nn8M6K5q1R5m4kK2q9
7144f9Q4nJl1j3P1j19N9J0l9K3n4L8oL9l2M8l3M1m0P1m0K9j5K3o1J8m3N7oRqk
7177Ej0k0NM7n9J2M3k4m1K9k5NJ5L1m0K2LRk3NJ4OL8Lr1L1N1n7K9l0P9o6J3K5
7211C4rL8o5l8NK5Qk8OK5%j1N8k2n3j9O9Pn7N8m7P9j8q3j0M8k7k4K5N1l9l6K3
7244b7Lj0N6l2Ll9K1N7l6OKQJ6j6O9j06K9j1lK6L0p7K9J1jnl3Rj2M5%m7L9%L2
7279C6p8O0m1K2k9J9qO7o8pM0J2j1j1o7M8K7j3RK0Rn2M2no6L4J1J8Mm6L1Qm3l4
7313f2J9L6M2p1oj8L7K7j0M1n8L7o2N0k2K5J5l5N5j9j5M5l3M6o0L3q3K4K9L5Q
$$ plain form
7080 -47 -10 -5 45 -24 16 5 -9 9 -45 39 -39 15 28 -34 -45 5 -41 28 30 -7 -5 -28 -5 -24 -26 -49 -28 -23 -39 -55 -18 -10 11
7113 11 -4 24 13 -30 -18 22 8 -12 46 -8 -33 -48 -16 45 -22 38 19 -22 57 -51 22 17 -41 5 30 -51 44 0 -2 20 -69
7144 -69 15 10 11 -20 -33 38 -81 -22 -12 -51 -28 -82 -44 -50 -11 -43 5 -28 13 -27 44 4 33 18 41 -20 -2 -45 12 6 15 7 5
7177 5 -5 -25 -20 27 -32 -20 23 -1 -42 -13 -38 -33 -18 13 -27 -5 -2 7 -16 -11 3 9 47 50 -41 -10 41 -16 13 -17 62 -4 9 34
7211 34 25 63 -2 -40 -35 -10 -2 -30 -24 1 1 -10 48 26 -27 -46 23 30 -27 31 -16 63 45 -38 -48 0 -27 -51 -26 25 -14 -50 -27
7244 -27 -24 -34 22 -10 -7 -46 -25 32 -4 2 4 12 28 12 81 -25 4 -7 -10 16 46 -31 -2 9 8 3 -30 -21 -33 12 12 -35 4 4 36
7279 36 -42 18 -23 -1 -30 -11 -19 48 -20 -27 13 25 14 3 -64 -16 11 -2 7 27 36 -16 26 21 -45 -11 0 18 22 -24 7 15 -28 -62
7313 -62 -43 -7 35 -36 -42 -60 -23 4 -6 35 -23 14 -48 2 -20 5 20 -15 40 21 6 51 18 64 4 37 -46 -22 7 42 50
7344E0m9j5OL2n0L4o4K8OJ1N5m2J0k6JM9o8L7o5O4j4K6rJ6Kl0J9M6n5l3L7k4R
7377fRL8l3kj9L5l5k0kN9l5J0K0p2K2L2o1K6J8QNKJ7n2j2N3m0L2qM0j2k3J7k8
7411a7O8j04N9k4O5l0N1o1M8o8j5K6qJ1rJ6nQj2o9O3K5n0M3K5l8L0J6j05Q0q7
7442f8L5O1q6O2m6J01j38K4R1l5j3j5%l4J01o3K6OJ3Qo0Q7q8K7J9K0m8J7l3N0
7472B1N0o3J4o1N7k2j8nKK9ooJ9m5R4k9j3n9J9QL7m1N1j9L4l4m8K7k4L6MK9l9
7505aL4m5M2J9j5k9m0J9kN6j4j4k2J4L1n9K7J6K1m9j9L5m6L7L7m1k8L6Rn7L4M1
7537B7l7L0l0j4K3L1n6NJ1K2L2l9K9jl7Q0q6J9l5j1M0l8J1rK4L5j8l7JJ7kN1l9
7570ak9O1j22R6l7oK8L5j9prK6k7PPj0O4j21N8k4L4L8n0J4Mll4J4j4N4k3j0J1
$$ plain form
7344 50 1 -14 -8 24 -26 8 -56 -28 -22 -11 44 2 12 -14 -13 36 -32 5 -60 4 -10 16 7 23 25 -5 14 60 5 -28 9 -15 -6
7377 -6 3 41 8 6 -13 22 -13 -33 -35 24 -11 -1 19 -53 -31 1 -60 -34 -16 -8 -3 -1 16 -36 -48 5 -35 -3 -11 29 17 -6 11 -17
7411 -17 51 -53 6 -18 47 17 68 7 55 -13 -28 -2 -10 1 -8 8 3 11 -1 -70 -7 18 -32 11 36 -2 28 44 -61 19 -68
7442 -68 -33 28 -58 4 -42 59 -79 -55 36 1 -12 -27 -27 -61 40 -23 3 9 22 30 -30 57 -31 -4 15 35 -13 4 -29 21
7472 21 71 8 22 -39 18 -4 -22 -27 -25 4 -2 -8 11 -34 60 31 18 -41 -22 -14 23 -18 33 14 48 14 -34 -7 -31 5 9 38 -1
7505 -1 33 -12 30 49 34 5 -35 -16 -18 38 24 10 -12 2 33 -26 1 17 38 -11 -30 5 -41 -4 33 -8 -36 0 9 -48 -14 27
7537 27 -10 20 -10 -24 -1 30 -26 -21 -10 12 44 5 34 33 -4 76 -10 9 -26 -37 3 -35 -24 -33 -9 26 8 -29 -28 -11 -13 38 -1
7570 -1 -30 31 -91 5 -32 -38 -10 25 6 -1 -10 16 -11 -4 3 -7 57 -64 -6 -30 4 42 -8 6 10 7 -27 -13 -27 27 4 -6 5
7603ElmPJ4k8Pk4J5K8n4M5l1J5m7R1M0j08K8j6M2Kl9L2J2M5q5ONj5RK7nL1j8Q
7638C7r7J12m4k2rJ3k1K3Ol9N0K3m8K3k4M4l9k2L3p2Q6o8M0k7L3PPN2p0kj3N5
7670B7m9N4qqj0nK4J1j11R9k9jL6J2m3J6j5J2n6J5J4N7j16Q9j7l5J7L1M0j0j6
7701B5p6K2K8m0L4O6r0J6K5l5J6%L9j4k4J6M8M8j25L1QL0p5L1o4N3j5J0PK2rK2
7733C0p0K5j3N2m4Pj7K7on8P9j4M7p0M4j5KNJK3j8Pk6l6K3j7M9K8r5J7P4%n4K6
7767A3j9m1L3JK0l8J3k1L9J9l5J2J6k4j5L5j3O4po7L3k5L5Qr5J02l9qN3l2PJ2
7799C6l1k1NM2j2J3o3M9mqm1N2Mj5N1m2J4m0L9qJ8j9l1Ln0P2p4K3RO3l4k7K9n6
7833e4J0M7jOmJ9n1J2N5J3j3k9k2J9K6k8Kj3j8K8J7j9J8k0N0m4k7L6k2K7j0n1
$$ plain form
7603 5 2 -2 5 19 -9 -2 -26 -11 17 -37 8 -23 -8 -55 36 76 -32 -4 -20 22 24 -15 17 29 74 -11 -5 0 -15 -6 21 16 47 29 37
7638 37 -60 52 8 -14 -23 -10 -31 -8 -2 -41 9 32 -16 7 -17 27 -12 -34 -1 -73 13 -55 -15 -42 -9 -2 5 57 -13 -15 -28 27
7670 27 -22 32 24 16 6 1 25 36 -75 24 -5 -6 30 42 -1 15 0 12 -44 -29 -15 42 -74 15 -2 -37 -20 11 51 41 25
7701 25 -51 -29 -1 -41 -7 59 -31 -15 10 -25 -9 -9 30 16 -8 8 56 104 -21 10 18 48 -27 4 -60 -7 -22 -12 -5 17 8 30
7733 30 -40 -15 -28 24 -20 -13 -30 -3 -9 -67 12 -2 45 -25 19 4 6 11 12 35 17 24 -2 -38 -15 -32 17 45 -50 -33 41 41 -13 13
7767 13 -6 -47 -14 -13 7 -31 -18 -39 0 19 -16 -4 12 -12 -27 8 -5 59 52 -15 18 -7 28 36 -59 43 4 -4 49 17 24 36
7799 36 5 -16 -11 31 19 32 -31 18 14 6 -35 17 21 6 57 15 29 -11 28 20 38 19 -12 -9 -59 13 -61 -38 -29 34 0 -27 2 -54
7833 -54 -44 3 2 8 4 23 -28 -16 39 52 39 10 -12 7 33 5 7 -6 -24 4 21 2 20 0 50 6 -21 15 -7 20 10 -41
7865d1lL7k3K9lm1kN5m0M0Mm4K6K5J9m4J2l1N7j2Pon0L1N2r9Q0j4k1K0k1pl9Q0
7899C3Kq5N1l5L3KJ6j8l1M0k4J8lJ7n4j0L1J7L0pk0k3qJ4N9l4j2K7m3L3k5J3J3
7932A7LM7j00O4k4jk8M8m2L1m2L0j6q7R8J5j0JjNj2k5Q3p0j1M5m0j3K9M4n1kJ2
7965cM6o9nNL0l0N1rm8N4j1M6o2J1LLj0K2%o8J1L1M7j19M3Qj6L9JMJK8q4RL7K5
$$ plain form
7865 -41 -44 -7 -30 -1 -4 -45 -47 8 -32 8 12 -32 -6 19 38 -6 6 -25 32 20 27 21 -29 2 54 -45 35 21 0 20 -1 -8 -47 33
7899 33 35 -50 1 -34 -1 1 17 -1 -32 8 -16 2 -1 16 -38 -48 -17 0 30 23 3 -20 -28 -14 45 11 -1 26 -17 16 -9 4 17
7932 17 20 67 -33 31 7 6 -22 26 -16 15 -27 3 -13 -100 -2 13 3 4 3 8 -4 -29 54 -16 -27 18 -22 -35 -6 38 -13 -15 -3
7965 -3 43 -26 -31 -26 4 -26 25 16 -32 22 11 57 -5 6 9 12 2 24 24 -44 -33 -2 45 -74 -31 -23 -39 0 1 5 6 34 -50 -41 -4 21
$$ [...]
8191b5
##END NTUPLES=NMR FID
##END=
