##TITLE=1H_AM_NV62.1
 CDCl3
 8 sc, 
 3.10.2023
##JCAMPDX= 6.0         $$ Bruker NMR JCAMP-DX V2.0
##DATA TYPE= NMR FID
##DATA CLASS= NTUPLES
##ORIGIN= UXNMR, Bruker Analytische Messtechnik GmbH
##OWNER= root
$$ XWIN-NMR		Version 3.5
$$ Tue Oct  3 16:04:50 2023 Russian Standard Time (UT+4h)  she@DPX200
##.OBSERVE FREQUENCY= 200.13135
##.OBSERVE NUCLEUS= ^1H
##.DELAY= (6, 6)
##.ACQUISITION MODE= SIMULTANEOUS
##.ACQUISITION SCHEME= undefined
##.AVERAGES= 9
##.DIGITISER RES= 18
##SPECTROMETER/DATA SYSTEM= spect
##.PULSE SEQUENCE= zg30
##.SOLVENT NAME= CDCl3
##.SHIFT REFERENCE= (INTERNAL, CDCl3, 0, 15.7039)
##AUDIT TRAIL= $$ (NUMBER, WHEN, WHO, WHERE, WHAT)
$$ ##TITLE= Audit trail, XWIN-NMR		Version 3.5
$$ ##JCAMPDX= 5.01
$$ ##ORIGIN= Bruker BioSpin GmbH
$$ ##OWNER= she
$$ F:/spectra/data/she/nmr/H-F/1/audita.txt
$$ ##AUDIT TRAIL=  $$ (NUMBER, WHEN, WHO, WHERE, WHAT)
(   1,<2023-10-03 16:03:28.00 +0400>,<she>,<DPX200>,
      <created by zg, POWCHK disabled, PULCHK disabled
       terminated by command 'halt'
       configuration hash MD5:
       00 E9 B6 7A A2 85 ED C7 34 08 36 98 17 FE 4E 26
       data hash MD5: 16K
       07 3E 88 41 DC 46 6D 38 32 B0 2E 8C 20 E3 98 10>)
$$ ##END=
$$ 
$$ hash MD5
$$ 0F B3 40 8C 16 F5 33 A5 A9 48 0B 28 EC 27 CD 13
##$RELAX= 
##$RELAX= 
##$RELAX= 
##$RELAX= 
##$RELAX= 
##$RELAX= 
$$ Bruker specific parameters
$$ --------------------------
##$DU= <F:/spectra>
##$EXPNO= 1
##$NAME= <H-F>
##$PROCNO= 1
##$TYPE= <nmr>
##$USER= <she>
##$AMP= (0..31)
100 100 100 100 100 100 100 100 100 100 100 100 100 100 100 100 100 100 
100 100 100 100 100 100 100 100 100 100 100 100 100 100 
##$AQSEQ= 0
##$AQ_mod= 1
##$AUNM= <au_zg>
##$AUTOPOS= <>
##$BF1= 200.13
##$BF2= 200.13
##$BF3= 200.13
##$BF4= 200.13
##$BF5= 200.13
##$BF6= 200.13
##$BF7= 200.13
##$BF8= 200.13
##$BYTORDA= 1
##$CFDGTYP= 0
##$CFRGTYP= 5
##$CHEMSTR= <none>
##$CNST= (0..31)
1 1 145 1 1 1 1 1 1 1 1 1 1 1 1 1 1 1 1 1 1 1 1 1 1 1 1 1 1 1 1 1 
##$CPDPRG= <>
##$CPDPRG1= <>
##$CPDPRG2= <>
##$CPDPRG3= <>
##$CPDPRG4= <mlev>
##$CPDPRG5= <mlev>
##$CPDPRG6= <mlev>
##$CPDPRG7= <mlev>
##$CPDPRG8= <mlev>
##$CPDPRGB= <>
##$CPDPRGT= <>
##$D= (0..31)
0 1.2 0 0 0 0 0 0 0 0.06 0 0.03 0 0 0 0 0.0002 0 0 0 0 0 0 0 0 0 0 0 0 
0 0 0 
##$DATE= 1696334607
##$DBL= (0..7)
120 120 120 120 120 120 120 120 
##$DBP= (0..7)
150 150 150 150 150 150 150 150 
##$DBP07= 0
##$DBPNAM0= <>
##$DBPNAM1= <>
##$DBPNAM2= <>
##$DBPNAM3= <>
##$DBPNAM4= <>
##$DBPNAM5= <>
##$DBPNAM6= <>
##$DBPNAM7= <>
##$DBPOAL= (0..7)
0.5 0.5 0.5 0.5 0.5 0.5 0.5 0.5 
##$DBPOFFS= (0..7)
0 0 0 0 0 0 0 0 
##$DE= 6
##$DECBNUC= <off>
##$DECIM= 32
##$DECNUC= <off>
##$DECSTAT= 4
##$DIGMOD= 1
##$DIGTYP= 9
##$DL= (0..7)
0 120 120 120 120 120 120 120 
##$DP= (0..7)
150 150 150 150 150 150 150 150 
##$DP07= 0
##$DPNAME0= <>
##$DPNAME1= <>
##$DPNAME2= <>
##$DPNAME3= <>
##$DPNAME4= <>
##$DPNAME5= <>
##$DPNAME6= <>
##$DPNAME7= <>
##$DPOAL= (0..7)
0.5 0.5 0.5 0.5 0.5 0.5 0.5 0.5 
##$DPOFFS= (0..7)
0 0 0 0 0 0 0 0 
##$DQDMODE= 0
##$DR= 18
##$DS= 0
$$ [...]
##$SUBNAM2= <"">
##$SUBNAM3= <"">
##$SUBNAM4= <"">
##$SUBNAM5= <"">
##$SUBNAM6= <"">
##$SUBNAM7= <"">
##$SUBNAM8= <"">
##$SUBNAM9= <"">
##$SW= 18.05172834244
##$SWIBOX= (0..15)
0 0 2 0 0 0 0 0 0 0 0 0 0 0 0 0 
##$SW_h= 3612.71676300578
##$TD= 16384
##$TD0= 1
##$TE= 0
##$TE2= 300
##$TE3= 300
##$TEG= 300
##$TL= (0..7)
0 120 120 120 120 120 120 120 
##$TP= (0..7)
150 150 150 150 150 150 150 150 
##$TP07= 0
##$TPNAME0= <>
##$TPNAME1= <>
##$TPNAME2= <>
##$TPNAME3= <>
##$TPNAME4= <>
##$TPNAME5= <>
##$TPNAME6= <>
##$TPNAME7= <>
##$TPOAL= (0..7)
0.5 0.5 0.5 0.5 0.5 0.5 0.5 0.5 
##$TPOFFS= (0..7)
0 0 0 0 0 0 0 0 
##$TUNHIN= 0
##$TUNHOUT= 0
##$TUNXOUT= 0
##$USERA1= <user>
##$USERA2= <user>
##$USERA3= <user>
##$USERA4= <user>
##$USERA5= <user>
##$V9= 5
##$VALIST= <valist>
##$VCLIST= <CCCCCCCCCCCCCCC>
##$VD= 0
##$VDLIST= <DDDDDDDDDDDDDDD>
##$VPLIST= <PPPPPPPPPPPPPPP>
##$VTLIST= <TTTTTTTTTTTTTTT>
##$WBST= 1024
##$WBSW= 4
##$XGAIN= (0..3)
0 0 0 0 
##$XL= 0
##$YL= 0
##$YMAX_a= 169981
##$YMIN_a= -169783
##$ZGOPTNS= <>
##$ZL1= 120
##$ZL2= 120
##$ZL3= 120
##$ZL4= 120
##$ABSF1= 10
##$ABSF2= 0
##$ABSG= 5
##$ABSL= 3
##$ALPHA= 0
##$AQORDER= 0
##$ASSFAC= 0
##$ASSFACI= 0
##$ASSFACX= 0
##$ASSWID= 0
##$AUNMP= <proc_1d>
##$AZFE= 0.1
##$AZFW= 0.1
##$BCFW= 1
##$BC_mod= 2
##$BYTORDP= 1
##$COROFFS= 0
##$CY= 11.3945322036743
##$DATMOD= 1
##$DC= 2
##$DFILT= <>
##$DTYPP= 0
##$F1P= 15.7292609196834
##$F2P= 12.9074282941183
##$FCOR= 0.5
##$FTSIZE= 0
##$FT_mod= 4
##$GAMMA= 1
##$GB= 0.15
##$INTBC= 1
##$INTSCL= 1
##$ISEN= 128
##$LB= 0.24
##$LEV0= 0
##$LPBIN= 0
##$MAXI= 10000
##$MC2= 0
##$MEAN= 0
##$ME_mod= 0
##$MI= 1.114404
##$NCOEF= 0
##$NC_proc= 0
##$NLEV= 6
##$NOISF1= 3.799351
##$NOISF2= 2.8
##$NSP= 1
##$NTH_PI= 0
##$NZP= 0
##$OFFSET= 15.70392
##$PC= 1
##$PHC0= -21866.16
##$PHC1= 9.45271
##$PH_mod= 1
##$PKNL= yes
##$PPARMOD= 0
##$PSCAL= 0
##$PSIGN= 0
##$REVERSE= no
##$SF= 200.130013532006
##$SI= 16384
##$SIGF1= 3
##$SIGF2= 2
##$SINO= 400
##$SIOLD= 16384
##$SREGLST= <1H.CDCl3>
##$SSB= 0
##$STSI= 0
##$STSR= 0
##$SW_p= 3612.71676300578
##$SYMM= 0
##$S_DEV= 0
##$TDeff= 0
##$TDoff= 0
##$TI= <>
##$TILT= no
##$TM1= 0
##$TM2= 0
##$TOPLEV= 0
##$USERP1= <user>
##$USERP2= <user>
##$USERP3= <user>
##$USERP4= <user>
##$USERP5= <user>
##$WDW= 1
##$XDIM= 8192
##$YMAX_p= 0
##$YMIN_p= 0
$$ End of Bruker specific parameters
$$ ---------------------------------
##NTUPLES= NMR FID
##VAR_NAME=  TIME,          FID/REAL,        FID/IMAG
##SYMBOL=    X,             R,               I
##VAR_TYPE=  INDEPENDENT,   DEPENDENT,       DEPENDENT
##VAR_FORM=  AFFN,          ASDF,            ASDF
##VAR_DIM=   8192,          8192,            8192
##UNITS=     SECONDS,       ARBITRARY UNITS, ARBITRARY UNITS
##FACTOR=    0.0002768,     1,               1
##FIRST=     0,             0,               0
##LAST=      2.2672688,     0,               0
##MIN=       0,             -169783,         0
##MAX=       2.2672688,     169981,          0
$$ Real data points
##PAGE= N=1
##DATA TABLE= (X++(R..R)), XYDATA
0@%%%%%%%%%%%%%%%%%%%%%oJ5j8J8j8J8k4L3l6L8m6N3o0O9p8Q9r9J12j27J40j54
42h1J71j93K17k40K65k92L21l55L92m32M77n24N75o34P00p71Q53r45J048j169
62f17J307j465J644j839K017k011R15J1701J58329j65018j52282K18653M2664
75A13998j79372L3398J04790r4334k0878P8579n9732l8331J03990k9652r5024
86h2568J02519O9463j37110o472J48825m3464j29019P1967P7947q7154m0196O6208
98A0946k3l9573J9426J7538j4042N545R418k144P261m892j7392J2747J3648k5255
112f792j6921J7594J1139q314j2185j01K4820J1406k9465k162L7786j0952l3989
125a8136K6775J4886m3422L851L9843k8393k7029M0677M514l5440K2818K1577
$$ y = [0, 0, 0, 0, 0, 0, 0, 0, 0, 0, 0, 0, 0, 0, 0, 0, 0, 0, 0, 0, 0, 0, -6, 9, -9, 9, -9, 9, -15, 18, -18, 20, -26, 27, -33, 36, -42, 47, -52, 60, -67, 73, -81, 90, -103, 114, -126, 139, -153, 168, -187, 205, -227, 250, -274, 301, -333, 367, -404, 449, -496, 552, -617, 690, -775, 869, -970, 1047, -964, -49, 11652, 169981, 4963, -147319, 71334, 113998, -65374, -31976, 72814, -21520, -42398, 36181, -23551, -61882, 42108, 12456, -82568, 19951, 89414, -47696, -54168, 94657, 51193, -77826, -5859, 72088, -15066, -55262, 10946, 10923, -28650, -9224, 8314, -5728, -183, 9235, 7091, 14352, 9460, -7932, 4815, 18463, -6792, -23713, -6119, 5020, -3294, -15479, -15580, 9240, 20646, -8819, -10981, 26805, 15853, -18136, 8639, 23525, -19897, -16046, 23797, -4596, -31625, 9052, 13566, -21874, 944, 22521]
137B2521l6237M286L7925k6391k5270L5150J47l1589K1452J0866l6232J6342L7489
150C0459l9333k2553N3411K119m9407J9318L1502l2098o661L0779j7007j7778
162a7249K9984j906k8570J9913J3870k9693N602K6056k3975j3416L1228m265k5513
175a7934K0017J1280k4814R246K1891k3715j0699K8857l360k5785R877J2052j0644
188c731P07L174p898J1032J0275j9948q67K6276j0408k4071J9541J2559k7443
201a0802l751K2484p111j4952R985N936k709M990m222l973J6849j68k3825Q191
215c078K1392k0535j7227K3627M738k3753N565J8583q517o544J0202J477j510
228D420K429p339j147J1182q942j5819J3673R297j9720j124K0455m759j2206J2663
$$ y = [22521, -13716, -9430, 28495, 2104, -23166, 11984, 12131, -19458, 1994, 12860, -23372, -7030, 30459, -8874, -31427, 21984, 24103, -25304, -5986, 25516, -6582, -13243, 17536, 529, -17249, 12735, 10829, -17741, 2172, 16042, -13651, -8049, 18007, -5968, -19384, 11844, 7579, -17934, 2083, 13363, -11451, -2205, 19686, -4029, -14728, 14129, 10769, -15016, -5139, 6913, -3731, -3024, 150, -7748, 3284, 13559, -6389, -7256, 19020, 8612, -15459, 4082, 16641, -10802, -14553, 7931, 820, -14132, -4147, 1789, -920, 4070, -152, -4125, 12724, 12556, -11269, -3078, 18314, -2221, -19448, 4179, 8917, -14836, -9271, 9312, 795, -5749, 4453, 5930, 4420, 6849, -490, -1637, 9545, 603, -15216, -1543, 7754, -11966, -13090, 7365, 2606, -9600, 3063]
242C063P004r891J433N213n401j47M41p754L407O316j2277j505J8561n023j6112
257a2672J6622J3048k0173k771J9444p346j4883J0033K343j1210M709K757r430
270i529Q592Q299j6205K794K3285j3053j9759K3947J0840l0184q82K6042j1071
283C116j8698J5250O848j3080M514P168q122M364P975j2082r66J5762r462j5479
297a2892J5564P902k0379j309J8301m422j1972P548O576m178l87M25o38M089j881
312B347p096N132M867r451j195J0056l473p127P123L158n794K505K090n096M010
327B056L488j0175J13J1584p104j0128J2118L941j3699M361J1594r873m716J2705
341F265k588r897Q557L144j0872M291P801j0772j818J2877n076r819J0649M129
$$ y = [3063, 10067, 176, 1609, 6822, 1421, 1274, 1715, -6039, -2632, 3684, -8593, -10098, 8463, 3440, -12672, 3950, 16998, -3175, -5946, 13498, 6152, -8731, 1302, 3645, -7565, -2856, -99, -9529, -937, 7362, -8843, -6049, 17236, 4183, -15576, 8371, 19211, -10973, -11855, 14187, 3116, -15582, -332, 6516, -6564, -2050, 5118, -3004, 1360, 9335, -2747, -3713, 12049, 2587, -12892, 2672, 10574, -9805, -11114, 7187, 2765, -9207, -1659, 4917, 739, 352, 777, 139, 4228, 2347, -4749, 383, 5250, -4201, -5396, 4660, 1187, -5940, 1183, 4341, -1453, 1052, 3142, -1954, 2056, 5544, -4631, -4518, 7066, -38, -10166, 1952, 5893, -7806, -3445, 8149, -1724, -6440, 6265, 3677, -6220, 2337, 5481, -5391, -1100, 6701, -4071, -5889, 6988, 1912, -7907, 2742, 6871]
355F871j1553L170Q624q323k999R124l630o867O873J114p262M163L816p017J957
370a939O904o152k759Q505k220o763O181K062p446K798M820o511p0O936n111l100
386c865Q723k226q344Q034M829j1935P40J1365p146p960J0207J681j0498M331
400b064P083p875q61Q591m321n072Q440l59r071N809O343j0053j916J1036l091
415B619r207O774O065p903j974P280p39m969J839K151j895n40Kr74J271Q22k523
432a901k26L451J36l455L15M170k57m761P41N638j807o286L258N904m958m582
448d620O038K563n751o6M492j657j932J765j108m84L073k434l875N603K391q180
464d182L13R121l672q109O663N363p743j605P151j485m579L654J061l273K362
$$ y = [6871, -4682, -1512, 7112, -1211, -4210, 4914, 1284, -5583, 1290, 2404, -4858, -695, 3121, -3896, -1939, 4965, -1187, -3946, 4559, 2339, -4424, 1757, 3819, -3627, -829, 3991, -2520, -2590, 4346, -765, -3865, 4858, 2632, -5712, 2322, 7151, -4784, -4044, 7321, 175, -7785, 2422, 4103, -6395, -2064, 5019, -2856, -3717, 4874, 553, -4519, 3921, 3562, -5509, 300, 6643, -3410, -5326, 5710, 2619, -6588, 186, 6251, -1652, -3626, 3654, 2915, -2054, -215, 1936, 41, -499, -497, -1471, -200, 622, -1901, -2127, 1324, 1460, -1995, -1680, 2490, 2233, -2528, -1787, 3851, 2044, -4242, -984, 4920, -38, -4620, 1418, 3981, -1770, -1836, 2656, 999, -933, 832, -276, -760, 2313, -121, -3996, 1607, 3998, -4182, -3869, 5252, 1580, -6529, 134, 5497, -2246, -3851, 3300, 1815, -2764, 890, 1951, -1322, 1040]
479A040J344m445J701M455n079l144P019K41p793K685O846m857m605O110J980
494C498n636M00M108k275k284K633k13k322J818J089k565R75L094k142j851M073
510B400Q16m722Q04M578l061m198L925K241n119n99M944j180l702L037K595l363
526f04l33L247j666k187K528o18l207K550J838m611M72N686k454m509N396L400
542D928o081m33N918k288m726L212J751m266J50K877j992r50K993p23j929K810
558A251J035l485P09L311k683k954L087J131l867ML463o74k230J892J909j034
574H65o88J002L04l90n61q53M48N97j461j151J699R40j755l75K110O88j634l53
592e68J570J88j528p16J043K84j184m46J009O16o05l72J052R97n77p72R26J045
$$ y = [1040, 2384, -2061, -360, 4095, -984, -4128, 2891, 3132, -4661, -1976, 4870, 13, -4592, 1518, 3498, -2138, -1738, 2370, 95, -2189, 444, 231, -2091, -273, 816, -1749, -774, 2320, 178, -1673, 2400, 3216, -1506, -702, 3876, 815, -3383, 542, 2783, -2336, -2935, 2009, 829, -2873, 164, 2759, -604, -937, 2310, 644, -1543, 985, 367, -2840, -290, 1548, -3063, -2591, 3095, 641, -3868, 1528, 4928, -1153, -1586, 4332, 2044, -2682, 530, 2281, -1985, -1835, 1042, -950, -1900, 1093, 370, -1559, 1251, 2286, -1199, -490, 2821, 138, -2816, 271, 1402, -2465, -2461, 1002, 328, -1902, -10, 1899, 865, 177, 1179, 1483, 1093, 532, -321, 127, 724, -737, -1888, -189, 751, -1004, -1379, 731, 1419, -215, -568, 1002, 1190, -338, -1054, -11, 273, -911, -1357, -348, 268, -337, -709, 343, 1340, 763, -9, 917, 1962]
610A962j537j320J646O25k428n22K488k87k276R63J757r30q90R18P0lL69j332
628g27l68K226n45l087J597L324k606k591L771J749l920j43L590j010k354J713
644F19O46j832Q54O87k151N89K273k105j775L257M01l561J135L054k462j873L380
661A136K83l449J148L015k040k150K682J066k401l5J747m40o59N82l61j54J311
678A281o19j871J265K059k240k135K711J529l204r53L142J80k727L52K264o77
694C57j154P18M78l56J79j27m57O81K92r64M0J078m42p88J094L34j301K27J278
713A167q17j210J047P08j321o53R78M81o18p35L95J204j75j475K71K152o58k098
731a357R14K022j077j656J013J331p85q22M08O23K61p80o60R67R55j516r98J681
$$ y = [1962, 425, -895, 751, 1376, -1052, -1574, 914, 627, -1649, -686, 1071, 141, -749, 169, 239, 236, 605, -727, -1095, 1131, 586, -2501, -904, 2420, -186, -2777, 994, 2743, -1177, -1320, 2270, 1260, -1094, 619, 1265, -567, 287, 974, -1177, -588, 1685, -420, -2195, 1062, 1463, -2098, -963, 2091, -371, -2244, 1136, 1419, -2030, -882, 2133, 93, -2057, 625, 1691, -710, -745, 1002, 562, -97, 485, 124, -30, 1281, 662, -1209, 56, 2115, -125, -2260, 451, 1980, -1224, -2177, 965, 1145, -1582, -1230, 1034, 357, -797, -79, 399, 43, 222, 95, -362, 319, 611, -353, -313, 765, 323, -465, 629, 963, -338, -111, 1167, 350, -860, 187, 895, -426, -1079, -101, 380, -238, -973, -578, 626, 451, -1024, -753, 1399, 741, -1357, -443, 1579, 502, -1154, -141, 1190, 405, -417, -9, 614, 875, 95, -565, 402, 1357, -159, -1157, 524]
749E24N04k050j72K003m19j795R29J342j158o64J223J97q36K83M91k89o8K45k75
768A5J16M68m21n45J030L46j564J61J673o84j769J145J453j756j046J827M58j805
786h98j16J526k17r89K02O77R1k71m31K10J059k46j450O84J613r08j716J258J505
805A583j320j367J261J244j220j207R34J127p72j295M69J258m40j330M09J385
821G19n26j212N40J062m59o96N52M25k53j59J76N9J39j9k65K17J85m15p1N78k92
842B85q12N90R17j318q22J613P37k131n45K416J7k323K66K154n92j431O42Q14
860D77k08j29k82j72J085K85j759OK320n73k451J250K103j804j534J908N92j795
878f81L5J320o85o63Q31o4o85N48J79n80L52L37o05J53R19p44p70J434N85j828
$$ y = [524, 1028, -1022, -1194, 809, 390, -1405, -476, 866, -292, -956, 267, 464, -372, -89, 402, 113, 45, 290, 15, 131, 599, 178, -367, 663, 1009, -555, -394, 1279, 595, -1174, -29, 1424, -332, -1378, 449, 907, -898, -1014, 512, 295, -694, -492, 185, 276, 5, -426, -216, 843, 597, -853, -169, 1444, 536, -1180, 78, 1583, 263, -1104, 157, 1401, 181, -1026, -92, 1035, 263, -1032, -563, 695, 255, -1075, -666, 719, 193, -1019, -479, 583, 124, -572, -20, 405, 152, -7, 169, 228, 367, 348, 83, 300, 485, 70, -1, 577, 285, -527, 63, 980, -338, -1160, 453, 1190, -941, -1486, 930, 947, -1376, -1110, 1044, 452, -979, -337, 477, 269, 140, -142, -314, 771, 1056, -703, -697, 1623, 1050, -1401, -151, 1952, 148, -1386, 522, 1114, -681, -646, 674, -11, -674, 157, 93, -592, -44, 135, -445, -93, 244, -361, -208, 711, -33, -803, 631, 1216, -612]
898f12r6J962l04j801N11J557n76j258L18R81j44r31l27Q76M85r05q55J063R35
917H79j169r45J271R96j325q36J418Q12j385n41J371M57j271j38J140nq55R0M79
936D43k0l43k43J86N17l39r11N14J004r18j027J131R42j560n01J573J64j355J16
955f27J183j60p44K53M41k2j95j28J94L12j55n49M03N35o02m33O33K94r79n6Q96
976D94j41j108L61J011n29q81M22R20m71q54M58R63l02q91J91J102j02j163J29
995c91J263L1j358NJ369k5j351j0J187j8j078k07Q96L06r56l68P88M58r64l90
1015h13J032K68j034rJ117k37r13N00R06p20n25P62M00o97j08L73J57j05m58j42
1035b46P77K19j265k15J591p0k036M48J951p39j884J068J424r90j112R81P93o40
$$ y = [-612, -708, 1254, 950, -851, -340, 1217, 641, -617, -299, 682, 538, -393, -720, 156, 641, -264, -1119, -56, 879, -290, -1235, 36, 1032, -293, -1129, 289, 1101, -284, -825, 546, 1003, -268, -406, 734, 729, -126, -36, 443, 423, 80, -163, 23, 540, 201, -710, -196, 808, -110, -1137, -6, 936, -624, -1125, 448, 612, -743, -627, 556, 396, -348, -95, 346, 324, 129, 1, 195, 507, 352, -197, 206, 741, 139, -294, 339, 633, -346, -402, 494, 353, -755, -394, 617, 88, -793, -371, 549, 78, -776, -318, 645, 343, -548, -357, 745, 643, -520, -391, 872, 903, -455, -450, 919, 894, -457, -467, 720, 702, -376, -583, 313, 619, -337, -705, 83, 541, -423, -813, 219, 487, -547, -556, 561, 324, -589, -89, 817, 97, -428, 334, 734, 37, -71, 302, 459, 354, -104, -246, 531, 750, -515, -730, 861, 791, -1245, -797, 1154, 415, -1469, -401, 1023, 33, -1079, -98, 695, 55]
1053E5m89K83M76J94n29l94P33O42r07p25J236N29j342l19J249k0j160J42R85
1072F39l60r66M28P22m89o99O25N92o55n34O64N82p44l22P04L85n43l37M40M24
1092E56k31n68J60P59m5j147J80J384m24j569N77J602j028j465J140J140j261
1109b40q80J236M73q86l75O41M02k79l94M6P18K0q16Q0R69p9j166L22J198m12
1129E78j218N16J176o46j092N89J047q61j027P71R49r30p60Q01O94p62n52P95
1147F8L95n86l44N03L61k37l87Q8O52np91J3J175k86j176M29J241p42j227Q27
1167b9R91j067r02J124N71j018m01Q85K94p28j59N17J29k88k07O9M71M0n66j9
1187b93R32L0j073K79J212n50j218P25J011j064q13J023N05j070k58Q87Q9o63
$$ y = [55, -434, -151, 325, 519, -10, -404, 329, 971, 64, -661, 575, 1104, -238, -557, 692, 672, -488, -346, 639, 279, -687, -259, 463, -26, -725, -100, 492, -163, -697, -33, 549, -195, -517, 187, 572, 29, -308, 132, 556, 325, -243, -83, 676, 631, -516, -336, 1048, 624, -945, -368, 1234, 206, -1259, -119, 1021, -240, -1120, 116, 589, -297, -672, -31, 371, 92, -302, -256, 462, 482, -334, -254, 715, 636, -530, -208, 990, 578, -640, -124, 1052, 406, -686, -97, 950, 89, -938, -167, 782, -148, -908, -107, 587, -175, -727, 68, 463, -123, -467, 36, 397, 160, -227, -139, 513, 508, -283, -270, 905, 619, -557, -128, 1113, 371, -856, -29, 962, -105, -1007, 117, 688, -330, -731, 154, 448, -280, -439, 78, 207, -81, -288, -219, 252, 292, -274, -293, 639, 669, -404, -125, 1087, 537, -681, 44, 1055, -9, -822, 201, 706, -364, -622, 265, 354, -309]
1205c09K5M44R5l35k25J39L12j54n03K18O42j31o97M41Q26m44o28O78N63p05n74
1226c22O03L04p29l84O37K03n69k33O84K31n12r2L78J31l83j65J78J50l44k77
1246e11K05M18j39l36M52N99m02m14Q03L11q34m29O97Q1q44j45O51J0o58K26O25
1267C66j39m02K79L50k47k55j9O6j04j19k84J58N09k08m77O89P00o64l77R29K07
1288I58j119rR81n37r27N35N36o50l05O41J76m21J74L13j95k1l2l32R5L54m57
1309b42m51P26K58p46J27R66j64p66M26P51o17m78M34L68n79m67N20M23m88l58
1329c57M45M23n19l51M85J86m20k60K17K73k52k98K56N18j78o05M40Q20m75r39
1349e91P06Q30q12r13Q83P89q86o07R08O31q32m21O40L63p01n05M34L35n36n22
$$ y = [-309, -284, 160, 255, -80, -305, -166, 146, -8, -511, -293, 349, 218, -479, -38, 788, 344, -284, 394, 957, 252, -322, 281, 585, -144, -528, 109, 312, -257, -490, 194, 425, -87, -179, 199, 330, -53, -218, -40, 110, -234, -511, -306, 112, -27, -363, 89, 688, 286, -128, 675, 986, 152, -277, 420, 501, -343, -488, 163, 173, -485, -259, 366, 227, -175, 104, 454, 207, -48, -67, -1, -105, -224, -508, -350, 159, -49, -526, 163, 863, 199, -178, 751, 958, -161, -170, 811, 274, -653, -118, 418, -232, -537, 104, 280, -141, 33, 346, 151, 130, 98, -234, -139, 215, -242, -693, 33, 291, -455, -328, 638, 474, -292, 134, 885, 268, -210, 224, 592, 13, -454, 66, 489, 1, -357, 88, 511, -8, -359, 126, 312, -108, -368, -151, 122, -130, -428, -172, 346, 168, -437, 3, 823, 348, -591, 115, 945, 133, -780, 103, 892, 6, -601, 307, 938, 106, -315, 325, 688, -13, -518, -84, 251, -285, -807]
1369h07L81P09l27o24M99J025k51r88K97J065n12j120L84R71q61p21R20N48p95
1388b07j15J009K03p22j76O12P5m98p34J02O91m26j117M80J419n52j065J107J327
1407A413j088q52J239N25j293o71Q24L22p91o25N21J063q9j017L56J510k28j399
1425b80L17J253p92j334L79O48p40o13P43N38m43k15P73N61l78m01N08M04o63
1444B65p73M95L58p26n82Q64N76p43k19J110M72q40n77R70P41j412j119J147R92
1463I99j573j322J622J200j327q00J380R87q93p38P41O70n57r43J81R93l92j169
1481i41M23J317l63j224O42J376n39j185N41R54p13r31N42M87p36l92P47K19p44
1500e20L9Q49J61p28j59P97K13p20m38N44P51n62j055O88J246p17j395J049J267
$$ y = [-807, -426, 283, -44, -668, -169, 856, 605, -383, -86, 979, 467, -653, -269, 702, -159, -880, 40, 588, -207, -322, 687, 890, 168, -8, 604, 679, 181, -553, -451, 240, -186, -1303, -823, 596, 44, -1021, 86, 1413, 325, -527, 712, 1237, -56, -727, 97, 419, -372, -997, -476, 587, 498, -519, -163, 1347, 1119, -280, 37, 1290, 498, -836, -457, 191, -549, -1162, -419, 119, -324, -539, 234, 795, 417, 16, 524, 928, 265, -508, -13, 345, -381, -963, -99, 477, -266, -485, 625, 1097, 257, -320, 650, 1391, -21, -1140, 7, 999, -574, -1896, -274, 926, -401, -1201, 179, 1166, 273, -465, 276, 946, 389, -554, -373, 620, 228, -941, -518, 799, 436, -788, -146, 1230, 691, -494, 47, 1001, 288, -643, -101, 386, -350, -742, 5, 224, -520, -481, 368, 529, -199, -358, 439, 652, -68, -506, 38, 789, 227, -828, -140, 1106, 389, -1006, 43, 1310]
1519A310j118j208J204J000j346q45J163O61r56n75O33N49l00o13m4P94K47j041
1537d85k72J033M08j053j02J078m4q62K81Q32m70o90N13M27o42l90N85K24o01
1556b30j06M76J21k83r4K45J07j44l40J22L42k03n89K41P27k47q41N40J050n33
1576C61q69P23P92o88p32N62N10o11n99M25L61l45k35L01K64j25j77J21K37j07
1596A69l14j08L81Ln87j5P75j71o75M18Q81n67m86P60M30q33k28P48o7q85P6O22
1618C27l28k89J89J33N5O5k61l5M98N1q27K17P60n25q23P04N96q27k38R31Q8o44
1640a83J70O40j91m59J97J67r9k52o3P5J60l24j45L70K57m53j90N44R7n39Q3M05
1662B67j56l53m3K36R1k68q6M71K39m36n0N80R9o00J08M41k71m66K00J85l26j11
$$ y = [1310, 192, -1016, 188, 1188, -158, -1003, 160, 821, -135, -710, -77, 472, 172, -441, -485, 309, 556, -485, -757, 276, 684, -369, -471, 607, 563, -299, -18, 814, 344, -346, 167, 594, -48, -438, 147, 371, -230, -336, 140, 261, -22, -116, 129, 236, 92, -248, -126, 216, 13, -576, -335, 392, 145, -696, -156, 894, 361, -508, 215, 1007, 319, -413, 149, 659, 48, -551, -126, 235, -110, -345, -44, 220, 95, -82, 39, 276, 169, -145, -253, 128, 131, -456, -471, 304, 133, -542, -124, 757, 190, -296, 464, 894, 61, -167, 581, 514, -371, -295, 327, -1, -290, -101, 32, 87, 152, -109, -144, 354, 405, -422, -205, 555, 30, -793, -89, 507, -320, -558, 373, 461, -183, -13, 627, 436, -23, 174, 341, 242, -10, -73, 2, 162, -162, -307, 63, 320, -133, -323, 221, 318, -221, -138, 267, 111, -242, -285, -49, 42, -226, -312, 159, 398, -38, -88, 492, 591, -9, 99, 540, 269, -197, 3, 188, -138, -249]
1684b49K16P2j08P6N2J02P4j19j79K27P7n47r9M60j22n22K72O40k78l43O02M08
1706G12m21k18M14Q4n14k18K42n7k05j02K8K07J22j78o6N88J55o93J9P57l76r17
1728f37L14P16p18n28O85M50n23kN93J32j67M8mN0J45n15l01M18K4q12J5R24l00
1751Go17N91P09m45m99O51J83o16k24J82J14j77m34P9O69j00n26L74Q71l26n99
1772a33N03N29n99n74L89K29l54m78J03N70l1p14K02R77o6j041L73J026n70j033
1792f92O17O75q40n05N93L64l75j88L41L24O2k16j65N29J99q35j48R06k00j023
1812e77K25R37m79q16N39P71o40m99O13M61n18l72N67J78m36k81L56K71k39l17
1832b56J02M09M0n20J9P74j10q21K67R14l56r90O14P26p75o60O69M17q09k36N48
$$ y = [-249, -33, 39, -69, 7, 59, 161, 235, 116, -63, 164, 241, -306, -405, 55, -67, -589, -317, 323, 45, -298, 304, 712, 291, 73, 487, 571, 57, -161, 81, 24, -181, -283, -255, -48, 74, -104, -170, 418, 573, -120, -101, 656, 280, -637, -323, 393, -325, -853, -168, 282, -241, -243, 350, 482, 315, 363, 359, 409, 554, 39, -262, 156, 180, -632, -617, 307, 7, -610, -19, 690, 245, -254, 397, 580, -36, -260, -78, 36, -141, -575, -496, 173, 73, -453, -79, 792, 466, -133, 370, 899, 300, -274, 115, 344, -10, -488, -385, 185, 154, -560, -358, 619, 553, -488, -115, 911, 341, -692, -75, 600, -240, -745, -152, 212, -163, -351, -10, 314, 376, 160, -5, 524, 723, -112, -260, 646, 446, -577, -352, 585, 106, -710, -171, 600, -40, -539, 74, 535, 17, -355, 212, 390, -46, -327, 29, 300, 61, -256, -154, 255, 295, -225, -206, 568, 458, -363, -96, 818, 462, -528, 86, 812, 37, -623, 46, 463, -346, -582, -34]
1853c4J38k32j11K30L80n5m02RO40j58p26R8O65l41p27M11P18m83m34O26M81m08
1875B85l27L86K90l72n26K01L53m14n96L76M65l92k78N20M64k96k07M21K04k81
1895B76l03R0K33k50n24J01O21j86o50N55Q49m23o29P37N46q56m33N86Q1p81k28
1916e88L71R8k74l6J90L84J45l00J18O10j83p01J89N09m20p11M91M79o45k99P06
1937A33L43m70LM82N6k66j49M2P5j77m23n5M13k23m66M02O52l98l81P69L40o11
1959I1j99O49j58m99KK92j99j68L4j6K76J25l28L2P53k28p53L88O70p62o47R00
1981B55Q6r87J55P06k81m01M95K12l71L08J15l17K90K12o51j3P89l93q79P17O10
2002F57r54k50J040M9j019M03P03n56l21L95N7l17J06k0l16M48M8o51J96P92m74
$$ y = [-34, 104, -128, -239, -9, 371, 316, -86, -77, 563, 405, -321, -223, 442, 101, -626, -215, 503, 20, -414, 212, 693, 285, -42, 344, 634, 262, -264, -63, 290, -124, -720, -344, 121, -271, -549, -29, 435, 139, -68, 353, 557, 276, -27, 63, 296, 46, -478, -377, 244, 58, -592, -37, 812, 389, -240, 497, 1043, 187, -246, 340, 421, -360, -588, -217, -119, -393, -429, -239, 145, 290, -10, 108, 718, 535, -166, 23, 532, 112, -599, -108, 371, -274, -573, 133, 476, 6, 9, 491, 547, 281, 132, 174, 249, 72, -351, -406, 7, -216, -682, -280, 372, -26, -407, 362, 702, 91, -108, 541, 383, -116, -114, 178, -21, -189, -155, -171, 105, 230, -98, -66, 687, 459, -294, 94, 764, 2, -645, 255, 341, -646, -491, 215, -66, -467, 28, 240, -131, 177, 292, -25, 265, 477, -174, -187, 602, 209, -670, 47, 657, -297, -547, 493, 542, -477, -74, 629, 73, -248, 147, 204, -113, -7, -27, -343, 105, 153, -498, -302, 490, 16]
2023A6o37R08N34r98j81J053j63q66L22N76m97l51L90l0j82J82l9q8L80Ro25L06
2045A9O68o53o34Q42L05j013j78J076k11q91M80O78m58k33M87M2j86J35j84j11
2065b0L84j76o01L72N65p15m38R26K20q51N6Q85l13o58M19L54m81j15J48j05J94
2086E0j10k87L09M63m32l11P03K39p82N6P22k53o50L76K52l99j10J89p9R7N3k49
2108a53J38M00k86n13O41L38r10oP80k58o42L85N25n27j59M76M2k97K05J4j53
2129D0K68j9n13K49N04n47m58O96K25q16NR04k48q16N03N28n37l42N18Q4l84J01
2151e5J39j64R3J35l36J03N26l12l69N02M42q12k37R17j64r05K89Q10n85n43N97
2172G1L08n56J3K79k3j36O4p8K9K93l48k54N10K17o44l4Q20j89p11L72N98l72
$$ y = [16, -621, 287, 821, -177, -358, 695, 532, -334, -12, 564, 67, -284, 106, 76, -106, 76, 37, -51, 329, 338, -287, 19, 687, 34, -600, 242, 547, -466, -644, 432, 221, -670, -190, 488, 30, -203, 284, 326, 140, 275, 91, -20, 364, 188, -413, -41, 524, -191, -629, 297, 517, -334, -278, 607, 294, -364, 55, 409, -72, -187, -39, -144, 50, -60, -347, -38, 425, -7, -318, 385, 624, -158, -102, 620, 367, -283, 93, 345, -54, -164, 25, -54, 43, 96, -153, -15, 385, 99, -414, 227, 565, -345, -351, 429, 171, -471, -86, 439, -88, -247, 229, 271, -26, 179, 193, 40, 308, 289, -224, 25, 529, -18, -476, 220, 445, -371, -366, 538, 290, -526, -23, 505, -32, -374, 144, 228, -156, -55, 84, -80, 13, 148, -188, -85, 441, 129, -240, 262, 704, -108, -345, 572, 408, -497, -208, 602, 17, -526, 71, 379, -177, -164, 115, 92, -44, 20, -58, -29, 264, -84, -338, 172, 389, -255, -289, 531, 342, -369, 3, 601, 229]
2194B29n03M16L15l44l04J52K96j29l25J5M32j17m77J54N73k60m80K50M48k61
2214H0l88L62K37k35k00J28K91n3l58L5M83q7m65J63M90k85m79L11M21m60l44
2235c53M39K53l90k45L16K12k77j95K58J93k14k38K91J31p1k88R9L54j24k50J04
2256EM40k20m60K42M90l87l58M24J93m34j61L89Lk87M3P2l8J07j32n2J70J82l15
2279h4r4M35j34l91J94M20l19k76L69K32l68mK05j0j70J46j8j00j3j9l1L2R9j47
2303d6p2K22m7k17J31K23j69k29K19J93k47j31K50J22j21j79K32Q8j54k3P1M9
2325A65%j17oJ05ok29k8L04n6k77J08K11k23j57K10J33k01q0J96J25j48j10J33
2348E2J50j58j56K34J67k99j17L48O5l16j2L00m2k01n5J22R1j49j24j1K81j19
$$ y = [229, -274, 142, 457, 113, -191, -39, 257, 128, -197, -182, 250, 133, -344, -190, 383, 123, -357, -107, 341, 80, -308, 54, 291, 56, -144, -16, 275, 222, -136, -101, 382, 295, -170, -7, 483, 198, -281, 30, 451, -9, -353, 86, 339, -51, -296, 20, 232, -45, -240, 18, 211, -3, -241, 50, 181, 110, -178, -79, 275, 151, -99, 5, 445, 225, -235, 7, 497, 110, -248, 176, 369, -65, -226, 163, 166, -121, -78, -6, -44, 63, -69, -121, 49, 231, -84, -178, 257, 123, -268, -74, 346, 27, -249, 120, 352, -16, -20, 185, 175, 5, 151, 133, 33, 20, 1, -30, 2, 101, -46, -118, 104, 57, -160, -29, 194, 25, -204, 15, 208, -39, -170, 80, 202, 81, -98, 134, 222, 68, 45, 116, 165, 165, 48, 42, 147, 141, -88, -116, 188, 132, -145, -37, 174, -49, -206, 4, 137, -64, -144, 52, 177, 29, -81, 52, 202, 44, -112, 122, 289, -10, -127, 221, 286, -30, -42, 258, 216, 15, -40, 82, 173, 24, -100, -111, 170, 51]
2370E1l59L18K91l65k84N47J28n90J01M80j56m05L16K37k04j27J3J02J56j28k07
2391h5K06K40l97k12M30K16o10m6N66j42n00K41L53k12k40K22J24o6j24p1K10
2412A03R3j92j47L65L4l57m4M51q7l38J22L62j85l25J95K52j84k86R9K21r3k93
2434b34J48K56j37j83P9K53r1k31L1L33o9k92J03L61j56k41R2L30j49k51O2K06
2456B20j30j26P1Q9oj95j8J70N0k70NL33j04l20J52L02k42j73K30J80k43K3P1
2479F9L3P1r6q2J27J39k26r1K75J4m01J54K83j79l30K66K53l42j27J78J46j74
2501d0m5O1N8L9j21K5J01J7j31j2K25J6k28K8K54q7k14J38J43j21k10R8L15k63
2525D6j80J75J42k30j53J80J79k44%R4L0q6n3J01J03mj72P8K20q8j99N4K89j33
$$ y = [51, -308, 10, 301, -64, -348, 199, 327, -263, -162, 318, 162, -243, 73, 310, 106, -21, -8, 94, 250, 122, -85, 121, 361, -36, -248, 182, 398, -212, -258, 308, 166, -334, -93, 260, 48, -192, 30, 154, 88, -36, -107, 103, 196, 4, -143, 222, 256, -101, -145, 306, 219, -119, 3, 365, 180, -145, 50, 302, 118, -168, -69, 152, 59, -234, -86, 170, 33, -150, -71, 182, 91, -140, -109, 224, 155, -137, -34, 327, 171, -70, 22, 352, 203, -48, 14, 220, 90, -36, 35, 124, 118, -77, -95, 75, 125, -145, -140, 193, 89, -231, -79, 223, -19, -192, 38, 218, -25, -2, 69, 102, 173, 77, -5, 122, 261, 35, -56, 219, 233, -168, -14, 269, 90, -240, 26, 279, -63, -190, -12, 134, -40, -85, -24, 34, 73, -48, -23, 78, 95, -36, -48, 177, 193, -35, -7, 247, 160, -54, 84, 227, 106, -104, -6, 309, 46, -134, 41, 183, -47, -200, -20, 159, -85, -85, 9, 39, -47, -100, 1, 104, 100, -72, 6, 226, 138, -61, -7, 282, 149]
2549A49l06J93L16k03l27L25J31k53j26J64J35k93MJ20O0j08p6L4J65n4j57J1
2571i6K92n8l49J97L78k13l37K80K85l59j63L79J9k70m0K50n4j04r0R3J19o3k57
2594a61J24K30j91k06J32K62j89k66K89J71k68p3K66R2j53j42J59J26j12j89K29
2615A30J73k16j19J31J52k62j26J75J65k43m3J51O3j37j40J45J97k68j01K01J36
2636A64j26j41J66J58k38q0K51J09k68o3J61J15k17l9J68Q6k04j50K81N2j79j50
2658a44K03O9k34j0J78O7j46o0J17J41k05r4J99J33k35j06L09Q8k71o7K46M7k52
2681b7j5K51n7k32J7J78K4j64m8J22R7j92r5K10J12k31j20K05J77k79m5K62rk02
2705f1k9L04J7l41J03J92Rk48N4J70o3j43k2J22K5o2q4R0J17j95j68K72J48l51
$$ y = [149, -157, 36, 352, 149, -178, 147, 278, 25, -101, 63, 198, -95, -91, 29, 89, -19, -95, -61, 104, 50, -107, -96, 196, 138, -211, -14, 364, 151, -186, 94, 379, 20, -143, 236, 255, -15, -55, 195, 141, 37, -53, 40, 159, 96, -161, -37, 193, 2, -204, -72, 190, 1, -265, 24, 195, -73, -146, 120, 212, 59, -83, 76, 202, 90, -99, 130, 303, 87, -32, 99, 251, -11, -137, 38, 203, -40, -83, 68, 131, -6, -146, -1, 196, -72, -173, 28, 164, 38, -103, 63, 221, -17, -97, 154, 263, -5, -68, 93, 208, -9, -48, 120, 206, 2, -148, 133, 185, 6, -144, 59, 128, -106, -116, 62, 129, -17, -77, 40, 181, -24, -118, 81, 214, -21, -127, 182, 270, -1, -68, 178, 225, -27, -42, 209, 152, -80, -63, 115, 139, -25, -73, 49, 146, -46, -141, 69, 181, -50, -170, 35, 212, -67, -112, 150, 141, -61, -90, 214, 231, -110, -7, 185, 194, -54, 0, 170, 107, -36, -58, 64, 89, 27, -57, 33, 150, -45, -213, 59, 207, -144]
2729a44p3L79J4l50OL68m1k90J00K78r5k01Q0K11q1j55K8Q5K1j50m7J91J2j67
2753b1j15K49O8l26JK47R2k64j01L15j9l11M6L53j17j99O1K88q0k26J27J33r1
2776A10r6QR7M5q9k05K34J01k10j33K80O1l29q5M36j35k84J00K63j08k34J58K14
2799A99j21j61R1J61j33n3J9J43P7k75PJ25J02k14l6K20O3l35k7L50p0k78J9L65
2823B38r8l43J40L05j84k48J92J40j10r1J08R1j1q4j8J90mj92o6K14N5l47M0L68
2847B85j03l56R6L27k06k16J21K10j00j76J19J94j51j36J11J61j30j09K3K17n4
2868A27j36j1K09Mk42j9K55J9k70J0K90q4l33J40L05k09k41K30Q1j58j09J75Q5
2891A18p9j04K2J27Rj17j05K38J10l42R2L34j52k73J17K99j87k00J38J67j36j55
$$ y = [-144, -217, 162, 176, -174, -168, 200, 159, -131, -31, 247, 152, -49, 31, 242, 161, 6, 34, 119, 140, -10, -57, 134, 146, -21, -136, 113, 181, -145, -144, 103, 195, -69, -170, 145, 126, -185, -139, 214, 97, -102, -41, 247, 167, -59, 68, 201, 110, 14, 22, 119, 164, 75, -130, 104, 205, -5, -138, 142, 203, -126, -211, 225, 90, -194, -94, 169, 61, -173, -15, 199, 78, -83, 8, 169, 36, -17, 2, 145, 222, -53, -46, 79, 181, -33, -69, 151, 214, -121, -148, 202, 132, -146, -127, 238, 140, -203, -63, 242, 58, -190, 2, 142, 32, -59, 49, 140, 129, 45, 27, 217, 213, 21, -45, 169, 224, -123, -83, 285, 182, -174, -78, 249, 43, -173, -52, 158, 58, -118, 1, 195, 44, -92, 19, 180, 50, -59, -36, 181, 127, -9, -20, 189, 193, -49, -68, 187, 206, -64, -54, 236, 152, -181, -41, 264, 55, -186, 44, 125, -33, -142, 33, 118, 39, -65, -43, 84, 93, -24, -129, 109, 219, -123, -31, 303, 151, -122, -5, 294, 107, -93, 45, 212, 76, -79]
2913g9R4J39o7k15P1J81m1k17R8K42j52j72J44J44j08j18M1J73p8j49O0K28j4
2936B05l16R2L04j44l04J42K98k08k09J70J63j50j80J67O6q3r4N0J39kj81OK37
2959A68j6k80J10K73j09k79J65J83j45j38J03J63j53j11J17J56j88r3J01J25j32
2980B0j12Q3J27r8r5K4J28mj18N9J52o5j58K6K29m3k80J37K22j53j81K50J38k51
3004C7j8J69j09j17L5N5M4q3n9MJ00l0j44J05J61j17j59J61R2j30j15J60J27j94
3028b5k2J18J61j80p2J71L0j62MJ34l1r2l6J06p6L6p3K6O1j05pRJ49l8j59J36
3054F3J93k73p4J83N0k01j3K57l1j80J01O2k3k0k9M2%p1j03J09N1j33m9J40R3
3079A44k00K2J84l8j69Q1Q4k4j04nQ2J3m2r3J38J03j75l6K54m0j93N4J16p3j72
$$ y = [-79, 15, 154, 87, -128, -57, 124, 83, -134, -36, 206, 54, -118, 26, 170, 62, -56, -15, 158, 80, -69, -9, 219, 205, -111, -19, 285, 141, -163, -21, 277, 69, -140, 30, 193, 43, -137, 30, 96, 13, -81, -31, 108, 106, -75, -69, 168, 152, -128, -18, 255, 146, -133, 32, 215, 70, -68, 35, 198, 45, -66, 51, 207, 19, -74, 27, 152, 20, -92, -9, 118, 20, -75, -51, 77, 73, -45, 14, 166, 101, -57, -31, 198, 155, -125, 12, 234, 81, -100, 150, 288, 37, 19, 188, 79, -38, -3, 52, 96, 13, -46, -42, 58, 28, -116, -11, 150, 33, -126, 35, 127, -3, -118, 42, 169, -25, -47, 71, 232, 52, -20, 151, 181, 19, 23, 157, 126, 34, -2, 104, 28, 64, -9, 17, 78, -27, -34, -25, 124, 86, -73, 63, 256, -17, -91, 92, 142, -59, -72, 185, 154, -26, 75, 137, 114, 94, 65, 107, 107, 36, -67, 42, 93, -40, -89, 51, 144, -56, -34, 150, 112, -57, 24, 108, 84, -20, -25, 57, 70, 28, -65, 73, 176, 1, -35, 219, 179, -14, 40, 156, 83, -89]
3104h9J35M8j5j60M0J44j7q4m9J60Q6k09n7J62mj27m6K41q3j98J31J72m3j20P
3129B5J94p4j43N5J24j10j53J7J67M2k11PJ63M5j72k4J92P0l24j4K96j15k64J20
3153h7K89j55r4J41N8q1m7Q2J21r3j29j9J05L1k00l9K61P5k93Q7K28p3k47J37
3177E8J40j35k26J32J20j08n4O4R6l0j03K7J67K4k00O2J70q1k60J44J63n7k53
3200a40J58K39j48k00J20K02r8j58J9J60j16j63Q1J14m7j77Q2J55M7j52L8K57
3222B73p2k32P5J48q0j97J7J95n0j53Q3K30j17j93O9K09l2k18J2J58n5k03N2J87
3246A06j31j03J00K38j07j48J72P0j32j01P3J13J1k08MJ54j1j90N9K41m9k24J55
3269I2J07q5j72N7Q8r6j39J10mJ0kj4J99j7k00P9R4N5k26N5J62j06j16j3J98l5
$$ y = [-89, 46, 94, 79, -81, -41, 103, 86, 2, -47, 113, 199, -10, -67, 95, 91, -36, -82, 159, 76, -122, 9, 181, 138, 18, 25, 219, 145, 2, 57, 181, 71, -82, -65, 102, 144, -67, -60, 103, 148, -24, -48, 144, 214, -110, -124, 172, 57, -207, -87, 202, 47, -47, 94, 152, 71, 24, 106, 227, 134, 5, -14, 91, 122, -78, -117, 144, 219, -74, 13, 241, 168, -79, 58, 198, 63, -163, -31, 89, -19, -73, -9, 87, 57, -46, -19, 148, 172, -28, 34, 204, 123, -137, 7, 170, 113, -140, 18, 257, 109, -91, 29, 231, 133, -25, -6, 154, 38, -125, -44, 70, 23, -154, -72, 83, 130, -22, 16, 273, 201, -31, 44, 192, 112, -85, -68, 127, 77, -76, 7, 237, 120, -73, -4, 205, 173, -45, -33, 125, 70, -133, -81, 106, -25, -128, -28, 210, 103, -45, 127, 197, 65, -36, 37, 150, 161, -47, -43, 111, 100, -90, -31, 210, 161, -63, 92, 199, 114, -58, -1, 87, -9, -148, -38, -42, -32, -34, -48, 151, 134, -66, 13, 107, 162, -64, -9, 153, 47, -69, -82, 116, 81]
3295H1j29J43J41j22j72J76M3r9k05J54J2j2j25R3M9n8k3L6K15p0j44N8J43q7
3319I8j08PJ37j05j58J89N2m8j4Q5P9j36n5Q3pq4l0K5K1n0j48J53J41m4j18M0
3345EJ77j00j15O6R1r2r2O6J20j48k8J52K0j0j61J98M3r6n7N7j7k0m9M3Jp4P3
3372E3j1NOm0MJ36m6j30O6J35j69n7J13M9j59N0J51m0l7PL6k3j2p2O7o0K2p1K
3401b5R7l7n3R8K4j24j1J31L8j34l1J53o6m6j2J21o8o3J21k0m4%K2P4l7n3l2N4
3429G7jp4QL5R8k03l6J98M5j84M5J14j17l1M9plq4P6J11n6n9Q1R7j23k1j6J58
3457A77p4r2L5Q8l3j41K6J28Lj32k8J03L4q1k6J08J9j29L7J39p6j78Q5J08j00
3482@j7J30J8m7o4P8j1Jr1J6J13q1p6N0R8Qj45k1J69m1j42O2J51j76J0R3M4j20
$$ y = [81, -48, 95, 236, 114, -58, 118, 161, 62, -143, 11, 23, 11, -114, -21, 28, -30, -53, -17, 198, 128, -16, 42, 185, 98, -10, -3, 134, 29, -129, 60, 112, 64, 50, 135, 214, 78, 23, 106, 99, 15, -15, 10, 31, -19, -167, -14, 127, 83, -35, 5, 182, 82, -33, 33, 124, 32, -60, 6, 126, -22, -50, 102, 122, 112, -49, 149, 192, 96, 39, 96, 79, 59, 10, 53, 54, -20, 53, 42, 47, 53, 13, 17, 153, 107, -23, 43, 178, 9, -48, 65, 114, -45, 5, 156, 116, 79, 86, 122, 99, 87, 15, 82, 22, 44, -27, -25, 72, 35, -18, 80, 104, -20, -31, 100, 138, 4, -27, 126, 60, 14, 2, 123, 55, -8, 113, 93, 49, 49, 71, 145, 108, 55, 23, 77, 76, 2, 10, 45, 143, -60, -96, 102, 147, -37, 8, 122, 5, -26, 23, 16, 13, -71, 5, 116, 60, 1, 82, 179, 56, 35, 19, 177, 103, 11, 46, 134, 101, -40, -14, 114, 117, -15, -43, 60, 94, 13, -13, 95, 114, -15, 22, 161, 85, -93, -8, 100, 0, -17, 113, 131, 84, 20, 98, 87, 88, -3, 13, 126, 45, -31, 19, 117, 125, -20, -41, 128, 87, -55, 7, 158, -18, -8, 85, 129, 9]
3510Il9Q0J22j22p8O0J42j13n3L7J04o3j35Q5J03k7j74R9O8q1n9M4J27r9j47J56
3536D6Q5j23j17J44N5p6q8R3R0k1j70J26J06o1j66K05M6j36n8J5J58l9k51J68
3560C1J11o1j49J30J10j05j33R7J12q9j31J09J37j42p9Q6Q3q9o3M2J57r7m6P8
3584I9O7n9j19N5J58j34j41J03J21q4j86K35K6j44QJ06K9j88M7R2m0m5j3Q7n3
3609B7M2l9J8Q8k7q9L7J42j55j20J20J11j19j51J53Q6j86N5J26nr3j0O8Oj04J5
3635dN3O7p3r5J30L8p2j49J42J69j64q6J28O3q6n8J23L2j85k5J19M4j28L2O3j3
3661F5r5K3O3N3m7p8J5P6o9p7Q6Q6j14k0J60L2j59L9P0Q8j84j4J44m3r5l5Q3N5
3689A08q7n6J11Pl7j10J64o1q0m1J37K4j12L3N0P2q5r5J70K8p3j14J43J08k59
$$ y = [9, -30, 50, 172, 50, -28, 32, 174, 61, 8, 45, 149, 86, -49, 36, 139, 112, -62, 37, 105, 24, -35, 9, 136, 37, -110, 46, 131, 8, -109, 35, 90, 14, -74, 19, 109, 88, -82, 44, 150, 89, -77, 128, 174, 38, -20, -5, 153, 114, -137, 31, 142, 81, -68, 62, 172, 67, -66, 31, 143, 54, -77, 32, 169, 27, -52, 34, 117, 28, -35, 7, 164, 67, 21, 99, 166, 107, -12, 43, 201, 67, -74, 29, 150, 66, -120, 115, 141, -3, 5, 111, 140, -48, -1, 91, 51, 6, -7, 80, 27, 69, 30, 48, 136, 109, 20, 57, 199, 44, -76, 44, 155, 36, -115, 38, 124, -62, -7, 119, 114, 21, 11, 79, 85, -19, -4, 49, 116, 43, -52, 78, 116, 44, -105, 37, 206, 42, -44, 84, 147, 61, 3, 126, 158, -27, -52, 67, 111, -17, 15, 78, 65, -30, -7, 56, 109, 62, -16, -1, 75, 6, -71, 15, 101, -13, -33, 127, 159, 0, 39, 109, 197, 13, -1, 143, 100, 5, -30, 53, 108, 21, -35, 76, 83, 46, -64, 100, 39, -41, -82, 55, 79, -33, 0, 50, 122, 37, -58, 112, 140, 67, -47, 96, 204, -55]
3714e5Q7P7lj19M1P0k8m0J9K0j9pj3J6J6o6j14J65O9j00q9J39O4j23J3J24o8m2
3742C4o9Q2Qp0L0R5On3o9J08O6j11r6J27L5q5m0M0R1q0j53J96oj82Q3J04J6j55
3770d8N5J47p0o9l5J08j4p3NJ21j3r0OR2M6j73j6J05k1j17O8M7%j56M5J03lp0
3798b0QJ41n1o7PQ6J9q5lP3p4o3O4O1kq2QJ09p0m4K6P1p3pn1L3P9j54N2J04k5
3829G0j21K3J18j9o7P9J3l6j5L2L6p4M2n3pO8k7n4Q6O6j40n8R1J25k05nO9J2n1
3858bM1O0p7j7M5lp2PM7K0L4l8L8k0L1l4oK7J7j03j0R1K8j36J5J14l4j42R9J16
3888A36r0o9M2O0p6m1O9J1l1K7L3R6j10j8j3O5l4l5O1Kk8q0N4O1l1o8M2j7R1j43
3918c4Q3O8o1q5O9L1p5j3Q4J9n0qK1L6k4k4J3OQQl2J08n9r3J09Pj13LO0qmj2J1
$$ y = [-55, 32, 109, 106, -13, 28, 98, 70, 30, 49, 69, 50, 43, 30, 46, 62, -4, -118, 47, 116, 16, -73, 66, 130, 7, 20, 144, 76, 34, -35, 47, 55, -15, 15, 110, 116, 63, -6, 102, 168, 57, -39, 88, 123, 38, -2, 38, 129, 49, -104, 92, 86, -96, -13, 91, 107, -48, 7, 154, 84, 15, -20, 88, 74, 1, 6, 127, 114, 24, 30, 122, 168, -5, -21, 84, 63, -54, 14, 61, 61, -95, -50, 53, 50, -20, -12, 129, 78, 11, 18, 104, 123, 38, 35, 108, 34, -29, 35, 96, 94, 12, 20, 129, 59, 15, 41, 112, 39, 32, -19, 14, 93, -61, -9, 95, 70, -51, -28, 90, 71, 4, 83, 96, 60, 45, 77, 113, 39, 81, 28, 21, 89, 62, 8, 94, 160, 20, -38, 53, 178, -27, -32, 37, 49, -2, 39, 99, 22, 5, 50, 47, -25, -18, 29, 49, 83, 45, 83, 63, 94, 60, 54, 81, 98, -5, -15, 76, 104, -32, -17, 97, 63, -79, 20, 136, 46, -23, 19, 79, 3, -38, 31, 42, 11, 38, 71, 167, 57, 39, 26, 91, 57, 22, 83, 85, 57, -23, 31, 92, 61, -7, 35, 18, 109, -34, 49, 117, 56, -29, 40, 71, -4, -17, 67, 86, 36, 28, 49, 85, 61, 37, 50, 56, 64, 72, 40, 148, 89, -4, 105, 112, -1, 2, 62, 54, 50, 38, 49]
3951D9QMQj6K9l4r4J06Jq1K2N0R7r0o0N6P6p4r5P1Q4p1l4L9P2n7j04J45L2q0o9
3982a0N8Jq8K8NN5n2k0P7L0k5j02J20K8j27N3J2K9k0j01R1M3l4l3L0kJLJ5N8q6
4013C7k2K0L5J2q0L6j5K9n1K7L6n3K5K7mj1o6P5O3p4m3J10mk5q3O9L2r1QN5l1
4044D3l3j5M9qK3n0j5P9Kj01L2J31j09j4K2O0l3q9J25K2j26l6J61l0n3RL0L2k8
4073H0n6L2J0j5r8O4JK6o9L0K6K3m0rQ3o2j5M6R8r0p8J06l0r6LR5m2ML3j2J9n1
4105A6L6K4K7l9k5j8K5Ro0N3L1l7n5K3N4j12J5J32j9p4N5k5M0p0MM4K2k7L%K8
4136H0o3pR2n6L1p6P2k9n4M3O7k0q3KL9NnMO0J2q8l2L7kR0n5m1K0K0j7J2L2m8
4169D2M2n0P5j14O6j2O1j09L3pM5j08M1Q7k8n9L5M3J9p0K2k7P6m8j1L4n6J2k7
$$ y = [49, 57, 61, 69, 53, 82, 48, -46, 60, 61, -20, 2, 52, 149, 59, -1, 55, 131, 57, -38, 33, 117, 46, 12, 51, 123, 66, -38, 107, 139, 59, -10, 48, 49, -39, -11, -6, 49, -3, -23, 54, 84, 59, -43, 77, 105, -22, 31, 43, 72, 52, -49, 42, 85, 51, 18, 48, 46, 47, 50, 65, 123, 37, 15, 35, 70, 82, 2, 38, 23, 52, 1, 28, 64, 11, 36, 63, 59, 48, -18, 57, 120, 46, 3, 113, 109, 84, 1, 70, 102, 11, 19, 74, 43, 10, -5, 44, 36, 59, 9, -6, 73, 75, -26, 6, 137, 28, 14, 36, 96, 63, -26, 99, 121, -5, -41, 120, 90, 37, 46, 76, 108, 80, 24, 56, 66, 51, -47, 17, 18, 44, -25, 5, 31, 54, 14, 5, 88, 26, 11, 57, 155, 65, -13, 93, 63, -33, -30, 65, 23, 27, 60, 48, 67, 16, 52, 76, 103, 64, 39, 21, 46, 55, -5, 48, 79, 42, -13, 10, 64, -48, -33, 99, 80, 6, 61, 36, 76, 6, 10, 54, 76, 49, 52, 52, 80, 17, 10, 102, 46, 77, 1, 73, 44, -10, 33, 100, 80, -3, -1, 38, 43, 38, 42, 102, 114, 26, -6, 31, 29, 119, 64, 23, 43, 63, 46, 58, 90, 42, 84, 34, 109, -5, 61, 49, 110, 1, 34, 27, 72, -36, 5, 92, 64, 5, 40, 83, 102, 32, 54, 27, 103, 55, 44, 78, 22, 34, 7]
4198GM7N2q5J0M0K2j28KJ41j1j49M4J05o0Pn0O3p7M3%M2n8j8L8Q7o0j4J7J6k0
4228E3k8l1L9J9%OK2k6n7L9J9Nj01P1O5k7n1M0rmk9RK2n5K9J1Q1n4%r3J00L3l8
4261F0j5kj2L7J6Q9q4m6J8k4l2J3M7l7k0J6K2K1L6j16M1P5o1n1L1nJ1NJ7MKMn
4294E5L0j4n5J15j8m4l5K1N4n3l1QQ2q6l9P9k6p5P9P0m6Q%m4qM5%o5J16p8q5N
4326c5J35o7k6P0K7m7k6P2k6m2J9j9jqKrN0n3jM0M6j1j06N0l4M8n5L2J4nm4Q8
4358G8K1p0J6N4j7p8K5M7J4p2K2j5M7l3J2k7%N1j60J44j8J0p3R0Nm4j7O3k8j5
4388C2pM5J1k7K2j0k2j7RM3m7j0J4K9L8k9o2J4l0k4J7N9J04r7o5N3K8p2M6J2O2
4419A19j08k5J57m7k6o9N7K7k9j2LlmM2p8J6J0RL3K6j16J2J10n8l0m7O1j5QK6
$$ y = [7, 54, 106, 21, 31, 71, 93, -35, -33, 108, 97, -52, -8, 97, 37, 44, -6, 57, -20, 23, 23, 65, 7, -11, 27, 114, 54, 40, 57, 73, 53, 25, -6, 33, 52, 52, 58, 80, 54, -3, 36, 55, 60, -41, 30, 95, 68, 17, 57, 48, 44, 15, 24, 46, -9, 20, 31, 112, 58, 58, -35, 65, 98, 60, 45, 43, 31, 68, 84, 173, 89, 43, 61, 37, 5, 18, 65, 28, 8, 24, 46, 67, 103, -13, 28, 103, 42, -9, 22, 17, 28, 33, 50, 54, 56, 60, 55, 85, 71, 16, 131, 113, 69, 34, 55, 109, 56, 25, 33, 115, 29, -10, 69, 43, -32, 47, 117, 71, 79, 79, 35, 27, 72, 72, 7, 123, 45, -40, -35, 100, 33, 7, 77, 104, 57, 31, 103, 77, 35, 54, 35, 34, 26, 28, 19, 69, 16, 15, 55, 101, 90, -16, 34, 0, 48, -7, 25, 39, 34, -10, 78, 99, 29, 45, 99, 82, 4, 29, 76, 90, 18, 40, 25, 72, 39, 51, 24, 24, 75, -85, 59, 41, 51, -22, 68, 73, 29, 12, 75, 47, 32, 25, 70, 81, 54, 76, 66, 44, 27, 36, 79, 32, 22, 36, 65, 103, 74, 12, 26, -4, -28, -11, 48, 152, 55, -10, 43, 71, -1, 45, 57, 119, 11, -14, 143, 96, 70, 1, 58, 85, 56, 44, 47, 44, 40, 82, 4, 20, 30, 39, 72, 98, -18, -6, 104, 46, 16, -31, 30, 15, 23, 49]
4449D9k0Rj7O0Q2j13%l7L0j4J6Nl0M1QJ2m9j1O0j02O8O6p5L6m9O2o3J3K2j1k1
4480B7N3%n6rJ8j3k5N4M1l9Ll4l1M8qJ6n7N4J4K9p5k3L5j6k2O7k1o6J9O4KJ5o2
4513BP5k7j4K7jPJ4nl2J0pqrM9m1q6R4J6q9K6L0K7m5QO9l7r6J14l3J4k1k6M8o
4547D7l7O0n7N1j0J1J9j5m1M8K0m1l4L8kM6r2nM8M3mj9P7j29K1K0j2j6K8KK4n2
4579C7l6k5J55p3l7L2O1j7k9o7J31m9m5J6O6o9m1N9L1n1k7O2o0J4pNK9L2q8K8
4609C7rM3p8K4K6oPNK3Onl9j5K7o7kJ02l2m7Q1m5%%M1l0o2K0R1o8K9poMK2l8k1
4645A1P5n4K3k1Q9K0o1j4J1l1o5Q9l6j8JL0M2l5J2qj8k1m4R6Jm1o6P3J6L2r6K0
4677A2K9J4q8N2ON9Nk1M0m0m3K0pn1O8j4L6k9pL8n4N9o7L4l5M3n2OM7mn3K5J3
$$ y = [49, 29, 38, 21, 81, 163, 50, 50, 13, 43, 29, 45, 50, 20, 61, 69, 81, 32, 21, 81, -21, 47, 113, 38, 74, 25, 87, 24, 37, 59, 48, 27, 80, 80, 24, 15, 33, 20, -5, 49, 90, 51, 54, 20, -11, 37, 29, 45, -12, 42, 56, 85, 10, -13, 22, 6, -16, 51, 30, -36, -17, 47, 49, 64, 2, 77, 50, 36, 63, 62, 69, 83, 78, 46, 56, 49, 41, 32, 81, 40, -46, 48, 64, -25, 1, 31, 58, 13, 21, 90, 53, -43, 71, 38, 52, 31, 5, 53, 47, 10, 70, 13, 64, 54, 65, 84, 69, 28, 76, 96, 55, 21, 59, 57, 103, 11, 6, 54, 97, 93, 74, 151, 22, 43, 63, 51, 35, 63, 65, 89, 37, 1, -24, 131, 58, 21, 53, 114, 97, 68, 1, 132, 83, 38, 54, 120, 51, 10, 69, 100, 49, 22, 84, 24, 38, 31, 36, 65, 97, 9, 37, 28, 71, -7, 17, 43, 37, 44, 49, 72, 78, 73, 34, 19, 46, -21, -23, 79, 47, 0, 81, 36, 36, 36, 77, 47, -15, 5, 96, 28, 57, 50, 44, 48, 70, 32, 11, 86, 32, 55, 34, 123, 143, 82, 68, 79, 48, -17, 72, 36, 18, 19, 49, 91, 56, 68, 60, 42, 21, -23, 73, 74, 33, -33, 40, 56, 88, -8, 12, 41, 55, -33, 19, 25, 84, 89, 68, 108, 68, 25, 45, 38, -13, 55, 41, 77, 48, 41, 79, 25, 84, 17, 51, 16, 59, 7, 13, 60, 56, 3, 28, 41]
4710D1m5L0qL2M0k6j7%Mm4J8M4j1j4k6M0k1M2m5O9k5l1pnlKpM6m3j0pQ1n2rJ11
4745A44r6kL6j5J8p2Q2l6qm8nO2K3k5j04O5N7jm4NN0rn0K9j4k7j8K6Q4n2q1R0
4777F4O8q6poM8Np3L8j5L4m2LK4j8L9j07M8MJ2KJ2l9J0L1j6Jm6O8jPj6J2k8pj5
4812HR3m1K1n4j4O8M6k8m1M2p7j2J19q0J1m6J00q6K8k7N2k7l6J7k2P9l5j0K6l3
4842D1j8L5M6j8q3R5m2k8JqN2j3M5n5qk0J4K9M0L1j07K6J6Jj14R7J0J0m0K1Kk
4874E6j8P2o0p%n%J4k8nO3m2jl0O6n1N4m9N3j9p4O3M9o4n3mQ5M2j35J01j5kl2
4907B4j8O3o2N1m6K6k6K0rM6l6MKN3K5q5k3Q1p0K6nl5O5n8J11p8RJ2m4M0j1m4
4939HK2J2J7Rm5pK5K7n0P9m0q6P4N5p1nj3K3j6K7K1m8NL4p3O2m2l1R0%Lo9L8N4
$$ y = [41, -4, 26, 18, 50, 90, 64, 47, 47, 51, 7, 25, 69, 58, 44, 18, 58, 37, 79, 34, 103, 78, 47, 40, 35, 32, 34, 27, 73, 30, 20, 13, 94, 42, 33, 144, 48, 46, 82, 67, 85, 13, 95, 59, 51, 3, -2, 60, 83, 58, -46, 19, 76, 75, 31, 36, 86, 77, 27, 56, 42, 15, -3, 23, 107, 55, -26, 64, 132, 46, 39, 33, 81, 86, 13, 51, 36, 70, 28, 31, 55, 37, 76, -31, 17, 21, 33, 35, 47, 8, 18, 49, 33, 34, -12, 56, 55, 62, 46, 58, 30, 23, 8, 101, 60, 81, 27, 13, 81, 127, 99, 58, 100, 23, 11, 130, 50, 61, 15, 115, 29, 57, 30, 82, 55, 19, 36, 14, 93, 58, 48, 74, 41, 23, 58, 104, 86, 3, 98, 56, 28, 29, 21, 73, 60, 105, 50, 42, 22, 36, 65, 105, 136, 29, 55, 71, 72, -42, 55, 65, 75, 35, 56, 58, 56, 38, 110, 50, 43, 43, 38, 38, 52, 24, 19, 82, 40, 39, 9, 75, 24, 78, 29, 82, 63, -11, 52, 101, 37, -16, -20, 65, 107, -28, 73, 58, 56, 24, 6, 69, 7, 58, 12, 38, 12, 32, 23, 69, 33, 37, 39, 92, 117, 32, 9, 90, 20, 46, 41, 6, 71, 13, 124, 46, 55, 67, 23, 63, 52, 8, 30, 42, 59, 68, 23, 16, 41, 68, 18, 97, 57, -29, 45, 100, 29, 24, 11, 34, 18, 45, 66, 18, 23, 57, -16, 46, 4, -27, 63, 63, 66, -3, 35, 89]
4973H9m2k4M3J6nn5L4J5qJmJ8k6L7p2nL5n6NM8oM1k2pK0l2KP3l4m5m6O9J9o7k1
5008a2P7M5q3L0N5l8k6MK8L1k4k0l0k1j0j7R7p6N6m4O3J1l6p6J08n9J4K0Lk7k6
5039A7J3L6m0J3K4K0Rr9M4O4o8K5q6J18r6MN6Qlm3N0J0k9j9L1L3no0K4K6o2N4
5071F9k8%kqK1K3l7K1k1J2j7nl6K8J1k4j3J05K2n8k2kk9J01l7l6o3L9m4P4m3O4
5103F5K%M1p6Q7m3j4n0M6j1K7m8NL5J8n5%K1KPq2R5m0MM6pp6J8Q5l0p3K0K0K6
5137F5k2pj5L6k5N5p6P5lno7R5n0L4Oo1L4m9M0k5L1k3Rm1K5oK5k2KL2m7K7l0J0
5171B7L1q5M3Km2P1%l0P4k5L7n8L7k7O7j14O7o9J5K7l4m5N5N0K9K6q7L0m5K9N2
5202A08p3L2p0R4lq8L5l4P4k2j7%%K8j9j8k2J4P0n1oJ1J2LK9m4o0O2J6n2J1k5
$$ y = [89, 47, 23, 66, 82, 77, 22, 56, 71, 63, 64, 60, 78, 52, 89, 17, 12, 47, -9, -4, 44, 38, 79, 57, 50, 70, 38, 40, 113, 79, 34, -12, 57, 76, 9, -12, 65, 110, 27, 57, 112, 74, 48, 52, 80, 111, 87, 67, 37, 16, 6, -11, 86, 10, 66, 22, 85, 96, 60, -16, 92, 33, 47, 67, 70, 43, 17, 30, 66, 26, 39, 63, 83, 92, -7, 37, 101, 33, 58, -28, 90, -6, -2, 54, 62, 59, 16, 66, 76, 47, 28, 59, 92, 87, 27, 51, 77, 15, 69, 41, 41, 39, 31, 52, 75, 38, 59, 38, 50, 33, 28, -8, 20, 31, 7, -6, 99, 121, 63, 41, 39, 10, 111, 74, 38, -25, 14, -30, 44, 1, 65, 67, 67, 108, 32, 119, 76, 62, 12, 58, 47, 74, 26, 31, 66, 84, 29, 29, 50, 52, 59, -23, 72, 32, 36, 82, 75, -1, 17, 102, 72, -1, 19, 39, 65, 43, 36, 21, 57, 32, 87, 11, 86, 83, 78, 11, 106, 56, 90, 96, 35, 69, 20, 60, 35, 66, 43, 52, 11, 36, 30, 55, 33, 35, 67, 20, 47, 17, 27, 58, -27, 16, 18, -24, 47, 47, 17, 91, 66, 103, 45, 82, 55, 122, 8, 75, 6, 21, 48, 14, -31, 24, 74, 103, 129, 42, 72, 27, 56, 108, 35, 67, -3, 91, 88, 0, 35, 1, 75, 53, 36, 36, 36, 64, 45, 27, 5, 19, 89, 38, 32, 43, 55, 58, 87, 43, -17, 45, 61, 9, 20, -5]
5234eM1l1M2POj2N1r4M9jL3n0j1L7J5o5O4kj5L4j8l6k2N4l7l2K1M9q6Q5K9j0p4
5267A6LP8q1k6K8N8j8nk4L9k8J2J3ol4j7N2kmk7N0k0K5k9j7j7M8J3n0K1l7L1M6
5300I1mn8nR1n2l9L2l4Oj9R2q4K6Rm0QN7lj8QJ6l5L0n7LN1k6klm0M9K2lK3n3M0
5336G9M4m4n3L0j3m0N4l6N4p9Nj0O0Jl6lJj1l4J02mm0L5j8l3L8n7O7K1m9j7L5
5368D9j9oL0Lj5j3NJ6l2o5O1R1p7k2l8O3KM6q5K9J9Nl3J0M8j9qPl1L2Qm0L4J2
5402F7k4K9j4j7K7Kk2k3PO1k8m4L3L8J1q8M8j3M9j13J4L0j2lK4J8K9q9P7lp6P5
5434G0k1LNn4RL6j2k1JO9KPL1j06P3n7jL2n4nN3j8l2j9P3K8K0p7k6K4J7N1n4j9
5468B8O1l3m0j9K2K3l6N8k8MPK8k4m1L6L6j00O3%M0l1lm0Q4n6PNQl0M3l2j6L2
$$ y = [-5, 36, 5, 47, 54, 60, 48, 99, 5, 54, 53, 86, 36, 25, 62, 77, 12, 76, 74, 59, 93, 75, 39, 17, 71, 34, 2, 23, 72, -14, 71, 100, 90, 16, 19, 97, 16, -10, 18, 76, 58, 53, 29, 68, 40, 52, 65, 59, 25, 8, 60, 58, 54, 27, 77, 57, 82, 53, 36, 19, 67, 80, 30, 51, 14, 45, 91, 87, 29, 24, 115, 63, 24, 56, 22, 28, 9, 101, 17, 43, 52, 12, 20, 77, 74, 56, 64, 80, 45, 75, 18, 21, 72, 46, 44, 41, 1, 50, 72, 69, 92, 39, 79, 123, 79, 26, 56, 43, 3, 57, 21, 75, -4, 1, -9, 51, 52, 16, 13, 14, 3, -31, 71, 67, 27, 62, 44, 11, 49, -8, 59, 80, 31, 14, 49, 30, 24, 54, 57, 42, 29, 34, 50, 18, -47, 14, 105, 28, 6, -32, 31, 33, 79, -6, 23, 42, 47, 14, 24, 72, 53, 45, 52, 21, 53, 61, 21, 55, 67, 43, 72, 58, 41, 68, 70, 48, 25, 32, 93, 65, 21, 54, 92, 103, 15, 63, 50, 99, -14, 0, 30, 18, 15, 39, 57, 86, -3, 74, 71, -5, 70, 49, 52, 57, 3, 12, 48, 36, 15, 16, 85, 87, 94, 125, 19, 92, 35, 34, 66, 12, 7, 60, 42, 10, -9, 64, 92, 112, 35, 9, 33, 50, 101, 47, 28, 89, 56, 16, -3, 19, 42, 6, 64, 36, 40, 47, 75, 51, 10, 46, 82, -18, 45, 45, 85, 54, 51, 11, 95, 39, 46, 51, 59, 29, 72, 40, 24, 56]
5501E6rn1P4K1n9oN2J1l4Pl1j3L1J9k7L2k8L1k6j4j2Q1m5kk5qM5J9j6q7R8rq3
5534hR6np2K4k3J8P5o3K6k9L4m7N0n6M6LJ3lk5j4lL0l9Jm7J13k8l4K1m1J9j6J3
5567B9L4J1J0p8O4oLl8MN5o7K8mk1l1L4Q7n6J7L8m7J1m8MJ4Km0M4j4j8N7k2Pm4
5601A9L7l5P0n5j3P4l5j1K5m7L9N2j29P9j6%l3J9J7p3J9L4O4m3m0N0j1mnoJ5j2
5633D5qQK1j5L5m2n4O5Nm5O1n9P3pRm3L2j3L5k5m9L6K2q8M2J3N4j30J1M8J2LJ8
5666G0l4K3k0j0M0o6Q1k8K6jMp9Q7r2L5J2l4O0n2QM9p4L3qNK0m9L0M7p8O1rK0
5699G7l4k4k3O3pk3Q9k3l4n0j0M9M3l8j7N0n1m3L6O0l4O0q5K8K8k3m8L3K9q6J1
5730CK4l2J7M7QJ6j07K0O6j01O1j3P6Nl0nK9j1l5komk1LN7j5m1L3Qo4O7o1M7Q5
$$ y = [56, 47, -4, 70, 91, 32, 26, 78, 89, 55, 62, 31, 18, 49, 68, 41, 73, 45, 76, 50, 36, 24, 105, 60, 58, 33, 25, 70, 89, 73, -14, 84, 75, -8, 88, 83, 11, 35, 12, 30, 105, 42, 68, 39, 73, 26, 76, 20, 66, 69, 82, 79, 54, 40, 37, 67, 28, 29, -18, 95, 67, 33, 54, 13, 32, 16, 29, 63, 74, 84, 6, 70, 64, 67, 29, 33, 88, 21, 49, 45, 24, -7, 27, 114, 58, 75, 113, 66, 77, 29, 33, 47, 49, 9, 53, 39, 21, 78, 56, 63, 19, 56, 21, 91, 36, 23, 97, 62, 51, 76, 29, 68, 120, -9, 70, 54, 54, 21, 40, 57, -16, 3, 37, 101, 58, 18, 68, 57, 53, 48, 42, 57, 45, 37, 45, 66, 51, 86, 44, -10, 55, 60, 15, 76, 17, 90, 83, 92, 49, 81, 68, 103, 78, 29, 65, 87, -1, 41, 54, 108, -22, -11, 37, 49, 52, 70, 36, 59, 39, 29, 69, 3, 84, 56, 82, 81, 85, 6, 93, 1, 36, 48, 14, 74, 22, 30, 79, 5, 38, 30, 35, 55, 6, 36, 83, 5, 66, 57, 77, 43, 19, -4, 59, 52, 29, 118, 95, 61, 11, 1, 50, 93, 55, 38, 88, 37, -6, 30, 90, 56, 116, 31, 59, 87, 64, 16, 49, 78, -8, 3, 27, -5, 12, 59, 67, 83, -24, -4, 62, -39, 22, 9, 85, 90, 60, 55, 84, 73, 38, 36, 30, 26, 5, 8, 65, 50, 9, 42, 50, -14, 53, -8, 39, 124]
5764A24q8k3K8k0L4n2kL7O2o8K6j3j8j4O4o8L7l6N9n3L5J7n2P8m8Kk2L5j8n0L6
5795B9K0pn8KJ02Nr4O7j3l1J7L0J4j04O4M4p1j6j7L4N0K9p2K4K8m2M6n5M4Jj5
5826E5M7k6j8J3mj4k9l5N6rL1m2L4j7k9P8m4j8L1j6K4J4p2J9N8j5l6J4lL1l7n6
5858a5M9kL0n9QM2k3J0K0Rk1j9K6L9j05R6J3k5pk7l2O2l2n6N2J6l9L7J7m1K4k6
5890B1K7K6m7k0M8j6Nl7K6L6p6P6n5N5n8m5J16o8L1j07J56m8k8QR6l9OrLk9j7
5921C7J8QJ5j4m9L1j8J6OLNk6PJ7k7J2K2o5L9%J7oM2p3K2N6j4n1jK4k5k2M8ll2
5956A9NpqP6n2K8k1K8m5O5n7K6ql1M2Mr6Q6k2J9nl5M4N8q0M4Mm5k1mL8NJo5R5
5991H5l0%k8j5L4%l9JRrP2kL4n7n1L6Ll5M5Mnk6K3K5j8p6O6L2l6M0q4P3l4l5M1
$$ y = [124, 36, 13, 41, 21, 55, 3, 1, 38, 100, 32, 58, 45, 27, 13, 77, 9, 46, 10, 69, 16, 51, 68, 16, 94, 46, 48, 26, 61, 43, -7, 29, 49, 42, -16, -14, 88, 93, -1, 66, 53, 22, 39, 69, 83, -21, 43, 87, 16, 0, -17, 17, 67, 96, 24, 48, 76, 34, 80, 25, 69, 70, 55, 102, 76, 58, 71, 67, 53, 24, -11, 45, 36, 67, 25, 59, 42, 13, 91, 47, 29, 60, 44, 68, 82, 10, 29, 87, 72, 36, 50, 47, 78, 41, -15, 34, 32, 62, 3, 11, 53, 30, 40, 60, 69, 48, 29, 55, 94, -11, 85, 98, 73, 66, 39, 7, 69, 37, -19, 33, 49, 10, 47, 64, 23, 47, 21, 48, 74, 27, 7, 55, 39, 44, 7, 33, 69, -7, 69, 14, 69, 11, -34, 82, 14, 45, -62, 94, 46, 18, 26, 122, 83, 89, 80, 83, 54, 37, 55, 63, 78, 64, 15, 46, 28, 44, 50, 53, 58, 32, 39, 56, 29, 41, 63, -2, 37, 37, 54, 48, 90, 17, 39, 95, 81, 30, 29, 53, 28, 6, 54, 51, 19, 24, 17, 9, 85, 33, 61, 40, 68, 23, 88, 31, 57, 49, 18, 60, 64, -32, 54, 32, 51, 46, 11, 55, 113, 33, 77, 81, 36, 15, 11, 49, 54, 55, -10, 85, 55, 55, 27, 12, 46, 46, 7, 8, 17, 8, 80, 78, 112, 55, 4, 40, 43, 8, 53, 57, 52, 26, 49, 74, 56, -20, 46, 78, 42, 82, -2, 71, 37, 2, 43]
6026D3L5m3mLL9l2m2J6N1K6j17J08lq1NJ8L3Ql7L4l5L0M9m0p8L4km3O6j8J1Nq
6059C1J6n7qJ44j0j18M2Rk7L9K4j0m3l6K8J8N9o2j9L1l4R%N1p0pM2J9M8m2k3l3
6091A1L8l5k8O1j1k9L8J3n9K3kK9l7M1k0L7n3oL4n6M8n0O0j0K7jJ1j1J0m0K3P0
6123A26n8n0P5j8n3lK0K0O3r2L6L0o2M4k8rJ6o7J21j00M7LL0n2l3J4K0j6J1oO3
6154I2J4m2k9L2mj7J2m9N4j6j2N0lq9kO8k8N5q3K7qJ5k9N4j8J1j0kL2j2k7QO1
6187A05q0k6O8Pp8J1N7n6O8q7K4KM4j3Pk6M3j9n4M2j9L1RK9m1N%Mo6L5RMM2J2
6221I3r2N6%M7p4MO3l7jJ4K1p2L8j2kl0P9l2k7j4O7%o2l4O0L3n6l4N2j7l3K4L4
6254E6j8J7K6p4M6n9J6MM4J1rp5R6m3jL3j4n1M4p9Q4qkOj7kM4J5%m3j9lj3lM2
$$ y = [43, 78, 35, 31, 34, 73, 41, -1, 15, 66, 92, -25, 83, 80, -1, 4, 22, 55, 63, 26, 60, 25, 55, 104, 64, -14, 20, 18, -25, 41, 23, 34, 39, 31, 47, -10, -18, 126, 116, -2, 40, 49, 22, 61, 85, 75, 32, -4, 24, 42, 101, 39, 20, 51, 17, 26, 26, 77, 7, 0, 42, 61, 109, 67, 44, 11, 49, 14, -14, 47, 36, 7, 45, 58, -1, 22, 20, 49, 12, 53, 33, 70, 17, 11, 45, -11, 37, -13, 47, 37, 64, 63, 74, 63, 73, 33, 56, 126, 68, 18, 93, 75, 22, 19, 39, 59, 122, 30, 66, 96, 34, 78, 50, 41, 57, -10, 111, 11, 58, 61, 91, 39, 6, 20, 40, 24, 35, 29, 92, 106, 64, 35, 67, 63, 46, 58, 9, 63, 47, 35, 85, 82, -7, -9, 59, 31, 86, 3, 30, 22, 37, 8, 62, 44, 55, 45, 43, 75, 63, 36, 44, 105, 25, -1, 67, 74, -4, 7, 64, 8, 76, -11, 13, 15, 59, 46, 53, 27, 70, 51, -3, 39, 20, 51, 60, 89, 48, 53, 53, 57, -9, 26, 35, 39, 81, 93, 1, 57, 57, 104, 30, 34, 97, 60, 59, 73, 94, 22, 60, 48, 46, 16, 95, 63, 36, 22, 89, 89, 27, -7, 53, 86, 30, -4, 48, 31, -2, 22, 56, 38, 55, 81, 7, 53, -6, 10, 14, 58, 69, 60, -15, 81, 38, 37, 70, 56, 5, 49, -30, 54, 46, 44, 50, 33, 31, 75, 90, 90, 47, 28, 25, 12, 9, 51]
6289E1K4kj5rL6m0nj0M1m4l3K7Rm1P8o4M9k8L5Mj3J9m1K4Mk4LRJ2o4j0P3K5k3
6323E7j4J3k8O1l7k0J06p7k3J5K3k2m1L9j3J1m2O3j0jnJ6pjn8O1Qm4RMpK5Lm1
6357B3L2J8n0K4M4n0l4J9O2j1q6N0N1k6PJ2o4K1ok0M5n8KM7k2K3k0kN9qn1kN3
6390H2p9L6LK0k2N1n3l1oM3PJ2l4J3j7K7k2lL8j2K1Kj3J2j6m0M7J7l3n4N2L7m2
6423D3O0j5m5k6P7p3Q7r2JJ5qR7j42O1O1q5JL2k5mJ5J4k3L1n7K7K0k4l4M0O1j4
6455G6Jn2lL7n0L4Rl5K7K0k6k8L7M3Lr4N8l0R1p8k5L0ok5k1L5P3l9o1Q2p9P3l9
6488C8mJ9m1pQQJ1J0oj5L1K1J1L3n9POl1rK6k1K3Lj03J35k5p8N5j1K4k6KkRl0
6523A2l5R4J1m2L3kqL4p8L9l3mO9k4m3m4Q9l6L2o3M1L0K6n4P1q5K4l6qK4L7l0
$$ y = [51, 75, 73, 58, 49, 85, 45, 40, 30, 71, 27, -6, 21, 30, -11, 67, 3, 52, 24, 59, 63, 50, 69, 28, 52, 56, 32, 35, 44, 56, -8, -18, 55, 80, 57, 43, 56, 28, 89, 52, 32, 138, 61, 38, 53, 76, 54, 13, 52, 39, 50, 8, 71, 61, 60, 55, 71, 64, 63, 5, 66, 74, 30, 39, 43, 36, 61, 64, 23, 55, 73, 23, 47, 91, 41, 7, 26, 88, 77, -9, 41, 92, 66, 73, 85, 21, 42, 36, 16, 61, 3, 5, 52, 30, 53, 33, 31, 90, 82, 31, 29, 82, 3, 39, 42, 62, 40, 91, 38, 7, 1, 44, 51, 63, 29, 42, 25, 52, 30, 27, 65, 53, 74, 76, 63, 75, 59, 19, 66, 83, 50, -4, 48, 85, 43, 103, 88, 43, 17, 94, 21, 108, 16, 17, 32, 24, 121, -21, 40, 101, 16, 17, 49, 24, 20, 35, 49, 26, 57, 0, 27, 47, 23, -11, 29, 90, 76, 77, 25, 22, 59, 9, 43, 52, 17, 44, 64, 38, 10, 47, 90, 93, -1, 57, 27, 118, 40, 15, 45, 39, 14, -7, 28, 101, 62, 1, 83, 4, 77, 38, 34, 53, 12, 5, 13, 21, 32, 42, 36, 21, 52, 73, 84, 117, 58, 65, 71, 40, 31, 57, 36, 59, 62, -41, 94, 69, -9, 46, 35, 59, 33, 35, 33, 42, 12, -23, 71, 82, 40, 73, 71, 63, 97, 19, 58, 25, 21, 90, 66, 23, -21, 68, 32, 64, 1, 42, 72, 98, 44, 115, 30, 54, 18, 10, 34, 71, 41]
6555D1j2OMlj0j4J11r1o8J22Pjj02M7J6j4kP3o4j2QO5o1N8q0P2r0KpP4j9m3M0
6588E3k5M8Kk5Ol1J6J9m6N1k6K7Mj6j6j7M0m9j6L9J0j7o5P9M5l9J0o4O5k0M4j07
6620b1M9K8j4j9K9l1K2J0J3l8PM0J5k0m4mQ9o4lO2k0Oo8RN0l1p9R0j8L8p8M6J4
6653F5l8l1QJ4j0prJ35o3Mm8N2Oq6L7J2L3l6O8lp9q0J34n4LJ1j0K3k7K9pPJ8l2
6687C9j3L3Pl3k4M2p0P1O1o9jl2k9K2K4K8J0J3m9j0M7j0lLo5J35j10j0J7K4k6
6718B2M2n5PKm4P7n7J5K0lM5k4j5j8M3K3n3K4j2M1m1M9l1%p1L4J4pj2K3jJK9n1
6752A6J5jpPM4p2M4M4n5Q0j06n5Q7m1OR8j8Mj10P9m6R0n7n4Q2o2nJ7P1r8NM5N5
6785A02k2k2l1N5j1q4M8L1l0k3KN2o9N0L2o4O4k6KL8n2l4J8M4Oo8L1N5Qo0j0K7
$$ y = [41, 29, 35, 39, 36, 26, 12, 123, 32, -36, 86, 93, 92, -10, 37, 53, 39, 37, 110, 46, 34, 42, 107, 46, 104, 24, 96, 6, 8, 1, 75, 56, 13, 53, 28, 76, 78, 53, 59, 28, 44, 63, 17, 68, 42, 69, 73, 57, 41, 24, 64, 15, -1, 38, 48, 31, -34, 45, 90, 51, 61, -3, 62, 42, 86, -21, 28, 56, 42, 23, 52, 21, 43, 53, 66, 28, 35, 75, 90, 70, 26, 22, 111, 47, 44, 106, 86, 92, 24, 33, 83, 52, -27, 63, 45, 83, 5, 51, 65, 27, -4, 4, 18, 8, 1, -8, 127, 64, 68, 20, 72, 78, -8, 29, 41, 74, 38, 106, 103, 24, -56, 78, 24, 27, 38, 28, 51, 24, 53, 46, 53, 71, 39, 26, 59, 66, 33, 9, 51, -19, 52, 113, 44, 43, 11, -18, 4, 28, 56, 66, 79, 30, 20, 67, 57, 54, 57, -8, 127, 17, 7, 24, 48, 22, 64, 9, 16, 18, -26, 51, -6, 9, 29, 26, 71, 47, 32, 14, 57, 80, 27, 51, 39, 80, 39, 88, 57, 57, -14, 20, 34, 27, 15, 38, 37, 38, 67, 16, 31, 30, 23, 30, 74, 2, 46, 90, 35, 115, 9, -46, 41, 0, 6, 104, 86, 90, -20, 59, 13, 103, 46, -8, 74, 12, 7, 24, 95, -3, 2, 47, 102, 80, 58, 27, 82, 71, -13, 35, 66, 36, 13, 15, 67, -2, 48, 80, 16, 80, 54, 56, 94, 42, 8, 26, 70, 76, 8, 39, 94, 102, 42, 32, 59]
6817E9Ol8M8m2Pn5J05r5O0L8l9L9l2m9M7j7nk3M3Nrj4J5pL5n0k9M9pJ0oqJ1K4
6851G6o9N4j8m3N8J0m6K9K4j3K0m9Qj0nojO6j6nJ8l8k8MN5Rl6k6P8Pm6l9K1jO0
6886A02p2L4J1m4k0KJ05j07O1j4l3L6n7R9j02J0J1O6%p6N8n8L3K2o2N3Ol8K0l
6916D3J4l7O9o0N2j1o6O1NMo2N8o1N5m0KO4k9q2Q0oj7M6K9l3j05K7P2pl5PK3j8
6949D2K1oj0j4l5J2R5k5r7O5l3L4jk4MM0k8m5R8o2M7k3j8m7J6K7K7j1K7l6l4R
6981A5K5K5m2N5pk3Q5q6l0j5k1J00m0MKo9P5l2M2l5L8m0L6k3K7l2lO0k1m8J1M8
7013H1p0J9N1Qn9j1O4n9J0klRnJ2noL2Lj8rroj3P9q8ljjK3rP2O6j10jK9l5Rk0
7051B4OOo0O8rrJ1M5m3L6Kj22J28n4l3L7O7l7m4O2k7j9j2o%K9k9K5j2J1m0M8n7
$$ y = [59, 65, 27, 75, 33, 40, -15, 90, -5, 55, 93, 54, 93, 61, 12, 59, 42, 37, 14, 57, 62, 53, 39, 54, 47, 82, 32, 3, 52, 45, 55, 49, 41, 52, 76, 7, 61, 43, 0, 58, 68, 22, 51, 75, 62, 82, 33, 41, 31, 26, 20, 19, 85, 69, 64, 82, 44, 16, 20, 75, 84, 48, 22, 100, 107, 61, 22, 43, 42, 102, 30, 64, 75, 31, 11, 13, 118, 11, 72, 58, 25, 61, 4, 103, 1, 11, 22, 88, 88, 12, 70, 12, 45, 67, 5, 58, 64, 26, 46, 43, 57, 20, 89, 29, 81, 70, 4, 65, 70, 74, 12, 70, 9, 64, 24, 26, 90, 61, -21, 59, 53, 36, 82, 111, 78, -27, 0, 72, 65, 30, 37, 60, 42, 63, 57, 47, 33, -2, 10, 105, 80, -17, 48, 15, 49, 48, 24, 28, 68, 40, -5, 93, 31, 78, 55, 37, -10, 6, 33, 60, 49, 76, 40, 6, 15, 40, 65, 23, 78, 71, 48, 133, 47, 17, 2, -19, 81, 41, 45, 47, -22, 53, 21, 63, 28, 66, 26, 62, 39, 66, 34, 31, 91, 70, 22, 33, 81, 11, 30, 81, 89, 30, 19, 83, 24, 34, 32, 29, 38, 33, 45, 40, 34, 66, 69, 51, 42, 33, 27, 14, 93, 5, 2, 1, 0, 23, 14, 86, 152, 42, 41, 70, 35, 44, 24, 30, 36, -24, 44, 35, 26, 37, 82, 39, 75, 77, -45, 83, 29, -4, 33, 100, 63, 19, 81, 54, 35, 23, 17, 17, 46, 17, 42, 30, 41, 1, 49, -8]
7084hrR1j13J33p3M9k6k1J1L8n2K2orl0N4j1l7J6J4K6m1N3M3q0J7k5N7j21L3K8
7115B3J6L9q0Q7k6nl8QL9k2mj0Pn4Q1%J5o1rR8p5K6N6q2M2k6k0KN2jn0R3m1o0
7149B0P2p5O4J3n5J1oL1k3J7m3Kj6%J3L0m7J1QO7p1L1J9k2o9K6M6o7M6M3ol1K5
7182F4J0pj5k3J9j8J3k6j2M6Qk2j0K8Mk3kj3J2N8k7l7L0m4P8n6J6k3K6PkrkNQ
7217F1m8Q4n2%K1J8j7m6N6m4J8lK0l1mrj3N4kj1k5M1J6k6nk1M1m6l4J7N4k8l1
7250EK5J4J9%mj2j8J4L6k8l2rL1N3o7K1L5Nl5nK2k3o8R8kj7o7N9j6M9n5j5O1j1
7284F3k1j4J7K0n8K1N4m4J6MRm1Nk9P5J4k5k9l0P6l5K4p0MJ4K5Rm0J2K1K2n6Q
7317B1M7j1K6Qk6j4M4kk9m6k4M2j1O4j8k2m3P8j4n8K4O9l4o4KP3j04J9NN5J6p0
$$ y = [-8, -17, 74, -39, 94, 21, 70, 44, 23, 34, 72, 20, 42, 36, 27, -3, 51, 40, 3, 19, 33, 59, 18, 71, 114, 34, 51, 26, 83, -38, -5, 23, 39, 78, -2, 85, 59, 54, 16, 24, 63, 41, 37, 27, 34, -20, 61, 61, 76, 15, 6, 104, 29, 55, 111, 29, 71, 45, 25, 27, 79, 78, 28, 121, 80, 20, 92, 17, 81, 94, 39, 50, 44, 75, 52, 69, 26, 28, 12, 12, 25, 55, 8, 19, 27, 94, 23, 54, 73, 51, -18, 8, 54, -13, 33, 76, 70, 39, 64, 74, 67, 52, 29, 48, 30, 43, 17, 5, 51, 59, 37, 27, 55, 59, 36, 34, 21, 33, 91, 64, 27, 57, 13, 91, 35, 51, 28, 54, 61, 59, 50, 48, 53, 61, 13, 97, 45, 45, 66, 84, 67, 21, 77, 33, 51, 48, 68, 37, 33, 24, 11, 65, 63, 52, 27, 68, 84, 58, 53, 32, 73, 27, -7, 10, 64, 36, 5, 30, 44, 63, 63, 59, 47, 29, 43, 79, 51, 19, 10, 41, 94, 27, 48, 83, 88, 53, 48, 70, 47, -21, 77, 75, 58, -9, 50, 34, 83, 28, 13, 74, 63, 42, 28, 45, 65, 7, 28, 82, 38, 54, 58, 67, 26, 31, 2, 77, 91, 66, 37, 7, 83, 48, 72, 2, 6, 20, 45, 54, 14, 26, 47, 69, 13, 21, 68, 57, 83, 91, 65, 51, 95, 93, 64, 18, -6, 36, 25, 89, 71, 49, 6, 84, 70, 12, 36, 105, 71, 7, 9, 82, -22, -3, 2, 57, 73, 3]
7349CO7l5J3l0J7M4o8M3j6l5O2m0K8K2Qr6M1K7m1l0M4O3Kk3k7j0K5o2N0k8K9o4
7381a7jR5J7m4N0m2k1K7K5kl7J8j6L4ol3J2k4j9L3M6j4kk8L7Jo5l6N8N8o1o5Q6
7414F4j4k3l7M9J6rO3m2jn8j0N3M3o2NJ4j4n5L1P1j4j2l7J04o2J3Nl1Jl1O5k9
7446E6k2M5n4M9j43J19k2lK3Pk5m5O6Qk3l1P7o1K3m1K9Lk7N5l6KMM2J8n2ON3n5
7479D5M6n6j7L0N1Lq1M7k6Ok2jP0o1n2O5k3JJ5kLrrO4j5n7O4jo0L6n8L6K7J3q7
7514a5L7J8j3K3o9L6O6m7J8N5j02J2l3P2om6k7j5Q3k3K3n6MO0K6m3lOJ0l7K4K3
7546F1l3J8llO0n6kK7k0l6l5J24p9L2j4j7KJ7k2lJ4k9J6j3K8L1k2J0n6N0n4O2
7578E5p1L6L6n4L5JP0n9K1k3k5K1j2K4j3Q2n6o3Q5n6j4pO5K6l2j3k0j9kP1p6J6
$$ y = [3, 70, 35, 48, 18, 35, 79, 11, 54, 38, 3, 65, 25, 53, 75, 83, -13, 28, 55, 14, -16, 28, 91, 93, 70, 43, 33, 58, -4, 46, 18, 47, -17, -18, 77, 94, 50, 100, 58, 37, 64, 89, 87, 50, 68, 52, 86, 80, 47, 59, 35, 16, 49, 95, 81, 79, 51, 88, 89, 24, -12, 46, 104, 43, -22, 64, 50, 27, -10, 39, 55, 46, 109, 67, 66, 8, -2, 51, 94, 32, 37, 51, 37, -18, 13, 84, 70, 58, 21, 125, 63, 76, 81, 50, 51, 20, 85, 56, 34, 79, 25, 74, -69, 50, 28, 25, 48, 55, 30, -15, 51, 59, 36, 5, 82, 21, 44, 3, 32, 35, 8, 63, 27, 29, 33, 75, 93, 41, 47, 100, 45, 91, 35, 18, 48, 99, 102, 21, 68, 42, 48, 26, 25, 95, 34, -18, 47, 24, 25, 40, 38, 41, 32, 23, 87, 72, 15, 79, 78, 18, 54, -4, 32, 59, 72, -15, 22, 40, 27, 50, -19, 17, 83, 36, 54, 109, 7, 19, -14, 58, 52, 6, -21, -36, 47, 24, 47, -9, -5, 55, 81, 38, 35, 41, 51, 14, 38, 61, 28, 46, 43, 40, 100, 44, 42, 69, 49, 13, -22, 102, 23, 55, 41, 24, 26, 43, 21, 18, 32, 3, 19, 6, 34, 65, 43, 53, -3, 47, -7, 55, -16, 20, 56, 2, 37, 38, 108, 49, 70, 47, 22, 43, 31, 55, 42, 124, 68, 5, 90, 34, 20, 13, 78, 104, 72, 59, 39, 20, 18, 89, 13, 29]
7610B9L4l0p3R2k5p7N7Q3n6klK7K8l5J3j8L1m2j1l8N8k5Rk5nP1J0k6M9n8l8R4
7642I8l4mp9Q5l1K6k3O7p1L0l1K4kj3lK2K0m6oJ2J8j0n6L4K2rJ0k0oj9O4ql4K5
7676E2k3l4K1M8j1J3o6j8K9P6l9K5m1K6%kKK2j0l6K2Ko2N5j6L9l5k1O6m0J4m0
7708A8k5O6M7q1J2J5n2k4O5O1q5J1J3J6L2p1N7%m3j4j7M6j8J2j4O2o1l5J9P9m3
7739D8J4l7k1N6j8K2jpmoL0J3o0mN5p7J9n0N7lL9l9jPK7k3J2n1P5k8j5kl0O0k7
7774C0M%K7j6K9k9j2l6P3m2m0N6M9q0N1k3m2P9m7%K7j1o3J14Nnm6j5k6Q4n5J1
7806E1j1L6Kjj9l2L1j0J7o5Q7Jp7J0M9k3m3L7o8Q9J1mn6J9O0l9j4L0m5J5K0m7
7838A1J0M6ml2K0qJ9m6j9LO3qo0P0pJ9p7O7K1Qk9l1K0J3nm3O1m3KM1k5rL7n2j0
$$ y = [29, 63, 33, -40, 52, 27, -50, 7, 90, 34, 32, 29, 56, 84, 49, 62, 44, 75, 33, 22, -16, 42, 17, 26, 1, -4, 67, 77, 51, 100, 42, 4, 98, 64, 60, -19, 66, 35, 61, 38, 105, 34, 64, 33, 57, 55, 42, 39, 61, 81, 35, 29, 41, 59, 49, -7, 27, 49, 40, 50, 30, 24, 5, 69, 61, 27, 52, 29, -5, 16, 64, 53, 66, 0, -18, 11, 87, 48, 73, 32, 58, 58, 56, 58, 80, 70, 34, 56, 58, -4, 51, 35, 74, 39, 18, 84, 44, 58, 18, -7, 59, 106, 25, 37, 52, 0, -24, 41, 102, 17, 28, 41, 57, 89, 18, 75, 75, 32, 18, 1, 47, 29, 41, 27, 89, 28, -7, 12, 91, 48, 62, 25, 4, 60, 42, 64, 63, 56, 52, 46, 76, 89, 29, 25, 80, 3, 22, -28, 29, 26, 65, 26, 25, 32, 59, 36, 48, -3, 72, 44, 29, 27, -3, 57, 30, 34, 34, 61, 45, 74, 45, 33, -3, 70, 28, -12, 44, 93, 13, 64, 41, -1, 78, 31, 31, 58, 47, -16, 98, 103, 98, 52, 37, 11, 95, 40, 51, 40, 76, 78, 77, 58, 26, 57, 47, 64, -1, 86, 87, 10, 20, 69, 46, 3, 40, -28, 61, 72, 68, 12, 31, 91, 52, 38, 68, 23, 38, 58, 11, 21, 67, 63, 31, 51, 43, 62, 16, -3, 0, 63, 55, -5, 65, 58, 77, 0, 67, 88, 96, 67, 36, 56, 69, 64, 21, 82, 39, 41, 82, 57, 48, 85, 33, 23]
7873B3Q2l3n1N8J0j4k6l5K5j6l4L9l4L9jK0O9o5j1%J0m3M2k0N0J1p3RN8n6RM4
7905H6j0p5LK0L2on2L2j4N7qn2K2q4K7K8j2K6K8k5nM4m1oM1l0n0O2PnM6q5O3K5
7939H9n2K3jk4k5M6Olp0R9l5M8q0jN1n2j7J0Q0n6L1n2R9r4M6n2J07o0J2m5K2o
7971D4j8N5%J9q1O0o8J4N9l8j6M2m6M9rMk9NL2K3r6N0Rj7nK2L5o9k9K6KN7pl6
8005D3L4k1L3o3O5p6M9m8J8K6K0k4N6m1l1lL1nj1KJ8k9j2M3k5k4QJ9j5P2n3OM7
8038A09p5jN1k4k9nN8n9m9Q5K3q6R1m6l3M3M5j9Kn6L1l8N9pr5M6P1m3j0M5k7l1
8070B6j2M4j2J2l9J4rP2j38Q8Lj1M7k9K7m1J4J0k3M6m6k9R6o5r1Q3PL8p8Lk3L7
8102B1N6m4L8rM4p9J7K4j8j0QJ1J8o7Q6lq3rM3K0m3O9j7p5J8N8m4l8P0k5J1l0
$$ y = [23, 105, 72, 21, 79, 89, 75, 49, 14, 39, 23, -11, 28, -6, 33, 32, 52, 121, 56, 45, 45, 55, 12, 54, 34, 84, 95, 22, 31, 89, 33, 42, 86, 76, 1, 4, 24, 56, 50, -2, 30, 16, 73, 65, 13, 35, -49, -22, 6, -6, 20, 48, 23, 18, 62, 21, 15, 56, 26, -24, 38, 45, 40, 86, 1, 64, 89, 37, 60, 59, 35, 10, 56, 62, 59, -11, 88, 53, 101, 21, 20, 71, 19, 2, 12, 92, 36, 67, 15, 114, 20, 66, 14, 121, 61, 73, 28, 50, 44, 26, 81, 81, 100, 19, 79, 11, 25, 84, 46, 30, 72, 26, 75, 66, 70, 41, 46, 78, 101, 5, 55, 64, 47, 42, 64, 99, 30, 1, 27, 29, 86, 79, 43, 77, 56, 89, 26, 91, 15, 64, 16, 34, 60, 80, 56, 112, 71, 40, 37, 68, 63, 52, 54, 72, 43, 31, 74, 49, 25, 33, 52, 37, 109, 56, 62, 109, 34, 33, 84, 60, 31, 26, 84, 25, -24, 61, 84, -2, 89, 43, 10, 53, 98, 79, 81, 25, 56, 18, 77, 70, -25, 21, 92, 49, 39, 84, 57, 26, 14, 58, 46, 58, 19, 33, 24, 96, -42, 46, 49, 38, 85, 56, 83, 42, 56, 66, 43, 89, 43, 14, 110, 45, -46, 37, 44, 82, 4, 7, -16, 21, 77, 33, 71, 62, 106, 27, 44, 68, 50, 40, 48, 59, 77, 10, 96, 93, 10, 1, 44, 64, 21, 90, 73, -2, 16, 74, 30, -8, 62, 37, 48, 18]
8134A8%kJ9L7L1q1oO3k5J9m3Oj2Qj3J2L4m3J8jk7N7n6P8r8J06k4J0l0L3j2Pm8
8167C5Ml8k9P2JJ1l8M4m9O1r4P7J3p0P8k7J0J5l8PK1Ln2O2
$$ y = [18, 18, 16, 35, 72, 103, 22, 16, 79, 54, 73, 30, 36, 24, 32, 19, 31, 65, 22, 40, 39, 12, 69, 13, 91, -7, 99, 75, 85, 55, 88, 76, 83, 35, 39, 1, -28, 44, 45, 56, 18, 62, 13, 74, -20, 57, 70, 0, 78, 51, 61, 76, 38, 45, 66, 69, 17, 79]
8191G9
$$ Imaginary data points
##PAGE= N=2
##DATA TABLE= (X++(I..I)), XYDATA
0@%%%%%%%%%%%%kJ1j8J8j8K1l0L6m5N4o3P3q2R9j17J36j55J79k06K36k71L07l45
35a82L84m30M84n43O07o76P49q32R23j022J131j248J376j514J669j841K029k237
53a173K466k722L013l341L716m153M662n268O008o932Q122r718J1985j5476K1585
68A2774l5258J18342m0562k25079K21031P7814j96620j4393J51654p8664n7191
79f6152Q8358j6011o4183R3906N048r9278O6680Q8504j26801l8663J42917k1150
91E3175j46392O0127J02537q1853n8617Q1746J9716n0218J3972L0385j7975l415
103C188J1621o562l290k502j5742P197J4738k0432j5561K3686J5051j1650r027
116i285N429J8981P408k7467q904L3420m838l8886J7901K4921l6552n735M4094
$$ y = [0, 0, 0, 0, 0, 0, 0, 0, 0, 0, 0, 0, 0, -2, 9, -9, 9, -9, 12, -18, 18, -27, 27, -36, 37, -45, 54, -63, 73, -82, 97, -109, 127, -144, 163, -182, 202, -228, 256, -287, 320, -356, 393, -439, 484, -538, 593, -655, 721, -793, 876, -965, 1064, -1173, 1293, -1429, 1584, -1757, 1959, -2194, 2468, -2800, 3208, -3724, 4398, -5320, 6665, -8811, 12774, -22484, 95858, 55296, -169783, 51248, 129062, -67558, -81951, 69703, -8961, -66152, 22206, 6195, -57988, 35918, 40966, -58312, 8368, 96872, -29929, -68592, 74325, 53175, -93217, -33090, 69447, -12406, -71023, 10723, 30439, -19779, -5807, 24578, 6603, 3188, 14809, 8247, 4957, 2455, -13287, -6090, 8648, -11784, -27345, -3659, 11392, -258, -9285, -3856, 15125, 22533, -4934, -13838, 19582, 14744, -24142, -6241, 18680, -17872, -23607, 20487]
129B0487j5769l3790L7385J7606l9293J0053K9859l1712r828L8184j7314l4071
141b8203L1959J2974l5540J1346K3074l0026K925L9217k8434l1254M8306J2722
153B9066n3655R180M1834k7290j9313L3232n983k5345K5338Q318l1156J1572K2430
166A8228k6405m464K9388j5585k0602K9311M834k9785J3013J9261k3869j384K4084
179A6025j7948j7451K7173L098k8482P590J9961j0680m652Q597m384M156J0422
192A3425j5978o769K3417n233k6974J4734J8420k4684q015K6318j635j8362J0265
205a071J1130o739K31n92o055R883J673k2142K974K2961j4896j9806K3341J2036
219A2928k3511K037K2797p070j2231J0226L269p085K11l851l463R022l862j4335
$$ y = [20487, 4718, -29072, 8313, 25919, -13374, -3321, 26538, -5174, -15002, 23182, 5868, -28203, 3756, 16730, -18810, -7464, 15610, -14416, -11491, 27726, -708, -31962, 16344, 29066, -24589, -15409, 26425, -865, -20178, 13054, 7071, -18274, 7064, 15382, -15774, -4202, 18228, -8177, -12641, 16747, 1162, -19440, 9871, 14705, -15080, -2067, 17194, -6675, -8059, 16025, -1923, -19374, 7799, 10897, -17585, -9995, 9966, -714, -5366, 3231, -1153, 3003, 13425, -2553, -9322, 14095, 8862, -18112, -3378, 15042, -9642, -17657, 8661, 7026, -11336, -1071, 10059, 3320, 3551, 2959, -3096, 6787, 8460, -13682, -10708, 12253, -2643, -22449, 892, 12928, -10583, -8546, 14251, 7181, -5050, 5176, 8445, 1360, 1571, -2280, -5743, 3279, -583, -14918]
233a4918J1913J3785j6389m508K1645j483j6668R216R301j2741l299O892n051
246b305l499L253m178J442Q463o956l402J6966o75j7588J1178J4895j9539q852
260a0797J9806l350j8493R056Q676j1277K005Q254p211L510J0223j2564l382K0247
274A4703q327k3131J8218J5225k8502o318K8977n312k2468J4517J3631j4366o1
287c214J1034o837j590Q557r055n382J4082m584j6590J2639J2135j8391m281K0419
301H942j658j5195O755R248o463l402K050j090J661n92o200L327O517p312k954
316f366J0633p88q685N967N542o848k33M167m452N60M652p615k134J1357l512
331B245j1205R972P505j3271K09J3172p540q586J1617Q42j2091N685O781j0463
$$ y = [-14918, -3005, 10780, -5609, -10117, 11528, 10045, -6623, 2593, 11894, -847, -4146, 2746, -2305, -5804, -2551, -6729, -5287, 3176, -3780, -7182, 9784, 9109, -8479, 2699, 17594, -1945, -10797, 9009, 5659, -12834, -3778, 4898, -6379, -4374, 3880, -3331, 179, 10402, -2162, -5544, 14703, 6376, -16755, 1463, 16688, -11814, -18132, 10845, 5533, -16935, -2418, 11213, -3153, -3214, 7820, 983, -607, 7950, -1105, -6487, 7595, 3011, -13579, -940, 11195, -7196, -11477, 8942, 7284, -7911, -1156, 8092, 1629, -1773, 277, -813, 848, 256, -5944, -2617, 3900, -3412, -6366, 4267, 3479, -5206, 761, 6303, -545, -778, 3389, -1063, -503, 4149, -3466, -5600, 5757, 2245, -8960, 1012, 8517, -4754, -4545, 8627, 1087, -7499, 4118, 4960, -7131, -1446, 5335, -5128]
345e128O81J0000p794m817J2727j517j1727Q535P332j1630l86J0431o284o162
359e739R190o10q418N624M206p520J773N896o020q62P314m389n332P637J16q183
375e317M260M614p213M80O672m811k425P367k396n229P396O37r051N305O830j0559
391c440k185J1951m141j0057R071N016j0815J565R172o461m250Q699k005p333
405e213O593K360r346L114P922q096m145J1037l84j0335N399P994p552l867P815
420C296M65o300J424L413k105j308R67l87O49J068j925n22K997J24l565NL724
437B020l67m584L36N159j207o006K479O289l950n223N771L755n958j283N481r20
453A792l309J859L82j302K144q96l663L865L385p096j270Q745j922q946N236O943
$$ y = [-5128, -4447, 5553, -2241, -7058, 5669, 4152, -7575, 960, 8292, -3338, -3724, 6707, 423, -5739, 3451, 2841, -5577, 47, 4253, -3267, -1494, 4402, -1618, -2480, 4834, 445, -4887, 2750, 2866, -5317, -1057, 3557, -3656, -3176, 3496, -1315, -3740, 3627, 1231, -3998, 3398, 4035, -5016, 289, 7119, -3440, -5625, 6326, 2185, -7872, 1199, 6215, -4600, -3035, 6137, -324, -4574, 4125, 2120, -5213, 1380, 3740, -5606, -2492, 5430, -2666, -6811, 4226, 3842, -6493, -1094, 6900, -652, -4519, 3296, 3761, -2539, -1115, 2298, 193, -1115, -148, -535, 114, 1182, -743, -1265, 1732, 1856, -1709, -1704, 2020, 1653, -2931, -2595, 2564, 1357, -4649, -2170, 4119, 169, -5054, 717, 4472, -1486, -2769, 2712, 1792, -1517, 342, 724, -578, 1566, 670, -2993, 872, 4257, -2839, -4109, 4636, 2714, -6232, -996, 5947]
469E947p525l564P736j12n972K757K895l713P47K601l552J81M655l383l874O308
485B132J919p498J361P497l894n808N529L206o128r48M887j658l400K429J035
500F61k506J041J951k200j1L050j536k637L255J348m690n0M747j987m484L665
516c83L442m408j255N313j47m308K281L098l484j650L229j030l051K012P21l055
532b675J576K758l473o49N536j339n179M095L999n998k056N942j080n566K839
547a270L397l797n78L979q89j835K796K88k611J621J516l572m12L100j959l284
563c510K797K124l499m30L942j40k830J475K174j520j368R77K98q15n35k09M58
580f11Q18q03o65J790J228j514o61J998N36k046p20J338J15j783o69J245M92j173
$$ y = [5947, -1578, -5142, 2594, 2482, -3490, -733, 2162, -1551, -804, 1797, -1755, -1574, 3081, -302, -4176, 2132, 4051, -3447, -2086, 5411, 1517, -4291, 1238, 4444, -1684, -2632, 2255, 597, -2803, -374, 661, -1845, -804, 1147, -1053, -1064, 1986, 450, -2187, 1068, 2416, -2274, -2324, 2423, 436, -4048, -383, 3059, -1349, -2604, 2709, 2562, -1746, 535, 3633, 149, -1501, 1728, 698, -2353, -341, 380, -2675, -1099, 1659, -1814, -2463, 3073, 1734, -3445, 650, 4649, -1349, -3405, 2537, 1457, -4109, -1270, 2127, -1670, -2248, 1731, 842, -993, 1803, 2091, -520, 1101, 2617, -955, -1367, 1733, -226, -3510, -713, 1411, -2088, -2518, 1424, 1284, -1546, -71, 2103, 583, -785, 192, 490, -325, -860, -1069, -611, 207, -596, -1261, 529, 1757, 243, -418, 1580, 2116, 70, -650, 688, 803, -980, -1649, -404, 88, -1085]
598a085l74J309O59p27l83R23P09p65r50O77Q92j279j256J565J055j999m45K628
616A154K21k241P17K044r85j418R04K96o58P0p97m79J680q1k730J071L334k112
634a0k954L310K331l908r98L876m44k984J425J561j790J73J345j551o0K428j333
651D17k167K795J098l502K49L359j877k686K951J058l633L85L304j764k566K510
667f9J563k512n19K209j77j125O17J99l99Q68q8j624Q94K089j781k121K534J801
685B359l071j251L252N46l079K1K465n67j732O54P07n58j84M2l24L97M51p44j00
704g16J190j58r86R17O96j205o3J325o29j232R89R40j183p54J110N64q14n37L83
723a63Q70k13j441R5J833n10k162O43K155j048j829J218J466q72j000P01Q10K5
$$ y = [-1085, -1459, -150, 509, -218, -601, 322, 1031, 266, -684, -7, 885, -394, -1650, -85, 970, -1029, -1474, 1154, 1375, -866, -149, 1895, 910, -508, 396, 692, 34, 104, -693, -1172, 508, 427, -2303, -1232, 2102, -10, -2964, 346, 2677, -1231, -2229, 1647, 1203, -1781, -356, 1205, -585, -412, 933, -618, -678, 1750, 417, -1750, 1045, 2143, -1359, -1110, 2249, 372, -2314, 637, 1695, -1938, -1553, 1751, -13, -2579, -69, 1494, -1018, -1537, 672, 495, -630, -13, 186, -213, 655, 567, -1057, -163, 1926, 145, -1976, 558, 2359, -712, -1963, 1289, 1835, -1244, -1223, 1242, 675, -1057, -403, 304, -254, -438, -396, -720, -323, 128, -616, -716, 474, 316, -670, 247, 943, -262, -325, 1000, 371, -861, 128, 1068, -115, -869, 241, 805, -9, -546, -163, 707, 494, -947, -852, 981, 471, -1691, -1048, 1107, 59, -1770, -552, 914, 42, -958, -257, 553, 578]
741E78o50m60Q28R01j215j007J538Q25j947m13K059j11k017O67J568j180r72J125
759A17M06j227Q1O81l68l01M14j45m0N25k81m51Q27N34j182j38J617l99j676R02
779a04J629j447j355J775P36j932k67J749j83j312K48P26j60l97l63J93P33j88
797H1j264N42J514p01j691J199J777j356j425J439J368j302j225J112J153q71
813C50j122N95J160m94j352L74J361n07j356M45J090n31r06M73O47m87k35K50
831b45J18p8Q5o7J27J79j79q7M90mp07N02Q32r09r40J414P94j906o65K175K76
852A205k449Q1K220m90j839N84J164m90m92O8n1O35L34j404j95K227k07k435R41
871e93K419j528j864J977J109j950k41J560m75r61P74K37q62L09M15o80L3M63
$$ y = [578, -72, -532, 296, 1197, -18, -1025, 513, 1338, -609, -1022, 1037, 926, -1091, -424, 1144, -36, -1008, 117, 523, -704, -623, 58, -310, -611, -197, -342, -382, 143, -138, -589, 238, 772, -410, -548, 1069, 670, -1006, -104, 1525, 78, -1277, 498, 1234, -698, -965, 784, 601, -711, -463, 263, 103, -294, -657, -464, 269, 81, -1183, -641, 873, 172, -1519, -320, 1457, 101, -1324, 115, 1483, 181, -1044, 68, 1221, 350, -772, -177, 983, 489, -863, -489, 872, 365, -991, -546, 544, 13, -893, -420, 227, -260, -495, -245, -127, -205, -120, -187, -60, 119, -60, -147, 343, 339, -368, 134, 966, 57, -883, 531, 1325, -581, -1246, 929, 1205, -1244, -1163, 1057, 567, -1272, -688, 476, -14, -506, -438, -489, 146, 480, -924, -1119, 1108, 901, -1534, -593, 1826, 298, -1566, 411, 1520, -430, -671, 889, 414, -547, 227, 464, -398, -89, 326, -354, -321, 142]
889A42n08j84Q19m95q38J111O27j532k13J857l5j836M14J737n61j347M86J178
907H22k52q27j56P60N08r25p49R64Q77j118j100J177J030j355j002J358P90j331
925e29p33J400M99j252k70J244N4r04Q2P26j0l72l5K20L53j46p48L78R74o77j108
946h54J005R42j407q17J511L79j546j22J303j65r94J67O87j23l24NK22K64j05
965B8m44L05O17l95n10P05M11r46j52J077j24j051K43R54m44r88M64Q92n70r18
985h46M06R35m10r15J85J019o0j191J42J249o0j259M1J441K1j308l6J339P7j152
1005c82o0R31J88r03l30Q77L51r08m73R70L29j107j77R71j02j066M44Q56n50o79
1025h20O95M90o76k46O41K59l15k58N7N62K67r85k19J395J21j830K11J900n90
$$ y = [142, -366, -550, 269, -226, -1064, 47, 674, -858, -1071, 786, 751, -1085, -671, 1066, 505, -842, -356, 822, 570, -257, -413, 347, 855, -70, -819, 145, 1022, -96, -1196, -19, 1011, -344, -1346, 12, 802, -529, -1262, 138, 637, -615, -885, 359, 413, -491, -409, 317, 307, -65, -100, 120, 473, 327, -421, -43, 931, 254, -854, 151, 1093, -314, -1131, 380, 759, -787, -909, 394, 229, -765, -598, 89, -34, -358, -353, -131, 133, 28, -416, -111, 506, 111, -399, 306, 717, -229, -381, 696, 572, -479, -236, 718, 274, -714, -250, 642, 72, -846, -440, 495, 85, -830, -645, 374, 314, -877, -735, 514, 454, -805, -764, 677, 698, -610, -646, 693, 770, -382, -442, 489, 677, -226, -556, 321, 672, -236, -709, 261, 590, -517, -694, 277, 175, -891, -447, 409, -141, -820, -125, 365, -311, -557, 84, 343, 28, -230, -173, 389, 656, -329, -548, 847, 968, -862, -651, 1249, 659]
1044F59j903Q44J513j058j249R22Q96p92o41M06N59q7m39l26O48N82q09o26J161
1063B60N92j223m22J403K02j335J37J148l06r48L96P38m50p86N95N72o40o50O70
1082d7N47p94m80O80M65p50k75M70L97k76m47J86P46j1r62J37J285k31j553N92
1102c21J605q74j490J063J307j295j020J216O96j146m37P02K55l71m57Q1O09n
1120A18q02M9R72lj101K81J213l33j156M85J233n49j205O50J111o99r73O98R43
1139I32q37q38Q32O79q68n95O73M73p07m18N55K57l18l67J22O38m3o54J6R84n9
1160D57j143L50J245n28j278P87J216r96r24J026P19j059m95R13L16q72l01O26
1178E9R4m41j78K88J60L7m91n6Q21J00j083J61J203l73j174O49J169r22q76J008
$$ y = [659, -1244, -400, 1113, 55, -1194, -272, 624, -168, -809, -403, 156, 69, -370, -696, -48, 534, -275, -901, 260, 852, -371, -793, 610, 812, -523, -386, 762, 456, -492, -96, 642, 192, -594, 1, 573, -67, -717, -47, 500, -294, -774, -94, 371, -379, -654, -184, 213, -63, -510, -324, 422, 411, -551, -414, 871, 640, -913, -321, 1284, 410, -1080, -17, 1290, -5, -1025, 191, 887, -259, -696, 6, 261, -110, -567, -486, 123, 118, -684, -635, 337, 334, -767, -486, 727, 394, -762, -277, 956, 407, -798, -148, 963, 264, -709, -11, 932, 95, -743, 89, 768, -100, -695, -22, 451, -256, -674, -119, 138, -180, -547, -425, 213, 170, -484, -468, 516, 457, -686, -336, 909, 381, -897, -110, 1106, 110, -814, 212, 931, -128, -623, 290, 606, -266, -567, 59, 153, -288, -466, -178, -18, 19, -472, -528, 293, 393, -690, -529, 674, 301, -873, -224, 945, 23, -853, 155]
1198A55O77j020k72J013R2p17j44N37j14l85k29J85K72j91m46J40O86j72o79L68
1218b44Q07m91p28N42O17o59n39O42N29p52l34R06K57o07j52O47K60o58j62M50
1238C31o5m92k09K22J48l09j84L13L18j22l30L77N51m94n20N25L39p29l77P41
1258C4K46p49q8Q43J28n24J65O97k06n34J15K40k74l92k0N6l9r5j09K43M20j64
1280gm10M64N45o32n56Q54K01j082j51J073k02r40O19Q44m97m05P27K75n78l0
1300A12K24k08j85m5k53Q4K64l20l81O25M47p85l2R18j55r02L73P66o27o47N63
1321a64M68n12l44O10M08m16l24N49L32n12l86M12K17m18k99K80K27k09k48J36
1341a93M77k32o20K64O77m58q19N33R27p27p85Q49R31q10o71R68N77q94n14Q01
$$ y = [155, 832, -188, -460, 553, 645, -72, -216, 321, 207, -178, -407, -222, 50, -141, -587, -447, 239, 67, -612, -244, 563, 72, -656, -114, 503, -156, -695, -53, 476, -276, -610, 296, 553, -54, -206, 441, 701, 43, -119, 331, 266, -226, -435, -213, -65, -374, -558, -245, 73, -49, -379, -2, 549, 55, -465, 60, 399, -330, -707, 34, 280, -469, -557, 286, 414, -110, 55, 752, 546, 12, 127, 367, 93, -299, -319, -263, -302, -397, -506, -263, 157, -7, -417, 47, 592, -40, -596, 258, 459, -623, -774, 299, 97, -843, -224, 620, 123, -282, 445, 720, 142, 112, 336, 128, -57, -102, -355, -271, -7, -327, -708, -83, 364, -421, -453, 465, 310, -592, -219, 547, -80, -727, -164, 304, -208, -552, 58, 466, 50, -274, 275, 607, 95, -291, 121, 338, -80, -379, -99, 128, -81, -329, -193, 284, 52, -568, -304, 373, -85, -904, -371, 556, -171, -956, -107, 824, 14, -657, 311, 888, -6, -520, 281]
1361B81K62p29m22N48L95m48m54N30O42l44o96L69P91l86j096J37J050n20j177
1380a267N07J086n44p25R57Q39q06l05J000J79r56k13N54k0o27m18L36O73k09
1399D1q67N30J327m10j287Q25J189j239j148R92N86j392n82J011N71o66l97P98
1417a18R24j16r71K83J255k73j575J7J304o23j317N71R39n52n70Q83O64n06k60
1436d1N34L43o87o48L27L36o99p16O37O10n58l04R12O59o19k89Q92M05r36o65
1456e07P94N92j290j041J259J091j264j150J612J406j361j108J366R60j288r44
1472h73O38O27o69q60M27R38k66r19M79J349l11j205N46J295o30j311N16J066
1490H37o95j035O51P39o26m61P94K76p31r1P72K4q69p9P12P7p83l71O99N64n25
$$ y = [281, 543, -186, -608, -60, 335, -113, -567, -37, 605, 261, -435, -66, 725, 339, -757, -620, 430, -90, -1267, -760, 326, -218, -943, 14, 853, 47, -258, 742, 921, -35, -248, 306, 286, -341, -759, -423, 250, 41, -826, -296, 1031, 621, -666, 159, 1348, 109, -1039, -47, 539, -853, -1435, -424, 147, -519, -916, -118, 806, 690, -281, 2, 1257, 984, -591, -574, 730, 107, -1210, -639, 300, -252, -822, 61, 725, 219, -41, 493, 836, 149, -499, -172, 164, -535, -1251, -614, -4, -562, -866, 46, 705, 86, -203, 689, 1094, 158, -507, 287, 879, -411, -1452, -193, 898, -366, -1516, 96, 1502, 141, -967, 399, 1359, 71, -873, -235, 392, -277, -1137, -710, 228, -38, -957, -478, 871, 560, -645, -99, 1196, 566, -745, -229, 837, 142, -893, -242, 497, -129, -590, 204, 480, -251, -342, 430, 454, -415, -494, 218, 295, -488, -859, -160, 404, -121]
1511a21q25O54J127n66j338R38J297r98j254J169J178j333r34J292P25j106o50
1528g45P93O00n02o43K9O83J22r08l27J121L16j060j57J088R4j063O2R42l70p27
1548f52N01N22n60l02O88L16n41j74N78J28m68j06K02P5k80k88J19K21r7n02K42
1569c78O71j41q48N14R02n38r80O29Q73p42q79O85P55n88n23N31M69l41k14K60
1589A17L86k45k09LJ05Mm84o0K91N3m87L7O47n5o40L07P78m35o49N41N51q64l39
1612f47Q06J05q24R9P79j66m00L03K43n2Kk05r6L12Qp21M9O87l28q51N98P89q12
1635c22l60Q60K39p84Q0O65k10n71K53K51k00j85L7K14K23k04j38L21L09m19j59
1656a00M40M3n70j47L68m8m62rL81O5k96l1M46J82l74j79N65Nn85j06N48j62m37
$$ y = [-121, -946, -292, 835, 269, -1069, -131, 1166, 168, -1086, 83, 1261, -72, -1006, 286, 1011, -95, -745, 48, 648, 146, -497, -468, 215, 337, -571, -898, 223, 539, -521, -678, 410, 504, -559, -497, 445, 75, -652, -151, 371, -189, -491, 197, 513, -28, -202, 376, 504, 36, -70, 132, 207, -73, -361, -242, -21, -118, -620, -378, 293, 152, -696, -182, 720, 182, -798, -169, 704, -38, -917, -232, 523, -65, -588, -57, 412, 71, -143, 117, 503, 258, 49, 52, 157, 161, -323, -383, -92, -39, -526, -489, 158, 103, -537, -230, 548, 113, -536, 5, 556, -308, -647, 159, 264, -560, -461, 318, 152, -248, 55, 298, 246, 248, 43, -53, 259, 267, -454, -405, 282, -46, -897, -299, 490, -322, -682, 178, 417, -367, -287, 378, 168, -403, -150, 101, -99, -284, -247, -33, 190, -14, -152, 169, 478, 59, -100, 340, 383, -187, -334, 34, -14, -476, -485, -104, -39, -335, -366, 80, 262, -112, -291, 274, 279, -306, -412, 136, -26, -463]
1679d63K04M39k81n3K89J32r3m0J03lk8k86j32J39Q6m50j32M66On23L89O01l05
1702F5m45N80L17o06l56M70J1m40q0L54Q7k26J01K11K30P4j33q9L62No62j51N95
1725B74k61r52L68Q40n45n78P67N92o01j60O35N7m34p8N2j02J3k25k93N41K14
1746A24n09NR82l6q12M47P15o30o61N02K88p72l04L21J78k23k36L28M87o2m01
1767b69K43P30m02p91M14N20o82m87M11M18k85l63L41N72P2n77K4Q79j56j013
1787d01J78R31n94j120N95P63o83o12P93M15m28k30L84K75j27k16j24L99R3o70
1807c79j80Q25M9r40J73J110l97q70N75Q08n59o70N83N16p61l83N16K43m73k95
1827e09L68K91k69l17J74L65M4m88N3O66n5q07K21R29m07q56L40R39p83o98Q26
$$ y = [-463, -259, 180, -101, -154, 135, 267, 174, 134, 237, 234, 206, -80, -212, -73, 13, -437, -569, -103, -97, -620, -231, 370, 65, -380, 200, 517, -89, -445, 25, 36, -404, -484, -130, -43, -269, -168, 43, 273, 347, 214, 125, 487, 492, -170, -321, 274, 13, -939, -571, 269, -276, -854, -87, 505, -96, -256, 379, 436, 2, -76, -24, -126, -113, -338, -631, -90, 124, -385, -380, 602, 566, -246, 201, 916, 286, -375, 127, 415, -357, -661, -340, -162, -385, -621, -293, 194, 132, -269, -26, 704, 302, -489, -75, 445, -237, -724, -313, 105, -180, -543, -202, 370, 442, -135, -111, 768, 612, -401, -223, 708, 114, -1006, -411, 352, -331, -943, -150, 265, -163, -393, -9, 266, 139, -77, -201, 198, 291, -379, -559, 266, 315, -625, -452, 658, 261, -609, -34, 774, 215, -455, 128, 644, -117, -500, 16, 259, -214, -509, -141, 150, -119, -436, -262, 103, 147, -341, -288, 378, 323, -484, -263, 666, 259, -597, -257, 682, -101, -799, 27]
1848B7N47p64k98O78K25m15j73K37K26j85l50j6L53p2p24J00O91k04o74N59P24
1869D92l67m88O05M33m43n02L99J72l11n69L17L84k91m26M21O26l40m29O24L49
1889F56m95l94L74O7n14l28J70K76j20l12J73O32l2m72L58Q09m43p03M71M92p59
1910i4n84O32K46o80j47O02J26k02K1K02K67l2m35J9L82j93p68N1O70m02n76N37
1932c58O03m50k92Q05L55n29j47M53m8l91k33J25M6r4k72R2M00o0l98L15O85m71
1954A36m39N32L18p12l59N62j3o22M2M17j9j55K34O1K12J71l55m1N25j30p94K61
1976a68P19p50n85Q65L17q81K1Q27j70o21N20K58m61P6J01k84Q4K33n28j78P99
1997A94j13q51O59P86q85l60J101N3r86K22Q33n19n49N10J04m10N1J52k99K89
$$ y = [27, 574, -190, -488, 190, 415, 0, -173, 64, 290, 105, -245, -261, 92, 20, -704, -604, 87, -117, -791, -232, 492, 125, -363, 242, 675, 232, -270, 129, 301, -10, -579, -262, 122, -169, -595, -174, 452, 112, -317, 307, 656, 161, -233, 141, 208, -306, -634, -464, -188, -308, -620, -447, 185, 153, -319, 39, 848, 405, -298, 173, 665, -94, -678, -46, 200, -480, -627, -25, 101, -101, -80, 122, 389, 357, -78, -59, 323, 130, -638, -587, 83, -319, -895, -358, 245, -205, -497, 308, 663, 134, -13, 440, 392, 1, -232, -107, -61, -155, -427, -335, 65, 5, -393, -78, 607, 136, -303, 229, 547, -165, -524, 38, 25, -597, -555, -138, -157, -312, -78, -17, 195, 366, 11, -30, 495, 365, -429, -168, 551, -199, -784, 81, 398, -483, -462, 365, 195, -426, 94, 352, -109, -33, 68, -216, -132, 101, -427, -605, 194, 81, -770, -111, 675, -210, -570, 531, 584, -402, -180, 653, 134, -415, 95, 199, -211, -160, -8, -307, -18]
2017a8J34n35Q7P77m01p52P78N90r63l78J015Kj013K25P66m27m08N36J81k62J36
2038G0R8k00K57M3m17k1O92m99p10O71M72r38k66J053j0r30K95Q59n09m25M43
2059B8J68l22m9P9j02K33q5m45L36N74m99m74R25K79q75l5Q47k45q27L22M87m76
2081a56j96K16j5L0J8k12K05M36m01l73N63L21p20j77Q09j70p68L96M26k98k03
2102b69L05K4KQ6j33j9L89l06n02N08L47p99j68Q30j53q06L83O45m26m11N74Q1
2124A82l53P7P6j08J01P0l90J28N28l74m41O49L82p72j79R62j55q83L78O85n78
2145a5m92M97J93n94J18K70j60L4J93k30k0M08j44m82M38M99p23l63Q73O7r28
2166e61K17Q79l94p60O67M04n52j10M21k4l23j8M1O1J48k15l81M44K99n71j16
$$ y = [-18, 116, -419, -332, 445, 44, -708, 70, 660, -303, -681, 334, 336, -677, -452, 314, -113, -521, 15, 196, -66, 70, 168, -32, 225, 268, -149, -170, 522, 23, -687, -16, 456, -482, -748, 305, 295, -635, -340, 519, 10, -415, 28, 196, -126, -175, -96, -198, 35, -50, -495, -159, 415, -84, -558, 367, 646, -229, -264, 583, 338, -489, -167, 320, -156, -352, -136, -151, -121, -103, -315, -110, 326, -75, -448, 115, 436, -284, -461, 348, 178, -590, -194, 232, -66, -269, 36, 60, 62, 148, 15, -4, 385, 79, -423, 85, 432, -367, -535, 295, 142, -664, -281, 364, -62, -473, 101, 182, -171, -94, -18, -126, -25, 45, -345, -217, 311, -63, -504, 145, 527, -245, -424, 538, 383, -500, -122, 563, -15, -507, -10, 183, -411, -293, -23, -183, -149, 44, -186, -206, 202, 58, -424, 14, 513, -210, -573, 300, 367, -561, -344, 535, 141, -619, 48, 452, -100, -210, 211, 187, -136, -154, -113, -52, 96, -119, -500, -56, 243, -328, -444]
2187d44P05n3p42K94O61l59n19L89L97l14l02K47K82j70k85J02L59r0m66J42N51
2208C85k79m88K01M92l68l80L07K56k25l25K48K66o0m03J66L88k1n14J35N06j98
2229H9m65K38N43l68l58L54L38l55k74K99K75m07j89L12J28k55k15K43O7j22j50
2250b72N3K75ll76M5M76j27m37K39M54l56l74M31K97m08j74M10M4k65L9J45p4
2272D2L2j04j05J47P3k66j49L84j6l95J09M35k76k81L46K04l37p6L54r3j51N3
2294g0R0m2L3Kk5M5M4j83N8J39m7j86M6J82j06k26P5L10k31k39K26J26j45j53
2318b77K75N1j55mQ7J5k5q1P6J62k7j62j8K70r2k39J26K05k05k06J93J50k02j74
2342b57J65J03j65j22J95J06j09k22K66J42k25j82L41J63l45k6L17ll02J34Q7
$$ y = [-444, 261, 208, -534, -240, 421, 62, -457, -68, 329, 15, -287, -40, 242, 72, -213, -111, 248, 158, -308, -166, 385, 106, -382, -181, 311, -57, -437, -130, 126, -99, -424, -176, 90, 30, -373, -207, 181, 160, -354, -219, 287, 89, -376, -138, 405, 37, -321, 33, 371, 16, -258, 41, 316, -91, -280, 32, 160, -95, -310, -67, 0, -122, -272, -219, 56, 53, -323, -278, 198, 71, -366, -127, 327, -29, -403, 28, 325, -83, -257, 153, 197, -68, -29, 116, 42, 74, -30, -135, 12, 85, -181, -330, 54, 38, -357, -248, 187, -89, -370, -24, 180, -157, -233, 121, 28, -123, -70, 20, -22, 11, 13, -12, 33, 77, -106, -48, 91, 44, -142, -96, 86, -20, -246, -171, 139, -92, -331, -105, 21, -124, -277, -2, 49, -106, -110, -23, -8, -33, -114, -38, 124, 97, -65, -83, 187, 95, -144, -18, 187, -18, -224, -31, 119, -83, -257, -92, 11, -154, -276, -81, 25, -84, -306, -40, 102, -123, -305, 36, 199, -146, -172, 145, 142, -160, -26, 61]
2363F1O1j41r2L2J99K9m02K02L10l67k94M34J52m75r6O13j21m93J73L90k58j42
2385b25R2J25M8l0j55J04K38k21k70L34L56n45j34N37ln65J30M41k29l56K75J56
2407A03j65j35K7J08J31k65j00K98J10l37q4N08r3l82Q6L85j30k52Q0L53j69l22
2429b45J67K31p6k43M8K69j19k53P7K35n5l23J03K06K5l35P1K86n0k44L1L33q6
2452E3k88J04K97j32j60P7J22l1j29j2J58J8j60o8L49j15k89P0K77k14k26K15
2474h4J53k27j06K59l3q8L5n7J39M8j48q6K79K5k92L8L96k25k53J95K36k74q4
2497a54J71Q9j81p9R6Q4j22o8L1R1rk11%K18O2l06J02K14j9j94J33J36o0j80M5
2522a11K78p3k23J37J76j95j36J03K08j71j43J19P3j09n8J08k4%j91Q1J37M6k53
$$ y = [61, 122, -19, -111, -79, 120, 149, -253, -51, 259, -108, -402, 32, 184, -291, -387, 226, 105, -388, -215, 175, -83, -225, -133, -8, 40, 10, -145, -41, 197, -24, -294, 40, 396, -149, -283, 254, 251, -314, -184, 257, 28, -328, -53, 103, -62, -197, -170, -62, 69, -196, -296, 2, 112, -225, -309, 199, 106, -276, -190, 195, 65, -187, -107, 246, 77, -245, -78, 153, 77, -166, -118, 151, 32, -221, -144, 91, 36, -287, -184, 22, 47, -288, -217, 69, 19, -225, -194, 139, 53, -235, -131, 166, 34, -126, -49, 73, 42, -87, -99, 59, 77, -83, -151, 198, 83, -206, -136, 141, -73, -299, -84, 69, -158, -264, -5, -38, -126, -91, -148, -9, 39, -109, -195, 84, 109, -183, -145, 251, 26, -227, -32, 204, -70, -154, 17, 106, -75, -154, -58, 26, -96, -164, -133, -42, -51, -262, -262, -44, 18, -288, -186, 28, 9, -185, -52, 84, 24, -156, -111, 167, 94, -129, 8, 184, -11, -147, -44, 164, -7, -150, -31, 42, -67, -125, -17, -41, -41, -232, -151, -14, 32, -221]
2545b21PL38j02l16J92K23o9l19K24K90k65j74K43J40k59j5J33lj06r8J21N2n2
2568c6j39m7K63l8l38J79K84j75l15K99K01k26j74L11Q5k95n7K86Mj65RQ4N0o0
2592a0p8L1J26l1l13J87K84k72j81J83K03k56j73K65J01k50n3K02J06k35k7J29
2614f2J91j85j75K53J75l04j27K72J19k32p5K17Q7j82j47J70O8j37j62J41J72
2635G7k17j35J72K24k44j57J95J68k04j31K17J49j74r0J36J18j82o1K11O1j02
2656C1j79J66P4j25j26J73j1j12p0J05J68k05j94K61J13k29j21K96J6k04k7K82
2678H2J15l31%J84kj15l4J55Lr0k9P1J08j89j10K10R9l16j6J43J13j98j17K21
2702d3J49l14p7L04N9k75L7L02o2k49L6K33q4j45J8J56L2j51l1M1J71j62j72J95
$$ y = [-221, -214, 124, 22, -294, -102, 121, 52, -267, -43, 247, -18, -192, 51, 191, -68, -83, 50, 47, -59, -157, -36, 16, -36, -175, -222, 41, 3, -335, -156, 128, -47, -362, -63, 138, -88, -262, 49, 134, -161, -218, 68, 72, -93, -84, 0, 50, -10, -88, -57, 69, 38, -275, -88, 196, -76, -257, -74, 129, -127, -300, -35, 66, -184, -237, -35, 71, -164, -191, -62, 129, -56, -231, 22, 197, -107, -234, 38, 157, -75, -150, 67, 154, -28, -175, -5, 63, -74, -236, -95, 77, -140, -275, -103, 121, -123, -280, -85, 83, -121, -252, -35, 114, -60, -150, -14, 104, -78, -139, 72, 133, 31, -148, 18, 92, -33, -159, 14, 3, -109, -179, -74, 94, -111, -305, -44, 69, -160, -281, 15, 31, -173, -200, 82, 197, -134, -134, 50, 48, -67, -101, 54, 57, -33, -62, 9, 117, -72, -182, 28, 127, -189, -205, -62, 51, -147, -264, -43, 106, -208, -285, 19, 78, -197, -160, 142, 80, -169, -133, 100, 16, -129, -111, 45, 77, -74, -105, -64, 107, -55, -227, -32]
2726c2K06l24j14K76J11l51OK71n0k27O2K85j20j87Q0J54n5j19O2J13n8n7j6J34
2750E0J25k08j06K02Q5k54n0K60J0l49k9L16j8l01kL52q5l16J83K13j05j91N9
2773a59K16j22n9MJ63mr2n8R5J18j33j56K49J77l67o2L43k0l59R3K90j45l16J72
2797a32K92j78j86J19J68j68o6K1J44po6l7J56N9k07q9K73Q4l26n4L27K6l65P1
2821a41K57l8k88J22K25j68k22J19K09j63r3J21O7p0j25L3J49L8j29l7K08j3k34
2844a73LL48k4l55J07K75r3l09J54K41j37k79J92J62j65j16N8J10q5r5O9J04j7
2867b5j51rJ79L6j57j3K33Nl07K8L65j01k60J14K94k87j96K19K17k35r9R6R5q9
2891d8j08P5Q1J8j54n0K01j3k35k9L57q5l28J69L18j37k64J42K45j89j59J41K37
$$ y = [-32, 174, -150, -264, 12, 123, -228, -222, 49, -1, -228, -166, 119, -1, -188, -108, 46, -9, -128, -66, 47, -11, -68, -84, 50, 175, -33, -139, 63, 148, -106, -156, 104, 114, -235, -264, 52, 34, -267, -269, 83, -2, -318, -135, 78, -27, -218, -159, 57, -65, -124, -120, 43, 39, -53, -111, -16, 102, -31, -187, 62, 239, -128, -190, 153, 133, -226, -133, 157, 12, -304, -132, 160, -18, -204, -85, 83, -85, -151, -130, 14, 7, -59, -96, 60, 119, -88, -177, 96, 180, -146, -200, 127, 153, -212, -141, 116, 78, -210, -88, 137, -31, -253, -134, 75, -88, -181, -60, 7, -63, -188, -155, -6, 32, -97, -134, 74, 61, -173, -170, 178, 154, -201, -94, 181, 88, -221, -67, 174, 37, -242, -50, 112, -53, -169, -111, -1, -86, -181, -112, -8, -25, -176, -185, -6, 30, -127, -140, 93, 98, -209, -181, 184, 83, -177, -63, 231, -56, -252, -33, 184, -51, -150, -54, 41, -48, -156, -81, 0, 18, -136, -186, 15, 2, -233, -262, 95, 10, -318, -149, 169, 32, -232, -90, 155, -34, -193, -52, 185]
2914A85j59j56R0J90j47k14R1K01j14j49J10J22n4j81R4K1K3r2p2K40j1k79J00
2937a61K80q0k92K15K47j89k25J69J75k14j07J99Q6j53m4M7P6N6k06l4K09o3k29
2960b38O4K71j12k80J84K24j75j46J62J60j70r5P2J97j10k06J48K19k05j37J41
2981c2J03p6q1L8R8l6j06L4J5Kj55P7J70m2k80J84K80k62j40K36J30k44r1K59
3005H1ok20J16Q2lj20LJ0M9lr5M4P6L3k14Q0J62j92j29J67Q3j42m5J46O2r4o0
3032a29J54M2k02l2J29P0j55J3J19j2n5qN4R5o9q0M9M7q5j12P9J95k54n2J19J26
3058D6k41L9K12j13j03J4J62n9p0K6M1M7j08k9J00Q6q1r4K53k1k14J7J90p0j41
3083a11K0J24n4j19m7J28L6r9n8K38k6j59n9K75k3k00j3J52l9j99K04K9L3j41
$$ y = [185, 26, -130, -40, 150, 3, -211, -120, 81, -33, -182, -72, 50, -4, -185, -91, -70, -47, -139, -211, 29, 18, -261, -161, 119, 39, -253, -38, 209, 20, -205, -36, 139, -75, -182, 17, 103, -50, -94, -47, 29, 85, -121, -155, 54, -9, -238, -174, 97, -15, -295, -111, 113, -62, -208, -46, 114, -56, -151, -79, 118, 8, -198, -50, 169, -36, -173, -32, 71, -5, -86, -48, 50, 14, -92, -58, -43, -41, -196, -119, 51, 9, -271, -87, 193, -69, -209, 27, 157, -87, -178, 81, 75, -145, -29, 53, 50, -70, -67, -57, -8, -11, -106, -62, 14, 47, -167, -87, 75, -117, -246, -79, 4, -138, -183, -37, 25, -69, -129, 25, 67, -135, -167, -38, 32, -123, -110, 9, -3, -58, -66, -12, 83, 14, -66, -17, 30, -55, -167, -88, 107, -147, -199, -80, 46, -195, -156, 56, -57, -160, -146, 16, -43, -113, -87, -46, 1, -107, -136, -36, 50, -31, -125, 128, 107, -107, -90, 100, 30, -111, -91, 33, -21, -140, -187, -59, -23, -122, -180, 58, 32, -127, -186, 89, 66, -134, -147, 5, -34, -233, -29, 0, 33, -108]
3107a08L1J05KK0j60J88lk12k0J60mk02K7K40o4j82J9K41k2j59L1J36j20q7L7
3132a06J14j29m1J9J45M1j31QJ41L6j84p3K80l6k93L0K09K3l14R2K92j62j43J34
3156d8J62j65n1O2M8j28k8n3J91J04k59NK46P4l07Q2K35j11k37P4K49j59k51J94
3180g1J13j58l9O4J53j3j76M1R6M3j93r6K61p4j85J08J86o0k12J71K21j05j79
3203a04J13J54p2k66R7J49r4k33J11J60l0j52M1J70jj41n0K31j06j82m4K65q9
3226g3k25J61J96p3j30J43R6o8k9l1J36n8j99P1J09Qk22N4K57p0j64Q6J27j54
3250e2o1K0J42j30p6m2J28M3j82Q0J58P7k43O3L01j39k21P4K10k51j28J30R6p1
3274g4j25J65O6rj12%J08N3j99kJ62q7j30LK01j12j13J33J81r0j54J41J26r0j19
$$ y = [-108, -77, 28, 30, 50, -110, 78, 75, -137, -157, 3, -1, -203, -176, 64, 0, -182, -163, 78, 56, -103, -72, 64, -56, -143, -106, 8, -121, -162, -143, 2, 43, -88, -80, 61, 97, -87, -160, 120, 84, -209, -179, 30, 53, -261, -169, 123, -39, -182, -48, 114, -51, -102, -40, 8, -120, -148, -201, -10, 94, -165, -160, 86, 160, -147, -65, 170, 59, -178, -104, 145, -14, -265, -71, 42, -116, -155, -91, 62, 49, -127, -86, 10, 53, -140, -236, 25, -49, -234, -126, 60, 0, -212, -41, 180, 75, -104, 9, 163, 91, -175, -78, 71, -23, -256, -145, 15, -15, -167, -126, 44, 43, -98, -148, 83, -23, -205, -249, 16, -73, -298, -137, 59, -14, -144, -1, 95, 27, -2, -33, 103, 45, -154, -83, 26, 34, -188, -134, 123, 53, -111, -25, 102, -52, -113, -93, 49, -81, -157, -199, -71, -28, -210, -130, 28, 105, -138, -75, 226, 87, -134, -60, 150, -101, -229, -99, -3, -74, -199, -34, 32, 23, -89, -89, 19, 72, -127, -129, 33, -54, -184, -181, 20, -92, -205, -72, 109, 19, -135, 6, 132, 42, -77]
3299g7k3J10j01j12J24R6j09lO2N1Rj24J16J5j9j19J5P0p5j24P9J53r6j15J79
3324a8J03j38m7J85J7j46o1P6Qk8r3K4J35m5r0M4J47n4j10M4Q1j43k3M5L6m9j06
3351b06J83l4K0j44J67J13j81l7P3Q2p7r6J20j6j1o8O9On4L4N8KQp1k8J63j53
3378g8n1N2P1j12q1J73N1j35J9J01O8j69N5R4n2j11M1M9jn8J2lP2l0m8P9O1j14
3406d5n3J32lj50n8J78p6j33P3J48k8o3J9J39j28l7O3M2k8o7k0J05l5k0m3M9R5
3433E6p4o3J30n9j09M5N6p7j20Q0J01nj09M1Q1J3j17R6j5K5j05Q3O0j02n3P1N1
3460a9j2j06O7J06Jq3J0L9K5j47M5J25Jk44M4J61r6p4Q5J29p0j05Q2Q2r1j43J68
3487b0po2QL7J3k3k3k2K26p4j26K1J25q8j23J43J07j68o5L8J39j77p6J63J9m4
$$ y = [-77, -100, 10, -91, -203, -79, 17, -92, -95, -33, 18, 27, -97, 19, 34, 15, -104, -89, -19, -94, -218, -139, 14, -82, -197, -18, 85, -53, -100, 85, 102, -44, -105, -29, -21, -49, -142, -118, 17, -28, -118, -74, 73, 19, -91, -47, 34, -109, -132, -87, -51, -100, -206, -23, -57, -37, -181, -14, 99, -82, -119, -46, 36, -41, -137, -17, -33, -44, -112, -43, -37, -91, -57, 1, 3, 11, -60, -88, 75, -78, -129, -77, -6, -118, -199, -26, 25, -110, -91, 10, 78, -91, -36, 58, 6, -105, -64, -15, -16, -74, -62, -65, 7, -23, -71, 8, 69, -45, -98, 34, 31, -119, -177, 1, -75, -208, -135, 13, -15, -78, -59, 80, -48, -85, -22, 20, -8, -75, -95, 10, -25, -45, -88, -39, 56, -18, -81, 49, -10, -119, -74, -18, -95, -215, -135, -34, -39, -148, -107, -26, -13, -130, -34, -49, -24, -129, -46, 14, -88, -141, -70, -19, -31, -137, -70, 36, 37, -46, -36, 3, 28, -119, -74, 51, 52, -192, -148, 13, -83, -157, -72, 57, -13, -118, -36, 46, -45, -188, -20, -27, -89, -81, -44, -31, -54, -77, -99, 127, 53, -73, -52, 73, -15, -138, 5, 112, -56, -121, -83, 56, -121, -197, -34, -15, -59]
3513e9l5L8N0Lj14Q0O5j05kK8R3r2r0O6J26p4p7J10O6o5j21M9P0o3m4lJ16r4o4
3542a42P2M6o1n4J46j8j6r2N4J63j51q7J16P7j23k4J1J49j05k2K3P6j03m7P7M7
3568A2o6j40R5Q7p3k8N2N4m1j57J18Q7j2j04M0R5m1q3M4R2j05q8J57J35j78n2
3594a00J14J00j16j09O3J42k04j4J23l7j39O6R7m8ql3N1Q6n4j22L3J60j26j36
3618b11J37J85j94m9J83Lr4l4L3J5ql1N8j0J6r5M4P1q7j4L3O3j16n1R0Q5j11n3
3646a42J28R7j43j22J82M2q4p4J87m0p6n6K08n8j27NQ0o7k3l6j3J85o1j40O6J77
3672I5j37j27J51O0q9j30J69k2j12L6J29j5p4j5P6M3j11n8J20M4j25%R4N6j42
3697h4J5KM6o1j2L3Q4n8q3R1P0j49j07K04R1j69k4J90Nk53J12J00m2n2K3mK0k3
$$ y = [-59, -94, -56, -6, -3, -117, -37, 28, -77, -79, -51, 42, -50, -140, -74, 52, -22, -99, 11, 77, 12, -109, -60, 10, -53, -97, -100, 16, -78, -142, -70, -24, -85, -139, 7, -11, -27, -119, -65, 98, -53, -140, -24, 53, -70, -94, -83, 66, -39, -61, -38, 38, -65, -112, -35, 12, -54, -194, -99, -12, -85, -113, -61, -7, -48, -205, -87, 0, -12, -116, -76, 19, -22, -105, -61, 31, -74, -162, -5, 130, -48, -100, 14, 114, -2, -111, -48, 94, -110, -124, -1, -38, -177, -111, -14, -62, -70, -103, -52, 34, -20, -142, -109, 51, -75, -211, -74, 111, -83, -132, 51, 54, -40, -74, -41, -26, -34, -65, -7, -17, -1, -96, -52, 19, -68, -82, -49, 14, -102, -153, -63, 22, -89, -142, -14, 83, -60, -182, 0, 42, -42, -116, 71, 31, -45, -101, 107, 49, -78, -73, 7, -60, -83, -119, -132, 53, -8, -148, -82, 95, -42, -169, -18, 42, -47, -177, -8, -30, -142, -106, 23, 8, -66, -81, -5, 38, -73, -131, -11, 33, -92, -92, 2, 58, -84, -69, -67, -21, -82, -94, -61, 23, -35, -118, -27, 43, -106, -213, -9, 82, -87, -111, 79, 84, -169, -57, 43, 1, -51, -28, -32, -12, -35]
3725c5n4l3K07r1j37J47Q8j64q2J28R9j48o9J52L5k17L4J27j5m0j8J47l0o9r1
3750a29J50l1o2J2M4O1q5q4J29L6j07n7J66M1j74q0K13Nj67L4P9J9j71M9M6K3
3776d0l7o5J36%r0l8J58L8j45m7J74j5j21K1P9n1q7L0P1L6p6l8J28l8r3J0J31
3803C1j09n7j6J33N5j66P2K6K0q8M8R3q5j8k3L9M5o0M6K6J9j51J9J15j0q7nJ05
3831A7k1j23P4K1m0J4j3P0r0N1k6J1J6p1K1J04M0r2o4J06J7j09K1J20p1m2o9J17
3859a1p2n1P5O4m2m9P5l3J0l9K9l0P0p0QK6N2q6j3R0N1j57M2J06j29j1L3Q7p6
3888e1j24J11P6o8k6N0L5p4j5JKK8m1n5J76j36l7M7J64j42m5O9O6n2q1J00L2l9
3916b9n9N1N7l4j47J12K9r4RR6%k9m0L4M4o5j0J2K2j7o3J3J31k6j07QO5ro9M9
$$ y = [-35, -89, -122, 85, -6, -143, 4, 92, -72, -154, -26, 73, -75, -144, 8, 43, -174, -140, -13, -28, -68, -86, 61, 31, -38, -129, 21, -10, -72, -60, -16, 45, -40, -124, 5, 41, -66, -123, 43, 84, -90, -170, 43, 48, -119, -85, -6, 13, -158, -109, -63, -40, -77, -142, -6, -6, -96, -134, 24, 62, -83, -130, 44, 29, -92, -71, 8, -43, -130, -100, -29, 7, -69, -107, 21, -17, -110, -100, 31, -78, -135, -151, -18, 37, -129, -57, -31, -11, -99, -51, 42, -43, -61, -84, -45, 0, -60, -14, 12, 31, -120, -101, 14, 4, -83, -88, 17, -4, -127, -53, -32, -72, -58, -71, -1, -91, -40, -66, -55, -39, -110, -89, 15, 55, -37, -101, 5, 22, -87, -66, 54, -17, -59, -128, -11, -83, -134, -59, 5, -37, -86, -11, -44, -34, -73, -44, -74, -4, -74, -66, -40, 12, -74, -87, 3, 54, -103, -61, 45, -84, -95, -62, 25, -51, -175, -64, 12, -56, -82, -32, 3, -71, -86, -85, -83, -55, -96, -151, 25, -111, -148, -101, 63, -79, -124, -55, 11, -41, -122, -22, 10, -29, -88, -37, 20, -14, -161, -49, -20, -114, -105, -9, -9, -38, -78, -44, 0, -65, -75, -63, -41, -58, -121, -108, 23, -3, -110, -102, -37, -46, -115, -66]
3946f6J28q0j28J26K3p4LN2mk0q4N2M1j5l1jN8Pj39J04L4n7K0k3M9k7p6P8Nj4
3976e9m7J39l7p6l0L6J11j12m5N7J8l0j6L6P3p2p7O0O0m3j02P6J11r3p2R9M2q8
4004h1l3P1N6j17M5K7J9l9jL2N6j04p0J30K2p2m1J6K6K1o5L9Jj2p2O1O5j6o9L2
4034g3P3o0J6O2J7n1o9R8J3p1K0q5L8J2RRK2Pn6J6Q8p1m9J1L7j30L4P3L6o0m0
4065a24J44m9p0K3O5kj9m1N2Ll2o1J06l0n2K4J3Q6j04J5L7k3J1q3O2L3m4n8M8
4094g0M9l5K3L7K7q7l6N5Kj2j2O7k4m7JJ4O0k2p8K3N8km1K1rr2jN5R7r7M5K8l1
4127c4n9N5J8Nn2J1M1L6n5j6N3M4j33K9M6L1l5p7O9L0q1JN5jo8j6J61o3p0k8J27
4158B4o1o2O7k3l3J9OmJ5M5j07J04k3n4N1NL3p0m0J27n2k8j0N0L5r2K6J0J0o5
$$ y = [-66, 62, -18, -146, -20, 3, -71, -68, -16, -20, -40, -124, -72, -31, -46, -77, -78, -20, -13, -152, -48, -14, -71, -51, -74, -25, -52, -128, -50, -45, -59, -106, 33, -4, -80, -110, -74, 37, -75, -120, -63, -45, -75, -91, -55, 18, -54, -131, -71, -11, -54, -156, -80, 31, -62, -134, -35, 7, -81, -114, -43, 13, -104, -59, -32, -13, -52, -53, -21, 35, -69, -139, -9, 13, -59, -100, -84, -58, -37, -102, -63, -62, -74, -146, -85, -20, -36, -105, -73, 0, -60, -44, 18, 35, -16, -85, 13, 26, -45, -25, -110, -72, -60, -51, -42, -20, -13, -69, -53, 35, -36, -85, -74, -37, -167, -133, -60, -24, -84, -124, 20, -29, -99, -76, -11, -13, -32, -73, -21, -18, -50, -111, -5, -35, -87, -63, -50, 36, -68, -53, -16, -39, -28, -111, -49, -16, -60, -118, -70, -21, -56, -33, 4, 31, -56, -92, -37, -35, -47, -59, 8, -16, -63, -62, -48, 12, -10, -88, -65, -7, -9, -50, -29, -38, -130, -131, -76, 21, -76, -31, -3, -34, -93, -38, -20, -15, -67, -56, -15, 21, -34, -50, 3, 47, -86, -57, -11, 20, -15, -92, -23, 7, -74, -73, -18, -19, -87, -103, 58, -5, -75, -103, 24, -37, -99, -32, -55, -88, -69, -63, -67, -52, -7, -114, -10, -33, -87, -36, -31, 2, -68, -108, 19, -33, -61, -71, -21, 14, -78, -52, -42, -32, -97]
4188i7PP7j33M4NL5O8m8m3N1K0o0pJ04n7pl1M6K2r1mR6nm8n2P9j5n9P0k3NNM7
4221An2L4p3NO9o4k0oP1M5j11L6P9k1r1O2K1n1K0K4rlj5J1P8j14L1q0P4j7k4M2
4253d8k9O6o3J7L5l1l8N7M3k8n7J0M0l4J2LO5o6q0J40J3q7n8P5oN6p1j3K0j1m4
4284a12RO1l5L7l9MP4p1j3O2k7l0n3J31j4k4J1N3j01m8J36J1j46K0Q9L7j04K3
4312e9J5j8k0M8n1K7O7r5k6R2l6m8lJ16n9k6N6J8p1J4O6M1j27j7Q5l2K3jm3k8
4342i2O4K5l9k9qj0O0m5nj3K6k0QLN3l0nl0J27q7j9RQ1r0k8L8j1J00j11M2M8l6
4374b4K4m3l2Q7m0j44J92n9M8q4O3M6r3qLJ16j05k8P2n5l2P1j4K4Jk9J9L9p4J2
4404d7k0M6k9Jl3Q2q7kK7L5o3k5M9N8q7J4M4Pp8M3K7L5o5M0l7M2q7N4jJ3J2L7
$$ y = [-97, -90, -13, -146, -102, -97, -62, 6, -42, -85, -34, -14, -74, -81, 23, -34, -41, -72, -26, -4, -95, -99, -3, -8, -56, -108, -29, -44, -103, -33, -56, -51, -46, 1, -51, -17, -90, -85, -16, -80, -100, -106, -35, 10, -101, -65, 14, -7, -98, -36, -15, -66, -46, -22, -31, -34, -49, -38, 40, -74, -43, -123, -49, -66, -90, -48, -77, -11, -74, -57, -22, -53, -91, -34, 9, -19, -76, -66, -26, -60, -48, -45, 20, -46, -126, 14, 27, -60, -118, -43, -49, 7, -64, -77, -57, -68, -112, -103, -42, -77, -40, -79, -75, -1, -72, -85, -23, -50, -80, -133, -2, -16, -40, -29, 24, -77, -125, 11, 22, -124, -104, -15, 22, -82, -59, -44, -62, -82, -34, -85, -58, 9, -86, -112, -20, -56, -104, -107, 9, -50, -76, -20, -2, -73, -59, 7, 48, -79, -96, -11, -43, -20, -21, -64, -92, -28, -3, -42, -71, -79, -89, -29, -74, -79, -92, -66, -86, -78, -75, -22, -52, -57, -87, 40, -47, -66, -57, 24, -66, -94, -56, -67, 33, -78, -36, 12, -24, 0, -43, -75, 12, -28, -172, 20, -39, 9, -75, -12, 34, -59, -67, -64, 52, -53, -81, -9, -64, -96, -25, -39, -15, -14, -43, -24, 15, -59, -47, -67, -21, -50, -49, -82, 0, -87, -89, -62, -27, -90, -115, -66, -8, -95, -81, -37, -30, -108, -65, -38, -3, -68, -28, -65, -23, -110, -56, -57, -44, -32, 5]
4436Eq9N7J9q8P9J2m1m6M4K0m1lRK3j3K0qK1q6K3N1On4qP0l3J0l4K9N0m6J8n3
4469g7L3K7o0Q0Kj04J4O9j5p9l8J43p0L2j4K5Kj0j9m0JQ7r0Q1Ok9n6M2Non9P0
4501d7O5r9J6N5l5kj7oN7q2J6Q4m2n1P1J1m1o5j6M9m1O2o4J00m7K5j3M3K8m9n3
4532h8J6J16j26J1L6m5qN4N8j03nL3K1k1m0K2J2L2pmrJ8p3oJ19l2o4M4M0k5q7
4563a11P9j%k9N0n8L9mOL2ol9k4M6l6n4j1Q1nj1l1M1L8k6kN5m8o4M0K5L3r5J15
4596B5n6pj7K6j9n5K5rQ8k1n5k0L2K4J8o3N4j1n3J4L1j4n6O0N4l0j3kM0j4m2J3
4628e3O6m6j2L4k6j1oK5m3J7j0KL3M0r5RJ48j49J9%J0J8r3R2N2m7o5P3K9o1l5
4659h5P5mOn4J6MrRl8M4Ok5o2P3J2ro2P8pm3O0o4M9n0J03oj6j7j2K3k4J5k0Q6
$$ y = [5, -84, -27, -8, -96, -17, -5, -46, -92, -48, -28, -69, -72, -63, -40, -53, -33, -41, -20, -106, -83, -32, -26, -80, -88, -18, -51, -41, -75, -46, 4, -42, -24, -77, -44, -17, -77, 3, 5, -99, -85, -16, -31, -110, -148, -5, -75, -43, -57, -32, -30, -40, -59, -99, -98, -11, -101, -20, -14, -43, -99, -57, -52, -58, -117, -47, 18, -81, -65, -10, -45, -47, -64, -70, -13, -95, -79, 5, -37, -88, -17, -6, -47, -112, -128, -79, -120, -58, -122, -22, -69, -44, -57, -14, 14, -35, -88, -72, 44, -82, -71, -35, -80, -88, -34, 24, -79, -84, -51, -30, -51, -91, -69, -57, -25, -32, -36, -45, -27, -100, -106, 13, -19, -83, -39, 1, -24, -111, -32, -33, -33, -62, -12, -70, -31, -35, -29, 3, -3, -42, -66, -20, -56, -110, -121, -40, -45, -56, -87, -46, -8, -34, -36, 19, -29, -93, -53, -28, 5, -90, 25, -31, -38, -55, -29, -48, -103, -78, -87, 1, -20, -75, -95, -63, -39, -21, -84, -30, -41, -94, -80, -49, -63, -119, -59, -5, -35, -48, -50, -10, -24, -66, -53, 13, -33, -45, -11, -37, -48, -54, -29, -72, -55, -65, -63, -30, 10, -85, -76, 72, -77, -58, -58, -48, -30, -123, -31, 21, -26, -91, -18, 11, -50, -85, -10, -14, -8, -62, -46, -42, -51, -42, -80, -36, -30, -55, -117, -44, -32, -41, -103, -25, -32, -75, -15, -79, -30, -80, 23, 17, 1, -16, -28, -5, -29, -14, -34, 52]
4693E2o2rm3N0J6o0k8j4L6plM6j7k2oj6J3N1m4K2k5L8%j4Nl5L1L2k3j7N3j2l7
4726d9j2QN0k8k6N7l9Oj00K4P7K2m7k2M5k1J5n6P5o6K5K2L6o6qJNJ6rN2p2L4k2
4759g3QPJ0O6r2R6j04J3L5M3n9j0MM1l4l2N4PKk1L8o2O4J0m4k7J8o8K0N7J6m4
4791f1M6j3j6jO1j17L9K0J5J6l8n9J05L8j17l3J12m4k3j3K6L5J9jj7l6O1p9m6
4820a21J36o5L9p8L8M8l5op2K0k6O7M8p6k8M8N5j06M0K8J4o4mM6K0k2jj5M0kJ8
4851a6m6Q4m6k0P3m3l8K9mo4R1o2K8m0L4M0r0k0N6k8M6k6k9OK3j7M6k5J2J9n4
4882h1k9O0k3N3K9n5L2m0L1nK0p4M6J2m6m9K3K7L6K4l4J6K7l5k8M9pn4l7J09j3
4913a6Mq0K2R1q8l2L5M6o1j1O7m2J9nK0J4J2j4l9lJ6l0M4J8q4P9jm0l8J14q0N6
$$ y = [52, -10, -19, -62, -12, 4, -56, -84, -98, -62, -69, -72, -26, -43, -65, -71, -87, -74, -23, -67, -45, -70, -32, -32, -46, -41, -76, -45, -13, -36, -53, 0, -12, -49, -61, -53, -3, -31, -57, 0, -39, -33, -133, -109, -32, -10, -57, -79, -34, -55, -40, -96, -21, -87, -62, -40, -4, -70, -78, -77, -72, -56, -65, -13, -85, -51, -73, -65, -58, -48, 18, -74, 22, -82, -69, -34, 9, -50, -60, -56, -15, -49, -81, -27, -20, -18, -39, -1, -63, 1, 11, -33, -60, -42, -110, -90, -33, -17, -61, -15, -28, -44, -45, 16, -101, -62, -42, -27, -11, -49, -108, -3, 35, -82, -115, -3, -47, -70, -83, -57, -22, -3, -4, -21, -57, 4, -75, -121, 15, -50, -11, -89, -51, -3, -38, -44, -116, -96, -122, -55, -7, -83, -111, -63, -8, -114, -74, -46, -32, -96, -100, -54, -34, -56, -57, -72, -32, -34, -16, -62, 22, -24, -44, 29, -14, -52, -23, -27, -91, 0, -62, -34, -74, -40, 0, -90, -110, -54, -82, -36, -62, -91, -85, -62, -79, -33, -58, -46, -27, -81, -110, -50, -73, -20, 9, -46, -14, -54, -23, -28, -8, -82, -36, -24, -70, -119, -96, -69, -33, -9, -43, -27, 0, -35, -63, -14, -21, -75, -112, -3, -16, -12, -92, -70, 21, -67, -99, -64, -18, -79, -90, -23, -65, -46, -51, -31, -17, -5, -19, -58, -61, -45, -75, -31, -13, -97, -18, -19, -59, -97, 17, -63, -7]
4945gn5rR4j7k4l8O9j1n7KM7q3KN3k5L1k3l6J02r2L2l9K0K5l2m3Q0rp7M7KP6n3
4978d8o4R5ro8O2M1q3jL9l9L0L0Pp7J3N6m4jM5k7j5n4P6o8K1K8lm2Q8k4l4L3M1
5011Dl6J8p1L2pJ8l0K0M8k6J7oj5pk7lRM8k7j2J7kp0MJ04k7k2J1K0k3P2p8QM9
5045A0r2K4J3k9N4k6L0qn6K4L5Mk3l9K3J9n4L5J5jj7n1J22n7o3O6N3j09MM6Jp
5077e4K8j5OlKnK0k5m7N0M1Jm0K0ml2j8RL8n8J0N5K6l6M9l4j0n2L0k5j7L5k7K7
5111e5l9N5l5M2J6Oj17L7N2k8K7k4J6j9r9J55k1j6m7L7Q%j0Rm1O4K6q0P3rr2l
$$ y = [-7, -62, -71, 23, 6, -18, -56, 13, 2, -55, -53, -6, -89, -87, -34, -59, -28, -51, -87, 15, -77, -45, -84, -64, -39, -71, -114, -34, -43, -120, -73, -71, 5, -48, -112, -17, -26, -94, -32, 9, -74, -75, -36, -75, -45, -15, -8, -85, -72, -16, -60, -61, -16, -43, -58, -112, -36, -104, -83, -55, -58, -100, -12, -36, -70, -37, 4, -32, -14, -85, -53, -60, -42, -72, -52, -4, -30, -13, -19, -34, -41, -68, -71, -62, -14, -41, -53, -36, -38, -108, -104, 0, -27, -49, -38, -18, -41, 31, -47, -39, 10, -82, -58, -45, -74, -20, -46, -16, -24, -80, -56, -21, -17, -40, -79, -56, -37, -91, -56, -41, -42, -59, -110, 12, -45, -108, -42, 11, -98, -94, -48, -47, -54, -26, -41, -35, -38, -36, -41, -21, -46, -93, -43, -2, -1, -41, -21, -25, -57, -75, -66, -28, -86, -76, -21, 5, -31, 18, -16, -26, -78, -48, -73, -90, -55, -82, -55, -94, -39, -74, -32, -16, -10, -127, -90, -38, -66, -39, -63, -47, -66, -165, -10, -31, -47, -94, -57, -49, -49, -59, -50, -91, -27, -1, -81, -8, -17, -109, -112]
$$ [...]
8191e5
##END NTUPLES=NMR FID
##END=
