##TITLE=1H_AM_NV62
 CDCl3
 8 sc, 
 29.9.2023
##JCAMPDX= 6.0         $$ Bruker NMR JCAMP-DX V2.0
##DATA TYPE= NMR FID
##DATA CLASS= NTUPLES
##ORIGIN= UXNMR, Bruker Analytische Messtechnik GmbH
##OWNER= root
$$ XWIN-NMR		Version 3.5
$$ Fri Sep 29 13:58:06 2023 Russian Standard Time (UT+4h)  she@DPX200
##.OBSERVE FREQUENCY= 200.13135
##.OBSERVE NUCLEUS= ^1H
##.DELAY= (6, 6)
##.ACQUISITION MODE= SIMULTANEOUS
##.ACQUISITION SCHEME= undefined
##.AVERAGES= 8
##.DIGITISER RES= 18
##SPECTROMETER/DATA SYSTEM= spect
##.PULSE SEQUENCE= zg30
##.SOLVENT NAME= CDCl3
##.SHIFT REFERENCE= (INTERNAL, CDCl3, 0, 15.7039)
##AUDIT TRAIL= $$ (NUMBER, WHEN, WHO, WHERE, WHAT)
$$ ##TITLE= Audit trail, XWIN-NMR		Version 3.5
$$ ##JCAMPDX= 5.01
$$ ##ORIGIN= Bruker BioSpin GmbH
$$ ##OWNER= she
$$ F:/spectra/data/she/nmr/H-F/1/audita.txt
$$ ##AUDIT TRAIL=  $$ (NUMBER, WHEN, WHO, WHERE, WHAT)
(   1,<2023-09-29 13:57:16.21 +0400>,<she>,<DPX200>,
      <created by zg, POWCHK disabled, PULCHK disabled
       configuration hash MD5:
       00 E9 B6 7A A2 85 ED C7 34 08 36 98 17 FE 4E 26
       data hash MD5: 16K
       09 C2 35 F6 A7 0D 6B 88 95 45 BB D1 D7 47 AA 08>)
$$ ##END=
$$ 
$$ hash MD5
$$ 5B 20 25 28 27 E4 19 EA C4 FD 50 0C 25 1A 34 A0
##$RELAX= 
##$RELAX= 
##$RELAX= 
##$RELAX= 
##$RELAX= 
##$RELAX= 
$$ Bruker specific parameters
$$ --------------------------
##$DU= <F:/spectra>
##$EXPNO= 1
##$NAME= <H-F>
##$PROCNO= 1
##$TYPE= <nmr>
##$USER= <she>
##$AMP= (0..31)
100 100 100 100 100 100 100 100 100 100 100 100 100 100 100 100 100 100 
100 100 100 100 100 100 100 100 100 100 100 100 100 100 
##$AQSEQ= 0
##$AQ_mod= 1
##$AUNM= <au_zg>
##$AUTOPOS= <>
##$BF1= 200.13
##$BF2= 200.13
##$BF3= 200.13
##$BF4= 200.13
##$BF5= 200.13
##$BF6= 200.13
##$BF7= 200.13
##$BF8= 200.13
##$BYTORDA= 1
##$CFDGTYP= 0
##$CFRGTYP= 5
##$CHEMSTR= <none>
##$CNST= (0..31)
1 1 145 1 1 1 1 1 1 1 1 1 1 1 1 1 1 1 1 1 1 1 1 1 1 1 1 1 1 1 1 1 
##$CPDPRG= <>
##$CPDPRG1= <>
##$CPDPRG2= <>
##$CPDPRG3= <>
##$CPDPRG4= <mlev>
##$CPDPRG5= <mlev>
##$CPDPRG6= <mlev>
##$CPDPRG7= <mlev>
##$CPDPRG8= <mlev>
##$CPDPRGB= <>
##$CPDPRGT= <>
##$D= (0..31)
0 1.2 0 0 0 0 0 0 0 0.06 0 0.03 0 0 0 0 0.0002 0 0 0 0 0 0 0 0 0 0 0 0 
0 0 0 
##$DATE= 1695981435
##$DBL= (0..7)
120 120 120 120 120 120 120 120 
##$DBP= (0..7)
150 150 150 150 150 150 150 150 
##$DBP07= 0
##$DBPNAM0= <>
##$DBPNAM1= <>
##$DBPNAM2= <>
##$DBPNAM3= <>
##$DBPNAM4= <>
##$DBPNAM5= <>
##$DBPNAM6= <>
##$DBPNAM7= <>
##$DBPOAL= (0..7)
0.5 0.5 0.5 0.5 0.5 0.5 0.5 0.5 
##$DBPOFFS= (0..7)
0 0 0 0 0 0 0 0 
##$DE= 6
##$DECBNUC= <off>
##$DECIM= 32
##$DECNUC= <off>
##$DECSTAT= 4
##$DIGMOD= 1
##$DIGTYP= 9
##$DL= (0..7)
0 120 120 120 120 120 120 120 
##$DP= (0..7)
150 150 150 150 150 150 150 150 
##$DP07= 0
##$DPNAME0= <>
##$DPNAME1= <>
##$DPNAME2= <>
##$DPNAME3= <>
##$DPNAME4= <>
##$DPNAME5= <>
##$DPNAME6= <>
##$DPNAME7= <>
##$DPOAL= (0..7)
0.5 0.5 0.5 0.5 0.5 0.5 0.5 0.5 
##$DPOFFS= (0..7)
0 0 0 0 0 0 0 0 
##$DQDMODE= 0
##$DR= 18
##$DS= 0
##$DSLIST= <SSSSSSSSSSSSSSS>
$$ [...]
##$SUBNAM1= <"">
##$SUBNAM2= <"">
##$SUBNAM3= <"">
##$SUBNAM4= <"">
##$SUBNAM5= <"">
##$SUBNAM6= <"">
##$SUBNAM7= <"">
##$SUBNAM8= <"">
##$SUBNAM9= <"">
##$SW= 18.05172834244
##$SWIBOX= (0..15)
0 0 2 0 0 0 0 0 0 0 0 0 0 0 0 0 
##$SW_h= 3612.71676300578
##$TD= 16384
##$TD0= 1
##$TE= 0
##$TE2= 300
##$TE3= 300
##$TEG= 300
##$TL= (0..7)
0 120 120 120 120 120 120 120 
##$TP= (0..7)
150 150 150 150 150 150 150 150 
##$TP07= 0
##$TPNAME0= <>
##$TPNAME1= <>
##$TPNAME2= <>
##$TPNAME3= <>
##$TPNAME4= <>
##$TPNAME5= <>
##$TPNAME6= <>
##$TPNAME7= <>
##$TPOAL= (0..7)
0.5 0.5 0.5 0.5 0.5 0.5 0.5 0.5 
##$TPOFFS= (0..7)
0 0 0 0 0 0 0 0 
##$TUNHIN= 0
##$TUNHOUT= 0
##$TUNXOUT= 0
##$USERA1= <user>
##$USERA2= <user>
##$USERA3= <user>
##$USERA4= <user>
##$USERA5= <user>
##$V9= 5
##$VALIST= <valist>
##$VCLIST= <CCCCCCCCCCCCCCC>
##$VD= 0
##$VDLIST= <DDDDDDDDDDDDDDD>
##$VPLIST= <PPPPPPPPPPPPPPP>
##$VTLIST= <TTTTTTTTTTTTTTT>
##$WBST= 1024
##$WBSW= 4
##$XGAIN= (0..3)
0 0 0 0 
##$XL= 0
##$YL= 0
##$YMAX_a= 4886
##$YMIN_a= -3830
##$ZGOPTNS= <>
##$ZL1= 120
##$ZL2= 120
##$ZL3= 120
##$ZL4= 120
##$ABSF1= 10
##$ABSF2= 0
##$ABSG= 5
##$ABSL= 3
##$ALPHA= 0
##$AQORDER= 0
##$ASSFAC= 0
##$ASSFACI= 0
##$ASSFACX= 0
##$ASSWID= 0
##$AUNMP= <proc_1d>
##$AZFE= 0.1
##$AZFW= 0.1
##$BCFW= 1
##$BC_mod= 2
##$BYTORDP= 1
##$COROFFS= 0
##$CY= 11.3945322036743
##$DATMOD= 1
##$DC= 2
##$DFILT= <>
##$DTYPP= 0
##$F1P= 15.7292609196834
##$F2P= 12.9074282941183
##$FCOR= 0.5
##$FTSIZE= 0
##$FT_mod= 4
##$GAMMA= 1
##$GB= 0.15
##$INTBC= 1
##$INTSCL= 1
##$ISEN= 128
##$LB= 0.24
##$LEV0= 0
##$LPBIN= 0
##$MAXI= 10000
##$MC2= 0
##$MEAN= 0
##$ME_mod= 0
##$MI= 1.114404
##$NCOEF= 0
##$NC_proc= 0
##$NLEV= 6
##$NOISF1= 3.799351
##$NOISF2= 2.8
##$NSP= 1
##$NTH_PI= 0
##$NZP= 0
##$OFFSET= 15.70392
##$PC= 1
##$PHC0= -21864
##$PHC1= 7.252711
##$PH_mod= 1
##$PKNL= yes
##$PPARMOD= 0
##$PSCAL= 0
##$PSIGN= 0
##$REVERSE= no
##$SF= 200.130013532006
##$SI= 16384
##$SIGF1= 3
##$SIGF2= 2
##$SINO= 400
##$SIOLD= 16384
##$SREGLST= <1H.CDCl3>
##$SSB= 0
##$STSI= 0
##$STSR= 0
##$SW_p= 3612.71676300578
##$SYMM= 0
##$S_DEV= 0
##$TDeff= 0
##$TDoff= 0
##$TI= <>
##$TILT= no
##$TM1= 0
##$TM2= 0
##$TOPLEV= 0
##$USERP1= <user>
##$USERP2= <user>
##$USERP3= <user>
##$USERP4= <user>
##$USERP5= <user>
##$WDW= 1
##$XDIM= 8192
##$YMAX_p= 0
##$YMIN_p= 0
$$ End of Bruker specific parameters
$$ ---------------------------------
##NTUPLES= NMR FID
##VAR_NAME=  TIME,          FID/REAL,        FID/IMAG
##SYMBOL=    X,             R,               I
##VAR_TYPE=  INDEPENDENT,   DEPENDENT,       DEPENDENT
##VAR_FORM=  AFFN,          ASDF,            ASDF
##VAR_DIM=   8192,          8192,            8192
##UNITS=     SECONDS,       ARBITRARY UNITS, ARBITRARY UNITS
##FACTOR=    0.0002768,     1,               1
##FIRST=     0,             0,               0
##LAST=      2.2672688,     0,               0
##MIN=       0,             -3830,           0
##MAX=       2.2672688,     4886,            0
$$ Real data points
##PAGE= N=1
##DATA TABLE= (X++(R..R)), XYDATA
$$ [...]
$$ plain form
624 -575 -162 238 -416 -846 129 390 -661 -677 579 456 -750 -263 904 344 -570 213 956 195 -267
643 -267 341 570 105 -88 111 228 106 -109 -276 70 198 -345 -713 118 327 -677 -730 392 267 -864
663 -864 -400 668 108 -754 54 786 140 -428 409 688 139 -120 362 440 186 9 4 213 258 -182 -406
684 -406 137 255 -530 -641 293 142 -915 -597 515 8 -933 -145 634 -56 -631 206 604 -95 -256 386
704 386 503 79 85 302 352 252 38 -62 339 371 -287 -376 351 200 -734 -457 489 -42 -970 -316 466 -281
726 -281 -856 54 451 -361 -457 344 397 -180 -99 367 380 209 108 147 382 351 -54 -79 507 346 -476 -318 557
749 557 51 -846 -232 535 -259 -914 -4 359 -532 -671 213 252 -401 -260 236 180 -55 -15 222 332 255 -7
771 -7 69 493 406 -200 -33 656 181 -570 -61 602 -196 -789 69 460 -560 -748 181 135 -639 -525 225 63
$$ packed form
624e75M13M00o54m30R75K61j051j6J256j23j206M87J167n60r14P83P43p61m62
643b67O08K29m65j93J99J17j22k15j67L46J28n43l68Q31K09j004n3J122j25j131
663h64M64J068n60q62Q08P32o46n68Q37K79n49k59M82P8k54j77nK09M5m40k24
684d06N43J18p85j11R34j51j057L18J112n07r41P88P79o90n75Q37L98o99j61O42
704C86J17m24OK17N0j00k14j00M01L2o58q9P27j51r34K77R46n31r28O54P82p47
726b81n75R10L97q12r6Q01N3n77Q1M66J3j71j01L9K35l1m05k5N86j61q22J58Q75
749E57n06q97O14P67p94o55R10L63q91j39Q84L9o53J41M96n6k35M0K37J10p7k62
771gP6M24q7o06J67O89m75p51N09O63p98n93Q58L91j020j88R29m6p74J14P50j62
$$ plain form
793 63 -338 -162 163 94 29 -15 150 421 326 -107 72 619 334 -355 108 734 1 -630 212 608 -409 -645
815 -645 276 239 -622 -589 175 -10 -642 -336 103 -71 -274 -144 26 208 109 -86 79 523 305 -251 198
836 198 771 124 -407 333 698 -185 -530 417 483 -495 -398 386 119 -604 -343 135 -184 -474 -241 -42 -88
857 -88 -180 -238 -35 271 65 -296 78 628 99 -321 398 724 -95 -331 591 609 -400 -242 534 240 -528
878 -528 -168 315 -87 -521 -206 22 -161 -316 -226 -141 0 -131 -349 -15 367 -37 -394 292 617 -112 -273
899 -273 502 564 -256 -167 708 382 -437 -86 575 36 -425 -34 222 -165 -376 -149 -24 -120 -237 -317 -141 91
921 91 -211 -438 140 408 -266 -392 459 585 -339 -158 703 449 -375 45 686 157 -396 162 465 -130 -302
942 -302 12 120 -101 -274 -246 -55 -8 -277 -466 14 163 -305 -507 262 355 -390 -283 580 375 -424 69
$$ packed form
793F3m01J76L25o9o5m4J65K71r5m33J79N47k85o89M63O26p33o31Q42L96j017k36
815f45R21l7q61L3P64j85o32L06M39j74k03J30J70J82r9j95J65M44k18n56M49
836A98N73o47n31P40L65q83l45R47O6r78R7P84k67p23K61M78l19k90K33J99m6
857h8r2n8K03L06k06l61L74N50n29m20P19L26q19k36R22J8j009J58P76k94p68
878e28L60M83m02m34L15K28j83j55R0Q5J41j31k18L34L82m04l57O86L25p29j61
899b73P75O2q20Q9Q75l26q19L51O61n39m61L91K56l87k11K27J25r6j17q0J76K32
921I1l02k27N78K68o74j26Q51J26r24J81Q61k54q24M20O41n29n53N58L03n95j72
942c02L14J08k21j73K8J91M7k69j89M80J49m68k02P69R3p45J07Q63k05p99M93
$$ plain form
963 69 744 235 -316 245 636 10 -168 262 296 -71 -175 26 37 -94 -199 -305 -48 31 -359 -459 99 144
985 144 -567 -372 409 172 -565 -141 685 111 -419 218 692 -35 -233 403 532 -36 -71 244 192 6 -102
1006 -102 -79 53 56 -278 -341 69 90 -484 -420 227 37 -644 -305 492 -51 -535 109 546 -76 -360 348 525
1028 525 -51 -56 364 360 -2 47 184 178 93 -96 -91 166 120 -389 -337 200 30 -653 -260 368 -130 -697 16 444
1052 444 -222 -502 266 419 -201 -191 366 368 -37 63 251 254 89 81 84 185 178 -198 -162 270 58 -533 -243 319
1076 319 -60 -620 -117 333 -288 -568 130 279 -315 -359 355 298 -200 -56 356 238 14 89 233 255 189 10
1098 10 62 346 166 -264 -88 388 -37 -566 -59 356 -324 -630 58 249 -517 -466 200 143 -439 -245 283
1119 283 55 -135 27 238 218 129 36 168 348 212 -148 55 474 109 -315 77 438 -168 -518 100 292
$$ packed form
963F9O75n09n51N61L91o26j78M30L4l67j04K01J1j31j05j06K57P9l90j00N58M5
985A44p11J95P81k37p37M24Q26n74n30O37M74p27j98O36J29n68l5L15n2j86j08
1006a02K3J32Ll34o3M10K1n74O4O47j90o81L39P97n43m84O44M37o22k84P08J77
1028E25n76nM20ml62M9J37oq5j89NK57m6n09N2N37j70o83L93O28m98n67P13M28
1052D44o66k80P68J53o20J0N57Km05J00J88Lj65qLJ01pl76L6M32k12n91K90N62
1076C19l79n60N03M50o21k80O98J49n94m4P14n7m98J44M12j18k24P5J44K2o6j79
1098A0N2K84j80m30J76M76m25n29N07M15o80l06O88J91p66N1O66n7n82J94N28
1119B83k28j90J62K11k0q9r3J32J80j36l60K03M19l65m24L92L61o06l50O18J92
$$ plain form
1140 292 -413 -490 249 129 -522 -352 248 -3 -425 -96 192 5 -70 -40 117 231 165 -55 207 424 99
1161 99 -201 170 504 -39 -295 217 354 -391 -436 276 139 -494 -309 269 -28 -448 -243 152 -103 -269 -35
1182 -35 129 30 -80 -77 112 289 138 -141 200 488 8 -293 349 491 -208 -245 417 306 -410 -299 323 -7
1204 -7 -476 -151 205 -162 -398 -66 50 -143 -213 -16 77 104 -28 -123 143 385 29 -178 293 468 -121 -227
1226 -227 474 350 -296 -78 475 160 -433 -82 333 -145 -405 -67 75 -193 -274 -148 -80 -54 -154 -176 68
1247 68 156 -108 -228 242 384 -84 -127 464 401 -194 -11 557 196 -363 51 480 10 -341 54 240 -204
1268 -204 -323 -74 -2 -205 -203 -126 -67 -13 -235 -272 47 178 -236 -239 283 291 -230 -51 493 215 -305 100 568 88
1292 88 -271 176 388 -94 -274 78 114 -84 -230 -87 -53 -47 -215 -218 -15 55 -287 -265 204 126 -306 -173 394
$$ packed form
1140B92p05p7P39j20o51J70O00k51m22L29K88j87p5L0J57J14o6k20K62K17l25
1161I9l00L71L34n43k56N12J37p45m5P12j37o33J85N78k97m20K05L95k55j66K34
1182c5J64r9j10LJ89J77j51k79L41K88m80l01O42J42o99l7O62j11p16J11O22l30
1204gm69L25L56l67k36L32J16j93p0J97R3K7j32r5K66K42l56k07M71J75n89j06
1226b27P01j24o46K18N53l15n93L51M15m78k60L38J42k68q1J26O8K6j00k2K44
1247F8Q8k64j20M70J42m68m3N91o3n95J83N68l61n59M14M29m70l51L95J86m44
1268b04j19K49P2k03KP7N9N4k22l7L19J31m14lN22Qn21J79N44k78n20M05M68m80
1292H8l59M47K12m82j80L52L6j98j46J43L4Oj68lK03P0l42K2M69p8m32J33N67
$$ plain form
1315 394 145 -329 34 508 146 -264 257 463 -71 -191 250 246 -116 -147 43 69 -78 -119 -94 -27 -55 -252 -240
1338 -240 42 35 -312 -242 248 104 -401 -11 455 62 -281 216 457 -29 -111 332 326 -95 -42 269 193 -67 -56
1361 -56 53 108 -21 -175 -201 18 -16 -354 -226 139 -42 -498 -124 332 -86 -424 123 442 -86 -230 319
1382 319 385 -68 -43 326 253 -19 21 193 110 47 -20 -10 64 65 -206 -198 144 -9 -410 -103 222 -127 -487 44
1406 44 336 -162 -371 136 260 -217 -148 366 232 -92 74 337 182 12 57 138 158 85 -29 -3 123 43 -256
1429 -256 -76 229 -178 -485 15 261 -287 -389 115 250 -363 -240 259 176 -220 0 314 110 -82 116
1449 116 169 161 89 44 56 199 100 -134 -35 222 -64 -343 15 224 -260 -405 129 160 -386 -258 187 91 -371
1472 -371 -156 268 11 -216 47 239 111 -69 30 153 188 110 1 35 288 -8 -241 114 219 -197 -306
$$ packed form
1315C94k49m74L63M74l62m10N21K06n34j20M41ml62l1J90K6j47m1K5O7k8j97J2
1338b40K82pl47P0M90j44n05L90M66l93l43M97K41m86q2M43om21N3L11p6k60J1
1361e6J09N5j29j54k6K19l4l38J28L65j81m56L74M56m18l38N47L19n28j44N49
1382C19O6m53K5L69p3k72M0J72q3o3o7J0P4Jk71QL42j53m01L07L25l49l60N31
1406D4K92m98k09N07J24m77O9N14j34l24J66K63j55j70M5Q1K0p3j14K6J26q0k99
1429b56J80L05m07l07N00K46n48j02N04J35o13J23M99q3l96K20L14k04j92J98
1449A16N3qp2m5J2J43r9k34R9K57k86k79L58K09m84j45N34L1n46J28M45r6m62
1472c71K15M24k57k27K63J92j28j80R9J23L5p8j09L4K53k96k33L55J05m16j09
$$ plain form
1493 -306 141 195 -375 -384 203 74 -458 -189 185 -104 -306 -56 139 9 -55 44 158 78 88 17 117 239 91
1516 91 -79 145 322 -59 -202 224 286 -266 -206 283 115 -411 -188 220 -103 -438 -142 180 -145 -272 -52
1537 -52 115 -40 -65 -11 38 124 93 -28 147 335 40 -86 230 328 -168 -152 321 129 -310 -140 217 10 -383
1560 -383 -79 206 -142 -311 -32 85 -145 -169 -43 -7 -15 5 -31 92 195 36 -103 307 269 -75 -141 319 229
1583 229 -194 -26 386 64 -401 5 273 -104 -312 10 182 -179 -198 -59 -5 -113 -117 -49 -4 51 -38 -113 160
1606 160 195 -131 -81 313 234 -177 -10 443 125 -282 35 363 -46 -240 115 197 -139 -253 40 39 -220 -161
1628 -161 -42 -54 -83 -104 -95 57 96 -156 -133 247 168 -149 -41 349 54 -199 129 435 -14 -203 215 311 -93
1651 -93 -159 179 155 -202 -128 -66 -50 -93 -165 -143 -14 -19 -216 -168 129 49 -258 -60 276 64 -201 112 397 -10
$$ packed form
1493c06M47N4n70rN87j29n32K69L74k89k02K50J95j30o4R9J14q0J0p1J00J22j48
1516I1j70K24J77l81j43M26O2n52O0M89j68n26K23M08l23l35K96L22l25j27K20
1537e2J67j55k5N4M9Q6l1j21J75J88k95j26L16R8m96J6M73j92m39J70L57k07l93
1560c83L04K85l48j69K79J17k30k4J26L6qK0l6J23J03j59j39M10l8l44o6M60r0
1583B29m23J68M12l22m65M06K68l77k08L22J72l61j9J39N4j08mO8M5N5q9p5K73
1606A60L5l26N0L94p9m11J67M53l18m07L17L28m09j94L55Q2l36j14K93jk59N9
1628a61J19j2k9k1RJ52L9k52K3L80p9l17J08L90k95k53L28L06m49j89M18R6m04
1651i3o6L38k4l57P4O2J6m3p2K2J29nj97M8K97q0l07J98L36k12k65L13K85m07
$$ plain form
1675 -10 -154 217 363 -78 -122 241 183 -105 -36 181 62 -92 -69 4 -35 -91 -204 -162 9 -56 -272 -162 138
1698 138 -18 -378 -6 285 -70 -216 166 360 -67 -150 292 253 -121 -1 217 115 -115 -51 42 72 3 -105
1720 -105 -95 22 -91 -173 -106 127 -69 -330 -47 190 -76 -331 84 286 -123 -234 251 264 -140 -73 319 129
1742 129 -143 11 210 113 -34 -43 54 40 -23 -143 -80 151 -82 -270 -114 112 -182 -361 53 208 -169 -297
1764 -297 214 247 -185 -102 283 150 -109 72 283 102 -34 100 136 46 4 -18 19 61 10 -195 -26 117 -131
1787 -131 -364 -5 130 -293 -316 98 115 -294 -151 198 131 -255 41 288 66 -107 119 182 85 52 104 104 102 72
1811 72 -42 80 148 -15 -201 50 170 -210 -256 88 58 -301 -195 188 -29 -283 -96 203 -21 -223 33
1832 33 155 -13 16 75 102 89 67 57 136 163 42 -63 120 165 -80 -205 196 63 -266 -179 190 64 -278 -39
$$ packed form
1675a0j44L71J46m41m4L63n8k88O9K17j19j54K3P3l9n6j13M2J71o5k16J10L00
1698A38j56l60L72K91l55j46L82J94m27q3M42l9l74J20K18j02k30O4R3L0o9j08
1720a05J0J17j13q2O7K33j96k61K83K37k66k55M15K02m09j11M85J3m04O7L92j90
1742A29k72J54J99r7j47rR7j4o3j20O3K31k33j88J56K26k94j79M14J55l77j28
1764b97N11L3m32Q3L85j33k59J81K11j81j36J34L6r0m2k2L7M2n1k05J69J43k48
1787a31k33L59J35m23k3M14J7m09J43L49o7l86K96K47k22j73K26O3r7l3N2%kl0
1811G2j14J22O8j63j86K51J20l80m6L44l0l59J06L83k17k54J87K99k24k02K56
1832C3J22j68K9N9K7j3k2j0P9K7j21j05J83M5k45j25M01j33l29Q7L69j26l42K39
$$ plain form
1856 -39 164 -127 -278 20 99 -75 -111 88 80 48 26 77 94 78 84 -47 149 205 -17 -119 182 176 -248 -93 217
1881 217 41 -299 -65 207 -51 -293 -17 127 -133 -213 51 119 -79 -41 71 124 23 2 11 135 190 18 -43
1904 -43 236 149 -158 -70 209 86 -164 -72 203 -55 -245 -13 118 -109 -274 -25 5 -192 -123 60 44 -18 -4
1927 -4 -1 52 114 -35 2 144 181 -81 -46 307 92 -137 85 256 64 -212 74 167 -162 -209 41 112 -166 -208
1951 -208 15 16 -157 -109 -16 -17 -46 -75 36 103 112 -48 -40 229 144 -123 31 335 90 -147 93 316 -13 -178 139
1976 139 186 -129 -177 127 12 -153 -75 36 -24 -95 -61 -64 30 19 -80 -99 125 89 -110 12 245 78 -145 123
2000 123 325 -57 -193 182 229 -104 -60 163 138 -204 -94 65 -16 -124 -65 -56 -29 -65 -118 -53 27 12 -153 -29
2024 -29 164 16 -121 114 266 54 -126 181 252 -98 -57 191 146 -143 -34 162 2 -135 -52 27 -60 -115 -21
$$ packed form
1856c9K03k91j51K98P9j74l6J99ql2k2N1J7j6Oj31J96N6k22j02L01om24J55L10
1881B17j76l40K34K72k58k42K76J44k60q0K64O8j98L8J12N3j01k1RJ24N5j72o1
1904d3K79q7l07Q8K79j23k50R2K75k58j90K32J31k27j65K49L0j97O9J83j6o2J4
1927dLN3O2j49L7J42L7k62L5L53k15k29K22J71j92k76K86R3l29m7K50P1k78m2
1951b08K23Jj73M8R3jk9k9J11O7Rj60QK69q5k67J54L04k45k37K40K23l29j65L17
1976A39M7l15m8L04j15j65P8J11o0p1L4lR4j1r9j9K24l6j99J22K33j67k23K68
2000A23K02l82j36L75M7l33M4K23k5l42J10J59q1j08N9RK7l6n3O5Q0j5j65J24
2024b9J93j48j37K35J52k12j80L07P1l50M1K48m5k89J09J96j60j37Q3P9q7n5R4
$$ plain form
2047 -21 -41 -6 -98 -224 -52 170 -11 -186 47 183 -33 -181 117 227 -88 -62 256 182 -96 3 219 95
2069 95 -47 72 159 48 -89 -41 -11 -27 -16 -190 -34 -4 -65 -226 -29 140 -96 -215 94 195 -168 -156 179
2092 179 167 -165 1 245 29 -63 19 198 -8 -86 22 91 -1 -16 -51 41 -4 -52 -135 3 85 -122 -219 -26 93
2117 93 -239 -179 161 149 -222 -79 145 79 -135 39 227 53 -44 33 165 32 -46 4 15 74 -48 -122 -13 72
2141 72 -121 -144 36 66 -168 -240 110 51 -262 -106 167 -7 -190 -60 161 32 -61 117 168 57 7 54 76
2164 76 42 80 7 -5 91 -27 -133 32 64 -176 -213 43 49 -299 -173 120 -36 -252 -97 160 -39 -175 74
2187 74 176 -23 -63 82 116 120 94 42 32 94 14 -4 136 112 -99 -90 145 60 -197 -105 124 40 -248 -114 151 -56
2213 -56 -224 -17 147 -114 -126 117 35 -22 -21 70 57 46 8 46 133 143 12 -6 134 67 -137 -57 165 6 -217
$$ packed form
2047b1k0L5r2j26J72K22j81j75K33J36k16j48K98J10l15K6L18p4k78R9K16j24
2069I5j42J19Q7j11j37M8L0j6J1j74J56L0o1j61J97J69k36j19L09J01l63J2L35
2092A79j2l32J66K44k16r2Q2J79k06p8J08O9r2j5l5R2m5m8q3J38Q2k07r7J93J19
2117I3l32O0L40j2l71J43K24o6k14J74J88j74r7P7J32j33p8N0J1N9j22p4J09Q5
2141G2j93k3J80L0k34p2L50n9l13J56K73j74j83J30K21j29r3J78N1j11n0M7K2
2164G6l4L8p3j2R6j18j06J65L2k40l7K56Ol48J26K93j56k16J55K57j99j36K49
2187G4J02j99m0J45L4Mk6n2j0O2q0j8J40k4k11RK35q5k57R2K29q4k88J34K65k07
2213e6j68K07J64k61j2K43q2n7JR1j3j1l8L8Q7J0j31j8J40o7k04Q0K22j59k23
$$ plain form
2238 -217 -67 157 -116 -250 -24 58 -165 -187 16 46 -77 -45 96 5 11 -16 41 117 83 10 3 193 129 -99 17
2263 17 214 54 -167 -13 129 -32 -227 -10 183 -96 -236 11 69 -133 -142 15 15 -65 -28 60 80 48 -40 -25
2287 -25 101 143 -68 31 206 57 -121 48 204 -20 -172 85 153 -144 -151 41 53 -159 -142 85 75 -147 -88
2310 -88 2 -18 -30 -6 12 59 11 -69 15 165 55 -79 60 161 14 -88 78 213 -98 -122 141 113 -123 -135
2334 -135 69 3 -169 -36 33 -24 -112 -67 -1 33 -50 -102 -20 51 32 -98 -23 186 74 -134 63 199 29 -123
2358 -123 118 210 -50 -101 131 51 -95 -22 95 -1 -123 -67 36 -51 -56 -132 1 55 -34 -41 -8 136 3 -122 33
2383 33 190 6 -126 156 190 -73 -37 221 145 -79 -75 126 -18 -95 18 60 -80 -84 -17 -6 -45 -50 -94 25 1 -21
2409 -21 -92 28 125 -48 -63 68 183 -122 -30 174 58 -86 13 186 28 -103 26 118 -27 -91 9 7 -41 -92
$$ packed form
2238b17J50K24k73j34K26Q2k23k2K03L0j23L2J41r1Ok7N7P6l4p3pJ90o4k28J16
2263A7J97j60k21J54J42j61j95K17J93k79j40K47N8k02rJ57%q0L7Q8K0l2q8J5
2287b5J26M2k11R9J75j49j78J69J56k24j52K57O8k97pJ92J2k12J7K27j0k22N9
2310h8R0k0j2K4J8M7m8q0Q4J50j10j34J39J01j47j02J66J35l11k4K63k8k36j2
2334a35K04o6j72J33O9n7q8M5O6L4q3n2Q2P1j9j30P5K09j12k08J97J36j70j52
2358a23K41R2k60n1K32q0j46P3J17r6j22N6J03q7np6J33N4q9pL3J44j33j25J55
2383C3J57j84j32K82L4k63L6K58p6k24MK01j44p7J13M2j40mO7J1l9nm4J19k4k2
2409b1p1J20R7j73j5J31J15l05R2K04j16j44R9J73j58j31J29R2j45o4J00km8n1
$$ plain form
2433 -92 -102 17 12 -18 -137 3 67 -116 -147 98 73 -134 -67 157 115 -122 -27 155 97 -95 74 173 -19 -45 41
2458 41 45 16 -60 -46 -9 24 -80 -145 -4 -19 -127 -135 23 56 -111 -109 134 117 -174 -40 145 7 -102 24 162
2483 162 51 -5 68 119 16 -27 60 83 -30 -3 -33 45 36 -88 -100 69 42 -143 -106 86 11 -151 -62 145 25
2508 25 -205 27 175 29 -105 126 159 3 25 105 85 7 39 34 91 89 -41 -46 16 116 -65 -116 120 31 -188 -83
2534 -83 135 -13 -156 2 134 -39 -102 34 84 -7 -63 150 113 -33 -25 51 19 77 3 -47 86 101 -76 11 29
2559 29 34 -171 -112 89 -54 -214 -15 91 -70 -167 36 94 -61 -92 87 82 -11 -41 84 52 15 74 150 95 58 2
2585 2 -52 62 37 -98 -54 132 -8 -173 -14 54 -83 -177 20 91 -101 -121 59 86 -84 -37 59 30 -28 -17 51
2610 51 56 44 48 21 97 79 -42 58 117 -2 -75 -38 113 -33 -121 54 111 -152 -148 20 15 -119 -87 57 -5 -119 -77
$$ packed form
2433i2j0J19nl0j19J40O4j83l1K45k5k07O7K24m2k37R5J82n8j92J69R9j92k6Q6
2458D1Mk9p6J4L7L3j04o5J41j5j08qJ58L3j67KK43j7k91J34J85j38j09J26J38
2483A62j11n6P3N1j03m3Q7K3j13K7l0P8rj24j2J69k7j85L7J92p5j62Q9K07j20
2508B5k30K32J48j46j34K31L3j56K2Q0k0p8L2nN7kj30nO2J00j81n1K36q9k19J05
2534h3K18j48j43J58J32j73o3J36N0r1n6K13l7j46QP6l2N8p4n0J33J5j77Q7J8
2559B9Nk05N9K01j43j60J99J06j61r7K03N8j55l1J79nr3l0J25l2l7N9P6n5l7n6
2585Bn4J14k5j35M4J86j40j65J59O8j37r4J97P1j92k0J80K7j70M7R6k9n8J1O8
2610E1Nj2Mk7P6j8j21J00N9j19p3L7J51j46q8J75N7k63MJ68nj34L2J44o2j14M2
$$ plain form
2637 -77 29 42 6 -5 41 62 83 -55 21 120 97 -117 34 216 9 -135 21 137 -71 -136 28 35 -161 -85 40
2662 40 -26 -136 -51 101 17 -104 -24 -9 23 -18 -32 40 117 14 -77 38 165 4 -80 83 94 -64 -109 44 68
2687 68 -138 -134 153 22 -135 -72 43 -12 -77 -26 -10 5 -26 -12 44 108 50 -37 52 146 15 -55 111 156 17 -13 141
2714 141 116 -94 -56 145 26 -68 -18 104 -39 -103 -56 32 -74 -12 -92 -45 -23 -26 -101 -38 110 -7 -30 115 115 -6
2740 -6 -52 184 152 -23 -4 133 70 -65 26 115 0 -139 -8 71 -3 -87 -21 8 23 -131 -109 -36 -6 -69 -80 31
2766 31 20 -34 -86 77 70 -78 -30 153 81 -42 -12 111 23 -94 12 94 14 -24 2 8 -69 -21 55 -17 -7 -78 -93 30
2794 30 12 -30 -60 27 54 -106 -61 106 48 -53 18 147 22 -70 106 127 -25 -28 -5 71 -29 -45 20 6 -40 -56 -51
2821 -51 5 18 -40 -89 30 -26 -122 -28 76 -9 -118 16 174 80 -42 24 132 -4 -37 72 64 -17 -31 43 37 1 -19
$$ packed form
2637g7J06J3l6j1M6K1K1j38P6R9k3k14J51J82k07j44J56J16k08o5J64Pj96P6J25
2662D0o6j10Q5J52q4j21Q0J5L2m1j4P2P7j03r1J15J27j61q4J63J1j58m5J53K4
2687F8k06MK87j31j57O3J15n5o5N1J6J5l1J4N6O4n8q7Q9R4j31p0J66M5j39l0J54
2714A41k5k10L8K01j19r4N0J22j43o4M7Q8j06O2q0M7K2lp5O3J48j17k3J45%j21
2740fm6K36l2j75J9J37o3j35R1Q9j15j39J31P9p4q4O6K9J5j54K2P3L0o3j1J11
2766C1j1n4n2J63pj48M8J83p2j23L0J23q8j17J06Q2q0l8K6Op7M8P6p2J0p1j5J23
2794C0j8m2l0Q7K7j60M5J67n8j01P1J29j25r2J76K1j52lK3P6j00j6O5j4m6j6N
2821e1N6J3n8m9J19n6r6R4J04q5j09J34J58r4j22O6J08j36l3J09qq1j4P4ol6k0
$$ plain form
2848 -19 -42 -13 11 -18 -41 -2 4 -68 -88 63 -9 -133 -35 136 -46 -112 61 128 -24 -55 79 89 -1 -31 66 86 -36
2875 -36 4 59 24 8 30 21 44 82 -26 -31 7 9 -109 -51 96 -70 -169 -46 76 -55 -88 66 2 -103 -25 110 65
2902 65 14 -5 38 73 23 11 33 39 24 -40 -37 88 -8 -77 -23 60 10 -87 -38 81 -83 -142 23 73 -85 -89 15 81 -51
2931 -51 -28 34 42 -32 13 29 16 8 -22 32 48 -5 -36 -66 76 -18 -119 41 79 -114 -95 9 45 -79 -57 52 20 -82
2959 -82 -25 125 29 -84 -32 42 63 -5 -42 59 73 18 -52 7 28 -47 -52 0 40 -56 -121 80 23 -92 -83 31 67 -77
2987 -77 -36 100 20 -109 -14 13 24 -7 32 -4 51 -26 35 14 51 6 -43 35 48 11 -39 45 77 -97 -44 98 -12 -93
3015 -93 -99 56 -6 -93 -7 72 -50 -59 -16 82 -4 -21 19 61 50 -41 1 41 96 11 -28 65 72 -11 -28 87 41 -47 -51 106
3045 106 3 -77 19 86 -34 -73 -36 15 -33 -51 -26 -31 45 -6 8 -16 97 8 -25 66 62 -47 -29 67 70 -37 -60 41
$$ packed form
2848a9k3K9K4k9k3L9Op2k0J51p2j24R8J71j82o6J73O7j52l1J34J0r0l0R7K0j22
2875c6M0N5l5j6K2rK3L8j08nL8Kj18N8J47j66r9J23J22j31l3J54o4j05P8J35m5
2902F5n1j9M3L5n0j2K2Oj5o4LJ25r6o9N4Q3n0r7M9J19j64n9J65N0j58mJ04O6j32
2931e1K3O2Qp4M5J6j3ql0N4J6n3l1l0J42r4j01J60L8j93J9J04L6j24K2J09l2j02
2959h2N7J50r6j13N2P4K1o8l7J01J4n5p0N9K1p5nN2M0r6o5K01n7j15RJ14L6j44
2987g7M1J36q0j29R5K7J1l1L9l6N5p7O1k1L7m5m9P8J3l7n0Q4L2j74N3J42j10q1
3015i3oJ55o2q7Q6P9j22rM3R8q6j7M0M2j1r1M2M0N5q5l9R3Pq3j7J15m6q8mJ57
3045A06j03q0R6O7j20l9L7N1m8j8K5nP6n1J4k4J13q9l3R1mj09J8R6Lj07k3J01
$$ plain form
3073 41 13 -102 -64 45 -26 -59 13 -33 -51 -39 0 27 -33 -19 -9 27 54 -31 -14 36 109 -18 -47 142 62 -27 -37 148
3101 148 77 -79 -23 138 -11 -86 -2 64 -47 -93 23 -5 -15 -43 -24 20 -15 5 -31 35 56 -18 -74 63 17 -26 40
3128 40 105 4 -69 -13 91 -5 -34 70 82 -31 -46 91 51 -37 -6 -2 -43 19 -43 -73 -11 -18 -69 -72 39 19 -97 -3
3156 -3 69 15 -45 24 112 4 -51 87 94 -56 8 78 73 -61 -53 12 -6 -17 -34 -10 -69 -12 -7 -43 -14 -9 -61 -26 14 -40 -50
3187 -50 9 27 9 -64 47 53 -2 7 51 100 -67 -12 42 40 -32 12 -25 14 -32 -50 8 39 25 -71 6 52 -17 -56 -13 30 -98
3218 -98 -39 14 131 -20 -21 40 32 22 -8 56 42 12 2 77 -14 -11 3 -4 31 2 -6 -21 30 -11 -68 -74 16 12 -87 5 14 -44 -76
3251 -76 34 64 -33 -39 44 43 20 24 43 41 10 39 33 23 18 -25 0 25 -25 -63 -42 53 -20 -70 7 64 -22 -46 21 -13 -87 -64 54
3284 54 24 -79 6 20 3 -14 1 75 -7 50 20 39 -1 41 -43 39 13 -34 -38 -6 15 -83 -81 -3 10 -51 -34 9 9 -81 -55
$$ packed form
3073D1k8j15L8J09p1l3P2m6j8J2L9K7o0J4J0L6K7q5J7N0P3j27k9J89q0q9j0J85
3101A48p1j56N6J61j49p5Q4O6j11m6J16k8j0k8J9M4l5K0l6O6K1p4n6J37m6m3O6
3128D0O5j01p3N6J04r6k9J04J2j13j5J37m0q8L1Mm1O2o2l0O2pn1lJ11k0j16R4
3156cP2n4o0O9Q8j08n5J38Pj50O4P0nj34QO5j8j1j7K4n9N7Nl6K9Nn2L5M0n4j0
3187e0N9J8j8p3J11On5RM4M9j67N5N4kp2M4l7L9m6j8N8L1j4r6P7M6o9l9M3M3j28
3218i8N9N3J17j51jO1qj0l0O4j4l0j0P5r1LJ4pL5k9qj5N1m1n7oR0mr9R2Rn8l2
3251g6J10L0r7oQ3jk3MJ9kl1K9oj0nm3K5K5n0l8K1R5p3n0P7N7q6k4O7l4p4K3J18
3284E4l0j03Q5J4j7j7J5P4q2N7l0J9m0M2q4Q2k6m7mL2K1r8KP8J3o1J7M3%r0K6
$$ plain form
3315 -55 25 4 -34 -16 3 -29 -50 0 30 61 44 -26 40 66 -3 -17 -17 51 -30 -29 51 57 -55 -39 57 21 -89 -7 71 31 -34
3346 -34 0 17 -17 -28 16 7 23 36 -12 8 18 10 -5 27 80 7 -50 30 48 -2 -7 60 16 -60 -27 38 -12 -22 29 18 -73 -9
3378 -9 33 33 -8 -5 -37 4 32 -49 32 13 54 61 -21 32 65 -44 -38 58 -1 -79 -52 85 17 -83 -45 25 -37 1 -2 2 -68 -30
3410 -30 -47 -26 12 -42 1 -14 2 8 2 40 55 -47 1 72 65 -14 -8 97 5 -68 15 31 -93 -95 53 3 -28 0 -11 -1 -17
3441 -17 -21 -32 28 -17 -12 -58 71 36 -13 -32 62 11 -75 -24 51 17 14 11 87 42 -41 10 44 -92 -101 -7 31 -51 -46 30 -18 -2
3473 -2 5 -16 -4 1 -62 -20 66 43 -7 42 115 10 -45 10 98 47 -74 -5 37 37 -26 48 7 -28 -42 -32 -44 -16 -41 -5 -1 15
3505 15 -31 -6 57 -3 -72 3 52 41 -28 -13 107 -13 -33 17 55 34 -32 49 20 -1 -15 46 18 -18 -71 -4 -10 -45 1 -39
3535 -39 -25 -11 -16 -45 -45 -29 -5 -12 22 -8 -34 23 72 -26 -15 64 31 15 34 24 64 8 2 31 -31 67 -7 -15 -14 47 -13 16 13 0
$$ packed form
3315e5Q0k1l8J8J9l2k1N0L0L1j7p0O6K6o9j4%O8q1JQ0Oj12J6R6l6j10Q2P8m0o5
3346c4L4J7l4j1M4rJ6J3m8K0J0qj5L2N3p3n7Q0J8n0nO7m4p6L3O5n0j0N1j1r1O4
3378iM2%m1Ll2M1K8q1Q1j9M1Pq2N3L3j09OR6n9p8K7J37o8j00L8P0o2L8lMp0L8
3410c0j7K1L8n4M3j5J6OoL8J5j02M8P1pp9OJ05r2p3Q3J6j24kJ48n0l1K8j1J0j6
3441a7mj1O0m5Nm6J29l5m9j9R4n1q6N1P5l4llP6m5q3N1L4j36rR4L8q2NP6m8J6
3473bPk1J2No3M2Q6k3n0M9P3j05n5N5Q8n1j21O9M2%o3P4m1l5j4J0j2K8k5L6MJ6
3505A5m6K5O3o0o9P5M9j1o9J5J20j20k0N0L8k1o6Q1k9k1j4O1k8l6n3O7ol5M6m0
3535c9J4J4nk9%J6K4pL4l0k6N7M9r8J1P9l3j6J9j0M0n6oK9o2R8p4qJO1o0K9lj3
$$ plain form
3569 0 -87 33 49 3 -60 -20 38 1 -59 6 72 -85 -34 13 102 -17 -20 49 18 2 29 -18 52 15 -13 0 14 -29 -72 -6
3599 -6 30 26 10 -5 -23 12 -23 23 -14 -52 -46 13 -8 -104 -21 29 9 -41 10 18 15 -35 -48 21 37 -3 -57 47 -42 -28 -45 -33
3631 -33 14 -12 -46 18 83 -58 -6 93 43 54 -22 34 20 -30 49 -18 -1 -61 17 -22 33 -25 -3 25 -3 12 -7 2 17 -25
3661 -25 -75 28 -24 -45 -92 20 -64 -90 -45 27 46 -17 13 33 -5 4 3 61 17 -15 34 60 12 51 -7 64 53 30 -9 23
3691 23 28 -8 -50 30 -20 -71 -16 -17 3 -90 -47 -18 -35 -62 55 0 -9 -46 3 -33 5 -10 -17 17 35 21 -35 26 27 -63 -17 59
3723 59 6 -29 -7 53 -11 -4 -34 71 -7 0 -13 3 -11 0 66 0 53 -43 3 58 53 -53 -63 54 20 -66 -28 29 32 -23 -98
3754 -98 51 3 -75 28 11 -34 -46 1 -35 -36 -6 26 9 -15 38 -9 -14 14 -16 10 50 18 -27 1 38 27 -45 -7 -6 14 -16
3785 -16 -10 43 -23 -35 24 27 -21 -5 -19 8 -6 -20 -96 37 24 -51 -5 -16 14 39 7 56 24 -75 -40 62 65 -28 -9 55 -24
$$ packed form
3569@q7J20J6m6o3M0N8l7o0O5O6j57N1M7Q9j19lO9l1j6K7m7P0l7k8J3J4m3m3O6
3599fL6mj6j5j8L5l5M6l7l8ON9k1r6Q3N0k0n0N1Qln0j3O9J6m0n4J04q9J4j7J2
3631c3M7k6l4O4O5j41N2R9n0J1p6N6j4n0P9o7J7o0P8l9N5n8K2K8k8J5j9RJ5m2
3661b5n0J03n2k1m7J12q4k6M5P2J9o3L0K0l8RjN8m4l2M9K6m8L9n8P1j1k3l9L2
3691B3Nl6m2Q0n0n1N5jK0r3M3K9j7k7J17n5rl7M9l6L8j5pL4J8j4n6O1Jr0M6P6
3723E9n3l5K2O0o4Pl0J05p8Pj3J6j4J1O6o6N3r6M6N5nj06j0J17l4q6L8N7Ln5p5
3754i8J49m8p8J03j7m5j2M7l6jL0L2j7k4N3m7nK8l0K6M0l2m5K8L7j1p2L8JK0l0
3785a6ON3o6j2N9Lm8J6j4K7j4j4p6J33j3p5M6j1L0K5l2M9l2r9L5J02Lr3J9O4p9
$$ plain form
3816 -24 -9 26 21 -45 -15 10 -20 -1 2 -19 -61 17 -49 8 -33 -50 11 -18 14 -29 6 -21 18 21 -53 48 30 -24 -40 38 5
3847 5 5 -29 -18 9 -35 -14 40 -42 40 -22 2 11 -23 -39 -12 39 -11 -22 11 5 3 -44 -11 38 -14 -24 -3 20 -30 -36 20 52 12
3880 12 -15 8 42 -45 -46 -21 14 47 -13 4 -6 19 10 9 34 -63 -35 -3 63 -63 -44 22 31 -30 -18 61 12 18 -15 68 4 -56
3912 -56 -9 -7 -19 -5 -17 35 25 8 -11 -10 -23 -10 11 -7 22 10 -79 24 -16 -26 -45 7 33 -10 16 56 12 -25 22 25 69
3943 69 1 -38 -53 -41 15 30 32 -14 -11 16 -16 62 -28 -56 20 73 -29 -38 -7 -29 -34 -30 62 -4 -41 -12 32 -34 -20 33 23 3
3975 3 -36 -8 36 32 35 -5 11 -6 -85 22 72 -6 -46 21 15 18 -40 -35 31 -15 -2 -40 35 -2 -34 -5 -22 -9 -28 55 16 10 -19
4008 -19 6 -18 39 4 45 -25 -28 34 -67 1 38 14 -33 73 1 7 -11 62 -18 -10 -12 34 -19 -105 30 -32 20 -34 23 -13 -9
4039 -9 -16 -55 3 12 1 -72 -19 -15 19 20 27 -23 -15 -95 29 -44 -36 11 40 23 8 57 35 -1 4 28 17 10 48 73 69 21 -73 -17 3
$$ packed form
3816b4J5L5no6L0K5l0J9Lk1m2P8o6N7m1j7O1k9L2m3L5k7L9Lp4J01j8n4j6P8l3
3847E%l4J1K7m4K1N4q2Q2o2K4Rl4j6K7N1n0j1L3okm7L3M9n2j0K1K3n0oN6L2m0
3880A2k7K3L4q7jK5L5L3o0J7j0K5rjK5r7K8L2O6j26J9O6Ro1J2P9m9Ol3Q3o4o0
3912e6M7Kj2J4j2N2j0j7j9Jj3J3K1j8K9j2q9J03m0j0j9N2K6m3K6M0m4l7M7LM4
3943F9o8l9j5J2N6J5Km6LK7l2P8r0k8P6N3j02rL1k2nMR2o6l7K9M4o6J4N3j0k0
3975Cl9K8M4mLm0J6j7p9J07N0p8m0O7oLn8NO6m6J3l8P5l7l2K9j7J3j9Q3l9ok9
4008a9K5k4N7l5M1p0lO2j01O8L7k4m7J06p2Oj8P3q0QkM6n3q6J35o2N2n4N7l6M
4039ipl9N8Rj1p3N3ML4JPn0Qq0J24p3QM7K9j7j5M9k2l6NK4j1pL8K5mm8r4N6K0
$$ plain form
4074 3 7 -43 -32 -8 17 -42 -54 13 -32 -34 3 46 10 -75 1 34 -22 -8 11 -30 -1 34 63 41 41 29 -11 18 59 1 -48 23
4106 23 41 -33 31 23 14 1 26 57 -24 0 15 -67 -14 -27 28 29 -19 -49 17 -14 37 54 -33 46 5 32 -6 42 15 -44 -48 62
4138 62 -17 -11 -40 45 36 36 -8 6 -43 14 12 22 -7 -16 36 50 47 3 -2 -45 -34 54 15 27 -14 -43 -22 14 19 22 -28 -16 -36 -26 -66
4173 -66 -8 -26 -66 -2 8 37 -8 34 -14 -14 9 33 -55 -12 -19 13 -12 -14 -16 19 69 7 11 65 32 20 -27 22 16 12 64 75 40 -37
4207 -37 -31 -19 -1 14 0 -2 -46 -27 -24 -33 44 -12 7 -69 47 32 -54 9 44 18 -45 26 2 -32 -19 36 29 -34 -11 23 14 0 -3
4240 -3 42 14 6 8 -15 -18 -4 5 3 -12 -23 -9 42 43 12 23 10 28 -45 -1 19 32 36 -8 10 -12 -10 -8 30 -41 -48 35 33 52 -6 -57
4276 -57 27 -20 -47 19 -20 9 0 -23 14 55 -15 -94 35 7 -21 -10 20 -22 -21 25 40 -44 -72 -25 -13 24 -21 -18 -11 -14 -72 -27
4308 -27 15 42 2 -78 -16 53 12 -8 17 24 20 -22 8 26 -19 26 -1 -34 -40 30 15 -3 18 -42 13 -50 -9 -36 -17 -6 61 -4
$$ packed form
4074CMn0J1K4K5n9j2O7m5kL7M3l6q5P6L3n6J4J9m1K9L5K9k2%j2m0K9M1n8m9P1
4106B3J8p4O4qrj3K5L1q1K4J5q2N3j3N5Jm8l0O6l1N1J7q7P9m1K7l8M8k7n9mJ10
4138F2p9Ok9Q5r%m4J4m9N7kJ0k9rN2J4lm4nm3J1Q8l9J2m1k9K1L6NLn0J2k0J0m0
4173f6N8j8m0O4J0K9m5M2m8%K3K4q8M3pL2k5kkL5N0o2MN4l3j2m7M9omN2J1l5p7
4207c7OJ2J8J5j4km4J9LrP7n6J9p6J16j5q6O3L5k6o3P1k4l4J3N5po3K3L4rj4l
4240cM5k8qKk3lJ4Rkj5j1J4N1Jl1J1j3J8p3M4K0J3Mm4J8k2KKL8p1pQ3kJ9n8n1
4276e7Q4m7k7O6l9K9rk3L7M1p0p9J29k8k8J1L0m2JM6J5q4k8M7J2L7m5LPln8M5
4308b7M2K7m0q0O2O9m1k0K5Pmm2L0J8m5M5k7l3oP0j5j8K1o0N5o3M1k7J9J1O7o5
$$ plain form
4340 -4 27 18 -19 -42 32 30 -85 -35 31 20 -36 -18 29 -3 -27 -5 1 -52 10 6 25 40 0 -30 28 6 -4 -18 28 -17 -10 13 4
4373 4 -42 -42 -40 22 -17 -70 -10 15 -5 -16 -19 -42 14 -18 -18 8 20 -8 30 -29 -25 40 -19 -20 39 0 -21 8 -6 32 -44 2 17 23
4407 23 -9 -44 -10 10 30 -24 -2 47 -10 11 -41 -22 41 -20 40 9 -40 -11 15 27 3 13 21 60 -31 -18 -32 -22 -27 38 -6
4438 -6 10 -29 14 37 -52 53 -19 2 -43 45 25 34 -27 40 1 27 -72 58 -58 -20 -8 -26 22 10 -30 -19 -11 8 -62 -9
4468 -9 -19 -8 -48 21 -37 -21 -20 -64 2 -25 -26 30 -25 9 21 -21 5 -32 17 -11 -3 9 -16 -3 1 47 -1 16 12 3 -25 21 -30 2
4502 2 -39 43 -9 -42 -26 -24 -62 2 6 13 -31 -6 12 -20 14 -9 -21 -47 42 -30 -12 54 52 23 2 26 16 -22 -33 0 -21 -35 19
4535 19 17 28 -19 4 9 23 15 52 -1 -41 -39 -1 -30 41 -17 -14 -7 -15 -41 -50 14 30 -7 -36 3 -8 -20 -53 3 -6 -18 -23 30 21 -8 -13
4571 -13 9 59 -1 -43 -33 -44 -8 -47 32 54 26 -28 -18 26 47 -21 0 42 -65 40 -1 -18 -27 -31 4 0 -2 -30 -17 -62 35
$$ packed form
4340dL1rl7k3P4kj15N0O6j1n6J8M7l2k4K2On3O2mJ9J5m0l0N8k2j0j4M6m5PK3r
4373Dm6%KO2l9n3O0K5k0j1lk3N6l2%K6J2k8L8n9MO5n9jN9l9k1K9j4L8p6M6J5O
4407B3l2l5L4K0K0n4K2M9n7K1n2J9O3o1O0l1m9K9K6J2k4J0QL9r1J3j4J0nO5m4
4438fJ6l9M3K3q9J05p2K1m5Q8k0Ro1O7l9K6r9J30j16L8J2j8M8j2m0J1QJ9p0N3
4468ij0J1m0O9n8J6Jm4O6k7jN6n5L4J2m2K6l7M9k8QJ2k5J3MM6m8J7mrk8M6n1L2
4502Bm1Q2n2l3J6Kl8O4MPm4K5J8l2L4k3j2k6Q9p2J8O6kk9k1K4j0l8j1L3k1j4N4
4535A9kJ1m7K3NJ4qL7n3m0KL8k9P1n8LPqk6rO4J6l7k9L9j1j2l3N6rj2nN3rk9n
4571a3K2N0o0m2J0j1L6l9P9K2k8n4J0M4K1o8K1M2j07J05m1j7rmL5mkk8J3m5R7
$$ plain form
4602 35 -23 -30 -4 -4 -3 25 22 -9 32 33 29 -11 -55 2 -12 12 10 -13 -16 7 11 -16 30 45 -9 4 20 4 4 -22 11 -24 10 -51 45
4637 45 -23 -42 4 34 20 -6 3 -45 -2 -43 12 -1 -6 -19 16 -50 -7 11 -4 8 27 14 -17 40 28 30 15 -2 28 15 -27 14
4669 14 10 41 1 14 -29 -49 -4 3 7 -5 15 -7 10 -27 -15 -31 -26 -15 30 18 -24 -22 -45 5 -1 -11 43 32 5 9 19 69 -36
4702 -36 -17 42 28 59 -9 60 29 2 -44 -2 -14 9 23 -32 44 -4 -4 -35 6 -27 25 19 65 70 23 3 36 -25 -17 11 17 -1 -20
4735 -20 29 57 23 -17 -55 -2 -16 -9 -27 -50 -18 11 -33 0 -13 8 25 41 56 -22 -60 -44 25 -4 -11 -17 -63 28 21 -29 26 17 2
4768 2 16 6 -37 -38 -31 -4 19 29 64 -12 15 20 18 -23 8 8 10 -1 -7 7 -25 -7 17 11 2 61 13 42 29 -2 63 13 -26 -8 2
4803 2 37 -11 31 -7 -22 25 7 -37 -40 14 14 -5 -24 -17 9 -21 26 19 -33 -56 -21 45 19 -4 3 -16 9 24 36 3 -20 -42 4
4836 4 21 -1 20 -7 -7 -35 1 27 2 28 -17 -3 -50 -1 -5 6 -8 -73 -32 39 -12 -28 6 9 -6 0 30 -37 -41 10 22 7 15 -7
$$ packed form
4602C5n8pK6%JK8ll1M1Jmm0m4N7j4K4kk3lK3Mk7M6J5n4J3J6j6%k6L3l5L4o1R6
4637D5o8j9M6L0j4k6Rm8M3m1N5j3nj3L5o6M3J8j5J2J9j3l1N7j2Kj5j7L0j3m2M1
4669A4mL1m0J3m3k0M5PMj2K0k2J7l7J2j6NJ1M5j2m2Kk3N0oj0N4j1k7MJ0N0j05
4702c6J9N9j4L1o8O9l1k7m6M2j2K3J4n5P6m8%l1M1l3N2oM6Nm7k0L3o1QK8Oj8j9
4735b0M9K8l4m0l8N3j4Pj8k3L2K9m4L3j3K1J7J6J5p8l8J6O9k9pom6R1pn0N5rj5
4768BJ4j0m3jPK7K3J0L5p6K7Nkm1L1%Kj1oJ4l2J8K4orN9m8K9j3l1O5n0l9J8J0
4803BL5m8M2l8j5M7j8m4lN4%j9j9PK6l0M7pn2k3L5O6k6k3Pj9K5J5J2l3k3k2M6
4836DJ7k2K1k7%k8L6K6k5K6m5J4m7M9mJ1j4o5M1P1n1j6L4Lj5OL0o7mN1J2j5Qk2
$$ plain form
4870 -7 6 9 38 65 7 38 -10 4 -14 52 -16 -43 -3 21 3 -7 -30 20 20 -46 34 11 -21 -48 44 36 -43 15 83 -24 -45 -4
4902 -4 -8 28 -19 33 23 22 18 8 -21 20 24 -4 -19 29 -12 20 10 -17 -17 -15 39 25 12 14 25 -63 -20 13 -8 -5 -26 -12 -15 15 -54
4937 -54 -44 -3 14 -18 -2 28 28 3 -52 -22 26 -11 -17 13 -1 34 -103 15 23 22 -10 25 57 42 23 30 42 35 -38 -23 44 -35
4969 -35 -8 -24 19 22 -14 -14 11 34 -16 8 -8 -31 65 31 58 -39 -11 1 -1 -9 -43 9 42 35 -30 -31 21 3 33 55 44 11 -16
5002 -16 39 -5 -62 -50 26 14 -13 -44 -24 16 -35 2 9 35 -63 -28 55 -64 -14 -12 -51 34 10 -41 -1 50 -20 -10 -2 -25 -41
5033 -41 -17 44 -14 19 -1 19 58 44 -40 52 -44 -65 -27 6 19 -33 -42 2 18 -65 -11 34 -27 11 -38 -18 -24 6 5 -5 -11 -67
5065 -67 -59 29 50 -26 -7 18 -6 2 22 4 18 -28 -23 -22 -12 1 45 6 -8 33 -25 16 -24 10 26 56 55 -14 -10 9 1 3 13 -17
5099 -17 1 24 4 17 -68 -8 -30 -42 -20 -35 -4 -1 36 -15 3 -8 -19 1 32 -9 24 -18 24 -8 42 27 37 21 1 18 60
$$ packed form
4870gJ3LK9K7n8L1m8J4j8O6o8k7M0K4j8j0k3N0%o6Q0k3l2k7R2qp9N8O8j07k1M1
4902dmL6m7N2j0jmj0k9M1Mk8j5M8m1L2j0k7%KN4j4j3KJ1q8M3L3k1Lk1J4lL0o9
4937e4J0M1J7l2J6L0%k5n5L0M8l7oL0j4L5j37J18Qjl2L5L2j5j9PJ2pp3J5O7p9
4969c5K7j6M3Ll6%K5K3n0K4j6k3R6l4K7r7K8J2kql4N2L3po5jN2j8L0K2j1l3k7
5002a6N5m4n7J2P6j2k7l1K0M0n1L7PK6r8L5Q3j19N0Kl9Q5k4n1M0N1p0J0Qk3j6
5033d1K4O1n8L3k0K0L9j4q4R2r6k1L8L3J3n2rM4J6q3N4M5o1L8m9K0oL0jj0on6
5065f7QQ8K1p6J9K5k4QK0j8J4m6NJJ0J3M4l9j4M1n8M1m0L4J6L0jo9MJ9qKJ0l0
5099a7J8K3k0J3q5O0k2j2K2j5L1LL7n1J8j1j1K0L1m1L3m2M2l2N0j5J0j6k0J7M2
$$ plain form
5130 60 -28 8 -13 -8 -1 -37 2 30 26 -28 15 29 15 -51 -10 -43 -25 -1 -43 -24 -18 21 -40 24 -4 -54 -25 -26 -22 -39 -34 14 56 4
5164 4 -3 37 -20 29 22 -24 3 51 57 11 -34 25 -34 -66 30 -2 -36 40 -9 -33 -25 5 21 -2 -27 10 23 5 -26 -13 43 -39 -10
5197 -10 -22 -47 -27 29 -20 -1 8 -12 -17 56 50 -27 0 53 -16 -15 34 31 6 -40 -3 17 34 -41 18 62 0 2 24 48 -13 33 27 47
5231 47 -13 -28 48 -34 2 -12 10 26 -61 -28 19 6 -37 0 49 39 34 -19 -12 -37 5 -5 -37 5 24 -33 7 25 1 -24 53
5262 53 29 -4 -16 -48 -16 28 -6 0 45 -38 -58 -31 -20 -62 33 45 37 27 28 13 22 -21 3 19 -24 -6 34 25 -2 -10 22 -6 -18
5295 -18 38 24 -4 42 -32 1 42 -14 -44 -18 -9 -28 -30 -14 -40 -10 -29 13 37 -20 -32 -5 23 19 -18 -33 -30 -2 -10 -95 2 21 28
5328 28 -45 39 55 20 0 10 -20 -19 0 -13 7 -24 1 47 58 0 59 -36 15 7 1 -26 26 -2 -51 15 53 -9 -41 5 52 -18
5360 -18 -38 8 18 50 -34 -35 -20 -35 -30 -37 41 -43 42 -1 -6 23 -8 17 -32 -3 -27 75 -44 28 32 17 -9 8 -20 21 -19 -51
$$ packed form
5130F0q8L6k1NPl6L9K8mn4M3J4j4o6M1l3J8K4m2J9OL9o1O4k8n0K9jMj7NM8M2n2
5164DpM0n7M9pm6K7M8Om6m5N9n9l2R6l2l4P6m9k4QL0J6k3k5L7J3j8l1J3N6q2K9
5197a0j2k5K0N6m9J9Rk0nP3op7K7N3o9JM9lk5m6L7K0J7p5N9M4o2KK2K4o1M6oK0
5231D7o0j5P6q2L6j4K2J6q7L3M7j3m3L7M9j0nn3Pk5M2j0l2M2J9n7M0J8k4k5P7
5262E3k4l3j2l2L2M4l4OM5q3k0K7J1m2R5J2qj0Jj5Rm3K4J6m3J8M0rk7qL2k8j2
5295a8N6j4k8M6p4L3M1n6l0K6Rj9kJ6k6L0j9M2K4n7j2K7K8ml7j5LK8qq5R7J9P
5328B8p3Q4J6l5k0J0l0JJ9j3K0l1K5M6J1n8N9r5N1qok7N2k8m9O6L8o2l2M6M7p0
5360a8k0M6J0L2q4jJ5j5NpP8q4Q5m3nK9l1K5m9K9k4J02j19P2Mj5k6J7k8M1m0l2
$$ plain form
5392 -51 31 24 8 -63 17 -19 6 -78 -34 2 -8 -17 12 -6 -23 7 -16 -21 -45 -32 -48 48 -25 -10 12 -22 10 -21 9 -7 28 1
5424 1 -14 34 85 -16 18 11 -24 -21 -8 34 20 4 -28 -11 -11 -14 1 11 13 4 -26 -24 24 -31 30 46 45 -35 15 22 22 -68 -50 42 38 31
5460 31 15 14 -19 33 21 -53 39 -67 -15 10 21 57 -10 44 -4 8 -30 -23 25 10 -13 40 45 4 12 53 -25 -16 -18 -62 16 -18 22
5493 22 14 44 14 -49 -45 2 28 10 55 25 0 16 45 42 41 7 54 -6 4 6 69 -9 -42 9 -8 23 -27 26 26 -41 17 8 -34 -34
5527 -34 -13 -51 1 -12 -29 -12 -4 -53 -37 -28 7 -20 16 9 8 -21 -8 -1 27 -49 -32 105 53 26 22 40 -21 30 -11 22 18 -1 -17
5560 -17 -4 36 2 2 33 -33 -40 -28 -37 18 -58 -22 1 11 -4 -70 -18 -30 -18 45 34 -39 20 -28 -18 -23 10 -30 -42 39 6 -45
5592 -45 5 7 -47 16 28 -9 16 -4 -14 2 -34 -10 0 41 -39 -23 10 -42 -19 16 44 -4 -14 -42 7 -14 13 -37 7 -6 -19
5623 -19 -47 16 -24 -24 -18 3 -21 11 1 25 56 22 -48 -49 -16 8 25 -32 24 54 -3 -25 37 32 -44 -22 -5 -46 45 -12 -6 33 -39
$$ packed form
5392e1Q2pj6p1Q0l6K5q4M4L6j0rK9j8j7L0k3nk4J3j6R6p3J5K2l4L2l1L0j6L5k7
5424Aj5M8N1j01L4pl5LJ3M2j4j6l2J7%lJ5J0Krl0KM8n5O1J6jq0N0P%r0J8R2mp
5460C1j6jl3N2j2p4R2j06N2K5J1L6o7N4m8J2l8PM8j5k3N3Nm1QM1p8Rkm4P8l4M0
5493B2qL0l0o3MM7K6j8M5l0k5J6K9ljl4M7o0J0KO3p8l3N1j7L1n0N3%o7N8rm2%
5527c4K1l8N2j3j7J7Qm9J6RL5k7L6pjk9J3PK8p6J7J37n2k7mJ8o1N1m1L3mj9j6
5560a7J3M0l4%L1o6pJ2rN5p6L6K3J0j5o6N2j2J2O3j1p3N9m8J0nL3m0j2Q1l3n1
5592d5N0Kn4O3J2l7K5k0j0J6l6K4J0M1q0J6L3n2K3L5K8m8j0k8M9k1K7n0M4j3j3
5623a9k8O3m0%OK1k4L2j0K4L1l4p0jL3K4J7n7N6L0n7k2O2np6K2J7m1R1n7OL9p2
$$ plain form
5656 -39 27 16 -37 -83 -22 20 -18 5 -53 -5 -16 -28 -48 -39 -4 59 -12 83 -8 11 8 -28 7 26 -2 -14 1 -31 -39 18 -12 -13
5688 -13 -44 34 -14 -13 12 -14 14 -25 16 19 -43 43 12 14 -30 28 -32 24 10 -38 18 1 -22 -58 -1 -20 -26 -12 45 6 14 15 -18
5721 -18 16 -2 -28 23 53 31 -15 -49 -21 -25 -8 56 -70 25 -37 19 33 -20 -41 -45 -12 20 -22 -20 6 -7 2 0 12 56 -36 54
5753 54 -35 -14 -30 -35 0 -1 2 -7 60 -33 -11 -27 31 52 38 26 30 5 -14 -4 -15 9 -56 66 -49 -31 -16 7 -13 31 -4 3
5785 3 2 -13 -16 13 -11 -27 -68 5 -3 -30 -15 13 19 23 -41 17 56 13 22 6 21 -28 32 91 25 -35 58 14 -47 8 -6 14 30 -2
5819 -2 26 32 -17 39 -11 0 4 -40 -16 -39 -1 -30 -28 28 38 -45 -30 19 21 -55 -5 -21 27 8 25 -8 6 19 -33 31 -9 -12 -6 24
5853 24 8 24 -15 19 39 8 -41 26 -47 25 0 17 17 -42 -10 6 45 25 2 -13 3 -36 29 1 -6 3 50 -25 28 -23 35 -65
5885 -65 59 -14 -3 -9 -66 -14 14 17 -16 -30 28 52 -22 11 2 64 -39 -62 17 -37 -24 -18 -13 38 -13 -22 -1 24 50 3 24 -94
$$ packed form
5656c9O6j1n3m6O1M2l8K3n8M8j1j2k0RL5O3p1R5r1J9ll6L5J9k8j2J5l2qN7l0j
5688a3l1P8m8JK5k6K8l9M1Lo2Q6l1Km4N8o0N6j4m8N6j7k3l6N7j9oJ4N7l9QJl3
5721a8L4j8k6N1L0k2m6l4K8mJ7O4j26R5o2N6J4n3k1mL3L2m2KK6j3RkJ2M4r2R0
5753E4q9K1j6nL5jLrO7r3K2j6N8K1j4j2Mk5j9J0j1K4o5J22j15J8J5K3k0M4l5P
5785Cjj5lK9k4j6m1P3qk7J5K8OMo4N8L9m3Rj6J5m9O0N9o6o0R3m4o1N5j4K0J6l2
5819bK8Om9N6n0J1Mm4K4k3L8k9KN6J0q3J5M9Kp6N0j6M8j9J7l3J4J3n2O4m0lOL0
5853B4j6J6l9L4K0l1m9O7p3P2k5J7%n9L2J6L9k0k3j5J6l9O5k8pRM7p5N3n1N8j00
5885f5J24p3J1on7N2K8Ll3j4N8K4p4L3rO2j03k3P9n4J3ONN1n1rK1K5K6m7K1j18
$$ plain form
5917 -94 -9 37 -17 -29 -40 -32 16 81 28 -27 24 9 -3 -11 55 33 4 56 -24 -66 -26 45 20 0 8 36 -3 5 -58 -1 -24 22
5949 22 -24 -9 -39 4 3 -39 -31 2 32 -22 -8 -17 -9 11 31 -12 -30 -9 14 15 -10 -15 9 21 -7 35 -20 12 -8 -50 -31 25 0
5982 0 -27 19 32 38 39 6 -13 -27 -49 32 1 20 15 46 20 -38 -32 -32 0 -41 -9 -18 -51 26 -50 -27 2 20 -38 37 26 -39 22 14
6016 14 36 -25 29 34 15 -11 -29 -12 7 -23 46 -15 52 -4 15 -10 27 32 -3 12 14 7 -41 -53 -19 -58 -66 26 30 -18 -31 -31 -12 10
6050 10 -25 37 67 -57 31 -32 -14 11 4 15 30 -9 -14 65 12 -17 -10 -12 34 -24 -18 -4 -14 -30 -6 14 -37 -17 13 44 2 8 6
6083 6 -1 -28 -41 -34 -24 6 -24 -36 23 3 11 -58 34 25 -14 18 71 -5 21 6 -8 50 -9 11 -22 -20 12 34 -5 1 14 -4 -15 -19
6117 -19 -32 67 16 -28 11 -75 43 -38 -54 -1 5 -10 -60 57 55 -26 -6 -30 6 -31 -50 -16 30 53 -49 -10 -52 -15 -9 -10 25
6148 25 23 -9 11 1 44 -46 9 20 69 3 16 13 13 37 -8 -64 -51 -24 0 -24 -9 -18 -38 -22 -25 0 -22 -19 -9 -7 -10 -3 -30 -22 -20 3
$$ packed form
5917i4Q5M6n4j2j1QM8O5n3n5N1j5j2qO6k2k9N2q0m2M0P1k5k0QK8l9Qo3N7k3M6
5949B2m6J5l0M3jm2QL3L0n4J4rQK0K0m3j8K1K3Jk5nK4J2k8M2n5L2k0m2J9N6k5
5982@k7M6J3OJl3j9j4k2Q1l1J9nL1k6n8O%L2m1L2rl3P7p6K3K9J8n8P5j1o5O1q
6016A4K2o1N4Nj9k6j8J7J9l0O9o1O7n6J9k5L7Nl5J5Kpm8j2L4l9qR2Mm8j3%J9K2
6050A0l5O2L0j24Q8o3J8K5pJ1J5l9nP9n3k9PkM6n8OJ4j0j6K4K0n1K0L0L1m2Ok
6083Fpk7j3PJ0L0l0j2N9k0Qo9R2rl9L2N3p6K6j5j4N8n9K0l3KL2K2l9OJ3j8j1m
6117a9j3R9n1m4L9q6J18q1j6N3Oj5n0J17kq1K0k4L6l7j9L4M6K3j02L9m2L7OjL5
6148B5kl2K0j0M3r0N5J1M9o6J3l%K4m5n6J3K7K4k4J5rk0J6lK5k2LJ0KlPk7QKK3
$$ plain form
6184 3 31 12 -20 79 19 -22 32 76 54 4 -43 80 -69 0 68 -4 17 -33 21 20 -8 -50 -6 24 18 -16 -42 2 11 -50 -49 -23
6216 -23 -17 -38 -38 -13 24 15 46 43 -34 -3 0 13 -5 51 51 60 32 -52 7 -31 24 -31 -14 19 10 -61 -19 -7 49 -14 7 60 -54 -18
6250 -18 -20 28 34 -30 29 14 2 -1 30 52 -3 -38 6 32 -27 -5 -4 2 76 14 44 6 -33 -19 -35 44 -60 -39 21 39 64 -63
6282 -63 -52 24 26 23 32 37 -77 -56 0 20 10 -22 4 -39 4 -17 -50 6 1 -29 -49 4 -2 -25 32 47 23 -77 8 25 -24 38
6314 38 45 88 7 17 1 22 1 10 26 27 -44 21 9 -20 37 23 20 -16 2 -28 30 -85 -49 -23 38 -18 -24 -35 -36 31 -23 -25 -35
6347 -35 11 -30 -20 38 -42 9 -23 48 25 13 -19 57 8 6 15 15 67 -4 -29 89 -19 1 -2 3 12 -58 -18 4 6 -44 -5 31 -10
6380 -10 -49 4 44 5 -18 44 3 18 -20 27 -15 24 2 20 30 7 -27 -35 -26 17 -49 -15 5 -10 -29 2 32 17 -31 -61 -14
6411 -14 16 -3 0 -12 3 -1 -6 2 -38 -48 17 -33 -46 -13 -45 60 -9 8 38 -21 5 -37 4 -16 -29 -36 30 -32 -52 -19 1 -9
$$ packed form
6184CK8j9l2R9o0m1N4M4k2n0m7J23j49O9O8p2K1n0N4jk8m2M4L0ol4k6M4Ro1JK6
6216b3Ok1%K5L7rL1lp7L1LJ3j8N6%Rk8q4N9l8N5n5J7L3rp1M2J2N6o3K1N3j14L6
6250a8kM8Oo4N9j5j2lL1K2n5l5M4K6n9K2JOP4o2L0l8l9J4j6P9j04K1O0J8K5j27
6282f3J1P6KlRNj14K1N6K0j0l2K6m3M3k1l3N6nl0k0N3ok3N7J5k4j00Q5J7m9O2
6314C8PM3q1J0j6K1k1RJ6Jp1O5j2k9N7j4ll6J8l0N8j15L6K6O1n6oj1jO7n4kj0
6347c5M6m1J0N8q0N1l2P1k3j2l2P6m9kR%N2p1k5J18j08K0lNRp0M0K2Kn0L9L6m1
6380a0l9N3M0l9k3O2m1J5l8M7m2L9k2J8J0k3l4qRM3o6L4K0j5j9L1L0j5m8l0M7
6411a4L0j9Lj2J5mnQm0j0O5n0j3L3l2J05o9J7L0n9K6m2M1k0j3pO6o2k0L3K0j0
$$ plain form
6443 -9 -6 12 -17 30 23 37 34 10 55 24 -38 -10 -17 6 -63 -6 39 -4 -9 -17 -31 -42 18 -21 -12 -16 6 -13 -25 3 -25 6 46 -7 -6
6478 -6 50 34 34 -47 70 19 -26 -26 9 34 -17 -43 28 -19 -33 13 42 -41 -17 7 46 -15 -80 -10 50 25 -43 -26 37 1 -42
6509 -42 1 11 8 26 -10 -9 9 27 28 -25 33 -8 37 63 35 9 76 -19 -42 -24 -3 -16 -21 -25 26 56 -5 14 -1 25 19 33 23
6542 23 38 3 14 12 16 -60 -8 44 -5 -6 -107 -12 0 -46 -11 8 -43 -4 13 9 -27 46 -3 32 16 -13 -49 -30 8 6 18 27 -23
6575 -23 -23 6 -13 60 36 43 20 10 -22 -16 3 -32 21 -13 -6 0 -23 -31 -4 -28 -21 -34 64 26 -8 -8 4 -13 -20 -17 -17 -28 -74 -7 -25 64
6611 64 5 9 39 34 -59 53 -5 3 -14 19 30 57 -19 66 -51 -1 -13 -7 -33 31 -21 -6 15 -2 7 -48 21 22 -23 14 -2 -32
6643 -32 -8 -8 4 24 -7 12 -44 37 -21 -7 -17 50 47 -7 28 0 20 -64 29 3 51 -17 69 16 -8 -18 20 25 -73 -12 27 -13
6675 -13 11 -33 35 45 -53 -10 60 -69 -19 37 -2 -10 31 18 -39 -4 -30 -27 25 -5 -64 -11 -4 -29 29 -28 12 -6 -10 -38 12 17
$$ packed form
6443iLJ8k9M7pJ4lk4M5l1o2K8pK3o9N7M5m3nqj4j1O0l9RmK2j9j2K8k8L1M0n3J
6478fN6j6%q1J17n1m5%L5K5n1k6P1m7j4M6K9q3K4K4L9o1o5P0O0k5o8J7O3l6m3
6509d2M3J0lJ8l6JJ8J8Jn3N8m1M5K6k8k6O7r5k3J8K1j3nmN1L0o1J9j5K6oJ4j0
6542B3J5l5J1kMp6N2N2m9jj01R5J2m6L5J9n1L9J7ml6P3m9L5j6k9l6J9L8kJ2Rn0
6575b3%K9j9P3k4Pk3j0l2OJ9l5N3l4POk3qK7k4Pj3R8l8l4%J2j7pL%j1m6O7j8Q9
6611F4n9ML0nr3J12n8Qj7L3J1K7p6Q5j17N0j2Ok6O4n2J5K1j7Rn5O9Jm5L7j6l0
6643c2K4%J2K0l1J9n6Q1n8J4j0O7ln4L5k8K0q4R3k6M8o8Q6n3k4j0L8Nr8O1L9m0
6675a3K4m4O8J0r8M3P0j29N0N6l9qM1j3n7L5k6LN2l0n9N3Pk5N8n7M0j8mk8N0N
$$ plain form
6707 17 27 -27 -9 -15 12 -3 22 27 -19 34 -23 4 -70 10 14 -38 -99 -31 38 46 -36 12 -23 13 44 -16 16 1 25 -33 -8 30
6739 30 3 -15 -33 35 18 -56 -17 4 -36 -40 8 -40 73 20 -8 38 -9 11 4 -19 -12 -3 -20 4 -44 -53 -3 -17 16 -31 -11 37
6771 37 -7 35 -20 18 35 -14 -18 25 -8 32 6 20 1 27 4 6 -49 -22 10 -6 5 -33 8 -3 -26 23 44 -27 -40 -70 -21
6802 -21 -22 -40 -20 49 -15 -24 -41 -25 -13 -8 -17 11 -14 -20 -49 21 -49 -44 -28 17 -46 -74 -9 -10 -3 5 12 22 13 -2 32 15 30 37 12 48
6838 48 -21 -52 12 35 20 -2 20 12 -13 0 7 34 -5 -36 -57 -36 -44 -14 21 -40 -9 21 36 -19 3 -10 -20 22 49 20 7 85
6870 85 36 20 -14 32 -33 7 19 -33 5 -30 34 -13 8 -13 -2 4 -33 -79 53 57 -32 -33 -34 -16 -59 -11 -26 5 -34 -15 -21 11
6902 11 -3 -17 35 19 17 -47 18 18 -18 -22 30 38 -24 21 36 40 -7 23 -21 57 -5 -20 34 -2 -34 2 -28 12 -32 9 -32 24 -84
6935 -84 -32 35 -52 -3 45 7 -19 22 -22 31 -15 -105 -24 58 -28 21 -22 24 -14 -20 -66 12 18 12 42 44 -62 32 42 72 11 -46
$$ packed form
6707A7J0n4J8oK7j5K5Nm6N3n7K7p4Q0Mn2o1O8O9Qq2M8l5L6L1o0L2j5K4n8K5L8
6739C0k7j8j8O8j7p4L9K1m0mM8m8J13n3k8M6m7K0pk3PRj7K4m8rN0j4L3m7K0M8
6771C7m4M2n5L8J7m9mM3l3M0k6J4j9K6k3Kn5K7L2j6J1l8M1j1k3M9K1p1j3l0M9
6802b1jj8K0O9o4rj7J6J2NrK8k5ok9P0p0NJ6M5o3k8O5jPQPJ0rj5L4j7J5Pk5L6
6838D8o9l1O4K3j5k2K2qk5J3PK7l9l1k1K1qL0L5o1L1L0J5n5K2j3j0M2K7k9j3P8
6870H5m9j6l4M6o5M0J2n2L8l5O4m7K1k1J1Ol7m6J32Mq9jjJ8m3M8j5L1l9J9oL2
6902A1j4j4N2j6ko4O5%l6mN2Qo2M5J5Mm7L0m4P8o2j5N4l6l2L6l0M0m4M1m1N6j08
6935h4N2O7q7M9M8l8k6M1m4N3m6r0Q1Q2q6M9m3M6l8om6P8OoL0Kj06R4J0L0o1n7
$$ plain form
6967 -46 25 14 -1 -22 -84 6 15 -52 14 -2 -5 0 50 -20 64 14 -27 -59 50 14 -69 17 -5 -1 -55 64 49 -13 -48 64 40
6998 40 15 -4 39 25 14 -30 40 -21 -13 16 14 6 -39 -28 -35 14 -29 -48 -29 -27 10 -12 -68 49 -51 -10 23 3 -16 -6 45 32
7030 32 -9 -10 19 76 -1 28 16 -17 -36 57 33 60 -7 -15 58 18 -11 6 29 -41 26 -13 27 -10 1 50 27 -23 1 -24 12
7061 12 -33 -40 39 48 24 -14 15 37 24 1 2 59 5 16 -13 29 -1 -57 10 29 -33 -56 28 24 34 -6 27 4 42 -56 5 2 35
7094 35 -24 31 -18 -64 -17 60 -4 35 -35 -4 36 15 -49 -21 -17 18 -97 -43 -3 35 14 -9 4 -9 -16 23 42 -44 -7 19 -3
7125 -3 -30 23 15 20 33 -25 37 64 14 14 28 17 77 -4 -4 18 21 -31 -3 1 -40 -16 32 8 -48 5 -28 4 -20 -14 -10 -28 -40 17 23
7160 23 -1 16 -25 -20 33 -3 11 39 28 9 -7 -1 59 31 41 -34 40 -2 -16 2 -15 -46 9 -2 45 12 32 -6 -59 11 15 -13
7192 -13 51 19 -36 2 22 -27 -87 -10 22 31 -14 26 47 -22 2 51 9 -12 -49 42 30 44 21 5 27 11 -30 3 7 -18 24
$$ packed form
6967d6P1j1j5k1o2R0Ro7O6j6lNN0p0Q4n0m1l2J09l6q3Q6k2Mn4J19j5o2l5J12k4
6998D0k5j9M3j4j1m4P0o1QK9kqm5J1pM9m3j9J9KL7k2n6J17j00M1L3k0j9J0N1j3
7030C2m1jK9N7p7K9j2l3j9R3k4K7o7qP3m0k9J7K3p0O7l9M0l7J1M9k3n0K4k5L6
7061A2m5pP9Rk4l8K9K2j3k3JN7n4J1k9M2l0n6O7J9o2k3Q4mJ0m0L3k3L8r8O1lL3
7094C5n9N5m9m6M7P7o4L9p0L1M0k1o4K8ML5j15N4M0L8k1k3J3j3pL9J9q6L7K6k2
7125ck7N3qNJ3n8O2K7n0%J4j1O0q1%K2Ln2K8Mm1K4M8k4n6N3l3L2k4OMj8j2N7O
7160B3k4J7m1NN3l6J4K8j1j9j6OO0k8J0p5P4m2j4J8j7l1N5j1M7l3K0l8n3P0Mk8
7192a3O4l2n5L8K0m9o0P7L2Rm5M0K1o9K4M9m2k1l7R1j2J4k3j6K2j6m1L3Mk5M2
$$ plain form
7223 24 78 56 -27 -9 -22 53 16 -17 17 -22 4 -3 -20 -25 -44 -26 -5 35 -49 -55 -52 38 12 8 -1 -10 20 37 -40 -47 -41 15 -29 -12 25
7258 25 19 85 23 -7 40 49 40 -18 -28 -43 -28 -19 -38 13 18 -11 15 -1 9 8 -40 27 -25 -27 23 34 -16 3 29 24 77 22 -26 -20 -29
7293 -29 -7 -16 64 -11 11 -8 56 -29 -20 -59 18 15 -22 10 -2 14 -17 -27 -15 -24 5 -38 -11 -3 -63 10 -31 50 -46 -14 11 8 37
7326 37 -14 40 56 -20 -41 10 16 57 -15 35 8 8 -32 -19 -19 -1 -44 8 -18 -10 23 -37 32 -11 45 1 -1 7 -27 -9 -3 3 -4 -8 -9 -46
7362 -46 -21 3 18 14 18 -9 -22 -72 -30 -1 -89 22 -63 54 28 1 34 31 -11 14 34 -1 17 2 -15 71 50 -12 -9 23 -19
7393 -19 14 29 -31 -16 -40 -8 -22 0 -36 17 7 6 -5 -8 -19 1 36 -14 33 -25 -21 -1 5 -18 11 -6 28 -24 17 35 -5 -25
7425 -25 -20 -12 -32 14 -45 -23 25 -24 9 -43 24 -83 -38 -35 41 3 -51 39 3 -66 -22 -31 -48 41 -14 50 9 -14 -19 -4 -17 15
7457 15 -8 36 1 30 -5 13 13 -3 2 -9 -27 16 3 -31 7 -40 17 68 121 29 -20 -8 -51 8 -24 -15 -32 16 -27 10 25 13
$$ packed form
7223B4N4k2q3J8j3P5l7l3L4l9K6pj7nj9J8K1M0q4oLR0k6mrrL0J7p7pON6m4J7L7
7258B5oO6o2l0M7Rrn8j0j5J5Rj9N1Nk9K6j6J0jm8O7n2kN0J1n0J9K6nN3n5m8Or
7293b9K2rQ0p5K2j9O4q5Rl9P7ll7L2j2J6l1j0J2rK9m3K7Qo0P3m1Q1r6L2K5lK9
7326C7n1N4J6p6k1N1OM1p2N0k7%m0J3%J8m3N2k6QL3o0O9m3N6m4kQl4J8OOpmjl7
7362d6K5K4J5mMk7j3n0M2K9q8J11q5J17k6k7L3lm2K5K0l5J8j5j7Q6k1o2LL2m2
7393a9L3J5o0J5k4L2j4K2l6N3j0jj1lj1K0L5n0M7n8MK0Ok3K9j7L4n2M1J8m0k0
7425b5NQk0M6n9K2M8m9L3n2O7j07M5LP6l8n4R0l6o9M4rj7Q9n5O4m1k3nJ5j3L2
7457A5k3M4l5K9l5J8%j6Nj1j8M3j3l4L8m7N7N1N3r2m9J2m3N9l2Rj7M8m3L7J5j2
$$ plain form
7489 13 48 -19 2 -12 -5 54 -23 1 50 -7 15 39 -25 50 -31 -15 -6 51 13 31 18 83 -6 12 7 13 15 21 69 -15 53 61 -1 -34
7523 -34 29 -4 22 -3 42 -24 -24 -39 14 -23 29 43 -16 21 3 27 -38 -42 -19 19 16 -14 9 8 -7 11 110 -4 -23 -22 6 8 71
7556 71 -33 -11 11 67 -29 -19 8 -15 -15 -40 -7 18 -35 -22 -10 -23 1 -8 -11 -60 53 -24 -17 -7 68 -20 -3 18 -5 37 44 28
7588 28 -23 3 10 0 -20 43 30 12 -4 12 15 -16 18 -31 47 63 -26 -16 13 -19 -37 36 -8 -13 2 12 -13 -12 -21 -40 -21 24 19
7621 19 -22 40 -90 -22 35 46 -54 9 17 20 -54 -21 33 2 -2 35 -37 24 3 32 -36 87 3 39 -66 4 -5 -45 -6 17
7651 17 16 7 -46 12 -22 -13 65 -19 29 9 5 66 3 -28 11 -28 -27 -50 -11 -8 25 -34 16 29 -12 44 13 0 6 35 40 19 35 -1
7685 -1 -23 20 40 -27 25 14 -24 -55 28 -50 -21 -22 0 -46 -14 -30 -88 -6 -33 -20 -9 40 24 -19 -23 -6 1 37 -20 10 7 25 -7
7718 -7 8 16 15 75 15 28 -30 37 -33 -3 -22 -36 -1 20 -83 13 9 8 -46 -15 -9 28 6 -24 -23 -53 -2 20 -33 4 -52 1 -50
$$ packed form
7489A3L5o7K1j4PN9p7K4M9n7K2K4o4P5q1J6RN7l8J8j3O5q9J8nOKOM8q4O8Qo2l3
7523c4O3l3K6k5M5o6%j5N3l7N2J4n9L7j8K4o5mK3L8ll0K3jj5J8R9j14j9JK8KO3
7556G1j04K2K2N6r6J0K7k3%k5L3K5n3J3J2j3K4rlm9J13p7PJ0P5q8J7K1k3M2Pj6
7588B8n1K6Pj0k0O3j3j8j6J6Ll1L4m9P8J6q9J0K9l2j8P3m4nJ5J0k5Jrj9J9M5n
7621A9m1O2j30O8N7J1j00O3QLp4L3N4l1mL7p2O1k1K9o8J23q4L6j05P0rm0L9K3
7651A7jrn3N8l4RP8q4M8k0mO1o3l1L9l9Jk3L9LL3n9N0J3m1N6l1j3OK9Nk1J6l6
7685ak2M3K0o7N2j1l8l1Q3p8K9jK2m6L2j6n8Q2k7J3J1M9j6m3mJ7PL6n7L0lJ8l2
7718gJ5QjO0o0J3n8O7p0L0j9j4L5K1j03R6mjn4L1OL7k2l0Jl0N1K2n3L7n6N3n1
$$ plain form
7751 -50 24 3 -22 69 -23 -73 -31 -17 12 -4 -5 24 12 49 0 43 15 10 29 14 -24 -19 4 12 -1 -37 15 36 -20 -58 8 -1 37
7784 37 -3 44 52 10 -22 -39 -28 -14 7 2 59 -9 1 28 87 -19 -59 40 11 38 -19 55 -28 19 -1 7 -4 22 -6 17 62
7815 62 18 9 16 23 -51 -54 5 9 -54 6 -12 -23 -69 -66 28 37 -39 -12 -26 14 -32 9 -24 24 66 47 28 92 29 -38 13 2 24 -38
7849 -38 -33 22 26 -34 -35 26 -14 20 -36 50 -64 8 5 7 -34 -4 30 -3 -5 -21 -20 -9 47 -76 -6 29 47 -56 3 21 4 52
7881 52 -19 8 -78 -32 -1 -7 -36 -21 26 44 -19 -22 24 9 -40 -5 -7 -36 20 19 21 27 -5 16 -16 -34 23 -87 -9 17 -18 10 25
7914 25 29 -22 -41 12 -19 -32 12 28 -22 -33 23 3 2 -20 -45 -17 39 -5 0 36 -3 17 59 48 19 -30 -28 7 -6 -56 -15 40
7946 40 -18 -44 3 -24 -63 -34 -3 -18 -1 -19 -19 9 17 -18 -47 -34 22 -30 28 4 -30 -3 13 8 35 10 -3 -22 -12 3 8 33
7978 33 35 -16 6 36 22 -24 54 8 6 -15 23 -41 -1 -17 -29 -15 42 47 7 37 -44 -31 0 14 0 -10 -42 -10 -17 -30 -13 -12 -13
$$ packed form
7751e0P4k1k5R1r2n0M2J4K9j6jK9j2L7m9M3k8nJ9j5l8NK3Qj3l6N2K1n6l8O6rL8
7784C7m0M7Qm2l2j7J1J4K1nN7o8J0K7N9j06m0R9k9K7n7P4q3M7k0Qj1K6k8K3M5
7815F2m4rPPp4lN9Mo3O0j8j1m6LR4Rp6K7j4M0m6M1l3M8M2j9j9O4o3o7N1j1K2o2
7849c8NN5Mo0jO1m0L4n6Q6j14P2lKm1L0L4l3kj6JJ1N6j23P0L5J8j03N9J8j7M8
7881E2p1K7q6M6L1ok9J5M7J8o3lM6j5m9L5kk9N6jKOl2K1l2j8N7j10P8K6l5K8J5
7914B5Mn1j9N3l1j3M4J6n0j1N6k0jk2k5K8N6m4NL6l9K0M2j1k9m9KL5j3n0M1N5
7946D0n8k6M7k7l9K9L1j5J7j8%K8Ql5k9J3N6n2N8k4l4K7J6nK7k5j3j9J0J5NK5
7978C3Kn1K2L0j4m6P8m6kk1L8o4M0j6j2J4N7Nm0L0q1J3L1J4j4j0l2L2pj3J7Jj
$$ plain form
8011 -13 58 -3 -39 -27 -25 -4 9 -26 -12 -1 23 12 -10 28 53 18 -1 5 -2 -30 -42 25 4 -30 -43 -25 10 -43 -34 -45 -30 -57
8043 -57 17 -68 -27 -61 -33 -22 -42 47 3 -54 27 40 -8 -10 -66 12 11 -31 26 -7 10 36 28 -8 5 1 17 35 16 25 -36 4 -63
8076 -63 -22 -21 6 -35 7 -15 -37 -16 -26 -20 7 -33 -1 17 14 -25 -3 40 -13 -29 32 30 -50 21 34 -18 -3 -31 16 73 -38 -24
8108 -24 5 -26 33 19 18 11 64 -51 -39 -10 -2 -54 -19 8 -28 -81 50 0 -21 0 27 -27 -34 -52 20 -64 -54 27 -2 -41 23
8139 23 -21 -2 30 23 -24 -49 13 -11 -5 22 -14 9 -24 12 -28 -3 -37 10 11 -24 -10 29 -9 6 0 -6 15 -51 -29 -23 -34 -19 -7
8172 -7 2 29 -68 -22 55 20 -16 -8 -16 -22 -38 -5 16 25 43 -11 -9 17 34
$$ packed form
8011a3P1o1l6J2KK1J3l5J4J1K4j1k2L8K5l5j9Opk8j2O7k1l4j3J8L5n3Rj1J5k7
8043e7P4q5M1l4K8J1k0Q9m4n7Q1J3m8kn6P8jm2N7l3J7K6ql6J3mJ6J8j9Ro1M0o7
8076f3M1JK7m1M2k2k2K1j0OK7m0L2J8ll9K2M3n3j6O1kq0P1J3n2J5k8M7N7j11J4
8108b4K9l1N9j4jpN3j15J2K9Qn2L5K7l6n3J31n0k1K1K7n4pj8P2q4J0Q1k9l9O4
8139B3m4J9L2pm7k5O2k4OK7l6K3l3L6m0K5l4M7Jl5J4L9l8J5ooK1o6K2Oj1J5J2
8172gRK7r7M6P7l5l6Qqoj6L3K1RJ8n4KK6J7
8191C4
$$ Imaginary data points
##PAGE= N=2
##DATA TABLE= (X++(I..I)), XYDATA
$$ plain form
0 0 0 0 0 0 0 0 0 0 0 0 0 0 0 0 0 0 0 0 0 0 0 0 0 0 0 0 0 0 0 0 -6 8 -8 8 -8 8 -8 8 -9 14 -15 16 -16 17 -22 23 -24 28
48 28 -31 33 -38 40 -46 48 -55 60 -68 75 -85 94 -107 122 -141 167 -202 253 -333 485 -870 4886
70 4886 2997 -3249 1034 3243 -78 -2372 878 1034 -1209 -1531 -112 -285 -549 -1253 -1287 2 567
87 567 -1422 -1564 914 894 -1957 -1123 1906 1012 -1797 -274 2662 1161 -1294 625 2860 687 -1212
104 -1212 944 2149 -331 -1478 639 995 -981 -1322 -87 47 -592 -1078 -1029 134 351 -1421 -1471 980
122 980 886 -1944 -936 2083 590 -1928 373 2507 136 -1201 1283 2116 -83 -554 1033 1282 -125
139 -125 -600 143 532 -123 -858 -541 166 -228 -1240 -911 222 -168 -1392 -844 771 117 -1541 -364
157 -364 1641 198 -1495 590 2106 -21 -974 1354 1696 -441 -296 1259 761 -382 47 365 66
$$ packed form
0@%%%%%%%%%%%%%%%%%%%%%%%%%%%%%%oJ4j6J6j6J6j6J6j7K3k9L1l2L3l9M5m7N2
48B8n9O4p1P8q6R4j03J15j28J43j60J79k01K29k63L08l69M55n86Q18j355N756
70D886j889o246M283K209l321k294L250J56k243l22J419j73k64p04l4J289N65
87E67j989j42K478k0k851Q34L029q94k809J523K936j501k455J919K235k173j899
104a212K156J205k480j147K117L56j976l41J235J34o39m86M9J163K17j772n0K451
122I80r4k830J008L019j493k518K301K134k371j337K484Q33k199m71J587K49j407
139a25m75P43L89o55p35L17P07l94j012L29J133l90j224N48J615o54j658J177
157c64K005j443j693K085J516k127r53K328L42k137J45J555m98j143M29L18k99
$$ plain form
174 66 19 -472 -731 181 112 -1433 -1131 751 -187 -2086 -498 1273 -561 -1735 507 1434 -589 -856
192 -856 1128 1216 -336 -158 1162 888 -161 71 744 609 72 -118 132 464 152 -709 -472 443 -49
211 -49 -1471 -681 755 -567 -1853 -123 1068 -892 -1529 857 1090 -922 -543 1351 727 -478 221
228 221 1019 485 108 266 413 592 418 -320 4 933 122 -1194 -131 912 -606 -1617 62 662
246 662 -1128 -1522 386 592 -1144 -995 769 582 -834 -305 1002 628 -303 160 889 555 128 136 380
265 380 671 328 -382 93 1005 -1 -1182 58 948 -802 -1564 471 672 -1495 -1260 705 250 -1431
283 -1431 -473 826 16 -729 98 728 312 44 143 481 716 317 -187 511 1068 86 -651 541 1037 -573
303 -573 -977 578 633 -1161 -1106 602 220 -1470 -849 651 -119 -1230 -275 616 -220 -626 189 475 208
$$ packed form
174F6m7m91k59R12o9j545L02J882r38j899J588J771j834j174K242R27k023k67
192h56J984Q8j552J78J320k74j049K32O73j35n37j90K50L32l12q61K37R15m92
211d9j422P90J436j322j286J730J191j960o37K386K33k012L79J894o24j205O99
228B21P98n34l77J58J47J79j74p38L24R29q11j316J063J043j518j011J679O00
246F62j790l94J908K06j736J49J764j87j416N29J307l74r31M63P29l34m27QK44
265C80K91l43p10M75R12j006j181J240Q90j750p62K035K01k167K35J965m55j681
283a431R58J299q10p45Q27O30m16k68R9L38K35l99n04O98N57r82p37J192M96j610
303e73m04J555N5j794N5J708l82j690O21J500p70j111R55Q91q36m06Q15K86k67
$$ plain form
322 208 101 127 453 820 291 -336 559 1214 -188 -743 862 957 -867 -778 973 313 -1371 -508 726
341 726 -353 -1286 -285 431 -492 -874 -111 230 -65 -339 -98 409 449 16 -95 658 889 -47 -247 863
361 863 981 -414 -433 1097 668 -948 -333 979 10 -1312 -230 674 -570 -1127 -113 184 -644 -614
379 -614 -138 -15 -56 -182 -242 233 541 -100 -287 787 940 -389 -189 1244 688 -746 58 1272 181
398 181 -942 134 884 -384 -954 37 336 -612 -813 -96 -14 -455 -529 -252 35 71 -375 -312 476 491 -469
419 -469 -233 990 697 -562 77 1352 399 -800 363 1230 -138 -827 444 701 -511 -671 192 87
437 87 -608 -550 -190 -121 -277 -564 -461 76 137 -615 -314 729 350 -720 -10 1178 361 -578 468 1275
457 1275 94 -540 633 1008 -270 -551 472 471 -482 -514 142 -32 -456 -501 -252 -55 -174 -592 -509 265
$$ packed form
322B08j07K6L26L67n29o27Q95O55j402n55J605R5j824Q9J751o60j684Q63J234
341G26j079r33J001P16r23l82P63L41k95k74K41N07M0m33j11P53K31r36k00J110
361H63J18j395j9J530m29j616O15J312r69j322J082R04j244n57J014K97q28L0
379f14M76J23m1j26o0M75L08o41j87J074J53j329K00J433n56j434Q04J214j091
398A81j123J076P50j268n70R91K99r48k01P17Q2m41p4K77K87L6m46O3P88J5r60
419d69K36J223k93j259O39J275r53j199J163Q67j368o89J271K57j212j60Q63j05
437H7o95N8L60O9j56k87J03N37O1p52L01J043l79j070P10J188q17r39J046Q07
457A275j181o34J173L75j278k81J023jr53l2O56j74m24m5K49J97j19m18Q3P74
$$ plain form
477 265 99 -771 -303 813 194 -809 184 1239 20 -651 719 1227 -221 -335 877 686 -408 -194
495 -194 499 191 -371 -230 -8 -23 -217 -494 -446 82 -104 -832 -426 539 -117 -1053 -27 904 -148 -793
515 -793 585 973 -304 -412 920 788 -332 -14 798 425 -297 32 354 90 -132 -311 -187 78 -111
534 -111 -714 -382 336 -234 -1028 -138 596 -413 -914 347 744 -492 -547 765 685 -488 -87 924 536
553 536 -217 198 661 306 -101 46 228 244 -67 -409 -141 208 -193 -786 -208 443 -500 -1022 133 508
573 508 -689 -802 486 496 -718 -312 794 377 -430 159 788 336 -104 282 517 278 93 -16 189
592 189 334 -14 -509 -81 360 -372 -878 -21 422 -725 -936 308 355 -838 -543 649 140 -715 -24
611 -24 701 141 -333 310 629 246 17 222 326 377 199 -176 186 492 -199 -585 179 498 -616 -799 316
$$ packed form
477B65j66q70M68J116o19j003R93J055j219o71J370N08j448j14J212j91j094K14
495a94O93l08n62J41K22j5j94k77M8N28j86p28M06R65o56r36J026R31j052o45
515g93J378L88j277j08J332j32j120L18Q12l73p22L29L22k64k22j79J24K65j89
534a11o03L32P18n70p94Q90P34j009n01J261L97j236n5J312q0j173M01J011l88
553E36p53M15M63l55m07J47J82J6l11l42K68L49m01n93N78O51r43n22J155L75
573E08j197j13J288J0j214M06J106m17q07N89O29m52m40L86K35k39j85j09K05
592A89J45l48m95M28M41p32n06Q57M43j147k11J244M7j193K95J192n09q55O91
611b4P25n60m74O43L19l83k29K05J04N1j78l75L62L06o91l86P64L19j114j83J115
$$ plain form
632 316 254 -973 -640 536 77 -931 -290 559 -154 -602 170 541 10 -129 265 437 324 96 90 331
652 331 526 35 -288 353 530 -358 -557 442 372 -757 -591 439 20 -1001 -355 451 -278 -862 -124 395
672 395 -256 -437 147 352 30 -111 145 372 398 98 7 430 648 -116 -278 601 474 -505 -355 646 155
693 155 -889 -298 493 -262 -944 -58 373 -410 -629 17 213 -306 -225 80 165 83 54 -15 344 515 19 -78
715 -78 611 576 -270 -166 797 336 -646 -76 691 -122 -827 -23 449 -465 -809 16 120 -503 -498 71 59 -193
737 -193 -177 9 157 218 -73 -131 495 541 -213 -34 808 438 -408 67 905 125 -658 199 670 -366 -669
758 -669 187 273 -575 -554 71 -65 -452 -388 -99 -84 -86 -197 -128 267 253 -249 -30 647 421 -321 119 893 175
781 175 -460 389 817 -159 -505 356 501 -395 -419 253 20 -495 -326 -8 -143 -293 -311 -218 -20 -42 -337 -168
$$ packed form
632C16o2j227L33J176m59j008O41Q49p13m48P72L71n31j39L94J72j13k28oK41
652C31J95m91l23O41J77q88j99R99p0j129J66J030m19j021O46Q06p29n84P38N19
672C95o51j81N84K05l22j41K56K27K6l00r1M23K18p64j62Q79j27r79J50J001m91
693A55j044N91P91p55o82Q86M31p83k19O46J96n19Q1L05Q5q2k9o9L59J71m96r7
715g8O89l5q46J04R63m61r82N70P67q13p05Q04M72r14l44Q25J04o23NN69j2k52
737a93J6J86J48O1k91n8O26M6p54J79Q42l70q46M75Q38p80p83Q57M71j036l03
758f69Q56Q6q48K1O25j36l87O4K89J5kj11O9L95j4n02K19O77k26p42M40P74p18
781A75o35Q49M28r76l46Q61J45q96k4O72k33n15J69L18j35j50j8R3J98k2k95J69
$$ plain form
803 -168 386 162 -431 81 761 95 -461 336 863 -55 -399 506 680 -295 -316 516 235 -397 -267 197 -42
824 -42 -383 -339 -131 -80 -259 -376 -264 112 -31 -540 -121 506 -61 -505 245 692 -60 -409 514 708 -244
845 -244 -205 667 449 -343 -69 461 125 -365 -117 103 -88 -315 -289 -153 -14 -210 -508 -238 289 -159 -564
866 -564 19 559 -175 -492 442 622 -335 -270 732 503 -290 -33 641 230 -276 97 332 43 -188 -50
886 -50 0 11 -194 -404 -162 105 -210 -556 -115 270 -381 -645 197 397 -464 -393 571 364 -431 -15 708 272
908 272 -300 187 587 113 -97 147 259 85 -80 -172 -28 98 -194 -490 -121 193 -378 -660 99 264 -587
929 -587 -503 412 260 -590 -170 603 167 -430 137 608 117 -154 256 399 105 41 86 180 181 -78 -244 38
951 38 230 -329 -490 123 170 -595 -545 318 77 -677 -290 494 115 -549 61 487 -4 -245 248 453 61
$$ packed form
803a68N54k24n93N12O80o66n56P97N27r18l44R05J74r75k1Q32k81o32J30M64k39
824d2l41M4K08N1j79j17J12L76j43n09M19O27n67m44P50M47p52l49R23J94r52
845b44L9Q72k18p92K74N30l36m90K48K20j91k27K6J36J39j96k98K70N27m48m05
866e64N83N40p34l17R34J80r57O5J002k29p93K57O74m11n06L73K35k89k31J38
886e0N0J1k05k10K42K67l15l46M41L85o51k64Q42K00q61P1R64k07p95M16P23m36
908B72n72M87M00m74k10K44J12j74j65r2J44J26k92k96L69L14n71k82P59J65q51
929e87Q4R15j52q50M20P73m36n97N67M71m91k71M10J43k94o4M5R4Jk59j66K82
951C8J92n59j61O13M7p65N0Q63k41p54L87P84l79o64O10M26m91k41M93K05l92
$$ plain form
972 61 -7 220 262 159 59 6 199 319 -105 -326 165 204 -418 -479 257 59 -707 -362 391 -103 -716 -99
994 -99 406 -208 -471 183 372 -76 -137 302 355 99 6 206 308 280 7 -26 286 312 -233 -219 373 170 -562
1017 -562 -271 451 -82 -748 -168 349 -265 -657 69 320 -318 -341 202 198 -151 -51 208 262 166 94 90 369 349
1040 349 -67 -83 421 279 -357 -140 477 46 -608 -97 409 -298 -697 67 295 -405 -507 130 141 -350 -190
1061 -190 146 123 -71 -49 37 182 208 -56 30 455 320 -182 31 585 149 -412 33 478 -127 -608 143 372
1083 372 -406 -448 174 157 -497 -356 114 8 -318 -176 72 123 2 -98 47 357 281 -176 50 565 197
1104 197 -304 125 617 45 -361 193 468 -289 -477 259 166 -475 -372 143 -8 -440 -250 59 3 -187 -152
1125 -152 -25 84 62 -142 35 404 191 -176 188 610 98 -321 289 563 -126 -293 390 338 -332 -267 280
$$ packed form
972F1o8K27M2j03j00n3J93J20m24k21M91L9o22o1P36j98p66L45P53m94o13O17
994i9N05o14k63O54J89m48o1M39N3k56r3K00J02k8k73l3L12K6n45J4N92k03p32
1017e62K91P22n33o66N80N17o14l92P26K51o38k3N43ml49J00K59N4r6p2mK79k0
1040C49m16j6N04j42o36K17O17m31o54N11N06p07l99P64K28p00j02O37J1m91J60
1061a90L36k3j94K2Q6J45K6k64Q6M25j35n02K13N54m36n61M45M45o05m81P51K29
1083C72p78m2O22j7o54J41M70j06l26J42K48N1j21j00J45L10p6m57K26N15l68
1104A97n01M29M92n72m06N54K75p57j88P36r3o41J03N15j51m32J90L09n6j90L5
1125a52J27J09k2k04J77L69k13l67L64M22n12m19O10K74o89j67O83n2o70O5N47
$$ plain form
1146 280 31 -482 -220 81 -117 -368 -145 -34 -52 -103 -219 -113 192 31 -309 80 445 -4 -292 276 519
1167 519 -97 -222 423 437 -327 -178 395 147 -346 -95 214 -50 -329 -120 4 -102 -199 -210 -92 49 -133
1188 -133 -381 -52 244 -72 -373 136 448 -147 -279 427 482 -206 -99 539 274 -328 54 398 64 -274
1208 -274 -43 141 -85 -255 -107 -71 -44 -151 -279 -85 141 -127 -410 25 256 -207 -356 292 311 -258 -109
1229 -109 554 240 -298 70 569 141 -273 98 345 -24 -146 49 89 -42 -168 -210 -69 3 -243 -376 -1
1250 -1 140 -354 -376 231 224 -379 -240 496 188 -325 -5 552 105 -222 157 435 29 -98 150 242 -49 -62
1272 -62 40 51 68 -148 -257 18 92 -288 -393 136 75 -465 -375 308 119 -459 -67 436 2 -311 180 446
1294 446 30 -137 335 349 39 -34 152 209 61 -8 -24 29 61 -226 -275 116 69 -359 -323 174 16 -537 -181
$$ packed form
1146B80k49n13K62L01j98k51K23J11j8n1j16J06L05j61l40L89L65m49k88N68K43
1167E19o16j25O45J4p64J49N73k48m93K51L09k64k79K09J24j06r7j1J18J41j82
1188a33k48L29K96l16l01N09L12n95j32P06N5o88J07O38k65o02L82L44l34l38
1208b74K31J84k26j70J48L6K7j07j28J94K26k68k83M35K31m63j49O48J9n69J49
1229a09O63l14n38L68M99m28m14L71K47l69j22J95M0j31j26m2J41P2k46j33L75
1250aJ41m94k2O07po03J39P36l08n13L20N57m47l27L79K78m06j27K48R2k91j3
1272f2J02J1J7k16j09K75P4l80j05N29o1n40R0O83j89n78L92N03m34l13M91K66
1294D46m16j67M72J4l10p3J86N7j48o9j6N3L2k87m9L91m7m28L6M97j58n53L56
$$ plain form
1317 -181 318 -59 -434 75 389 -106 -281 261 323 -91 -24 267 247 -4 19 118 186 78 -65 -86 156 141 -277
1340 -277 -251 193 10 -477 -210 260 -131 -547 -29 282 -220 -411 112 295 -204 -230 239 224 -30 19 187
1361 187 148 64 31 35 233 173 -117 -112 311 96 -370 -135 233 -93 -545 -56 241 -262 -491 161 216 -293 -238
1384 -238 219 169 -140 -60 200 154 35 89 149 191 108 -20 24 280 130 -230 22 373 -40 -440 -49 264 -241
1407 -241 -483 97 151 -333 -383 172 31 -326 -135 221 41 -107 6 151 108 73 9 96 318 203 -82 90
1429 90 452 104 -210 111 327 -134 -378 123 198 -361 -360 130 32 -444 -202 130 -23 -285 -114 77 -3 -62
1451 -62 9 66 158 89 -81 82 320 147 -191 185 392 -41 -201 288 325 -253 -246 262 119 -394 -182 189 -98
1474 -98 -372 -141 101 -69 -211 -70 -4 1 -25 -123 36 216 77 -158 195 394 -9 -206 327 402 -150 -225 357
$$ packed form
1317a81M99l77l75N09L14m95j75N42O2m14O7K91k0k51K3R9O8j08j43k1K42j5m18
1340b77K6M44j83m87K67M70l91m16N18L11n02j91N23J83m99k6M69j5k54M9J68
1361A87l9q4l3MJ98o0k90NM23k15m66K35L68l26m52M89K97n03k29O52N5n09N5
1384b38M57n0l09Q0K60m6j19N4O0M2q3j28M4K56j50l60K52L51m13m00L91L13n05
1407b41k42N80N4m84n0N55j41l57J91L56j80j48J13J45m3l5o4Q7K22j15k85J72
1429I0L62l48l14L21K16m61k44N01P5n59JM90r8m76K42L32j53k62J71J91q0n9
1451f2P1N7R2o9j70J63K38j73l38L76K07m33j60M89L7n78PN08j43n13K12L71k87
1474i8k74K31K42j70j42J41O6Nk6r8J59J80j39k35L53J99m03j97N33P5n52p5N82
$$ plain form
1497 357 228 -313 -157 204 -6 -318 -118 99 -153 -261 -116 38 -39 -127 -73 -9 79 -47 -139 55 290 -26
1519 -26 -151 271 380 -104 -125 417 237 -221 -37 380 106 -312 -26 240 -109 -299 -59 15 -183 -236 -135
1540 -135 -48 -67 -137 -209 -49 167 -124 -170 187 315 -207 -107 371 271 -189 -35 420 169 -233 69 309 18
1562 18 -240 50 165 -124 -147 -53 -5 -112 -172 -147 -68 -11 -227 -225 14 80 -201 -182 240 238 -208 -65 397 165 -273
1587 -273 101 434 52 -173 131 345 -103 -137 113 68 -111 -143 -111 -15 -26 -182 -234 -42 63 -205 -307 82
1609 82 61 -302 -132 308 46 -273 22 446 46 -193 227 367 1 -108 204 223 -68 -77 7 27 17 -128 -112
1632 -112 -9 0 -234 -218 158 76 -324 -166 240 35 -352 -48 343 -78 -267 149 379 -4 -119 267 225 -46
1654 -46 -38 184 164 -21 -45 29 52 17 -93 -120 45 -44 -277 -200 137 -72 -437 -69 238 -136 -302 46 274 -63
$$ packed form
1497C57j29n41J56L61k10l12K00K17k52j08J45J54p7q8N4O4Q8j26r2J94K35l16
1519b6j25M22J09m84k1N42j80m58J84M17k74m18K86K66l49j90K40P4j98n3J01
1540a35Q7j9p0p2J60K16k91m6L57J28n22J00M78j00m60J54M55k51m02L02K40k91
1562A8k58K90J15k89k3R4M8j07o0K5P9N7k16KK39O6k81J9M22km46J43M62k32m38
1587b73L74L33l82k25L04K14m48l4K50m5j79l2L2R6j1j56n2J92J05k68j02L89
1609H2k1l63J70M40k62l19K95M24m00k39M20J40l66j09L12J9k91rQ4K0j0j45J6
1632a12J03Rk34J6L76q2m00J58M06k05l87L04L91m21j89M16K30l83j15L86m2k71
1654d6QK22k0j85k4P4K3l5j10k7J65q9k33P7L37k09l65L68L07l74j66L48K28l37
$$ plain form
1678 -63 -170 213 274 -18 -37 288 161 -10 63 116 108 51 -61 -48 74 49 -193 -133 118 -61 -381 -180 119 -166
1702 -166 -377 38 204 -180 -255 154 166 -163 -113 262 67 -77 -8 205 138 -29 76 76 124 21 -89 6 226
1725 226 -9 -244 -71 227 -61 -314 -7 175 -186 -319 102 128 -282 -228 162 47 -187 -34 174 77 -21
1746 -21 35 137 104 96 -3 8 235 16 -112 3 248 -53 -234 39 207 -205 -292 88 110 -309 -270 124 38 -287
1770 -287 -104 180 -23 -140 50 151 62 36 44 138 149 63 -11 106 244 19 -102 73 250 -132 -227 135 114
1793 114 -212 -276 202 -25 -383 -138 144 -26 -266 -66 110 -15 -70 16 64 124 38 4 108 228 96 -70
1815 -70 156 261 -57 -107 223 258 -201 -161 228 62 -317 -152 124 -107 -334 -71 93 -59 -190 -20 10 -88
1837 -88 -45 -11 76 80 48 -100 127 246 -38 -73 266 205 -97 -70 342 127 -258 -34 183 -59 -280 -41 122
$$ packed form
1678f3j07L83O1k92j9L25j27j71P3N3qn7j12J3J22k5k42O0K51j79l20K01K99k85
1702a66k11M15J66l84p5M09J2l29N0L75j95j44O9K13o7j67J05%M8j03j10R5K20
1725B26k35k35J73K98k88k53L07J82l61j33M21K6m10N4L90j15k34J53K08r7r8
1746b1N6J02l3qr9J1K27k19j28J15K45l01j81K73J68m12q7L80K2m19L9L94q6l25
1770b87J83K84k03j17J90J01q9k6QR4J1q6p4J17J38k25j21J75J77l82r5L62k1
1793A14l26o4M78k27l58K45K82j70k40K00J76j25n5Q6M8O0q6l4J04J20j32j66
1815g0K26J05l18n0L30L5m59M0L89j66l79J65K76k31k27K63J64j52j31J70L0r8
1837h8M3L4Q7Ml2j48K27J19k84l5L39o1l02K7M12k15l85K24K17k42k21K39J63
$$ plain form
1860 122 -153 -261 -56 -31 -92 -94 -48 -6 27 29 -54 75 157 -29 -118 185 254 -63 -34 285 204 -230 4 291 52
1885 52 -236 35 216 -106 -180 43 84 -116 -158 -13 -1 -60 -80 -134 -12 68 -116 -106 112 137 -172 -87 230 135
1909 135 -120 30 346 138 -184 75 296 -24 -125 79 164 -96 -201 85 5 -188 -147 -81 -16 -92 -108 -143 85
1932 85 60 -170 -106 164 79 -210 23 289 102 -220 65 339 -17 -159 195 212 -97 -101 172 93 -110 -106 -6
1955 -6 -24 -37 -109 -152 -7 -35 -161 -162 109 35 -204 -26 204 59 -199 43 252 35 -143 198 287 -31 -21 255
1979 255 154 -103 -45 147 16 -88 -105 -74 -23 -51 -147 -174 70 -58 -224 -118 88 -69 -230 -1 231 -45
2001 -45 -215 84 240 -101 -88 232 169 -98 -22 195 87 -82 62 44 -2 -27 -17 -52 41 -30 -168 -27 82 -61
2025 -61 -241 -30 103 -118 -245 89 169 -153 -172 195 147 -96 10 227 119 -18 45 121 104 -19 74 23 14 19
$$ packed form
1860A22k75j08K05K5o1kM6M2L3Kq3J29Q2j86q9L03O9l17K9L19q1m34K34K87k39
1885E2k88K71J81l22p4K23M1k00m2J45J2n9k0n4J22Q0j84J0K18K5l09Q5L17r5
1909A35k55J50L16k08l22K59K21l20j01K04Q5k60j05K86q0j93M1O6O5p6j6l5K28
1932H5k5k30O4K70q5k89K33K66j87l22K85K74l56j42L54J7l09mK73p9k03MJ00
1955fj8j3p2m3J45k8j26jK71p4k39J78K30j45k58K42K09k17j78L41Q9l18J0K76
1979B55j01k57N8J92j31j04j7L1N1k8r6k7K44j28j66J06K06j57j61K29K32k76
2001d5j70K99J56l41J3L20o3k67P6K17j08j69J44j8m6k5J0l5R3p1j38J41J09j43
2025f1j80K11J33k21j27L34Q0l22j9L67m8k43J06K17j08j37O3P6j7j23R3n1rN
$$ plain form
2049 19 -121 -19 80 -73 -230 -70 180 -126 -302 4 135 -199 -208 102 87 -156 -52 246 99 -70 34 147
2071 147 106 -34 49 89 51 59 -39 -10 153 -16 -134 -27 84 -120 -226 19 103 -221 -259 78 31 -202 -109 126
2095 126 35 -202 -37 132 28 -78 103 145 76 42 56 46 152 5 -12 96 131 -39 -141 60 123 -187 -202
2118 -202 87 53 -225 -159 77 -31 -230 -71 132 -74 -161 32 105 -10 15 75 133 127 29 -1 26 133 64 -81
2142 -81 146 209 -78 -191 108 91 -193 -167 117 8 -259 -95 139 -117 -216 -4 85 -67 -100 25 75 -21 10
2165 10 50 61 108 62 -31 131 150 -117 -50 139 153 -155 -119 161 86 -262 -66 93 -72 -244 -25 143 -106 -167
2189 -167 -28 38 -60 -108 22 89 19 16 -58 114 103 5 -34 179 152 -111 -42 185 94 -137 -20 207 -66 -182 34
2214 34 65 -116 -227 28 6 -139 -204 -9 50 -47 -81 -38 1 79 8 -31 133 100 -84 -31 218 107 -85 34 242
$$ packed form
2049A9j40J02R9j53j57J60K50l06j76L06J31l34rL10j5k43J04K98j47j69J04J13
2071A47m1j40Q3M0l8Qr8K9J63j69j18J07J11k04j06K45Q4l24l8L37m7k33R3K35
2095A26r1k37J65J69j04j06J81M2o9l4J4j0J06j47j7J08L5j70j02K01O3l10j5
2118b02K89l4k78O6K36j08j99J59K03k06q7J93P3j15K5O0N8or8l0K7J07o9j45
2142h1K27O3k87j13K99j7k84K6K84j09k67J64K34k56r9K12Q9j52l3J25N0r6L1
2165A0M0J1M7m6r3J62J9k67O7J89J4l08L6K80p5l48J96J59j65j72K19J68k49o1
2189a67J39O6r8m8J30O7p0lp4J72j1r8l9K13k7k63O9K27r1k31J17K27k73j16K16
2214C4L1j81j11K55k2j45o5J95N9r7l4M3L9P8p1l9J64l3j84N3K49j11j92J19K08
$$ plain form
2239 242 12 -105 106 221 -62 -144 31 45 -113 -116 24 -46 -152 -143 -75 -3 -6 -105 -26 79 123 -60 -29 209 99
2264 99 -104 -23 280 42 -128 142 221 -14 -102 100 108 -118 -107 97 12 -111 -68 -1 -23 -112 -87 -31 -5 18 -110
2289 -110 -49 164 53 -96 -69 198 45 -231 83 181 -72 -112 158 208 -98 -97 110 76 -49 -34 85 11 -108
2312 -108 -93 -58 -52 4 -105 -121 51 33 -148 -38 140 -40 -127 -9 202 -64 -110 128 181 -39 -69 124 136 -77
2336 -77 -49 98 37 -50 -40 -27 -81 -26 -132 -25 43 -37 -170 -26 89 -13 -199 53 130 -26 -105 46 198 -63
2360 -63 -63 198 184 -60 18 216 43 -111 63 116 -13 -68 -48 0 9 -54 -101 -32 71 -65 -139 -52 126 -116 -153 26
2386 26 129 -141 -60 124 85 -140 23 174 65 -58 54 177 23 -3 6 82 82 55 -47 12 17 -2 -121 -43 108
2411 108 -109 -142 31 59 -193 -56 150 62 -177 -69 196 72 -111 63 166 65 -34 59 137 13 -32 -39 24
$$ packed form
2239B42k30j17K11J15k83q2J75J4j58lJ40p0j06RO8P2lr9P9J05M4j83L1K38j10
2264I9k03Q1L03k38j70K70P9k35q8K02Qk26J1K04q5j23M3O7k2q9K5N6K6K3j28
2289a10O1K13j11j49K7K67j53k76L14R8k53m0K70N0l06JK07l4j25J5J19p4j19
2312a08J5L5ON6j09j6J72j8j81J10J78j80q7J18K11k66m6K38N3k20l0J93J2k13
2336g7K8J47o1q7J0J3n4N5j06J07O8q0j33J44J15j02j86K52P7j56p9J51J52k61
2360f3%K61j4k44P8J98j73j54J74N3j29n5K0M8Ro3m7O9J03j36p4Q7J78k42l7J79
2386B6J03k70Q1J84l9k25J63J51j09j23J12J23j54k6RP6%k7j02N9Nj9j19P8J51
2411A08k17l3J73K8k52J37K06q8k39J08K65j24j83J74J03j01r9R3P8j24m5pO3
$$ plain form
2434 24 -5 42 -57 -18 61 -101 -160 78 76 -180 -160 91 34 -198 -65 120 3 -134 -16 183 -10 -69 89 132
2458 132 40 -49 62 73 77 -24 -26 72 78 -33 -80 56 73 -113 -134 96 90 -205 -129 152 -17 -206 -26 94 -12
2483 -12 -136 22 88 -40 0 41 101 91 22 13 108 42 3 -52 100 77 -20 -95 85 44 -104 -133 80 -32 -226 -55
2509 -55 78 -90 -166 0 94 -71 -102 57 66 -32 -9 36 43 84 15 -6 92 126 -34 -28 153 70 -108 8 152 18
2535 18 -165 -33 134 -52 -166 -4 72 -94 -120 22 49 -82 -102 9 -16 19 49 11 49 77 5 22 62 56 -47
2560 -47 -58 156 44 -158 -12 142 -74 -135 47 103 -75 -110 53 41 -140 -80 13 48 -3 -67 -24 27 -17 25 -27
2585 -27 129 99 -30 27 119 60 -103 42 139 -12 -161 2 104 -117 -107 57 74 -93 -94 48 33 -63 -11 50 -35
2610 -35 -30 -42 -43 18 47 -64 -3 164 85 -102 104 178 42 -90 76 152 -28 -88 126 76 -122 -80 27 4 -95 -140
$$ packed form
2434B4k9M7r9L9P9j62n9K38kk56K0K51n7k32J33J85j17j37J18J99j93n9J58M3
2458A32r2q9J11J1Mj01kR8Oj11m7J36J7j86k1K30ok95P6K81j69j89J80J20j06
2483a2j24J58O6j28M0M1O0j0o9rR5o6l9n5J52k3r7p5J80m1j48k9K13j12j94J71
2509e5J33j68p6J66R4j65l1J59Rr8K3M5PM1o9k1R8L4j60OJ81q3j78J16J44j34
2535A8j83J32J67j86j14J62P6j66k6J42K7j31k0J11k5L5L0l8L8K8p2J7M0oj03
2560d7j1K14j12k02J46J54k16o1J82N6j78l5J63j2j81O0R3L5n1o4M3N1m4M2n2
2585b7J56l0j29N7R2n9j63J45R7j51j49J63J02k21J0J64J7j67jJ42j5r6N2O1q5
2610c5Nj2jO1K9j11O1J67p9j87K06P4j36j32J66P6j80o0K14n0j98M2J07k3r9m5
$$ plain form
2636 -140 -24 -17 -94 -85 -27 -49 -14 -91 -62 61 13 -134 8 148 -11 -35 40 114 38 -6 127 143 -63 -10 68 84 -86
2663 -86 -39 62 -44 -66 -19 7 -6 -46 6 -24 43 -57 -129 -20 50 -50 -57 59 146 -65 -127 94 97 -14 -41 97
2689 97 63 -87 22 141 1 -96 17 56 -3 -36 -57 -43 -47 -25 -93 -70 68 -1 -73 -15 82 -70 -110 47 124 -103
2715 -103 -35 111 126 -79 -32 202 68 12 12 22 24 -44 -73 2 -42 -54 -44 -28 -10 -80 -84 16 25 -30 -125 61 40 -79
2743 -79 -97 124 112 -74 -4 129 75 -68 51 96 61 -42 25 66 2 -61 -65 10 38 -132 -81 -17 1 -71 -96 11 27
2770 27 -161 -87 110 24 -122 13 97 24 -69 -9 112 24 -41 68 93 37 23 47 64 41 14 -36 -26 95 -44 -78
2796 -78 13 57 -105 -103 4 5 -119 -89 128 -5 -108 -3 97 8 -104 60 92 -9 -7 56 59 -8 1 3 89 46 -78
2823 -78 -44 37 65 -67 -83 87 -15 -147 -33 102 -49 -139 31 74 -63 -105 55 104 -54 -8 56 47 34 10 21
$$ packed form
2636a40J16Pp7RN8k2L5p7K9J23m8j47J42J40j59k4P5P4p6m4J33J6k06N3P8J6j70
2663h6M7J01j06k2M7K6j3m0N2l0O7j00p2J09P0j00pJ16Q7k11o2K21Lj11k7J38
2689I7l4j50J09J19j40r7J13L9n9l3k1J4mK2o8K3J38o9p2N8R7j52m0J57P7k27
2715a03O8J46J5k05M7K34j34n6%J0Ko8k9P5m4j2J0J6J8p0mJ00Rn5r5J86k1j19
2743g9j8K21j2j86P0J33n4j43J19M5l5j03O7M1o4o3mP5K8j70N1O4J8p2k5J07J6
2770B7j88P4J97q6j46J35Q4p3r3O0J21q8o5J09K5n6j4K4J7k3k7n0J0J21j39l4
2796g8R1M4j62KJ07Jj24L0K17j33j03J05J00q9j12J64L2j01KO3Lo7RKQ6m3j24
2823g8L4Q1K8j32j6J70j02j32J14J35j51r0J70M3j37m2J60M9j58M6O4rj3k4J1
$$ plain form
2848 21 68 46 8 -11 67 -12 -60 -14 44 -5 -97 -26 101 10 -176 -4 118 -59 -141 12 86 -89 -87 51 60 2 1 83
2876 83 30 -16 8 38 87 89 3 -4 63 1 -51 -40 89 24 -63 -25 74 -33 -161 40 25 -146 -89 19 27 -85 15 -10
2904 -10 29 -64 35 66 61 72 -64 16 92 54 -43 -20 78 -10 -51 43 113 -54 -61 41 52 -36 -109 42 47 -122 -59 13 -24
2933 -24 -106 -51 22 26 -21 -17 26 67 22 -21 19 65 37 -89 41 164 40 -74 47 96 -66 -74 72 66 -54 -100 36
2960 36 11 -62 -75 16 1 12 -41 16 13 26 -17 -3 94 54 -63 46 139 20 -57 66 103 -17 -57 89 88 -93 -39 72
2988 72 32 -79 -21 39 -47 -53 -39 -56 -27 -12 -29 -26 17 32 -9 8 95 11 -7 45 145 -26 -11 87 112 -52 -32 61 25
3017 25 -75 -20 57 25 -58 -14 26 -10 -46 21 2 11 -32 -95 -50 66 -41 -17 8 74 30 -59 108 75 -30 -65 104 102
3045 102 -58 -30 75 15 -81 12 65 -33 -18 30 -28 -27 -19 -105 16 -17 -45 -40 11 73 0 -20 51 68 -29 12 76 77 25 28 128
$$ packed form
2848B1M7k2l8j9P8p9m8M6N8m9r2P1J27r1j86J72J22j77q2J53P4j75KJ38Rn8jQ2
2876H3n3m6K4L0M9Kq6pO7o2n2J1J29o5q7L8R9j07j28K01j5j71N7J08Qj12J00k5
2904a0L9r3R9L1nJ1j36Q0P6l8r7K3R8q8m1R4P0j67pJ02J1q8p3J51Nj69O3P2l7
2933b4q2N5P3Mm7MM3M1m5m3M0M6k8j26J30J23j24j14J21M9j62qJ46oj20m6J36
2960C6k5p3j3R1j5J1n3N7lJ3m3J4R7m0j17J09R3j19p7J23L7j20m0J46jj81N4J11
2988G2m0j11N8O0q6oJ4j7K9J5j7LM3J5m1J7Q7q4j8N2J00j71J5R8K5j64K0R3l6
3017B5j00N5P7l2q3M4M0l6l6O7j9Rm3o3M5J16j07K4K5O6m4q9J67l3j05l5J69k
3045A02j60K8J05o0r6R3N3r8J5M8n8JQq6J21l3k8NN1O2p3k0P1J7r7M1O4Jn2LJ00
$$ plain form
3076 128 3 -64 44 39 7 -20 47 80 3 -12 8 -26 -8 -70 18 55 -5 -78 -67 19 40 -86 -4 76 30 -47 -9 143
3104 143 10 -95 56 119 10 -6 48 42 -2 -26 20 13 26 -19 -34 21 20 -36 -55 34 69 -81 -55 90 6 -130 -7
3131 -7 85 -16 -71 34 114 27 -54 48 106 -27 -2 56 56 24 -27 -12 9 -15 -17 -85 21 -28 -58 -18 40 -10 -66 -15 80
3160 80 -20 -48 0 81 -28 -81 67 58 -34 -37 60 8 54 69 39 30 1 34 1 1 1 -41 -44 43 4 -94 -40 66 -18 -114 -18
3191 -18 66 -31 -123 8 68 -65 -36 20 36 -35 -4 -1 34 38 -40 5 72 56 0 17 86 45 -78 -52 60 58 -82 43 33
3220 33 17 -44 -3 53 -27 -71 -8 -12 -56 -42 71 58 -16 9 -26 67 27 14 30 24 19 0 30 58 -13 -100 21 37 0 -79 -2
3251 -2 11 -132 -51 75 1 -69 -55 -57 -25 -55 -28 33 44 18 17 16 62 36 -9 24 87 52 -28 18 74 9 -68 0 85 -118 -125
3282 -125 49 14 -31 -92 46 -18 -53 -43 43 -36 -17 9 54 34 40 -60 46 83 43 -36 23 72 -14 -30 115 114 -84 -69
$$ packed form
3076A28j25o7J08nl2k7O7L3p7j5K0l4J8o2Q8L7o0p3J1Q6K1j26Q2Q0m6p7L8J52
3104A43j33j05J51O3j09j6N4om4k4M6pJ3m5j5N5jn6j9Q9L5j50K6J45q4j36J23
3131gR2j01n5J05Q0q7q1J02N8j33K5N8%l2n1J5K1k4ko8J06m9l0M0N8n0n6N1R5
3160H0j00k8M8Q1j09n3J48rr2lR7n2M6J5l0rk9L3l3%%m2lQ7l9r8N4J06q4r6R6
3191a8Q4r7r2J31O0j33K9N6J6p1L1LL5Mp8M5O7j6n6J7O9m1j23K6J12kj40J25j0
3220C3j6o1M1N6q0m4O3mm4J4J13j3p4K5l5R3m0j3J6onj9L0K8p1q7J21J6l7p9P7
3251bJ3j43Q1J26p4p0J4kL2l0K7O1J1k6jjM6k6m5L3O3l5q0M6N6o5p7O8Q5k03p
3282a25J74l5m5o1J38o4l5J0Q6p9J9K6M5k0Oj00J06L7m0p9N9M9q6j6J45jj98J5
$$ plain form
3310 -69 48 54 -56 10 51 -15 -99 -26 51 -84 -91 -15 98 21 -1 1 5 19 20 -16 37 43 -21 -12 84 88 4 -2 51 8 -61 -30 80
3343 80 23 -91 24 70 -36 -93 -76 56 -18 -74 -13 4 -43 -5 -6 -38 39 2 -57 90 89 -32 -68 110 74 -12 -22 77
3371 77 16 -50 40 34 -19 -93 20 6 -22 -18 2 -24 -33 -71 -66 -24 -13 -9 4 28 55 -3 -101 33 31 -47 1 103 70 -45 22
3402 22 79 1 -65 9 -2 -21 -46 45 -12 19 -73 -88 -24 58 -47 28 12 40 -23 -30 31 62 -22 7 51 47 -13 1 81 42 -11
3433 -11 9 80 -26 -32 72 56 -3 -49 2 -11 -46 -32 -30 2 -11 -58 -10 21 -8 -78 -37 12 14 -33 38 114 19 -48 57 50 -6
3464 -6 14 12 72 2 35 36 11 -8 -37 10 21 -36 -44 63 10 -27 -53 -5 36 40 -70 6 57 14 -86 13 -20 -44 5 38 33 24
3496 24 21 19 17 -6 -41 6 15 -39 -8 -12 26 12 -13 16 2 -42 -80 -37 21 -50 -86 75 10 -16 11 27 -16 -18 -15 44 8 -41 18
3529 18 -13 31 -24 -36 -37 15 -8 -83 36 27 29 -87 5 -16 -31 -48 18 73 -70 -30 87 14 -18 -21 24 61 -21 44 41 -3 -15
$$ packed form
3310f9J17Oj10O6M1o6q4P3P7j35pP6J13p7k2KMJ4Jl6N3Oo4RR6Mq4oN3m3o9L1J10
3343H0n7j14J15M6j06n7J7J32p4n6O1J7m7L8jl2P7l7n9J47jj21l6J78l6q6j0R9
3371G7o1o6R0on3p4J13j4k8MK0k6rl8NM2J1MJ3K4K7n8r8J34kp8M8J02l3j15O7
3402B2N7p8o6P4j1j9k5R1n7L1r2j5O4Q2j05P5j6K8o3pO1L1q4K9M4mo0J4Q0l9n3
3433a1K0P1j06oJ04j6n9m6N1j3l5J4KL2j3m7M8L1k9p0M1M9Km7P1P6r5o7J05pn6
3464fK0kO0p0L3Jk5j9k9M7J1n7qJ07n3l7k6M8M1Mj10P6N1m3j00R9l3k4M9L3nr
3496B4lkkk3l5M7Rn4L1mL8j4k5K9j4m4l8M3N8p1l6J61o5k6K7J6m3kLN9l6m9N9
3529A8l1M4n5j2jN2k3p5J19rKj16R2k1j5j7O6N5j43M0J17p3l2lM5L7q2O5lm4j2
$$ plain form
3560 -15 -7 47 44 10 1 -3 48 -26 -14 8 -10 7 -74 -17 6 -73 -76 35 69 -61 -55 44 32 -55 16 53 -42 25 11 65 -7 -9 -11
3593 -11 3 53 0 23 -8 44 45 -82 -18 82 52 -34 18 -28 -61 0 58 20 -45 19 -8 29 -59 12 60 32 31 22 -11 37 -19
3624 -19 -27 23 4 -25 -32 21 74 -8 -42 3 0 -30 -53 59 43 -4 -36 12 -9 -16 -28 76 -26 -39 14 1 15 2 -7 -22 50
3655 50 -1 34 44 0 -31 -70 -48 38 -49 19 35 20 -87 30 -16 20 -62 -29 33 -32 -28 28 18 31 -7 -16 -6 40 17 21 -11
3686 -11 17 36 -4 11 84 -9 -33 50 33 -29 -10 40 -7 -21 -23 27 5 -68 5 -37 -9 -32 44 18 -54 -3 -33 -10 68 -41
3716 -41 44 9 -2 3 15 66 23 6 40 74 14 -44 -6 64 -12 -51 -18 -16 -63 10 -16 -15 -2 60 -14 51 -69 -57 -1 23 1
3747 1 -37 -45 44 31 -12 -34 41 39 -65 42 72 7 -27 20 27 -26 -20 -16 21 -3 13 -21 0 -43 -8 -1 21 2 -46 -38 62 -11 13
3780 13 71 5 3 -33 58 11 42 -65 -28 20 -62 -46 -14 40 -1 -38 -52 8 3 -12 52 -16 -21 -6 -53 -35 -7 -5 -23 51 29 -38
$$ packed form
3560a5QN4ll4rmN1p4J2K2j8J7q1N7K3p9lJ11L4j30OR9j2q7P1L7r5O7j4N4p2kk
3593a1J4N0n3K3l1N2Jj27O4J00l0q6N2m6l3O1N8l8o5O4k7L7q8P1M8k8jrl3M8n6
3624a9qN0j9k9pN3N3q2l4M5ll0k3J12j6m7l2M8k1pj2J04j02j3N3j3J4j3rj5P2
3655E0n1L5J0m4l1l9K2Q6q7O8J6j5j07J17m6L6q2L3O2o5MN6j0J3l8rJ0M6k3Ml2
3686a1K8J9m0J5P3r3k4Q3j7o2J9N0m7j4kN0k2p3P3m2K8k3P6k6p2N1l0K3P8j09
3716d1Q5l5j1NJ2N1m3j7L4L4o0n8L8P0p6l9L3Km7P3k6JJ3O2p4O5j20J2N6K4k2
3747Al8qQ9j3m3k2P5kj04J07L0o5l4M7Pn3OML7k4J6l4K1m3L5PK2j9m8QJ00p3K4
3780A3N8o6kl6R1m7L1j07L7M8q2J6L2N4m1l7j4O0nj5O4o8nJ5m7J8K8Kj8P4k2o7
$$ plain form
3812 -38 44 40 0 9 -8 16 -2 -1 62 2 -15 -23 44 -26 -23 -29 11 -59 25 -43 -6 -6 21 -24 -39 -21 -10 -28 3 23 -22 -3 -30 53
3846 53 2 -14 35 39 -60 8 -5 -3 -37 2 86 21 16 -19 13 17 -51 -8 38 41 41 -50 -16 15 29 -28 17 66 2 -20 68 39 -28
3879 -28 -24 -15 21 18 20 -5 11 17 -13 45 14 15 -18 27 6 10 -63 -20 1 -50 -34 24 48 -21 -42 -6 38 -19 -3 5 25 -16 -14 35 -46
3914 -46 -56 14 24 0 -17 16 -1 22 15 -36 -48 48 36 -1 56 -14 -29 -46 -10 31 -42 -56 5 44 -54 -13 73 27 -19 -13 17
3945 17 28 -18 16 -13 30 46 -20 55 18 -9 4 41 7 -71 -30 55 -26 -68 -41 -7 26 11 -44 -9 25 -28 49 49 13 -2 -37
3976 -37 59 66 -9 71 -5 15 -40 -51 33 10 -23 -38 34 -39 29 -48 11 52 -11 -11 42 -18 -26 3 43 -33 -5 -10 51 -35 7 24
4008 24 69 43 -17 42 30 47 -3 -24 -21 -11 7 -82 61 54 -50 15 16 34 -48 0 12 -37 1 70 37 16 -20 -20 -25 -59 16 -36
4040 -36 -31 17 -25 -17 -10 24 5 -20 -25 20 -33 -57 64 -4 -31 26 0 7 -33 24 -19 -3 -14 41 -3 -3 12 -1 12 10 34 0 16
$$ packed form
3812c8Q2mm0Rj7K4j8JO3o0j7qO7p0LoM0p0Q4o8L7%K7m5j5J8J1j8L1K0m5J9k7Q3
3846E3n1j6M9Mr9O8j3Kl4L9Q4o5nl5L2Mo8M3M6L%r1L4L1J4n7M5M9o4k2Q8k9o7
3879b8MRL6lKk5J6Ol0N8l1Jl3M5k1Mp3M3K1n1J6N8K4o9k1L6M4n7J6QK0m1KM9q1
3914d6j0P0J0k4j7L3j7K3pn1j2R6j2l7N7p0j5j7L6M1p3j4O1L9r8M1Q6m6m6OL0
3945A7J1m6L4k9M3J6o6P5l7k7J3L7l4p8M1Q5q1m2K7L4L3j5n5L5L4n3P7%l6j5l5
3976c7R6Pp5Q0p6K0n5j1Q4k3l3j5P2p3O8p7N9M1o3%N3o0qK9M0p6K8nO1q6M2J7
4008B4M5k6o0N9j2J7n0k1LJ0J8q9J43pj04O5JJ8q2M8J2m9L8O9l3k1l6%nl4P5n2
4040c6NM8m2QPL4j9k5nM5n3k4J21o8k7N7k6Pm0N7m3J6j1N5m4%J5j3J3kK4l4J6
$$ plain form
4073 16 -41 47 42 15 25 -18 -2 36 57 -43 -37 83 -24 34 12 8 -49 1 29 -21 -53 -5 37 21 -9 21 66 15 29 -14
4103 -14 39 5 6 -34 41 46 20 -11 16 47 46 24 31 1 -43 -39 38 -26 -26 -13 -8 26 -26 -51 -2 41 -78 -40 31 -11 24 -7 13
4136 13 13 -17 -33 -11 37 1 -6 28 -20 -11 27 23 57 7 -22 18 48 -10 -25 -16 -20 21 -8 -33 -7 20 27 -23 18 -8 -31 29 34 45
4170 45 36 20 26 -8 42 35 18 11 -43 45 47 22 -29 -17 2 14 34 21 30 -32 25 15 20 -9 -7 -20 12 -34 11 5 20 -38 -35 5 -5
4205 -5 -3 -19 6 11 -24 -45 -12 -24 16 -16 -16 37 27 -10 23 -5 -7 -56 4 -7 -17 -66 54 20 -13 -2 -19 23 -35 24 -6 -45
4237 -45 20 20 60 3 -2 43 66 6 -55 5 -15 -17 -15 -18 7 -22 22 6 25 -17 -36 -12 17 -1 -12 22 -20 7 -5 53 9 34 -38
4270 -38 30 -32 -34 73 -10 -13 41 -39 3 -10 -9 3 31 1 28 52 -16 10 -12 -45 14 37 41 -52 17 57 -23 -54 14 6 35 -7
4302 -7 36 4 -10 -4 -37 22 41 0 4 23 23 -37 32 -1 -36 -15 -30 -4 13 -46 5 25 11 -10 -42 33 19 -28 -14 -25 -3 0 57
$$ packed form
4073A6n7Q8nk7J0m3J6L8K1j00OJ20j07N8k2mn7N0K8n0l2M8M2j6l0L0M5n1J4m3
4103a4N3l4Jm0P5Nk6l1K7L1jk2Pl0m4MP7o4%J3NL4n2k5M9M3j19L8P1m2L5l1K0
4136A3%l0j6K2M8l6pL4m8RL8mL4n0k9M0L0n8j5RmM1k9k5K6K7Pn0M1k6k3O0NJ1
4170D5rj6Ol4N0pj7pn4Q8Kk5n1J2J9J2K0j3Ro2N7j0Nk9Kj3L2m6M5oJ5n8LM0j0
4205eKj6K5Nl5k1L3j2M0l2%N3j0l7L3k8km9O0j1j0m9J20l4l3J1j7M2n8N9l0l9
4237d5O5%M0n7nM5K3o0o1O0k0kKlK5k9M4j6J9m2j9K4K9j8j1L4m2K7j2N8m4K5p2
4270c8O8o2kJ07q3lN4q0M2j3JJ2K8l0K7K4o8K6k2l3N9K3Mr3O9M0q0l1O8qK9m2
4302gM3l2j4Ol3N9J9m1MJ9%o0O9l3l5K1j5K6J7n9N1K0j4k1l2P5j4m7J4j1K2LN7
$$ plain form
4335 57 57 2 34 41 33 30 -21 -2 2 24 37 -23 11 8 -11 -28 -43 30 -39 5 -12 -61 9 17 -15 14 -15 17 -19 -17 -27 17 31 -17
4369 -17 38 -33 66 13 41 -28 27 46 29 6 44 2 -1 12 5 -65 -46 38 -3 -12 17 -40 -14 -19 21 -14 36 8 -12 35 -3 -12 -19
4402 -19 -36 9 69 -72 -24 12 13 -43 -23 19 32 20 -39 27 10 -40 -30 26 -22 6 -27 -20 16 -42 40 5 7 -22 4 29 39
4433 39 -42 4 47 62 -31 38 23 16 37 -15 21 8 -41 3 58 -55 -11 -56 -48 2 43 7 -9 -1 18 -37 10 -11 -31 14 -47
4464 -47 31 -64 -12 43 -9 -67 2 -5 13 -57 -6 -42 -38 -1 0 -3 -50 -12 42 -5 34 -6 1 81 43 -36 -22 26 39 6 -31 44 7
4497 7 -56 15 -10 1 -62 -22 30 -19 -22 -51 -93 -10 -13 -31 -9 -33 -15 -6 -2 -12 17 -15 -5 10 -10 -25 46 4 -64 -5 -19 -40 14
4530 14 13 19 -20 20 15 0 19 -3 53 -1 5 11 24 1 15 20 -34 -4 -49 -7 -20 -3 55 -25 -35 -12 40 6 1 15 24 -9 18 46
4564 46 14 8 14 -16 -11 -46 11 -28 2 18 14 -14 -37 -22 8 -40 39 -11 -17 35 16 25 30 -15 26 -23 -25 37 -11 -19 1 12 -16 -41 14
$$ packed form
4335E7%n5L2Pqln1J9MK2J3o0L4lj9j7j5P3o9M4j7m9P0Ql2K9k9L2l6Kj0M4J4m8
4369a7N5p1R9n3K8o9N5J9j7k3L8m2lJ3pp0J9Q4m1rK9n7K6nM0l5N0k8k0M7l8rp
4402a9j7M5O0j41M8L6Jn6K0M2J3j2n9O6j7n0J0N6m8K8l3PL6n8Q2l5Kk9K6K5J0
4433C9q1M6M3J5r3O9j5pK1n2L6j3m9M4N5j13M4m5QN0M1l6j6QJ9n5M7k1k0M5o1
4464d7P8r5N2N5n2n8O9pJ8p0N1l6ML7Jlm7L8N4m7L9m0PQ0l8p9J4M8J3l3l7P5l7
4497Go3P1k5J1o3M0N2m9lk9m2Q3lj8K2k4J8RMj0K9l2J0J5k0j5P1m2o8N9j4k1N4
4530A4jOl9M0nj5J9k2N6n4OOJ3k3J4Nn4L0m5M2j3J7N8q0j0K3N2l4nJ4Rl3K7K8
4564D6l2oOl0Nl5N7l9L0J6mk8k3J5L0m8P9n0oN2j9RNm5M1m9kO2m8qK0J1k8k5N5
$$ plain form
4599 14 8 -105 -8 26 -23 -18 -10 22 57 -72 -40 -6 3 22 -80 23 1 18 21 59 27 -38 22 49 -16 -10 -7 -6 8 53 13 3
4631 3 -53 -29 -3 -75 -77 11 9 33 42 -46 -16 -37 15 -12 12 26 -17 -41 -15 -40 7 15 -28 42 2 16 1 7 -3 -3 6 -12 16 13 18
4666 18 18 1 -31 8 -3 -17 10 70 24 0 45 0 -6 55 23 -26 4 -28 -6 55 36 -28 -11 11 -25 -6 34 -41 17 -4 -13 -18
4698 -18 -1 5 39 24 -40 60 4 18 0 -51 -6 -6 63 -2 -36 20 -7 -22 -5 26 0 55 -18 1 -26 -23 -31 -23 20 38 -43 2
4730 2 -17 -2 34 -40 -30 23 -26 -34 55 -3 -5 32 11 14 4 9 45 15 -31 -10 9 15 53 16 31 -46 -30 -37 35 -17 0 -37 40 -12
4764 -12 -20 13 42 -22 -55 -46 14 10 4 38 41 -17 -18 77 14 -1 3 -2 -24 61 -25 13 41 16 6 12 26 4 27 -29 -34 24 -20 26 10
4799 10 0 -24 -40 13 21 48 3 0 5 -38 13 26 46 -15 -9 24 -2 -33 28 -29 -32 6 31 -7 14 21 26 6 -63 -24 13 14 -46 -45 -4
4834 -4 35 33 43 -21 34 -35 2 -32 -32 21 17 -2 85 36 -10 0 -22 -8 -23 -24 33 -2 2 -36 -43 -47 19 52 4 53 51 12 -14 26 -25
$$ packed form
4599A4oj13R7L4m9NQL2L5j29L2L4RJ9j02J03k2J7LL8l2o5O0K7o5OLJJ4M5m0j0
4631Cn6K4K6p2kQ8kK4Rq8L0k1N2k7K4J4m3k4K6k5M7Qm3P0m0J4j5Oj0%Rj8K8lN
4666A8%j7l2L9j1j4K7O0m6k4M5m5oO1l2m9L0l2K2O1j9o4J7K2l6J9M0p5N8k1rn
4698a8J7OL4j5o4J00n6J4j8n1M5%O9o5l4N6k7j5J7L1k6N5p3J9k7LqQM3J8q1M5
4730Bj9J5L6p4J0N3m9qQ9n8kL7k1Lj0NL6l0m6K1J9OL8l7J5p7J6pP2n2J7l7P7n2
4764a2qL3K9o4l3RO0moL4Ln8jR5o3j5Mnk2Q5q6L8K8k5j0OJ4k2K3n6nN8m4M6j6
4799A0j0k4j6N3QK7m5lNm3N1J3K0o1OL3k6l1O1n7lL8K5l8K1PNk0o9L9L7Jo0JM1
4834dL9kJ0o4N5o9L7l4%N3mj9Q7m9m6J0k2J4j5jN7l5Ml8pmO6L3m8M9kl9k6M0n1
$$ plain form
4869 -25 5 -21 -11 14 2 26 10 19 26 42 11 0 43 -1 35 -50 -17 -21 -14 32 -53 12 -33 -29 8 -9 27 34 5 9 -6 2 10 -14 24
4904 24 -11 -4 -68 -25 -28 -4 41 2 3 17 12 25 -24 42 0 -14 -11 12 -21 -53 -15 16 9 -17 17 -75 5 -13 26 -30 13 14 -21 0
4938 0 17 7 18 -53 -22 15 -46 74 6 92 25 49 65 16 -30 30 -10 -9 -41 -26 -17 -13 20 21 -28 36 -10 10 14 -28 0 -10 -19
4971 -19 -8 -27 -57 -4 -28 -16 -4 62 3 -29 41 -26 24 -32 34 -4 -3 33 48 11 -28 40 55 52 6 -2 13 34 -7 -30 39 39
5003 39 -42 27 55 24 8 28 41 -12 -8 1 -11 9 6 -4 50 -22 15 -5 -14 -5 -15 -50 2 45 -41 -32 35 58 17 -1 -1 41 -17 -1
5037 -1 36 -10 32 14 5 -9 31 33 -22 60 16 80 -17 -8 22 -4 27 -4 -28 -32 -48 -7 -22 -1 -47 49 12 -42 15 37 -27 -56 42
5070 42 30 -17 -50 45 10 14 -11 8 21 26 -28 19 -25 -15 10 -46 12 -30 14 -60 39 55 -9 25 -31 -19 -17 24 31 1 13 -8
5102 -8 25 -4 10 12 -19 0 6 34 -36 -19 -40 -38 37 21 -60 -29 -26 20 -8 7 -17 0 2 -39 10 -19 28 8 -39 9 9 12 -12 29
$$ packed form
4869b5L0k6J0K5j2K4j6RPJ6l1j1M3m4L6q5L3mPM6q5O5m5ML7j7L6Pk9Mj5QQk4L8
4904B4l5Po4M3lK4M5l9JJ4nJ3m9O6m2j4LK3l3l2L8L1pk6L4r2Q0j8L9n6M3Jl5K1
4938@J7j0J1p1L1L7o1J20o8Q6o7K4J6m9m6O0m0Jl2J5RML3Jm9O4m6K0Mm2K8j0r
4971a9J1j9l0N3k4J2J2O6n9l2P0o7N0n6O6l8JL6J5l7l9O8J5lm6qJ5K1m1k3O9%
5003C9q1O9K8l1j6K0J3n3MRj2K0lj0N4p2L7k0rRj0l5N2M3q6RO7K3m1j8%M2n8J6
5037aL7m6M2j8rj4M0Kn5Q2m4O4r7RL0k6L1l1k4mj6M1j5K1m6R6l7n4N7K2o4k9R8
5070D2j2m7l3R5l5Mk5J9J3Nn4M7m4J0K5n6N8m2M4p4R9J6o4L4n6J2KM1Pl0J2k1
5102hL3k9J4Kl1J9OK8p0J7k1KP5j6q1L1LM6k8J5k4J7Km1M9k9M7k0m7M8%Lk4M1
$$ plain form
5136 29 1 1 -30 -12 -53 18 15 -61 -83 12 28 -9 30 2 3 -51 -15 4 27 -23 -1 20 26 -59 68 -7 17 -1 -58 39 16 -11
5168 -11 36 -16 -5 8 -89 27 51 37 12 6 -32 52 4 -26 -7 -50 39 -57 0 -3 41 32 -42 -44 -36 26 -25 -38 27 52 9 17 -8
5201 -8 10 53 0 -1 8 36 -24 11 58 -10 -55 -18 42 -56 -27 26 20 -15 -24 3 -6 -14 7 -1 1 -14 23 43 10 -42 -18 33 10 46 -24
5236 -24 14 10 -21 -10 39 11 28 -18 -25 -31 8 68 27 -32 -14 -6 52 -30 -6 37 8 34 -8 -8 48 -20 -38 14 -3 61 10 5 31
5269 31 -6 -12 -4 -8 18 -23 13 10 62 -41 7 5 54 4 -19 20 -18 18 34 39 5 19 -27 38 -28 2 18 1 1 30 14 0 44
5302 44 8 -9 13 -28 -27 -16 -12 0 -21 50 -32 -5 7 20 -20 -2 13 8 -26 14 21 22 1 -4 -32 -33 41 30 56 38 36 4 -1 -24 36
5337 36 -30 46 -46 11 37 26 44 11 67 19 -41 23 2 -13 -35 3 44 -17 -21 5 23 28 18 34 6 22 -7 45 -12 -19 -79 -28
5369 -28 -25 -23 -42 -12 23 -52 -65 14 -3 3 20 14 -1 -31 29 17 2 -2 32 -3 -1 3 51 -15 47 -71 20 51 13 -9 -23 0 -29
$$ packed form
5136B9k8%l1J8m1P1lp6k2R5J6l7L9k8Jn4L6J9K3n0K2K1Oq5J27p5K4j8n7R7k3k7
5168a1M7n2J1J3r7J16K4j4k5ol8Q4m8l0J9m3Q9r6N7lM4rp4kQO2n1j3O5K5m3Qk5
5201hJ8M3n3jRK8o0L5M7o8m5L7O0r8K9N3ol5rK7rqK1qKj5L7K0l3n2K4N1k3L6p0
5236b4L8ml1J1M9k8J7m6poL9O0m1n9J8QN8q2K4M3k9K6m2%N6o8j8N2j7O4n1nK6
5269C1l7oQmK6m1L6lN2j03M8kM9n0k3L9l8L6J6Nl4J4m6O5o6L0J6j7%K9j6j4M4
5302D4l6j7K2m1JJ1MJ2k1P1q2K7J2J3m0J8J5nl4M0PJk1nk8jP4j1K6j8kl2nk3O0
5337C6o6P6r2N7K6j1J8l3N6m8o0O4k1j5k2L8M1o1mK6J8Nj0J6k8J6k9N2n7po0N1
5369b8LKj9L0L5p5j3P9j7OJ7oj5l0O0j2j5mL4l5KMM8o6O2j18R1L1l8k2j4K3k9
$$ plain form
5402 -29 -16 -12 -26 28 33 -18 35 -26 -6 -20 56 21 0 20 5 -23 -5 -5 22 -9 1 -16 7 39 9 31 -1 -57 10 29 -12 -34
5434 -34 -8 -8 -49 3 9 39 -6 -2 -25 10 6 -20 -38 27 11 -42 -26 -1 -46 -4 -21 21 46 -20 8 8 33 3 10 -3 13 -50 -12
5467 -12 0 -9 22 -54 -47 3 14 -7 -20 27 19 -9 -56 20 -9 -41 28 16 14 4 4 12 1 51 30 -12 -4 -7 69 -1 29 -21 -14 17 36
5502 36 16 2 -2 -36 -12 -9 -14 -30 -69 -39 23 25 20 53 7 -28 36 6 40 3 -28 -15 34 29 -8 -26 -1 51 0 -57 -14 35 -53
5535 -53 -8 -16 3 4 8 15 -10 6 -27 -45 -29 -5 19 36 4 -3 56 34 29 31 -11 -17 48 -48 51 7 32 12 -23 34 26 -38 -15 7 20
5570 20 -69 -19 5 -16 -23 -24 28 -12 -2 -13 19 -47 25 21 28 12 59 5 6 27 3 -7 8 -2 -12 -6 -16 -39 53 -10 57 80 -46
5603 -46 -2 53 -59 -1 -32 21 16 -25 15 16 18 21 7 0 30 13 32 9 -4 -25 20 47 51 -43 32 -3 15 4 -17 -57 -9 8 -30
5636 -30 -19 29 -6 49 21 -8 17 12 35 13 -19 -40 -3 2 -23 3 -8 12 -26 23 25 -56 -54 -16 23 -22 70 21 -5 -32 -27 -33 -30 3
$$ packed form
5402b9J3Mj4N4Nn1N3o1K0j4P6l5k1K0j5k8J8%K7l1J0j7K3L2l0K2l2n6O7J9m1k2
5434c4K6%m1N2OL0m5Mk3L5mk6j8O5j6n3J6K5m5M2j7M2K5o6K8%K5l0Pj3J6o3L8
5467a2J2rL1p6PN0J1k1j3M7qk8m7P6k9l2O9j2kj0%Qj1N0k1m2QlP6p0L0n0PL1J9
5502C6k0j4ml4K4Lnj6l9L0O2KnL3m6l5O4l0L4l7l1J3M9nl7j8K5N2n1n7M3M9q8
5535e3M5qJ9JMPk5J6l3j8J6K4K4J7l2pN9k2nKm2oO5r6R9m4K5k0l5N7qo4K3K2J3
5570B0q9N0K4k1pjN2m0J0j1L2o6P2mPj6M7n4JK1k4j0J5j0j0Oj0k3R2o3O7K3j26
5603d6M4N5j12N8l1N3nm1M0JKLj4pL0j7J9k3j3k1M5K7Mr4P5l5J8j1k1m0M8J7l8
5636c0J1M8l5N5k8k9K5nK3k2l2k1L7Nk5K6j1K0l8M9Kq1KL8L9m5R2m9k6k7NoLL3
$$ plain form
5670 3 -49 10 9 -3 -40 -12 43 10 6 -53 30 -6 7 -15 78 -39 6 -6 -2 5 -20 2 -12 -23 -25 -1 44 -62 -18 -45 11 -5
5702 -5 -65 1 -11 -17 -7 61 27 61 -24 -72 1 -6 1 -2 22 -3 42 27 13 11 -45 -34 6 -17 22 24 -52 -30 -13 4 15 -17 -45 21
5736 21 43 -14 48 -48 55 -22 -26 15 -16 18 -42 62 3 -15 34 2 -13 -30 51 -2 -21 -8 53 -20 -20 2 -18 -28 -42 -10
5766 -10 22 35 44 -5 -5 46 10 -33 -27 -4 -7 -10 -29 26 -51 3 -1 30 -7 -3 19 47 -12 -11 2 -19 -40 -18 -93 -13 58 -10 -2 3 -9
5801 -9 28 -43 9 9 -25 -36 15 59 12 44 5 32 1 40 -54 -17 -6 5 29 3 -22 3 0 5 -36 -12 19 -45 28 41 40 25 -75
5834 -75 -4 -76 38 -61 -35 24 61 -63 43 12 -41 19 -9 15 36 -2 31 20 -42 -23 58 -51 -27 20 6 25 19 -47 1
5863 1 8 -1 -14 10 52 16 -38 24 6 20 -80 -17 29 4 -41 -12 9 1 11 0 -2 45 12 -38 44 25 55 69 16 12 -23 66 32
5896 32 2 -2 -14 -3 -44 -36 2 23 46 18 3 6 -37 -6 24 15 12 20 -28 39 17 -9 20 15 6 3 26 40 -5 -27 13 39 22 -18 -14
$$ packed form
5670Cn2N9jj2l7K8N5l3mn9Q3l6J3k2R3j17M5j2MPk5K2j4j1kK4M5j06M4k7N6j6
5702eo0O6j2oJ0O8l4L4q5m8P3pPlK4k5M5j5j4kn6J1M0k3L9Kp6K2J7J7J1l2k8O6
5736B1K2n7O2r6J03p7mM1l1L4o0J04n9j8M9l2j5j7Q1n3j9J3O1p3%K2k0j0j4L2
5766a0L2J3Rm9%N1l6m3OK3llj9N5p7N4mL1l7MK2K8n9JJ3k1k1K2p5Q0P1o8QNj2
5801iL7p1N2%l4j1N1M4m7L2l9K7l1L9r4L7J1J1K4k6k5K5lNm1K4L1o4P3J3jj5j00
5834g5P1p2J14r9K6N9L7j24J06l1n3O0k8K4K1l8L3j1o2J9Q1j09K4M7j4J9oo6M8
5863APrj3K4M2l6n4O2j8J4j00O3M6k5m5K9K1qJ0j1kM7l3n0Q2j9L0J4n3ml5Q9l4
5896C2l0mj2J1m1QL8K1K3k8j5Lm3L1L0rlQm8O7k2k6K9nrlK3J4m5k2M0K6j7m0M
$$ plain form
5931 -14 20 0 -32 4 -5 47 42 -25 -3 15 -28 11 28 -17 19 -15 16 19 -43 13 -17 -12 -40 -39 51 -10 -35 1 24 28 3 19 10 51
5965 51 16 32 -14 -11 47 4 23 -37 4 -43 3 11 23 20 71 -62 -60 -8 40 35 13 -15 -37 -21 -12 49 -13 4 3 -27 -54 21 -2
5998 -2 27 -5 12 -35 -45 5 -2 -7 45 31 -18 14 15 60 -7 -5 -15 57 -44 -21 19 -23 -54 8 23 -6 2 15 -10 -4 1 9 3 -12 -7
6033 -7 -1 -48 0 -36 -52 7 21 30 -47 25 14 10 -41 -3 19 -11 -14 -8 37 22 -49 -22 -1 6 -20 -65 0 18 -2 33 13 15 -66 84
6067 84 31 -9 -46 -29 13 -60 13 0 -14 -29 34 34 -55 -16 -2 -26 -12 15 -54 5 21 34 -29 25 -31 6 9 3 2 20 -3 12
6099 12 19 -14 31 46 -21 -34 -27 65 11 1 -50 33 33 17 19 -26 -24 -33 -14 46 2 -18 30 34 31 -71 20 45 29 -11 -25 13 29 44
6133 44 -12 28 15 -12 14 0 -3 7 62 -1 -29 -46 15 50 7 47 32 0 -24 48 -1 -13 20 -14 21 -22 -4 -51 28 83 29
6164 29 33 17 4 0 -33 18 -3 0 -33 17 -65 -20 15 -51 -30 -34 21 2 -22 -12 -5 10 74 -4 68 -22 27 17 22 40 55 29 -11
$$ packed form
5931a4L4k0l2L6rN2no7K2J8m3L9J7m5L6l4L1Lo2N6l0Nk8JR0o1k5L6K3Mk5J6rM1
5965E1l5J6m6LN8m3J9o0M1m7M6QJ2lN1j33KN2M8nk2k8k2J6RO1o2J7jl0k7P5k3
5998bK9l2J7m7j0N0pnN2j4m9L2JM5o7Kj0P2j01K3M0m2l1O2J5k9QJ3k5ONQoj5N
6033gOm7M8l6j6N9J4Rp7P2j1mn1L8K2l0lOM5j5p1K7K1Pk6m5O5J8k0L5k0Kq1J50
6067H4n3m0l7J7M2p3P3j3j4j5O3%q9L9J4k4J4K7o9N9J6J3o3N4n6L7LojJ8k3J5
6099A2Pl3M5J5o7j3PR2n4j0n1Q3%j6Km5KrJ9O0m4k0M8Mlj02R1K5j6m0j4L8J6J5
6133D4n6M0j3k7K6j4lJ0N5o3k8j7O1L5m3M0j5l2k4P2m9j2L3l4L5m3J8m7P9N5n4
6164B9Mj6j3ml3N1k1Ll3N0q2M5L5o6K1mN5j9k4J0PJ5O4p8P2r0M9j0NJ8J5k6m0
$$ plain form
6197 -11 -3 4 18 12 -35 -4 -11 -32 -43 -12 -4 -8 35 -20 32 -19 -15 -15 -13 -13 -19 -30 -54 -25 13 33 -18 3 -32 3 -45 -5 9 21 -13 59
6233 59 26 10 1 3 3 13 5 -18 21 30 33 -45 3 -16 -21 -39 31 2 -7 -46 -3 -29 -11 -6 5 20 -16 19 -23 62 19 -58 51 -19
6267 -19 -24 -21 -19 -42 -48 -2 6 35 1 -7 -23 26 1 30 9 21 3 -11 10 -57 -21 28 -13 -26 -8 -17 1 -14 18 4 1 -27 57 -37
6301 -37 -34 2 -15 -39 -12 24 5 -42 20 -30 -28 20 15 -40 -1 -53 -29 -21 -17 -51 -38 -18 36 30 17 16 4 20 11 -8 7 -30 -37 21 -6
6336 -6 -7 -20 -52 -57 -14 17 -26 14 -37 24 -25 -7 -20 -14 -3 7 7 -41 13 -12 -38 48 -37 -19 13 10 67 3 37 40 23 -18 -58 -32
6370 -32 40 -53 -36 -14 33 -57 -5 25 -22 -12 10 53 39 -1 51 4 25 -1 -21 32 -26 39 22 -34 -18 -23 0 46 39 38 33 27 -37
6403 -37 17 28 33 39 -7 40 -18 0 19 50 -34 -19 -17 -15 24 -10 -50 -36 -17 13 3 -4 7 32 43 -25 -26 28 -30 7 17 -43 -44 16
6437 16 1 12 -4 -17 -1 -6 -41 -43 18 19 85 3 1 9 6 9 15 26 -2 18 11 24 -52 -21 68 24 -20 13 -14 9 -27 44 45 -21 47
$$ packed form
6197a1QPJ4om7L1pk1j1L1QmM3n5N2n1M%K%oj1k4K9L8K0n1K1l5L5m8M0J4J2l4P2
6233E9l3j6rK%J0qk3L9RLp8M8j9nj8P0k9rl9M3k6J8NJ1J5l6L5m2Q5m3p7J09p0
6267a9nLKk3oM6QK9l4qj6M9k5K9k1J2j8j4K1o7L6M9m1j3J8rJ8j5L2j4lk8Q4r4
6301c7LL6j7k4K7L6j9m7O2n0KM8nn5L9n2K4QMl4J3K0N4oj3jj2J6rj9J5l7pN8k7
6336fjj3l2nM3L1m3M0n1O1m9J8j3OJ1J0%m8N4k5k6Q6q5J8L2lN7o4L4Lj7m1m0K6
6370c2P2r3J7K2M7r0N2L0m7J0K2M3j4m0N2m7K1k6k0N3n8O5j7n6J6nK3M6pjnoo4
6403c7N4J1NOm6M7n8J8J9L1q4J5KKL9l4m0J4J9L0j0pJ1K5J1o8jN4n8L7J0o0jO0
6437A6j5J1j6j3J6nl5kO1JO6q2kQlLOJ1k8K0pJ3p6L1Q9m4m4L3k7K3l6P1Jo6O8
$$ plain form
6472 47 32 -5 -5 -6 -46 3 15 -14 71 2 62 8 15 13 -1 51 31 44 54 -46 -15 54 5 -29 -54 27 46 -11 41 3 -23 -42
6504 -42 -5 33 16 -5 4 -15 20 -1 31 30 20 -20 39 1 -22 -16 -11 48 22 -31 21 -15 8 2 -24 5 -68 12 10 18 -8 -41 -6 35
6538 35 -29 -36 -93 35 -36 -49 -17 -6 46 -50 -17 -5 9 48 -43 17 13 -39 -30 -56 -23 11 19 -22 -2 -5 14 15 -8 -58 53 -3
6570 -3 -5 -3 34 83 11 7 -4 -5 -86 0 44 4 -22 -45 58 31 -80 -34 42 -27 6 47 -27 -14 65 20 -10 29 -15 -33 -21 -18
6602 -18 1 -23 3 23 3 -13 -1 10 -83 -15 31 12 -63 -53 -48 -21 -9 21 -2 -16 -32 -26 27 -24 -12 -12 -1 20 -2 -28 9 -42
6634 -42 -22 -71 6 59 -39 -26 22 -18 -3 -57 16 -13 -52 23 71 30 31 5 -13 -19 0 37 19 -3 46 12 1 31 -28 -13 49
6665 49 10 -5 20 24 3 25 4 12 15 -27 -28 -13 -10 -7 16 19 -10 -14 -35 -29 41 9 -7 20 -14 -21 62 -21 17 -5 -35 36 -54 -2 -42
6700 -42 -52 5 5 13 -14 -27 9 46 44 14 -3 27 -29 10 -9 7 -8 14 -34 1 23 7 -60 -33 71 -10 -68 14 -1 28 -85
$$ packed form
6472D7j5l7%jm0M9J2k9Q5o9O0n4Pkj4N2k0J3J0j00L1O9m9l4k5Q1J9n7N2l8k6j9
6504d2L7L8j7k1Rj9L5k1L2jj0m0N9l8k3ONN9k6n3N2l6K3ok6K9p3Q0kQk6l3L5M1
6538C5o4pn7J28p1j3L2J1N2r6L3J2J4L9r1O0mn2Rk6L3L4Qm1K0lJ9Jk3n0J11n6
6570ckKL7M9p2mj1jq1Q6M4m0k6k3J03k7j11M6P6o9L3M1p4J3P9m5l0L9m4j8J2L
6602a8J9k4K6K0k0j6J2J1r3O8M6j9p5J0NK7J2L0k3j4j6ON3n1J2%J1K1k2k6L7n1
6634d2K0m9P7N3r8J3M8m0J5n4P3k9l9P5M8m1Jk6j8oJ9L7j8k2M9l4j1L0n9J5O2
6665D9l9j5K5Mk1K2k1QLm2jJ5LLK3Lk9mk1OP0l2j6K7l4pQ3q3L8k2l0P1r0N2m0
6700d2j0N7%Qk7j3L6L7kl0j7L0n6L9j9J6j5K2m8L5K2j6o7K7J04q1n8Q2j5K9j13
$$ plain form
6731 -85 11 19 -21 -23 -37 7 31 14 5 -23 -28 21 47 -6 11 31 14 35 36 19 2 85 -23 -74 12 10 -8 -12 -37 31 -12 -35 -18
6764 -18 39 -27 -34 19 -13 20 -18 -19 0 -48 -2 38 -7 -32 21 -25 34 22 12 23 29 -12 41 19 76 49 -31 -20 -16 -21 -79 16 -55
6797 -55 -20 9 -31 -36 -14 -32 2 -25 -1 -5 8 53 11 -50 -20 -31 19 4 13 -2 29 22 52 36 20 -57 -3 -25 -73 -31 19 -16
6829 -16 -7 -60 -5 -36 -37 -33 -46 -9 25 -16 34 18 -9 -30 51 16 -7 -37 24 10 -28 37 2 -31 -20 40 17 -8 -1 6 -17 22 -18
6862 -18 -67 58 50 -75 -14 -12 15 53 -48 51 -43 61 -7 -6 16 72 -47 -6 40 -27 -62 57 16 -33 -18 1 14 55 12
6891 12 -44 16 -4 -12 -26 17 11 -70 11 -17 -15 -9 -1 -10 -25 -18 -15 -57 13 11 43 22 19 14 59 19 62 -11 -21 -23 -29 7 -27 26 1 -34 -30
6928 -30 6 -31 6 5 25 -58 -13 -9 22 -55 8 30 0 6 13 41 -18 -4 -12 -12 -34 -17 -54 2 -30 15 -24 2 -27 -51 2 -4 39 26
6962 26 -19 32 35 4 -39 60 2 -31 -46 3 31 -47 6 -6 -14 -2 26 29 23 -19 -48 -23 -2 15 -18 25 16 23 10 -45 -45 3 -29 13
$$ packed form
6731h5R6Qm0kj4M4K4j7rk8nM9K6n3J7K0j7K1Jj7j7Q3j08n1Q6kj8mk5O8m3k3J7
6764a8N7o6pN3l2L3l8jJ9m8M6M0m5k5N3m6N9j2j0J1Om1N3k2N7k7q0J1Mnn8R5p1
6797e5L5K9m0nK2j8L4k7K4mJ3M5m2o1L0j1N0j5Rj5L1pL0j6j6p7N4k2m8M2N0l5
6829a6Rn3N5l1jMj3L7L4m1N0j6k7k1Q1l5k3l0O1j4l8O5l5l3J1O0k3k5PPk3L9m0
6862a8m9J25qj25O1KK7L8j01R9r4J04o8JK2N6j19M1M6o7l5J19m1m9J5J9J3M1m3
6891A2n6O0k0qj4M3oq1Q1k8KOQrj5PLm2P0kL2k1lnM5m0M3p3j0koL6l4N3k5l5M
6928c0L6l7L7jK0q3M5ML1p7O3K2l0OPK8n9J4q%k2J7l7N6l2M5l9K6k9k4N3oM3j3
6962B6m5N1Ll1m3R9n8l3j5M9K8p8N3j2qJ2K8Lom2k9K5K1J7l3M3rPj3n5%M8l2M2
$$ plain form
6996 13 19 -14 -8 -7 0 -13 7 -9 -5 -24 -35 4 12 9 -26 -10 17 5 71 -27 59 -21 -16 8 11 2 -35 -33 -21 -87 34 13 -77 -58 -9
7031 -9 15 -17 -50 44 62 78 -10 -19 37 -15 16 -55 -37 41 35 19 -12 -17 -9 -3 47 -54 -55 -4 21 -32 -84 2 34 -44 -12 -33 -50
7064 -50 -6 -14 68 0 -7 -1 73 -15 9 2 38 -15 -5 -58 -8 35 -12 -35 0 44 -16 27 30 13 50 -13 -1 8 -62 -23 -7 -9 7 5
7098 5 -43 40 14 10 -3 21 3 16 -59 36 2 -63 11 7 -25 -31 -71 20 -38 -3 -17 26 10 -8 21 41 -61 -64 7 19 -17 -5
7130 -5 52 18 16 -64 7 17 56 -4 -21 41 13 -12 34 22 -46 -22 -7 29 -13 -33 15 -42 -13 10 -16 20 -19 30 -1 -38 -15
7161 -15 24 8 -16 -7 36 -3 37 21 -5 -10 47 1 25 63 -37 19 -9 14 6 3 -18 -13 -19 -14 12 -2 -90 -12 -28 8 -8 -7 6 43
7195 43 47 -36 7 4 37 -18 -12 10 21 13 -38 22 0 -13 38 -22 14 -4 -23 12 3 -18 -71 -13 -13 -7 -22 -7 25 37 12 -47 -10 -36
7229 -36 -13 8 18 -54 17 60 28 -28 3 -29 33 8 43 13 -42 41 12 50 35 -18 47 -9 -22 35 -4 45 -18 -2 1 36 -41
$$ packed form
6996A3Ol3OJPj3K0j6Mj9j1L9Qll5J6K7j2O6r8Q6q0NK4Lrl7KJ2o6J21k1r0J9M9
7031iK4l2l3R4J8J6q8rN6n2L1p1J8P8oj6l1nQON0j01jN1K5n3n2Q6L2p8L2k1j7
7064e0M4qQ2o8pOP4q8K4pL6n3J0n3N0M3m7k3L5M4o0M3Lj7L7o3J2Rp0L9J6kJ6k
7098Em8Q3k6mj3K4j8J3p5R5l4o5P4ml2om0R1n8L5j4M3j6j8K9K0j02lP1J2l6J2
7130eN7l4kq0P1J0L9o0j7O2k8k5M6j2o8K4J5L6m2k0M8n7K9K3k6L6l9M9l1l7K3
7161a5L9j6k4RM3l9M0j6k6nN7m6K4L8j00N6k8K3qlk1NoNK6j4q8P8j6L6j6JJ3L7
7195D3Mq3M3lL3n5OK2J1qn1O0k2j3N1o0L6j8j9L5rk1n3N8%Oj5J5L2J2k5n9L7k6
7229c6K3K1J0p2P1M3l2n6L1l2O2k5L5l0n5Q3k9L8j5n3O5n6j3N7l9M9o3J6LL5p7
$$ plain form
7260 -41 -5 8 7 85 77 -27 54 43 2 -23 -39 45 -29 -44 15 8 36 -8 -14 10 6 -10 17 -8 -32 -39 69 -25 6 -36 -32 -6 -10
7293 -10 -28 -13 37 -4 24 18 -67 -24 -10 22 -38 -51 -5 -11 26 10 -32 -14 15 -70 -12 16 17 -17 -32 0 -23 -23 -4 28 32 -8 -34
7326 -34 -19 -17 9 61 -10 -9 7 2 -11 50 12 11 50 39 -11 6 34 -45 -9 -43 10 7 34 -27 -28 -1 -5 51 22 38 76 -21 -59 -9
7360 -9 -34 45 42 -75 -11 47 -40 -28 -12 -27 -23 19 -12 -29 -40 -9 37 -68 -6 -34 -18 -34 44 -7 -4 22 3 -8 34 -5 -21
7391 -21 -60 41 -4 6 51 -39 10 -16 -2 26 -34 0 -19 -31 -11 -28 17 -37 -45 33 -7 -14 29 26 -1 -43 -42 9 44 -40 30 73
7423 73 15 -28 -2 31 17 -3 -39 35 28 -20 10 39 -3 24 -5 42 34 -15 37 -27 -7 33 4 -46 -33 -27 -28 12 -8 -14 16 -9 -11
7456 -11 22 -32 19 43 -38 -19 -9 -18 -14 26 -11 62 -3 -11 3 14 -19 30 -3 -17 3 20 14 -18 28 18 -18 -33 -49 -5 19 8
7488 8 -13 -5 27 69 17 55 26 5 -42 32 32 -47 48 -19 16 -32 12 31 -10 -30 18 5 -14 16 -22 65 38 4 24 3 -4 -19
$$ packed form
7260d1L6J3jP8qj04Q1j1m1k5j6Q4p4j5N9pK8m4oK4mj6K7k5k4pJ08r4L1m2MK6m
7293a0j8J5N0m1K8oq5M3J4L2o0j3M6oL7j6m2J8K9q5N8K8Jl4j5L2k3%J9L2Mm0k6
7326c4J5KK6N2p1JJ6nj3O1l8jL9j1n0J7K8p9L6l4N3lK7o1jK7mN6k9J6L8r7l8N0
7360ik5P9lj17O4N8q7J2J6j5MM2l1j7j1L1M6j05O2k8J6j6P8n1LK6j9j1M2l9j6
7391b1l9J01m5J0M5r0M9k6J4K8o0L4j9j2K0j7M5n4qP8m0pM3lk7m2JN1L5q4P0M3
7423G3n8m3K6L3j4k0l6P4pm8L0K9m2K7k9M7qm9N2o4K0M0k9n0J3OjM0k0oL0k5k
7456a1L3n4N1K4q1J9J0rMM0l7P3o5qJ4J1l3M9l3j4K0J7ol2M6j0l6j5j6M4K4j1
7488Hk1QL2M2n2L8k9k1m7P4%p9R5o7L5m8M4J9m1k0M8j3j9L0l8Q7k7l4K0k1pj5
$$ [...]
8191G
##END NTUPLES=NMR FID
##END=
