##TITLE=1H_AM_NV61.1
 CDCl3
 8 sc, 
 29.9.2023
##JCAMPDX= 6.0         $$ Bruker NMR JCAMP-DX V2.0
##DATA TYPE= NMR FID
##DATA CLASS= NTUPLES
##ORIGIN= UXNMR, Bruker Analytische Messtechnik GmbH
##OWNER= root
$$ XWIN-NMR		Version 3.5
$$ Fri Sep 29 13:51:27 2023 Russian Standard Time (UT+4h)  she@DPX200
##.OBSERVE FREQUENCY= 200.13135
##.OBSERVE NUCLEUS= ^1H
##.DELAY= (6, 6)
##.ACQUISITION MODE= SIMULTANEOUS
##.ACQUISITION SCHEME= undefined
##.AVERAGES= 8
##.DIGITISER RES= 18
##SPECTROMETER/DATA SYSTEM= spect
##.PULSE SEQUENCE= zg30
##.SOLVENT NAME= CDCl3
##.SHIFT REFERENCE= (INTERNAL, CDCl3, 0, 15.7039)
##AUDIT TRAIL= $$ (NUMBER, WHEN, WHO, WHERE, WHAT)
$$ ##TITLE= Audit trail, XWIN-NMR		Version 3.5
$$ ##JCAMPDX= 5.01
$$ ##ORIGIN= Bruker BioSpin GmbH
$$ ##OWNER= she
$$ F:/spectra/data/she/nmr/H-F/1/audita.txt
$$ ##AUDIT TRAIL=  $$ (NUMBER, WHEN, WHO, WHERE, WHAT)
(   1,<2023-09-29 13:50:11.43 +0400>,<she>,<DPX200>,
      <created by zg, POWCHK disabled, PULCHK disabled
       configuration hash MD5:
       00 E9 B6 7A A2 85 ED C7 34 08 36 98 17 FE 4E 26
       data hash MD5: 16K
       13 D6 62 41 F6 AB 81 3B 12 BC 6A F8 3C 88 E8 F4>)
$$ ##END=
$$ 
$$ hash MD5
$$ 72 DB F8 1A 72 97 3B 48 A9 E0 55 A5 C9 BD 96 A3
##$RELAX= 
##$RELAX= 
##$RELAX= 
##$RELAX= 
##$RELAX= 
##$RELAX= 
$$ Bruker specific parameters
$$ --------------------------
##$DU= <F:/spectra>
##$EXPNO= 1
##$NAME= <H-F>
##$PROCNO= 1
##$TYPE= <nmr>
##$USER= <she>
##$AMP= (0..31)
100 100 100 100 100 100 100 100 100 100 100 100 100 100 100 100 100 100 
100 100 100 100 100 100 100 100 100 100 100 100 100 100 
##$AQSEQ= 0
##$AQ_mod= 1
##$AUNM= <au_zg>
##$AUTOPOS= <>
##$BF1= 200.13
##$BF2= 200.13
##$BF3= 200.13
##$BF4= 200.13
##$BF5= 200.13
##$BF6= 200.13
##$BF7= 200.13
##$BF8= 200.13
##$BYTORDA= 1
##$CFDGTYP= 0
##$CFRGTYP= 5
##$CHEMSTR= <none>
##$CNST= (0..31)
1 1 145 1 1 1 1 1 1 1 1 1 1 1 1 1 1 1 1 1 1 1 1 1 1 1 1 1 1 1 1 1 
##$CPDPRG= <>
##$CPDPRG1= <>
##$CPDPRG2= <>
##$CPDPRG3= <>
##$CPDPRG4= <mlev>
##$CPDPRG5= <mlev>
##$CPDPRG6= <mlev>
##$CPDPRG7= <mlev>
##$CPDPRG8= <mlev>
##$CPDPRGB= <>
##$CPDPRGT= <>
##$D= (0..31)
0 1.2 0 0 0 0 0 0 0 0.06 0 0.03 0 0 0 0 0.0002 0 0 0 0 0 0 0 0 0 0 0 0 
0 0 0 
##$DATE= 1695981010
##$DBL= (0..7)
120 120 120 120 120 120 120 120 
##$DBP= (0..7)
150 150 150 150 150 150 150 150 
##$DBP07= 0
##$DBPNAM0= <>
##$DBPNAM1= <>
##$DBPNAM2= <>
##$DBPNAM3= <>
##$DBPNAM4= <>
##$DBPNAM5= <>
##$DBPNAM6= <>
##$DBPNAM7= <>
##$DBPOAL= (0..7)
0.5 0.5 0.5 0.5 0.5 0.5 0.5 0.5 
##$DBPOFFS= (0..7)
0 0 0 0 0 0 0 0 
##$DE= 6
##$DECBNUC= <off>
##$DECIM= 32
##$DECNUC= <off>
##$DECSTAT= 4
##$DIGMOD= 1
##$DIGTYP= 9
##$DL= (0..7)
0 120 120 120 120 120 120 120 
##$DP= (0..7)
150 150 150 150 150 150 150 150 
##$DP07= 0
##$DPNAME0= <>
##$DPNAME1= <>
##$DPNAME2= <>
##$DPNAME3= <>
##$DPNAME4= <>
##$DPNAME5= <>
##$DPNAME6= <>
##$DPNAME7= <>
##$DPOAL= (0..7)
0.5 0.5 0.5 0.5 0.5 0.5 0.5 0.5 
##$DPOFFS= (0..7)
0 0 0 0 0 0 0 0 
##$DQDMODE= 0
##$DR= 18
##$DS= 0
##$DSLIST= <SSSSSSSSSSSSSSS>
$$ [...]
##$SUBNAM2= <"">
##$SUBNAM3= <"">
##$SUBNAM4= <"">
##$SUBNAM5= <"">
##$SUBNAM6= <"">
##$SUBNAM7= <"">
##$SUBNAM8= <"">
##$SUBNAM9= <"">
##$SW= 18.05172834244
##$SWIBOX= (0..15)
0 0 2 0 0 0 0 0 0 0 0 0 0 0 0 0 
##$SW_h= 3612.71676300578
##$TD= 16384
##$TD0= 1
##$TE= 0
##$TE2= 300
##$TE3= 300
##$TEG= 300
##$TL= (0..7)
0 120 120 120 120 120 120 120 
##$TP= (0..7)
150 150 150 150 150 150 150 150 
##$TP07= 0
##$TPNAME0= <>
##$TPNAME1= <>
##$TPNAME2= <>
##$TPNAME3= <>
##$TPNAME4= <>
##$TPNAME5= <>
##$TPNAME6= <>
##$TPNAME7= <>
##$TPOAL= (0..7)
0.5 0.5 0.5 0.5 0.5 0.5 0.5 0.5 
##$TPOFFS= (0..7)
0 0 0 0 0 0 0 0 
##$TUNHIN= 0
##$TUNHOUT= 0
##$TUNXOUT= 0
##$USERA1= <user>
##$USERA2= <user>
##$USERA3= <user>
##$USERA4= <user>
##$USERA5= <user>
##$V9= 5
##$VALIST= <valist>
##$VCLIST= <CCCCCCCCCCCCCCC>
##$VD= 0
##$VDLIST= <DDDDDDDDDDDDDDD>
##$VPLIST= <PPPPPPPPPPPPPPP>
##$VTLIST= <TTTTTTTTTTTTTTT>
##$WBST= 1024
##$WBSW= 4
##$XGAIN= (0..3)
0 0 0 0 
##$XL= 0
##$YL= 0
##$YMAX_a= 13588
##$YMIN_a= -10827
##$ZGOPTNS= <>
##$ZL1= 120
##$ZL2= 120
##$ZL3= 120
##$ZL4= 120
##$ABSF1= 10
##$ABSF2= 0
##$ABSG= 5
##$ABSL= 3
##$ALPHA= 0
##$AQORDER= 0
##$ASSFAC= 0
##$ASSFACI= 0
##$ASSFACX= 0
##$ASSWID= 0
##$AUNMP= <proc_1d>
##$AZFE= 0.1
##$AZFW= 0.1
##$BCFW= 1
##$BC_mod= 2
##$BYTORDP= 1
##$COROFFS= 0
##$CY= 11.3945322036743
##$DATMOD= 1
##$DC= 2
##$DFILT= <>
##$DTYPP= 0
##$F1P= 15.7292609196834
##$F2P= 12.9074282941183
##$FCOR= 0.5
##$FTSIZE= 0
##$FT_mod= 4
##$GAMMA= 1
##$GB= 0.15
##$INTBC= 1
##$INTSCL= 1
##$ISEN= 128
##$LB= 0.24
##$LEV0= 0
##$LPBIN= 0
##$MAXI= 10000
##$MC2= 0
##$MEAN= 0
##$ME_mod= 0
##$MI= 1.114404
##$NCOEF= 0
##$NC_proc= 0
##$NLEV= 6
##$NOISF1= 3.799351
##$NOISF2= 2.8
##$NSP= 1
##$NTH_PI= 0
##$NZP= 0
##$OFFSET= 15.70392
##$PC= 1
##$PHC0= -21863.36
##$PHC1= 3.652711
##$PH_mod= 1
##$PKNL= yes
##$PPARMOD= 0
##$PSCAL= 0
##$PSIGN= 0
##$REVERSE= no
##$SF= 200.130013532006
##$SI= 16384
##$SIGF1= 3
##$SIGF2= 2
##$SINO= 400
##$SIOLD= 16384
##$SREGLST= <1H.CDCl3>
##$SSB= 0
##$STSI= 0
##$STSR= 0
##$SW_p= 3612.71676300578
##$SYMM= 0
##$S_DEV= 0
##$TDeff= 0
##$TDoff= 0
##$TI= <>
##$TILT= no
##$TM1= 0
##$TM2= 0
##$TOPLEV= 0
##$USERP1= <user>
##$USERP2= <user>
##$USERP3= <user>
##$USERP4= <user>
##$USERP5= <user>
##$WDW= 1
##$XDIM= 8192
##$YMAX_p= 0
##$YMIN_p= 0
$$ End of Bruker specific parameters
$$ ---------------------------------
##NTUPLES= NMR FID
##VAR_NAME=  TIME,          FID/REAL,        FID/IMAG
##SYMBOL=    X,             R,               I
##VAR_TYPE=  INDEPENDENT,   DEPENDENT,       DEPENDENT
##VAR_FORM=  AFFN,          ASDF,            ASDF
##VAR_DIM=   8192,          8192,            8192
##UNITS=     SECONDS,       ARBITRARY UNITS, ARBITRARY UNITS
##FACTOR=    0.0002768,     1,               1
##FIRST=     0,             0,               0
##LAST=      2.2672688,     0,               0
##MIN=       0,             -10827,          0
##MAX=       2.2672688,     13588,           0
$$ Real data points
##PAGE= N=1
##DATA TABLE= (X++(R..R)), XYDATA
0@%%%%%%%%%%%%%%%%%%%%%%%%%%%%%%%%%%KrJ5j6J6j6J6j6J6j6J9k5L0l2L2l5
$$ 0 0 0 0 0 0 0 0 0 0 0 0 0 0 0 0 0 0 0 0 0 0 0 0 0 0 0 0 0 0 0 0 0 0 0 2 -7 8 -8 8 -8 8 -8 8 -8 11 -14 16 -16 16 -19
50a9M1m6M8n1N8o5P2q1Q9r7J09j23J38j57J80k08K45k85L02o56J4094p028j4424
$$ -19 22 -24 24 -27 31 -34 38 -43 46 -51 58 -65 73 -84 96 -112 133 -152 150 -506 13588 6560 -7864
73g864K293K733L152L914k104m588j135K16L516L234N20j964p512k332J2740N448
$$ -7864 -5571 -2838 314 4228 2124 -2464 -3599 -3383 133 3367 3887 1923 -5589 -7921 4819 10267
89A0267j0844m738L216MM521N034n646o906Q23N260N322j814o840j898J122K438
$$ 10267 -577 -5315 -2099 -2095 2426 7460 1814 -5092 -4269 991 6313 4499 -2341 -4239 -3117 -679
105f79N368j991p594K05L060P10M737Q33q399k882N997M681K33l982m180J002
$$ -679 4689 2698 -4896 -4691 -1631 -921 3816 4649 -3750 -6632 -635 4046 4279 297 -3883 -2881
121b881K370L117L522m491p437K692O379J724r52n455m603N092N511k467k916
$$ -2881 -511 2606 6128 1637 -5800 -3108 3271 4995 4043 -1412 -6015 -923 4588 2121 -795
136g95q49r69M98J813K842Q27o261m348O035O171j450m255m046Q77O627K263l928
$$ -795 -1644 -2613 -2115 -302 2540 3367 -2894 -7242 -1207 4964 3514 -741 -4787 -3910 2717 4980 1052
153A052k551l82O37L079J931j447k947k874J751N143L32l770j988j019J333M315
$$ 1052 -1499 -1881 -1244 1835 3766 2319 -628 -3502 -1751 3392 3724 -46 -2034 -3053 -1720 2595
169B595P05l980k974j30L154M188r53m867j966K119L918J822k733l038J13J293
$$ 2595 3300 -680 -3654 -3784 -630 3558 2605 -2262 -4228 -2109 1809 3631 898 -2140 -2027 -734
185g34K349K112k013l786k81K410K641N96k812l062K94K382K452K40l468l104
$$ -734 1615 3727 1714 -2072 -2353 57 2698 3294 482 -2580 -2286 96 2548 2788 -680 -3784
201c784J141L459K305j577m340j296L239K896l11j806j918k18J614K099J141j379
$$ -3784 -2643 816 3121 1544 -2796 -4092 -853 2043 1732 -74 -1992 -2210 -596 1503 2644 1265
217A265l215q85L105L306l55l484k744J435L512J355j911k726j267J396K680J096
$$ 1265 -1950 -2835 270 3576 3221 -263 -3007 -1572 1940 3295 1384 -1342 -2609 -1213 1467 2563
233B563j857k916q60K085K817J65k353k235Q1K298K222p4k231k147N41K787K262
$$ 2563 706 -2210 -3070 -985 1832 1997 -356 -2591 -2510 -212 2010 1936 -295 -2442 -1901 886 3148
250C148j026k941j614J656K938R08j866k691p17J870K427K33k066k515k30K348
$$ 3148 2122 -819 -2433 -777 2161 3069 1203 -1488 -2205 -335 2092 2325 259 -2256 -2486 -138
266a38K061l85k361j906M45K527J793p99k367j627J122K961J357j652k557o99
$$ -138 1923 1538 -823 -2729 -2284 243 2036 1237 -1130 -2757 -1635 1326 2683 1031 -1526 -2225
282b225K054K552J62k127j839j14J933J947k25k201j777K63K107J749r13k591
$$ -2225 -171 2381 2543 416 -1423 -1537 396 2343 2118 -83 -1860 -1597 510 2259 1346 -1245
298a245j241J007K254J101j477k286n72J536K166O08j763k019O9J865J990m4j969
$$ -1245 -2486 -1479 775 1876 399 -1887 -2459 -923 1243 1851 88 -1931 -1862 3 1993 1949 -20
315b0j691N81K038J447n37k258j324R92K060Q59j174k172r10J459J865L96j551
$$ -20 -1711 -1130 908 2355 1818 -440 -1764 -772 1288 2147 973 -1199 -2109 -650 1215 1611 60
332F0j927k72J757J654j52j596j479K61J903J456m68j672j250Q46J992J067j053
$$ 60 -1867 -2139 -382 1272 1120 -476 -1955 -1694 209 1665 1197 -475 -1725 -879 1113 2180 1127
349A127j822o68J153J768L90j330j655l00J260J593Qj616j616Q4J554J351m03
$$ 1127 -695 -1363 -210 1558 1948 618 -1037 -1337 -77 1516 1524 -92 -1708 -1624 -70 1281 878
366H78j709j087N38J616J147p04j788p54J130J733O58j086j641j88J415J408J04
$$ 878 -831 -1918 -1380 236 1383 679 -1109 -1863 -733 1000 1658 572 -1069 -1257 158 1566 1670
383A670j217j396KJ387J108j83j346j388K31J586R35o71j608j003Q75J669M26
$$ 1670 453 -943 -941 446 1554 1371 25 -1363 -1132 454 1389 718 -890 -1893 -1018 651 1077
400A077j043j192m12R44J442K65r67j106l11J248J603j04j316j106J39J508J195
$$ 1077 34 -1158 -1570 -626 816 1081 114 -992 -1303 -55 1548 1444 128 -978 -839 669 1864
417A864o67j540p14N03J302P09q71j399n13M47J489O81j290j333j88Q71J499K78
$$ 1864 1197 -343 -1057 -554 748 1457 586 -813 -1326 -879 610 1291 1 -1332 -1520 -649 850 1128
435A128j558j098M50J220R78q4j339p93N80J097R13l03j482p62Q65J174P03r22
$$ 1128 -430 -1528 -1078 142 1120 1036 -303 -1096 -516 581 1494 1191 -291 -1053 -188 986 1689 767
453G67j784k34J302Q98rr82j282P4J188O83J4r69j269L32J466Q66l44j342j040
$$ 767 -1017 -1251 51 949 940 -42 -1324 -1250 -62 621 635 -334 -1603 -1271 195 1061 717 -625 -1665
472a665J123J677Q8p98r04l95R32J149L5o45j092m82J045J318k16j200j176m5
$$ -1665 -542 1135 1223 425 -479 -874 58 1207 1242 597 -495 -977 68 1386 1170 -30 -1206 -1251
490a251J757Q42j165j165k30M05J067M76p56p84k87L31J318N77q16j069k99R23
$$ -1251 506 1348 183 -982 -1212 -807 260 736 -20 -804 -1091 -760 558 1135 319 -750 -1049 -126
508a26J546k9j491p30M53Q96Q81l99j359m08M27Q23N70m72j332l46N59Q41N80
$$ -126 1420 1391 -100 -830 -377 519 1400 1001 -358 -766 -339 484 1054 582 -750 -1096 -537 304 884
527H84q54j319R2R31P14K43q59r40K62J005P30k6q96q80M07J100O76k74j299o30
$$ 884 30 -1289 -1197 -266 448 691 -168 -1108 -846 159 889 863 -33 -913 -506 594 1270 996 -303 -933
547i33R69J081j93p21p32r8O56L50j8j35q41o32O69J167J64r99j218K22J680O95
$$ -933 36 1117 924 203 -529 -627 29 379 361 226 -615 -1247 -578 589 753 -246 -1464 -1242 438 1133
567A133r46r34j20P80Q18j6l95l34l29J48Q43M21m83q74n00O57J075Jj049p29
$$ 1133 187 -747 -867 -87 731 715 320 -14 -343 -195 648 1069 586 -288 -788 -131 944 945 -104 -833
587h33K2Q59O61l62r79m51L67P78M81m82o51k26L16Q23M80m74p98j16O22P62J96
$$ -833 -811 48 709 347 -632 -1083 -716 62 543 61 -590 -816 -500 323 803 329 -469 -585 37 799 995
608I95p18o15M7N30O01Q7o89q95m9Q11R29m10j288o04P36J087Lq90n63J88M98
$$ 995 277 -338 -291 239 840 927 238 -657 -706 105 1034 624 -664 -1268 -532 555 558 -332 -895 -707 -209
629b09K83J82n7m72n41L62J152M89q69j116J57J234P41n23j151k90N66P11J49
$$ -209 74 256 199 -273 -814 -452 700 1189 320 -796 -639 595 1336 813 -338 -628 -62 649 798
648G98n52o87j94L78N21J92m82o60j96L96O24M01n24r59q3R02R08Lj080o93O07
$$ 798 246 -441 -635 -257 264 456 -26 -686 -882 -486 138 539 15 -944 -1027 -125 783 786 -294 -987 -380
669c80J030L30m77q55j33O17N36J60l32q06l84O82P51j50n55p22o4O27M96k0m59
$$ -380 650 980 503 -352 -485 132 668 828 496 -310 -694 -12 739 589 34 -688 -752 -125 371 351 -108
690a08q57p1J054O61k51r90o67Q20J277q8q57l65K57M16L32L4j91m73l93L62Q49
$$ -108 -965 -1036 18 679 428 -562 -1229 -409 868 780 -77 -442 -185 231 563 597 406 -67 -460 -98 751
711G51J21p62p91k8Q91O47n78q27k63K85O40M45n69p86k5N68O91J25o59m63K90
$$ 751 872 110 -681 -709 182 829 251 -576 -839 -554 86 531 -38 -824 -849 -281 410 535 -124 -587 -297
732b97L33M44K19m84m97p5M46P42J30r84o75L84Q40K85n76p72j86N51M17J90m42
$$ -297 36 480 699 215 -282 -357 89 831 961 -23 -698 -314 526 811 235 -537 -723 -172 245 435 -7
753gp53j05O57M81Lm36n00J56M43L03K46l20o29j3P39O22l4q94o31O25Q63k4o02
$$ -7 -760 -865 -208 273 276 -160 -660 -504 -61 242 488 168 -461 -474 265 887 853 -41 -672 -47 816 792 190
776A90n27n3M56L02q4k59l87l16L73N95M3o15m34k8O58M67j33m30m28J68O81N12
$$ 190 -337 -390 66 368 284 25 -362 -678 -305 290 333 -282 -716 -744 -86 381 248 -182 -610 -442 239 751
798G51l26o21k92N13O97O2n95l88J4K94L24P7l09n01k38L09O08O7o87n61K06O65
$$ 751 425 -196 -488 25 722 784 189 -199 -185 109 433 510 201 -300 -538 -229 379 446 -241 -802 -596 69
820F9L72l19n49k85L37N47K88k34n68j97M99N94J34m35m57l7M39L40J12m54n13
$$ 69 441 122 -427 -712 -375 172 460 226 -342 -539 -40 554 688 253 -204 -241 198 538 650 196 -317
841c17o3M95M87j97o47m99K21O78K50m13n01k37L73N82J69l85m24k03M74O82L9
$$ -317 -380 115 602 405 -242 -741 -520 158 408 -5 -506 -743 -370 212 381 -4 -428 -631 -157 525 564
862E64m87m71P4N11N96k14n28m04J16N76M62l17p20l76L11O27J60m38o60j2L96
$$ 564 77 -394 -320 191 787 573 45 -359 -243 333 795 478 -242 -618 -307 320 480 42 -618 -630 -234
883b34M80J02n12n02K8M70N38M6n70m36K80N19M08r4n96l83L87N49K76l21o32
$$ -234 246 348 -164 -666 -638 -168 370 416 -154 -590 -310 209 617 523 -73 -456 -69 480 756 435 -197
904a97k51M32N14O2m06o77n0N63L81o3n42m96J08O15L11j45m73l50K64O49K24
$$ -197 -448 -16 498 560 154 -523 -573 -10 371 308 -234 -730 -622 -7 304 159 -314 -664 -400 249 473
925D73j99n19k55M25O27J31m24m33j03M01M92l6m59m40q5N06M82k64n72l64J47
$$ 473 274 -245 -500 -75 552 683 259 -174 -277 124 616 580 121 -319 -404 102 584 320 -252 -616 -469
946d69N39L10l67n50p1K21M85K75k90m21k01L59O17J53m91m19P6L83M79J3n49
$$ -469 70 380 13 -537 -608 -387 98 373 83 -338 -539 -180 437 590 99 -320 -244 139 618 631 82
967H2m50J86M29K75j46o28k32K06M46K84l22o04j19K86M09K48k95o82kN29M70
$$ 82 -368 -182 247 522 376 -252 -484 -278 168 452 130 -474 -593 -307 102 350 55 -627 -629 -100 370
988C70L4m36m38J25N32L58m8m51l59J86M32L42j18o50l61L72N98O2m97m36j61
$$ 370 404 -32 -470 -345 187 545 497 46 -313 -127 305 647 529 -121 -482 -110 488 550 53 -383 -544
1009e44L07M79O6l72n85l8M76N91n0n12n25K66P32K91k90m66j75J79M82L42k02
$$ -544 -237 242 308 -64 -649 -687 -211 380 330 -182 -707 -441 291 582 292 -174 -349 -170 312 654 452
1030D52m63l42K34O70J30m92n85j40M54O23j23o50m20R7N12M08k16n28l40K70
$$ 452 -11 -353 -119 551 681 189 -396 -536 -82 541 418 -232 -652 -555 -43 365 149 -379 -719 -449
1050d49N57L52k31n02k62L44N87K55l90n48j07N01N86Ro18m85R0N79L20k27m79
$$ -449 108 460 229 -273 -535 -191 396 651 261 -287 -394 107 693 702 84 -401 -311 268 588 361 -118
1071a18m50J18N52L74k95o42l54M36O36J93n26n34N3M68N18nl88l96o8N25N98
$$ -118 -568 -450 102 476 181 -461 -815 -379 257 450 -76 -610 -557 -89 429 424 36 -360 -428 97 695
1092F95q3o40m14J39O93L90l88p09j71M04L94J83l98n02k35L93N23J49m70o90
$$ 695 612 -28 -442 -303 390 780 392 -317 -488 -84 310 493 95 -407 -642 -249 274 423 -47 -737
1112g37P4N41N77j33n36m36K77O78K82k62m36l22K96N85K56l13o08k20L59O34
$$ -737 -663 -122 455 322 -214 -650 -373 305 587 325 -111 -433 -137 448 704 391 -217 -437 -78 556
1132E56P2m79p04oO05N02k52n29m06J23N63L74k43n47k57K20N59L17k29n09k90
$$ 556 628 149 -555 -561 44 546 294 -235 -641 -518 45 419 176 -371 -628 -408 151 468 239 -270 -560
1153e60M02O52K13m88n80M8M57N38j12n56m22J15M49L74n6o53m31J33O17L95m66
$$ -560 -158 494 707 219 -361 -313 144 682 570 14 -408 -293 156 530 474 -179 -610 -477 140 535 69
1174F9n87j76M08N19J00l45n59mM78N14J53n43m64QO32N29j74o49l26K53N36K78
$$ 69 -518 -694 -286 233 333 -12 -571 -575 -97 417 570 27 -437 -429 203 732 558 -91 -417 -164 372 650
1196F50k65n69l42L08N14K54m53n69k66M79O22P0n34n65mO55M47p2m74m92J74
$$ 650 385 -184 -526 -218 296 550 97 -472 -738 -259 363 433 -101 -666 -670 -15 432 360 -114 -606 -432
1217d32P21L99k89o26k88L96N73K60l93n50k54M22M95K09n43o23r8N47O00j17
$$ -432 289 688 399 -227 -515 -119 454 714 321 -229 -483 -61 434 643 100 -523 -621 -74 526 409
1237D09o67m92J52O47L94j41o60l02L24N87L27l66o22j73M65O66J61n31n03n2
$$ 409 -258 -750 -598 49 443 302 -358 -660 -336 251 578 212 -410 -583 -118 548 709 178 -325 -377
1257c77M37N45N4n86o46R6O39N22l09q19k50L40O42J59l95n39k13L77O60J10l31
$$ -377 60 605 659 73 -573 -477 162 684 375 -444 -694 -354 288 447 52 -487 -700 -323 337 447 116
1278A16o17j72O42O71p9n33m66O9O39N21k77n88m36K13O97L29l86p56j99M13O63
$$ 116 -501 -673 -31 640 561 28 -438 -369 270 791 514 -74 -510 -297 400 729 343 -413 -612 -199 464
1299D64M6n84m89q9M16N58J08n82n15P6N86N87j18p97l02L85O04L39l96o06j38
$$ 464 510 -74 -563 -652 -236 322 430 -152 -667 -591 -5 582 464 -333 -635 -250 354 693 297 -309 -447
1320d47M51N99J36m44o87o3N15M84j7n93n19O0N92L54r4n66n12K05P61K92k48
$$ -447 4 603 739 295 -392 -455 60 544 527 -66 -585 -525 67 421 327 -239 -751 -546 215 507 259
1341B59p58k27N29O21J07m01n02j61N85N42Mm53n39J6N29N33j78o24l76J71O10
$$ 259 -499 -726 -197 424 531 130 -372 -533 52 594 598 145 -394 -378 151 684 506 -118 -494 -323 287
1362B87K62l06o07k46K10P05K63o02n45j02N10O12Jn55l51L6M71N22l6o04l49
$$ 287 549 243 -364 -610 -400 305 568 -34 -579 -681 -171 441 442 -113 -464 -428 43 565 529 -75 -424
1383d24J13N43N40k42p21l27L42O41J82m02o59j74M42N23N9m92n68J7M98M92l
$$ -424 -311 232 772 530 -191 -518 -176 465 647 245 -414 -588 -146 377 436 -56 -624 -607 -109 383 380
1404C80n73m27J89N90L13r4n56m35L59N99L12k96o33j80M35N48M1l32o26j32O14
$$ 380 -193 -620 -431 159 472 378 -178 -613 -254 345 657 361 -272 -452 -17 531 572 240 -386 -518 96
1425I6M24o2n92m73Q9O56L46k15o03l71K54O37L33l96n48k43M16P09J50m18n70
$$ 96 520 458 -134 -607 -518 138 484 269 -334 -705 -451 186 519 123 -425 -668 -252 457 607 189 -381
1446c81o5N46N67m3n27m69L6N39M71k51n86l19J24N82K97l69n53k64L63N50K43
$$ -381 -446 100 667 624 97 -372 -336 203 674 423 -163 -482 -358 224 521 152 -401 -665 -302 248 491
1467D91n17n63m0M61O07P5o15m47J50N44M71j41o03l17K36O29L04l05o81k10L30
$$ 491 -26 -589 -629 -168 439 514 -101 -548 -398 146 617 476 -127 -444 -208 421 725 420 -261 -471 -141
1488a41N91J50m21n95j56M56N08M6n57n74J25N36M91j59n38l79K76N33L29j76
$$ -141 450 600 179 -416 -572 -116 392 438 -119 -693 -568 -32 459 300 -238 -617 -341 192 521 345
1508C45o31k43L48N88K58m12n81q6M60N35on17n36N9N02M53j85m82n06K45N29
$$ 345 -286 -529 -181 407 665 253 -328 -414 46 581 575 58 -478 -419 83 536 351 -131 -637 -392 137
1529A37L17k73n95k45L96N42K33m13n62p4M69N52K5m29n21J10M97L84o9m48m16
$$ 137 454 181 -414 -659 -263 279 512 99 -463 -537 -68 484 509 80 -441 -331 166 550 481 33 -383
1550c83O7N84L19k52n77k67K78M89J87m07n36j20M17N29P5m66m17J3M69M35p5
$$ -383 -316 268 587 335 -242 -509 -231 258 445 38 -498 -618 -201 328 403 -63 -480 -467 2 437 362
1571C62m96k87J41N09L64k52m84k28K95M68J85l36m71k23L63N39O8m96n21N8M40
$$ 362 -134 -421 -280 229 593 341 -143 -371 -76 392 577 241 -230 -453 -90 449 517 21 -500 -442 -2
1592bL41l2m61l68J36M36L39j59m97k65K13N51K25k61m96j08L79M31J85l82n23
$$ -2 339 307 -154 -522 -386 50 389 230 -267 -532 -319 232 457 196 -300 -408 -29 402 587 205 -318
1613c18J7M22L06j7m37m15J45M22K44r8m85k95J67M42K12j55m46k74L81M75J39
$$ -318 -301 121 427 410 -27 -442 -297 125 369 271 -214 -509 -342 100 312 157 -289 -563 -182 293 432
1634D32m13m11j7M25M62o4l65l78P6M43L62j69m27l56J74M71K53l08m60j52K22
$$ 432 19 -392 -409 16 478 414 49 -329 -253 190 552 383 -44 -400 -226 245 498 190 -270 -422 -200
1655b00M23P8k10m78j83M41M07O4m02l78lM66M36j15m51k70J95M89K13k41m07
$$ -200 223 301 91 -387 -570 -129 278 342 -60 -438 -441 25 461 346 -105 -375 -180 309 522 281 -126
1676a26j97K40M51J38l09m48j04K73M03L0l60m23M3L85L47j26m38l22J56N10K36
$$ -126 -323 -83 368 506 197 -251 -355 -82 321 351 -9 -432 -389 -4 343 217 -221 -543 -387 123 359
1697C59j93l95j84K17M27K94l10l81j67L87L76P4m05l79P4L04L31j74l49k54J33
$$ 359 166 -229 -413 -196 231 525 215 -166 -333 54 430 504 99 -280 -206 98 429 255 -94 -348 -215
1718b15L24K68j27n58j67K65L52J40j94m92o3L25L72O5k24l61o6M38L31o9l82
$$ -215 109 377 250 -308 -475 -210 142 282 88 -404 -467 -142 230 295 71 -290 -356 82 413 344 -38
1739c8l18J66M54J89r2m88j92K55L04J10k41l60j88K82L51K7k07m10n6L82K76
$$ -38 -356 -190 264 453 361 -127 -319 -64 240 350 109 -251 -439 -157 194 221 14 -396 -452 -70 206
1760B06n0l05k14Q1L71K25j34k82k03J96L46J85k30k97j41J81M00K1k71l31m7
$$ 206 156 -149 -363 -282 89 314 180 -102 -305 -109 237 422 192 -105 -246 -65 335 356 85 -246 -293
1781b93K15L82r4l22k33k2L78L23k45l21j33J06L96J66j71l31j02K07L51K5j44
$$ -293 -78 304 210 -112 -345 -367 11 334 89 -232 -365 -259 137 303 132 -199 -301 -94 257 282 138
1802A38l27l2K73K60P0l46k34L2K48K75j27l41k51R3L45J97j45l50j13J14K58
$$ 138 -189 -221 52 312 382 36 -198 -166 82 357 230 -111 -362 -269 76 273 128 -222 -335 -221 37
1823C7J69j36l38p4K29K31J37j48l06k5L38K42m1l41k00J45K57J45q9k51k48J20
$$ 37 206 70 -268 -342 -113 118 255 107 -199 -224 114 356 315 -26 -226 -81 176 321 232 -19 -267 -147
1845a47L40O1j89k72r6J81K95k4j30l39n4K73K86J4l20j96P0K76K09m7k12k01
$$ -147 193 254 65 -207 -303 -122 173 149 19 -320 -374 -101 185 199 -121 -317 -247 29 238 191 -21 -222
1867b22J56K48K11k13k52j02J67K57P4k31l09k1J54L03l4k78k26j2L08K24l8l24
$$ -222 -66 182 393 180 -72 -174 -7 250 324 93 -216 -237 -83 220 186 -92 -318 -330 -22 202 164 -160
1889a60j70J38K93J13j12k98o8J96L05O1j86k01j11K13K10P3j99k95NK26K40j08
$$ -160 -330 -192 101 214 102 -196 -264 -68 237 298 112 -89 -200 13 223 296 97 -198 -193 33 273 165
1911A65k31k25R8K46R7q8k71j20J53K93J09k36k17m1K36K58k3j65j63q3K82K13
$$ 165 -66 -291 -193 53 150 62 -209 -329 -176 117 226 -10 -227 -268 -32 226 203 38 -125 -208 74 287
1933B87l6k35j91Q1K39J91j99k22j59J09J96J50j45l29m7J96J75Q0k31j80K7K47
$$ 287 251 16 -175 -94 145 336 137 -85 -244 -135 61 211 66 -263 -310 -114 61 141 -90 -270 -243 4
1955DK04m1k44j31O4K60J26j0k77j65J36K82J12j56k87k6J34K17Oj92j51n5J50
$$ 4 208 167 -77 -208 -144 116 242 232 -45 -210 -74 208 320 164 -123 -149 -15 202 208 16 -135 -190 -40
1978d0J57J7j69k62L7K43J65o7k23j01R6J47K39j77k02lJ50J35J39j57k24N5J14
$$ -40 117 134 -35 -297 -260 -17 148 81 -142 -243 -147 0 239 62 -140 -143 7 142 281 124 -100 -45 69
2001F9J82j8j65j88M1J03J60j2k18j28N1J35J26p4k66k2P7J59J40o6k75n6K57
$$ 69 251 233 68 -120 -79 24 184 172 -46 -174 -123 12 138 64 -202 -224 -147 12 152 86 -189 -245 12
2024A2R2J16j24k21L2R8K38k2j97j57N5J64J30p7j44j88J22J07Q6l8k05o6Q4J90
$$ 12 104 220 96 -125 -93 5 243 221 24 -133 -78 86 216 139 -5 -193 -71 36 122 84 -121 -187 -103 87
2048H7l3o8j69m5J55K05Rj64j55Q4J04K01k7j75j33J22J15J41n6j93j27R6J64
$$ 87 54 -14 -183 -228 -73 132 141 -23 -178 -94 10 211 184 9 -124 -2 113 254 198 5 -122 -26 138
2071A38O3j17j97m8L1J75M8j25j78k9J99J69n6j71j17O5K01J66j40j51n9J22J91
$$ 138 201 84 -113 -161 -130 45 93 -32 -210 -239 -40 129 73 -98 -215 -150 51 217 77 -74 -133 -11 180
2094A80Q9j06k67L3O9J95K4j11k58j3J56J86r3j16j67j7K48N9n6j95q3Q9J97N1
$$ 180 269 163 -104 -71 -2 193 217 106 -152 -165 -9 177 84 -32 -199 -216 32 91 35 -160 -243 -154 43 94
2118I4r5j39l1J44K14ll9k34K7J04K04m5j67j49N4J08J00m1k06l5L8J01J38o7
$$ 94 -1 -140 -171 -27 187 184 145 -89 -62 42 246 201 34 -115 -61 47 147 106 -100 -135 -97 4 142 75
2142G5k06n1O7J76M1r8j59oJ56R2N7j46j30L7K03J42q9j81p4N9J34J00m5j46j05
$$ 75 -131 -182 -115 61 102 4 -155 -161 -5 87 144 -2 -132 -95 108 250 161 -20 -94 -35 99 199 154 8 -97
2167i7L3J40N3j24k01L3J18N1J02j87o8k3J40J06m3q6o4J3J40J23p2j44n3J16
$$ -97 -64 76 129 5 -196 -163 -45 6 108 -79 -147 -170 -30 76 33 -53 -117 -104 36 159 87 -57 -110 6
2191FJ19R0j04j40m0M5J79j7j01r0n0J35O9m2j43ro0J10J21n9j37m7L5J08J28
$$ 6 125 215 111 -29 -69 -24 155 138 37 -53 -103 32 101 59 -84 -93 -153 -43 78 19 -118 -165 -130 -22 106
2216A06j09k9j29J05K00L4p1j47l8J26J16op6j98K8J19J71j02j76j05O9J06N0
$$ 106 -3 -32 -161 -56 144 178 107 -40 -78 48 164 158 82 -116 -88 31 202 100 -76 -181 -112 -6 44
2239D4j8j54o5L9J33P7p0j55n1J77R6L0l4j04k8R7J50N6j64j25L6J10J10l4j60
$$ 44 26 -128 -193 -154 -21 56 -14 -169 -220 -43 53 83 49 -55 -83 14 164 220 56 -69 -33 77 187 153 -7
2264gj00M5Q7N0pj62p2N2J45Q7j23j09p6J78J46n7o6j44n4J88J66n0j01j39R3
$$ -7 -107 -62 25 75 68 -94 -166 -114 31 118 -5 -114 -190 -12 134 77 11 -133 -187 1 167 117 16 -123 -30
2289c0J66O7j11j26m6K3J63P5p5k14lL5J52J9j32j40oJ87O0L8j58j41P5J28J30
$$ -30 136 203 92 -34 -80 -57 106 181 106 -108 -111 -76 76 95 -37 -177 -183 4 64 102 -56 -197 -122 6 136
2314A36r0p3q8R5J23L0m6j03k9L2J41J0n5k19M9J12J07n1j14j19j7J40Q0Jj20
$$ 136 46 -27 -115 -20 103 133 87 -16 -45 -13 128 138 83 -136 -87 25 132 81 -33 -152 -169 -29 51 52 -68
2339f8r0P2J02Q7j03q3l2Q3R0J43j10j53pL4K22m1r0j07L7J04J08j02j09j03P9
$$ -68 -158 -86 16 103 0 -83 -115 -32 58 201 91 -62 -69 -35 187 146 56 -51 -14 90 198 96 -13 -116 -37
2364c7P7Q0o6j78m6K7J29K3M3j59o3J53M9R9j08j22l3J86J06m5l9j40P1P7Q8m7
$$ -37 40 120 54 -124 -170 -143 -14 9 52 -107 -170 -17 32 131 23 -99 -132 54 160 115 76 -64 7 84 172 125
2390A25p4j24K7J41O9j20n7j08K9J72m4p7r7m0J10R5l1r4n1M7J08L0O7j30k5K1
$$ 125 51 -73 -46 95 164 44 -13 -121 -92 80 36 -41 -138 -178 -68 27 -4 -98 -149 -102 6 36 103 -27 -52 -31
2416c1Q0J08r6r6n5P9J56J9j07j14j7P1N6Ko4j06k3J10N9J6j06k6rJ45pL0j72
$$ -31 49 157 61 -35 -90 -11 145 164 57 -57 -74 -3 53 55 -9 -115 -138 -28 31 47 -59 -85 -94 51 44 74 -98
2443i8K6L4O1J28o6r6p3M8J18J25j17j42k6J03R5j2j22q9J1J19P1q6p2j35P0R5
$$ -98 -72 -38 23 151 85 -11 -84 -36 82 207 90 -52 -78 25 120 108 -14 -103 -92 27 98 12 -60 -195 -125 -30
2469c0J35j9j73m7R4P5J01j6j86KR2Q4N9r9j15l0J44N1jj33r2L1J51j0l4j05p2
$$ -30 105 86 -87 -134 -40 35 136 120 -66 -64 28 112 171 72 -43 -73 71 122 121 -12 -104 -73 78 68 34 -71 -143
2496a43J0J95J5p4j34l3P9J97l2j69j6j7J52P3k8j11Lk3J71P5l3q8j99O1J82M8
$$ -143 -133 62 77 3 -131 -164 -85 112 80 -89 -105 -122 30 103 75 -36 -33 -56 115 190 157 69 -130 -69 113 161
2522A61n1j82n4R6O4J00j29j23m9J46J07k4j18j28P4Q6R1l0q7o0J0J54P3J5j35
$$ 161 110 -72 -126 -30 34 134 5 -118 -167 -21 86 62 -56 -184 -110 -24 67 37 -50 -110 -100 54 127 142 7
2547Gj3k0J27P1r1j57rQ1J28j3j32j06M8M6J09l7j17j07J04J09M7l7j70m1J03
$$ 7 -6 -26 101 172 81 -76 -85 -4 124 111 -21 -127 -79 -33 76 39 -78 -185 -81 28 75 38 -132 -173 -70
2572g0J39O8j08m4j20J28J88%j11j37lJ54O2kj47j43R8J14J05r4j51q3O9J07P4
$$ -70 69 137 29 -15 -135 -7 181 181 70 -67 -70 84 146 144 -3 -146 -48 66 171 77 -74 -157 -88 19 93
2597I3n3j43o9J11J43N5j50m0n8R7J48N8j49j63J16M8J12j9j00j54O6J23J20j21
$$ 93 40 -103 -172 -61 82 137 -13 -53 -111 -14 134 192 43 -120 -4 44 156 137 37 -117 -51 72 192 71
2621G1j12q6Q7J34Pj10r0m1R3M3Pl3p1l6J11J30np9j70P2J82j2Rj06q0Q8R8J11
$$ 71 -41 -127 -40 94 101 -9 -99 -140 -47 -4 3 -30 -101 -137 -26 104 99 20 -150 -78 104 92 101 -5 -85 3 101 212
2649B12j27j54o6J33J02j9p6j61J4J36R6o1j15p8L9J50j3M8j80o2J51J42M0q6
$$ 212 85 -69 -135 -2 100 81 5 -156 -142 -6 90 29 -86 -164 -125 25 12 60 -120 -182 -31 111 151 65
2673F5j52J0R3J04J2n3j60k4J78P3m2j27o8J7J03J29p7j63r3Q9J56K6j20j05j4
$$ 65 -87 -77 16 120 132 79 -81 -105 73 146 104 -23 -91 -74 29 158 81 -82 -175 -86 70 96 -24 -129 -143
2698a43J16J07K7p8j66M1O3J73Lj65r4pK33R5j21q2j69J33Q1J03q4j19j14J23
$$ -143 -27 80 107 29 -137 -96 -33 140 143 -22 -116 -123 110 205 84 2 -167 -34 47 150 66 -53 -167 -44
2722d4R9N7j68j30KJ40J73o6r6j05L2J57J34p8j86n9J24J46j7p6p4n3J08J78p6
$$ -44 55 112 -56 -186 -184 -44 129 63 -33 -138 -106 51 185 107 -79 -138 -14 132 115 39 -35 -88 20 198 122
2747A22j33o3J4Q8J17o3j37q5L4J04O4k9j24r1R4J03O4j9j58q4J70J01K8p9r3
$$ 122 -11 -74 -60 28 145 82 -55 -140 -106 -2 62 33 -91 -182 -88 15 79 60 -98 -182 -12 89 117 38 -55
2772e5J2M4J34j3j27j33P2J50N6q0r0p5qJ71P3j12k03J6R3J49k1k8j44n7J65J04
$$ -55 -43 1 135 122 -5 -138 -66 84 140 60 -30 -105 -113 58 131 19 -184 -168 -75 74 53 25 -119 -176 -11 93
2798I3Qj21j28Q2K2K10j06j03m8N3J91Nn1j88j6O4J62Kq8j35k6R5J24K5j52j16
$$ 93 101 -20 -148 -66 -44 166 60 -43 -91 -38 153 158 107 -81 -97 -33 129 131 43 -92 -118 -23 101 126 -26 -142
2824a42N4NJ76m1j06q0O4J21M9n3q7k6P8R2kl5j17j6R4R7Oj11j25M4N9J09o5j25
$$ -142 -88 -83 93 52 -54 -134 -70 51 100 47 -40 -66 12 104 102 67 -50 -66 28 125 131 20 -105 -61 -2 107 42 -83
2852h3q3L8J74J3k5j04j02J36P9O0j07m8L0J4J31jr0j51M7J63M6K1j50r4j8J27
$$ -83 -166 -128 46 59 34 -70 -172 -36 43 103 -4 -52 -22 -8 123 122 32 -119 -72 91 137 158 8 -86 -104 23
2878B3P8J4k16m7K4J79Kp4r7l2K6J10J00j08j11L9Q5J58l4j38n9P2J03j8R5k15
$$ 23 101 115 -101 -148 -124 55 57 -17 -114 -146 -120 -10 90 -18 -129 -90 -5 153 119 -19 -78 -6 97 79 174 -41
2904d1n7O4J33N8j05j44LN3J33K6j40j26j1J02J11nj43n7Q4L5R1J9j74k3K0J38
$$ -41 -98 -34 99 157 52 -92 -89 -36 97 123 -17 -143 -154 -52 59 54 -89 -146 -62 -27 64 83 -91 -114 -94 44
2930D4N2l4j05k9L3J86l3p8p1lQ3O7lp8p8p6J58O5n2j31p3Q2J27J7r7j07mQ4J40
$$ 44 96 62 -43 -72 -39 147 114 36 -35 -38 45 112 109 31 -47 -123 35 100 48 -83 -156 -74 53 70 -27 -134 -138 -54 86
2959H6lj07l8l3J48Q3k7j47l1JJ10J18o0j07o4K1Q4O5l9r8j08J28P7L0j19q4p
$$ 86 83 -24 -62 -95 53 136 109 -38 -69 -68 42 160 100 -7 -71 -50 34 99 60 -38 -146 -18 59 89 -30 -114 -121
2986a21J09M0K9o7r8J4J23J17j29m6k1J1J33M2q1l7q3J6J49k6j05k6n4P5J37K2
$$ -121 -12 28 57 -10 -108 -94 29 146 17 -29 -50 -39 94 136 55 18 -65 -49 100 74 -31 -57 -111 -36 101 123
3012A23j72r5N6J33L1l0q7p1L6Q2J00j06l8o0K8J46O6q2j51j8O8J62%p9j53O3
$$ 123 -49 -144 -88 45 76 46 -41 -112 -76 6 106 0 -38 -98 -70 76 142 60 -91 -109 -41 121 121 42 -111 -48
3038d8P1P9o6p6p8L8O6O2Rr3j35R2Q6L2l0j10K7M8J15j5n3q5k0J03J23r1q5OQ
$$ -48 23 102 36 -40 -118 -80 -14 48 57 -36 -171 -79 7 39 9 -101 -74 -26 89 74 21 -64 -84 19 142 51 -34 -28 -20
3067b0R9Q2l7j17j20O7Q1Q1k0j53k7N3P7M8j18o4%L4J28j5r1n2l8J48O0k1q5l9
$$ -20 79 161 124 7 -113 -46 35 116 96 -57 -84 -31 46 94 -24 -88 -88 -54 74 59 -32 -84 -122 26 86 65 -20 -59
3095e9P1J13Nqj68l0O1J34m6n5j13k6J27J17o0r3l5JM5Q8O7j92k3L8J28qk8j37
$$ -59 12 125 130 122 -46 -76 -15 119 73 18 -95 -121 6 123 63 -30 -65 -64 -19 69 136 -56 -79 -41 87 79 51 -86
3123h6K8K4P1O4n3j08OJ11L4k5k6o6l7R2M0j5p4p5P9R5M1j63j5j6L6R6j1k1j03
$$ -86 -58 -34 37 101 48 -60 -54 57 91 66 40 -26 -63 29 69 54 -20 -95 -16 79 120 -43 -58 -74 -38 58 47 26 -77
3152g7J1J08P1p4k2n7JR3Nj3k0j02P2P7L1l1j05mK1L5N4m2j21j5L9J27l1o8q5
$$ -77 -66 42 113 39 17 -40 -39 54 59 46 26 -76 -4 73 104 73 -32 -36 -15 20 74 32 -89 -104 -65 62 31 -37 -122
3181a22M1O1P4Oj22l1Q0Q7j2m0p3J5K8J28j7m2n1q8R6K0M2p7p7nQ4QNm9j07J11
$$ -122 -81 -20 54 60 -62 -93 -13 74 62 22 -51 -36 -8 120 103 61 10 -78 18 38 80 3 -74 -79 5 13 18 -31 -138 -27
3211b7N2Ll0m9m8M2Q1K7o7l3J6L9J07o4l0q2J2J20K9o3jj34R1N1j1L7q6o2J0J07
$$ -27 25 28 -2 -51 -99 -57 24 51 -16 -49 -33 6 113 49 19 -63 -51 69 98 35 34 -100 -9 42 31 68 -18 -80 -70 37
3241C7K6n5j09J34l3L1J3l7p3N3J0L3L7m2o1L4O1lM6j20k7L8P3j8%p3l5J4Q8l8
$$ 37 63 8 -101 33 0 31 44 7 -66 -13 -3 30 67 25 -36 -2 59 56 102 -18 -45 -7 66 48 48 -25 -60 -46 42 4
3271Dm7L7n8k0J40l0m7j6l8N3Q1J8o8n0O7N0K5p4p8J5PJ30n9Pr8J4k4R2K0l5j40
$$ 4 -43 -6 -64 -84 56 26 -21 -37 -75 -22 59 77 9 -41 26 76 101 27 -51 -36 -29 101 42 49 -49 -35 -59 33 53 18 -122
3302a22J17J1K9Rm8k9m0P3N4k0j20J9N6P4M7q2o1pP4R3o5j2j24P3l2R9l0o5m1
$$ -122 -5 6 35 44 -4 -33 -73 0 54 34 -86 -67 -11 63 110 28 -33 -40 34 127 62 50 -74 -1 -33 66 36 -29 -70
3331g0L7P6j8J0j27P5oJ01l4o4m6J5K1O8j0k0p5j0M9R9k1j10P3j08J13R9l6q2
$$ -70 -33 43 25 35 -92 -17 -23 78 44 -20 -66 -51 -30 38 28 8 -67 -77 -28 71 50 -60 13 -95 18 117 81 -1
3359am2R4K3oK1j24k5P1M8l9k9o2m5P5L7J5l5J9o3P7M9j6o4n2O8N5K0n7op5P8
$$ -1 -43 51 74 68 89 -35 -60 11 59 20 -9 -71 -116 -41 -4 11 -24 -5 -68 9 58 42 -22 -74 -6 49 69 12 6 -69 9
3390IN4J7j17k5K6P6j5j4n7ok6R2M2n3m0j0L4N2jm0j8j3L6N4M1o6ok6NJ11r2k3
$$ 9 63 80 -37 -62 -36 40 25 11 -46 -52 -78 14 56 3 -37 -47 -13 39 38 -2 -20 -33 3 57 98 32 26 0 5 116 24 1
3422Alk8R9l7m9%l0KP0J7k6p2J8K4J4N6r4m6M3L0L8J1k8J2m3N5K7K3n1p6O0J3
$$ 1 -2 -30 69 32 -17 -17 -47 -45 25 42 16 -56 -38 -14 0 56 -38 -84 -41 -11 27 38 10 22 -21 34 61 84 33 -43 17 30
3454C0M3m8j7q1R2j5P7r6J8l4j0P4lj3j28O4M1M6k7o9L6qk0N7Nk5m8M5R4L4o9
$$ 30 73 25 8 -73 19 4 81 -15 3 -31 -41 33 30 17 -111 -47 -6 40 13 -56 -20 -28 -48 9 14 -11 -59 -14 80 114 45
3485D5k9k3Q4l8pm5k4P9k3L8j2k3j9MK6J8n2J6l8MJ9M6L2r4K9K8m2K0O6o2m5j9
$$ 45 16 -7 77 39 32 -13 -37 42 19 57 45 22 3 7 33 51 -1 15 -23 -19 0 46 78 -16 13 41 -1 19 85 23 -22 -41
3517d1Q1l0N5j30J1J17m4K0m1K0k5K6N7p4n6RN1j3J0qQjo1J14m2ml6k0J27J4l0
$$ -41 40 10 65 -65 -54 63 19 39 -2 18 -7 19 76 2 -54 -45 6 -7 3 -5 3 2 -59 55 13 9 -27 -47 80 94 64
3548F4o0m7P6jj0J8k7n9P8j0mlm9KRL9J0o8m4K8O6j8M4m3l1K4J00o0l6N3p4K8
$$ 64 4 -43 33 32 22 40 13 -46 32 22 18 15 -34 -32 -23 16 26 -42 -86 -58 8 -10 34 -9 -40 -16 84 24 -12 41 -33 -5
3580eM8J6m1n4MP6lM3m1o5N3n3J6P0p4j4n0M7L8Kl4kJ8M9K9r0kQqL6%j0nOK3l0
$$ -5 43 59 18 -36 -32 44 41 84 43 -22 31 -22 -6 64 -10 -24 -74 -27 11 13 -21 -23 -5 44 73 -17 -19 -11 -19 17 17 7 2 8 31 1
3616AL6o8M5l5K7M9J8q4o4M8O0j5j3m1K7k7O2j8l2K3m6P1K5l0J4o6k1K2N3j6J3
$$ 1 37 -31 14 -21 6 55 73 -11 -75 -27 33 18 5 -36 -9 -36 26 8 -24 -1 -47 24 49 19 33 -33 -54 -32 21 5 18
3647A8k8J3rL7K3j03P6J3j7n8K8j8K9K7j5L2m4n8M2K9%N5q8j3L5l2O6l9J0m0P2
$$ 18 -10 3 -6 31 54 -49 27 40 23 -35 -7 -25 4 31 16 48 4 -54 -12 17 17 72 -16 -29 6 -26 40 1 11 -29 43
3678D3l2M5q4j2J6O0l1qL4j04M9NM7n3J7k4KpL4k2J2ll1L9K3N7j19P1n8J22p1
$$ 43 11 56 -28 -40 -24 36 5 -3 31 -73 -24 -19 28 -25 -8 -32 -30 -37 -3 -25 -13 -16 -47 -8 15 72 -47 24 -34 88 17
3709A7K1n4j5R3j8K8m0m9K0RL6ro0k0NJ4N8p5K8k9MN5n8L7m2J7oO0J3j8n3M2R
$$ 17 38 -16 -31 62 44 72 32 -17 3 12 48 39 -21 -41 -36 -22 36 -39 -11 -40 -36 19 -39 -2 -44 -27 -33 27 40 22 -31 11 20
3742B0KKL6q0P4l6nL6k1l8L5l5J9j5k6l5P0L0l6K0m5l5N0M4K4k6l6pMj7L5p3Q6
$$ 20 22 24 60 -20 54 18 13 49 28 -10 25 -10 9 -6 -32 -67 3 33 -3 17 -28 -63 -13 31 55 29 -7 -14 -10 -27 8 -65 21
3775B1m6J2K8m5M1m3M7J2ljl1j6N1J3l9J8pn1QO9l7%m5k1R6m4K0jl6J3O2Pl2J0
$$ 21 -25 -13 15 -30 11 -32 15 27 24 23 -8 -24 27 40 1 19 12 -39 -31 38 1 1 -44 -65 31 -13 7 6 -30 -17 45 52 20 30
3809C0n0L5J6J2n0oJ4pj6N3l6m5O4m3Lj0lK6J5k7N7J6o8j3N5K1m7K3Mm0L8k9J1
$$ 30 -20 15 31 43 -7 -13 1 -6 -22 31 -5 -50 14 -29 -26 -36 -39 -13 2 -25 32 48 -20 -33 22 43 -4 19 23 -17 21 -8 3
3842CN0jm5j0M0l2qMo0P0J4k5p0rO7l4M0J3l8J0J2L1%J8p5K1J9mN2l1J4m7K4M9
$$ 3 53 52 7 -3 37 5 -3 1 -59 11 25 0 -70 -79 -12 -46 -6 7 -31 -21 -9 22 22 40 -35 -14 5 1 53 22 36 -11 13 62
3876F2l0l0%K0ol4J9K3l2J8On1J2K0jl8M7L4n8k6K2P0j3Pql6jk7O1n1O2J3o1K4
$$ 62 32 2 2 22 16 -18 1 24 -8 10 16 -35 -23 -3 -4 -42 5 39 -19 -45 -23 47 34 41 33 -3 -4 -31 30 -21 41 54 -7 17
3910A7M0m2k2k3K4L4kp3N6n9N0O8l7Nl1jJ5K6Kl8m8QK4J6ol0R2Jj5n7L8l5q4R4
$$ 17 57 15 -7 -30 -6 28 26 -47 9 -50 0 68 31 36 5 4 19 45 47 9 -39 -31 -7 9 3 -27 65 66 51 -6 32 -3 -87 7
3944Gj0NlQo4L6NMK8p5K2M2m9P7k5k1j1L7J1o5J7PN7P8r6n1jL3NL7j8m9j7LQ0
$$ 7 -3 2 -1 7 -57 -21 -16 -12 16 -59 -37 5 -44 33 8 -13 -24 13 24 -41 -24 -17 40 118 22 -29 -30 3 8 45 27 -22 -39 -36 44
3979D4k4K5q9N8p9O0J0k4n6N3L1m0L9j3O0q9J8N2m3m3RO1J6k4M7j5p2J1Q1l0M
$$ 44 20 45 -44 14 -65 -5 5 -19 -75 -22 9 -31 8 -5 55 -34 -16 36 -7 -50 -41 20 36 12 59 44 -28 -17 64 34 38
4010C8K8q3j8P7l5O0p2o5P4N8J0j54M6LKQ6k9l1j4jM5K0m1qk6M4K3J0m1J5n3P4
$$ 38 66 -17 -35 42 7 67 -5 -70 4 62 72 -82 -36 -33 -31 55 26 -5 -19 -20 25 45 4 -4 -30 14 37 47 6 21 -32 42
4042D2k8Ll3LK5l9O3K3p9j9m4J42m2lk7o2M8O4m2K3n8l1M1P6m6J1l7j8N4L2K8
$$ 42 14 17 -16 -13 12 -27 36 59 -20 -39 -83 59 17 14 -13 -75 -27 37 -5 18 -40 -71 -30 46 0 11 -26 -44 10 42 70
4073G0j36kQ4k2Kk1Oo2J07l6R2j25j1N0K0Po1R4q4J5j0M9J2nl0l2Q3q0J5J8m1
$$ 70 -66 -68 16 -6 -4 -25 -19 -81 26 -10 82 -43 -54 -4 16 23 -38 56 -28 -13 -23 26 38 33 3 -29 54 -26 -11 7 -34
4104c4J7oP6n3k2j9P3k8J2j2k3j5K5J4K1r7J3M6K7Mj3kLk0J2M6j7j9lNN3L1n7
$$ -34 -17 -23 53 0 -22 -41 32 4 16 4 -19 -34 -9 5 26 -71 -58 -12 15 19 6 4 7 -13 -1 45 28 9 6 11 64 95 38
4137C8n0k8P4k4Jk1n2N5PM7n4p2N4OK0J5J5n0K8l8O4J1k3k9K1j4J3J5j2l1L0j0
$$ 38 -12 -40 34 10 11 -10 -62 -7 0 47 -7 -79 -25 -19 1 16 31 -19 9 -29 35 46 23 -6 15 1 14 29 17 -14 16 6
4169FM6n9j2J1l4P3J2k1K2q5kJ01k3J9j06rP0l1M4l8k5KN8k1J7j5l0L7qM0n6q
$$ 6 52 -7 -19 -8 -42 31 43 22 44 -41 -43 58 35 54 -52 -61 9 -22 22 -16 -41 -39 19 -2 15 0 -30 7 -1 39 -17 -25
4201b5Nm1M2J1K8m2qP4Pj2Pl1o6M5J7J3m6k0j1N3nPj2pPj4R2k8j2j1k1jL1%n9
$$ -25 -20 -61 -19 -8 20 -22 -30 44 51 39 46 15 -51 -6 11 24 -22 -42 -53 0 -5 2 -10 -17 -10 -24 68 40 28 17 -4 -5 26 26 -33
4236c3j6RL7K7o4J2l3L0L5nj6J1j8M5MMj15Q0j3K6MPj3m5J2P5Op8K3K0M6o1M6
$$ -33 -49 -40 -3 24 -40 -28 -61 -31 4 -1 -17 -6 -24 21 25 29 -86 -6 -19 7 11 18 5 -40 -28 47 53 -25 -2 18 64 3 49
4269D9o1n0JK2N6J1q1J5j1M0M8n2j4K3j1N8k5qj0l1k9J35m8m0jKN1m0Mm4N1ok1
$$ 49 -12 -62 -61 -39 17 28 -53 -38 -49 -9 39 -13 -27 -4 -15 43 18 10 0 -31 -60 75 27 -13 -14 -12 39 -1 3 -41 10 4 -17
4302a7O5Jn1l8M5L2L0n5m2LKN6Ook2LK0l7O9j00K9p1J12No8n3N8K1oj6O1r1RO0
$$ -17 48 49 -2 -40 5 37 67 12 -30 -27 -25 31 37 31 9 12 32 -5 64 -36 -7 -78 34 39 -29 -82 -24 -3 -9 -25 36 -55 -46 14
4336A4P2n7pJ5m2J2N9n1j0k9l7R2k6Nk9J6K2KnJ7l7J1PK8j5k8j4k8L5K8l7O3o9
$$ 14 86 29 22 37 -5 7 66 15 5 -24 -61 31 5 10 -19 -3 19 21 16 33 -4 7 14 42 27 -1 -15 -43 -8 20 -17 46 -23
4369b3n3J09Pp2j9N3k6J26n2j15M0mRN9j3J8m1nL3J8nmlo8L3O6kj14L3j8O1%j7
$$ -23 -76 33 40 -32 -51 2 -24 102 50 -65 -25 -29 -20 39 26 44 3 -2 31 49 44 40 37 -31 2 68 66 -48 -15 -33 28 28 11
4402A1j4m0K6J3N3o1o2M5K4m4J01r8Q7m1J9nJ7n4KJ8NR9p2L1n7j0O7k9J9n0j6
$$ 11 -3 -43 -17 -4 49 -12 -74 -29 -5 -49 52 -46 41 0 19 14 31 -23 -21 -3 2 101 29 60 3 -7 60 31 50 0 -16
4433a6L6L8lr0KM2L9j1k0o2M5l1P7m1J9m0p8J63m2k2Nn9PN0l5O4p8%K0N9l1N1
$$ -16 20 58 55 -35 -33 9 48 37 17 -45 0 -31 46 5 24 -16 -94 69 27 5 10 -49 -42 8 -27 37 -41 -41 -21 38 7 58
4465E8m0l4M2l0M0k8k4QK9M4l7l4l8k1Q1L2nl3n6O8K1K3p9K5l9K9l4K2j6l5N5
$$ 58 18 -16 26 -4 36 8 -16 -8 21 65 28 -6 -44 -65 16 48 43 10 -46 22 43 66 -13 12 -27 2 -32 -10 -26 -61 -6
4496fj1P6p9K7k5l0RL2M8L3j01J2MOK2j7k0M9j5l0J7l8N2KM5m9K0k5l4M0K5K5
$$ -6 -17 59 -20 7 -18 -48 -39 -7 41 74 -27 -15 -11 -5 17 0 -20 29 14 -16 1 -37 15 17 62 13 33 8 -26 14 39 64
4528F4m2l2qJ1O1m2kk5k6K5K7k4J5j2J3L6m7J6k1rL2L0m9O8r8R6n2OpJ8n6JN5
$$ 64 22 -10 -18 -7 54 12 10 -15 -41 -16 11 -13 2 -10 3 39 -8 8 -13 -22 10 40 -9 59 -39 57 5 11 4 22 -34 -33 22
4561B2K4l4k2k4N7k6j0M8p0K3Nok5N3n1L0J1kk4L6Jk5O1k9r8J05n2K0M0oMp0J3
$$ 22 46 12 -10 -34 23 -3 -13 35 -35 -12 -7 -13 -38 15 -36 -6 5 3 -21 15 16 -9 52 23 -75 30 -22 -2 38 32 36 -34 -21
4594b1pJ3K5Rk9%j8R0o1j1K6j1J7q0O5J7m2M3j5j6l7M3m7LJ04l1j5Mj00J03pk4
$$ -21 -28 -15 10 19 -10 -10 -28 62 1 -10 16 5 22 -58 7 24 -18 25 10 -6 -43 0 -47 -44 60 29 14 18 -82 21 14 -10
4626a0j9k0M7k6M9Jj3m4K9N9o2K6Klj6J9K2l3m7M6j1K7OJ2n9J6J9K9o8j2M3l1
$$ -10 -29 -49 -2 -28 21 22 9 -35 -6 53 -9 17 19 16 0 19 41 8 -39 7 -4 23 29 41 -18 -2 17 46 -22 -34 9 -22
4658b2K3K4k5J1o8P6k3kKl0m4L7L8N6o6N2m5L1L1m4NPj5M7J3k4n5L7k5L8k3l0
$$ -22 1 25 0 11 -57 19 -4 -6 -4 -34 -78 -41 -3 53 -13 39 -6 25 56 12 17 24 9 56 69 45 -10 27 2 40 17 -13
4690a3K5Jl2MM9k6J7k7KJ9K1kn2K1jok0L5l6k0R8r5M4jk6K6NJ3rK5q3K0RL4Lp
$$ -13 12 13 -19 -15 34 8 25 -2 0 19 40 38 -14 7 6 0 -20 15 -21 -41 57 -38 6 5 -21 5 10 23 14 39 -44 -24 -15 19 22 15
4726A5p8R4rjo4R4p4M3k0K8ln5K7L8k9k9J6n1O4KO2j40R2k8ol1N1k5l1L6K9L1
$$ 15 -63 31 22 21 -43 51 -23 20 0 28 25 -30 -3 35 6 -23 -7 -58 6 8 70 -70 22 -6 -12 -43 8 -17 -48 -12 17 48
4758D8jp6L6n5J9J7K1j7k8J6NQ6o3k5J7L2l6Joj4L9P1p2j6o1L9P6o2K0j2Oj2j8
$$ 48 47 -29 7 -48 -29 -12 9 -8 -36 -20 -15 71 8 -17 0 32 -4 -3 -9 -23 16 87 15 -1 -62 -23 53 -9 11 -1 5 -7 -25
4791b5qO6n2NLJ1J3k3lk7RL5J9mJ1l1j7O1M1j49Q4l3L8Mk5Qm2J3N7J7n0qj1j2
$$ -25 -33 33 -19 -14 -11 0 13 -10 -13 -40 -31 4 23 19 30 -1 -18 43 84 -65 19 -14 24 28 3 11 -31 -18 39 56 6 -2 -13 -25
4825b5K3L1o3K9m5Q0o1N1nm2L4j3KJ7l4J4rQj3Jj7RJ4K6LPn9L7l3L2k3O3j6o9
$$ -25 -2 29 -34 -5 -50 30 -31 20 15 -27 7 -6 -4 13 -21 -7 -16 -8 -21 -20 -37 -28 -14 12 15 22 -37 0 -33 -1 -24 39 23 -46
4859d6M0k0L2nK7lK6k2k4mK1l2L1k7N9j00O3n6MQJ2L1m0J7mlL6K4m7pK0J1l4R
$$ -46 -6 -26 6 1 28 25 51 29 5 1 22 -10 21 -6 53 -47 16 -40 -36 -28 -16 15 -25 -8 -12 -15 21 45 -2 -9 11 22 -12 -3
4893ck2L5j6NLl6M0N6q7K7%j8J7oN1p8mK1J6l3P1l0m4L6n2M8Jm9k4K1P0jRn8K1
$$ -3 -25 10 -6 -1 2 -34 6 62 -25 2 2 -16 1 -5 46 -32 -36 -15 1 -32 39 9 -35 1 -51 -3 -2 -51 -75 -54 16 15 24 -34 -13
4928a3N2l0j5J0K8l9J5P7m7L6o1l7j3K0N2n1L9n8rL3j2L0%j7J3J9m7P3p4j7M6
$$ -13 39 9 -6 4 32 -7 8 85 38 74 13 -24 -37 -17 35 -16 23 -35 -44 -11 -23 7 7 -10 3 22 -25 48 -26 -43 3
4959CJ6l8J0RJl4J22r6l2K6j1L2R%m6L8l5L9j6mLK6k1K6l5j5l7P0k7jM8p0K9O7
$$ 3 19 -19 -9 0 1 -33 89 -7 -39 -13 -24 8 17 17 -29 9 -26 13 -3 -7 -4 22 1 27 -8 -23 -60 10 -17 -18 30 -40 -11 56
4993E6qm7LK5k3j8jQJ8m1kJ6Qk8n2R1j9RjoMj4K8k6L4j6J4k6O1n2OP0p7J0N9o5
$$ 56 48 1 4 29 6 -12 -13 -5 13 -28 -30 -14 -6 -34 -86 5 -14 -5 -6 -12 -8 -22 6 -20 14 -2 12 -14 47 -5 1 71 -6 4 63 -2
5029bl5L1L0K8l0k5QQJ2Qn5M7k5mj2m5N7K7J5r0JN3K7ql1n7O3M3o2M2n7O2qL8
$$ -2 -37 -6 24 52 22 -3 5 13 25 33 -22 25 0 -4 -16 -61 -4 23 38 -52 -51 2 29 21 -10 -67 -4 39 -23 19 -38 24 16 54
5063E4K9r6N6l5Oj8qk0L7M5l3k3K1p9L8N8MK4o5k0k3LP8nm1m4P1j0l5M0L5p7K
$$ 54 83 -13 43 8 14 -4 -12 -32 5 50 17 -6 15 -64 -26 32 36 60 -5 -25 -48 -45 33 28 -13 -57 14 4 -31 9 44 -33 -31
5096c1M1noJ2oK1o8P0Jo6j4P0m0K6L1m4kOM5n9L3pK3k5L8j6k2j7QN0p7J9j3j3
$$ -31 10 5 -1 11 5 26 -42 28 29 -37 -51 19 -21 5 36 -8 -10 -4 41 -18 15 8 31 6 44 28 6 -11 -3 47 -30 -11 -24 -37
5130c7N3l0kL1n4N9k2M4q9L7j0J4n6J35o0l1L5m9P1p1O5oj7rK7j7Rn2R7q0lM1
$$ -37 16 -14 -16 15 -39 20 -2 42 -47 -10 -20 -6 -62 73 13 -18 17 -32 39 -32 33 27 10 1 28 11 20 -32 65 -15 -18 23
5162B3rl3O8l6qKK1k0L8j3K1p1m3K9L9J0k5L4l9K3J3n9M6J5k6MoO5q5J1m3O4o3
$$ 23 14 -19 49 13 5 7 28 8 46 33 54 -17 -60 -31 8 18 -7 27 -12 11 24 -35 11 26 0 4 -2 63 -22 -11 -54 10 -53
5195e3K2O7m1N8l2o9J8P7o5M7k5k5J7Nm7J2L4MKk1pmko1Q8J7p2qN9j2J9Rk0k3
$$ -53 -31 36 -5 53 21 -48 -30 47 -18 29 4 -21 -4 1 -46 -34 0 4 6 -15 -22 -26 -28 -89 -1 16 -56 -64 -5 -17 2 11 -9 -32
5229c2M6NqM4m2j6nJ9%l4L3j3O3p5Mom4R5r4M9ok7N0%K0Jk1L7o1O3n1J4qk1oJ5
$$ -32 14 19 11 55 13 -3 -8 11 11 -23 10 -3 60 -15 -11 -17 -61 34 -60 -11 -17 -44 6 6 26 27 6 43 -18 45 -6 8 0 -21 -27 -12
5265a2J8l5j0L1K4O3o7j9J7k0Jk2L9k5j0K1K5KK8J5r3O4O0n5l1k6Q0p7k3K2jN5
$$ -12 6 -29 -39 -8 16 79 12 -7 10 -10 -9 -31 8 -17 -27 -6 19 21 49 64 -29 35 95 40 9 -17 63 -14 -37 -15 -16 39
5297C9j7o1K0J4Mk3l4K4L1j4l3j8L9PJ7K1j3L2mj6j4j7PM0l4nN7k5r7N6QqM9j04
$$ 39 22 -39 -19 -5 -1 -24 -58 -34 -3 -17 -50 -68 -29 -22 -5 16 3 35 31 15 1 -16 -9 31 -3 -8 49 24 -73 -17 -9 -17 32 -72
5331g2N9j3j6O0m5L4J2JJ0o2P4q6Q6j7oJ0j3j4l2J5KLJ1kMnPjL2l0NM2n2J8j3
$$ -72 -13 -26 -42 18 -27 7 19 20 30 -32 42 -44 42 25 19 29 16 2 -30 -15 -13 -10 1 -1 3 -2 5 4 36 6 11 53 1 19 6
5366Fj3J5J2K8m8k%L8M9p8J1n0J4J9J3l9N0Ro3Q8o7L1l9nN6o9K6%Nmj4M8l1j0
$$ 6 -7 8 20 48 0 -2 -2 36 85 7 18 -32 -18 1 14 -25 25 34 -29 59 -8 23 -16 -21 35 -34 -8 -8 -3 -7 -21 27 -4 -14
5400a4J4Rn3R1n9j3Qj7N1j4oK4j2kqj7K7l4K1j6J8j9M6jm9O8o8j9Q4o2P9p1K1
$$ -14 0 9 -44 47 -12 -25 -17 -34 17 3 -3 21 9 7 -1 -18 9 -25 -4 -20 -2 -21 25 24 -25 43 -25 -44 40 -22 57 -14 7
5433Gm4J6kj7nL3KJQrmM5k8Rj6K6km3QL3pj8L0n1O3j8o0K6N5k0k6j3K4M0n1QJ4
$$ 7 -37 -21 -23 -40 -45 -12 -10 -9 -1 -10 -14 31 3 12 -4 22 20 -23 -15 18 11 -7 23 -28 35 17 -43 -17 38 18 -8 -21 3 43 -8 0 14
5470A4m6N6l2L0m3k5J8ON6k3j2J1l3L7j6m3M4j6OK4J6j8MJ0p1P6K2r6O8k5K9p
$$ 14 -32 24 -8 22 -21 -46 -28 -22 34 11 -1 10 -23 14 -2 -45 -1 -17 -11 13 29 11 15 25 -46 30 52 -44 24 -1 28 21
5502B1m0%j1L7j0j5N1lk2L2o0pL3o3L6m0O4rk1mM2l5J7J2n2O9m4MLm4Q5o2O1j
$$ 21 -19 -19 -30 7 -3 -18 33 30 8 40 -20 -27 6 -57 -21 -61 3 -6 -27 -31 11 -24 -7 5 -47 22 -22 -18 -15 -59 26 -36 25 24
5536B4qj3qL4j5J0Pl3l9N6j1K7l5Mk0J7K5m2N0j8n7NP4q3N2m9K0J4l7Q3Pn4J0
$$ 24 16 3 -5 29 14 24 31 -2 -41 15 4 31 -4 0 -20 -3 22 -20 30 12 -45 -40 34 -49 3 -46 -26 -12 -49 34 41 -13 -3
5569cJ3K9m5O5r5M2J5l9J4K3J6k8L1l3K1l7J4j3K4J2m1jk7M0K8l1qK0K0m7L3M0
$$ -3 10 39 -6 59 -36 6 21 -18 -4 19 35 7 38 5 26 -11 3 -10 14 26 -15 -16 -43 -3 25 -6 -14 6 26 -21 12 52
5601E2o5j4K3P1po9qL9k0%m5O7K5l0J2K2k0Mo5Q4m4j3J7n4l2Q8m5K8J5K0p7O8
$$ 52 -13 -27 -4 67 60 -9 -17 22 2 2 -43 24 49 19 31 53 33 37 -28 56 12 -1 16 -38 -70 18 -27 1 16 36 -41 27
5633B7k6L9n3J7m6J2J0J6l1L7l2LQ8o2k2K0K5l4j3L9k4N7n5%QNPPj4m8L4N8l0
$$ 27 1 40 -13 4 -42 -30 -20 -4 -35 2 -30 -27 61 -1 -23 -3 22 -12 -25 14 -10 47 -8 -8 0 5 12 19 5 -43 -9 49 19
5666A9lJ9Oq3R2j00M7J0k7M1p2M8j3m1L7L0oJO0j01N4Ml4K6l4L6j5L7l9q1P2j7
$$ 19 16 35 41 -42 50 -50 -3 7 -20 21 -51 -3 -16 -57 -20 10 4 5 65 -36 18 22 -12 14 -20 16 1 38 -1 -82 -10 -27
5698b7O6j0n2L3K0J1K0Pn7j5M3m0l8K5J0J2J3l9N9j19M5K5P7r3l4R1p7K5n2N0
$$ -27 39 29 -23 10 30 41 61 68 11 -4 39 -1 -39 -14 -4 8 21 -18 41 -78 -33 -8 69 -24 -58 33 -44 -19 -71 -21
5728b1Ol8N2l9O9K8p8lL6j4Jm6M5K7l6O3l6k7p2J37l2j3J2k8jL0m8R0n4j4PM6
$$ -21 -15 -53 -1 -40 29 57 -21 -24 12 -2 -1 -47 -2 25 -11 52 16 -11 -83 54 22 9 21 -7 -8 22 -26 64 10 -4 3 49
5760D9o2J5k1L3j6L5l4j7MJ2j7K0K2m6QOj3J6j6O8r3L1K4n4O0m5L1k8oO4l6K9
$$ 49 -13 2 -19 14 -2 33 -1 -18 -14 -2 -19 1 23 -23 -15 -9 -22 -6 -22 46 -47 -16 8 -46 14 -31 0 -28 -34 30 -6 23
5792B3Kl0jQm0KK9l3R4o6J5j8j3M9km8K4N0p3O8Ql6l3mJ3j8L6K9p1L5k8J9N6J0
$$ 23 25 -5 -6 2 -38 -36 -7 -40 54 -12 3 -15 -28 21 19 -29 -5 45 -28 40 48 12 -21 -25 -12 -30 6 35 -36 -1 -29 -10 46 56
5826E6q3lk1J0K6k1N5m5l9O7L4m2k5j0O9L0n3Nj8j3k1PM9K7m3k5M0on8K2J7rJ6
$$ 56 -27 -30 -51 -41 -15 -36 19 -26 -65 2 36 -6 -31 -41 28 58 5 10 -8 -21 -42 -35 14 41 -2 -27 13 7 -51 -29 -12 -21 -5
5859eJ0l9k8L7M9l2m3O0m2O1n4lK5n6P4m4L0pM4l9jJ8nm2J6pM3l6L4k7Jk1l7K5
$$ -5 5 -34 -62 -25 24 -8 -51 9 -33 28 -26 -29 -4 -60 14 -30 0 -7 37 -2 -3 15 10 -32 -16 -23 20 -16 18 -9 -8 -29 -66 -41
5893d1M8K6l5o0L9oL6j7k3N3k0K8QK0r2K8lNlqL3jPl0L2nj9k1P8k0p9P0j7K5J2
$$ -41 7 33 -2 -62 -23 -29 7 -10 -33 20 0 28 36 56 -36 -8 -11 -6 -9 -17 16 15 22 -8 24 19 0 -21 57 37 -42 28 11 36 48
5928D8j9k7mm1J05k3l1j8Noj8M3l7K1J4r8Q3M3o3L2m5%L1L3l0K3n5K3M3J5n0O
$$ 48 29 2 -2 -43 62 39 8 -10 -5 -11 -29 14 -23 -2 12 -86 -3 40 -23 9 -36 -36 -5 28 -2 21 -34 -11 32 47 -3 3
5960CkM0J9m5K0Ml7K7k2O7p7j4K8K5m7qRPl%m5kM0k0M8jJ0m5%Qj3jl5P2k4M4J7
$$ 3 1 41 60 15 35 39 2 29 7 74 -3 -17 11 36 -11 -19 -10 -3 -6 -6 -51 -53 -13 -33 15 14 24 -21 -21 -13 -26 -27 -62 10 -14 30 47
5997D7l0K8j8o4J12rm1j3k3pM4p%k7o0L0N7qJ9m8rj5NP1m1j4K9n2j4J5J9L4l5
$$ 47 17 45 27 -37 75 66 25 12 -11 -18 26 19 19 -8 -68 -38 19 11 30 -18 -27 -42 -37 34 -7 -21 8 -44 -58 -43 -24 10 -25
6030b5%QNK3K8k3rK8jp7J8QL4J9m2M2Qm2lL1l3J4K3k1Pj1J2qm6L2J8l0M4k3J0
$$ -25 -25 -17 -12 11 39 16 7 35 34 -43 -25 -17 17 36 -6 36 44 2 -1 30 -3 11 34 13 20 9 21 13 -33 -1 17 -13 31 8 18
6065A8k9L5j0k1k2JK3Jk4O4l1Mjk7M2Ko2N1Rl7j5%l8J08l3l4J00p0J2L1pk3o0
$$ 18 -11 24 14 -7 -29 -28 -5 -4 -28 36 5 9 8 -19 23 25 -37 14 23 -14 -29 -29 -67 41 8 -26 74 4 16 47 40 17 -43
6098d3O0PJ1r4N0r%j5K1j9N4q4N0j8j1K9m1L0m0RJ0JL5k7L6M3m9L1n5O9k6okL0
$$ -43 17 24 35 -59 -9 -18 -18 -33 -12 -31 23 -61 -11 -29 -40 -11 -52 -22 -62 -53 -43 -42 -7 -34 2 45 -4 27 -28 41 15 9 7 37
6132C7k4k9LM5rj9m0N4j2J6q1O9mj6N8j02L7j6J5J8KJ3k0L2l9K6jqK0n9K3k6O3
$$ 37 13 -16 -13 32 23 4 -36 18 6 22 -59 10 6 -10 48 -54 -17 -33 -18 0 2 15 -5 27 -12 14 13 5 25 -34 -11 -37 26
6165B6n3J9N7p2L6PpL1l9n0N8N3o1P4j25L2L2n0K9J9Ok1jk9M1m3K6MJ4k2JJ1N1
$$ 26 -27 -8 49 -23 13 20 13 44 5 -45 13 66 5 79 -46 -14 18 -32 -3 16 22 1 0 -29 12 -31 -5 -1 13 -9 -8 3 54
6198E4r6K5n2K7L6R%K5m5k8R0n7qN7MOj03J01l1n6K0M0lJ2n1M4J2j4K5Om4J3p
$$ 54 -42 -17 -69 -42 -6 3 3 28 -17 -45 45 -12 -20 37 41 47 -56 45 14 -42 -22 18 15 27 -24 20 32 18 43 49 5 18 11
6231A1j0LJ5k1MK3k7K5m6L4l2K1Nm4J6QL7K0m3k6N5Oj7k8j9J9J5RK4p8R4m2L3
$$ 11 1 4 19 -2 2 25 -2 23 -23 11 -21 0 5 -39 -23 -15 22 42 -1 -27 28 34 17 -11 -30 -11 4 13 37 -41 53 11 44
6264D4rKl2j5J5l0N0L1o6Ol3O0mm5O7l5%l0j5J7K1L7k3k5N5p8L4J2J0k2K6m6m
$$ 44 35 37 5 -10 5 -25 25 56 -10 -4 -37 23 19 -26 41 6 6 -24 -39 -22 -1 36 13 -12 43 -35 -1 11 21 -1 25 -21 -25
6297b5M9qj1J8l9P3k4q0Q1k9J6l4M0m7J2j6K5k2J06o1o3N7lo5J7J3m1L1Q8m6n
$$ -25 24 16 5 23 -16 57 33 -47 34 5 21 -13 27 -20 -8 -24 1 -21 85 24 -39 18 15 -50 -33 -20 -61 -30 58 12 7
6328Gp1P9J1qj5l5J3L9L2m8J6kJ6k1K8j2j5l8M0L1n3J9jJ0j2qL8n4Oj0O5j8l8
$$ 7 -64 15 26 18 3 -32 -19 20 52 4 20 18 34 13 41 29 14 -24 16 47 -6 13 12 22 10 2 40 -14 -8 -18 47 29 -9
6361iK8l8O0n0K1j6J1qo3N3J2JmJ5k5k4Q6q5J1J7M2mj8m0N2kj3Ol2ON6q4M0K8
$$ -9 19 -19 41 -9 12 -4 7 -1 -64 -11 1 2 -2 13 -12 -36 50 -35 -24 -7 35 31 13 -27 25 23 10 16 -16 -10 46 -38 2 30
6395C0r6N1Q6j09%M5kl7j6J7lL7k2N0o3J9M3m9K9rj7N5Kmj7m8LN5l1O4n5k8jJ3
$$ 30 -66 -15 71 -38 -38 7 5 -32 -48 -31 -34 3 -19 31 -32 -13 30 -19 10 1 -16 39 41 37 20 -28 -25 30 -1 63 8 -20 -21 -8
6429hK7j9j8rLP8k9Nm9j6M3k2O4k1l1l0L4M2m4l%j7K1j3jjk6M0Moljl1J5L4K8
$$ -8 19 0 -18 -27 -24 54 25 30 -19 -35 8 -14 50 29 -2 -32 2 44 0 -3 -3 -20 1 -12 -13 -14 -40 0 4 -2 -5 -6 -37 -22 12 40
6465D0l1JL2m7l3N3q3M3O2m6J8j1N5qj0k2nlk5k3M5L2m5QnK1j0K0p7Q3k0l1j8
$$ 40 9 10 42 -5 -38 15 -68 -25 37 -9 9 -2 53 45 35 13 8 5 -20 -43 2 34 -11 -3 -8 13 3 23 -54 29 9 -22 -40
6498d0jk2J14l6p8O8kl3j4J9LjN2o2K6L7J2pj5K8m2K0nk0P2p5J5J0j1J9k3j2J5
$$ -40 -41 -63 51 15 -63 5 3 -30 -44 -25 -22 -23 29 -33 -7 30 42 35 20 48 6 26 21 1 73 -2 13 23 12 31 8 -4 11
6531A1l7M9j0r9Q6j4L0l4j7L5j5L5k8Rrk2M7nJ4qM7n0m7N1o3L6L8n9L1j2M%oK4
$$ 11 -26 23 13 -86 0 -14 16 -18 -35 0 -15 20 -8 1 -8 -30 17 12 26 18 65 15 -32 19 -44 -8 30 -29 2 -10 -6 -6 -12 12
6565A2k4lo1J04l8J8k3M4o7j6N0%L0j4o0JN6j0K6l3k1L0n4L5J8k5roL6K2qK9m8
$$ 12 -12 -15 -76 28 -10 8 -15 29 -38 -54 -4 -4 26 12 -48 -47 9 -1 25 -8 -29 1 -53 -18 0 -25 -34 -40 -4 18 10 39 -9
6598iJ6Qm3J2K9j3J6l1j2J4J4L9o1K3K0Qp5M7qJ4l2L5oPk1J9QMj6n1O7J9l3mJ5
$$ -9 7 15 -28 -16 13 0 16 -15 -27 -13 1 40 -21 2 22 30 -45 2 -6 8 -24 11 5 12 -9 10 18 22 6 -45 22 41 8 4 19
6633A9Mqm2jP0j9j2L8p4Q2q0Q0n5Qj7L2m9J2J1J1k0rJ2lk8mQ6l2%l8J9PpqJ3j
$$ 19 23 15 -27 -28 42 23 11 49 -25 57 -23 57 2 10 -7 25 -24 -12 -1 10 -10 -19 -7 -10 -38 -42 44 12 12 -26 -7 0 -7 -15 -2 -3
6669cJ7k7K2%j2K3j2Qj1K1n1O9n2qj6L2m5M2JK0j7jJ8m0J6J1m1J0N3k7pm1O2J7
$$ -3 14 -13 9 9 -3 20 8 16 5 26 -25 44 -8 -16 -32 0 -45 -3 -2 18 1 0 18 -22 -6 5 -36 -26 27 0 -7 -48 14 31
6703C1l9j8M7k6K3m2rJ5L2n8K6L5m5L3J0m6NK3J9jJ4n3P5l0J4l3K7k7LM7m8M1
$$ 31 -8 -26 21 -5 18 -24 -33 -18 14 -44 -18 17 -28 5 15 -31 -26 -3 16 15 29 -24 51 21 35 2 29 2 5 52 4 45
6735D5k4m7M2m8L5Ll6M8o2L0JJ9J4m4J6J9J7j1p9R1k2mL3k3k8l4O4J6J2l7Pm7
$$ 45 21 -26 16 -32 3 6 -30 18 -44 -14 -13 6 20 -24 -8 11 28 17 -62 29 7 3 36 13 -15 -49 15 31 43 6 13 -34
6767c4M7oqj6P5m5K2l7oP7o9Ok3R5q2k2K5j9jM4m0l7M7pk5QJ6k3M8n7L0KqO4L
$$ -34 13 7 -1 -17 58 13 35 -2 -8 69 0 6 -17 78 -4 -26 -1 -20 -21 23 -17 -54 -7 -14 -39 -31 -15 -38 10 -47 -17 -15 -23 41 44
6802D4k9j4K4pLL3q1L9Ml6M6jn2L3Rm7NL0%L1j6Nk5M6K6p2j3Nk7N5l7J4K7o4N2
$$ 44 15 1 25 18 21 54 -27 12 16 -20 26 25 -27 6 15 -32 -27 3 3 34 18 23 -2 44 70 -2 -15 -10 -37 18 -19 -5 22 -42 10
6837A0j8L4m1K7k2L5k1K1j3j4k9J2NL4Lk5%j3L3j4m8M7qJ6LP0j12K0RMJ3m9M7
$$ 10 -8 26 -15 12 -10 25 4 25 12 -2 -31 -19 -14 20 23 -2 -2 -15 18 4 -44 3 -5 11 14 84 -28 -8 1 5 18 -31 16
6870A6l9PJ2o5J05k3J1o4N6k4K8k1Mj7j9RmJ2l3L9O7m8nl9P2Nn3Q3p0J7l7L2N
$$ 16 -23 -16 -4 -69 36 13 24 -40 16 -8 20 -1 3 -14 -33 -24 -28 -16 -49 -10 57 9 4 -35 37 42 -11 72 2 19 -18 14 19
6903A9k2J9Nk2j4Kj7NLl6J21n3q2R6k7L6o3L7m1J5q1M9L9O9m8k7J7k3K1L4l6J1
$$ 19 -3 16 21 -1 -15 -13 -30 -25 -22 -58 63 10 -72 24 -3 33 -30 7 -34 -19 -100 -51 -12 57 9 -18 -1 -24 -3 31 -5 6
6935FJK5k6K9j7k3JL3k6j1k2K4M2k2L5p6k4Q9l7l5L6J8j5k9L0rL3l1J6k8N3n4
$$ 6 7 32 6 35 18 -5 -4 29 3 -8 -30 -6 36 14 49 -27 -51 38 1 -34 2 20 5 -24 6 -3 30 -1 15 -13 40 -14
6967a4l4MN0l5K0j9N2k5k3K8l9NP1p2K6ll5L8JlM1Nom7J2J1n9O0l8N9l6K6l4K6
$$ -14 -48 -44 6 -29 -9 -28 24 -1 -24 4 -35 -30 41 -31 -5 -8 -43 -5 -4 -7 34 39 33 -14 -2 9 -50 10 -28 31 -5 21 -13 13
7001A3N5o1j7O6n8m2N6K8l8n2K0J9k6M0k6n3R0k7L2qJ6J1nOp1lL7K2pk1K6J6J
$$ 13 68 7 -10 56 -2 -44 12 40 2 -50 -30 -11 -37 3 -23 -76 14 -13 19 11 27 38 33 39 -32 -35 2 24 17 -4 22 38 39
7034C9m5J8k3L7r8M0j3N3n2O5k4L9m1L6p6J1O8k1M8j18N4J1N2m4Jl4J7M2Km3L9
$$ 39 -6 12 -11 26 -72 -32 -45 8 -44 21 -3 36 -5 31 -45 -34 34 13 61 -57 -3 8 60 16 17 -17 0 42 44 1 40
7065D0l9k4O5p0j6N2j8K2N2m5j0M1q0L4l8lQ2r1O2rn7L4P5o2NK3l6J8k6O1k7n0
$$ 40 1 -23 42 -28 -44 8 -10 12 64 19 9 50 -30 4 -34 -37 45 -46 16 7 -50 -16 59 -3 2 25 -11 7 -19 42 15 -35
7097c5L4J0K7m4J7l2M4n2J5L6mj6%Rj0L3j0K3m0k4KJM1n3O7o9O4m3J9j7L9n2j3
$$ -35 -1 9 36 -8 9 -23 21 -31 -16 20 16 0 0 9 -1 32 22 45 5 -19 -17 -16 25 -28 39 -30 34 -9 10 -7 32 -20 -33
7130c3M6l3L7j3j9j0JkoJ4L3l9j4N0J1p4Q2j8JK5j1l5K8k4K7n7J6M0j4k0k8Q5
$$ -33 13 -20 17 4 -15 -25 -24 -26 -32 -18 15 -24 -38 12 23 -51 31 13 14 39 28 -7 21 -3 24 -33 -17 23 9 -11 -39 46
7162D6n4L0Oo4J4oN4l5K4K1j01L9k3P2k2n2O6Mm7M0jmo3L6OMQo4J6L7L4J9m8N6
$$ 46 -8 22 28 -36 -22 -28 26 -9 15 36 -65 -26 -49 23 1 -51 15 19 -28 12 11 7 -56 -20 -14 -10 -2 -66 -50 -13 21 40 -8 48
7196D8rk3j6k0N7om4nJ0J1n0M2J3N1k3p4lM2n0rN7j9L8j6o2M6L9J9k4o4P7o9L5
$$ 48 39 16 0 -20 37 31 -13 -18 -8 3 -47 -5 8 59 36 -38 -41 1 -49 -58 -1 -20 18 2 -60 -14 25 44 20 -44 33 -36 -1
7229aqM7K4n5j5mM7o4J3J8MnnLJ7j8K7O2r5kRL0%j6l6k9L6K7o9J5L6l0J5MJj1
$$ -1 -9 38 62 7 -8 -12 35 -29 -16 2 6 1 -4 -1 16 -2 25 87 -8 -10 -1 29 29 13 -23 -52 -16 11 -58 -43 -7 -37 -22 -18 -17 -28
7265b8m0L2K4J3n6N0J2K0kk0pL3l9l8J2rP7k8jOqm5M5PQklpm1N6l0n3P3n9m2K8
$$ -28 -68 -36 -12 1 -55 -5 7 27 25 5 -2 31 -8 -46 -34 -43 34 6 5 11 3 -42 3 10 18 16 13 6 -35 21 -9 -62 11 -48 -90 -62
7301f2P3k0J9j3l7RK3Qm6%L3j2M5K0l4j9l3j7J03m5O0j07J5M5J7m5Pl7L8K5k4
$$ -62 11 -9 10 -3 -40 -31 -8 0 -46 -46 -13 -25 20 40 6 -13 -46 -63 40 -5 55 -52 -37 8 25 -20 -13 -50 -12 13 -11
7332a1LJ6k9j8k4J4K5j8jjM1j9O1k1m6M4j3j8J6l1M4jp0N6pj5qP7J3p6K5qk2j3
$$ -11 -8 8 -21 -39 -63 -49 -24 -42 -43 -44 -3 -22 39 18 -28 16 3 -15 1 -30 14 13 -57 -1 -8 -23 -31 46 59 -17 8 0 -22 -35
7366c5J4J7k9oJ5J7k2M6L6p6J6m9Q3l4K3n3K7k5K7n0M4K8K5m7K9l5N1rm6Rk9L2
$$ -35 -21 -4 -33 -39 -24 -7 -29 17 53 -23 -7 -56 27 -7 16 -37 -10 -35 -8 -58 -14 14 39 -8 21 -14 37 28 -18 -9 -38 -6
7398fnJ5L3j3k4k9M2M0k3p3Q1j9k3%nM8m8jJ2RlRj4j3L6n3qM4j3k5N7m5j8pJ5
$$ -6 -11 4 37 24 0 -29 13 53 30 -43 38 19 -4 -4 -9 39 -9 -10 2 11 8 17 3 -10 26 -27 -35 9 -4 -29 28 -17 -35 -42 -27
7433b7%L7m7M2l0n2J13K6n3k9OM7q8R2l4J1No1O3m9P7n7M3%m4k2J3L1l0N6m7J5
$$ -27 -27 10 -37 5 -25 -77 36 62 9 -20 -14 33 -55 37 3 14 19 -42 21 -28 49 -8 35 35 -9 -31 -18 13 -17 39 -8 7
7465Gl3oj1J7K1Ol8L2m4L5nm0N6L3r0N6Kk1L8mr9O1L2kN7m0j3k8P6l4N4p6L3j9
$$ 7 -26 -32 -43 -26 -5 1 -37 -5 -49 -14 -19 -59 -3 30 -60 -4 -2 -23 15 11 -88 -27 5 3 60 20 7 -21 55 21 75 -1 32 13
7499A3m0K4lL2Ml5k4JJ5Kk7JM0KnJ1j4j6K0l2O5LLrj10P1O8lm5nqql3J5O7k6j1
$$ 13 -27 -3 -6 26 30 -5 -29 -28 -13 -11 -38 -37 3 5 0 11 -3 -19 1 -31 34 37 40 31 -79 -8 60 57 12 7 -1 -9 -42 -27 40 14 3
7536CPj1qK9j3P2q5J6JK5o0L0L6l9lL2rJ3p3NK3LL9p5L8l0Q5k3qk2M7mq2N4J6
$$ 3 10 -1 -9 20 7 79 -6 10 11 36 -24 6 42 3 0 32 23 36 -37 -32 -9 -6 33 -42 -4 -34 51 28 20 -2 45 41 -41 13 29
7571B9m0Oj7N9k6kJ6n0N0j9RK2J9j14N0K9m3O2l9KrKRM1k2K1r2J5R3m6Qk0o0j3
$$ 29 -11 -5 -22 37 11 9 25 -25 25 6 15 37 56 -58 -8 21 -22 40 1 3 -6 -4 5 46 24 45 -47 -32 61 15 23 3 -57 -70
7605g0J09p5K1P6l3o3LJ8%K3k7J0P2q7N5n1J3QO8j34M3K0l3Q7p7N4rm3K2j0k2
$$ -70 39 -36 -15 61 28 -35 -32 -14 -14 9 -18 -8 64 -23 32 -19 -6 2 70 -64 -21 -1 -34 53 -24 30 21 -22 0 -10 -32
7636c2L0kJ3M4n8Lj1K9j7L8k5jJk4n3M8L9m9L0M1o8K4m6M2KRj7NKkk1K2N1j09
$$ -32 -2 -4 9 53 -5 -2 -13 16 -1 37 12 11 12 -12 -65 -17 22 -27 3 44 -24 0 -46 -4 -2 7 -10 -5 -3 -5 -26 -4 47 -62
7670f2L3Q7p7K1N2j08O2K1j4L%m1L9m9j1M4m5M2OPJ1k0N1n4Ql0K8k8k1N9j0J0
$$ -62 -29 58 -19 2 54 -54 8 29 15 18 18 -23 16 -33 -44 0 -45 -3 3 10 21 1 52 -2 6 -24 4 -24 -45 14 4 14
7702A4K0l8k1M0m5M6Nj0j0RJ7N1o5n2N5L1j12O4K4m4J8j7m2K3M7L2q2M9j9j2M4
$$ 14 34 -4 -25 15 -30 16 21 11 1 10 27 78 13 -39 16 47 -65 -1 23 -21 -3 -20 -62 -39 8 40 -42 7 -12 -24 20
7733B0k9%l9P0m0kNJ9K5m4J2Rk6P9m7K4%J6o7O2k3om1KK3ql6R9n4RmQk4J9qk0
$$ 20 -9 -9 -48 22 -18 -20 -15 4 29 -15 -3 6 -20 59 12 36 36 52 -15 47 24 18 -23 -21 2 -6 -42 57 3 12 8 16 -8 11 3 -17
7769a7l3j1N0M4ll5k3N8l9J8k2j6mL9n2L1L3l2K6K7l9L3m5oK3Qm5L6k4j9O1o9
$$ -17 -50 -61 -11 33 30 -5 -28 30 -9 9 -13 -29 -33 6 -46 -15 18 -14 12 39 0 33 -12 -18 5 13 -32 4 -20 -39 22 -47
7801d7M1kj2MM5k9O1m2o4R0p1K2k0rO5j0k8L0Oj5j8j3O1k9Ml2Kk0L4J3j1N2r2
$$ -47 -6 -8 -20 -16 29 0 61 19 -45 45 -26 -4 -24 -33 32 22 -6 24 30 15 -3 -16 45 16 20 -12 -10 -30 4 17 6 58 -34
7834c4J9L1o6P1l7N4l7M1n0n%J3j4O2o4J0j4Qk1M1pJ0n4K8M3l7j7K0pJ3J9kJ4
$$ -34 -15 16 -50 21 -16 38 1 42 -8 -13 -13 0 -14 48 -16 -6 -20 -12 -33 8 1 11 -43 -15 28 -9 -26 -6 -13 0 19 17 31
7867C1m6N2o7M3LJ2l1k0N3m1k5N5p3K8kok4LL7K4L8o2qK8K1m4L6m7KL9o8K5K6
$$ 31 -15 37 -30 13 16 28 -3 -23 30 -11 -36 19 -54 -26 -28 -34 -58 -55 -18 6 44 -18 -26 2 23 -21 15 -32 -30 9 -59 -34 -8
7900hk7M4l6K7jrM5q7N7n6M3MJL9o4K6J6J2j1l1K7j9KK5Qm2OL2n6N0n3J7K7qJ5
$$ -8 -35 9 -27 0 -1 -10 35 -52 5 -51 -8 -4 -3 36 -28 -2 14 26 15 -16 11 -8 -6 19 27 -15 -9 23 -33 17 -36 -19 8 0 15
7935A5Jl1j2L6m7K7K0n0M4pMn3Q5np2M2k3OK5j0Rj9L8LQn4O2qL1n2n1M2rj6l9
$$ 15 16 -15 -27 9 -38 -11 9 -41 3 -4 0 -53 32 27 -45 -3 -26 -20 5 -5 4 -15 23 26 34 -20 42 34 65 13 -38 4 -5 -21 -60
7970f0P3j0Jk9MK7k4M8l6m4O9l0J8j3j7Kk8O7mn9P3l3k9J5nj1L0RO0n2l9L3K4
$$ -60 13 3 4 -25 -21 6 -18 30 -6 -50 19 -11 7 -6 -23 -21 -49 18 14 -45 28 -5 -34 -19 -24 -35 -5 4 64 12 -27 6 30
8003C0j5j4K7q2P7l7N2q0O5k4Rl8K1J5lj9l1M9K9o9K6N0p0L3J6l1J8J2j8Lmj6
$$ 30 15 1 28 -54 23 -14 38 -42 23 -1 8 -30 -9 6 3 -16 -47 2 31 -38 -12 38 -32 1 17 -14 4 16 -2 1 -3 -19
8035a9J7J3j5mK9j5k6l5M0O2k0k4k1J6m4O0oj4O0o3Ok3O2k3J1J2l2L2p2L8M4p1
$$ -19 -2 11 -4 -8 21 6 -20 -55 -15 47 27 3 -18 -2 -46 14 8 -6 54 -9 -3 -26 36 13 24 36 4 36 -36 2 46 -25
8067b5MM7j7l4L1j6L4k4l0J2ol7O6Pm8O0j8k2L4l2J5j2j4N2J5p3P6r4M0L0m3N6
$$ -25 -21 26 9 -25 6 -10 24 0 -30 -18 -24 -61 5 12 -36 24 6 -16 18 -14 1 -11 -25 27 42 -31 45 -49 -9 21 -22 34
8099C4j7j2L8lml8lK2p2J7L5k9L3OK8J0k3p4K5N9n6K6j4j5mO7j3n5K4N2j3j5P
$$ 34 17 5 43 40 36 -2 -5 17 -55 -38 -3 -32 1 7 35 45 22 -52 -27 32 -24 2 -12 -27 -31 36 23 -32 -8 44 31 16 23
8132B3n1L5N6p8KJp3J10m3M0J5On7l1Q2n6N0j0l2RK2j6Jm6K1K6k9Q6m5K3n5JM
$$ 23 -28 7 63 -15 -13 -12 -85 25 -18 22 37 43 -14 -45 37 -19 31 21 -11 -2 20 4 5 -41 -20 6 -23 63 18 41 -14 -13 -9
8165ij4J4%N7m1K6k8m%K8nLk6M0k2L1j4j7j7k3Q2o8J9o4Q8j00
$$ -9 -23 -9 -9 48 7 33 5 1 1 29 24 27 1 41 19 50 36 19 2 -21 61 -7 12 -52 36 -64
8191f4
$$ Imaginary data points
##PAGE= N=2
##DATA TABLE= (X++(I..I)), XYDATA
0@%%%%%%%%%%%%%%%%%%%%%%%Nj3J6j6J6j6J6j6K4l2L2l2M0m8M8n6O4o9P7q6R4
$$ 0 0 0 0 0 0 0 0 0 0 0 0 0 0 0 0 0 0 0 0 0 0 0 0 5 -8 8 -8 8 -8 8 -8 16 -16 16 -16 24 -24 24 -32 32 -37 40 -46 48
44D8j04J17j29J41j54J71j90K09k30K54k81L12l45L83m28M80n43O18p13Q36j000
$$ 48 -56 61 -68 73 -81 90 -100 109 -121 133 -148 164 -181 202 -226 254 -289 329 -384 452 -548
65e48J234j595K234l696J3922p15k1663O802O250J722l83k704o126J157K113L587
$$ -548 686 -909 1325 -2371 11551 10836 -10827 -4025 2225 3947 3564 860 -5266 -4109 -1996 1591
81A591J711j640l424l435l08J0904L911j2675n920P593K599J428K733n577o226
$$ 1591 3302 1662 -1762 -5197 -5505 5399 9310 -3365 -9285 -1692 907 2335 5068 -509 -6735
96f735M252O700K793l547o808m35M510K246K074k709p545Q03O004J81P77j69p452
$$ -6735 -2483 4217 7010 3463 -3345 -3780 730 2976 5050 2341 -5204 -4401 1603 1784 2561 2392 -5060
113e060j665P857L905k827m689k742K804M007J268M67m102n916M152P723l82l904
$$ -5060 -6725 1132 5037 2210 -2479 -5221 -2417 1590 2858 3325 -777 -6693 -2541 5182 4800 896
129H96l829j978N935N634m046m524M63O86J028J752P45j017n038k745O646N575
$$ 896 -2933 -4911 1024 6658 2612 -1912 -1449 -763 265 2017 2762 1745 -3293 -6038 608 6183
145F183m193n607j478K674N929R76n753k764J855J858K298Q65k616k689m72K731
$$ 6183 1990 -3617 -5095 -2421 3508 4484 -1269 -4033 -2178 -320 1978 2843 227 -2462 -2934 -203
161b03M523n88m918j451J538J986K959m73m798k141K058L374K253k436n143n62
$$ -203 4320 3732 -1186 -2637 -1099 887 3846 3373 -1425 -3566 -1508 1866 4119 1683 -3460 -4022
177d022L632L157m5l687k904J522K542J306O10k442l258J176L675J716q21l034
$$ -4022 -390 2767 2722 -965 -3869 -2347 195 1501 2111 -331 -3589 -2413 1262 2978 2157 -877
193h77k039J886L084J313j358l298j893K573L678N54l003l783N1M032K290j960
$$ -877 -2916 -1030 2054 3367 2009 -1289 -3182 -609 3069 3623 620 -3163 -3112 920 3210 1250
209A250k784j195P70K164J321l21k056k332N01L654K381j879l599j195K744L638
$$ 1250 -1534 -2729 -1959 205 1526 1205 -851 -3183 -2682 972 3353 1474 -2125 -3320 -576 3062
225C062Q7k916k266K18K377K328k18k639k237M42K730J950j154l000j556J278
$$ 3062 3149 233 -2033 -1815 562 2890 2672 33 -2204 -1762 968 2918 1764 -1236 -2792 -1514
241a514K557J109j438k616j165J525K844J038k060k788l17K711K643l19k523k024
$$ -1514 1043 2152 714 -1902 -3067 -1542 1302 2340 280 -2508 -2825 -114 2529 2210 -313 -2337
257b337O96K744J735q71k494j584J117K643J210j570k498r91J437K448N96k006
$$ -2337 -1641 1103 2838 1967 -527 -2111 -994 1649 2859 1289 -1209 -2200 -763 1685 2281 275
273B75k346o01J998K476J00k618k136N63K590J931q96k567j106J255K214J228
$$ 275 -2071 -2672 -674 1802 1902 -716 -2852 -2289 301 2232 1336 -1231 -2337 -1082 1132 2360
289B360j074k291q81J415K298Q77j757k430k76J886J961L0k216k090M50K121J421
$$ 2360 1286 -1005 -1886 -471 1827 2704 947 -1483 -1759 127 2088 2118 -98 -2188 -1738 383 1804
306A804n93k278j497R79K173J093j055k218q94J611K146N72j384j979k85J890
$$ 1804 1211 -1067 -2564 -1585 588 1681 626 -1592 -2486 -875 1271 1843 459 -1520 -1805 85
322H5J928qj692j802J76K090J572p06j961j318N90K065R07j127j936q72R90J908
$$ 85 2013 2005 313 -1489 -1313 777 2349 1643 -318 -1636 -1046 1019 1926 799 -1137 -2009 -1019 889
340H89O29j365j913l47J464J822J91j655j538K96J737J520m05j648j122O82J672
$$ 889 1518 153 -1760 -2107 -643 1179 1370 -285 -1823 -1527 210 1730 1325 -323 -1445 -763 909
357I09J130p08j788q82Q80J722O30j139j857m82J289J473J58j329j694n3J541
$$ 909 2039 1331 -457 -1339 -459 1263 1893 754 -1103 -1585 -296 1177 1335 6 -1688 -1741 -200
374b00J385l01j539j285N47J716J026o92j317p80P05J612P59q07j324o72R87J663
$$ -200 1185 884 -655 -1940 -1393 323 1349 657 -660 -1440 -735 877 1636 829 -495 -1167 -180 1483
392A483L32j256j487j73J250J442l66j551r91J57J257R52l77j504p23L47J272
$$ 1483 1815 559 -928 -1101 149 1591 1225 -326 -1317 -1160 97 1049 672 -832 -1555 -1208 64
409F4J124p32j615m16Q85J508P23j238j459J10J206J249J27j228j165J75J095
$$ 64 1188 456 -1159 -1575 -690 818 1541 303 -1156 -1046 160 1409 1536 308 -857 -682 413
426D13J028O0j591j199N44J208Q36m61j685r35J171J142K62o27j405l52J086J095
$$ 413 1441 1501 -90 -1289 -745 463 1299 838 -847 -1782 -611 531 793 166 -1239 -1591 -505 590
444E90L02p53j351o4J395J086Nj082j324L81J788O62p10j055q05N19J360L16p09
$$ 590 892 139 -1212 -1276 119 1205 1210 128 -1196 -815 973 1635 925 -130 -935 -416 944 1260 551
463E51j027q17O68J496J62j061j198m47J260J590n15j437m55K28J073R41m36r58
$$ 551 -476 -1293 -625 871 1033 -28 -1226 -1673 -413 1177 662 -775 -1230 -1002 71 1012 576 -382
481c82m83J27J261J111p64j254n49O63J578M91j587j223M46P60P34k9j163p86
$$ -382 -865 -738 523 1634 870 -384 -933 -270 1308 1799 212 -1011 -565 195 929 900 -263 -1049
499a049K32N36R27P5j267q96L58J102R97m04j670l31J139R79K99o12j209K0J090
$$ -1049 -817 -281 646 721 -546 -1442 -1084 18 1015 611 -1059 -1390 -251 728 1027 415 -794 -774 316
518C16P34J51q04j121J46J065O16q4j044j032M01J173L40n22q82p20N79J070K16
$$ 316 1050 1201 397 -724 -578 487 1103 1019 -25 -1057 -656 517 857 335 -547 -1267 -688 382 598
537E98n15r46m95Q68J110J00o21j119m0J368R74n48r13l66L73P61L64l84m20m19
$$ 598 83 -863 -1358 -490 620 720 99 -1020 -1060 308 1282 734 -179 -545 -172 589 953 569 149 -270
557b70k52P66Q93l99j151r42O43J585Q7j346r64M31Q96N66l75o29k18J29M04O75
$$ -270 -522 244 1137 738 -413 -1355 -712 873 960 -386 -1350 -919 -23 543 168 -461 -679 -550 -146 529
577E29J75o88p16J33R64Q72l80j169m20O77Q78K62p00j033l0O63O49Lq02p34J17
$$ 529 704 16 -700 -567 397 1269 889 -280 -700 -23 855 1117 417 -616 -646 17 666 669 -133 -867 -750
598g50N47N53M5p37p43K52Q23N67k30p60l91L91Q37M21k93o67m27L52R57N13o59
$$ -750 -203 350 395 -342 -1085 -833 -10 557 327 -433 -824 -433 404 825 532 -135 -562 -210 747 1260 601
619F01j209j50J092Q56m42j108l64M57N03K1j79k94m33j96M10R63J07j165p96
$$ 601 -608 -758 334 1190 748 -360 -724 -267 236 257 78 -216 -649 -845 -435 528 635 -530 -1326
638a326O02J310M54q42j072J64J008N87j83o03m95J74O60L99j50n88n26K5O11
$$ -1326 -724 586 1040 198 -874 -710 298 885 702 99 -396 -222 438 837 687 99 -427 -402 209
657B09M10l9p72q12K85R39M74n36j106l40Q90J067j62q36n36J76Q81M44k07l93
$$ 209 619 580 -192 -1004 -719 220 694 158 -948 -1288 -398 669 507 -329 -865 -689 192 636 429 36
677C6n03MQ89N91l12p57l71K31P24L01l70o26n03K03R69L18p74r59j95R41R71
$$ 36 -467 -463 426 1017 705 -52 -423 -192 532 833 463 -163 -666 -463 506 824 50 -909 -1104 -163 808
698H08m45j096j86N70M96J63k07k68k24n8N35P27j03q91m37M13R62L94p58r32
$$ 808 363 -733 -919 -349 147 310 103 -165 -389 -447 88 815 712 -179 -616 -203 759 1153 395 -537
718e37J21O19M90Kp39p42J94P27L85k55q24l01M72M56J01l3n43k98K49O46M60
$$ -537 -416 203 693 695 -44 -786 -592 135 520 265 -559 -860 -388 68 169 136 -407 -705 -456 190 650
739F50k07q40l06Q18P43m1o72n69J27P50K75j53m87n55J66O13K66l47o16l05K83
$$ 650 443 -397 -703 115 858 817 145 -424 -297 453 728 575 88 -467 -301 312 578 231 -385 -690 -407
760d07N37Q2k77k86m41J99P97L73m37p68k65R08Q16j90p77l16L19N28K82k33l83
$$ -407 130 212 -65 -351 -792 -593 204 577 140 -628 -893 15 831 641 -136 -452 -133 395 677 444 61
781F1k45J0M42M29k23o90m46L06O37K07n07n08k12L08O46K12n59o32N9O65N45
$$ 61 -184 -174 268 697 474 -216 -662 -356 281 488 -19 -527 -739 -431 215 427 -132 -764 -705 -40 505
802E05j44o15k12L47L65K84o4l97l09J25M73M47j96p21m19M97N66M4m79o53k0
$$ 505 361 -254 -466 -119 246 530 466 69 -240 -115 358 805 609 -112 -531 -34 532 576 97 -556 -576
823e76M94M30o0m68n56K2O08M33j14n48l46K54O66K91k37l65l12K35O70K75l43
$$ -576 -82 348 288 -180 -736 -714 -106 327 213 -335 -681 -427 239 530 293 -72 -384 -149 521 796 453
844D53p15j78M93O28K0o17n39N2N23L20j23n89l21O5N11M39k73n85l12L50N41
$$ 453 -262 -440 53 681 701 84 -455 -403 120 440 317 -272 -593 -528 -17 422 149 -436 -748 -398 143
865A43L48l16n90j62M51O25J77l92o11nN94M11l3o16m88J98N99K58j51o36m55
$$ 143 491 175 -415 -577 -126 499 676 284 -327 -332 262 673 640 24 -464 -266 333 591 440 -196 -651
886f51K76N90J46k75n89l27M56O01R8l96n08q0N78N38rm44l88J6O54M29k02m64
$$ -651 -375 215 361 86 -503 -830 -374 227 325 -71 -579 -659 -81 457 448 4 -384 -368 286 715 513 49
908D9m20K01O35K63l66n53k06K20N73J23m70m42k32L58N71m8m89m47P6M64N48
$$ 49 -371 -170 465 728 362 -191 -397 -177 396 519 49 -393 -625 -267 304 256 -233 -680 -604 -140 408
929D08j62n80k00J54N74L65j90n18k09K41N52L11l94n27j30L94M65J09n87n21
$$ 408 246 -334 -534 -380 194 559 369 -149 -358 -117 435 746 352 -175 -305 89 554 663 76 -445
949d45Q4L86K94l0m41m35L5M62L79m6o52l10L90M67K84k15n44j90M85N32Q5l34
$$ -445 -361 25 319 289 -152 -587 -552 -90 289 243 -409 -719 -329 138 422 207 -337 -527 -42 490 575 241
971B41m65m0L85M33M5m42n19L9N20J97%m93n07P5O76K75l80m49k69L20M91J59
$$ 241 -224 -264 121 554 599 157 -362 -323 197 394 394 -99 -606 -531 145 420 40 -409 -678 -358 133 292
993B92k49m76j16L56N37J17k91m95j19O07N91j92n41k71M6M75L19j84m82m06P9
$$ 292 43 -433 -549 -193 344 461 170 -325 -444 163 754 562 21 -250 -204 271 590 406 -76 -482 -403
1014d03O19L22l53o11l33M00O59P4n52n15J46L96M73k0l76l72R4M34N55m5o35
$$ -403 216 538 185 -426 -759 -359 300 374 -178 -693 -547 -151 322 302 -74 -446 -352 82 637 592 -43
1035d3m21J77O72M71l91o64k19M14M47J54m68n72m1L30M49N8n06m45j9M34N10
$$ -43 -464 -287 385 856 465 -199 -418 -4 443 597 129 -443 -484 -154 295 353 -153 -598 -617 -183 327
1056C27J2n63m59J62P28L81l09o05k00M39N35K27m04m67j56L77N27J70n17o54
$$ 327 339 -224 -683 -521 207 588 279 -326 -526 -87 448 675 271 -196 -352 25 552 722 205 -449
1076d49o4O14M91j34o85m48K35N78K69k55n54k51K20N62L54l14o81k05N71O69
$$ -449 -513 101 592 458 -227 -675 -440 138 407 152 -402 -653 -433 129 483 169 -512 -717 -146 523
1096E23R5n30n07M5O52L72j40m65l72P8M66M30j95o08m17K30O38K37l76o49l12
$$ 523 618 88 -419 -374 278 650 510 45 -327 -249 217 647 452 -156 -573 -343 295 532 156 -493 -805
1117h05N61N77K0n07l42r1M67N06P7n42m46J18O54M10j88n73l26K34O54L34m74
$$ -805 -244 333 353 -154 -496 -587 -120 386 463 -79 -525 -407 247 657 469 -104 -430 -196 458 792 318
1138C18n36k51L43O01Q7n09n20j40M57M47J8m55m44m8N06N91j23o67l72K89O21
$$ 318 -218 -469 -126 475 562 53 -467 -607 -150 297 315 -140 -584 -632 -126 465 342 -325 -697 -408 213
1159B13L95l15o04j99M73N27J93l55n65p0L12N50P8n36n50LN62L78q5o34m47K15
$$ 213 608 293 -311 -510 -37 490 683 328 -237 -307 5 555 633 97 -453 -450 112 490 405 -229 -676 -461
1181d61N27K48j79m55m43L26P21K53l85o02j38N03N48M2l49m62o3N51M25J2n40
$$ -461 66 314 135 -320 -763 -437 284 537 152 -450 -588 -85 463 505 156 -306 -369 182 607 619 79
1202G9m61L3O15M15l01n99m15K59O74K18m82n15k24L01O93J05m95m85NN04O29
$$ 79 -382 -349 266 681 380 -219 -634 -375 299 517 35 -480 -704 -403 290 395 -100 -585 -580 -76 553
1223E53j18n01l86J06N27M72q7o45l69J73P05L97m50p01k43M17O26J09n52n88
$$ 553 435 -66 -452 -346 181 653 566 -79 -448 -275 430 827 377 -324 -567 -150 476 585 33 -555
1243e55o6N08N10k9n32n48J08O13M41j22n88l52K07O43L84k50n88l46M01P22J88
$$ -555 -621 -113 397 368 -164 -712 -604 9 450 328 -260 -612 -405 238 622 372 -216 -562 -161 561 749
1264G49n08o54m8N86N19q2o37l97P8M75M20j11o08n10J95O73M09l31p60k04L80
$$ 749 241 -413 -461 125 644 562 -75 -472 -394 81 501 390 -218 -728 -533 140 549 218 -542 -746 -366
1285c66O43K73m30n81q9N20O33P9o14m99N0O09N25j95o10m03K11M98L49k30o60
$$ -366 277 550 120 -461 -550 -30 603 682 68 -431 -381 228 753 558 -52 -455 -244 254 603 373 -287
1306b87l83L07O48K59m31p98m4N50O25l6n75m68O1O56M43m9n43n23K67O61L53
$$ -287 -670 -363 285 544 113 -685 -729 -179 446 410 -165 -633 -572 84 527 478 -65 -588 -321 340 693
1327F93k85o21k63L77O09J67l57o23k89M97N93J8n64o01J6O91M46k39n81l46J80
$$ 693 408 -213 -476 -99 510 677 320 -303 -592 -95 498 516 -48 -649 -633 58 504 265 -316 -662 -482
1348d82N55M33k49n79l19L41O68K81m36n41j23M17O61O2n14n76M8L78O56j22o94
$$ -482 73 506 257 -322 -641 -300 368 649 213 -328 -451 -34 627 689 175 -401 -353 25 681 559 -135
1369a35m62K15N67L09k38o85k25L21M91K90l68n58j35M62M53K36m14n80j4N53
$$ -135 -597 -382 185 494 256 -429 -654 -333 158 448 80 -478 -613 -151 302 538 124 -456 -470 83
1389H3M92k5n02n23J88N92L39j92n88m23L11N24K20k75o49k43M30N26J28l77o01
$$ 83 575 550 48 -475 -287 305 644 452 -136 -559 -248 276 496 221 -428 -671 -241 285 413 36 -565
1410e65j24N33N92k7n47m49K6P21M60j97n27l87K12P19K26l72n25k26L86O11J55
$$ -565 -689 -156 436 409 -138 -587 -561 160 620 423 -104 -491 -279 440 666 294 -231 -457 -71 540 695
1431F95n16n79o1L37O09Jo11m51k5N21N51j25o20m11K59N97L84l31n67k06L92
$$ 695 179 -400 -461 -124 485 486 -125 -576 -601 -80 471 346 -274 -685 -426 171 555 224 -343 -549 -157
1452a57N89J85m07n57o3M08N75R9n35n86Q5M80M46j34o30m62L04N18L16l03n99
$$ -157 432 617 210 -347 -410 -2 573 672 137 -449 -364 116 562 428 -202 -664 -360 158 474 171 -428
1473d28k84M09N73J82l61o16r4M60O07L0m34n48R5N68M89k03m72m09J62N63L42
$$ -428 -712 -303 270 452 91 -525 -619 -159 448 478 44 -504 -409 159 648 445 -27 -436 -274 289 631
1494F31k22o36k58K71N65K22m25o28q7L85N29P5n14m75KM97M91o7m98m89K40O07
$$ 631 409 -227 -485 -214 351 573 148 -480 -567 -182 347 422 -92 -567 -565 -68 423 356 -142 -631 -391 216
1516B16L89k78n74k47L75N86J59l80n00j97M42M74J05m96n75k6N72M96k63m46
$$ 216 605 327 -247 -494 -119 467 626 246 -254 -451 -9 465 570 74 -501 -527 45 541 278 -168
1536a68m70J43O18L68k98n51k77L45N57K14l05n54j10M00N57R7m18m88jM93M95
$$ -168 -638 -495 123 491 193 -358 -635 -290 267 481 176 -378 -488 -88 469 566 148 -340 -341 152 647
1557F47j31n44m30J22O09J92j39n75k96K50N07J96l29n01j23L33M89J66m65m76
$$ 647 516 -28 -458 -336 273 465 326 -249 -545 -295 212 408 79 -422 -545 -212 277 443 -22 -498
1577d98O1N18L47Nm36l92Q2N49L61j24n79k77K29N41K26l29o08o6L15L69R0m14
$$ -498 -437 81 428 433 -3 -395 -313 236 597 473 -106 -383 -154 387 613 284 -324 -390 -75 294 384 -30
1599c0l85j13M61L27O6m47m62P0N59L41o1m77l53K34N26K56k65m73j14K03N62
$$ -30 -415 -528 -67 260 326 -121 -583 -513 46 387 326 -151 -504 -270 256 512 247 -226 -340 -137 425
1620D25O9l01l80j15L69M42r6m28m28L6M49L83j42m83l35J79L94L15k33m67j58
$$ 425 494 193 -187 -302 67 509 413 -15 -443 -407 42 425 283 -200 -535 -356 38 353 120 -347 -505
1641e05K29N65J49k73n15o4L82M74M4l67m14N2L87L35j13l65l44M8M59K55j60
$$ -505 -276 289 438 165 -350 -414 -32 442 486 119 -295 -243 144 479 366 1 -343 -295 164 419 259
1662B59n30k10K18M57J82l49m23j20L84L91R7m03l90L5M23M28j03l69k89J39L86
$$ 259 -271 -481 -263 194 376 27 -396 -516 -132 259 356 -47 -437 -402 21 449 346 -23 -312 -173 213
1683B13K67j03m56k54K19L83K43l25n15q8L53L50J8l64m11R1K78L83j3m46k40
$$ 213 480 377 -79 -333 -114 269 512 187 -328 -416 -63 287 305 -59 -470 -379 -101 282 269 -177 -417
1704d17%M63L27j36m12k77K52M67J94k38l84j75K92L92J46l58m07qL53K77Mm46
$$ -417 -417 46 373 237 -175 -452 -200 267 461 223 -161 -336 -44 348 494 136 -271 -279 74 351 355 -91
1726i1l29J21L42K91j03m60k30J44M97J18k10l94j89M02M42J9l09l90K2L91L21
$$ -91 -420 -299 43 334 231 -229 -459 -315 182 300 90 -304 -493 -91 351 370 61 -329 -307 84 405
1747D05Ol11l71Q9L59K71j14l93l16J38M04J67k16l51j33J03M68J18l35l86KK99
$$ 405 411 100 -271 -182 177 448 334 -59 -375 -237 167 334 118 -233 -366 -263 205 323 -12 -398 -396 -97
1769i7L22J3l55j86J04K89K91r8l95j29J44L33K19j62m06j81K05L39J43l37l17
$$ -97 225 238 -117 -303 -199 90 381 283 -112 -241 -97 236 455 293 -113 -294 -89 250 393 56 -261
1790b61K2K20K11K0k91k65L5K96K32o4l11k03J19K71K45j23k84j68K65K82J51
$$ -261 -239 -19 192 212 -79 -344 -309 -13 219 155 -156 -359 -240 31 276 153 -131 -299 -34 248 399
1811C99k15k78j46K96K93l6k39k78L7K17K27p9k70k92J34K83J55j45k60j99J48
$$ 399 184 -94 -240 56 349 313 74 -204 -167 50 277 198 -72 -364 -230 53 208 63 -197 -396 -248
1832b48L46J55k51k37o5J74L28N9k56j73n9K95L08l7l07k14L9K96J66j35k75j75
$$ -248 98 253 2 -235 -300 -126 202 261 5 -168 -227 68 376 339 32 -182 -143 153 319 184 -91 -266
1854b66J23K08J74k11k24j50J00L65J72k80l48K5K71K26R5l12k21N7K83K24n5
$$ -266 -143 65 239 28 -196 -346 -246 119 291 11 -337 -312 -41 185 280 -32 -253 -196 87 311 256
1875B56k43k00J45J95J97j24l26j57J67K72N1j28l26r6J91K81K2k29k70L8L00
$$ 256 13 -187 -42 153 350 226 -100 -257 -90 182 233 105 -221 -317 -126 155 177 -52 -322 -284 16
1896A6J37l6k10j89P3K92J61j51k19j06J41K77J65k27k12j07K13K67Rk35k59n0
$$ 16 153 117 -93 -282 -209 83 244 93 -126 -232 -91 186 351 124 -88 -195 18 285 294 59 -200 -250
1918b50K23K65Jl42j74nL15J45q8k89j05J18K31J65j00k91j13K17L16K0j88k45
$$ -250 -27 238 239 -103 -277 -282 33 178 90 -199 -304 -186 45 210 110 -181 -294 -77 239 259 71 -174
1940a74L4K43J97l0k41j98J08J82J31o4k53j93J11K28O0j16k13j02J54K21J01
$$ -174 -140 103 300 270 29 -169 -61 121 252 188 -65 -258 -147 81 141 25 -188 -290 -136 85 186
1961A86j62k84L1J60K55k9j85j85J20K21J13m3k09j58J28J91J32j30j99j39J06
$$ 186 24 -260 -229 -69 186 157 -28 -213 -93 128 241 198 -11 -169 -41 150 282 152 -47 -186 -80
1982h0K73N9k32k13m8J92J58m1j04k06N0J29J86O6l40q9R3J90K08j50j90o0J39
$$ -80 193 252 20 -193 -241 -49 109 68 -36 -242 -192 -63 123 189 -151 -240 -147 43 251 101 -89 -149 -10
2005a0J25J28o5k02j00Q6K34M0j98j84PJ47J45n5j72j57J7J71J16Kj78j92J59
$$ -10 115 243 178 -24 -124 -38 196 236 38 -146 -139 8 153 98 -74 -231 -214 -43 73 75 -103 -295 -136
2028a36K08R8m7k48o2J54J81M8q6j33j36J75K12k3j99o1oJ24J26m4j66j56N3J88
$$ -136 72 170 123 -125 -187 -33 148 196 110 -23 -159 16 228 205 6 -55 -61 63 189 145 -21 -177 -124 64
2052F4O5p3k41o5O3K62P7j19j84o0J39K46Kk21r9J1J92J86p8j81r1P3J34P0N9
$$ 64 129 56 -185 -250 -187 75 152 33 -151 -211 -72 174 176 -45 -144 -133 59 245 167 -14 -105 -32 102 172 231
2077B31k84j35J31Q7J30j10j59q0J28J48pj42j57K7J03K03J7j44k14P6K18J20
$$ 231 -53 -188 -57 30 160 50 -109 -189 -61 87 80 -62 -219 -192 -89 114 131 -13 -227 -151 67 187
2099A87o9j12j54J31J56J16r1j94j8j3J98N1j09k11o4J82R0K4j22j44JJ26J59
$$ 187 118 6 -148 -17 139 255 164 -30 -48 -61 137 188 79 -132 -196 -14 76 100 -22 -166 -165 -39 120
2122A20n7j48j47P2J96J40r5j26j07J51K37l2j08j24m7Q2J84M7j30k52J2K17R5
$$ 120 63 -85 -232 -160 36 176 81 -45 -152 -1 236 204 96 -28 -75 7 191 238 108 -144 -132 85 180
2145A80q2j33j51N7J93Lk8j67j12Q8J64J30j01j80m5J43K25n9l4k11J7J31J51
$$ 180 98 -35 -186 -129 64 67 39 -128 -240 -152 12 142 41 -139 -184 -41 184 125 91 -120 -103 28 179
2168A79J7j49j18O6O6Q5j0j54n5J4J61K9j08j24j71J67J53L2j31j21nJ80N9qp1
$$ 179 196 47 -71 -5 61 146 136 -18 -73 -59 102 131 23 -101 -272 -105 48 80 -51 -172 -177 3 62 54 -17
2193a7j01O2N2J66k8j38o8Q5J29P4q3j53j03R8J15R9j73j04q8J27R3L4j61j06
$$ -17 -118 -56 -4 162 134 -4 -72 13 142 216 133 -20 -123 -25 90 189 16 -88 -176 -49 44 78 -83 -189
2217a89M1L9J37L1j09j00O2P2J96k3j55j29J07J34Q7q6j94l7J18R9J12j33j44
$$ -189 -148 -109 28 59 -50 -150 -88 -16 180 157 2 -127 -20 114 201 115 -79 -116 2 101 213 80 -64
2240f4k1R4N6J6j39p6pJ40N5l2r1j56J16J66L0r5o3m1L0J74J74j69j47o1K00Q9
$$ -64 -85 9 65 81 -58 -134 -141 -1 54 22 -69 -225 -109 57 87 -8 -71 -112 -82 92 266 97 -50 -111 89 178
2266A78Or7m9n1R1P6l1j43j14J9Q4J75j17j86j0N1P9J23r3j60k8J13J21Q7j04
$$ 178 184 87 38 -13 78 154 123 -20 -134 -115 -31 144 27 -159 -169 -118 -39 84 -9 -169 -197 -84 37 124 20
2291B0j35K3R4J61m3j10q8J00R6L9j1j46q7M0J02J13p0k13k3N1J39l1n4j01J0
$$ 20 -115 -92 2 163 120 10 -78 22 118 157 146 0 -87 -47 55 168 98 -115 -138 -87 52 21 -33 -134 -124
2316a24O0J18j9k7j50L3Q9J27j6j17n0N6J10O8k8j39o9P6J69Mq4j79o2J62J13
$$ -124 -64 54 35 8 -142 -109 -20 107 91 -26 -76 -20 90 158 130 -9 -78 -2 167 171 87 -92 -154 8 121
2341A21l6o2j76K6R8O8l3m7j72J15P1J25m5j07p0Q5N6J87j19j53K5L3J34N4j63
$$ 121 85 23 -153 -127 -29 39 6 -41 -213 -98 -27 98 53 -54 -124 -39 17 204 85 -68 -43 -10 124 178 15
2366A5p6K0M6R3Kj40r4M8Q8J01j34m9j11N2J18M8K5k09KJ32J36n4p9m0l3J43J06
$$ 15 -61 -41 5 98 100 -40 -134 -86 2 103 -31 -80 -191 -139 -21 27 52 -157 -155 -23 113 59 -20 -60 -93 50 156
2393A56j3o4r8j7M9O2mj03r1O3J00K9j7j51n8Q7P9P5n6j64k0J25Q9Op5j20J4J13
$$ 156 143 79 -19 -36 13 75 71 -32 -123 -60 40 69 52 -99 -157 -70 9 84 28 -136 -156 -31 58 64 -11 -131 -117 -4
2421dJ31o0o9l3KJ02R2K0j37m3o0J44M7p6q3p1N7J24Lj24o9m6J09J12Qj67r1N1
$$ -4 127 67 -2 -35 -33 69 161 181 44 1 -59 85 132 56 -27 -98 -41 83 86 -38 -107 -153 -44 68 76 -91 -182 -131
2449a31J47K7M4r6m4j5J21J09p4j27m6P7J51op4j15o2O0J29kj10j17L9J01L6O1
$$ -131 16 43 87 -9 -53 -68 53 162 88 -39 -85 -8 143 137 63 -52 -114 -54 75 73 -37 -154 -115 -14 22 83
2475H3r5j45N9J50J2O3j96n0N2J08J11q0j16m7J01J71q5n6j17J0R6Q5N2j85j05
$$ 83 -12 -157 -98 52 64 127 -69 -119 -67 41 152 72 -44 -91 10 181 96 40 -77 -67 29 114 166 -19 -124
2500a24P5L0J06L6k07j48J36R8P5m0j14q1Q2J35O4j19j26j2J59Q2M9j57q1K4J19
$$ -124 -49 -19 87 123 -84 -232 -96 2 77 37 -77 -158 -76 59 123 4 -122 -134 25 107 156 -1 -82 -58 61
2525F1J07l6q8r6j9J18Q2n6j38j10Q9J27N6r1j02m3N5J07M3j22j05J8J89Q5kj87
$$ 61 168 132 44 -52 -71 47 129 73 -65 -175 -86 41 97 6 -96 -139 -84 23 66 -56 -161 -143 46 131 129 -58
2551e8n9L0J88M0j7j14n3j1J44J29j30j43o1J16Q2O3j75j44P7K2J47n4j32j5J2
$$ -58 -117 -87 101 141 124 10 -43 -54 90 219 89 -54 -115 1 83 146 -29 -173 -96 -74 73 19 -113 -128 -116
2576a16J21R6j02j19rJ1K00M2l5j07l4O1J30n0p1j00pJ39N5J9j36j40K2J32J14
$$ -116 5 101 -1 -120 -129 -118 82 124 89 -18 -52 9 139 89 18 -82 -89 50 105 124 -12 -152 -130 2 116
2601A16j3j53p6k1J86M6q4j28j5P2J41M8j21q5K2R1O3L1q7j24k6J09J31m9p5j07
$$ 116 103 -50 -126 -147 39 85 1 -127 -142 -70 71 119 -2 -87 -65 26 89 120 33 -91 -117 -8 123 74 -1 -108
2627a08M1Q1Q0j5j75k7K6J40j2l6j40k3Q5J18M9p7j17m6J24J27k5j11k9j1J06
$$ -108 -67 14 94 79 -96 -123 -97 43 31 -5 -145 -168 -83 35 84 7 -110 -156 -32 95 70 -41 -70 -81 25
2652B5J71r1j17n6N4J27L4q2j60p6J03J88k0r0j23n4Q8J53m5q7j19k0K11J07q6
$$ 25 196 105 -12 -68 -14 113 147 65 -95 -171 -68 120 100 10 -113 -167 -79 74 29 -58 -177 -197 14 121 35
2677C5r3n7RJ90J20j23j25k0N7R2M0q9j24RJ39N5k2j16j27N5J30P4j02n1j53P0
$$ 35 -58 -115 -106 84 204 81 -44 -64 -7 85 125 36 -88 -79 60 115 93 -23 -150 -95 35 109 7 -44 -197 -127
2703a27J94K5n7j15p1N9J85N0j00j98J2J73O6O7j68m7l6J04J21j9j66q3O8J76
$$ -127 67 92 35 -80 -151 -92 93 143 43 -155 -143 30 96 163 -5 -52 -88 16 137 118 -48 -131 -63 113
2727A13L3j22j35k1P9P7Q2j33r8NP1J13J3j01j34N4J25R9m2j45o0Q2R9R3p7j06
$$ 113 146 24 -111 -132 -53 24 106 -27 -125 -120 -49 64 77 -24 -158 -104 21 120 78 -67 -127 -45 54 147 70 -36
2753c6n3N5J37P1j42j28o1J04J27o1q9p6N3J03J36o0j92J1K2J15Q7r5n6q9J26
$$ -36 -89 -34 103 174 32 -96 -157 -53 74 13 -76 -152 -99 4 140 80 -112 -101 -79 36 123 28 -28 -117 9
2778IJ00L3q7r9o0J18J67l6j71m0n0J22J21o9j44q9K9J68Q2q8j24n1J17R5M7q9
$$ 9 109 142 55 -44 -104 14 181 145 -26 -66 -116 6 127 58 -86 -175 -146 22 104 16 -108 -159 -42 53 100 11
2804A1j18lJ08J28k0q8j02MJ21R8j4q3j26P8O5N1J8k04k3K8J45P4j47j18QN1K03
$$ 11 -107 -110 -2 126 106 18 -84 -80 41 139 125 42 -84 -6 59 110 128 -76 -99 -71 74 148 1 -117 -109 -58 145
2831A45o5p9j30oJ30J53l9j28j16M5J65k0K8j22l8O2J10R2j23r8p3R8J32j3q8
$$ 145 80 1 -129 -135 -5 148 109 -19 -135 -90 75 55 83 -39 -77 -15 95 187 64 -34 -107 -9 123 110 22
2856B2j22l3J70M7L7k04o9M2J58L0n7p4n4J7J11J29p2j76j0J14Q9O4j16r5n1J41
$$ 22 -100 -133 37 84 121 -83 -152 -110 48 78 21 -53 -107 -90 21 150 78 -98 -108 6 95 159 43 -52 -103 38
2882C8O2M0j51j39P7J31J06j07j47n9O1J41N0q5j23n0R6J60K9j75Lo5R4J89l8
$$ 38 100 140 -11 -150 -73 58 164 57 -90 -149 -88 53 103 18 -105 -155 -59 101 130 -45 -42 -107 -13 176 138
2907A38j29j13K0J82P2j26n3p4M2J68%j15n9l6L6J22K3n3j34l4O6J34J0j40j04
$$ 138 9 -104 -84 98 170 44 -9 -83 -41 127 127 12 -47 -83 -47 75 98 45 -89 -123 -57 77 87 -53 -157
2932a57M1J02J44m9j57n9N2J65N8j07j03K1N5J12O4j74o8M0K4O5Np2j69L5R9J56
$$ -157 -116 -14 130 81 -76 -135 -83 82 140 33 -70 -49 6 118 182 8 -60 -20 4 69 74 2 -167 -132 -33 123
2958A23m3j62j2m2J15R8l7j38j6K6K05nq5r8n9J44J18n3m7q8l5J56O8l4j19n8
$$ 123 80 -82 -94 -136 -21 77 40 -98 -114 -88 117 112 27 -71 -130 14 132 79 32 -56 -91 65 133 99 -20 -78
2984g8K1J57J6j09q1m0M8J11O9j00j59l5J38J12Pj53q5P4R4O6lq3r1R4N5O4j0
$$ -78 -57 100 116 7 -74 -114 -66 45 114 14 -145 -180 -42 70 77 -76 -161 -87 7 73 70 -13 -104 -10 45 109 99
3011I9j31o2K2J28J7n4r5m4J23M2lm6j17j0J26M6M7j35q1P2R7O8p5m5j02J02J37
$$ 99 -32 -94 -72 56 73 19 -76 -120 3 45 42 -4 -121 -131 -5 41 88 -47 -128 -56 41 109 34 -11 -113 -11 126
3038A26j2m9j38L5R2N6k6j13J8r3J21M4Oj15o4K0O1P2l4m2j57R4J53K1l2j36j5
$$ 126 114 65 -73 -38 54 110 84 -29 -11 -104 17 61 67 -48 -112 -92 -31 41 7 -35 -192 -98 55 76 44 -92 -107
3065a07J17P9Op5p5m8J77L7K0r1r0N2O1O9l3j72K4nO6O3m0p1n5N8J03k4j00l2
$$ -107 10 89 95 20 -55 -103 74 111 131 40 -50 2 63 132 99 -73 -49 -54 12 75 35 -36 -91 -33 70 46 -54 -86
3093h6lM6J29k9o3j09P0J48P4p7j04j03O7J19L5p6m9p2N2J18oq6o7Rk9J79m7m6
$$ -86 -89 -43 86 57 -6 -115 -45 103 177 100 -4 -107 -40 79 114 38 -11 -83 -31 87 81 -5 -72 -63 -92 87 40 -6
3121fm7k2Q6QP3j29k9pN9R8o5j6m4L1R6P4j34k5m9Q2L6j3o5q2M5M6J9QKj64R6
$$ -6 -53 -75 11 19 92 -37 -66 -73 -14 84 19 3 -41 -10 86 160 26 1 -48 34 70 57 -8 -90 -45 1 20 28 30 -134 -38
3152c8P2N4r6m7j07Q3J29N0j05q6J8N1O1O4j08k6m7Q6J14o5n7p6P0J6Q4n9p1o2
$$ -38 34 88 -8 -55 -162 -79 50 100 -5 -91 -73 -22 39 103 -5 -31 -78 8 122 57 0 -76 -6 10 94 35 -36 -98
3180i8K0J18L5r4o7k6P0N4Q7j26j19M3J12P0l9Or6K7J02k3J4o8K4k0J10k3j16
$$ -98 -78 40 75 -19 -86 -112 -42 12 99 -27 -146 -103 9 79 40 46 -50 -23 79 56 70 2 26 6 116 93 -23
3207b3Jq0O9J02m4k7q6O1J8O3J1r3l6j9N9Q7m9q7L3j3J03%J9q3k2M9R7K2q9n3
$$ -23 -22 -102 -33 69 25 -2 -88 -27 -9 54 65 -28 -64 -83 -24 63 14 -73 -40 -53 50 50 69 -14 -36 13 110 132 43 -10
3237a0k4R7KQo1p6k2L9J06l3q8j0M3O0N2j45j8K1L6M9%k5p9RN7P2J8p7m6P1O0
$$ -10 -34 63 65 73 12 -64 -86 -47 59 26 -62 -72 -29 31 83 -62 -80 -59 -23 26 26 1 -78 -69 -12 60 78 1 -45 26 86
3268H6n7O0j15m6K7N2Q8o0q0l8O8Q0n2Mm5l8J3O4j3Om6n8R6L1j3Mj07K8J02RO
$$ 86 29 89 -26 -72 -45 7 95 35 -45 -83 -15 65 13 17 -28 -66 -53 11 -2 4 -42 -100 -4 27 14 18 -89 -61 41 50 56
3299E6n3r7N9O8L6m5n4o4J9Q2L9o9q1nJ16K9m5k5o6Q8KL4M3j52N1J9Q0j1m4m7
$$ 56 3 -94 -35 33 69 24 -30 -94 -75 7 46 -23 -104 -109 7 36 -9 -34 -100 -12 -10 24 67 -85 -34 -15 65 54 10 -37
3329c7J2L1M6K5r4kj1L2Q3m3o7o8J3J03O2j07n4L1J7k7O8kn9m2M4N9O2j05m6N0
$$ -37 -25 6 52 77 -17 -19 -30 2 85 42 -25 -93 -80 23 85 -22 -76 -45 -28 -55 13 11 -48 -90 -46 13 75 -30 -76 -26
3359b6N4N5Qo9l3K0L5L5%p5n7J08q6Q2r4Qn0O5N4k9k8j03N1N8K0l8J5p8N7K0N1
$$ -26 28 83 91 22 -11 9 44 79 79 4 -53 55 -31 51 -43 -35 -85 -20 34 5 -23 -126 -75 -17 3 -35 -20 -98 -41 -21 30
3390C0J6n0j1j0L8l0N0p4n5O5J04K3j44J8n6M5R5n2j08PO0O0K2mo9j3K8RM1m9
$$ 30 46 -4 -15 -25 13 -17 33 -41 -96 -31 73 96 -48 -30 -86 -41 54 2 -106 -99 -39 21 43 39 -30 -43 -15 -6 35 -14
3420a4J9p9J08J2ql5j6QK0N5K1q4m6n1Q0R6o8m0k3l8O0M8l2m7n1O9O5J3J7r7J7
$$ -14 5 -74 34 46 38 3 -13 -5 15 70 91 7 -39 -90 -10 86 18 -22 -45 -83 -23 25 -7 -54 -105 -36 29 42 59 -38 -21
3451b1K5M0J1m9L8o2L9O2K4j12m0K0N8O8p9K0o7K6N0L8p7o2lN7J1J0j8n4NkN7
$$ -21 4 44 55 6 44 -18 21 83 107 -5 -45 -25 33 101 22 42 -25 1 51 89 12 -50 -53 4 15 25 7 -47 -42 -44 13
3482A3J6k6r1Q2M3J7nn0l4K7J7K3j7Nj5j5N0j0m1j4L7k1P2r0oJ1o1N3O8m6K5j13
$$ 13 29 3 -88 -6 37 54 49 -1 -35 -8 9 32 15 20 5 -10 40 30 -11 -25 12 -9 63 -27 -33 -22 -83 -30 38 -8 17 -96
3514i6N7J9j8R6o4L7n5Q3Kp3K4k9K1J5L8j4k4l0N0K4n5j7l7j5P5L5rp2k6%Q0M1
$$ -96 -39 -20 -38 58 -6 31 -24 59 61 -12 12 -17 4 19 57 43 19 -11 39 63 8 -9 -46 -61 14 49 40 -32 -58 -58 22 63
3546F3r2k0RMN0l6K1m6J1J17m3lo5J9k2Q0N0r0K2o5KM9m1O9j26O3k6K2K9m8j4
$$ 63 -29 -49 -40 -36 14 -22 -1 -47 -36 81 38 35 -30 -11 -33 47 97 7 29 -36 -34 15 -26 43 -83 -20 -46 -24 5 -43 -57
3577e7K9O9k2K1l1kJ1j4K4O1n9m8L1J3K8n3l3jL1N6m7Qm0K9m9L3l8RM3l8J2M4
$$ -57 -28 41 19 40 9 7 18 4 28 89 30 -18 13 26 54 1 -32 -33 -2 54 7 15 -25 4 -45 -12 -50 -41 2 -36 -24 20
3609B0k5MJ6k1JM3n0NoR6m7j9M7o3MJ6j1O2j2q0k9pQ7K9o2j9QJ1l9O2p0k4O3L7
$$ 20 -5 -1 15 -6 -5 38 -12 -7 -13 83 36 17 64 1 5 21 10 72 60 -20 -49 -56 31 60 -2 -21 -13 -2 -41 21 -49 -73 -10 27
3643B7njk2j4J5j3P1m9k8N8j7J6LJm5k5N1rM5oo5kJ8%L3p5mj5P7k3K3q8mM0J4
$$ 27 22 21 -1 -15 0 -13 58 9 -19 39 22 38 41 42 -3 -28 23 14 59 53 -12 -14 4 4 37 -38 -42 -57 20 -3 20 -68 -72 -32 -18
3678a8P9p5k0K1N3N7o5M4q6j2O1L1m3o6O8m6N0m5pM8o0J0lK7qm9l7R9L9om9Ml7
$$ -18 61 -14 -34 -13 40 97 32 76 -10 -22 39 70 27 -39 29 -17 33 -12 -19 29 -31 -21 -24 3 -5 -54 -91 8 47 41 -8 -4 -41
3711d1J2M0L0j8n0J3K5N2q0k1O9k3L1jn6LJ4J7K3m1k0j7NM0L9l3o7J6M0L4q3O1
$$ -41 -29 11 41 23 -27 -14 11 63 -17 -38 31 8 39 38 -18 -15 -1 16 39 -2 -22 -39 -34 6 45 12 -55 -39 1 35 -48 13
3743A3j3o0J0J05l7j9j3nP2pj9K3o0K0J8lj8Kpk0JL7j0k8K5n5L8l6R0n3m8P3M
$$ 13 0 -60 -50 55 18 -1 -14 -19 53 46 27 50 -10 10 28 25 7 9 2 -18 -17 20 10 -18 7 -48 -10 -46 44 -9 -57 16 20
3776B0o5L9n1R6m8J03n6%nl6LM1j5k4L0n1K7K3k1m4L8k6L5J8L6q8J1o3Q7n1j0
$$ 20 -45 -6 -57 39 -9 94 38 38 33 -3 0 41 26 2 32 -19 8 31 10 -34 4 -22 13 31 67 -21 -10 -73 14 -37 -47
3807d7j4L2%M0mjj7m0M1M4lo5O5m5N7n6N1n9l8O0J8J9m2n4K8M6J8k7k0j0J1N5
$$ -47 -61 -29 -29 11 7 6 -11 -51 -10 34 31 -34 31 -14 43 -13 38 -21 -59 1 19 38 -4 -58 -30 16 34 7 -13 -23 -12 43
3839D3K1o8j1QLK2L0j0kp8K2Q4J1o4p1j0O5j9J0Oo1K7J2O3n2J4l2M6k9OK0K5l3
$$ 43 64 -4 -15 -7 -4 18 48 38 36 -42 -20 64 75 11 -60 -70 -5 -24 -14 -8 -69 -42 -30 33 -19 -5 -37 9 -20 -14 6 31 -2
3872bl6Q0n4M8p5K7N4l3olJj7j8N5M2p5k6oP7n7O2m5Jp5O1J9J3n5J0K5m2O7m1
$$ -2 -38 42 -12 36 -39 -12 42 9 3 0 1 -16 -34 21 63 -12 -38 -44 33 -24 38 -7 -6 -81 -20 -1 12 -43 -33 -8 -50 17 -24
3905b4N4j06P5L4J3k5m8L1LP2j07QJ2r0J21m3J16r5p9L3N1M7r0L9n6L9mL9J1m1
$$ -24 30 -76 -1 33 46 21 -27 4 7 79 -28 -20 -8 -98 23 -20 96 1 -78 -45 6 53 -37 2 -54 -15 -19 20 31 -10
3935a0J0j9O0j4k5mm4J22j0o3k2l5N3J0K3k2Kk8oR3J8j26RL3J6m5N8n7J4N4n0
$$ -10 0 -19 41 27 2 -2 -46 76 66 3 -19 -54 -1 9 32 10 12 -16 -22 71 89 -37 -28 5 21 -24 34 -23 -9 45 -5
3966eRk8JPLN5k5J7p7Q7n8O2m8J0Mm6J2K9L0o6O0l4L1p7K6qQJ7%K9k9qKj5K3M6
$$ -5 4 -24 -23 -16 -13 42 17 34 -43 44 -14 48 0 10 14 -32 -20 9 39 -27 33 -1 30 -47 -21 -29 -21 -4 -4 25 -4 -12 -10 -25 -2 44
4002D4L1j16L9N3l1M3q4K6LRRL3r2k1O9pl8O0m9n6M6j1k3O8m3n8J11Rk7K1q9N8
$$ 44 75 -41 -2 51 20 63 -21 5 8 17 26 59 -33 -54 15 8 -30 30 -19 -75 -29 -40 -63 5 -38 -96 15 24 -3 18 -71 -13
4034a3k3N8Pk0J3q3O3O5m2Om2K7L9oQr4M2J6j1j4Nk3n0Q3k2M9q4K0pK0P9j18K4
$$ -13 -36 22 29 9 22 -61 2 67 25 31 -11 16 55 49 57 -37 5 21 10 -4 1 -22 -72 11 -11 38 -46 -26 -33 -13 66 -52 -28
4067b8O1J1p8NJ8J1J0n3Q4m6NJ5q6Q4M4Op1k2L1M1l8O5j06j8J18r3P8k3j2m6K2
$$ -28 33 44 -34 -29 -11 0 10 -43 41 -5 0 15 -71 13 57 63 -8 -30 1 42 4 69 -37 -55 63 -30 48 25 13 -33 -11
4098a1%NK2%o7M2M5j0l6l1L3K9j5M9m9j6K5o2N3M8q7qK7K0jL3m0l5L0jK9Rq4M8
$$ -11 -11 -6 16 16 -51 -9 36 26 -10 -41 -8 21 6 55 6 -10 15 -47 6 54 -33 -41 -14 6 5 38 -2 -37 -7 -8 21 30 -54 -6
4132fJ0M2L8j07k0M6O2k9l8k3J1j3K4P3m6m4L5n2J5O3K3o1l6QK7k4L7r2J8%O4
$$ -6 4 46 84 -23 -43 3 65 36 -2 -25 -14 -27 -3 70 24 -20 15 -37 -22 41 64 3 -33 -25 2 -22 15 -77 -59 -59 5
4163E%L3p1j2M0LNnl0L1O0n8k0JK2k1O1j3m3oJ4J0M8m3m8j7K2K5j1m8K4L4j0P5
$$ 5 5 38 -33 -45 -5 -2 3 -2 -32 -1 59 1 -19 -18 4 -17 44 31 -12 -18 -4 6 54 11 -37 -54 -32 -7 -18 -66 -42 -8 -18 57
4197E7l0ml3j3mN4l9M6o6O5k7O6p3j0K0k6P0Ln4L1m3J4j4JK8o0J8L3J9m3O8k8
$$ 57 27 23 -10 -23 -27 27 -12 34 -32 33 6 72 -1 -11 9 -17 53 56 2 33 -10 4 -10 -9 19 -41 -23 10 29 -14 54 26
4229B6p0N5K0rj4J7l2J7L9j05kP8k1J4NJ2l2qj3O5n4M8p5K9Kk0K5j9jRM1nk9j5
$$ 26 -44 11 31 22 8 25 -7 10 49 -56 -58 20 -1 13 18 30 -2 -10 -23 42 -12 36 -39 -10 -8 -28 -3 -22 -23 -14 27 22 -7 -22
4263b2j3K9M7j3j4j3l1Q0m6Mj1l2J9m6M6lM4p5J4M4K8mo5j9N3j6pL7l5l3O9N2
$$ -22 -35 -6 41 28 14 1 -30 50 4 8 -3 -35 -16 -62 -16 -19 25 -50 -36 8 36 32 -33 -52 1 -15 -22 15 -20 -53 16 68
4295F8l1j0m7k4P0Ml3L4q1K8N9J5Jo3j5J9qN8n4l1%L6l3M4m3PJ4lN1p0P9Pp8L4
$$ 68 37 27 -20 -44 26 30 -3 31 -50 -22 37 52 53 -10 -25 -6 -14 44 -10 -41 -41 -5 -38 6 -37 -30 -16 -19 32 -38 41 48 -30 4
4329DK6l3M0p2L6L2n6PJ0l4K7k5R5m3l6QJ4J4P6q6o9J00o4M2O1q2n0P9Pm1K5O
$$ 4 30 -3 37 -35 1 33 -23 -16 -6 -40 -13 -38 57 14 -22 -14 0 14 90 4 -65 35 -29 13 74 -8 -58 21 28 -13 12 18
4361A8k2K4L1l1K0o5%N2N3q2j6nNL9m6M0m1K6rN3k7lJ9o5K1J3krn9M3L4L8k4J2
$$ 18 -4 20 51 20 40 -25 -25 27 80 -2 -18 -23 -18 21 -25 15 -26 0 -9 44 17 14 33 -32 -11 2 0 -9 -68 -25 9 47 23 35
4395C5l3j4K1pP0r8jj6L1L0l0m7RRP8m2P3r7j0k1M4J7p3O2M2nqJ6r0M7mL1qM9
$$ 35 2 -12 9 2 72 -26 -27 -43 -12 18 -12 -59 -50 -41 37 -5 68 -29 -39 -60 -16 1 -72 -10 32 27 19 35 -55 -8 -12 19 11 60
4429F0n2o4K9O2J1k4j8j5L4K6M0j15O0q6L5L8k2op2N1Q3L7o3k7m%N4k2k6n9PK5
$$ 60 8 -56 -27 35 46 22 4 -11 23 49 89 -26 34 -52 -17 21 -1 -7 -79 -28 55 92 29 2 -2 -2 52 30 4 -55 -48 -23
4461b3P5no3K8N%M1k3nm1j6J3L4oM5p8K7J2Rl4Ok3L3k0m1M5J2j6m1O7QK2j6j3
$$ -23 52 47 -16 12 17 17 58 35 30 -11 -27 -14 20 14 59 -19 8 20 29 -5 1 -22 11 -9 -50 -5 7 -9 -50 17 25 47 31 18
4495A8j3L0l1k1L2l2j2O6J8l5j5MmL0j1k1l2M7j1jM1j11P2j9Q4pm9Jk0K0M8l9
$$ 18 5 35 4 -17 15 -17 -29 37 55 20 5 9 5 35 24 3 -29 18 7 6 47 -64 8 -11 73 66 17 18 -2 18 66 27
4527B7j7k7k9R4m3K3oq0L2J11r0Lj9L7roJ2n2M1l4QN5mn8l9L2M5K2J5n6l3K8L8
$$ 27 10 -17 -46 48 5 28 22 -58 -26 85 -5 -2 -21 16 7 1 13 -39 2 -32 -24 31 27 -31 -70 -38 7 29 44 -12 -45 -17 21
4560B1m0pJ6m6N4L0Pk6l5N4j4L2o5j7M3J9J7n3m9Q4m4J7j3M0m8L5j18R8J8n1N5
$$ 21 -19 -26 -10 -56 -2 28 35 9 -26 28 14 46 -19 -36 7 26 43 -10 -59 25 -19 -2 -15 25 -23 12 -106 -8 10 -41 14
4591A4o8J9R8l2J8j0o1rL1L0n3QJ1l6L8K5Rn8j7M0J3j8l0Pj6M1pK9Lp6L9mR7p8
$$ 14 -54 -35 63 31 49 39 -22 -31 0 30 -23 -15 -4 -40 -2 23 32 -26 -43 -3 10 -8 -38 -31 -47 -6 -13 16 19 -57 -18 -22 75 -3
4625cj3M3j9L2j1l2j4J5J9k5jqL4n8J09lo3J8p1L7QK8k8l3P2k6J2K8l5l3M1K3
$$ -3 -16 27 8 40 29 -3 -17 -2 17 -8 -9 -17 17 -41 68 65 2 20 -51 -14 -6 22 -6 -39 33 7 19 47 12 -21 20 43
4657D3l0K1j1k5m8P3ol7NL7l5J7K3m2qJPM0l0L2m2k4R6n2M6k2k8k3J8L4K1l0l7
$$ 43 13 34 23 -2 -50 23 17 -20 -15 22 -13 4 27 -15 -23 -22 -15 25 -5 27 -15 -39 57 5 51 29 1 -22 -4 30 51 21 -16
4690a6L1J1N0m6l2mj1J7k8RM0o5L7J7L7o7m2L7M3jN7n6m7L2p1J05k8m5L9l%K3
$$ -16 15 26 76 30 -2 -6 -17 0 -28 -19 21 -44 -7 10 47 -20 -62 -25 18 17 74 18 -29 3 -68 37 9 -36 3 0 0 23
4722B3j8qL4Njl3N3n0lrL5O3n1m1L6pl5P3j08K4rOJ7kOJK0nL2m6QMk4L5K0k3L3
$$ 23 5 -3 31 36 35 2 55 5 2 -7 28 91 40 -1 35 28 -7 66 -42 -18 -27 -21 -4 -6 0 1 21 16 48 2 10 14 -10 25 45 22 55
4759E5m7N7j1l3Mk9L5Nj3qM8o4K1J5Rl0mJ3nJ6nm3kJ4K0NK3k8Rk7K4k1K6n8M2
$$ 55 8 65 54 21 25 -4 31 36 23 15 63 -1 20 35 44 14 10 23 18 34 29 -14 -16 -2 18 23 46 18 27 0 24 3 29 -29 13
4794A3oqqm0O0p2P3l2N7l7nj5JJ6j1ok9J01j6J2n2k9JO6m6%M5n9m4P1k1N3n4j7
$$ 13 7 -1 -9 -49 11 -61 12 -20 37 0 -5 -20 -19 -3 -14 -20 -49 52 36 48 -4 -33 -32 34 -12 -12 33 -26 -70 1 -20 33 -21 -38
4828c8oM3O8j12M8K8q7P8o1K3k3oK7O7q0N2r1Q8k8K3j4Rm4O3l7NJ0l8JM0nN1j8
$$ -38 -44 -1 67 -45 3 31 -56 22 -39 -16 -39 -45 -18 49 -31 21 -70 18 -10 13 -1 8 -36 27 -10 -5 5 -33 -32 8 3 54 36
4861C6n9K3lqK1J9m2K4J7J1j4k5j8M5O0q7J9j0k1Nk3J9K4l4k4M2L9m2K5m9K4j2
$$ 36 -23 0 -3 -11 10 29 -13 11 28 39 25 0 -18 27 87 0 19 9 -12 -7 -30 -11 13 -21 -45 -3 36 -6 19 -30 -6 -18
4893a8L2L2n6L7l2L5k9O7l8lk7k2K7L7j1m8klK5L9p8j7O0J1k0L1m8N3m3K4J1n
$$ -18 14 46 -10 27 -5 30 1 68 30 27 0 -22 5 42 31 -17 -19 -22 3 42 -36 -53 7 18 -2 29 -19 34 -9 15 26 21
4925B1n8J2K6L4m4J6m8LO7l4O0l4m6P7l2m6L6j0J9k4J8M2l2l7J5M0k9K7j8j4J
$$ 21 -37 -25 1 35 -9 7 -41 -38 29 -5 55 21 -25 52 20 -26 10 0 19 -5 13 55 23 -14 1 41 12 39 21 7 8
4956HKl8J1oK5lJ0Rm7J4j4J1M1Rm5k1O9p6J02j6o2K8k4P6pp1L0m4QJ2K5J6k5J4
$$ 8 10 -28 -17 -23 2 -1 9 18 -29 -15 -29 -18 23 32 -13 -34 35 -41 61 45 -17 11 -13 63 56 -15 15 -29 -21 -9 16 32 7 21
4990B1k1J1l7j4K7j7oQ9p5K4Qj4J1jj1jqk6Q2n2QOJ5J1j2j6Ok8rk8J9O0j5l2L0
$$ 21 0 11 -26 -40 -13 -30 -36 53 -22 2 10 -4 7 6 -5 -6 -14 -40 42 -10 -2 4 19 30 18 2 8 -20 -29 -57 -38 22 7 -25 5
5025EJ7o8Q9m2K4J4Rj10R2n1j6L5l1OJ2P2j1k3rk7M1m2K4j1l8L3nj4k0M1j7m1
$$ 5 22 -46 43 1 25 39 48 -62 30 -21 -37 -2 -33 -27 -15 57 46 23 14 -13 28 -14 10 -1 -39 -6 -11 -25 -45 -4 -21 -62
5057f2R4pl8m6P4L0j3l0K6L3l6Nk0k5L2K8l2o5P8m3l3N3k6M4J4l7mj9L6Kj1K3
$$ -62 32 25 -13 -59 15 45 32 2 28 61 25 30 10 -15 17 45 13 -52 26 -17 -50 3 -23 21 35 -2 -6 -25 11 13 2 25
5089B5l5M5j9Mkn4O5k8J6l1k0K2%J6kLk9J3J7k0J2J4K0l3K5J3k2j8K4J0l0J4l7
$$ 25 -10 35 16 20 18 -36 29 1 17 -14 -34 -12 -12 4 2 5 -24 -11 6 -14 -2 12 32 -1 24 37 15 -3 21 31 1 15 -22
5122b2j7M8Ml8M6l7N7n0N7Jm0J7k8K2mL0l3Om3N8m5J2j6K8Kk8K8j%k0jL0N6q9
$$ -22 -39 9 13 -25 21 -16 41 -9 48 49 9 26 -2 20 16 46 13 19 -24 34 -11 1 -15 13 15 -13 15 14 14 -6 -7 23 79 -10
5156a0L1k0KK7l3k7L8O0j11M1Q4p6mk5P4p8K1qLL9k2MJ1mLK5m6l4L0Mk8R1jr3
$$ -10 21 1 3 30 -3 -30 8 68 -43 -2 82 6 2 -23 51 -27 -6 -14 -11 28 6 10 21 17 20 45 -1 -35 -5 -1 -29 62 61 -32
5190c2L8j9N2n8P4n4j3JL8L5mn6k4K5J7Nk5nL5n0K1RMk6k7K3j1Mj2L3L1n1K7j7
$$ -32 6 -13 39 -19 55 1 -12 -11 27 62 58 2 -22 3 20 25 0 -5 30 -20 1 10 14 -12 -39 -16 -27 -23 -35 -2 29 -22 5 -12
5224a2O0k1l3K5K8p6l0N0oL2o4L7L9m3L0Lj4j9K8m2N0j4J2L7m5l5N0K1k5m0L9
$$ -12 48 27 -6 19 47 -29 -59 -9 -15 17 -47 -10 29 -14 16 19 5 -14 14 -28 22 8 20 57 12 -23 27 48 23 -17 22
5255B2PMm1Km2Q5l1K4j5q3J35m1%k3l1J4O5o6pL2M7m5mK2qJ9k5K1k3l4N5%qr2
$$ 22 29 33 -8 -6 -48 37 6 30 15 -68 67 26 26 3 -28 -14 51 -15 -22 10 57 12 8 30 22 41 16 37 14 -20 35 35 27 -65
5289f5J10l4O0p3Ro5P4L4p2M5Nk9j1%M5o4%L3l6RM0J1m2J4Kj9J6L9n1NK6K9k6
$$ -65 45 11 71 -2 7 -58 16 50 -22 23 28 -1 -12 -12 33 -31 -31 2 -34 -25 15 26 -16 -2 0 -19 -3 36 -15 -10 16 45 19
5322A9L4l1n6Q8n6M1j1m4J9k3l0Q4m2OJ0j5K9no3M0l7M5Pk3J0k0O8n6L5l4mJ3
$$ 19 53 22 -34 54 -2 39 28 -16 3 -20 -50 34 -8 -2 8 -7 22 17 -46 -6 -43 2 9 -14 -4 -24 44 -12 23 -11 -15 -2
5354bnQn4P6l9nL1K3o5M6K7l4N1j3m8KLJ3L4n5J9r2O2l1J03l6K1l7l1K0J5l4O
$$ -2 -7 1 -53 23 -16 -21 10 33 -32 14 41 7 58 45 -3 -1 2 15 49 -6 13 -79 -17 -48 55 19 40 3 -28 -8 7 -27 -21
5387b1M1j2k4M2m9N8k2l8j3RN4l3J9k5L9l6M5j6kqPK9k7l8L7l9K4Kl2L9o5K0M6
$$ -21 20 8 -16 26 -23 35 13 -25 -38 -29 25 -8 11 -14 25 -11 34 18 16 8 15 44 17 -21 16 -23 1 3 -29 10 -55 -35 11
5420A1L0l7J7k1l8J4K7Lj7j6P0j07M2N5m5K0K0%r9O2ML8qn1nRK1J1j9k4L0J2%
$$ 11 41 4 21 0 -38 -24 3 6 -11 -27 43 -64 -22 33 -12 8 28 28 -71 -9 -5 33 25 -26 -31 -22 -1 10 -9 -33 -3 9 9
5453IJ9K7J2q2N7l0MQon7L6k2M2l2Oj4K7J9om2rK2o1N6J3j6j1J5KK7k0j2qL9j0
$$ 9 28 55 67 -15 42 12 16 24 18 -39 -3 -25 17 -15 -9 -23 4 23 17 -25 -34 -12 -73 -17 -4 -20 -31 -16 -14 13 -7 -19 -27 12 2
5488BQKJk2j0N9o0P6p9L6k8j7O1l0m4L7K2Jj6j7k3J5J5J2O8p8qP8o7rO7l9o4M7
$$ 2 10 12 13 -9 -19 40 -20 56 -23 13 -15 -32 29 -1 -45 -8 14 15 -1 -18 -41 -26 -11 1 69 -9 -17 61 -6 -15 52 13 -51 -4
5522dJ3KPl6J8NJJ2L3p6OKL6JK4n2L2J4k5K2q7P3k5M7m0m9J9j9M4l0J1J1k2K7
$$ -4 9 11 18 -18 0 5 6 18 51 -25 -19 -17 19 20 44 -8 24 38 13 35 -52 21 -4 43 3 -46 -27 -46 -2 -32 -21 -10 -32 -5
5556eJ0J9k0j2j1%K0J4j8J1j6MJ6Rl0MrJ0J5J6K4p3K0j5M5m5K0mk0K7k1J5J0K2
$$ -5 5 24 4 -8 -19 -19 1 15 -3 8 -8 -4 12 21 -9 -5 -14 -4 11 27 51 -22 -2 -17 28 -17 3 -1 -21 6 -15 0 10 32
5590C2l8L9k7J4oo2L8O9j11K5L9J0l3l1N2M5n4k7%M1Pj1PK1l9rL3k5Kpnj0kJ7
$$ 32 -6 33 6 20 14 -48 -10 59 -52 -27 12 22 -11 -42 10 55 1 -26 -26 15 22 11 18 39 0 -9 24 -1 1 -6 -11 -21 -23 -6
5624fJ6l2j3O6k0K5n0k3K7L8o7J6j3J3P7o7j5Q8m6j6n2M0l7k7J01l9l4R2Kn6M4
$$ -6 10 -22 -35 31 11 36 -14 -37 -10 28 -39 -23 -36 -23 54 -13 -28 60 14 -2 -54 -14 -51 -78 23 -16 -50 42 44 -12 32
5655C2j7lK5l9n6P5%L8n2p8Q8rM2m7Kj2N9n4KM3q9N6QlpJ2k5mL4m8kRl2M7k3O0
$$ 32 15 12 37 -2 -58 17 17 55 3 -75 13 4 46 -1 1 -11 48 -6 -4 39 -50 6 14 11 4 16 -9 -13 21 -27 -29 -20 -52 -5 -28 32
5691C2k7k2M4k7K9k3mJ5r0M6o3Q4nnK9mp8P4%k1j6O3m0J4N2n3n4L6M5k8k5K4j0
$$ 32 5 -17 27 0 29 6 2 17 -73 -27 -90 -6 -11 -16 13 9 -69 5 5 -16 -32 31 -9 5 57 4 -50 -14 31 3 -22 2 -8
5724hJ8oj5%L1mNoRLl8N0j7rMl1m2P8J7j9n4j3P6p4Q8n1K6k0LK1J0l5l6K0K4o
$$ -8 10 4 -11 -11 20 16 21 15 24 27 -11 39 22 13 17 -14 -56 22 39 20 -34 -47 29 -45 43 -8 18 -2 1 22 32 -3 -39 -19 5 -1
5760al6ON4m6M7KOlRm5J1k6Jj1KO9r9L9L5l1K4K9m5M2j2M6r8N8o6O7l0k5oJ01
$$ -1 -37 -31 23 -23 24 26 32 29 38 -7 4 -22 -21 -32 -30 39 -60 -21 14 -17 7 36 -9 33 21 67 -31 27 -39 28 -2 -27 -33 68
5794F8l0lJ0m6L7m6nMM5l4J6k5J1J1k5j7l1M6Nk5JNM8lj7K3l3J4RrM0n8Km1PM4
$$ 68 38 35 45 -1 36 -10 -15 -11 34 0 16 -9 2 13 -12 -29 -60 -14 -9 -34 -33 -28 20 17 0 23 -10 4 13 4 44 -14 -12 -53 -46 -2
5830bM0o3K1k4M9l0l1N2Nl5M9o1N9m0LLJj8NK7pj8K5K4j7n3M3k6J6mm9K1L9o4
$$ -2 38 -25 -4 -28 21 -9 -40 12 17 -18 31 -30 29 -11 -8 -5 -4 -22 -17 10 3 -15 10 34 17 -36 7 -19 -3 -7 -56 -35 4 -60
5864f0R0j2k2pJ5M5n1mK4o1O8m1K1K1oj3N4k7j6l4lK7K8n6J5l8K6l2J2QN0Pm1
$$ -60 30 18 -4 -11 4 49 -2 -6 18 -43 25 -16 5 26 20 7 61 34 18 -16 -19 8 36 -20 -5 -43 -17 -49 -37 -29 21 28 -13
5897a3M9n2Ml7K1qN2k4NmLk0L4jJ1l3J9K0l7K1j2pj5L2L5q4QLM4p0Q1K2m1LQM3
$$ -13 36 -16 -12 -49 -28 -36 16 -8 -3 -7 -4 -24 10 9 20 -13 6 26 -11 10 -2 -9 -24 8 43 -41 -33 -30 14 -56 25 47 6 9 17 60
5933F0q9k4M4j2J8J5l3LM8n9L9j0Jj8l0J01p3K6Ll1j3N1jj9p7J9L0K1kM5o7J8
$$ 60 -29 -53 -9 -21 -3 12 -21 -18 30 -29 10 0 1 -17 -47 54 -19 7 10 -21 -34 17 16 -3 -80 -61 -31 -10 -12 33 -34 -16
5965a6NL9L4n1L3l8J8Rm0J1Qm6P7l7J5j0n2L1j9J29r7Rn8J7NK3k4jL6J5Kl2LM7
$$ -16 -11 28 62 11 44 6 24 33 -7 4 12 -34 43 6 21 11 -41 -10 -29 100 3 12 -46 -29 -24 -1 -25 -26 10 25 27 -5 -2 45
5999D5l0L2l7l9Q9k5j06P4RN2q2kl9M1M9k2k5oL9m2J9j3Mn1P1k5J8Q4o0Jo1P3
$$ 45 15 47 10 -29 60 35 -71 3 12 64 -18 -20 -59 -18 31 9 -16 -22 17 -25 -6 -19 -15 -66 5 -20 -2 82 22 23 -38 35
6031C5k3j3n6M8Jk0P0n6J5K6nl3K4qk8OM2n1ML1k9rO5k2p9J00m2j0JOL9pl4J6
$$ 35 12 -1 -57 -9 -8 -28 42 -14 1 27 22 -11 13 5 -23 -17 25 -26 -22 9 -20 -29 36 14 -65 35 -7 -17 -16 -10 29 22 -12 4
6065DL1j3j7n8L6Q3o5J0%M4p4k9L1M3m4lL3K1p7L0N0l2J0J5l4l0L4K1Ll1M3k2
$$ 4 35 22 5 -53 -17 66 1 11 11 55 -19 -48 -17 26 -18 -21 12 33 -44 -14 36 4 14 29 -5 -35 -1 20 23 -8 35 13
6097A3n9NO6n6J2L0K6j1oj3J1k9N0j07L3J0K3J1j0Oj8j6P1n4n0J07n2J1LJ3m1
$$ 13 -46 -41 25 -31 -19 11 37 26 20 7 18 -11 39 -68 -35 -25 -2 9 -1 5 -13 -29 42 -12 -62 45 -7 4 7 20 -21
6128b1J8k8O6l8L1j2j3l0K1J0n4O4l3N2Jl1jJ8j4NMn6R8k9m3K7j9K2Jopj6N4k2
$$ -21 -3 -31 35 -3 28 16 3 -27 -6 4 -50 14 -19 33 34 3 2 20 6 11 15 -41 57 28 -15 12 -7 15 16 10 3 -13 41 19
6162A9J0l7J6%Rk3nn0N1JO1o2J4j2M1j5j0J4k6Jk8K4L6o5K4k0j0K4l8P9K6k9q
$$ 19 29 -8 8 8 17 -6 -11 -61 -10 -9 52 -10 4 -8 33 18 8 22 -4 -3 -31 -7 29 -36 -12 -32 -42 -18 -56 23 49 20 12
6195A2k3m%L3lJ9j8k4L5n1K4j3K8Qk2K3n3N3m1J8J5l7N1k8Kj1N5o8l2L8j1P9q5
$$ 12 -11 -15 -15 18 15 34 16 -8 27 -24 0 -13 15 23 1 24 -29 24 -17 1 16 -21 30 2 4 -7 48 -20 -52 -14 -25 54 -31
$$ [...]
8191A0
##END NTUPLES=NMR FID
##END=
