##TITLE=1H_AM_NV61
 CDCl3
 8 sc, 
 27.9.2023
##JCAMPDX= 6.0         $$ Bruker NMR JCAMP-DX V2.0
##DATA TYPE= NMR FID
##DATA CLASS= NTUPLES
##ORIGIN= UXNMR, Bruker Analytische Messtechnik GmbH
##OWNER= root
$$ XWIN-NMR		Version 3.5
$$ Wed Sep 27 13:53:36 2023 Russian Standard Time (UT+4h)  she@DPX200
##.OBSERVE FREQUENCY= 200.13135
##.OBSERVE NUCLEUS= ^1H
##.DELAY= (6, 6)
##.ACQUISITION MODE= SIMULTANEOUS
##.ACQUISITION SCHEME= undefined
##.AVERAGES= 8
##.DIGITISER RES= 18
##SPECTROMETER/DATA SYSTEM= spect
##.PULSE SEQUENCE= zg30
##.SOLVENT NAME= CDCl3
##.SHIFT REFERENCE= (INTERNAL, CDCl3, 0, 15.7039)
##AUDIT TRAIL= $$ (NUMBER, WHEN, WHO, WHERE, WHAT)
$$ ##TITLE= Audit trail, XWIN-NMR		Version 3.5
$$ ##JCAMPDX= 5.01
$$ ##ORIGIN= Bruker BioSpin GmbH
$$ ##OWNER= she
$$ F:/spectra/data/she/nmr/H-F/1/audita.txt
$$ ##AUDIT TRAIL=  $$ (NUMBER, WHEN, WHO, WHERE, WHAT)
(   1,<2023-09-27 13:52:25.95 +0400>,<she>,<DPX200>,
      <created by zg, POWCHK disabled, PULCHK disabled
       configuration hash MD5:
       00 E9 B6 7A A2 85 ED C7 34 08 36 98 17 FE 4E 26
       data hash MD5: 16K
       D1 10 09 89 3B 5B E3 44 A1 8F AE 19 A7 3F BD 6F>)
$$ ##END=
$$ 
$$ hash MD5
$$ 3F 96 CF 7C C2 E7 96 AE 9F 82 D6 7E E7 13 D3 02
##$RELAX= 
##$RELAX= 
##$RELAX= 
##$RELAX= 
##$RELAX= 
##$RELAX= 
$$ Bruker specific parameters
$$ --------------------------
##$DU= <F:/spectra>
##$EXPNO= 1
##$NAME= <H-F>
##$PROCNO= 1
##$TYPE= <nmr>
##$USER= <she>
##$AMP= (0..31)
100 100 100 100 100 100 100 100 100 100 100 100 100 100 100 100 100 100 
100 100 100 100 100 100 100 100 100 100 100 100 100 100 
##$AQSEQ= 0
##$AQ_mod= 1
##$AUNM= <au_zg>
##$AUTOPOS= <>
##$BF1= 200.13
##$BF2= 200.13
##$BF3= 200.13
##$BF4= 200.13
##$BF5= 200.13
##$BF6= 200.13
##$BF7= 200.13
##$BF8= 200.13
##$BYTORDA= 1
##$CFDGTYP= 0
##$CFRGTYP= 5
##$CHEMSTR= <none>
##$CNST= (0..31)
1 1 145 1 1 1 1 1 1 1 1 1 1 1 1 1 1 1 1 1 1 1 1 1 1 1 1 1 1 1 1 1 
##$CPDPRG= <>
##$CPDPRG1= <>
##$CPDPRG2= <>
##$CPDPRG3= <>
##$CPDPRG4= <mlev>
##$CPDPRG5= <mlev>
##$CPDPRG6= <mlev>
##$CPDPRG7= <mlev>
##$CPDPRG8= <mlev>
##$CPDPRGB= <>
##$CPDPRGT= <>
##$D= (0..31)
0 1.2 0 0 0 0 0 0 0 0.06 0 0.03 0 0 0 0 0.0002 0 0 0 0 0 0 0 0 0 0 0 0 
0 0 0 
##$DATE= 1695808345
##$DBL= (0..7)
120 120 120 120 120 120 120 120 
##$DBP= (0..7)
150 150 150 150 150 150 150 150 
##$DBP07= 0
##$DBPNAM0= <>
##$DBPNAM1= <>
##$DBPNAM2= <>
##$DBPNAM3= <>
##$DBPNAM4= <>
##$DBPNAM5= <>
##$DBPNAM6= <>
##$DBPNAM7= <>
##$DBPOAL= (0..7)
0.5 0.5 0.5 0.5 0.5 0.5 0.5 0.5 
##$DBPOFFS= (0..7)
0 0 0 0 0 0 0 0 
##$DE= 6
##$DECBNUC= <off>
##$DECIM= 32
##$DECNUC= <off>
##$DECSTAT= 4
##$DIGMOD= 1
##$DIGTYP= 9
##$DL= (0..7)
0 120 120 120 120 120 120 120 
##$DP= (0..7)
150 150 150 150 150 150 150 150 
##$DP07= 0
##$DPNAME0= <>
##$DPNAME1= <>
##$DPNAME2= <>
##$DPNAME3= <>
##$DPNAME4= <>
##$DPNAME5= <>
##$DPNAME6= <>
##$DPNAME7= <>
##$DPOAL= (0..7)
0.5 0.5 0.5 0.5 0.5 0.5 0.5 0.5 
##$DPOFFS= (0..7)
0 0 0 0 0 0 0 0 
##$DQDMODE= 0
##$DR= 18
##$DS= 0
##$DSLIST= <SSSSSSSSSSSSSSS>
$$ [...]
##$SUBNAM2= <"">
##$SUBNAM3= <"">
##$SUBNAM4= <"">
##$SUBNAM5= <"">
##$SUBNAM6= <"">
##$SUBNAM7= <"">
##$SUBNAM8= <"">
##$SUBNAM9= <"">
##$SW= 18.05172834244
##$SWIBOX= (0..15)
0 0 2 0 0 0 0 0 0 0 0 0 0 0 0 0 
##$SW_h= 3612.71676300578
##$TD= 16384
##$TD0= 1
##$TE= 0
##$TE2= 300
##$TE3= 300
##$TEG= 300
##$TL= (0..7)
0 120 120 120 120 120 120 120 
##$TP= (0..7)
150 150 150 150 150 150 150 150 
##$TP07= 0
##$TPNAME0= <>
##$TPNAME1= <>
##$TPNAME2= <>
##$TPNAME3= <>
##$TPNAME4= <>
##$TPNAME5= <>
##$TPNAME6= <>
##$TPNAME7= <>
##$TPOAL= (0..7)
0.5 0.5 0.5 0.5 0.5 0.5 0.5 0.5 
##$TPOFFS= (0..7)
0 0 0 0 0 0 0 0 
##$TUNHIN= 0
##$TUNHOUT= 0
##$TUNXOUT= 0
##$USERA1= <user>
##$USERA2= <user>
##$USERA3= <user>
##$USERA4= <user>
##$USERA5= <user>
##$V9= 5
##$VALIST= <valist>
##$VCLIST= <CCCCCCCCCCCCCCC>
##$VD= 0
##$VDLIST= <DDDDDDDDDDDDDDD>
##$VPLIST= <PPPPPPPPPPPPPPP>
##$VTLIST= <TTTTTTTTTTTTTTT>
##$WBST= 1024
##$WBSW= 4
##$XGAIN= (0..3)
0 0 0 0 
##$XL= 0
##$YL= 0
##$YMAX_a= 112086
##$YMIN_a= -85230
##$ZGOPTNS= <>
##$ZL1= 120
##$ZL2= 120
##$ZL3= 120
##$ZL4= 120
##$ABSF1= 10
##$ABSF2= 0
##$ABSG= 5
##$ABSL= 3
##$ALPHA= 0
##$AQORDER= 0
##$ASSFAC= 0
##$ASSFACI= 0
##$ASSFACX= 0
##$ASSWID= 0
##$AUNMP= <proc_1d>
##$AZFE= 0.1
##$AZFW= 0.1
##$BCFW= 1
##$BC_mod= 2
##$BYTORDP= 1
##$COROFFS= 0
##$CY= 11.3945322036743
##$DATMOD= 1
##$DC= 2
##$DFILT= <>
##$DTYPP= 0
##$F1P= 15.7292609196834
##$F2P= 12.9074282941183
##$FCOR= 0.5
##$FTSIZE= 0
##$FT_mod= 4
##$GAMMA= 1
##$GB= 0.15
##$INTBC= 1
##$INTSCL= 1
##$ISEN= 128
##$LB= 0.24
##$LEV0= 0
##$LPBIN= 0
##$MAXI= 10000
##$MC2= 0
##$MEAN= 0
##$ME_mod= 0
##$MI= 1.114404
##$NCOEF= 0
##$NC_proc= 0
##$NLEV= 6
##$NOISF1= 3.799351
##$NOISF2= 2.8
##$NSP= 1
##$NTH_PI= 0
##$NZP= 0
##$OFFSET= 15.70392
##$PC= 1
##$PHC0= -21874.26
##$PHC1= 18.65271
##$PH_mod= 1
##$PKNL= yes
##$PPARMOD= 0
##$PSCAL= 0
##$PSIGN= 0
##$REVERSE= no
##$SF= 200.130013532006
##$SI= 16384
##$SIGF1= 3
##$SIGF2= 2
##$SINO= 400
##$SIOLD= 16384
##$SREGLST= <1H.CDCl3>
##$SSB= 0
##$STSI= 0
##$STSR= 0
##$SW_p= 3612.71676300578
##$SYMM= 0
##$S_DEV= 0
##$TDeff= 0
##$TDoff= 0
##$TI= <>
##$TILT= no
##$TM1= 0
##$TM2= 0
##$TOPLEV= 0
##$USERP1= <user>
##$USERP2= <user>
##$USERP3= <user>
##$USERP4= <user>
##$USERP5= <user>
##$WDW= 1
##$XDIM= 8192
##$YMAX_p= 0
##$YMIN_p= 0
$$ End of Bruker specific parameters
$$ ---------------------------------
##NTUPLES= NMR FID
##VAR_NAME=  TIME,          FID/REAL,        FID/IMAG
##SYMBOL=    X,             R,               I
##VAR_TYPE=  INDEPENDENT,   DEPENDENT,       DEPENDENT
##VAR_FORM=  AFFN,          ASDF,            ASDF
##VAR_DIM=   8192,          8192,            8192
##UNITS=     SECONDS,       ARBITRARY UNITS, ARBITRARY UNITS
##FACTOR=    0.0002768,     1,               1
##FIRST=     0,             0,               0
##LAST=      2.2672688,     0,               0
##MIN=       0,             -85230,          0
##MAX=       2.2672688,     112086,          0
$$ Real data points
##PAGE= N=1
##DATA TABLE= (X++(R..R)), XYDATA
$$ plain form
0 0 0 0 0 0 0 0 0 0 0 0 0 0 0 0 0 0 0 0 0 0 0 0 5 -8 8 -8 8 -8 8 -13 16 -16 16 -22 24 -27 30 -33 38 -44 47 -54 60
43 60 -67 73 -81 90 -98 109 -121 132 -147 161 -177 195 -215 238 -263 289 -322 359 -402 453 -510
64 -510 581 -660 741 -760 332 5118 112086 56188 -56490 -44246 -20552 19711 54022
77 54022 24519 -14170 -20950 -18082 16478 41896 34235 2735 -61582 -56406 60159 73933 -31321
90 -31321 -52207 -22945 -16384 37679 56653 -20284 -59475 -23397 24368 53553 19960 -35640
102 -35640 -37471 -14341 21845 50902 583 -51926 -24726 -1342 15372 49926 7772 -60878
114 -60878 -30171 31096 44839 26361 -19105 -39071 -7195 20386 38789 30258 -36240 -58723
126 -58723 5143 44355 31437 -5304 -52497 -33355 35628 37679 -1752 -13931 -20583 -15160 9118
$$ packed form
0@%%%%%%%%%%%%%%%%%%%%%%Nj3J6j6J6j6J6k1K9l2L2l8M6n1N7o3P1q2R1j01J14
43F0j27J40j54J71j88K07k30K53k79L08l38L72m10M53n01N52o11O81p61Q55r63
64e10J091j241J401j501J092M786J06968n5898j12678J2244K3694M0263L4311
77E4022k9503l8689o780K868L4560K5418p661l1500o4317N176J16565J3774j05254
90c1321k0886K9262O561N4063J8974p6937l9191L6078M7765K9185l3593n5600
102c5640j831K3130L6186K9057n0319n2509K7200K3384J6714L4554m2154o8650
114f0878L0707O1267J3743j8478m5466j9966L1876K7581J8403q531o6498k2483
126e8723O3866L9212j2918l6741m7193J9142O8983K051l9431j2179o652N423K4278
$$ plain form
139 9118 24128 26533 -8323 -57985 -24289 49299 42410 -11645 -42418 -35380 16997 50025 11777
152 11777 -26147 -23856 -9769 16885 33564 12600 -16259 -30609 -14445 31987 38733 -7751
164 -7751 -31046 -21819 -3513 28856 31542 -13836 -40366 -21861 13984 38955 17268 -30586 -37183
177 -37183 -2492 29514 31324 -3836 -32364 -18110 6661 21436 25386 -3235 -35177 -19473
189 -19473 17231 30450 15583 -16550 -31567 -7587 23200 29205 8032 -25442 -31731 1896
201 1896 32087 25551 -9501 -37904 -20606 22201 30721 3536 -19625 -22758 -6327 16975 23199
214 23199 7008 -17568 -27896 -5080 28946 29092 -5835 -32991 -21028 16262 33460 11359
226 11359 -19214 -25399 -6240 19337 26077 4565 -22026 -24031 305 24600 21002 -7175 -27023
$$ packed form
139I118J5010K405l4856m9662L3696P3588o889n4055l0773P038N2377L3028l8248
152A1777l7924K291J4087K6654J6679k0964k8859j4350J6164M6432O746m6484
164g751k3295R227J8306L2369K686m5378k6530J8505L5845K4971k1687m7854o597
177c7183L4691L2006J810l5160k8528J4254K4771J4775L950k8621l1942J5704
189a9473L6704J3219j4867l2133j5017K3980L0787O005k1173l3474o289L3627
201A896L0191o536l5052k8403J7298M2807Q520k7185k3161l133J6431K3302O224
214B3199j6191k4576j0328K2816L4026J46l4927k7156J1963L7290J7198k2101
226A1359l0573o185J9159K5577O740k1512k6591k005K4336K4295l598k8177j9848
$$ plain form
239 -27023 -16914 9503 23385 11881 -12544 -25159 -11728 15226 25773 6703 -20938 -25168
251 -25168 -266 24715 20530 -5874 -24224 -15971 9335 24209 12405 -11508 -22399 -9622
263 -9622 15028 24267 6048 -17537 -20444 -1843 19388 20210 -1592 -21076 -17469 4135 22398
276 22398 16030 -10250 -24619 -11044 13431 22832 6501 -17535 -20161 -1303 16575 17715 454
289 454 -18498 -16705 3272 18908 15185 -5950 -22074 -12234 11059 20761 8565 -13012 -20751
302 -20751 -4237 16470 18432 1981 -16894 -17780 2578 19656 14397 -5304 -19609 -13021 8996
315 8996 20233 8653 -11212 -19504 -6986 14452 19316 2602 -15958 -17413 180 18446 15441
328 15441 -4950 -18903 -12968 6586 19116 9589 -10784 -18781 -7069 12003 18515 4223 -14699
$$ packed form
239b7023J0109K6417J3882j1504k4425j2615J3431K6954J0547j9070k7641m230
251b5168K4902K4981m185k6404j8350Q253K5306J4874j1804k3913j0891J2777
263i622K4650R239j8219k3585k907J8601K1231Q22k1802j9484L607K1604J8263
276B2398o368k6280j4369J3575K4475R401j6331k4036k626J8858J7878J140j7261
289D54j8952J793J9977J5636l723k1135j6124R840K3293R702j2196k1577p739
302b0751J6514K0707J962j6451j8875q86K0358J7078n259j9701j4305O588K2017
315H996J1237j1580j9865q292J2518K1438M864j6714j8560j455J7593J8266l005
328A5441k0391j3953N935J9554J2530r527k0373p997J1712J9072O512j4292j8922
$$ plain form
341 -14699 -16577 -309 16572 15874 -2466 -17797 -12632 6416 17986 10133 -8801 -17893 -6943
354 -6943 11352 17180 4774 -12734 -16433 -1491 15359 14939 -1788 -16590 -13601 4300 16955
367 16955 9862 -8161 -17371 -8603 9576 17285 5034 -12386 -15501 -1784 14542 15196 -1341
380 -1341 -14793 -11081 3576 14694 10521 -5734 -15128 -8030 6841 15700 7456 -10721 -15830 -2484
394 -2484 12264 14041 338 -14728 -11991 3451 12397 8773 -4076 -14406 -8462 6081 12843
407 12843 7460 -6892 -15208 -4142 11856 13433 2522 -11100 -13306 1914 14231 8980 -3365
420 -3365 -12090 -9491 5061 13234 6214 -5388 -12893 -7117 9477 14016 2022 -9534 -12534 -2526
434 -2526 13042 11371 -4415 -11812 -8211 2252 12387 7543 -5743 -10611 -6283 5601 14402 4930
$$ packed form
341a4699j878J6268J6881o98j8340j5331N165J9048J1570p853j8934r092J0950
354f943J8295N828j2406j7508l699J4942J6850m20j6727j4802K989J7901J2655
367A6955p093j8023r210Q768J8179P709j2251j7420l115J3717J6326O54j6537
380a341j3452L712J4657J1118m173j6255r394P098J4871Q859q244j8177n109J3346
394b484J4748J777j3703j5066K737J5442Q946l624j2849j0330N944J4543O762
407A2843n383j4352q316J1066J5998J577j0911j3622k206J5220J2317n251j2345
420c365q725K599J4552Q173p020j1602p505N776J6594M539j1994j1556l000J0008
434b526J5568j671j5786p397L601J0463J0135m844j3286m868M328J1884Q801r472
$$ plain form
448 4930 -9413 -10775 -2915 9432 13933 -978 -14082 -7911 3209 10067 8794 -4239 -12269 -5342
462 -5342 5015 11510 7058 -8196 -12897 -2236 8042 11704 2691 -13756 -11895 4723 10533 6156
476 6156 -2199 -11302 -7270 5584 10241 6192 -4194 -13046 -4957 9194 11252 3245 -9901 -14030
490 -14030 2241 14471 5869 -4480 -8242 -6687 4168 10908 4463 -3731 -8940 -6578 6289 11864
504 11864 2723 -7715 -11919 -3027 12581 10291 -5457 -10040 -5679 2013 10801 6726 -6340 -9605
518 -9605 -3890 5046 10728 2963 -8399 -8707 -1874 7414 10610 -1007 -10538 -5468 2026 7677 8680
533 8680 -2453 -11110 -4672 5208 9456 5033 -6831 -10535 -1397 7390 8871 875 -10378 -7759
547 -7759 4253 7592 4036 -1570 -7751 -4994 3398 6137 4306 -1727 -9448 -6401 5526 10512 3672
$$ packed form
448D930j4343j362P860J2347M501j4911j3104O171J1120O858j273j3033q030O927
462e342J0357O495m452j5254m701J0661J0278L662r013j6447J861J6618N810m377
476F156q355r103M032J2854M657m049j0386q852Q089J4151K058q007j3146m129
490a4030J6271J2230q602j0349l762J555J0855O740o445q194n209K362J2867N575
504A1864r141j0438m204Q892J5608k290j5748m583M361P692Q788m075j3066l265
518i605N715Q936N682p765j1362l08O833R288L196j1617r531N070P494N651J003
533H680j1133q657O438R880M248m423j1864l704R138Q787J481p996j1253K619
547g759J2012L339l556n606o181K757Q392K739j831o033p721L047J1927M986o840
$$ plain form
562 3672 -8918 -11917 1885 12448 5694 -4830 -7675 -3371 4613 6908 2159 -1975 -5047 -5216
576 -5216 2525 9187 4679 -5367 -10145 -2756 9370 9041 -2401 -8980 -5969 2161 8260 4714 -4131
591 -4131 -8027 -4381 3638 8366 3052 -6173 -7948 -1374 6687 7564 -187 -6935 -5321 1253 6933
606 6933 6181 -1295 -7405 -5116 2834 8542 5182 -4559 -9355 -3416 6673 9379 645 -9415 -8080
621 -8080 2531 8954 4261 -4817 -7367 -2225 3018 4518 2821 -1517 -5593 -5119 2200 9420 5516
636 5516 -6750 -10757 -401 10787 8675 -3903 -10272 -2869 6213 6512 1197 -3681 -4906 -1877
650 -1877 2506 5185 3266 -4052 -7984 -2066 5854 6752 -49 -7814 -6735 2356 7407 4250 -2919
665 -2919 -7926 -4036 5328 7855 1679 -5473 -6706 206 6990 4997 -905 -4621 -4537 1121 6389 4111
$$ packed form
562C672j2590k999J3802J0563o754j0524k845M304P984K295m749m134l072j69
576e216P741O662m508j0046m778P389J2126l29j1442o579L011Q130O099l546q845
591d131l896L646Q019M728n314r225j775O574Q061Q77p751o748J614O574N680
606F933p52p476o110K289P950N708l360r741m796N939J0089K706q734j0060J335
621h080J0611O423m693r078k550N142N243J500j697m338m076M74P319P220l904
636E516j2266m007J0356J1188k112j2578o369P403R082K99n315m878j225L029
650a877M383K679j919p318l932N918P920Q98o801p765J079R091N051l157p169
665b919n007L890R364K527o176p152j233O912O784j993n902l716Q4N658N268k278
$$ plain form
681 4111 -1645 -5349 -4539 2159 7058 2948 -3971 -6679 -3319 4472 7376 635 -6624 -6805 175 7880
697 7880 5447 -4423 -6950 -1470 3375 4669 1675 -2771 -3339 -1946 941 5779 4586 -3532 -7253
712 -7253 -2189 6317 8483 -679 -8960 -4574 3936 6346 2847 -3854 -6508 -1682 3490 4388 1810
727 1810 -3870 -6093 -901 4259 4644 989 -4974 -5607 698 5466 4837 -297 -6787 -5300 3955 7815
743 7815 2670 -4563 -6825 -675 6402 4960 -1029 -4483 -4237 382 5106 3563 -1366 -4819 -4550 1375
759 1375 6275 2898 -3372 -5729 -2853 3706 6632 1352 -5092 -5751 -399 6459 6024 -2195 -6735 -3045
775 -3045 3241 5870 2287 -3599 -4581 -1108 2514 4645 2234 -3577 -5544 -1340 4306 5624 38
790 38 -6295 -4864 1803 5639 3505 -2578 -6050 -2435 3668 5408 1705 -3954 -5169 -33 4658 3955
$$ packed form
681D111n756l704Q10O698M899m110o919k708L360P791K904o741p259j81O980P705
697G880k433r870k527N480M845J294k994m446n68J393K887M838j193q118l721
712g253N064Q506K166r162q281M386Q510K410l499o701k654M826N172Q98k578
727A810n680k223N192N160L85l655n963o33O305M768o29n134o490J487R255L860
743G815n145p233k262O150P077j442n989l454K46M619M724j543m929l453K69N925
759A375M900l377o270k357K876O559K926n280o444o59N352O858m35q219m540L690
775c045O286K629l583n886r82L473L622K131k411n811j967M204N646J318n586
790C8o333J431O667L836k134o083l472L615O103J740l703n659j215N136M691p03
$$ plain form
806 3955 -298 -3945 -3673 544 4119 3556 -507 -4857 -4209 1853 6054 2805 -3786 -6015 -1424 4704
822 4704 4993 -437 -4697 -3805 680 4313 3564 -1020 -4442 -3164 1520 4933 3025 -2389 -4894 -1872
838 -1872 2972 4889 1603 -3721 -4931 -527 4221 4497 -295 -5140 -3925 1686 4812 2683 -2184
853 -2184 -4839 -2168 2781 4313 1599 -2745 -4693 -1146 3974 4341 235 -4004 -4383 643 5070 3444
869 3444 -1573 -4777 -3205 2436 5368 1826 -3222 -4736 -1516 3859 4770 -130 -4063 -3794 -52 4424
885 4424 3940 -1374 -4550 -3069 1443 5164 2889 -3015 -4796 -1479 3017 4991 1077 -4256 -4089 90
901 90 3799 4175 -547 -4981 -3112 1566 4304 3069 -2261 -5215 -1734 2979 4237 1565 -3522 -4783
917 -4783 -75 3981 3660 85 -4388 -3886 1695 4509 2688 -1453 -4691 -2464 3180 4420 1317 -2609
$$ packed form
806C955m253l647K72M217L575n63m063m350O48O062M201l249o591k229M591O128
822D704K89n430m260Q92M485L633p49m584l422J278M684L413j908n414k505L022
838a872M844J917l286n324j210M404M748K76m792m845J215N611L126k129m867
853b184k655K671M949J532k714m344j948L547N120L67m106m239l79N026M427j626
869C444n017l204J572N641K932l542n048j514L220N375R11m900l933K69L742M476
885D424m84n314l176J481M512L721k275n904j781L317M496J974l914n333J67M179
901I0L709L76m722m434J869M678K738j235n330k954L481M713J258k672n087j261
917d783M708M056l21l575m473N02N581K814j821m141l238K227N644J240l103l926
$$ plain form
933 -2609 -4448 -1105 3991 3945 -13 -3644 -4235 502 4891 2833 -1906 -4248 -2717 2242 4581 1049
949 1049 -2755 -3419 -1536 2606 4257 639 -3301 -3745 -511 4337 4320 -1276 -4499 -2428 1928 4762
965 4762 2277 -2978 -3772 -746 2286 3794 1177 -3339 -3809 -514 3205 4003 -302 -4789 -3333 1305
981 1305 4039 2854 -2168 -4924 -1529 2888 3761 1368 -2803 -4026 -326 3403 3701 553 -3692 -3647
997 -3647 1126 4343 3054 -1149 -4636 -2456 2853 4156 1039 -2675 -3907 -1208 2878 3500 422
1012 422 -3380 -4318 -190 4411 3521 -1429 -4788 -2908 2662 5005 1205 -3071 -3392 -624 2838 3753
1028 3753 897 -2676 -3666 -460 4011 4281 -652 -4734 -3388 1902 5070 1969 -3387 -4449 -856
1043 -856 2876 3412 382 -3174 -3646 -533 3218 3579 -216 -4071 -3451 1269 4738 2906 -2298 -4548
$$ packed form
933b609j839L343N096m6l958l631n91M737M389k058m739k342J531M959K339l532
949A049l804o64J883M142J651l618l940m44L234M848j7n596l223K071M356K834
965D762k485n255p94L026L032J508k617m516m70L295L719P98m305m487J456M638
981A305K734j185n022k756L395M417Q73k393m171j223L700L729K98l148m245M5
997c647M773L217j289m203l487K180N309J303l117l714j232K699M086O22l078
1012D22l802r38M128M601q90m950l359J880N570K343l800m276l21K768L462R15
1028C753k856l573r90L206M471K70m933m082J346N290L168l101n356j062L593
1043h56L732N36l030l556m72L113L751L61l795l855O20M720L469j832n204k250
$$ plain form
1059 -4548 -1343 3337 4227 828 -3121 -3396 16 3419 3423 -210 -3666 -3176 775 4123 2891 -1928
1075 -1928 -4729 -2195 2566 4281 916 -3548 -3927 -309 3128 3181 -107 -3486 -3230 546 3828 3152
1091 3152 -1041 -4249 -2302 2427 4442 1868 -2689 -3972 -445 3379 3363 320 -3113 -3385 126 3493
1107 3493 3048 -775 -4141 -3130 1665 4257 1903 -2597 -4474 -1310 3364 3507 12 -2974 -3264 -254
1123 -254 3383 3401 -322 -3605 -3140 1286 4746 2681 -2190 -4294 -1603 3195 4360 310 -3495 -3189
1139 -3189 -266 3086 3392 -416 -3857 -3078 753 3906 2784 -1869 -4301 -2027 2242 4300 1450
1154 1450 -3293 -3927 -330 3338 3949 181 -4064 -3204 1386 4180 2603 -1548 -4040 -1891 2223 3829
1170 3829 1551 -2820 -4318 -915 3235 3509 219 -3832 -3796 808 4244 2816 -1379 -4226 -2567 2371
$$ packed form
1059d548L205M680Q90l399l949k75L412L403Ml633l456M90L951L348j232m819
1075a928k801K534M761J715l365m464l79L618L437N3l288l379K56L776L282o76
1091C152m193l208J947M729K015k574m557j283L527L824j6l043l433k72L511L367
1107C493m45l823l366J011M795K592k354m500j877L164M674J43l495k986k90L010
1123b54L637J8l723l283M65M426L460k065m871k104K691M798J165m050l805L06
1139c189K923L352L06l808l441P79L831L153j122m653k432K274M269K058k850
1154A450m743o34L597L668O11l768m245Q60M590K794j577m151k492K149M114J606
1170C829k278m371j498L403M150K74l290m051L6M604L436j428m195k847J659M938
$$ plain form
1186 2371 4488 1630 -2887 -4171 -618 3774 3621 -232 -3169 -2896 369 3590 2941 -734 -3632 -3004
1202 -3004 1167 4429 2334 -2840 -4759 -1384 3308 4012 -178 -3817 -3122 508 3472 3055 -776 -3726
1218 -3726 -2468 1493 4107 2362 -2211 -4065 -1215 2828 3840 928 -3017 -3643 -295 3528 3642
1233 3642 -458 -4355 -3335 1639 4355 1930 -2600 -4188 -1273 2648 3342 709 -2631 -3485 -557
1248 -557 3255 3684 77 -3599 -3151 1017 4202 2676 -1637 -3955 -1998 2157 4219 1506 -3057 -4159
1264 -4159 -563 3671 3708 -572 -4019 -2813 1125 3386 2194 -1345 -3668 -2243 1509 3858 2075
1279 2075 -2529 -4530 -1049 3678 4150 132 -3817 -3259 1118 4062 2747 -1203 -4006 -2369 2190
1294 2190 4132 1504 -2625 -3960 -876 3135 3349 135 -2934 -3323 -281 3459 3298 -721 -4229 -3300
$$ packed form
1186B371K117k858m517j284L553M392j53l853k937K73L265L221o49l675k898O28
1202c004M171L262k095n174j919L375M692P04m190l639O95L630K964m17l831k950
1218c726J258L961K614j745m573j854K850M043J012k912l945o26L348L823J14
1233C642m100l897J020M974K716k425m530j588K915L921O94k633l340q54K928
1248e57L812M29l607l676M48M168L185j526m313k318J957M155K062k713m563j102
1264d159L596M234L7m280l447J206L938K261j192l539k323J425L752K349j783
1279B075m604k001L481M727M72m018l949N58M377K944j315l950k803J637M559
1294B190J942k628m129j335L084M011K14l214l069l89L042L740j61m019l508R29
$$ plain form
1310 -3300 1654 4892 1860 -3158 -4104 -746 3323 3718 53 -3207 -2788 148 3340 3341 -693 -3851
1326 -3851 -2578 1446 4184 2247 -2473 -4091 -1260 2608 3828 937 -3513 -3838 120 3579 3325
1341 3325 -869 -4394 -2639 1856 3743 1897 -1925 -3834 -1274 2546 3456 1276 -2563 -3807 -190
1356 -190 3712 3193 -348 -3630 -3048 1296 3961 2114 -1620 -3972 -2048 2604 3998 701 -2941 -3641
1372 -3641 -359 3653 3096 -861 -3199 -2486 708 3660 2517 -1351 -3517 -2214 1893 4415 1450
1387 1450 -2969 -3653 -564 3200 3600 -441 -3714 -2646 691 3353 2565 -1451 -3929 -1948 1715 3615
1403 3615 1652 -2708 -3696 -592 2643 3410 614 -3245 -3212 662 3579 2939 -861 -3984 -2167 2212
1419 2212 3827 1543 -2273 -3853 -828 2917 3154 281 -3108 -3523 216 3521 2595 -989 -3671 -2582
$$ packed form
1310c300M954L238l032n018r46L358M069L95l665l260M19K936L192Jm034l158
1326c851J273M024K738j937m720j618K831L868J220k891m450l25L958L459k54
1341C325m194l525J755M495J887j846l822j909K560L820R10k180l839j244L617
1356a90L902n19l541l282N82M344K665j847l734k352J924M652J394l297l642p00
1372c641L282M012n57l957k338P13L194K952j143l868k166J303M107K522k965
1387A450m419o84L089L764M00m041l273J068L337K662p88m016k478J981L663J900
1403C615j963m360r88L104L235P67k796l859L3L874K917o40l800l123J817M379
1419B212J615k284l816j580L025L745K37k873l389m15L739L305r26l584k682J089
$$ plain form
1435 -2582 1595 3808 1603 -2139 -3738 -1289 2922 3828 421 -2930 -3141 152 3664 3085 -886 -3448
1451 -3448 -2301 1333 3774 1939 -2107 -3649 -1394 2357 3497 549 -3169 -3296 -168 3007 2984 -625
1467 -625 -3648 -2535 1146 3570 2154 -1893 -3749 -1298 2540 3608 930 -2758 -3044 134 3288
1482 3288 3031 -258 -3340 -2497 1283 3555 1992 -1713 -3612 -1667 2104 3360 725 -2858 -3442 -428
1498 -428 2872 2831 -363 -3290 -2725 905 3383 2166 -1388 -3356 -1603 2011 3643 1346 -2367 -3167
1514 -3167 -144 3126 3019 15 -2894 -2409 811 3093 2129 -1045 -3360 -2079 1476 3352 1314 -2491
1530 -2491 -3741 -725 2854 2793 -348 -3063 -2619 631 3010 2029 -951 -2919 -1958 1433 3451 1713
1546 1713 -1709 -3187 -829 2845 3335 317 -2568 -2606 233 3098 2522 -995 -3206 -2085 989 3136
$$ packed form
1435b582M177K213k205l742j599K449M211R06l407l351k11L293L512n79l971k562
1451c448J147L634K441j835m046j542K255L751J140k948l718j27L128L175k3l609
1467f25l023J113L681K424j416m047j856K451L838J068k678l688k86L178L154
1482C288k57l289l082Q43L780K272j563l705j899J945L771J256k635l583n84L014
1498d28L300m1l194k927N65L630K478j217l554j968J753L614J632k297l713q00
1514c167L023L270j07l004k909M85L220K282r64l174k315J281L555J876k038l805
1530b491j250L016L579o1l141k715M44L250K379r81k980j968R61L391K018j738
1546A713l422j478K358L674M90l018k885l8K839K865n76l517k211J121L074K147
$$ plain form
1562 3136 1460 -2039 -3396 -1142 2073 2953 389 -2739 -2799 -22 2806 2689 -679 -3156 -1828 1311
1578 1311 3022 1798 -1418 -3131 -1138 2182 3242 926 -2617 -3040 149 2959 2539 -717 -3262
1593 -3262 -2062 1294 2635 1187 -1267 -2923 -1545 1644 3043 1024 -2163 -3237 -357 3050 2779
1608 2779 -458 -2996 -2203 1203 3235 1456 -1366 -2644 -1341 1677 3006 870 -2134 -2766 -507
1623 -507 2493 2635 -350 -2827 -2306 576 2895 1830 -1445 -2953 -1398 1646 3016 986 -2151 -2666
1639 -2666 -232 2435 2577 41 -2521 -2163 556 2734 1967 -1023 -2952 -1399 1481 2693 1016 -1824
1655 -1824 -2679 -640 2067 2363 235 -2358 -2420 165 2688 2046 -906 -2795 -1524 1505 2725 1003
1671 1003 -1537 -2330 -641 1893 2473 472 -2043 -2309 -9 2438 2199 -625 -2820 -1711 1125 2635
$$ packed form
1562C136j676l499j357K254L215Q80k564l128o0K777K828j17l368k477J328L139
1578A311J711j224l216j713J993L320J060k316l543m23L189K810m20l256k545
1593c262J200L356J341j448k454j656J378L189J399k019l187j074K880L407k71
1608B779l237k538P93L406K032j779k822j278J303L018J329k136l004o32K259
1623e07L000J42k985k477N21K882K319j065l275j508J555L044J370k030l137n15
1639b666K434K667J42k536k562L58K719K178p67k990j929J553K880J212j677k840
1655a824q55K039K707K96k128k593o2K585K523o42k952j889J271L029J220j722
1671A003k540p93J689K534N80k001k515k66K300K447k39k824k195J109K836J510
$$ plain form
1687 2635 1182 -1592 -2541 -750 1736 2373 412 -2018 -2261 43 2230 2026 -306 -2397 -1737 995
1703 995 2521 1480 -999 -2467 -1087 1756 2552 637 -1916 -2349 -127 2235 1971 -467 -2253 -1845
1719 -1845 577 2345 1322 -1144 -2338 -1248 1289 2525 632 -1850 -2190 -259 2086 2191 -200
1734 -200 -2099 -1581 617 2396 1639 -974 -2191 -917 1271 2365 845 -1781 -2180 -251 1764 1985
1750 1985 -24 -2153 -1851 266 1911 1522 -842 -2557 -1250 1189 2100 861 -1483 -2275 -315 1850
1766 1850 1876 192 -1791 -1778 474 2110 1551 -422 -2012 -1255 1210 2201 707 -1186 -2078 -728 1672
1783 1672 1920 -32 -1847 -1944 57 2042 1320 -788 -1960 -1276 796 2083 741 -1167 -1589 -709 1182
1800 1182 2208 482 -1553 -1687 -22 1925 1809 -497 -1924 -1100 691 1935 1090 -1192 -1837 -554
$$ packed form
1687B635j453k774r49J791K486O37j961k430k43K304K187k04k332k091O60K732
1703I95J526j041k479j468J380K843P96j915k553m33K222K362k64k438j786M08
1719a845K422J768j023k466j194J090K537J236j893k482l40J931K345J05k391
1734b00j899N18K198J779p57k613j217J274K188J094j520k626l99J929K015K21
1750A985k009k129L02K117J645l89k364j715J307K439R11j239k344p92J960K165
1766A850K6j684j983J3K252J636n59j973j590P57K465R91j494j893q92J350K400
1783A672K48j952j815r7K001J985p22k108j172O84K072J287j342j908m22Q80J891
1800A182J026j726k035j34J665J947j16k306j427Q24J791J244q45k282o45J283
$$ plain form
1816 -554 934 1656 575 -1605 -1852 -110 1452 1511 -225 -1865 -1304 559 1661 1206 -718 -1962 -716
1833 -716 1291 1708 678 -1203 -1833 -79 1695 1443 -100 -1538 -1401 380 1605 997 -657 -1801
1849 -1801 -1114 892 1684 457 -1083 -1612 -562 1401 1682 33 -1434 -1454 171 1873 1254 -607 -1588
1866 -1588 -867 949 1797 541 -1009 -1279 -421 1011 1548 326 -1320 -1469 -35 1474 1303 -540 -1856
1883 -1856 -1042 642 1640 680 -1165 -1561 -374 1042 1426 354 -1243 -1344 139 1477 1289 -174 -1442
1900 -1442 -953 638 1565 883 -631 -1437 -596 1078 1410 315 -1184 -1525 -127 1319 1068 -341 -1469
1917 -1469 -1117 403 1341 745 -725 -1382 -584 901 1395 411 -953 -1128 -101 1205 1349 44 -1203
1934 -1203 -1044 370 1423 936 -541 -1446 -681 867 1344 319 -1043 -1273 -229 849 947 -4 -1214
$$ packed form
1816e54J488P22j081k180k47J742J562N9j736j640N61J863J102m55j924j244J246
1833g16K007M17j030j881o30J754J774k52j543j438J37J781J225o08j654j144
1849a801O87K006P92j227j540n29J050J963K81j649j467k0J625J702o19j861r81
1866a588P21J816Q48j256j550k70Q58J432N37j222j646j49J434J509j71j843j316
1883a856Q14J684R98r60j845l96J187J416L84j072j597j01J483J338j88j463j268
1900a442M89J591R27o82j514q06Q41J674L32j095j499l41J398J446k51j409j128
1917a469L52J520R38n96j470o57P98J485M94r84j364j75J027J306J44j305j247
1934a203J59J414J053m87j477r05P65J548M77j025j362k30J044J078R8r51j210
$$ plain form
1951 -1214 -1248 50 1131 856 -376 -1298 -786 667 1346 642 -679 -1146 -232 1080 1266 212 -920
1968 -920 -1051 134 1268 947 -367 -1187 -717 461 1129 496 -657 -1172 -512 627 1117 168 -1014 -1172
1986 -1172 -121 1033 1045 -269 -1143 -717 439 1180 794 -521 -1041 -328 813 1171 404 -793 -971 -57
2004 -57 906 1003 3 -1092 -908 201 1028 713 -503 -1277 -688 616 971 258 -769 -1158 -320 853
2022 853 1003 56 -929 -913 345 1176 809 -265 -981 -488 695 1160 459 -566 -911 -278 735 1031 43
2041 43 -940 -1019 -12 1101 739 -465 -1114 -686 406 1087 436 -692 -967 -283 641 998 220 -797 -820
2060 -820 88 938 951 -54 -889 -595 377 939 638 -511 -1025 -305 591 896 238 -787 -945 -155 764
2079 764 806 -122 -947 -783 275 891 544 -414 -915 -375 569 874 326 -471 -812 -145 749 942 114 -791
$$ packed form
1951a214l4J298J081k75j232r22N12J453O79p04j321m67R14J312J86j054j132
1968i20j31J185J134l21j314q20M70J178O68o33j153n15O60J139M90r49j182j58
1986a172J051J154J2j314q74M26J156P41l86j315n20P13J141L58p67j197j78R14
2004e7R63R7j000j095J84J109Q27l15j216p74N89J304L55p13j027l89Q38J173
2022H53J50r47r85J6J258Q31l67j074p16M93J183M65p01j025l45O33J013K96r88
2041D3r83p9J007J113l62j204o49M28J092O81o51j128k75O84R24L57p78j017k3
2060h20R08Q50J3j005q35K94R72N62l01j149n14P20Q96L05o58j025j58P90R19
2079G64M2r28q25J64J058O16l47r58n01N40R44L05n48p97l41O67Q94J93q28r05
$$ plain form
2099 -791 -737 166 914 611 -411 -898 -531 433 754 213 -559 -771 -287 565 808 90 -708 -785 8 773
2119 773 767 -153 -767 -568 300 903 525 -371 -866 -272 637 898 187 -742 -696 -52 690 645 -111 -791 -688
2140 -688 174 749 462 -377 -867 -463 434 844 227 -512 -810 -137 744 785 36 -702 -642 221 917 579 -329
2161 -329 -761 -308 452 802 266 -490 -694 -256 447 749 74 -808 -830 5 791 627 -340 -929 -440 369
2181 369 790 317 -440 -780 -148 620 757 212 -625 -692 187 734 641 -46 -698 -515 254 737 409 -344 -955
2202 -955 -390 534 692 62 -673 -783 -40 696 497 -163 -597 -549 229 779 468 -240 -596 -316 459 836
2222 836 278 -389 -533 -112 603 749 -11 -617 -580 51 751 477 -448 -741 -417 317 617 182 -537 -632 -227
2243 -227 387 631 140 -613 -528 73 623 692 -96 -671 -324 383 709 442 -357 -693 -137 457 646 180 -612
$$ packed form
2099g91N4R03P48l03j022m87L67R64L21n41p72k12M84Q52K43p18p98p7P93P65
2119G73or20o14J99Q68O03l78q96m95N94R09K61p11r29M6O44P42m5p56o80J03
2140f88Q62N75k87q39m90M04Q97M10o17p39k98O73Q81M1p49p38O0Q63O96l38r08
2161c29m32M53P60L50n36p56k04M38P03L02o75q82k2Q35P86j64r67n89M89Q09
2181C69M21m73p57l40O32P68J37n45q37o7Q79N47r3o87o52J83P69M83l28p53o11
2202i55N65R24J58o30p35j10P43P36j99o60m34M8P78N50l11p08l56K80P75L77
2222H36n58o67j44M21P15J46p60o06L7O31P00k74r25k93L24P34L00m35p19r5M05
2243b27O14K44m91p53Q5O01N50O9p88n75L47P07L26k67p99l36N56N94J89m66p92
$$ plain form
2264 -612 -663 38 508 432 -95 -653 -588 104 532 413 -227 -798 -449 435 713 208 -505 -697 33 692 584
2285 584 -65 -458 -407 111 724 543 -181 -583 -403 354 789 255 -473 -684 -192 454 553 -60 -667 -573 -9
2306 -9 590 470 -273 -712 -369 255 713 347 -375 -558 -101 474 713 188 -520 -466 26 637 614 -101 -705
2327 -705 -431 227 661 362 -352 -701 -275 392 530 49 -632 -634 -94 563 494 -103 -593 -412 222 617 399
2348 399 -216 -531 -248 383 713 293 -465 -574 -7 613 571 -80 -556 -395 139 495 321 -193 -641 -417
2368 -417 229 511 255 -436 -639 -149 479 569 13 -549 -471 159 659 516 -110 -554 -287 348 614 309 -252
2389 -252 -543 -191 455 551 85 -455 -596 -45 475 453 -187 -601 -528 176 606 203 -386 -575 -266 378 600
2410 600 208 -402 -476 -26 548 593 12 -512 -362 142 641 472 -208 -625 -307 257 576 209 -459 -716 -79
$$ packed form
2264f12n1P01M70p6n27n58O5O92M28j19o40n71L49Q84K78n05p13j92P30O59j08
2285E84o49l93N1N18O13j81p24m02J80P57M35n34p28k11M92O46R9o13o07R4N64
2306iN99j20p43m39L43O24M58l66p22j83M57N75K39n25p08N4M92O11k3p15o04
2327g05K74O58M34k99p14l49M26O67J38m81o81kN40O57o9n97m90J81O34L95k18
2348C99o15l15K83O31L30m20p58j09N67O20m2o51m76J61N34L56j74n14m48K24
2368d17O46K82k56o91k03M90O28R0n56n62P8O30N00j43o26m44K67O35K66l05n61
2389b52k91L52O46R6m66n40j41N51N20k2o40m14P3P04M30m03n89j89L09O44K22
2410F00l92o10p4M50N74M5n81n24J50N04M99j69o80m17L18N64L19l67o68k57O37
$$ plain form
2431 -79 471 492 -38 -675 -455 103 501 300 -133 -612 -320 353 574 410 -325 -590 -121 569 608 102 -448
2452 -448 -429 184 626 392 -139 -603 -417 316 644 174 -388 -646 -221 450 524 -46 -488 -577 -46 518 456
2473 456 -131 -571 -411 232 742 356 -350 -531 -165 533 667 101 -480 -406 22 536 488 -98 -581 -392 115
2494 115 465 369 -366 -651 -271 192 535 233 -468 -584 -76 500 565 5 -560 -422 180 596 402 -147 -508
2515 -508 -213 340 530 209 -306 -617 -132 464 481 19 -560 -569 13 542 385 -145 -636 -407 310 579 267
2536 267 -392 -572 -128 462 609 109 -404 -405 101 559 481 -35 -493 -385 152 649 368 -270 -607 -257 378
2557 378 578 93 -600 -606 -66 439 469 -89 -545 -423 148 574 416 -224 -557 -235 398 630 287 -416 -586
2578 -586 12 552 535 -12 -530 -468 120 532 342 -243 -665 -359 301 598 170 -447 -621 -190 424 545 -92
$$ packed form
2431g9N50K1n30o37K20N58L98k01m33m79K92O73K21j64p35k65M69O90L9n06n50
2452d48J9O13M42k34n31m64J86P33L28m70n62k58M25O71P4n70m42q9N31N64o2
2473D56n87m40J60O43N10l86p06j81L66O98J34n66n81P4M28N14m8n86m83J89N07
2494A15L50r6p35k85L80M63L43l02p01j16N08N76O5n60n65J38O02M16j94n49l61
2515e08K95N53J90l21n15l11M85N96J7m62n79rN82N29j57n30m91K29P17K69l12
2536B67o59j80M44N90J47n00n13jN06M58p8n16m58J08N37M97k81o38l37L50O35
2557C78K00m85o93oN40N05L0n58m56J22N71M26j58o40l33L22O33K32l43p03j70
2578e86N98N40j7n47n18O2N88M12j90n85m22L06O60K97m28o17j74M31O14J21o37
$$ plain form
2599 -92 -584 -430 106 624 437 -145 -584 -303 329 673 377 -358 -544 -132 581 617 -8 -589 -500 115 501
2620 501 445 -200 -651 -429 205 534 256 -384 -654 -152 409 523 102 -489 -535 24 519 485 -96 -547 -330
2641 -330 332 657 320 -249 -523 -229 361 595 104 -422 -562 -100 465 447 -157 -623 -413 156 537 259
2661 259 -236 -568 -308 276 601 204 -428 -585 -44 571 641 -12 -499 -339 138 586 398 -154 -525 -313
2681 -313 311 531 289 -437 -570 -156 428 513 -33 -590 -588 11 508 449 -218 -608 -381 367 614 260 -357
2702 -357 -526 -111 456 584 135 -468 -446 106 582 472 -103 -602 -422 249 616 299 -385 -669 -264 429
2722 429 563 26 -542 -551 35 592 428 -109 -614 -323 300 695 323 -299 -541 -213 426 616 130 -442 -548
2743 -548 7 601 492 -99 -615 -417 201 552 273 -319 -679 -306 365 533 50 -529 -585 4 464 482 -70
$$ packed form
2599i2m92J54N36N18j87n82m39K81O32L44k96p35j86M12P13L6o25n81Q9O15L86
2620E01n6o45m51K22O34L29k78o40k70N02N61J14m21n91m6N59M95l4n81m51K17
2641c30O62L25l37n69k74K94N90K34m91n26j40M62N65j8o04m66K10N69L81k78
2661B59m95l32K60N84L25l97o32j57N41O15P0o53m87J60M77M48j88n52l71K12
2681c13O24K20k42p26j33M14N84Q5n46n57KN99M97n9o67l90K27P48K47l54o17
2702c57j69M15N67J28m49o03K2N52M76j10n75m99J80O71L67l17o84k84M05O93
2722D29J34n37n68rN86N57j64n37n05K91O23L95l72o22k42L28O39J90m86n72j06
2743e48N55N94j09n91n16J98O18L51k79n92l60L73O71J68m83n79n6N89M60J8n52
$$ plain form
2764 -70 -529 -376 208 596 416 -245 -572 -236 402 638 147 -476 -531 -16 473 421 -119 -579 -422 110 487
2785 487 344 -300 -686 -372 267 546 177 -427 -574 -150 500 547 55 -536 -409 201 659 394 -194 -536
2805 -536 -198 380 541 204 -322 -536 -110 373 465 39 -518 -546 0 552 351 -213 -632 -470 237 578 242
2826 242 -370 -610 -194 485 609 36 -412 -423 109 640 519 -96 -456 -302 211 603 328 -324 -617 -239
2846 -239 390 593 101 -559 -579 23 510 412 -179 -592 -383 139 538 292 -305 -581 -202 408 633 192 -434
2867 -434 -516 36 566 509 61 -550 -407 244 610 395 -259 -679 -297 488 564 94 -476 -599 -113 537 484
2888 484 -89 -563 -424 117 609 363 -198 -611 -226 395 647 197 -396 -508 -87 544 556 -41 -577 -436
2908 -436 113 594 366 -302 -609 -327 326 602 160 -433 -541 -156 388 569 40 -547 -464 153 589 410
$$ packed form
2764g0m59J53N84L88j80o61l27L36O38K36m91o23n5N15M89n2n40m60J57N32L77
2785D87j43o44l86L14O39K79l69o04j47M24O50M7m92n91J27O10M58k65n88l42
2805e36L38N78J61l37n26k14M26M83R2m26n57k8N46N52k01n64m19J62P07L41l36
2826B42o12k40M16O79J24n73m48j1N32N31j21o15l60J54N13L92k75o52k93L78
2846b39O29K03m92o60k0O02M87r8n91m13K09N22L99k46n97k76L79O10K25m41o26
2867d34q2N52N30n7m48o11J43O51L66k15o54m20L82P85P6m70n70j23M86O50n3
2888D84n73m74J39N41M92k46n61m13L85O21K52m50n93j12M21O31J2n97n36J41
2908d36N49M81k28o68l07K82O53K76m42n93j08L85N44J81n29n87Q3O17M36j79
$$ plain form
2928 410 -202 -533 -243 314 623 242 -324 -555 -69 436 510 10 -533 -497 87 522 348 -149 -558 -379 242
2949 242 585 235 -343 -603 -186 407 539 53 -450 -485 106 533 453 -129 -476 -338 255 571 294 -270 -583
2970 -583 -184 432 559 79 -457 -509 -27 489 394 -170 -561 -418 146 538 269 -309 -596 -203 355 518 150
2991 150 -482 -488 -32 474 542 1 -477 -398 149 617 346 -305 -592 -217 411 515 67 -440 -528 -95 459 407
3013 407 -113 -549 -478 106 526 375 -260 -578 -297 356 636 237 -380 -482 4 464 460 -10 -460 -385 212
3034 212 550 297 -194 -566 -274 241 469 136 -389 -592 -135 422 462 -6 -549 -439 119 504 353 -210
3054 -210 -480 -302 321 515 257 -260 -440 -50 460 541 51 -451 -406 63 515 370 -200 -554 -346 145 467
3075 467 156 -399 -510 -183 336 526 47 -433 -483 64 527 429 -87 -466 -262 252 546 266 -281 -480 -109
$$ packed form
2928D10o12l31K90N57L09l81n66k31M86N05P4n00n43L6N84M35j74m97m09J79O21
2949B42L43l50n78k60M17N93J32m86n03l5N91M27q0n82l47J38N93L16k77n64l13
2970e83L99O16J27m80n36n2M82N16r5n64l91J43N64L92k69n78k87L93N58J63l68
2991A50o32oM56N06O8n41m78P9N47M68k71o51k87L75O28J04m48n07q8M33N54n2
3013D07n20m36P1N84M20j51o35l18K81O53K80l99o17j02M86M60mm70m50P5N97
3034B12L38k53m91l72K92N15K28l33n25k03M57N57M0m68n43J10N58L85j51n63
3054b10k70J78O23J94k58n17j80L90N10Q1m90n02M5M69M52j45n70l54K08M91L22
3075D67l11n55j11L27N19J90m79m80n0N47M63r8n16l79K04N14K94k80n47j99L71
$$ plain form
3096 -109 336 529 155 -421 -407 -2 457 427 -118 -550 -387 170 484 279 -347 -504 -211 298 403 89 -361
3117 -361 -454 -79 415 425 -5 -477 -347 173 599 321 -215 -451 -212 322 509 163 -351 -442 -62 403 406 -80
3139 -80 -408 -421 116 480 340 -276 -494 -225 220 558 204 -314 -435 -85 428 493 -8 -412 -354 138 454
3160 454 305 -143 -441 -247 286 467 222 -328 -505 -98 377 397 -15 -415 -402 30 414 336 -194 -501 -269
3181 -269 231 498 270 -292 -439 -68 452 448 29 -332 -378 76 386 305 -91 -436 -265 185 464 186 -247
3202 -247 -482 -166 338 417 -32 -420 -406 -11 401 371 -78 -445 -258 177 422 281 -221 -389 -112 321 456
3223 456 112 -285 -407 -25 425 402 -106 -452 -313 118 350 234 -169 -468 -273 249 400 73 -331 -407 -68
3244 -68 334 308 -68 -347 -311 154 435 326 -107 -415 -214 246 480 195 -257 -383 -69 315 405 -2 -383
$$ packed form
3096a09M45J93l74n76J4M05M59l0n45m32J63N57L14k05o26j57K93N09J05l14m50
3117c61r3L75M94J0m30m72J30N20M26k78n36k36K39N34J87l46n14r1L80M65Lm86
3139h0l28j3N37L64j40o16k18K69M45L38l54n18j21L50N13O5n01m04N8M92L16
3160D54j49m48k98J94N33J81k45n50j77M07M75K0m12m00J3M32L84p8n30l07K32
3181b69N00K67k28n62j47L71N20mm19l61m6M54L10q1l96l45J71M50K79k78m33
3202b47k35L16N04P9m49l88J4L95M12l0m49l67J87M35K45j41n02j68K77M33J35
3223D56l44l97j22L82M50k3n08l46J39M31K32j16m03k99J95N22J51l27m04p6L39
3244f8M02k6l76k79L6M65K81j09m33l08K01M60K34k85m52j26L14L84R0m07l81
$$ plain form
3265 -383 -330 28 379 252 -197 -489 -202 205 432 176 -261 -438 -42 315 393 101 -310 -295 71 429 319
3286 319 -40 -351 -226 239 390 222 -210 -422 -106 316 351 36 -341 -365 17 365 225 -107 -390 -342 123
3307 123 389 169 -273 -406 -176 300 354 108 -285 -347 47 436 361 -2 -363 -241 125 369 278 -264 -391
3328 -391 -169 256 367 32 -303 -347 -71 303 304 -65 -372 -261 64 363 243 -203 -398 -107 251 382 124
3349 124 -249 -323 -27 254 373 -2 -285 -251 71 356 260 -100 -321 -190 153 309 167 -280 -380 -88 261
3370 261 286 -30 -339 -409 9 321 249 -64 -326 -208 149 352 204 -150 -283 -82 294 332 37 -286 -300 10
3392 10 329 292 -77 -268 -237 114 313 190 -158 -361 -158 196 326 43 -292 -258 -32 291 264 -29 -331 -236
3414 -236 103 351 215 -87 -343 -185 232 346 120 -258 -345 -33 270 278 -42 -345 -301 79 291 168 -179
$$ packed form
3265c83N3L58L51j27m49k92K87M07K27k56m37j77L96L57P8k92m11J5L66L58j10
3286C19l59l11J25M65J51j68m32k12L16M22L5l15l77k4L82L48j40l32k83M8M65
3307A23K66k20m42j33K30M76N4k46l93o2L94L89p5l63l61J22L66K44r1n42j27
3328c91K22M25J11l35l35m4K76L74Jl69l07J11L25K99j20m46j95K91L58J31k58
3349A24l73p4K96K81J19l75k83L4L22K85r6l60k21J31L43J56j42m47j00K92L49
3370B61K5l16l09p0M18L12p2l13k62J18L57K03j48l54j33K01L76L8k95l23j4L10
3392A0L19l7l69j91L1L51J99j23l48k03K03L54J30k83l35L4K26L23k7k93l02R5
3414b36L39K48j36l02k56J58M17J14k26l78q7L12L03Ql20l03M4L80K12j23l47
$$ plain form
3435 -179 -325 -115 195 343 53 -262 -342 -12 262 329 68 -293 -246 111 246 260 -116 -326 -207 175 345
3456 345 67 -285 -329 -70 190 215 -58 -279 -319 50 236 212 -114 -280 -134 160 311 137 -166 -257 -12 314
3478 314 334 44 -208 -235 42 261 247 -28 -202 -223 119 290 168 -208 -309 -145 129 207 20 -215 -257 -22
3500 -22 264 234 -36 -279 -208 96 291 193 -80 -207 -86 196 281 139 -131 -213 11 255 246 17 -184 -216 47
3523 47 268 183 -164 -340 -117 150 253 79 -224 -307 -64 168 259 -7 -151 -142 6 238 237 -16 -197 -178 132
3546 132 296 169 -111 -252 -63 208 215 5 -281 -276 -1 244 190 -59 -300 -247 49 224 95 -151 -274 -90
3568 -90 216 266 59 -156 -217 19 228 239 -47 -220 -167 137 240 213 -70 -256 -108 153 230 83 -239 -254 -40
3591 -40 156 262 -75 -216 -202 110 239 144 -102 -285 -111 132 220 83 -134 -188 42 233 220 26 -156 -179
$$ packed form
3435a79j46K10L10J48k90l15q0L30K74O7k61l61M7L57J35J4l76k10J19L82J70
3456C45k78l52m4K59K60K5k73k21m0L69J86k4l26j66J46K94J51j74l03r1K45L26
3478C14K0k90k52k7K77K19j4k75j74k1L42J71j22l76j01J64K74P8j87k35m2K35
3500b2K86l0k70k43P1L04J95r8k73j27J21K82Q5j42k70q2K24K44rk29k01l2K63
3523D7K21q5l47j76K23K67J03j74l03q3K43K32R1k66j44RJ48K32jk53j81J9L10
3546A32J64j27k80j41J89K71Pk10k86NK75K45n4k49k41N3K96J75j29k46j23J84
3568i0L06N0k07k15o1K36K09J1k86j73N3L04J03k7k83j86J48K61P7j47l22j5K14
3591d0J96J06l37j41J4L12J29r5k46j83J74K43Q8j37k17n4K30J91j3j94j82k3
$$ plain form
3613 -179 22 208 226 -69 -260 -165 112 245 45 -146 -259 -44 131 207 -20 -194 -169 -39 157 162 -73 -221
3635 -221 -189 78 233 159 -63 -282 -94 208 265 114 -150 -158 9 222 221 -8 -188 -160 36 169 115 -58 -200
3658 -200 -105 123 222 80 -161 -267 -69 150 268 46 -173 -167 76 204 154 -23 -195 -143 84 196 56 -101
3680 -101 -201 -45 174 181 22 -115 -197 -39 148 123 -71 -225 -167 84 289 113 -164 -206 -26 153 210 57
3702 57 -154 -135 28 147 179 49 -193 -128 47 233 111 -84 -219 -62 103 170 36 -220 -198 -84 147 188
3724 188 -9 -224 -168 66 203 121 -114 -242 -111 160 274 76 -77 -208 -13 261 193 9 -129 -189 3
3745 3 210 164 -37 -188 -121 57 216 38 -127 -269 -92 119 180 -18 -193 -134 -15 144 153 -5 -179 -150 34
3768 34 244 153 -77 -220 -49 158 212 86 -163 -197 21 151 176 -3 -201 -187 95 174 88 -84 -218 -137 79
$$ packed form
3613a79K01J86J8k95j91R5K77J33k00j91j13K15J75P6k27j74K5J30J96Nk35j48
3635b21L2K67J55p4k22k19J88L02N7j51k64qJ67K13jk29j80K8J96J33n4j73j42
3658b00R5K28R9j42k41j06J98K19J18k22k19OK43J28n0j77j72N2K27J12j40j57
3680a01j00J56K19Pj59j37q2J58J87k5j94j54N8K51K05j76k77m2J80J79N7j53
3702E7k11J9J63J19L2j30k42O5J75J86j22j95j35J57J65O7j34k56K2J14K31M1
3724A88j97k15N6K34J37q2k35j28J31K71J14j98j53j31J95K74o8j84j38o0J92
3745CK07m6k01j51O7J78J59j78j65j42J77K11O1j98j75N9J19J59Rj58j74K9J84
3768C4K10r1k30j43J71K07N4j26k49l4K18J30K5j79j98J4K82P9q6j72j34Q1K16
$$ plain form
3791 79 154 7 -98 -224 -12 157 189 -21 -173 -113 114 227 187 -47 -257 -91 109 254 91 -145 -188 -82
3813 -82 110 174 -7 -137 -158 -18 163 134 -54 -197 -105 68 176 56 -113 -155 -54 111 239 79 -154 -244
3835 -244 21 207 159 21 -158 -134 57 203 108 -84 -270 -75 147 180 -10 -124 -216 -73 156 202 31 -148
3857 -148 -149 35 248 159 -36 -199 -78 101 277 124 -107 -158 3 133 209 72 -144 -169 29 217 186 -62
3879 -62 -228 -141 59 214 112 -125 -217 -103 104 188 21 -121 -161 -35 211 173 15 -137 -97 106 236 158 -64
3902 -64 -182 -59 153 254 124 -114 -121 -31 185 168 5 -169 -219 34 170 114 -88 -162 -147 112 270 30 -127
3925 -127 -159 -57 145 224 31 -130 -172 37 230 148 -35 -164 -109 92 165 146 -46 -240 -98 131 184 51 -180
3948 -180 -230 -62 147 180 16 -214 -153 65 254 171 -86 -204 -146 126 227 107 -142 -204 -53 213 223 -5
$$ packed form
3791G9P5j47j05j26K12J69L2k10j52O0K27J13m0k34k10J66K00J45j63k36m3J06
3813h2J92O4j81j30k1J40J81k9j88j43R2J73J08j20j69m2J01J65J28j60k33r0
3835b44K65J86m8j38j79K4J91J46r5j92j86J95K22L3j90j14r2J43K29M6j71j79
3857a48jJ84K13q9j95j63J21J79J76j53k31n1J61J30P6j37k16k5J98J88l1k48
3879f2j66Q7K00J55j02k37r2J14K07Q4j67j42m0J26K46l8j58j52M0K03J30p8k22
3902f4j18J23K12J01j30k38pR0K16j7j63j74n0K53J36n6k02p4J5K59J58k40j57
3925a27l2J02K02P9j93j61m2K09J93q2j83j29N5K01P3j9j92j94J42K29N3j33k31
3948a80n0J68K09L3j64k30O1K18J89q3k57j18N8K72J01j20k49o2J51K66J0k28
$$ plain form
3970 -5 -240 -208 -13 192 222 -109 -255 -160 127 255 63 -155 -217 -31 176 214 1 -163 -209 -12 210 141 -30
3993 -30 -211 -141 80 250 164 -132 -245 4 164 235 51 -216 -207 -11 228 170 -65 -204 -233 39 213 125 -174
4016 -174 -222 -106 162 217 -6 -184 -221 -13 224 245 -27 -218 -157 140 337 172 -36 -205 -75 126 237 94
4038 94 -178 -251 -30 199 181 -39 -255 -235 40 196 121 -78 -250 -130 136 214 43 -183 -225 -48 179 247 27
4061 27 -181 -159 48 235 163 -25 -212 -150 140 240 130 -86 -239 -57 158 241 43 -210 -223 -47 186 195 -54
4084 -54 -196 -135 105 268 129 -128 -305 -86 206 258 87 -160 -236 -8 232 264 -63 -210 -176 90 277 125
4106 125 -152 -215 -174 95 276 70 -215 -253 -72 279 254 -39 -243 -183 74 255 143 -72 -274 -153 181 322
4128 322 115 -181 -277 -94 265 231 -19 -299 -258 59 240 150 -94 -267 -158 157 286 119 -172 -295 -128
$$ packed form
3970ek35L2J95K05L0l31j46R5K87J28j92k18o2J86K07L8k13j64m6J97K22o9j71
3993c0j81P0K21J70q6k96j13K49J60P1j84k67RJ96K39n8k35j39k9K72J74q8k99
4016a74m8J16K68N5k23j78l7K08K37K1k72j91O1K97J97j65k08j69J30K01J11j43
4038I4k72p3K21K29j8k20k16K0K75J56p5j99j72J20K66P8j71k26m2J77K27O8k20
4061B7k08K2K07J87p2j88j87O2K90J00j10k16j53J82K15Q3j98k53j3J76K33Rk49
4084e4j42O1K40J63j39k57j77K19K92N2j71k47p6K28K40L2l27j47L4K66J87j52
4106A25k77o3M1K69J81k06k85l8J81L51k5k93k04O0K57J81j12k15k02J21L34J41
4128C22k07k96r6J83L59l4k50k80M1L17J81r0k44j73J09L15J29j67k91j23J67
$$ plain form
4149 -128 195 298 56 -220 -200 61 273 159 -60 -301 -107 151 315 157 -127 -229 -118 193 295 10
4169 10 -219 -230 69 236 245 -124 -317 -218 78 310 129 -158 -294 -53 173 282 71 -217 -272 27 306 212
4191 212 -5 -248 -196 162 297 161 -152 -292 -106 198 266 64 -198 -245 -50 247 221 -34 -258 -229 129 316
4213 316 189 -162 -254 -92 164 284 104 -195 -233 2 230 281 -14 -248 -239 70 351 234 -150 -343 -143 178
4235 178 281 143 -218 -291 -69 206 271 18 -281 -271 39 263 270 -67 -309 -157 158 291 180 -214 -344 -35
4257 -35 222 217 41 -278 -292 -1 267 268 -131 -326 -150 126 263 164 -195 -321 -93 235 270 67 -253 -299 43
4280 43 338 262 -42 -292 -198 139 402 173 -180 -312 -64 245 285 67 -223 -259 -28 259 249 -83 -303 -167
4302 -167 75 288 162 -172 -343 -136 184 280 -2 -226 -297 14 261 183 39 -304 -232 128 356 199 -132
$$ packed form
4149a28L23J03k42k76K0K61K12j14k19k41J94K58J64j58k84j02J11L11J02k85
4169A0k29j1K99J67Rl69j93R9K96K32j81k87j36K41K26J09k11k88n5K99K79r4
4191B12k17k43N2L58J35j36l13j40J86L04O8k02k62m7J95K97k6k55k24K9L58J87
4213C16j27l51r2J62K56J20j80k99l8K35K28N1k95k34RL09K81j17l84j93K00L21
4235A78J03j38l61p3K22K75O5k53k99J0L10K24Pl37k42J52L15J33j11l94j30L09
4257c5K57nj76l19j4K91K68Jl99j95J76K76J37r9l59j26K28L28L5k03l20m6L42
4280D3K95p6l04k50R4L37K63k29l53j32K48L09M0k18k90l6K31K87j0l32k20J36
4302a67K42K13j26l34j71K07L20R6k82k24p1L11K47p8j44l43P2L60K28j57l31
$$ plain form
4323 -132 -330 -156 216 326 120 -255 -297 -63 209 243 -31 -284 -274 79 254 241 -122 -306 -170 172 330
4344 330 171 -202 -277 -75 213 280 19 -279 -255 92 320 235 -90 -301 -146 91 318 159 -169 -325 -20
4365 -20 295 328 0 -287 -227 74 227 215 -111 -275 -116 180 329 134 -158 -321 -32 279 313 62 -249 -306
4387 -306 11 334 234 -73 -283 -268 80 304 162 -210 -341 -96 228 285 71 -294 -314 -1 236 221 -68
4408 -68 -243 -263 95 292 188 -93 -282 -89 259 313 70 -226 -298 17 323 306 -34 -332 -181 105 241 131
4430 131 -127 -348 -89 182 251 103 -207 -275 -5 286 292 34 -259 -247 64 291 224 -75 -304 -134 213 311
4452 311 148 -232 -306 -37 239 296 37 -238 -242 83 280 184 -110 -340 -162 151 282 136 -201 -285 -50 250
4474 250 247 -8 -261 -265 83 315 226 -82 -276 -170 129 319 130 -218 -383 -105 237 346 -16 -273 -234 19
$$ packed form
4323a32j98J74L72J10k06l75m2K34K72L4k74k53J0L53J75j3l63j84J36L42J58
4344C30j59l73p5K02K88O7k61k98K4L47K28q5l25k11J55K37K27j59l28j56L05
4365b0L15L3l28k87O0L01J53j2l26j64J59K96J49j95k92j63K89L11L4k51l11n7
4387c06L17L23j00l07k10J5L48K24j42l72j31K45L24N7k14l65k0L13K37j5k89
4408f8j75k0L58J97j04k81j89J93L48N4k43k96p2L15L06j7l40k98J51K86J36j10
4430A31k58k21K59K71O9j48l10o8K70K91Ok58k93J2L11K27o7k99k29J70L47R8
4452C11j63l80p4K69K76N7k59k75mL25J97r6k94k30J78L13J31j46l37q4K35L00
4474B50lk55k53mL48K32q9l08j94J06K99J90j89l48j65K78L42J09l62k57L9K53
$$ plain form
4496 19 300 216 -68 -277 -176 118 306 199 -111 -227 -62 260 306 88 -222 -269 32 245 203 -49 -273 -205
4518 -205 103 259 202 -144 -294 -147 121 279 96 -201 -284 -63 311 244 -50 -293 -244 16 281 181 -148
4539 -148 -273 -100 192 294 88 -233 -299 -12 235 269 -14 -336 -228 100 308 150 -96 -269 -125 118 282
4560 282 99 -186 -276 -84 221 206 4 -276 -240 32 258 174 -107 -244 -97 97 291 111 -194 -283 -48 186
4582 186 240 59 -232 -290 16 301 206 -68 -264 -124 91 261 116 -192 -305 -41 168 269 99 -212 -302
4603 -302 62 255 220 -110 -299 -228 128 295 101 -169 -327 -147 217 293 107 -173 -268 -42 248 226 6 -256
4625 -256 -164 99 264 135 -165 -229 -98 204 300 52 -167 -275 -8 236 230 -25 -224 -237 41 265 182 -99
4647 -99 -257 -170 170 284 93 -219 -242 -58 163 244 24 -215 -223 83 225 177 -91 -253 -170 136 288 104 -160
$$ packed form
4496A9K81q4k84k09J01K94J88j07l10j16J65L22M6k18l10m7L01K13m2k52k24O8
4518b05L08J56n7l46j50J47K68J58j83k97q3K21L74o7k94k43M9K60K65j00l29
4539a48j25J73K92J02k06l21o6K87K47L4k83l22J08L28K08j58k46j73J44K43J64
4560B82j83k85r0J92L05j5k02k80L6K72K26q4k81j37J47J94J94j80l05q9K35K34
4582A86N4j81k91n8L06K85r5k74j96J40K15J70j45l08j13K64K09J01j70l11r0
4603c02L64J93l5l30j89P1L56J67j94k70j58J80L64P6j86k80r5K26K90k2k20k62
4625b56R2K63J65j29l00o4J31L02R6k48k19j08K67K44ok55j99j3K78K24q3k81
4647i9j58Q7L40J14j91l12k3J84K21Q1k20k39qL06J42m8k68j62Q3L06J52j84k64
$$ plain form
4670 -160 -256 -45 214 221 24 -188 -226 1 292 191 -101 -298 -147 104 224 117 -166 -282 -56 179 205 -17
4692 -17 -204 -245 55 237 182 -56 -248 -152 107 256 143 -166 -237 -118 140 201 53 -173 -240 27 240 239 -38
4715 -38 -237 -196 56 289 100 -144 -233 -93 140 218 62 -240 -238 -20 248 220 -37 -205 -206 70 274 158 -76
4738 -76 -196 -112 158 275 94 -203 -213 -24 195 154 -51 -204 -164 26 235 145 -81 -226 -108 105 175 58
4760 58 -144 -209 -71 248 241 57 -213 -182 48 271 180 -81 -254 -160 128 197 61 -114 -254 -116 150 164 80
4783 80 -203 -209 -1 211 198 -73 -246 -119 145 227 128 -142 -229 -83 151 174 24 -164 -223 -32 174 170 -8 -235
4807 -235 -173 89 208 71 -71 -231 -52 124 241 44 -160 -225 16 220 190 -69 -212 -184 46 246 139
4828 139 -96 -239 -91 117 220 79 -185 -179 -7 174 250 7 -204 -194 5 204 150 -68 -196 -110 129 215
$$ packed form
4670a60r6K11K59Pj97k12l8K27K91j01k92j97J51K51J20j07k83j16K26K35K6k22
4692a7j87m1L00J82n5k38j92R6K59J49j13l09p1J19K58O1j48k26o7K67K13jk77
4715c8j99M1K52K33j89k44q9J40K33P8j56l02KK18K68k8k57j68jK76K04j16k34
4738g6j20Q4K70J17j81k97j0J89K19m1k05j53M0J90K09r0k26j45J18K13P0j17
4760E8k02o5J38L19pj84k70L1K30K23r1k61j73R4K88O9j36j75j40J38K66J4q4
4783H0k83oK08K12j3k71j73J27K64Q2r9k70q7J46K34K3j50j88n9J91K06mj78k27
4807b35O2K62J19j37j42j60J79J76J17j97k04o5K41K04l0k59j43K8K30K00j07
4828A39k35j43J48K08J03j41k64OJ72J81P6k43k11J0J99J99n4k18j28Q6K39Q6
$$ plain form
4850 215 27 -197 -216 -27 146 167 -25 -145 -166 45 154 127 -71 -192 -82 136 201 80 -158 -210 -88 92
4872 92 141 33 -165 -152 35 230 161 -118 -211 -156 73 274 118 -147 -197 -89 206 172 36 -205 -195 -36 165
4895 165 99 -38 -204 -166 105 124 111 -100 -225 -56 114 171 30 -190 -205 3 158 137 -25 -182 -168 79 180
4918 180 82 -87 -197 -121 102 163 53 -153 -144 -25 152 155 -9 -213 -214 44 165 167 -80 -157 -78 145 234 91 -144
4943 -144 -181 -14 149 182 -30 -135 -208 16 225 135 -25 -176 -146 56 174 104 -153 -216 -34 86 225 -8
4965 -8 -115 -133 25 187 151 -11 -164 -89 62 172 76 -109 -208 -85 85 218 22 -123 -163 17 188 172 -4
4988 -4 -183 -128 50 186 108 -135 -176 -78 140 235 43 -127 -143 29 102 112 -27 -193 -136 7 181 113 -72 -184
5012 -184 -85 119 225 41 -154 -146 5 170 179 16 -97 -152 29 168 137 -22 -163 -93 68 160 34 -78 -173
$$ packed form
4850B15j88k24j9J89J73K1j92j20k1K11J09k7j98j21J10K18O5j21k38n2J22J80
4872I2M9j08j98J3J87J95o9k79r3N5K29K01j56k65n0J08K95l4j36k41J0J59K01
4895A65o6j37j66L8K71J9j3k11j25J69J70N7j41k20j5K08J55k1j62j57J4K47J01
4918A80r8j69j10P6K23O1j10k06RJ19J77Lj64k04jK58J21Kk47p7P9K23Q9j43k35
4943a44l7J67J63L3k12j05p3K24K09r0j60j51L0K02J18p0k57o3J82J20J39k33
4965hj07j8J58J62l6j62j53P5J51J10r6j85r9J23J70J33j96j45m0J80J71j6j76
4988dj79N5J78J36p8k43m1R8K18R5j92j70j6J72P3J0j39j66N7J43J74o8j85j12
5012a84R9K04J06j84j95QJ51J65Rj63j13n5J81J39l1j59j41P0J61R2j26j12r5
$$ plain form
5035 -173 -64 86 150 52 -164 -157 -50 145 82 -19 -177 -89 79 181 89 -100 -163 -93 161 141 45 -108 -101 8
5059 8 195 145 18 -160 -65 65 101 89 -73 -156 -107 76 139 82 -133 -137 -35 160 167 -2 -155 -143 29 165 84
5084 84 -31 -128 -80 50 196 83 -138 -123 -17 130 157 3 -166 -53 89 160 148 -74 -219 -120 38 185 93
5107 93 -111 -197 -72 148 164 36 -170 -160 -16 108 148 -64 -114 -146 88 136 56 -115 -137 10 77 132 7 -101
5131 -101 -147 42 130 137 2 -137 -74 78 122 143 -42 -187 -58 88 128 71 -125 -111 -6 93 85 -32 -105 -92 31
5156 31 153 105 -30 -140 -77 70 132 91 -111 -145 -57 97 175 -7 -105 -115 8 179 90 -78 -122 -58 97 136 78
5181 78 -21 -89 -68 112 85 30 -110 -103 -30 186 98 -36 -170 -118 71 145 77 -60 -152 -25 117 149 40 -96 -116
5206 -116 -33 154 121 -12 -129 -140 17 140 65 -55 -120 -36 134 152 74 -57 -93 3 107 148 -8 -111 -106 43
$$ packed form
5035a73J09J50O4r8k16PJ07J95o3j01j58Q8J68J02r2j89o3P0K54k0r6j53PJ09
5059HJ87n0j27j78R5J30L6j2j62q3M9J83O3n7k15mJ02J95Pj69j53J2J72J36q1
5084H4j15r7M8J30J46j13k21J5J06J47K7j54j69J13J42P1j2k22j45R9J58J47r2
5107I3k04q6J25K20J6j28k06J0J44J24M0k12n0l2K34M8q0j71k2J47O7N5j25j08
5131a01m6J89Q8Pj35j39O3J52M4K1j85j45J29J46M0n7j96J4J05R9qj17p3J3J23
5156C1J22m8j35j10O3J47O2m1k02l4Q8J54P8j82r8j0J23J71q9j68m4O4J55L9n8
5181G8r9o8K1J80k7n5j40PP3K16q8j34j34N2J89P4o8j37r2J27J42L2j09j36k0
5206a16Q3J87l3j33j17j1J57J23p5j20o5Q4J70J8p8j31l6R6J04M1j56j03NJ49
$$ plain form
5230 43 77 108 15 -178 -89 90 104 47 -71 -134 -23 84 133 -15 -111 -164 -2 90 61 -38 -178 -37 42 150 13
5255 13 -87 -131 -27 109 95 -4 -85 -89 -13 137 117 -31 -144 -56 49 121 54 -40 -96 -93 91 132 35 -27 -90 -62 130
5282 130 136 -18 -112 -100 72 154 58 -31 -75 -78 0 149 75 -82 -110 -28 90 139 56 -149 -86 5 139 106 -44 -104 -79
5309 -79 62 99 75 -37 -123 -49 128 90 -29 -56 -82 -18 108 33 -50 -104 -70 17 203 31 -85 -84 -34 57 117 76 -102
5336 -102 -71 -12 89 65 40 -177 -159 38 79 54 -51 -115 -39 38 171 1 -31 -62 -50 146 134 20 -80 -80 51
5361 51 100 68 -25 -125 -81 53 58 7 -76 -139 -54 124 87 56 -157 -53 -3 156 82 -33 -151 -128 72 122 61 -80
5387 -80 -78 -40 142 88 22 -120 -46 -74 113 149 -82 -156 -84 22 117 69 -54 -154 -33 99 129 21 -90 -83 -85 100
5413 100 106 -9 -128 -122 35 156 68 -61 -85 -51 32 110 70 -64 -104 -56 83 168 41 -79 -75 6 108 145 -64 -116
$$ packed form
5230D3L4L1r3j93Q9J79J4n7j18o3J11J07M9j48r6n3J62R2k9r9j40J41P9J08j37
5255A3j00m4J04J36j4r9q1mP6J50k0j48j13Q8J05P2o7r4n6LJ84M1r7o2o3K8J92
5282A30Oj54r4J2J72Q2r6q9m4lP8J49p4j57k8Q2J18M9q3k05O3R1J34l3j50o0K5
5309g9J41L7k4j12q6P4J77l8j19k7k6O4J26p5q3n4L4Q7J86j72j16JN0R1O0m1j78
5336a02L1N9J01k4k5k17J8J97M1k5j05o4P6P7J33j70l2l1J2J96j2j14j00%J31
5361E1M9l2r3j00M4J34Nn1q3o3Q5J78l7l1k13J04N0J59p4j15j18K3K00N0o1j41
5387h0KL8J82n4o6j42P4k8J87L6k31p4P2J06R5m8j23j00J21J32L0j08j11PkJ85
5413A00Oj15j19OJ57J21q8j29k4L4Q3P8m0j34m0M8J39Q5j27j20MQ1J02L7k09n2
$$ plain form
5439 -116 -60 43 162 111 -76 -118 8 98 40 41 -85 -61 -14 185 153 -20 -129 -114 58 105 72 -36 -121 -26 87
5464 87 160 20 -175 -85 -22 116 167 -8 -128 -156 23 175 44 -7 -137 -80 76 193 42 -83 -115 -10 148
5487 148 125 7 -95 -117 36 119 88 -3 -157 -72 90 178 54 -38 -142 -48 49 114 -33 -104 -116 4 140 128 -64
5512 -64 -177 -134 43 198 114 -23 -74 -53 121 156 81 -160 -148 -1 123 112 -48 -136 -130 52 148 42 -58 -150 -45
5537 -45 74 128 10 -90 -84 -5 143 103 -8 -136 -111 9 162 88 -49 -155 -91 60 126 11 -54 -101 -38 190
5561 190 163 57 -129 -148 -1 108 105 26 -110 -122 68 148 102 -105 -123 -57 129 123 -12 -118 -101 -9 144 94 -65
5586 -65 -167 -152 26 199 127 -22 -216 -81 85 110 -35 -125 -107 -42 124 132 -19 -135 -96 23 146 98 -92 -203
5610 -203 -37 120 195 83 -161 -178 -51 119 209 7 -156 -119 69 144 105 -39 -190 -127 109 157 54 -158 -160
$$ packed form
5439a16N6J03J19n1j87m2J26R0n8Jj26K4M7J99l2j73j09J5J72M7l3j08q5R5J13
5464H7P3j40j95R0O3J38N1j75j20k8J79J52j31n1j30N7J56J17j51j25l2J05J58
5487A48k3j18j02k2J53Q3l1r1j54Q5J62Q8j24r2j04R4R7O5j47p1j2J20J36j2j92
5512f4j13M3J77J55q4j37n1K1J74L5p5k41J2J47J24j1j60q8OJ82R6j06j00r2J05
5537d5J19N4j18j00OP9J48m0j11j28K5J20J53p4j37j06O4J51O6j15o5m7O3K28
5561A90k7j06j86j9J47J09lp9j36j2J90Q0m6k07j8O6J86oj35j06J7R2J53n0j59
5586f5j02J5J78J73p2j49j94J35J66K5j45r0J8O5J66Qj51j16L9J19J23m8j90j11
5610b03J66J57P5j12k44j7J27J70R0k02j63L7J88P5l9j44j51O3K36M8j03k12k
$$ plain form
5633 -160 -52 134 172 -4 -157 -138 52 165 130 -48 -184 -83 79 149 111 -106 -146 -98 170 142 21 -142 -148
5656 -148 -46 163 141 -6 -163 -139 110 144 73 -101 -180 -65 133 167 43 -158 -154 19 178 134 -80 -171 -173 33
5680 33 222 98 -108 -180 -107 86 187 69 -119 -153 -34 166 169 -13 -94 -116 36 187 89 -54 -191 -90 113
5703 113 210 123 -88 -194 -43 194 191 35 -137 -166 19 165 132 -30 -171 -105 111 193 84 -90 -150 -87 125
5726 125 138 0 -151 -138 13 204 124 -50 -230 -135 65 175 79 -89 -196 -45 160 219 7 -163 -200 -2
5748 -2 197 144 0 -205 -77 49 169 57 -147 -246 -29 162 162 12 -111 -173 36 170 199 4 -197 -112 23
5771 23 201 141 -73 -188 -52 136 195 31 -129 -214 26 143 123 -38 -163 -180 24 171 106 -47 -232 -71
5793 -71 83 175 155 -116 -190 -25 205 181 -32 -203 -126 36 197 141 -80 -180 -74 84 190 93 -130 -193 -50
$$ packed form
5633a60J08J86L8j76j53J9J90J13l5j78j36J01J62P0l8k17m0M8K68k8j21j63o
5656a48J02K09k2j47j57K4K49L4p1j74p9J15J98L4j24k01MJ73J59m4k14r1kK06
5680C3J89j24k06p2P3J93J01j18j88l4J19K00Lj82q1k2J52J51r8j43j37J01K03
5703A13R7q7k11j06J51K37lj56j72k9J85J46l3j62j41O6K16Q2j09j74o0O3K12
5726A25J3j38j51J3J51J91q0j74j80R5K00J10r6j68j07J51K05N9k12j70l7J98
5748bJ99n3j44k05J28J26J20j12k04r9K17J91%j50j23o2K09J34K9j95k01Q5J35
5771B3J78o0k14j15J36J88N9j64j60q5K40J17k0j61j25j7K04J47o5j53j85J61
5793g1J54R2k0k71p4J65K30k4k13j71P7J62J61n6k21j00J06J58J06r7k23o3J43
$$ plain form
5816 -50 91 173 15 -144 -161 60 150 149 10 -176 -101 119 193 118 -100 -189 -64 197 190 20 -160 -147 52 229
5840 229 156 -26 -168 -163 70 230 69 -116 -205 -65 123 168 -26 -126 -207 25 205 175 -25 -169 -157 75 205
5863 205 101 -33 -189 -93 175 191 58 -164 -145 -2 206 202 -54 -201 -135 42 240 157 -47 -144 -125 102 175
5886 175 101 -193 -173 -59 230 172 -23 -149 -109 4 190 121 -88 -181 -127 112 236 51 -127 -237 -19 208
5908 208 237 51 -126 -170 -4 252 122 -15 -214 -134 132 185 93 -150 -220 -32 136 189 34 -201 -192 28 153
5931 153 157 -56 -210 -141 63 218 112 -93 -253 -34 152 210 42 -108 -165 20 202 198 -33 -163 -152 121 178
5954 178 126 -61 -183 -127 89 175 86 -179 -175 -54 179 159 -54 -259 -145 81 179 129 -97 -221 -94 179 263
5977 263 28 -163 -202 28 155 199 -4 -214 -138 45 203 145 -52 -191 -87 110 194 71 -159 -148 -70 179
$$ packed form
5816e0J41Q2j58j59j7K21R0jj39j86P5K20P4p5k18q9J25K61pj70j80J3J99J77
5840B29p3j82j42NK33J60j61j85q9J40J88M5j94j00q1K32J80l0k00j44J2K32J30
5863B05j04j34j56R6K68J6j33k22J9J43K08mk56j47O6J77J98q3k04r7J9K27P3
5886A75p4k94K0J14K89n8j95j26M0J13J86o9k09r3N4K39J24j85j78j10K18K27
5908B08K9j86j77m4J66K56j30j37j99Q0K66N3r2k43p0J88J68N3j55k35RK20J25
5931A53Mk13j54O9K04J55j06k05j60K19J86N8j68j50n7J85J82mk31j30J1K73N7
5954A78n2j87j22N6K16Q6q9k65MJ21K33k0k13k05J14K26R8n0k26j24J27K73Q4
5977B63k35j91l9K30J27M4k03k10P6J83J58n8j97j39J04J97Q4j23k30J1P8K49
$$ plain form
5999 179 217 5 -230 -163 26 227 189 -94 -216 -179 101 203 75 -152 -211 -74 171 247 -15 -202 -183 11
6021 11 185 185 -32 -204 -126 92 180 72 -83 -203 -55 187 157 20 -174 -196 -14 176 146 -40 -168 -138 57
6044 57 258 120 -143 -212 -142 116 239 42 -198 -178 51 197 222 -39 -225 -156 47 226 134 -90 -172 -69 151
6067 151 224 86 -156 -170 -53 171 227 -24 -187 -163 81 206 165 -73 -214 -134 100 246 135 -135 -248 -43
6089 -43 136 185 -21 -129 -150 48 230 149 -61 -211 -114 101 198 36 -170 -174 -51 154 226 -28 -155 -187 22
6112 22 192 156 -44 -191 -83 105 256 112 -126 -192 -56 191 235 43 -171 -135 -21 166 136 -30 -197 -195 47
6135 47 187 96 -117 -219 -91 148 199 43 -131 -203 -3 211 139 -11 -209 -147 53 274 129 -42 -238 -87
6157 -87 152 186 32 -135 -179 -39 242 184 -1 -224 -141 49 216 164 -117 -231 -112 113 192 135 -164 -258 -55
$$ packed form
5999A79L8k12k35O7J89K01l8k83j22L7K80J02j28k27n9J37K45P6k62j87J9J94
6021A1J74%k17j72P8K18Q8j08j55j20J48K42l0j37j94k2J82J90l0j86j28L0J95
6044E7K01j38k63o9P0K58J23j97k40K0K29J46K5k61j86O9K03J79r2k24q2J03K20
6067A51P3j38k42j4J17K24N6k51j63K4K44J25m1k38j41Q0K34J46j11k70j13K05
6089d3J79M9k06j08k1J98J82q1k10j50R7K15R7j62k06mJ23K05P2k54j27l2K09
6112B2J70l6k00j47J08J88J51j44k38o6J36K47M4j92k14L6J14J87l0j66j67KK42
6135D7J40r1k13j02J28K39N1j56j74p2K00K14p2j50j98O2K00K21j45j71j96J51
6157h7K39L4j54j67m4J40K81n8j85k23Q3J90J67n2k81j14J19K25P9n7k99r4K03
$$ plain form
6180 -55 100 142 -23 -255 -146 9 202 180 -83 -204 -54 43 215 99 -150 -186 -84 227 163 38 -192 -169
6202 -169 38 238 211 -75 -201 -163 65 192 125 -122 -232 -53 203 149 18 -171 -214 27 218 179 -26 -176
6224 -176 -136 19 220 123 -133 -135 -94 172 206 36 -125 -184 -58 213 185 2 -191 -120 31 254 104 -124 -252
6247 -252 -64 136 194 29 -201 -152 -73 152 115 -4 -175 -142 86 235 135 -97 -215 -102 185 182 89 -120 -223
6270 -223 -81 182 182 35 -160 -196 21 230 159 -7 -189 -102 99 174 107 -100 -200 -57 189 196 75 -102 -213
6293 -213 26 210 143 -69 -213 -68 80 144 126 -109 -172 -41 161 183 30 -175 -182 5 178 133 -77 -177 -143
6316 -143 65 164 95 -101 -214 -118 144 145 46 -93 -214 -24 223 187 -33 -180 -134 75 191 157 -8 -174 -41
6339 -41 102 191 53 -93 -122 -16 232 155 18 -161 -120 20 231 163 -65 -202 -151 118 195 101 -111 -224 -61
$$ packed form
6180e5J55M2j65k32J09J55J93k2k63j21J50R7J72j16k49l6J02L11o4j25k30K3
6202a69K07K00k7k86j26L8K28J27o7k47j10J79K56n4j31j89m3K41J91l9k05j50
6224a76M0J55K01r7k56kM1K66L4j70j61n9J26K71k8j83j93P1J51K23j50k28j28
6247b52J88K00N8j65k30M9P9K25l7j19j71L3K28J49j00k32j18J13K87lr3k09j03
6270b23J42K63%j47j95l6K17K09p1j66j82Q7K01P5o7k07j00J43K46Pj21j77j11
6293b13K39J84o7k12j44J45J48O4j8k35o3J31K02K2j53k05pJ87J73m5k10j00L4
6316a43K08R9o9j96j13R6K62Jr9j39j21J90K47l6k20j47M6K09J16l4j65j66J33
6339d1J43Q9j38j46k9J06K48p7j37j79M1J40K11o8k28j37N1K69P7r4k12j13J63
$$ plain form
6362 -61 162 163 -42 -196 -213 18 192 123 -79 -170 -68 144 176 139 -97 -160 -53 147 218 35 -133 -130 8 198
6386 198 172 -43 -198 -172 77 151 98 -92 -194 -40 167 181 27 -146 -219 20 169 139 -59 -196 -122 37 212
6409 212 105 -31 -161 -94 115 230 46 -137 -146 36 176 208 21 -195 -168 69 210 151 -49 -154 -76 98
6431 98 181 74 -110 -147 -10 128 153 -4 -231 -187 3 232 140 -127 -197 -127 53 174 18 -103 -159 -49 137
6454 137 180 -10 -104 -91 41 193 162 -60 -198 -146 127 169 94 -115 -148 -69 146 225 24 -156 -169 -4 162 154
6478 154 17 -157 -85 89 169 101 -88 -204 -111 67 176 9 -176 -194 -9 126 129 -31 -101 -94 58 185 99 -145
6502 -145 -160 -24 92 186 99 -115 -160 0 165 165 -54 -175 -132 20 199 149 -72 -157 -58 128 219 44 -123 -187
6526 -187 -57 152 139 65 -132 -219 32 140 143 -61 -185 -128 86 176 70 -87 -159 -98 147 197 -8 -141 -168 -11
$$ packed form
6362f1K23Jk05j54j7K31J74o9k02r1J02K12L2l7k36o3J07K00P1j83j68LJ38J90
6386A98k6k15j55K6K49P4n3j90j02J54K07J4j54j73p3K39J49l0j98j37P4J59J75
6409B12j07j36j30O7K09J15j84j83rJ82J40L2j87k16K7K37J41n9k00j05P8J74
6431I8Q3j07j84l7J37J38K5j57k27M4J90K29r2k67p0P0J80J21j56j21n6J10J86
6454A37M3j90r4J3J32J52l1k22j38N2K73M2p5k09l3P9K15P9k01j80j3J65J66q
6478A54j37j74P2J74Q0o8j89j16R3J78J09j67j85j8J85J35Lj60p0PJ52J27q6k44
6502a45j5J36J16R4q7k14m5J60J65%k19j21M3J52J79n0k21q5R9J86R1j75j67o4
6526a87J30K09j3p4j97q7K51J08Lk04j24N7K14R0j06j57p2O1K45N0k05j33k7J57
$$ plain form
6550 -11 128 131 -65 -201 -59 42 133 93 -111 -147 -55 151 136 5 -176 -149 21 146 180 -29 -206 -108 47 185
6574 185 89 -154 -155 -101 78 174 53 -134 -198 12 93 169 13 -156 -176 47 197 107 -62 -129 -66 125 158 30
6598 30 -123 -128 -47 173 131 -7 -195 -175 78 179 128 -95 -163 -80 21 189 73 -115 -162 -32 138 203 18 -102
6622 -102 -130 -24 196 149 -15 -154 -81 84 180 100 -118 -182 -74 34 201 49 -123 -146 39 144 138 -22 -137
6645 -137 -122 58 190 84 -108 -165 -33 100 245 34 -127 -198 -6 127 112 21 -113 -109 62 127 105 -72 -199
6668 -199 -57 140 135 42 -113 -149 18 143 152 48 -170 -125 58 139 151 13 -161 -93 86 161 125 -82 -136 -91 101
6693 101 174 0 -156 -153 36 139 143 -54 -200 -124 49 156 77 -114 -193 -83 136 173 26 -148 -180 5 192
6716 192 198 13 -135 -131 53 159 104 -84 -141 -14 147 156 60 -159 -130 -17 161 146 1 -143 -139 9 173 138 -4
$$ packed form
6550a1J39Lj96j36J42J01R1m0k04l6R2K06j5j31j81K7J70J25L4k09j77R8J55J38
6574A85r6k43jN4J79R6j21j87o4K10Q1P6j56j69k0K23J50r0j69o7O3J91L3j28
6598C0j53nQ1K20m2j38j88K0K53J01n1k23o8Q3J01J68j16j88m7J30J70O5j85j20
6622a02k8J06K20m7j64j39P3J65R6q0k18o4J08J08J67j52j72k3J85J05oj60j15
6645a37J5J80J32j06j92n7J32J33J45k11j61p1J92J33j5r1j34MJ71O5k2j77j27
6668a99J42J97nr3j55l6J67J25Rj04k18M5J83Q1J2j38j74O8J79P5l6k07n4M5J92
6693A01P3j74j56LJ89J03Mj97j46P6J73J07p9j91p9J10K19L7j47j74l2J85J87
6716A92Oj85j48MJ84J06n5j88n7J27J61Rr6k19K9J13J78j5j45j44MJ48J64l5j42
$$ plain form
6741 -4 -195 -82 44 152 8 -79 -134 -32 134 143 14 -166 -151 36 117 140 -80 -196 -113 57 129 39 -67 -192
6765 -192 -1 151 160 41 -139 -138 25 180 115 6 -198 -164 33 168 80 -126 -194 -58 42 163 6 -160 -150
6788 -150 -35 160 178 14 -217 -145 11 177 111 -86 -123 -96 83 174 21 -157 -100 -17 164 126 23 -130 -122 38
6812 38 141 96 -48 -153 -82 60 180 4 -125 -175 -29 152 178 77 -142 -83 -22 150 107 -60 -188 -138 -12
6835 -12 202 91 -81 -160 -64 129 170 52 -163 -89 55 177 146 -69 -169 -109 67 118 101 -74 -126 -114 95 176
6859 176 66 -146 -135 -16 70 118 -54 -146 -155 52 202 107 -93 -199 -35 129 131 16 -78 -154 -32 178 117 16
6883 16 -159 -112 40 147 147 -28 -110 -124 28 207 65 -73 -157 -51 121 159 -33 -129 -165 46 147 96 -59 -169
6907 -169 -126 123 153 116 -114 -147 -48 125 193 5 -91 -144 39 156 146 -31 -120 -107 81 158 61 -43 -142 -41 114
$$ packed form
6741dj91J13J26J08j44q7n5J02J66Rj29j80J5J87Q1K3k20j16Q3J70P2r0j06j25
6765a92J91J52Rj19j80JJ63J55o5j09k04L4J97J35q8k06o8J36J00J21j57j66J0
6788a50J15J95J8j64k31P2J56J66o6j97l7K7J79R1j53j78N7Q3J81l8j03j53QJ60
6812C8J03m5j44j05P1J42J20j76j29n0J46J81K6j01k19N9O1J72m3j67j28N0J26
6835a2K14j11j72p9R6J93M1j18k15P4J44J22l1k15j00O0J76N1j7j75n2J2K09Q1
6859A76j10k12J1J19Q6M8j72r2rK07J50r5k00j06J64J64Kj15r4p6J22K10o1j01
6883A6j75M7J52J07%j75q2j4J52J79j42j38q4J06J72L8j92r6l6K11J01n1j55j10
6907a69M3K49L0l7k30l3R9J73O8j88r6n3J83J17j0j77q9J3J88P7r7j04r9J01J55
$$ plain form
6932 114 178 46 -200 -161 -53 199 146 -25 -123 -136 38 172 77 -34 -198 -94 115 196 55 -119 -197 -11 112
6955 112 145 -12 -160 -108 -1 176 98 -71 -140 -117 86 209 58 -102 -167 2 172 127 6 -130 -112 30 150
6978 150 112 27 -155 -119 78 169 71 -104 -174 -4 146 162 65 -142 -193 -7 129 159 -59 -206 -113 54 206 75
7002 75 -129 -167 -127 82 181 49 -137 -219 -51 183 209 -24 -206 -138 53 169 110 -88 -199 -111 79 220 55
7025 55 -98 -208 8 160 173 -27 -148 -147 45 163 100 -63 -177 -106 58 162 54 -119 -194 -39 127 153 23
7048 23 -189 -143 49 181 121 -86 -215 -96 34 178 112 -134 -216 -37 192 187 33 -195 -176 10 192 140 -28
7071 -28 -204 -147 67 183 114 -110 -221 -60 103 184 23 -161 -171 14 171 169 -25 -169 -73 34 171 112 -92
7094 -92 -173 -73 129 190 22 -158 -163 -59 163 155 26 -118 -132 99 209 165 -63 -218 -120 145 165 69 -101 -185
$$ packed form
6932A14O4j32k46L9J08K52n3j71r8j3J74J34r5j11j64J04K09Q1j41j74p8J86J23
6955A12L3j57j48N2J07J77p8j69o9K3K03J23j51j60o5J69J70m5j21j36J8J42J20
6978A50l8q5j82L6J97R1r8j75p0J70J50J6r7k07n1J86J36L0k18j47R3J67J52j31
7002G5k04l8M0K09R9j32j86q2J68K34K6k33j82O8J91J16n9j98j11Q8J90J41j65
7025E5j53j10K16J52J3k00j21JJ92J18o3j63j14P1J64J04j08j73p5J55J66K6j30
7048B3k12M6J92J32o0k07j29J19J30J44o6k46q2J79K29nj54k28J9J86J82n2j68
7071b8j76N7K14J16o9k24j11J61J63Q1j61j84j0J85J57kj94j44R6J07J37n9k04
7094i2q1J00K02O1j68j80nJ04K22qj29j44j4K31J10m4k28j55R8K65K0r6j70q4
$$ plain form
7118 -185 1 128 198 0 -161 -144 37 171 113 -65 -161 -127 97 253 100 -87 -192 -82 140 145 45 -166
7140 -166 -204 97 187 154 -35 -157 -103 102 157 148 -113 -212 -39 181 210 -22 -166 -236 7 184 117 -79 -193 -132
7164 -132 19 221 107 -147 -169 -91 186 194 107 -173 -201 8 205 174 20 -208 -150 98 212 123 -145 -184 -82
7187 -82 168 225 105 -132 -163 35 179 125 -74 -204 -119 75 206 147 -50 -210 -126 183 216 51 -142 -173 -28
7210 -28 190 181 55 -129 -106 25 168 200 -54 -178 -140 91 237 99 -103 -199 -34 148 208 -20 -169 -131 40
7233 40 201 169 -41 -195 -89 188 224 134 -133 -205 -56 149 193 42 -155 -198 66 201 126 -20 -227 -103 91
7256 91 222 74 -91 -203 -33 152 197 34 -160 -214 -34 241 191 -45 -181 -132 30 202 149 -112 -258 -79
7278 -79 181 173 14 -145 -176 -59 150 197 12 -158 -137 93 222 148 -113 -189 -89 112 246 45 -166 -170 -35
$$ packed form
7118a85J86J27P0j98j61J7J81J34n8j78r6L4K24J56j53j87j05J10K22Nj00k11
7140a66l8L01R0l3j89j22N4K05N5rk61r9J73K20K9k32j44p0K43J77o7j96j14O1
7164a32J51K02j14k54k2P8K77Qq7k80k8K09J97l1j54k28N8K48J14q9k68l9J02
7187h2K50N7j20k37l1J98J44n4j99j30Q5J94J31n9j97j60Q4L09L3j65j93l1J45
7210b8K18rj26j84K3J31J43L2k54j24L8K31J46j38k02r6J65J82O0k28j49L8J71
7233D0J61l2k10j54J06K77L6r0k67p2J49K05M4j51j97m3K64J35p5j46k07J24J94
7256I1J31j48j65j12J70J85M5j63j94n4J80K75n0k36j36M9J62J72n3k61j46J79
7278g9K60qj59j59l1J17K09M7j85j70K1K30J29p4k61p6J00K01J34k01k11mJ35
$$ plain form
7301 -35 177 202 -46 -156 -109 62 200 183 -20 -184 -79 107 213 45 -109 -202 -3 184 155 -23 -187 -168
7323 -168 55 210 186 -68 -212 -101 95 238 122 -97 -231 -31 131 202 9 -155 -177 -4 214 164 -93
7344 -93 -202 -176 107 208 117 -100 -204 -85 169 238 68 -194 -167 39 180 154 -82 -168 -135 91 215 85 -98
7367 -98 -227 -75 136 222 74 -153 -165 -15 194 172 -55 -170 -168 110 253 133 -92 -233 -135 128 170 51 -136
7390 -136 -192 -15 148 182 16 -236 -184 74 159 147 -61 -222 -75 156 221 107 -128 -205 -70 211 154 22 -225
7413 -225 -200 54 183 148 -43 -227 -140 124 246 74 -125 -187 -57 162 185 -26 -117 -175 36 168 136 -62 -191
7436 -191 -174 137 234 88 -64 -202 -89 139 201 9 -202 -180 33 206 153 -50 -194 -132 82 214 99 -128
7458 -128 -169 -136 151 207 0 -168 -177 -29 205 177 -25 -222 -205 36 229 163 -139 -197 -86 144 242 84 -147
$$ packed form
7301c5K12K5k48j10M7J71J38j7k03j64J05J86J06j68j54r3J99J87k9j78j64J9
7323a68K23J55k4k54j44J11J96J43j16k19j34K00J62P1j93j64k2J73K18n0k57
7344i3j09K6K83J01r1k17j04J19K54O9j70k62K7K06J41k6k36q6L3K26J24j30j83
7367i8j29J52K11Q6j48k27j2J50K09k2k27j15KK78J43j20k25j41R8K63M2j19j87
7390a36n6J77J63L4j66k52N2K58Q5j2k08j61J47K31O5j14k35p7J35K81n7j32k47
7413b25K5K54J29l5j91j84Q7K64J22j72j99o2J30K19K3k11r1n8K11J32l2j98j29
7436a91J7L11R7j46j52j38J13K28O2j92k11K2K13J73n3k03j44O2K14J32j15k27
7458a28m1L3K87N6k07j68rJ48K34k8k02j97J7K41J93o6l02n8J11K30R8j58k31
$$ plain form
7481 -147 -191 -3 200 175 -21 -201 -158 54 276 169 -75 -189 -74 128 237 61 -198 -183 -46 227 235 -3
7503 -3 -237 -178 50 153 128 -120 -205 -133 146 269 25 -166 -157 -2 138 161 16 -204 -176 -2 270 170 -80
7526 -80 -212 -104 65 240 28 -146 -200 -79 198 164 0 -177 -147 27 198 148 -36 -212 -119 91 210 119
7548 119 -91 -249 -37 152 195 67 -179 -235 17 179 221 -78 -197 -166 74 232 93 -81 -173 -60 157 224
7570 224 77 -180 -159 41 153 224 -61 -181 -163 39 183 114 -88 -229 -82 142 152 38 -151 -209 -81 188
7592 188 139 -47 -203 -201 23 196 168 -81 -235 -94 85 191 36 -123 -121 -39 139 194 24 -173 -108 22 204
7615 204 138 -89 -214 -64 79 216 115 -127 -181 -63 117 203 42 -179 -173 29 179 120 -51 -188 -117 124
7637 124 165 102 -102 -204 -19 138 214 12 -141 -205 -26 204 164 -60 -217 -105 88 220 135 -137 -216 -57
$$ packed form
7481a47m4J88K03k5j96j80M3K12K22j07k44j14J15K02J09j76k59J5J37K73Qk38
7503ck34N9K28J03k5k48q5P2K79J23k44j91RJ55J40K3j45k20K8J74K72j00k50
7526h0j32J08J69J75k12j74n4J21K77l4j64j77L0J74J71n0j84j76R3K10J19r1
7548A19k10j58K12J89M3j28k46n6K52J62M2k99j19L1K40J58j39j74r2J13K17O7
7570B24j47k57K1K00J12P1k85j20J8K02J44o9k02j41J47K24J0j14j89n8J28K69
7592A88m9j86j56KK24J73k8k49j54J41J79J06j55j59KQ2J78N5j70j97O5J30J82
7615B04o6k27j25J50J43J37j01k42n4J18J80Q6j61k21OK02J50n9j71j37P1K41
7637A24M1o3k04j02J85J57P6k02j53o4J79K30m0k24j57J12J93J32q5k72p9J59
$$ plain form
7659 -57 112 212 10 -143 -214 -67 124 165 -31 -238 -130 85 225 98 -101 -180 -108 120 205 30 -115 -179
7681 -179 -43 152 145 20 -176 -169 70 166 123 -64 -185 -102 126 202 111 -112 -224 4 173 186 32 -180 -128 60
7705 60 160 169 -50 -188 -74 89 188 50 -77 -141 -73 180 188 14 -165 -207 12 207 146 -27 -178 -91 66 194
7729 194 165 -53 -169 -48 128 173 -13 -110 -182 33 215 193 -23 -166 -87 38 170 56 -43 -175 -66 159
7751 159 167 55 -153 -185 -68 165 164 -49 -196 -138 95 187 113 -121 -192 -101 80 172 24 -157 -145 13 154 185
7775 185 -23 -145 -163 40 150 157 -64 -137 -118 94 224 83 -106 -156 22 149 202 -7 -175 -111 52 184 135
7798 135 -50 -230 -138 92 160 26 -112 -123 -43 182 107 59 -111 -153 -5 170 134 -100 -167 -51 93 168 44
7821 44 -77 -159 -71 149 171 25 -126 -131 15 127 145 -31 -181 -58 70 174 117 -90 -183 -88 156 208 10 -190
$$ packed form
7659e7J69J00k02j53p1J47J91M1j96k07J08K15J40j27j99p9P2K28Q5j75j45o4
7681a79J36J95pj25j96PK39R6m3j87j21Q3K28P6r1k23j12K28J69J3j54k12N2J88
7705F0J00Rk19j38J14J63R9j38j27o4O8K53Qj74j79m2K19J95o1j73j51Q7J57J28
7729A94k9k18j16J21J76M5j86r7p2K15J82k2k16j43P9J25J32j14r9j32J09K25
7751A59Qj12k08l2J17K33jk13j47N8K33R2p4k34p1R1J81R2j48j81J2J58J41L1
7775A85k08j22j8K03J10Pk21p3J9K12J30j41j89n0J78J27N3k09j68O4J63J32m9
7798A35j85j80R2K30O8j34j38j1Q0K25p5m8j70m2J48J75l6k34o7J16J44P5j24
7821D4j21q2Q8K20K2j46j51nJ46J12J8j76j50J23J28J04n7k07r3R5K44N2j98k00
$$ plain form
7845 -190 -201 -16 143 139 16 -125 -139 87 182 72 -52 -179 -35 90 210 65 -76 -168 -57 103 151 -13
7867 -13 -192 -107 -7 147 76 -75 -126 -19 86 152 99 -117 -181 -56 155 147 14 -159 -85 46 148 127 -46 -104
7891 -104 -105 83 156 95 -73 -184 -42 126 157 45 -154 -139 34 176 136 -26 -149 -105 91 110 91 -37 -118 -35
7915 -35 139 135 21 -100 -188 9 153 132 -42 -179 -81 46 150 87 -50 -165 -35 98 157 -21 -116 -161 51
7938 51 145 111 -34 -171 -95 68 142 81 -56 -187 -36 92 126 36 -44 -133 -4 158 136 8 -130 -92 47 88
7962 88 117 -77 -143 -57 79 167 36 -87 -105 -39 114 150 33 -58 -128 -5 176 134 -129 -153 -119 29 102 53 -64
7987 -64 -173 16 95 159 21 -128 -122 -11 108 100 -22 -161 -69 84 144 92 -82 -120 -82 44 136 16 -108 -155 -23
8012 -23 77 115 -50 -152 -111 50 132 45 -114 -138 -72 65 136 78 -79 -178 -40 112 144 4 -129 -101 71 147
$$ packed form
7845a90j1J85J59mj23j41j4K26R5j10j24j27J44J25J20j45j41r2J11J60M8j64
7867a3j79Q5J00J54p1j51n1J07J05O6n3k16o4J25K11qj33j73P4J31J02k1j73n8
7891a04jJ88P3o1j68j11J42J68L1j12j99J5J73J42m0j62j23M4J96J9j9j28q1Q3
7915c5J74mj14j21q8J97J44k1j74j37R8J27J04o3j37j15J30J33N9j78r5m5K12
7938E1R4l4j45j37P6J63P4o1j37j31J51J28L4r0q0q9J29J62k2j28j38L8J39M1
7962H8K9j94o6Q6J36Q8j31j23j8O6J53L6j17r1p0J23J81m2k63k4L4J48P3m9j17
7987f4j09J89P9O4j38j49OJ11J19qj22j39R2J53O0n2j74l8L8J26R2j20j24m7J32
8012b3J00L8j65j02M1J61Q2q7j59k4O6J37P1n8j57r9J38J52L2j40j33K8J72P6
$$ plain form
8036 147 80 -128 -135 -49 98 171 28 -98 -114 16 58 90 -42 -105 -90 54 130 152 -35 -120 -47 -8 138 31 -53
8061 -53 -105 -66 99 105 -23 -103 -134 38 92 61 -54 -145 -133 50 152 22 -52 -94 -64 89 90 -6 -114 -127 8 138
8087 138 139 -83 -185 -111 42 139 85 -77 -161 -28 77 118 29 -50 -156 -14 122 143 -43 -171 -95 20 151 82
8111 82 -23 -133 -58 93 128 23 -75 -173 5 152 158 29 -103 -71 9 159 105 -23 -165 -126 12 120 63 -91
8135 -91 -144 -60 82 147 -37 -115 -84 39 154 125 -13 -123 -71 80 172 58 -83 -142 -85 103 90 50 -119 -113 87
8160 87 85 111 -50 -136 -92 78 137 60 -66 -126 -99 88 139 -15 -85 -122 -21 97 123 7 -147 -74 -15 152 35
8185 35 -100 -82 -57 73 116 22
$$ packed form
8036A47o7k08pQ6J47P3j43j26j6J30M2L2j32o3J5J44P6K2j87q5P3L9J46j07q4
8061e3n2L9J65Oj28q0l1J72N4l1j15r1J2J83J02j30p4m2L0J53Jr6j08j3J35J30
8087A38Jk22j02P4J53R7n4j62q4J33J05M1q9p9j06J42J36K1j86j28P6J15J31o9
8111H2j05j10P5J51L5j05r8r8J78J47Oj29j32L2Q0J50n4j28j42L9J38J08n7j54
8135i1n3Q4J42O5j84p8L1J23J15k9j38j10N2J51R2j14j41n9N7J88j3m0j69OK00
8160H7kK6j61q6M4J70N9p7j26o0K7J87N1j54p0l7J01J18K6j16j54P3N9J67j17
8185C5j35J8K5J30M3r4
8191B2
$$ Imaginary data points
##PAGE= N=2
##DATA TABLE= (X++(I..I)), XYDATA
$$ plain form
0 0 0 0 0 0 0 0 0 0 0 0 0 0 0 8 -8 8 -8 8 -9 16 -16 24 -24 32 -32 40 -48 55 -63 72 -80 89 -104 116 -130
35 -130 147 -168 185 -208 233 -258 287 -317 352 -389 430 -474 524 -577 635 -699 771 -851 937
54 937 -1037 1149 -1274 1419 -1587 1788 -2029 2325 -2699 3189 -3858 4836 -6407 9330 -16635
69 -16635 74493 80286 -85230 -35200 17650 41476 41776 3205 -47824 -31771 -13018 16727 28859
82 28859 4787 -28210 -50191 -30668 68563 72891 -46638 -68888 3506 16568 32371 35871
94 35871 -38921 -70103 -6095 40098 39979 -2403 -49939 -30966 16118 37240 41836 -5958 -53232
107 -53232 -11500 31312 24097 28131 -6694 -64118 -22904 47804 37932 -3210 -36346 -38918 6821
120 6821 35529 26475 5857 -40705 -48399 23541 56166 12752 -28075 -47862 -18719 46386 38769
$$ packed form
0@%%%%%%%%%%%%%Qj6J6j6J6j7K5l2M0m8N6o4P2q8J03j18J35j52J69j93K20k46
35a30K77l15L53l93M41m91N45o04O69p41Q19r04R98j101J212j334J470j622J788
54I37j974K186k423K693l006L375l817M354n024N888p047Q694j1243J5737k5965
69a6635R1128N793j65516N0030N2850K3826L00l8571n1029J6053J8753K9745J2132
82B8859k4072l2997k1981J9523R9231M328j19529k2250P2394J3062J5803L500
94C5871p4792l1182O4008M6193j19m2382m7536J8973M7084K1122M596m7794m7274
107e3232M1732M2812p215M034l4825n7424M1214P0708r872m1142l3136k572M5739
120F821K8708r054k0618m6562p694P1940L2625m3414m0827j9787K9143O5105p617
$$ plain form
133 38769 -19862 -28171 -11986 -241 21325 25362 9626 -16881 -43577 -6473 59388 35721
145 35721 -33983 -46736 -15044 30143 46365 -2995 -42751 -20797 8213 23979 26590 -1821
157 -1821 -27761 -22508 2328 35045 29753 -22200 -39608 -8839 14458 27864 18798 -25103 -40214
170 -40214 -3825 30289 34092 2729 -37891 -29484 16045 36963 19420 -17862 -36398 -9443
182 -9443 21129 21911 9636 -15065 -34694 -9184 29143 27543 -618 -25863 -26253 5597 31472
195 31472 20950 -8121 -30098 -21843 15730 35466 12667 -23054 -35014 -6718 32491 28382
207 28382 -10026 -28282 -15873 6637 22734 16829 -6350 -23383 -19137 7697 31947 18727
219 18727 -19144 -33747 -8079 27273 30687 -1868 -28734 -20421 7280 25641 18889 -7911 -26632
$$ packed form
133C8769n8631q309J6185J1745K1566M037j5736k6507k6696L7104O5861k3667
145C5721o9704j2753L1692M5187J6222m9360l9756K1954K9010J5766K611k8411
157a821k5940N253K4836L2717n292n1953j7408L0769K3297J3406r066m3901j5111
170d0214L6389L4114L803l1363m0620Q407M5529K0918j7543l7282j8536K6955
182i443L0572P82j2275k4701j9629K5510L8327j600k8161k5245l90L1850K5875
195C1472j0522k9071k1977Q255L7573J9736k2799l5721j1960K8296L9209m109
207B8382l8408j8256J2409K2510J6097n905k3179j7033M246K6834K4250j3220
219A8727l7871j4603K5668L5352L414l2555k6866Q313K7701J8361o752k6800j8721
$$ plain form
232 -26632 -15472 12856 27417 11744 -17654 -27051 -5980 19792 22003 566 -21341 -21928 -494
245 -494 21692 19873 -5758 -26589 -18031 11271 27746 11946 -16474 -24402 -5246 19273 23255
258 23255 2540 -19459 -18993 1488 21311 19424 -4661 -23127 -14592 8974 22383 12399 -11890
271 -11890 -23504 -9254 13639 21600 5741 -19202 -23633 -1400 20164 18073 -4363 -22931 -15319
284 -15319 8917 20819 11212 -8427 -19713 -8766 13284 20908 7473 -13034 -19954 -2720 19199
297 19199 19017 -828 -18356 -16143 5047 21020 12768 -8286 -20012 -11504 10351 20230 5754
310 5754 -14848 -19950 -5347 15015 17804 -881 -18064 -16021 2282 19113 15061 -6213 -19181
323 -19181 -10504 9677 20656 9226 -12450 -18684 -4106 14595 18275 1941 -16658 -15820 2059
$$ packed form
232b6632J1160K8328J4561j5673k9398r397K1071K5772K211k1437k1907n87K1434
245d94K2186j819k5631k0831Q558K9302J6475j5800k8420p928J9156K4519L982
258B3255k0715k1999M66K0481J9823j887k4085j8466Q535K3566J3409r984k4289
271a1890j1614J4250K2893P961j5859k4943m431K2233K1564k091k2436j8568P612
284a5319K4236J1902r607j9639j1286J0947K2050P624j3435k0507o920J7234K1919
297A9199j82j9845j7528K213K1190J5973q252k1054j1726Q508K1855R879j4476
310E754k0602n102J4603K0362K789j8685j7183K043J8303J6831m052k1274j2968
323a9181Q677K0181J0979j1430k1676o234J4578J8701L680j6334j8599Q38J7879
$$ plain form
336 2059 17171 14240 -4592 -18913 -11981 7575 17969 8392 -11238 -19464 -6329 12919 16671
349 16671 1840 -15148 -15776 1113 16674 13930 -3174 -16222 -11328 6839 18290 9566 -9267
362 -9267 -17372 -6483 11698 17117 3043 -14149 -15304 -341 14931 14402 -2647 -16829 -11751
375 -11751 5618 16430 9190 -9174 -17181 -5886 9956 14352 3955 -11489 -14295 -897 12856
388 12856 13764 907 -14095 -12427 5099 16033 9528 -6323 -15946 -7050 9952 13466 2847
401 2847 -9495 -13421 -2785 11295 11700 353 -11308 -12935 1295 14893 9437 -5497 -13874
414 -13874 -9118 7023 15356 4055 -9604 -11477 -3207 10108 13399 1185 -9928 -10071 -498 12819
428 12819 12099 -4117 -13212 -8229 3523 13875 7422 -10104 -13376 -2674 7363 11274 2763 -10573
$$ packed form
336B059J5112k931j8832j4321O932J9556J0394r577j9630q226J3135J9248L752
349A6671j4831j6988o28J6889J5561k744j7104j3048M894J8167J1451q724j8833
362i267q105J0889J8181N419j4074j7192j155J4963J5272n29j7049j4182N078
375a1751J7369J0812p240j8364q007J1295J5842M396j0397j5444k806J3398J3753
388A2856R08j2857j5002J668J7526J0934o505j5851r623Q896J7002L514j0619
401B847j2342l926J0636J4080M05j1347j1661j627J4230J3598n456j4934q377
414a3874M756J6141Q333j1301j3659j873Q270J3315L291j2214j1113j43R573J3317
428A2819p20j6216r095M983J1752J0352o453j7526l272J0702J0037L911q511j3336
$$ plain form
442 -10573 -10346 -379 8938 11527 -422 -13411 -8591 3856 11298 9705 -5394 -15153 -3338 10060
456 10060 10597 3900 -7597 -11542 -194 10044 9423 1090 -11289 -11655 2952 11083 6919 -3669
470 -3669 -14764 -8882 9629 12028 645 -7271 -10158 -3058 9755 10014 410 -7830 -10410 28
484 28 12992 9402 -2951 -11015 -8921 7157 16418 2735 -9889 -7616 -1344 7027 10077 -122
498 -122 -8826 -8073 -2192 7857 9582 -3026 -11799 -8611 1987 13002 7144 -10170 -11442 -229
512 -229 6802 9650 3107 -9288 -8649 1919 8760 8960 -557 -10233 -5931 4206 9423 7404 -4307
527 -4307 -11675 -2469 7020 7315 3437 -6165 -11575 -1681 8563 7125 -721 -9752 -9358 2558 9619
542 9619 5339 -3732 -10665 -4877 8251 8876 436 -4675 -6324 -1538 6870 6858 851 -4184 -7410 -2031
$$ packed form
442a0573K27R967R317K589j1949j2989M820J2447P442j593j5099r759J1815J3398
456A0060N37o697j1497l945J1348J0238o21q333j2379l66J4607Q131m164j0588
470c669j1095N882J8511K399j1383p916k887P100J2813K59r604q240k580J0438
484B8J2964l590j2353q064K094J6078R261j3683j2624K273O272Q371L050j0199
498a22q704P53N881J0049J725j2608q773L188J0598J1015n858j7314j272J1213
512b29P031K848o543j2395O39J0568O841K00r517r676M302J0137N217k019j1711
527d307p368R206R489K95l878r602n410R894J0244j438p846r031L94J1916P061
542I619m280r071o933N788J3128O25q440n111j649M786Q408j2o007n035l226N379
$$ plain form
558 -2031 8857 9383 -1124 -10537 -8452 5687 13144 1955 -9634 -7866 -43 6289 5695 -1652
572 -1652 -5636 -4599 -2018 4384 7870 811 -8114 -7879 1723 11008 6902 -6094 -9625 -1766 6414
587 6414 8375 1850 -6710 -6976 6 6604 7239 -315 -8282 -6232 2506 7849 4802 -4016 -8470 -3314
603 -3314 4290 6601 2509 -4937 -7832 -2151 5723 7594 1267 -7287 -7826 1022 9205 7328 -3019
618 -3019 -10111 -4503 6722 9607 1371 -7376 -6537 1174 5864 3990 -151 -3934 -5120 -1931 4382
633 4382 7579 1349 -9219 -8923 3324 11467 4885 -7931 -10444 339 8980 5499 -2352 -5601
647 -5601 -3563 1239 4662 4303 516 -5129 -5994 1390 7811 4776 -3265 -8103 -3861 5553 7756 842
663 842 -5986 -6991 -904 7116 6362 -2222 -7511 -4762 3043 7657 2899 -4228 -5364 -1939 3434 6579
$$ packed form
558b031J0888N26j0507r413K085J4139P457j1189j1589J768P823O332n94p347
572a652l984J037K581O402L486p059q925K35R602R285m106j2996l531P859Q180
587F414J961o525q560k66O982O598O35p554p967K050Q738N343l047q818m454N156
603c314P604K311m092p446k895N681P874J871o327q554n39Q848Q183j877j0347
618c019p092N608J1225K885q236q747Q39P711M690j874m141l783j186L189O313
633D382L197o230j0568K96J2247Q143o582j2816k513J0783Q641l481p851l249
647e601K038M802L423l59l787n645q65P384O421l035q041m838M242R414K203o914
663H42o828j005O087Q020p54q584n289K749P805M614m758p127j136L425N373L145
$$ plain form
679 6579 1883 -4355 -5073 -1375 4420 6729 502 -6190 -5377 313 6164 5843 -2419 -8027 -4268 3431
695 3431 7692 2685 -7022 -7203 1303 5342 3536 -738 -4331 -2970 689 2880 4660 2128 -5042
710 -5042 -6063 1392 7745 6032 -3467 -9296 -2094 7095 6111 -488 -5759 -5528 962 5414 3131 -1291
726 -1291 -5056 -4875 1401 5509 2767 -2150 -5607 -3849 3121 6188 2242 -3269 -6269 -2464 6294
741 6294 7558 -353 -6389 -4855 2355 7718 3583 -3784 -5133 -1866 2692 5323 1688 -3935 -5021
756 -5021 -2077 3283 5723 443 -5754 -5153 6 5043 5068 -1589 -6719 -3964 2633 6813 3668 -4559
772 -4559 -6845 -279 5703 5375 -25 -4956 -3660 1652 4350 3588 -76 -4641 -4247 1365 5376 3647
788 3647 -2582 -6899 -2973 4182 5520 652 -4832 -5658 -195 5247 4215 -1233 -5243 -3881 2175
$$ packed form
679F579m696o238p18L698N795K309o227o692Q13N690N851l21q262n608L759P699
695C431M261n007r707j81Q506M039j806m274l593J361L659K191J780k532p170
710e042j021P455O353j713r499n829P202R189r84o599n271K31O490M452k283m422
726a291l765J81O276M108k742m917l457J758O970L067l946n511l000L805Q758
741F294J264p911o036J534P210N363m135p367j349L267M558K631l635n623j086
756e021K944N360K440n280o197O01N159N037K5o657n130K755O597M180l145q227
772d559k286O566N982l28n400m931J296N312K698p62l664m565L94N612M011j729
788C647o229m317L926P155J338m868n484q26N463N442j032n448m010J362O056
$$ plain form
803 2175 5663 2512 -2549 -4171 -1689 2843 4781 2014 -2469 -4448 -1697 3970 5771 554 -5414
818 -5414 -4941 1149 5712 3343 -3000 -5728 -2287 2621 4313 1365 -3355 -4799 -1274 3274 4392
833 4392 764 -4103 -4274 562 4599 4045 -407 -4484 -3321 2157 5460 3075 -2258 -5118 -1820 3904
849 3904 4957 520 -3987 -4385 -192 4086 3362 -1021 -4276 -3903 531 4564 2822 -2357 -4924 -2734
865 -2734 2555 5244 1623 -3553 -4393 -668 4276 5170 25 -4425 -3273 1289 5075 3828 -1988 -4884
881 -4884 -2004 2290 4570 2158 -3466 -5059 -1241 3099 4278 470 -4960 -4644 513 4057 3362 -1258
897 -1258 -5252 -3003 2385 4479 2477 -2259 -4937 -1150 4006 4497 1156 -3298 -4320 571 4858
912 4858 3448 -717 -4263 -3608 1823 4796 1887 -2406 -4812 -2518 3096 4433 224 -3701 -4461 -830
$$ packed form
803B175L488l151n061j622K482M532J938k767m483j979K751N667J801n217n968
818e414M73O090M563k369o343k728L441M908J692k948m720j444L525M548J118
833D392l628m867j71M836M037n54m452m077J163N478L303k385n333k860L298N724
849C904J053m437m507l98M193M278p24m383l255L73M434M033j742n179k567K190
865b734N289K689l621n176q40L725M944Q94n145m450J152M562L786j247n816k896
881d884K880M294K280k412n624j593L818M340J179l808n430L16N157L544o95m620
897a258l994K249N388K094k002m736k678L787N156M91l341m454j022M891M287
912D858j410m165l546O55N431K973k909m293k406K294N614J337m209l925p60L631
$$ plain form
928 -830 4284 3743 -1196 -3965 -3174 931 4900 3041 -2029 -3970 -2092 2516 5380 1662 -3552 -3733
944 -3733 -305 3656 4229 -554 -4192 -2628 615 3195 3047 -1443 -4519 -2674 1275 4242 2422 -3412
960 -3412 -5077 -688 3463 3991 269 -4210 -3302 1369 3623 2814 -417 -3842 -2580 1808 4064 2645
976 2645 -1825 -4778 -1539 3449 4013 739 -3625 -4475 201 4123 2827 -1016 -3998 -3192 1211 4034
992 4034 2132 -1757 -4276 -2356 2748 4464 1151 -2957 -4105 -613 4282 3897 -794 -3625 -2583
1007 -2583 939 3982 2738 -1317 -3902 -2647 1819 4783 1884 -3395 -4740 -1007 3914 4224 -909
1022 -909 -4592 -2785 1187 3476 2444 -1170 -3697 -2454 1387 4409 2761 -2524 -4826 -1294 3831
1037 3831 4854 154 -4557 -3549 1391 4082 2425 -1393 -3793 -2329 1428 3730 2183 -2156 -4475
$$ packed form
928h30N114n41m939k769P91M105L969j859n070j941J878M608K864l718n214j81
944c733L428L961N73m783l638J564L243K580j48m490l076J845L949K967j820n834
960c412j665M389M151N28l722m479R08M671K254q09l231l425J262M388K256j419
976B645m470k953L239M988N64l274m364q50M676L922j296l843k982Q06M403K823
992D034j902l889k519J920N104J716l313m108j148L492M895l85m691k831J042
1007b583L522L043j244m055k585J255M466K964k899n279j345L733M921L10n133
1022i09l683J807L972K289j032l614k527J243L841L022j648n285k302L532N125
1037C831J023m700m711J008M940K691j657l818k400J464L757K302j547m339k319
$$ plain form
1052 -4475 -1881 2867 4386 815 -3943 -4200 488 4359 3225 -1268 -4043 -2273 1925 3968 2110
1067 2110 -1912 -3834 -1490 2656 4174 1273 -3335 -4223 -140 3991 3475 -1021 -4521 -2968 1544
1082 1544 3759 1760 -1978 -4017 -1882 2238 3907 1369 -2780 -4103 -548 3858 3881 -190 -3875
1097 -3875 -3136 1442 4401 2361 -1498 -3423 -2007 1913 3987 1650 -2421 -4130 -1382 3116 3911
1112 3911 -192 -4080 -3843 335 4029 2476 -2053 -3811 -1956 1478 3793 2088 -2071 -3888 -1274
1127 -1274 2925 4606 1010 -3670 -3666 529 4341 3545 -1355 -4272 -1971 1863 3588 2081 -2040 -4196
1143 -4196 -1607 2369 3730 887 -3555 -4216 -338 3428 3368 -557 -4329 -3112 1633 4100 2412 -1686
1159 -1686 -4320 -1637 3253 4327 932 -3002 -3638 -14 3722 3293 -288 -3619 -3283 1035 4179 2356
$$ packed form
1052d475K594M748J519l571m758k57M688L871j134m493k775J770M198K043j858
1067B110m022j922K344M146J518k901m608q88M083M131n16m496l500J553M512
1082A544K215j999l738k039K135M120J669k538m149j323L555M406K3m071l685
1097c875P39M578K959k040l859j925J416L920K074k337m071j709K748M498P95
1112C911m103l888K37M178L694j553m529j758J855L434K315j705m159j817K614
1127a274M199J681l596m680MM195L812p96m900k917K301L834J725j507m121k156
1143d196K589L976J361k843m442o61L878L766o0l925l772J217M745K467j688m098
1159a686k634K683M890J074l395l934o36L624L736m29l581l331L36M318L144j823
$$ plain form
1175 2356 -1822 -4254 -2416 2366 4303 970 -3339 -4123 -858 3547 3872 -558 -4180 -3273 1196 4531
1191 4531 2576 -1993 -3670 -1344 2194 3887 1667 -2279 -3552 -1114 2725 4167 585 -4096 -3989
1206 -3989 731 4402 2940 -2049 -4589 -1853 2199 3587 1338 -2537 -3943 -1078 2853 3613 455
1221 455 -3555 -3504 620 3951 2909 -918 -3728 -2358 1761 4165 2356 -2084 -4334 -1533 3412 4305
1237 4305 185 -3990 -3515 556 3719 2446 -1225 -3560 -2505 997 3622 2209 -1973 -4134 -1859
1252 -1859 2539 4062 967 -3200 -3585 -94 3652 3630 -236 -3846 -2989 1530 4511 2563 -2294 -4203
1268 -4203 -1272 2767 3439 517 -2821 -3508 -646 2767 3273 131 -3747 -3759 737 4389 2813 -2047
1284 -2047 -4449 -1923 2762 4202 1029 -2838 -3716 -515 3589 3779 -235 -3601 -2901 1100 4107 2476
$$ packed form
1175B356m178k432J838M782J937l333m309p84L265M405L25m430l622R07M469L335
1191D531j955m569j677K326L538J693k220l946j273K438L839J442l582m681J07
1206c989M720L671j462m989k540K736M052J388k249l875j406K865L931P60l158
1221D55m010N1M124L331j042l827k810J370M119K404j809m440k250K801M945Q93
1237D305m120m175M75M071L163j273l671k335J055L502K625j413m182k161K275
1252a859M398J523l095m167l85L491L746k2l866l610Q57M519K981j948m857j909
1268d203K931M039O72k922l338o87K862L413N06l142l878j2M496L652j576m860
1284b047k402K526M685J440l173l867q78L201M104J90m014l366P00M001L007j631
$$ plain form
1300 2476 -1628 -3581 -2053 1438 3738 1793 -2605 -4373 -1605 3113 4287 -68 -4549 -3412 1157
1315 1157 4075 2614 -1777 -3827 -1479 1977 3639 1974 -2140 -3868 -837 3140 3915 656 -3594
1330 -3594 -3435 832 3766 2907 -934 -4293 -2785 1860 3946 1559 -2663 -4538 -1274 3261 3371 -129
1346 -129 -3281 -3276 317 3571 2689 -664 -3289 -2746 1502 4430 2072 -2067 -3581 -1381 2973 4066
1362 4066 597 -3022 -3395 -215 3680 3407 -1142 -3956 -2639 1233 3942 1743 -2707 -3756 -1173
1377 -1173 2015 3345 834 -2951 -3410 -475 3040 3654 -206 -4054 -2662 1571 3989 2539 -1840
1392 -1840 -3997 -1130 2617 3511 1267 -2544 -3615 -253 3122 3083 -130 -3648 -3091 1020 3431 2057
1408 2057 -1304 -3931 -2256 2106 3732 1137 -2540 -3902 -786 3397 3397 -242 -3270 -2893 913 3987
$$ packed form
1300B476m104j953J528L491K300j945m398j768K768M718J174m355m481J137M569
1315A157K918j461m391k050K348L456J662j665m114j728L031L977P75l259m250
1330c594J59M267K934q59l841l359J508M645K086k387m222j875L264M535J10l500
1346a29l152NL593L254q82l353k625N43M248K928k358m139j514K200M354J093
1362D066l469l619l73L180L895k73m549k814J317L872K709k199m450j049K583
1377a173L188J330k511l785m59K935L515O14l860l848J392M233K418j450m379
1392a840k157K867L747Q94k244l811j071L362L375l9l213l518N57M111K411j374
1408B057l361k627J675M362J626k595l677j362L116M183%l639l028L77L806L074
$$ plain form
1424 3987 2349 -1349 -3314 -2020 1907 4042 1350 -2600 -3524 -892 2878 3510 -81 -3422 -3083 343
1440 343 3555 2690 -1524 -3844 -2058 1620 3709 1624 -2516 -3673 -761 2689 3465 450 -3217 -2984
1456 -2984 491 3477 2889 -937 -3655 -2008 1712 3487 1725 -2067 -3735 -1094 2604 3339 426
1471 426 -3139 -3352 240 3381 2704 -972 -3614 -2275 1664 3554 1660 -1916 -3512 -1178 2628 3473
1487 3473 462 -2844 -3037 58 3259 2829 -709 -3461 -2345 1296 3422 1806 -1903 -3541 -1394
1502 -1394 2182 3308 650 -2803 -3169 -198 2949 2931 -374 -3296 -2433 1287 3603 1851 -1615 -3252
1518 -3252 -1258 2152 3142 823 -2306 -3086 -588 2714 2997 -133 -3294 -2928 908 3607 1878 -1847
1534 -1847 -3389 -1425 1896 3088 701 -2307 -2870 -569 2455 3133 198 -2810 -2582 699 3507 2499
$$ packed form
1424C987j638l698j965J294L927K135k692l950r24K632L770O32l591l341L39L426
1440C43L212q65m214k320J786L678K089k085m140j157K912L450P76l015l667K33
1456b984L475K986n88l826k718J647L720J775j762l792j668K641L698P35k913
1471D26l565k13L592L141o77l676k642J339L939J890j894l576j596K334L806Q45
1487C473l011l306j93L095L201m30l538k752J116L641K126j616l709j638K147
1502a394L576J126k658l453l66K971L147j8l305k922Q63L720K316j752l466j637
1518c252J994L410R90k319l129p80K498L302K83l130l161L66L836K699j729l725
1534a847j542J964L321J192k387l008n63K301L024O78k935l008K28L281K808j008
$$ plain form
1550 2499 -1185 -3124 -1518 1564 3320 1279 -2318 -3201 -670 2268 2819 102 -3002 -2818 421 2872
1566 2872 2140 -1090 -3399 -1889 1470 3021 1419 -1973 -3321 -615 2573 2803 493 -2361 -2635 366
1582 366 3162 2598 -558 -3117 -2131 1558 3459 1381 -2102 -3312 -830 2473 2520 -191 -2355 -2469
1598 -2469 -281 2497 2361 -511 -2915 -2441 941 3426 1751 -1903 -3180 -943 2414 3126 268 -2388
1614 -2388 -2141 156 2561 2598 -306 -2708 -1966 969 2925 1706 -1559 -3066 -1174 1752 2764 565
1630 565 -2515 -2820 -137 2377 2263 -454 -2923 -2117 1000 2804 1541 -1332 -2781 -1187 1810 2853
1646 2853 911 -1976 -2614 -88 2629 2449 -40 -2402 -2066 687 2653 1658 -1026 -2713 -1629 1296
1662 1296 2740 917 -2137 -2875 -470 2306 2233 -294 -2425 -1997 482 2398 1763 -798 -2399 -1381
$$ packed form
1550B499l684j939J606L082J756k041l597q83K531K938N51k717l104J84L239K451
1566B872p32l230k309J510L359J551j602l392j348K706L188K30k310k854k74L001
1582C66K796n64l156k559R86L689J901k078l483j210K482L303M7k711k164j14
1598b469K188K778j36k872k404M74L382K485j675l654j277K237L357P12k858k656
1614b388K47K297K405L7k904k402P42K935J956j219l265j507J892K926J012k199
1630E65l080l05K683K514j14k717k469Q06L117J804j263k873j449J594K997J043
1646B853j942k887o38K526K717j80k489k362L36K753J966r95k684j687J084K925
1662A296J444j823l054p38K405K776p3k527k131M28K479J916o35k561j601J018
$$ plain form
1678 -1381 1247 2775 1313 -1552 -2681 -519 2371 2549 111 -2257 -2032 490 2396 1746 -795 -2553
1694 -2553 -1622 983 2371 982 -1556 -2576 -921 1845 2303 193 -2051 -2207 -28 2329 2052 -539
1710 -539 -2406 -1623 1019 2626 1203 -1406 -2230 -741 1672 2361 404 -1933 -2070 -98 1988 2093
1726 2093 -443 -2497 -1675 760 2327 1234 -1403 -2481 -815 1498 2245 654 -1934 -2172 112 1956
1742 1956 1985 -150 -2246 -1651 930 2204 1329 -904 -2353 -984 1512 2106 673 -1605 -2320 -269
1758 -269 2052 1757 -277 -2052 -1821 583 2257 1135 -962 -2032 -1089 1335 2232 669 -1391 -1921
1774 -1921 -408 1905 2038 -161 -1726 -1461 312 2115 1442 -954 -2053 -1134 969 2157 613 -1710
1790 -1710 -1914 -347 1378 1821 -154 -1956 -1419 144 1536 1605 -458 -2102 -1190 888 2003 1147 -1206
$$ packed form
1678a381K628J528j462k865j129K162K890J78k438k368K25K522J906o50k541j758
1694b553R31K605J388j389k538j020J655K766M58k110k244j56K179K357k77k591
1710e39j867P83K642J607j423k609q24J489K413O89j957k337j37J972K086J05
1726B093k536k054Q22K435J567j093k637j078J666K313P47j591k588k38K284J844
1742A956K9k135k096N95K581J274q75k233j449J369K496N94j433k278p15K051
1758b69K321k95k034j775K31K404J674j122k097j070R43K424Q97j563k060n30
1774a921J513K313J33k199j565K65J773J803o73k396j099R19K103J188j544k323
1790a710k04J567J725M43j975j802N37J563J392O9k063j644R12K078J115q56k353
$$ plain form
1807 -1206 -1974 -228 1557 1825 278 -1620 -1533 414 1611 1307 -210 -1805 -1408 819 1756 810 -977
1824 -977 -1957 -709 1239 1533 303 -1343 -1872 -121 1743 1293 -319 -1565 -1302 649 2052 918
1840 918 -917 -1537 -634 1145 1767 293 -1218 -1478 -295 1494 1530 -292 -1511 -1221 166 1625 1162
1857 1162 -852 -1809 -865 821 1716 505 -1433 -1585 -155 1395 1508 -140 -1534 -978 379 1381
1873 1381 1211 -364 -1601 -849 778 1639 843 -1037 -1765 -270 1396 1441 4 -1533 -1318 349 1381
1890 1381 901 -518 -1593 -975 703 1562 517 -955 -1533 -366 1197 1401 220 -1148 -1269 106
1906 106 1530 1238 -306 -1407 -1005 644 1612 712 -924 -1477 -415 1019 1330 80 -1194 -1253 -40
1923 -40 1208 1039 -341 -1388 -959 435 1253 815 -674 -1417 -529 942 1504 383 -1003 -1194 79
$$ packed form
1807a206p68J746J785K68j547j898Q7J947J197l04j517j595L97K227R37r46j787
1824i77r80J248J948K94j230j646n29J751J864m50j612j246K63J951J403j134
1840I18j835o20R03J779O22j474j511k60J183J789L6j822j219K90J387J459m63
1857A162k014r57R44J686Q95j211j938j52J430J550J13j648j394N56J357J002
1873A381j70j575j237P52J627Q61p96j880p28J495J666M5j437j537K15J667J032
1890A381m80j419j075O18J678Q59j045j472n78J167J563K04j181j368j21J375
1906A06J424k92j544j101M02J649R68r00j636n53J062J434L11j250j274n9J213
1923d0J248j69j380j047M29J394Q18m38j489p43Q88J471N62j121j386j91J273
$$ plain form
1940 79 1364 1122 -207 -1276 -919 444 1208 662 -563 -1257 -698 580 1286 372 -924 -1257 -270 1028
1958 1028 1164 -104 -1168 -1018 238 1226 863 -459 -1193 -634 652 1386 516 -829 -1088 -132 879
1975 879 1089 79 -1042 -986 16 984 807 -285 -1233 -767 424 1100 603 -744 -1292 -290 920 1049
1993 1049 191 -894 -1007 105 1086 894 -120 -1008 -785 477 1133 631 -464 -1119 -481 778 1089 203
2011 203 -833 -1199 -118 980 817 -232 -1072 -951 256 1071 623 -543 -1051 -559 672 1198 313 -812
2029 -812 -888 -15 989 1045 -63 -907 -676 196 1073 823 -415 -1024 -588 547 1130 401 -915 -1150 -242
2048 -242 698 905 -110 -1065 -873 104 884 698 -276 -1078 -582 423 990 534 -528 -974 -221 745 959
2067 959 231 -724 -796 178 946 769 -144 -934 -634 422 916 440 -519 -1044 -448 604 820 62 -841 -885
$$ packed form
1940G9J285k42j329j069L57J363P64n46j225o94N59J278P06r14j296l33R87J298
1958A028J36j268j064J50J256R88l63j322p34N59J286P34q70j345k59R56J011
1975H79K10j010j121N6J002R68j77j092r48M66J191O76m97j347n48J002J210J29
1993A049q58j085j13J112R81j92j014q88K23J262O56n02j095o55O38J259L11q86
2011B03j036l66J081J098j63j049q40J21J207Q15m48j166n08M92J231N26q85j125
2029h12p6Q73J004N6j108q44K31Q72Q77k50j238o09M36J135N83p29j316k35R08
2048b42R40K07j015r55J92R77P80j86r74q02M96J005N67m56j062m46P53R66K14
2067I59p28r55p2R74P68j77r13p90L00J056M94m76r59n25N96J052K16p58r03m4
$$ plain form
2087 -885 -55 769 649 -174 -763 -654 174 895 668 -308 -879 -417 595 1073 349 -689 -811 38 789
2106 789 747 -45 -720 -632 68 716 575 -277 -915 -514 357 794 329 -592 -898 -285 590 778 88 -713 -747
2127 -747 92 915 713 -175 -782 -389 447 833 446 -369 -764 -205 561 779 114 -627 -779 -122 716 689
2147 689 -185 -903 -684 144 776 456 -450 -897 -435 540 822 237 -688 -746 70 742 721 58 -633 -466 217
2168 217 724 628 -149 -871 -446 489 881 284 -637 -898 -56 644 625 -43 -755 -661 181 697 432 -269 -836
2189 -836 -463 378 823 245 -441 -649 -165 613 764 141 -557 -685 52 853 605 -296 -752 -478 290 813
2209 813 305 -496 -720 -257 385 659 56 -604 -631 -132 611 619 -140 -636 -433 168 674 508 -299 -692 -266
2230 -266 426 724 296 -591 -708 5 567 532 -19 -691 -408 197 491 426 -146 -729 -434 340 601 264 -478
$$ packed form
2087h85Q30Q24j20q23n89J09Q28P21k27r76n71M62J012M78p24j038j22Q49P51
2106G89m2p92o75Q8P00O48j41q52o38M01Q71M37m65r21l06O13Q75J88o90q01l4
2127g47Q39Q23k02q88o07L93Q36L86l87q15l95N59P66K18o65p41j52O57Q38k7
2147F89q74p18K19Q28O32l20r06m47M62R75K82n85r25n8Q16O72k1o63o91J67O83
2168B17N07r6p77p22M25R35L92n97r21k61Q42P00j9o68p12R4Q42N16k65p01n67
2189h36L73Q41M45n78o86k08M84P78J51o23o98j28P37Q01k48r01m56K74P68N23
2209H13n08q01k24M63O42K74o03o60k7M99P43Qp59m96K03O01N06j66q07l93M26
2230b66O92K98m28q87j17P13N62l5n51o72K83O05K94o5n72n83K95P74K61l37p42
$$ plain form
2251 -478 -789 -129 560 593 51 -536 -609 119 761 476 -124 -589 -418 373 705 284 -320 -655 -230 426 580
2272 580 111 -464 -669 -119 662 572 -186 -684 -536 276 685 313 -366 -575 -241 398 668 153 -477 -512 -90
2293 -90 580 713 -20 -646 -435 229 683 439 -301 -693 -372 324 608 201 -533 -694 -75 527 536 -11 -640
2314 -640 -496 169 643 441 -161 -680 -360 366 718 364 -352 -656 -196 604 605 125 -481 -542 63 636 501
2335 501 -221 -685 -481 279 648 211 -449 -676 -229 386 491 62 -516 -542 9 569 554 -10 -606 -438 268
2356 268 674 373 -338 -611 -155 443 603 190 -446 -517 -15 509 449 -3 -627 -511 161 521 393 -316 -666
2377 -666 -307 322 549 114 -423 -566 -71 489 561 -6 -507 -392 124 665 446 -186 -540 -315 240 617
2397 617 258 -347 -642 -189 398 567 61 -639 -495 10 496 413 -166 -616 -330 178 594 371 -321 -542
$$ packed form
2251d78l11O60O89L3n42n87p3P28O42k85o00m65J71P91L32m21o04l35M25O56J54
2272E80m69n75k05N50P81r0p58m98J48Q12M09l72o79k09L34O39K70n15o30l5M22
2293i0O70J33p33o26K11O64M54k44p40l92L21O96K84m07p34j61O19O02Rn47o29
2314f40J44O65M74k02o02n19L20P26L52l54p16l04M60Q00Jm80o06o1O05N73j35
2335E01p22m64K04P60L69m37o60k27M47O15J05m29n78k6N51N60j5n64n96J68P06
2356B68M06l01p11k73M56N98J60m13o36p1N02N24o0m52o24J16O72L60j28p09l50
2377f66L59O29K27m35n37j43M95N60P2n67n01J15N16N41k19o32l54K25N55L77
2397F17l59o05k95M53N87J69n06p00J44N05M86q3n79m50K86N08M16k23o92k21
$$ plain form
2417 -542 -184 402 555 177 -378 -521 5 528 527 13 -584 -520 243 696 345 -340 -733 -245 415 512 97
2438 97 -452 -610 -178 472 456 -12 -548 -578 117 736 413 -174 -538 -287 428 707 167 -368 -521 -76 574
2459 574 593 -32 -535 -447 74 563 394 -285 -587 -360 184 524 196 -461 -617 -230 414 613 73 -644 -505
2480 -505 84 549 533 -153 -569 -207 362 608 392 -325 -508 -77 411 560 142 -520 -590 11 472 400 -131
2501 -131 -602 -510 201 500 257 -337 -647 -244 376 569 91 -421 -530 -30 530 460 -37 -440 -407 177 621
2522 621 412 -200 -518 -258 283 628 130 -434 -640 -219 489 565 -58 -604 -541 59 507 379 -260 -590 -340
2543 -340 246 553 250 -344 -515 -104 471 683 175 -554 -503 100 574 523 -133 -614 -355 260 566 270 -343
$$ packed form
2417e42L58N86J53l78n55j43N26N23jn14n97O4P63M53l51o85l93M88O60R7m15
2438I7n49j58M32O50j6m68n36l0O95O19l23n87l64K51P15K79n40n35j53M45O50
2459E74J9o25n03Q8N21M89j69o79l02K27N44L40l28o57j56L87O44J99n40p17J39
2480e05N89M65j6o86m16L62N69K46k16p17j83M31M88J49m18o62p0O01M61p2n31
2501a31m71R2P11K99k43n94l10M03O20J93m78n12j09N00N60p0m97m03L3N84M44
2522F21k09o12l18K60N41L45m98n64k06M21P08P6o23n46O3O00M48j28o39l30K50
2543c40N86L07l03n94j71M11N75K12n08p29N1O03M74n1o56m81K59O15L06k96o13
$$ [...]
8191a09
##END NTUPLES=NMR FID
##END=
