##TITLE=1H_AM_NV60.1VAP
 aceton-d6
 8 sc, 
 27.9.2023
##JCAMPDX= 6.0         $$ Bruker NMR JCAMP-DX V2.0
##DATA TYPE= NMR FID
##DATA CLASS= NTUPLES
##ORIGIN= UXNMR, Bruker Analytische Messtechnik GmbH
##OWNER= root
$$ XWIN-NMR		Version 3.5
$$ Wed Sep 27 16:16:36 2023 Russian Standard Time (UT+4h)  she@DPX200
##.OBSERVE FREQUENCY= 200.13135
##.OBSERVE NUCLEUS= ^1H
##.DELAY= (6, 6)
##.ACQUISITION MODE= SIMULTANEOUS
##.ACQUISITION SCHEME= undefined
##.AVERAGES= 8
##.DIGITISER RES= 18
##SPECTROMETER/DATA SYSTEM= spect
##.PULSE SEQUENCE= zg30
##.SOLVENT NAME= Acetone
##.SHIFT REFERENCE= (INTERNAL, Acetone, 0, 15.7039)
##AUDIT TRAIL= $$ (NUMBER, WHEN, WHO, WHERE, WHAT)
$$ ##TITLE= Audit trail, XWIN-NMR		Version 3.5
$$ ##JCAMPDX= 5.01
$$ ##ORIGIN= Bruker BioSpin GmbH
$$ ##OWNER= she
$$ F:/spectra/data/she/nmr/H-F/1/audita.txt
$$ ##AUDIT TRAIL=  $$ (NUMBER, WHEN, WHO, WHERE, WHAT)
(   1,<2023-09-27 16:15:36.90 +0400>,<she>,<DPX200>,
      <created by zg, POWCHK disabled, PULCHK disabled
       configuration hash MD5:
       00 E9 B6 7A A2 85 ED C7 34 08 36 98 17 FE 4E 26
       data hash MD5: 16K
       08 9A 07 77 2E 26 8B 0D D0 A5 61 B5 E6 99 06 C5>)
$$ ##END=
$$ 
$$ hash MD5
$$ B6 65 FE AD DC 58 5D 9F 0F 68 E0 B4 2A C3 CC 4E
##$RELAX= 
##$RELAX= 
##$RELAX= 
##$RELAX= 
##$RELAX= 
##$RELAX= 
$$ Bruker specific parameters
$$ --------------------------
##$DU= <F:/spectra>
##$EXPNO= 1
##$NAME= <H-F>
##$PROCNO= 1
##$TYPE= <nmr>
##$USER= <she>
##$AMP= (0..31)
100 100 100 100 100 100 100 100 100 100 100 100 100 100 100 100 100 100 
100 100 100 100 100 100 100 100 100 100 100 100 100 100 
##$AQSEQ= 0
##$AQ_mod= 1
##$AUNM= <au_zg>
##$AUTOPOS= <>
##$BF1= 200.13
##$BF2= 200.13
##$BF3= 200.13
##$BF4= 200.13
##$BF5= 200.13
##$BF6= 200.13
##$BF7= 200.13
##$BF8= 200.13
##$BYTORDA= 1
##$CFDGTYP= 0
##$CFRGTYP= 5
##$CHEMSTR= <none>
##$CNST= (0..31)
1 1 145 1 1 1 1 1 1 1 1 1 1 1 1 1 1 1 1 1 1 1 1 1 1 1 1 1 1 1 1 1 
##$CPDPRG= <>
##$CPDPRG1= <>
##$CPDPRG2= <>
##$CPDPRG3= <>
##$CPDPRG4= <mlev>
##$CPDPRG5= <mlev>
##$CPDPRG6= <mlev>
##$CPDPRG7= <mlev>
##$CPDPRG8= <mlev>
##$CPDPRGB= <>
##$CPDPRGT= <>
##$D= (0..31)
0 1.2 0 0 0 0 0 0 0 0.06 0 0.03 0 0 0 0 0.0002 0 0 0 0 0 0 0 0 0 0 0 0 
0 0 0 
##$DATE= 1695816936
##$DBL= (0..7)
120 120 120 120 120 120 120 120 
##$DBP= (0..7)
150 150 150 150 150 150 150 150 
##$DBP07= 0
##$DBPNAM0= <>
##$DBPNAM1= <>
##$DBPNAM2= <>
##$DBPNAM3= <>
##$DBPNAM4= <>
##$DBPNAM5= <>
##$DBPNAM6= <>
##$DBPNAM7= <>
##$DBPOAL= (0..7)
0.5 0.5 0.5 0.5 0.5 0.5 0.5 0.5 
##$DBPOFFS= (0..7)
0 0 0 0 0 0 0 0 
##$DE= 6
##$DECBNUC= <off>
##$DECIM= 32
##$DECNUC= <off>
##$DECSTAT= 4
##$DIGMOD= 1
##$DIGTYP= 9
##$DL= (0..7)
0 120 120 120 120 120 120 120 
##$DP= (0..7)
150 150 150 150 150 150 150 150 
##$DP07= 0
##$DPNAME0= <>
##$DPNAME1= <>
##$DPNAME2= <>
##$DPNAME3= <>
##$DPNAME4= <>
##$DPNAME5= <>
##$DPNAME6= <>
##$DPNAME7= <>
##$DPOAL= (0..7)
0.5 0.5 0.5 0.5 0.5 0.5 0.5 0.5 
##$DPOFFS= (0..7)
0 0 0 0 0 0 0 0 
##$DQDMODE= 0
##$DR= 18
##$DS= 0
$$ [...]
##$SUBNAM2= <"">
##$SUBNAM3= <"">
##$SUBNAM4= <"">
##$SUBNAM5= <"">
##$SUBNAM6= <"">
##$SUBNAM7= <"">
##$SUBNAM8= <"">
##$SUBNAM9= <"">
##$SW= 18.05172834244
##$SWIBOX= (0..15)
0 0 2 0 0 0 0 0 0 0 0 0 0 0 0 0 
##$SW_h= 3612.71676300578
##$TD= 16384
##$TD0= 1
##$TE= 0
##$TE2= 300
##$TE3= 300
##$TEG= 300
##$TL= (0..7)
0 120 120 120 120 120 120 120 
##$TP= (0..7)
150 150 150 150 150 150 150 150 
##$TP07= 0
##$TPNAME0= <>
##$TPNAME1= <>
##$TPNAME2= <>
##$TPNAME3= <>
##$TPNAME4= <>
##$TPNAME5= <>
##$TPNAME6= <>
##$TPNAME7= <>
##$TPOAL= (0..7)
0.5 0.5 0.5 0.5 0.5 0.5 0.5 0.5 
##$TPOFFS= (0..7)
0 0 0 0 0 0 0 0 
##$TUNHIN= 0
##$TUNHOUT= 0
##$TUNXOUT= 0
##$USERA1= <user>
##$USERA2= <user>
##$USERA3= <user>
##$USERA4= <user>
##$USERA5= <user>
##$V9= 5
##$VALIST= <valist>
##$VCLIST= <CCCCCCCCCCCCCCC>
##$VD= 0
##$VDLIST= <DDDDDDDDDDDDDDD>
##$VPLIST= <PPPPPPPPPPPPPPP>
##$VTLIST= <TTTTTTTTTTTTTTT>
##$WBST= 1024
##$WBSW= 4
##$XGAIN= (0..3)
0 0 0 0 
##$XL= 0
##$YL= 0
##$YMAX_a= 281569
##$YMIN_a= -218698
##$ZGOPTNS= <>
##$ZL1= 120
##$ZL2= 120
##$ZL3= 120
##$ZL4= 120
##$ABSF1= 10
##$ABSF2= 0
##$ABSG= 5
##$ABSL= 3
##$ALPHA= 0
##$AQORDER= 0
##$ASSFAC= 0
##$ASSFACI= 0
##$ASSFACX= 0
##$ASSWID= 0
##$AUNMP= <proc_1d>
##$AZFE= 0.1
##$AZFW= 0.1
##$BCFW= 1
##$BC_mod= 2
##$BYTORDP= 1
##$COROFFS= 0
##$CY= 11.3945322036743
##$DATMOD= 1
##$DC= 2
##$DFILT= <>
##$DTYPP= 0
##$F1P= 15.7292609196834
##$F2P= 12.9074282941183
##$FCOR= 0.5
##$FTSIZE= 0
##$FT_mod= 4
##$GAMMA= 1
##$GB= 0.15
##$INTBC= 1
##$INTSCL= 1
##$ISEN= 128
##$LB= 0.24
##$LEV0= 0
##$LPBIN= 0
##$MAXI= 10000
##$MC2= 0
##$MEAN= 0
##$ME_mod= 0
##$MI= 1.114404
##$NCOEF= 0
##$NC_proc= 0
##$NLEV= 6
##$NOISF1= 3.799351
##$NOISF2= 2.8
##$NSP= 1
##$NTH_PI= 0
##$NZP= 0
##$OFFSET= 15.70392
##$PC= 1
##$PHC0= -21710.56
##$PHC1= 8.052711
##$PH_mod= 1
##$PKNL= yes
##$PPARMOD= 0
##$PSCAL= 0
##$PSIGN= 0
##$REVERSE= no
##$SF= 200.130013532006
##$SI= 16384
##$SIGF1= 3
##$SIGF2= 2
##$SINO= 400
##$SIOLD= 16384
##$SREGLST= <1H.CDCl3>
##$SSB= 0
##$STSI= 0
##$STSR= 0
##$SW_p= 3612.71676300578
##$SYMM= 0
##$S_DEV= 0
##$TDeff= 0
##$TDoff= 0
##$TI= <>
##$TILT= no
##$TM1= 0
##$TM2= 0
##$TOPLEV= 0
##$USERP1= <user>
##$USERP2= <user>
##$USERP3= <user>
##$USERP4= <user>
##$USERP5= <user>
##$WDW= 1
##$XDIM= 8192
##$YMAX_p= 0
##$YMIN_p= 0
$$ End of Bruker specific parameters
$$ ---------------------------------
##NTUPLES= NMR FID
##VAR_NAME=  TIME,          FID/REAL,        FID/IMAG
##SYMBOL=    X,             R,               I
##VAR_TYPE=  INDEPENDENT,   DEPENDENT,       DEPENDENT
##VAR_FORM=  AFFN,          ASDF,            ASDF
##VAR_DIM=   8192,          8192,            8192
##UNITS=     SECONDS,       ARBITRARY UNITS, ARBITRARY UNITS
##FACTOR=    0.0002768,     1,               1
##FIRST=     0,             0,               0
##LAST=      2.2672688,     0,               0
##MIN=       0,             -218698,         0
##MAX=       2.2672688,     281569,          0
$$ Real data points
##PAGE= N=1
##DATA TABLE= (X++(R..R)), XYDATA
$$ plain form
0 0 0 0 0 0 0 0 0 0 0 0 0 0 0 0 0 -8 8 -8 8 -8 8 -16 16 -16 22 -24 30 -32 38 -43 50 -55 62 -70 80 -91 101
37 101 -114 125 -138 154 -172 191 -212 233 -258 283 -312 344 -379 418 -461 508 -560 621 -688 767
57 767 -858 964 -1091 1251 -1445 1700 -2040 2525 -3268 4532 -7080 14147 -73428 -217704
71 -217704 55601 169125 38005 116160 281569 184101 113759 191576 124572 16043 110651
82 110651 126965 -21827 -13426 66750 -43735 -99733 -5670 -78983 -218698 -123794 -68253 -207604
94 -207604 -154452 49626 -16189 -131661 18423 72117 -98829 -48253 164187 120612 11181
105 11181 107956 141390 27564 24579 59765 -972 29770 106760 5019 -63727 66146 69252
117 69252 -89382 -65285 20009 -95795 -145888 -10921 -21190 -112024 12545 94614 -70058
$$ packed form
0@%%%%%%%%%%%%%%%qJ6j6J6j6J6k4L2l2L8m6N4o2P0q1R3j05J17j32J50j71J92
37A01k15K39k63K92l26L63m03M45m91N41n95O56p23P97q79R69j068J181j309J455
57G67j625J822k055K342k696L145l740M565n793P800j1612K1227q7575j44276
71b17704K73305J13524j31120P8155J65409r7468p0342P7817o7004j08529R4608
82A10651J6314j48792Q401Q0176j10485n5998R4063p3313j39715R4904N5541j39351
94b07604N3152K04078o5815j15472J50084N3694j70946N0576K12440m3575j09431
105A1181R6775L3434j13826k985L5186o0737L0742P6990j01741o8746J29873L106
117F9252j58634K4097Q5294j15804n0093J34967j0269r0834J24569Q2069j64672
$$ plain form
128 -70058 -107237 57924 47851 -56603 37352 122194 30078 1235 51783 847 -25812 43060
140 43060 16984 -38717 38163 49792 -68304 -36772 71923 -26457 -126552 -14289 25120
151 25120 -88327 -47846 75832 23916 -24341 62837 43772 -58663 7266 95624 16597
162 16597 -19915 60437 41152 -37961 -19383 -9957 -43237 5343 29294 -59982 -51583 53832
174 53832 69 -98086 -8310 54055 -59740 -74108 43727 30098 -30798 46185 81978 -5715
186 -5715 -6394 52997 6311 -22950 46954 41072 -28636 -3946 21299 -37562 -38082 12314 -17545
199 -17545 -33848 23765 -1125 -67138 1208 57564 -39051 -66625 42432 39270 -53763 -10635
211 -10635 69240 27590 -3509 32409 9943 -25409 12339 15480 -30503 -3323 31923 -21636
$$ packed form
128g0058l7179J65161j0073j04454R3955Q4842r2116k8843N0548n0936k6659O8872
140D3060k6076n5701P6880J1629j18096L1532J08695r8380j00095J12263L9409
151B5120j13447M0481J23678n1916m8257Q7178j9065j02435O5929Q8358p9027
162A6597l6512Q0352j9285p9113J8578R426l3280M8580K3951q9276Q399J05415
174E3832n3763r8155Q9776O2365j13795j4368J17835j3629o0896P6983L5793q7693
186e715o79N9391m6686k9261O9904n882o9708K4690K5245n8861n20N0396k9859
199a7545j6303N7613k4890o6013O8346N6356r6615k7574J09057l162r3033M3128
211a0635P9875m1650l1099L5918k2466l5352L7748L141m5983K7180L5246n3559
$$ plain form
223 -21636 -44378 4271 -3705 -31930 12366 22931 -30406 -6853 42962 -9818 -36958 40794
235 40794 42804 -40679 -17787 53063 12055 -29950 23133 40024 -9645 -16156 -3337 -20187
247 -20187 -8676 10226 -22975 -29645 16813 2052 -47360 -13318 29898 -3872 -14706 22285
259 22285 6476 -20164 20393 31219 -18336 -3916 47534 12280 -33669 9544 41171 2492
271 2492 -11936 9875 2159 -12692 -9340 -17582 -15395 9720 -3058 -37901 -14455 16243 -15930
284 -15930 -29499 16288 22616 -15423 -6492 19449 2790 -469 26029 15912 -6493 15576 26531
297 26531 -6412 -10132 22698 20015 -9997 -14587 -5452 -4264 -5536 -15951 -22400 -1193 7991 -24754
311 -24754 -34716 5049 16852 -14166 -12686 17054 12882 -6075 3064 15766 12720 14583 15887
$$ packed form
223b1636k2742M8649p976k8225M4296J0565n3337K3553M9815n2780k7140P7752
235D0794K010q3483K2892P0850m1008m2005N3083J6891m9669o511J2819j6850
247b0187J1511J8902l3201o670M6458j4761m9412L4042M3216l3770j0834L6991
259B2285j5809k6640M0557J0826m9555J4420N1450l5254m5949M3213L1627l8679
271B492j4428K1811p716j4851L352q242K187K5115j2778l4843K3446L0698l2173
284a5930j3569M5787O328l8039Q931K5941j6659l259K6498j0117k2405K2069J0955
297B6531l2943l720L2830k683l0012m590R135J188j272j0415o449K1207R184l2745
311b4754r962L9765J1803l1018J480K9740m172j8957R139J2702l046J863J304
$$ plain form
324 15887 4488 2314 12810 9725 -2270 1387 9020 999 -12347 -15536 -7750 -1019 -8750 -22083
338 -22083 -15347 313 -8480 -25706 -11646 14763 9863 -10766 -4199 17925 18772 2626 2858 19604
352 19604 23188 7399 -1245 6504 11282 7325 2341 -2412 -4767 -843 -4186 -19582 -20170 -3181
366 -3181 -4011 -23286 -23509 -6107 -2306 -8753 -6753 3324 13009 13008 1004 1830 23419 25011 242
381 242 1022 25432 17493 -7868 -124 15706 5163 -4324 -1635 -9534 -13300 -3234 -12651 -30311
395 -30311 -14668 1817 -18964 -28838 -3360 6960 -4097 776 8099 5240 15684 20277 -462
408 -462 2771 33697 21766 -12412 5624 31390 4464 -13508 10069 10737 -11586 -7657 -6188
421 -6188 -24124 -15626 -1559 -25962 -33940 1107 2771 -25999 -8513 20981 5031 -4021 16147
$$ packed form
324A5887j1399k174J0496l085j1995L657P633q021j3346l189P786O731p731j3333
338b2083O736J5660q793j7226J4060K6409m900k0629O567K2124Q47j6146K32J6746
352A9604L584j5789q644P749M778l957m984m753k355L924l343j5396n88J6989
366c181q30j9275k23J7402L801o447K000J0077R685jj2004Q26K1589J592k4769
381B42P80K4410p939k5361P744J5830j0543r487K689p899l766J0066r417j7660
395c0311J5643J6485k0781r874K5478J0320j1057M873P323k859J0444M593k0739
408d62L233L0926j1931l4178J8036K5766k6926j7972K3577O68k2323L929J469
421f188j7936Q498J4067k4403p978L5047J664k8770J7486K9494j5950r052K0168
$$ plain form
434 16147 11567 1434 21835 19048 -9097 9526 35360 -813 -21969 18261 23157 -17971 -12623
447 -12623 12185 -8107 -20149 -2556 -15050 -27728 2202 4316 -29850 -9170 31255 4207
459 4207 -17932 19595 25642 -8612 1436 19534 -5210 -3882 23182 -2232 -25124 14841 20312
472 20312 -29059 -17014 27437 43 -29526 3611 9972 -20458 -6031 10056 -16966 -7687
484 -7687 29935 4578 -20496 25206 36061 -16598 -12971 25663 -808 -25394 6218 5019 -22472
497 -22472 3013 16356 -25614 -17666 29858 2861 -32990 12399 32304 -15759 -14099 22288
509 22288 -998 -17724 15222 6914 -21875 13522 30198 -21035 -18835 29980 295 -43138
521 -43138 -2587 17884 -22988 -13046 22443 -3905 -13538 26282 9992 -27444 14063 39194
$$ packed form
434A6147m580j0133K0401k787k8145J8623K5834l6173k1156M0230M896m1128N348
447a2623K4808k0292j2042J7593j2494j2678K9930K114l4166K0680M0425k7048
459D207k2139L7527O047l4254J0048J8098k4744J328K7064k5414k2892L9965N471
472B0312m9371J2045M4451k7394k9569L3137O361l0430J4427J6087k7022R279
484g687L7622k5357k5074M5702J0855n2659L627L8634k6471k4586L1612j199k7491
497b2472K5485J3343m1970P948M7524k6997l5851M5389J9905m8063J660L6387
509B2288k3286j6726L2946q308k8789L5397J6676n1233K200M8815k9685m3433
521d3138M0551K0471m0872R942L5489k6348r633L9820j6290l7436M1507K5131
$$ plain form
533 39194 -14668 -17501 35750 13854 -29188 3766 19110 -17998 -4939 23908 -10080 -16746
545 -16746 28154 5785 -43339 -6147 21127 -32485 -38461 14796 1511 -30292 4719 14504
557 14504 -22503 -1451 29373 -10236 -14648 43130 30316 -18394 18212 50062 1082 -8089
569 -8089 35064 16686 -11517 20936 16377 -31446 -11147 13073 -43041 -59262 -1283 -11918
581 -11918 -60268 -22591 14682 -23522 -23647 19093 450 -16053 31505 33039 -8347 25512 64613
594 64613 13695 -6653 45823 35630 -14028 10939 32701 -9890 -12263 16370 -21389 -48030
606 -48030 -3997 -9445 -61567 -31129 16117 -24152 -41742 11166 10044 -27771 257 21530
618 21530 -11996 1980 42413 10451 -10080 41724 39847 -17013 4520 46377 6023 -15231
$$ packed form
533C9194n3862k833N3251k1896m3042L2954J5344l7108J3059K8847l3988o666
545a6746M4900k2369m9124L7192K7274n3612n976N3257j3285l1803L5011R785
557A4504l7007K1052L0824l9609m412N7778j2814m8710L6606L1850m8980r171
569h089M3153j8378k8203L2453m559m7823K0299K4220n6114j6221N7979j0635
581a1918m8350L7677L7273l8204j25M2740j8643j6503M7558J534m1386L3859L9101
594F4613n0918k0348N2476j0193m9658K4967K1762m2591k373K8633l7759k6641
606d8030M4033n448n2122L0438M7246m0269j7590N2908j122l7815K8028K1273
618B1530l3526J3976M0433l1962k0531N1804j877n6860K1533M1857m0354k1254
$$ plain form
630 -15231 25653 14894 -23753 747 7752 -39070 -26333 16629 -20171 -46315 9053 16920
642 16920 -35263 -18013 21606 -10139 -22790 17531 8558 -16051 22603 32666 -14858 153
654 153 44342 5931 -25949 22502 30517 -17205 -5370 22772 -12477 -24016 10091 -8342 -35727
667 -35727 5724 19368 -28914 -17846 28903 -460 -31545 8687 18505 -16969 -68 24896
679 24896 -5551 -5099 31769 5983 -26513 15461 29028 -22421 -16440 28480 2413 -28004 3936
692 3936 6927 -26105 -6805 13903 -19442 -15237 27265 5078 -28994 9735 27444 -16555 -12911
705 -12911 25555 6761 -12128 17612 13552 -15605 8232 23364 -18680 -18650 25526 5387 -31832
718 -31832 729 19758 -18385 -18979 10948 -5868 -17371 11993 6235 -20144 7192 24810 -14592
$$ packed form
630a5231M0884j0759l8647K4500P005m6822J2737M2962l6800k6144N5368P867
642A6920n2183J7250L9619l1745j2651M0321q973k4609L8654J0063m7524J5011
654A53M4189l8411l1880M8451Q015m7722J1835K8142l5249j1539L4107j8433k7385
667c5727M1451J3644m8282J1068M6749k9363l1085M0232R818l5474J6901K4964
679B4896l0447M52L6868k5786l2496M1974J3567n1449N981M4920k6067l0417L1940
692C936K991l3032J9300K0708l3345M205M2502k2187l4072L8729J7709m3999L644
705a2911L8466j8794j8889K9740m060k9157K3837J5132m2044L0M4176k0139l7219
718c1832L2561J9029l8143n94K9927j6816j1503K9364n758k6379K7336J7618l9402
$$ plain form
731 -14592 -16775 24488 10543 -21164 5674 21552 -7064 -3158 17865 -5177 -13300 17897 6269
744 6269 -25529 2170 24783 -13314 -21748 15342 6902 -20864 -1818 9513 -11731 -2197 15063
757 15063 -9104 -13753 18718 7665 -23681 1493 24823 -5881 -13855 15599 8317 -11433 5871
770 5871 8420 -13734 -599 17477 -9644 -17822 15059 9969 -21653 -6187 15663 -5077 -12210
783 -12210 7623 1914 -7873 9375 6851 -14078 2606 20530 -6405 -16044 14927 13492 -14270
796 -14270 -3988 12416 -4168 -8237 6532 -3525 -10984 8678 6169 -17451 -4066 16822 -4357
809 -4357 -17005 6535 10120 -7604 -1155 7721 -3092 650 11226 -3304 -8721 13807 10655
822 10655 -14653 -4724 16169 843 -12630 2849 6044 -5884 -1127 2446 -7665 -1653 9085
$$ packed form
731a4592k183M1263j3945l1707K6838J5878k8616L906K1023k3042q123L1197j1628
744F269l1798K7699K2613l8097q434L7090q440k7766J9046J1331k1244R534J7260
757A5063k4167m649L2471j1053l1346K5174K3330l0704p974K9454p282j9750J7304
770E871K549k2154J3135J8076k7121q178L2881n090l1622J5466K1850k0740p133
783a2210J9833n709r787J7248k524k0929J6684J7924k6935r639L0971j435k7762
796a4270J0282J6404j6584m069J4769j0057p459J9662k509k3620J3385K0888k1179
809d357j2648K3540L585j7724O449Q876j0813L742J0576j4530n417K2528l152
822A0655k5308R929K0893j5326j3473J5479L195j1928M757L573j0111O012J0738
$$ plain form
835 9085 -5709 -13717 5572 8079 -11235 -7371 9110 3031 -5017 2561 2735 -752 7037 5082
849 5082 -7600 515 13266 -840 -12379 3547 10214 -5474 -7523 3461 2186 -2164 -110
862 -110 -2846 -3204 5591 3110 -9252 -3545 9753 2178 -7860 794 7431 606 -2502 -312 -806
877 -806 1506 2477 -5711 -7678 2965 3886 -7956 -6902 5479 5238 -3990 -3466 3621 5230 2368 -935
893 -935 -589 5200 6061 -1418 -3728 4533 7709 -15 -3969 1210 4493 150 -5576 -4732 238 560
909 560 -5935 -8588 -3016 1065 -2498 -6430 -3165 3606 3282 -4267 -4990 4740 7817 -634 -2971 5929
925 5929 8811 2794 857 4454 7017 6747 2279 -2841 1040 6268 -1518 -10145 -3186 3216 -5261
940 -5261 -11060 -4585 -1794 -4044 -4175 -5500 -5451 2008 2682 -7552 -4876 9884 6748 -5434 1820
$$ packed form
835I085j4794q008J9289K507j9314L864J6481o079q048P578J74l487P789j955
849E082j2682Q115J2751j4106j1539J5926O667j5688k049J0984j275m350K054
862a10k736l58Q795k481j2362N707J3298p575j0038Q654O637o825l108K190m94
877h06K312R71q188j967J0643R21j1842J054J2381k41r228N24P087J609k862l303
893i35L46N789Q61p479k310Q261L176p724l954N179L283m343n726Q44M970L22
909E60o495k653N572M081l563l932L265O771l24p549p23R730L077q451k337Q900
925E929K882o017j937L597K563k70m468n120L881N228p786q627O959O402q477
940e261n799O475K791k250j31j325M9P459O74j0234K676J4760l136j2182P254
$$ plain form
955 1820 12754 6430 1148 6097 6153 4373 7159 1282 -6033 3115 7488 -7838 -11517 3561 2293
970 2293 -12023 -7621 1131 -4327 -5304 -665 -6261 -5594 6563 1754 -10849 2196 15321 -82
984 -82 -7522 9500 11435 -2152 1125 6547 -1077 1095 6505 -5251 -8474 8421 4470 -14342
998 -14342 -4242 11344 -2660 -11427 2953 3124 -6909 218 2133 -8865 -497 11240 -4565
1011 -4565 -11387 10999 11534 -10167 -3367 13513 1788 -6464 5754 3607 -4987 5822 5284 -11649
1025 -11649 -2477 13720 -4743 -16621 5707 8525 -13762 -8330 6508 -4967 -8251 5836 -1181
1038 -1181 -9381 9949 12161 -10331 -920 21648 4312 -11484 9181 13966 -5877 -1238 9337
1051 9337 -4945 -5659 8524 -5138 -17737 4389 7989 -18751 -12284 12183 -2573 -17882 2030
$$ packed form
955A820J0934o324n282M949N6j780K786n877p315R148M373j5326l679J5078j268
970B293j4316M402Q752n458r77M639n596O67J2157m809j2603J3045J3125j5403
984h2p440J7022J935j3587L277N422p624K172N410j1756l223J6895l951j8812
998a4342J0100J5586j4004q767J4380J71j0033P127J915j0998Q368J1737j5805
1011d565o822K2386N35k1701O800J6880j1725q252J2218k147q594J0809n38j6933
1025a1649R172J6197j8463j1878K2328K818k2287N432J4838j1475l284J4087p017
1038a181q200J9330K212k2492R411K2568j7336j5796K0665M785j9843M639J0575
1051I337j4282p14J4183j3662j2599K2126L600k6740O467K4467j4756j5309J9912
$$ plain form
1064 2030 6502 -9204 747 10819 -6022 -2529 18555 3662 -13504 10402 18883 -8979 -6635
1077 -6635 16806 4783 -8983 7456 6097 -9863 2821 9792 -13524 -10091 15414 -1143 -22599
1090 -22599 935 11449 -15089 -13187 8390 -3214 -11666 7570 3058 -13819 5619 15954
1102 15954 -10994 -8504 20968 8427 -13900 7724 18413 -4568 -1978 13917 -1975 -8087
1114 -8087 12654 3217 -17852 3477 16178 -14058 -16823 12055 2474 -19266 -1018 8622 -10924
1127 -10924 -4680 10113 -8423 -12224 13308 4580 -19160 3259 20793 -6493 -10711 16092 7951
1140 7951 -10747 6405 10591 -9351 1671 16840 -7020 -12168 17001 7891 -20679 -1900 16541
1153 16541 -8535 -13488 10093 914 -13385 4821 4797 -16858 -1531 16559 -9096 -15764 15787
$$ packed form
1064B030M472j5706R951J0072j6841L493K1084j4893j7166K3906Q481k7862K344
1077f635K3441j2023j3766J6439j359j5960J2684O971k3316L433K5505j6557k1456
1090b2599K3534J0514k6538J902K1577j1604q452J9236m512j6877J9438J0335
1102A5954k6948K490K9472j2541k2327K1624J0689k2981K590J5895j5892o112
1114h087K0741r437k1069K1329J2701l0236k765K8878r581k1740J8248R640j9546
1127a0924O244J4793j8536l801K5532q728k3740K2419J7534k7286m218K6803q141
1140G951j8698J7152M186j9942J1022J5169k3860n148K9169r110k8570J8779J8441
1153A6541k5076m953K3581r179j4299J8206k4k1655J5327J8090k5655o668L1551
$$ plain form
1166 15787 10690 -17219 -1233 15666 -6200 -8590 11679 552 -10714 11259 9780 -15672
1178 -15672 -734 19834 -5971 -16622 12525 10758 -13545 -722 12289 -7367 -6487 11236
1190 11236 -4460 -14114 12025 10485 -17735 -3288 19554 -4657 -16940 9277 8184 -12595
1202 -12595 784 10405 -9303 -4145 14541 -4730 -17017 10207 10676 -17990 -5909 16886 -2620
1215 -2620 -12715 8870 5352 -10640 5671 11424 -10454 -1425 20716 -398 -15914 11293 14338
1228 14338 -13891 -6223 14313 -2201 -10553 7303 951 -13727 3505 7396 -16527 -8540 14995
1241 14995 -3043 -18597 5843 11054 -11679 -4571 11091 -3470 -5917 12824 2926 -11132 10364
1254 10364 15861 -11161 -5866 19010 3864 -13490 6422 11522 -7462 -1779 8383 -7639 -7981
$$ packed form
1166A5787n097k7909J5986J6899k1866k390K0269j1127j1266K1973j479k5452
1178a5672J4938K0568k5805j0651K9147j767k4303J2823J3011j9656Q80J7723
1190A1236j5696r654K6139j540k8220J4447K2842k4211j2283K6217j093k0779
1202a2595J3379R621j9708N158J8686j9271j2287K7224M69k8666J2081K2795j9506
1215b620j0095K1585l518j5992J6311N753k1878R029K2141k1114j5516K7207L045
1228A4338k8229P668K0536j6514q352J7856o352j4678J7232L891k3923P987K3535
1241A4995j8038j5554K4440N211k2733P108J5662j4561k447J8741r898j4058K1496
1254A0364N497k7022N295K4876j5146j7354J9912N100j8984N683J0162j6022l42
$$ plain form
1267 -7981 9735 -3169 -18189 3736 10510 -14993 -11344 11417 -445 -13587 3764 6207 -8521
1280 -8521 2422 11852 -6401 -4868 16405 4501 -13914 5884 16004 -5806 -6752 11359 3138
1293 3138 -7210 4880 3002 -9377 2631 9395 -10696 -8789 12780 1507 -16642 113 9752
1306 9752 -8472 -8138 6592 -2238 -8163 6513 2632 -11097 3057 13078 -6419 -8168 13234
1319 13234 8261 -8286 2578 10285 -2222 -1090 6993 -3614 -5322 8949 708 -14424 176
1332 176 10409 -9239 -12242 7185 3598 -9783 44 5861 -4646 -104 8661 -2605 -5403 10377
1346 10377 5939 -9464 378 11667 -1528 -6717 4367 2205 -5137 1449 671 -7903 418 7078
1360 7078 -7546 -9814 7926 5105 -10952 -2481 9722 -358 -5591 3902 2639 -2552 4274 3460
$$ packed form
1267g981J7716j2904j5020K1925O774k5503L649K2761j1862j3142J7351K443j4728
1280h521J0943R430j8253J533K1273j1904j8415J9798J0120k1810r46J8111q221
1293C138j0348J2090j878j2379J2008O764k0091J907K1569j1273j8149J6755R639
1306I752j8224L34J4730q830n925J4676l881j3729J4154J0021j9497j749K1402
1319A3234m973j6547J0864P707j2507J132Q083j0607j708J4271q241j5132J4600
1332A76J0233j9648l003J9427l587j3381R827N817j0507M542Q765j1266k798J5780
1346A0377m438j5403R842J1289j3195n189J1084k162p342O586p78q574Q321O660
1360G078j4624k268J7740k821j6057Q471J2203j0080n233R493j263n191O826q14
$$ plain form
1374 3460 -5659 1599 9412 -2152 -6393 6552 6526 -4914 -1616 4151 -1716 -2038 2195 -4717 -6093
1389 -6093 4529 894 -11521 -3575 8079 -2481 -9450 2090 6085 -2655 -2256 2968 1158 1912
1403 1912 4604 -391 -983 7349 5487 -3914 104 7330 1246 -3805 552 730 -2888 -618 -1368 -6297
1419 -6297 -1702 3828 -4195 -8606 1998 5427 -4672 -5678 3130 3578 -2024 -2145 796 2510 3134
1434 3134 -9 -2112 3317 6002 -342 -3124 3208 4310 -1406 -2169 660 46 -325 498 -1669 -2032
1450 -2032 2635 2693 -3351 -2782 3671 2897 -3930 -4371 1607 2453 -3176 -5408 -412 3427 -1038 -5341
1466 -5341 -1427 3682 838 -3686 -1294 3273 2633 -955 -643 2876 4262 2436 828 2061 3491
1481 3491 2753 920 -1104 -1322 1036 474 -5196 -6615 228 1612 -6625 -6742 2425 3127 -4981 -4525
$$ packed form
1374C460r119P258P813j1564m241J2945k6j1440L298N767n867l22M233o912j376
1389f093J0622l635j2415P946J1654j0560o969J1540L995q740L99N224j810P54
1403A912K692m995n92Q332j862r401M018P226o084n051M357J78l618K270p50m929
1419f297M595N530q023m411J0604L429j0099j006Q808M48n602j21K941J714O24
1434C134l143k103N429K685o344k782O332J102n716p63K829o14l71Q23k167l63
1450b032M667N8o044N69O453p74o827m41N978Q46n629k232M996L839m465m303
1466e341L914N109k844m524K392M567o40l588L12L519J386j826j608J233J430
1481C491p38j833k024k18K358n62n670j419O843J384q237j17R167P02q108M56
$$ plain form
1497 -4525 2608 2921 -844 -1633 710 3754 3749 -955 -1094 5441 5396 -1397 -656 4696 1741 -2444 485
1514 485 -24 -3375 200 1869 -5335 -5334 4461 1905 -7608 -3011 5977 48 -6262 -1151 2550 416
1530 416 -722 -1429 -293 5396 4427 -3620 -2 9814 3477 -5667 2001 7052 -2846 -4602 2304 -1354
1546 -1354 -5897 1237 601 -8201 -2620 5978 -2927 -8155 2750 5177 -3314 -2283 3307 1796 2841
1561 2841 3943 -1217 1209 10112 2695 -7718 3313 10365 -4983 -9724 4502 2580 -9833 -3892
1575 -3892 2876 -5122 -4770 3580 -1857 -6934 3740 4984 -6257 -2330 7213 973 -3290 3456 2703
1590 2703 -629 5757 3805 -4984 3562 11378 -3943 -8947 8827 7408 -11558 -5631 8659 -1356
1604 -1356 -9187 1777 2074 -6433 -375 2731 -6799 -3337 6246 -2533 -8303 3606 4470 -5696 160
$$ packed form
1497d525P133L13l765p89K343L044nm704j39O535m5o793P41N352k955m185K929
1514D85n09l351L575J669p204JR795k556r513M597Q988n929o310N111L701k134
1530D16j138p07J136N689r69q047L618R816o337r144P668N051r898j756O906l658
1546a354m543P134o36q802N581Q598q905n228J0905K427q491J031N590j511J045
1561B841J102n160K426Q903p417j0413J1031P052j5348m741J4226j922j2413N941
1575c892O768p998L52Q350n437n077J0674J244j1241L927R543o240m263O746p53
1590B703l332O386j952q789Q546P816j5321n004J7774j419j8966N927J4290j0015
1604a356p831J0964K97q507O058L106r530L462R583q779n770J1909Q64j0166N856
$$ plain form
1619 160 6434 -2005 174 9920 76 -6444 9525 9556 -9886 -3983 14089 1621 -12144 2799
1633 2799 8912 -5285 -4387 4605 -1886 -4408 2985 -3089 -9037 2388 3216 -10547 -5086 7203
1647 7203 -3001 -8290 5679 4123 -6638 4051 9908 -5562 -3196 14283 3512 -10975 5783
1660 5783 14212 -4398 -6266 9607 4126 -6159 1038 1359 -6392 -7 1615 -11018 -5637 7307
1674 7307 -4257 -13392 4066 7220 -9343 -3012 10798 -982 -6409 9240 5227 -9392 2888
1687 2888 13002 -4915 -7547 11023 6449 -8621 441 7883 -2877 -3058 3314 -4260 -4365 6380
1701 6380 -2417 -12145 4114 9312 -10282 -7544 12113 2750 -11155 3806 9009 -7123 -3248
1714 -3248 9145 -2771 -8215 7965 5545 -9682 103 10846 -2837 -6611 5611 1550 -5837
$$ packed form
1619A60O274q439K179R746r844o520J5969L1j9442N903J8072j2468j3765J4943
1633B799O113j4197Q98Q992o491k522P393o074n948J1425Q28j3763N461J2289
1647G203j0204n289J3969j556j0761J0689N857j5470K366J7479j0771j4487J6758
1660E783Q429j8610j868J5873n481j0285P197L21p751O385J622j2633N381J2944
1674G307j1564r135J7458L154j6563O331J3810j1780n427J5649m013j4619J2280
1687B888J0114j7917k632J8570m574j5070R062P442j0760j81O372p574j05J0745
1701F380q797r728J6259N198j9594K738J9657r363j3905J4961N203j6132L875
1714c248J2393j1916n444J6180k420j5227R785J0743j3683l774J2222m061p387
$$ plain form
1727 -5837 2524 875 -8594 1823 8162 -8769 -7570 12914 4539 -13401 2069 14111 -4110
1740 -4110 -7604 8826 3233 -8059 3065 5801 -6958 -1097 9169 -3211 -8034 6237 3415
1753 3415 -9530 -1609 4535 -6242 -4030 5370 -4860 -7709 8751 4859 -11401 1903 15810
1766 15810 -2549 -9609 10470 9715 -7854 -1213 9014 -2226 -3670 5842 -923 -6343 5317
1779 5317 3272 -10192 -2173 6780 -6127 -9264 4214 -146 -9172 2372 4944 -8333 -1045 12408
1793 12408 -1282 -9290 9669 10847 -8533 -3270 11928 1398 -7341 3705 4102 -3908 1932
1806 1932 3703 -5706 -542 7883 -4344 -9276 5264 3664 -10429 -2719 7072 -4584 -5915 6717
1820 6717 683 -8718 4548 7829 -8552 -5030 10417 728 -10404 2393 7634 -3353 -1704
$$ packed form
1727e837Q361j649r469J0417O339j6931J199K0484q375j7940J5470J2042j8221
1740d110l494J6430n593j1292J1124K736j2759N861J0266j2380m823J4271k822
1753C415j2945P921O144j0777K212R400j0230k849J6460l892j6260J3304J3907
1766A5810j8359p060K0079p55j7569O641J0227j1240j444R512o765n420J1660
1779E317k045j3464Q019Q953j2907l137J3478m360r026J1544K572j3277P288J3453
1793A2408j3690q008J8959J178j9380N263J5198j0530q739J1046L97q010N840
1806A932J771r409N164Q425j2227m932J4540j600j4093P710R791j1656j331J2632
1820F717o034r401J3266L281j6381L522J5447r689j1132J2797N241j0987J649
$$ plain form
1833 -1704 5706 423 583 7048 61 -4234 7620 6009 -8822 -2360 9639 -2483 -9892 3504
1847 3504 3499 -8763 -2852 4246 -6515 -7028 5023 -1001 -10791 543 6847 -5122 -4609 7021 3886
1862 3886 -1377 4927 4757 377 6060 6483 -3954 159 10007 -655 -9564 3606 7044 -7686
1876 -7686 -6242 4994 -1430 -8116 67 163 -7775 -2033 3006 -6210 -6236 4709 1560 -5774 1612
1891 1612 6153 -48 1131 5236 327 1129 7793 1627 -4929 5522 8697 -4891 -4763 8098 3320
1906 3320 -7612 -1165 3962 -3875 -4885 -53 -4022 -5409 629 -1623 -7208 -590 4164 -2752 -3010
1921 -3010 4507 2756 -1180 3328 2978 -1070 3642 6166 -2330 -2191 7733 3444 -6292 -353 6821
1936 6821 -1291 -6050 496 1124 -3421 -2149 -1457 -3355 -208 1672 -3597 -2767 4257 1970 -3479 797
$$ packed form
1833a704P410n283J60O465o987m295J1854j611j4831O462J1999j2122p409J3396
1847C504nj2262N911P098j0761n13J2051o024r790J1334O304j1969N13J1630l135
1862C886n263O304j70m380N683M23j0437M113R848j0662q909J3170L438j4730
1876g686J444J1236o424o686Q183R6p938N742N039r216k6J0945l149p334P386
1891A612M541o201J179M105m909Q02O664o166o556J0451L175j3588J28J2861m778
1906C320j0932O447N127p837j010M832l969j387O038k252n585O618M754o916k58
1921c010P517j751l936M508l50m048M712K524q496J39R924m289r736N939P174
1936F821q112m759O546O28m545J272O92j898L147J880n269Q30P024k287n449M276
$$ plain form
1952 797 4247 -366 -839 2339 -642 -1536 3383 1294 -4615 474 5384 -1311 -4846 2466 4439 -1957
1968 -1957 -2861 1273 1323 -154 -408 -1571 57 2972 -175 -3562 733 3639 -1628 -3497 1055 1227
1984 1227 -2093 -1217 118 -1309 413 2078 -807 -1907 3086 3416 -1701 -1427 3160 2383 -1827 -1781
2000 -1781 519 1435 -283 -2210 -1684 1998 1664 -2657 -2100 2300 1850 -2444 -1706 1518 1049 -1022 -1067
2017 -1067 -74 799 726 -241 -1246 61 1758 26 -2098 -1148 1442 1258 -1735 -1799 1582 2807 -321
2034 -321 -1804 1732 3352 292 -1786 -20 1907 391 -2507 -2472 352 615 -2324 -2897 506 1790
2050 1790 -1062 -1487 750 1249 737 524 -474 -139 2350 1609 -2242 -645 3593 1638 -2612 -588 2261
2067 2261 312 -1673 -1175 -657 442 253 -2546 -2293 2341 2154 -3156 -1468 3920 1618 -2449 38
$$ packed form
1952G97L450m613m73L178k981q94M919k089n909N089M910o695l535P312J973o396
1968a957r04M134N0j477k54j163J628K915l147l387M295K906n267j869M552J72
1984A227l320Q76J335j427J722J665k885j100M993L30n117K74M587p77m210M6
2000a781K300R16j718j927N26L682l34m321N57M400m50m294P38L224m69k071m5
2017a067R93Q73p3r67j005J307J697j732k124R50K590j84k993o4L381J225l128
2034c21j483L536J620l060k078J766J927j516k898L5K824K63k939n73L403J284
2050A790k852m25K237M99n12k13r98L35K489p41l851J597M238j955m250K024K849
2067B261j949j985M98N18J099j89k799K53M634j87n310J688N388k302m067K487
$$ plain form
2083 38 1768 -564 -602 232 -1744 -862 2605 -264 -3452 1181 4195 -1058 -2739 2135 1809 -1755 -676
2100 -676 -175 -1370 969 1117 -3481 -1327 4637 1031 -4346 1173 5206 -932 -2755 2223 1382 -1394
2116 -1394 1150 851 -1985 1667 3625 -2338 -2673 4174 1778 -4987 -1431 2151 -2420 -3334 -10 -1871
2132 -1871 -2345 2349 89 -4572 1680 5906 -2094 -3571 4659 3729 -3064 -66 4182 263 514 3850
2148 3850 367 -809 5018 2580 -4557 49 4793 -3103 -6250 485 -199 -5843 -2429 -353 -4705
2163 -4705 -2149 2395 -3501 -4801 4361 3392 -4971 -350 7202 1313 -1610 5074 4929 829 4511
2178 4511 4816 -1125 1815 6155 -2035 -6007 2674 1238 -8222 -4842 1670 -4065 -5851 277 -1879
2193 -1879 -5203 1581 1971 -5681 -1136 6902 -353 -5157 4617 6086 -1905 1125 6688 1462 466
$$ packed form
2083C8J730k332l8Q34j976Q82L467k869l188M633L014n253j681M874l26l564J079
2100f76N01j195K339J48m598K154N964l606n377N519M033o138j823M978q41k776
2116a394K544k99k836L652J958n963l35O847k396o765L556L582m571r14L324j861
2132a871m74M694k260m661O252M226q000j477Q230r30o793K998M248l919K51L336
2148C850l483j176N827k438p137M606M744p896l147O735o84n644L414K076m352
2163d705K556M544n896j300R162r69q363M621P552n889k923O684j45m100L682
2178D511L05n941K940M340q190l972Q681j436r460L380O512n735j786O128k156
2193a879l324O784L90p652M545Q038p255m804R774J469p991L030N563n226r96
$$ plain form
2208 466 5441 746 -3571 3650 3335 -6797 -3281 5140 -1853 -7583 917 2228 -4662 -1636 2455
2223 2455 -3296 -2581 3932 -1423 -6361 3236 5141 -5137 -2185 7101 1791 -3311 3930 4196 -2087
2238 -2087 1912 3834 -3993 -2227 5514 -1279 -7577 2176 4870 -5447 -3707 4537 -379 -4453 2102
2253 2102 821 -4700 1359 4207 -4527 -2583 7347 1880 -5441 3263 6908 -2438 -1779 4525 -774
2268 -774 -3518 2715 -545 -6874 836 4288 -5926 -4839 5927 1153 -6680 1045 4554 -2895 -1290
2283 -1290 4040 -1548 -2372 5429 1824 -5097 3193 7663 -2908 -3510 6235 2164 -5317 799 2275
2298 2275 -4666 -1545 2852 -4453 -4857 4808 952 -7354 362 6041 -3418 -4499 4380 1418 -3603
2313 -3603 2263 3034 -3068 1827 6498 -2055 -2939 7093 3467 -6013 -36 5575 -3076 -4407 2547
$$ packed form
2208D66M975m695m317P221l15j0132L516Q421o993n730Q500J311o890L026M091
2223B455n751P15O513n355m938R597J905j0278K952R286n310n102P241K66o283
2238b087L999J922p827J766P741o793o298R753K694j0317J740Q244m916m074O555
2253B102j281n521O059K848q734J944R930n467p321Q704L645r346O59O304n299
2268g74k744O233l260o329P710L452j0214J087J0766m774p833P725L509p449J605
2283a290N330n588q24P801l605o921Q290M470j0571o02R745m071p481O116J476
2298B275o941L121M397p305m04R665l856q306P716N679r459j081Q879k962n021
2313c603N866P71o102M895M671q553q84J0032l626r480N977N611q651j331O954
$$ plain form
2328 2547 -1091 -4756 1610 1080 -5995 -116 5307 -3516 -5372 4871 3171 -5482 35 5007 -1330
2343 -1330 -1376 4402 50 -2559 4970 3244 -5195 552 6742 -2359 -5613 3537 2412 -5067 -639
2358 -639 2788 -3103 -1409 3567 -2157 -4644 3739 2392 -6568 -1483 5564 -1652 -4751 3056 2384
2373 2384 -2680 1630 3387 -2214 681 6043 -1015 -4195 4666 4126 -4965 -1769 4829 -903 -4021
2388 -4021 1718 290 -3900 743 1496 -5179 -2020 4616 -1826 -5957 2658 3774 -3629 -1015 4302
2403 4302 209 -1297 3509 632 -2380 3404 3573 -4324 -1290 5426 -407 -5125 1858 3327 -3088
2418 -3088 -1384 2194 -1657 -1721 2638 -939 -4208 2340 3377 -4257 -2360 4554 465 -4200 987
2433 987 2132 -2027 -39 1937 -2504 -1075 3976 -286 -4480 2541 4388 -2759 -2026 4014 1340
$$ packed form
2328B547l638l665O366n30p075N879N423q823j856J0243j700q653N517M972o337
2343a330m6N778m352k609P529j726q439N747O190r101l254R150j125p479M428
2358f39L427n891J694M976n724k487Q383j347q960N085P047p216l099P807o72
2373B384n064M310J757n601K895N362p058l180Q861n40r091L196O598n732l118
2388d021N739j428m190M643P53o675L159O636o442m131Q615J116p403K614N317
2403D302m093j506M806k877l012N784J69p897L034O716n833m718O983J469o415
2418c088J704L578l851o4M359l577l269O548J037p634J897O914m089m665N187
2433I87J145m159J988J976m441J429N051m262m194P021J847p147P33O040k674
$$ plain form
2448 1340 -2413 1159 1481 -1746 991 2098 -2892 -1638 3966 -93 -4686 857 3336 -2312 -2444
2463 -2444 1729 -87 -1924 1154 -169 -2878 1336 2679 -3229 -2264 3664 1295 -3729 159 3226
2478 3226 -636 -981 1778 163 -50 2846 561 -2314 1839 3309 -2183 -2540 2830 1217 -3194 -821
2494 -821 726 -1700 -1253 -6 -2646 -1920 1766 -502 -3946 280 3437 -630 -1846 2455 2668 275
2510 275 1129 1625 585 1787 2102 -1360 -1114 2501 483 -3632 -877 1853 -1198 -2729 -623 -294
2526 -294 -1253 -227 -990 -2038 303 1465 -1717 -1908 2183 2019 -1243 -543 2072 1442 67 350 265
2543 265 812 1767 3 -1455 1092 2653 -658 -1910 1236 1774 -1112 -1609 -451 -381 -913 -1494 -2084
2560 -2084 -1293 359 -523 -2214 -464 2015 498 -897 226 1792 1297 26 -223 818 2107 1125
$$ packed form
2448A340l753L572L22l227K737J107m990J254N604m059m593N543K479n648j32
2463b444M173j816j837L078j323k709M214J343n908R65N928k369n024L888L067
2478C226l862l45K759j615k13K896k285k875M153J470n492l57N370j613m411K373
2494h21J547k426M47J247k640P26L686k268l444M226L157m067j216M301K13k393
2510B75Q54M96j040J202L15l462K46L615k018m115K755K730l051j531K106L29
2526b94r59J026p63j048K341J162l182j91M091j64l262P00K615o30j375K83q5
2543B65N47R55j764j458K547J561l311j252L146N38k886m97J158P0n32n81n90
2560b084P91J652q82j691J750K479j517j395J123J566m95j271k49J041J289r82
$$ plain form
2576 1125 -678 3 1931 1280 -1094 -1024 834 381 -1386 -1991 -478 373 -819 -1881 -923 674 524
2593 524 -842 -817 470 1149 187 -1168 -200 1485 739 -1067 -361 1682 1594 -322 -169 1167 1368 230
2611 230 -985 -995 412 361 -2083 -2222 556 912 -1572 -1380 895 1157 -354 -407 208 614 986 242 -1231
2630 -1231 350 2271 153 -1562 770 2258 -354 -1248 389 169 -280 -353 -1436 -1450 828 349 -2642
2647 -2642 -885 2301 536 -2127 73 1863 -65 -691 365 -223 332 1253 -344 -1272 2139 2656
2663 2656 -911 -623 2841 1409 -1458 -240 699 -993 -582 -284 -2456 -1236 1267 -1087 -3756 136
2679 136 2267 -2098 -2482 1447 857 -1329 567 1144 -10 1963 2618 -511 417 4211 1841 -2147
2695 -2147 958 3138 -1211 -2044 513 -699 -2080 -18 -1031 -3206 127 1537 -2906 -2651 2392
$$ packed form
2576A125j803O81J928o51k374P0J858m53j767o05J513Q51j192j062R58J597j50
2593E24j366K5J287O79r62j355R68J685p46j806P06K043q8j916J53J336K01j138
2611B30j215j0J407n1k444j39K778L56k484J92K275K62j511n3O15M06L72p44j473
2630a231J581J921k118j715K332J488k612q94J637k20m49p3j083j4K278m79k991
2647b642J757L186j765k663K200J790j928o26J056n88N55R21j597r28L411N17
2663B656l567K88L464j432k867J218R39j692M11K98k172J220K503k354k669L892
2679A36K131m365l84L929n90k186J896N77j154J973O55l129R28L794k370l988
2695b147L105K180m349q33K557j212j381K062j013k175L333J410m443K55N043
$$ plain form
2710 2392 987 -3376 -621 2249 -681 -629 1643 301 -74 3120 1485 -1973 1862 4089 -1276 -2223
2726 -2223 2752 1509 -2542 -266 1559 -1302 -646 1220 -1703 -2400 2062 118 -4508 -929 2646
2741 2646 -2138 -3577 1474 1153 -1661 814 1743 -967 1174 3651 -608 -1503 3766 2355 -3077 -41
2757 -41 3839 -498 -2419 1682 481 -2091 800 319 -3374 -933 2544 -2314 -4015 1949 1839 -3488
2773 -3488 -871 3115 -135 -814 2563 625 -1373 2295 1653 -3125 -152 4219 -823 -3505 2177
2788 2177 2509 -2326 -513 2314 -1058 -953 2020 -1224 -3192 2126 1778 -4147 -1470 3771 -577 -3514
2804 -3514 1671 2035 -1820 279 2105 -1987 -568 3293 -674 -3270 2839 3188 -3091 -1259 3991
2819 3991 274 -2585 1391 929 -2582 497 1226 -3331 -1397 3447 -827 -4205 1857 3379 -2638
$$ packed form
2710B392j405m363K755K870k930N2K272j342l75L194j635l458L835K227n365r47
2726b223M975j243m051K276J825k861O56J866k923o97M462j944m626L579L575
2741B646m784j439N051l21k814K475R29k710K141K477m259q95N269j411n432L036
2757d1L880m337j921M101j201k572K891m81l693K441L477m858j701N964j10n327
2773c488K617L986l250o79L377j938j998L668o42m778K973M371n042k682N682
2788B177L32m835J813K827l372J05K973l244j968N318l48n925K677N241m348k937
2804c514N185L64l855K099J826m092J419L861l967k596O109L49o279J832N250
2819C991l717k859L976m62l511L079P29m557J934M844m274l378O062J522o017
$$ plain form
2834 -2638 -1303 3327 145 -1577 2109 674 -2471 1509 2611 -3218 -1745 4015 -37 -4222 1011
2849 1011 2534 -2442 -1470 2074 -848 -1592 2485 275 -3008 2143 3533 -2621 -1699 4223 1136 -3229
2865 -3229 949 2212 -1901 -543 1968 -1770 -1780 2718 80 -4398 1045 3233 -2917 -2614 2975 523
2881 523 -2738 771 1399 -1963 470 2513 -1853 -1489 3893 1203 -3624 1177 4036 -1706 -1828 2667
2897 2667 587 -1973 1113 745 -2777 440 2595 -2748 -2928 2924 744 -4173 -197 2728 -1558
2912 -1558 -1621 1831 -167 -1553 2387 936 -2796 1188 3895 -1674 -2330 3270 1960 -2778 204 2251
2928 2251 -1352 -950 1796 -1431 -2183 2125 757 -3715 -132 3163 -1743 -2894 2230 1398 -2144 472
2944 472 1621 -1386 135 2605 -1254 -2079 2941 1555 -3490 -416 3197 -844 -2781 1413 811 -1895
$$ packed form
2834b638J335M630l182j722L686j435l145L980J102n829J473N760m052m185N233
2849A011J523m976R72L544k922p44M077k210l283N151J390o154R22N922l087m365
2865c229M178J263m113J358K511l738j0M498k638m478N443K188o150L03N589k452
2881E23l261L509O28l362K433K043m366L64N382k690m827M801K859n742j22M495
2897B667k080k560L086l68l522L217K155n343j80N852k180m917L976K925m286
2912a558o3L452j998j386L940j451l732L984K707n569o56N600j310m738K982K047
2928B251l603M02K746l227p52M308j368m472L583L295m906j151N124q32l542K616
2944D72J149l007J521K470l859q25N020j386n045L074L613m041j937M194o02k706
$$ plain form
2960 -1895 339 815 -2135 105 2768 -1138 -2231 2681 2113 -2547 -275 2759 -210 -1309 1578
2975 1578 7 -1525 1521 995 -2800 -362 2983 -1257 -3472 1263 1642 -2427 -1286 1441 -597
2990 -597 -708 1265 -335 -1450 2226 1549 -2305 60 3349 26 -2046 1708 1937 -1178 136 1437
3006 1437 -1062 -316 1727 -868 -2564 1117 1179 -3038 -2201 1664 -506 -2580 -150 585 -774 486
3022 486 843 -1171 657 2887 -165 -1636 2382 2614 -1364 -398 2457 681 -1037 732 454 -1291
3038 -1291 392 332 -2457 -1684 1321 -693 -2886 -200 1082 -954 -893 714 249 263 1125 -259 -620
3055 -620 1863 1763 -1715 -340 2868 807 -1537 324 1835 -299 -731 419 -644 -826 185 -882
3071 -882 -1893 -11 902 -1430 -1418 915 775 -752 118 330 189 951 537 -896 259 2339 339
$$ packed form
2960a895K234M76k950K240K663l906j093M912n68m660K272L034k969j099K887
2975A578j571j532L046n26l795K438L345m240k215M735L79m069J141K727k038
2990e97j11J973j600j115L676o77l854K365L289l323k072L754K29l115J314J301
3006A437k499P46K043k595j696L681O2m217Q37L865k170k074K430P35j359J260
3022D86L57k014J828K230l052j471M018K32l978R66K855j776j718J769k78j745
3038a291J683o0k789P73L005k014k193K686J282k036O1J607m65J4Q62j384l61
3055f20K483j00l478J375L208k061k344J861J511k134m32J150j063j82J011j067
3071h82j011J882R13k332J2K333j40j527Q70K12j41P62m14j433J155K080k000
$$ plain form
3088 339 -1464 910 2497 -356 -1330 834 804 -675 -1020 -638 -705 -240 -494 -1658 -839 552 -278 -1182
3106 -1182 -172 750 58 -212 177 66 588 1088 11 -265 1396 1994 -374 -597 1417 1697 -808 -1249
3124 -1249 467 265 -1002 -1884 -882 -139 -578 -1622 -1148 199 63 -1023 -663 545 549 244 292 346 634
3143 634 1333 705 202 670 1469 980 -329 -440 919 372 -1095 -1553 278 620 -1311 -1931 70 893
3161 893 -843 -1375 31 619 -434 -769 -232 344 340 -64 -143 529 845 519 198 636 761 577 574 -96 -337
3182 -337 855 811 -1173 -1215 1014 743 -1875 -1293 718 223 -1970 -1354 179 -58 -687 -880 -289 922
3200 922 701 -493 4 1771 1281 -129 476 1396 357 6 955 -230 -639 804 611 -1966 -874
3217 -874 1244 -324 -2336 -534 1057 -614 -1417 -327 230 150 -54 -695 -66 1786 725 -1417 475
$$ packed form
3088C39j803K374J587k853r74K164l0j479l45L82o7M65k54j164Q19J391q30r04
3106a182J010R22o92k70L89j11N22N00j077k76J661N98k368k23K014K80k505m41
3124a249J716k02j267q82J002P43m39j044M74J347j36j086L60J208Ml05M8N4K88
3143F34O99o28n03M68P99m89j309j11J359n47j467m58J831L42j931o20K001Q23
3161H93j736n32J406N88j053l35N37N76mm04p9O72L16l26l21M38J25j84lo70k41
3182c37J192m4j984m2K229k71k618N82K011m95k193O16J533k37o29j93N91J211
3200I22k21j194M97J767m90j410O05R20j039l51R49j185m09J443j93k577J092
3217h74K118j568k012J802J591j671q03J090N57q0k04o41O29J852j061k142J892
$$ plain form
3234 475 2304 -89 -1321 1083 1160 -999 -67 1010 -544 -431 1319 -43 -1663 406 1495 -1190
3250 -1190 -1685 778 336 -1148 -633 -195 -283 571 -85 -1609 325 2211 -767 -1993 1763 2255 -1307
3267 -1307 -725 2382 812 -1056 1020 994 -915 289 1265 -1165 -1077 1115 43 -2060 -335 643 -803
3284 -803 -695 128 -592 -297 1403 -498 -1832 1490 2257 -2013 -1016 2930 860 -2379 444 2199 -636
3301 -636 -931 1201 -61 -749 726 78 -1691 159 1324 -1269 -1108 1234 0 -1176 645 134
3317 134 -1507 729 1567 -1814 -1313 2763 896 -2953 428 3038 -532 -1976 1398 1328 -848 160
3333 160 824 -904 466 944 -1508 -1105 1797 110 -2391 292 1447 -1625 -1033 1523 -558 -1373
3349 -1373 1729 1101 -2332 230 3340 -667 -2182 1934 2301 -1688 -591 1660 -67 -586 650 -635
$$ packed form
3234D75J829k393j232K404P7k159R32J077j554J13J750j362j620K069J089k685
3250a190m95K463m42j484N15M38q8Q54o56j524J934J886k978j226L756M92l562
3267a307N82L107j570j868K076k6j909J204R76k430Q8K192j072k103J725R78j446
3284h03J08Q23p20K95J700j901j334L322P67m270R97L946k070l239K823J755k835
3301f36k95K132j262o88J475o48j769J850J165k593J61K342j234j176J821n11
3317A34j641K236Q38l381N01M076j867l849L381K610l570j444L374p0k176J008
3333A60O64j728J370M78k452M03K902j687k501K683J155l072N92K556k081q15
3349a373L102o28l433K562L110m007j515M116L67l989J097K251j727n19J236j285
$$ plain form
3365 -635 -951 1412 -148 -2571 290 2076 -2007 -2182 1848 637 -2223 510 1633 -1498 -554 2285
3381 2285 -385 -1878 1948 1947 -1962 -583 2540 139 -1718 551 652 -862 416 238 -1941 188
3397 188 1686 -1980 -2255 2137 1004 -3131 -570 2553 -923 -1939 1518 768 -1807 746 1698 -1318
3413 -1318 -500 2316 176 -1648 1219 1594 -1145 -340 1236 -744 -308 1149 -983 -1703 1808 921
3429 921 -3150 -635 3048 -554 -2984 1266 1768 -1904 -572 1796 -390 -810 1447 -8 -1428 1121
3445 1121 1413 -1769 -566 1930 -247 -1337 1008 276 -1559 675 954 -1991 -460 2600 -568 -2719
3461 -2719 1463 2518 -1924 -1424 2172 506 -1844 438 742 -1043 319 731 -1357 -565 1884 -462
3477 -462 -1889 1177 1513 -1548 -357 1636 -537 -730 1744 407 -1891 1144 2319 -1675 -1348 2499
$$ packed form
3365f35l16K363j560k423K861J786m083j75M030j211k860K733J123l131R44K839
3381B285k670j493L826jl909J379L123k401j857K269J01j514J278j78k179K129
3397A88J498l666k75M392j133m135K561L123l476j016L457p50k575K553R52l016
3413a318Q18K816k140j824K867L75k739Q05J576j980M36J457k132p20L511q87
3429I21m071K515L683l602k430M250N02l672J332K368k186m20K257j455j420K549
3445A121K92l182J203K496k177j090K345p32j835K234K79k945J531L060l168k151
3461b719M182J055m442N00L596j666k350K282L04j785J362M12k088P92K449k346
3477d62j427L066L36l061J191J993k173j93K474j337k298L035J175l994L27L847
$$ plain form
3493 2499 817 -2560 -71 1451 -893 -963 359 -625 -448 1150 -410 -1665 1182 1593 -1852 -814
3509 -814 2185 195 -1698 1110 1433 -942 105 1979 -691 -942 2156 697 -2166 45 1886 -982
3525 -982 -1847 764 203 -983 -119 -205 -1145 196 888 -1897 -932 2004 -49 -2170 587 2096 -895
3542 -895 -673 1827 668 -493 1220 1285 -939 585 1791 -920 -1535 994 396 -1668 -639 420
3558 420 -679 -703 159 -949 -832 1193 -11 -1905 598 2094 -871 -1446 1875 1508 -865 219 1575
3575 1575 229 -212 948 -181 -965 753 252 -1730 -562 838 -730 -1428 366 201 -774 170 181
3592 181 -1129 322 1412 -690 -1016 1749 1366 -1240 -221 1938 514 -745 326 556 -375 -39
3608 -39 -95 -1090 -71 744 -984 -1348 586 583 -961 -616 591 -201 -336 447 -268 -413 1095 796 -746
$$ packed form
3493B499j682l377K489J522k344p0J322r84J77J598j560j255K847M11l445J038
3509h14K999j990j893K808L23k375J047J874k670k51L098j459k863K211J841k868
3525i82q65K611n61j186Q64q6r40J341O92k785R65K936k053k121K757J509k991
3542h95K22K500j159j161J713O5k224J524J206k711o15K529n98k064J029J059
3558D20j099k4Q62j108J17K025j204j894K503J496k965n75L321l67k373J084J356
3575A575j346m41J160j129p84J718n01j982J168J400j568o98J794j65r75R44J1
3592A81j310J451J090k102l26K765l83k606J019K159j424j259J071K30r31L36
3608c9n6r95J019Q15j728l64J934lj544L45J207p92j35P83p15j45J508k99j542
$$ plain form
3627 -746 226 1896 423 -924 670 1295 -193 -527 84 -153 -57 -198 -916 -860 559 -124 -1603 -780
3645 -780 590 -492 -1149 -32 306 -355 8 388 218 632 1090 510 -229 1175 1361 -62 -299 805
3663 805 618 -401 -577 -299 -249 -128 -656 -1242 -202 228 -624 -1234 -84 454 -597 -808 141 599 79
3682 79 149 226 623 935 530 -3 237 1040 533 -448 -59 429 324 -280 -481 -71 324 -134 -664 -442 50
3703 50 -155 -916 -870 156 131 -526 -517 247 552 68 -311 8 712 440 31 214 507 617 305 -129 150
3724 150 612 453 -212 -341 475 267 -476 -755 80 -82 -396 -647 -505 -17 57 -598 -682 201 641 -355 -660
3745 -660 593 615 -147 -248 200 335 530 328 -261 165 848 43 -694 -28 786 -226 -807 -98 183 -320
3765 -320 -190 -179 -433 282 473 -819 -537 879 455 -1064 -221 841 106 -556 214 236 231 687 138 -704
$$ packed form
3627g46R72J670j473j347J594O25j488l34O11k37R6j41p18N6J419o83j479Q23
3645g80J370j082o57J117L38o61L63L80j70M14M58n80p39J404J86j423k37J104
3663H05j87j019j76K78N0J21n28n86J040M30q52o10J150N38j051k11R49M58n20
3682G9P0P7L97L12m05n33K40Q03n07r81L89M88j05o04k01M10L95m58n30K22M92
3703E0k05p61M6J026k5o57RP64L05m84l79L19P04k72m09J83K93J10l12m34K79
3724A50M62j59o65j29Q16k08p43k79Q35j62l14k51J42M88P4o55q4Q83M40r96l05
3745f60J253K2p62j01M48J35J95k02n89M26O83q05p37O66Q14j012n81P09K81n03
3765c20J30J1k54P15J91j292K82J416m24j519Q43J062p35o62P70K2nM56n49q42
$$ plain form
3785 -704 490 959 -521 -779 785 848 -711 -307 396 -263 -271 267 -373 -415 711 -25 -1386 -113 1060
3804 1060 -426 -1063 585 597 -568 -258 427 -68 358 763 -393 -658 1205 635 -1252 -418 1233 -193
3822 -193 -1005 328 404 -597 -63 147 -795 -38 866 -641 -1215 692 815 -1191 -434 1241 124 -685
3840 -685 572 351 -486 779 377 -1029 -71 1410 -277 -1394 729 1126 -752 -654 781 -188 -567
3857 -567 163 -337 -998 328 369 -1384 -712 1647 73 -1332 668 1002 -523 -42 795 -187 -122 1172
3875 1172 -76 -1083 897 1206 -1097 -704 1354 16 -1380 45 374 -988 -280 506 -1132 -695
3891 -695 1028 -454 -1629 589 1463 -1079 -602 1396 425 -726 636 585 -514 796 1178 -874 -286
3908 -286 1816 283 -1509 336 1090 -1236 -1033 531 -455 -1162 253 -149 -1487 160 961 -1254 -1001
$$ packed form
3785g04J194M69j480k58J564O3j559M04P03o59qN38o40m2J126p36j361J273J173
3804A060j486o37J648J2j165L10O85m95M26M05j156k65J863n70j887Q34J651j426
3822a93q12J333P6j001N34K10r42P57R04j507n74J907J23k006P57J675j117q09
3840f85J257k21q37J265m02j406R58J481j687j117K123L97j878R8J435r69l79
3857e67P30n00o61J326M1j753O72K359j574j405K000L34j525M81Q37r82O5J294
3875A172j248j007J980L09k303L93K058j338j396J425L29j362P08P86j638M37
3891f95J723j482j175K218Q74k542M77J998r71j151J362n1j099J310L82k052N88
3908b86K102j533j792J845P54k326K03J564r86p07J415m02j338J647Q01k215K53
$$ plain form
3925 -1001 1717 571 -1285 354 1622 -425 -175 1418 35 -204 1431 331 -1328 612 1435 -1268
3941 -1268 -1372 1215 232 -1649 -327 527 -1082 -426 678 -938 -1030 1314 257 -1538 797 1817
3957 1817 -569 -846 1292 654 -712 423 836 -744 236 1228 -904 -1001 1382 444 -1824 -171 1383
3974 1383 -832 -1054 585 -10 -932 615 368 -1265 46 1493 -813 -1198 1530 860 -1334 63
3990 63 1451 -414 -385 1126 19 -813 943 559 -1574 -33 1573 -737 -1456 1012 642 -1308 -145
4007 -145 783 -747 -395 940 -460 -1014 1029 766 -1437 -174 1612 -402 -1259 914 568 -950 135
4024 135 630 -926 -121 1287 -441 -1350 1103 934 -1439 -308 1384 85 -1079 599 292 -779
4040 -779 555 615 -925 -334 1355 -442 -1408 745 980 -1425 -567 990 -395 -725 614 -230 -1051
$$ packed form
3925a001K718j146j856J639J268k047K50J593j383k39J635j100j659J940Q23k703
3941a268j04K587r83j881J322Q54j609O56J104j616r2K344j057j795K335J020
3957A817k386k77K138o38j366J135M13j580R80R92k132r7K383r38k268J653J554
3974A383k215k22J639n95r22J547k47j633J311J447k306l85K728o70k194J397
3990F3J388j865K9J511j107q32J756l84k133J541J606k310p19K468l70j950J163
4007a45R28j530L52J335j400n54K043k63k203J263J786k014q57K173l46j518J085
4024A35M95j556Q05J408j728r09K453j69k373J131J692j299j164J678l07j071
4040g79J334O0j540N91J689j797r66K153K35k405Q58J557j385l30J339q44q21
$$ plain form
4057 -1051 563 744 -1355 -229 1591 27 -1140 699 1129 -635 -184 872 -218 -282 982 -484
4073 -484 -1160 627 640 -1430 -792 1109 -120 -1493 210 501 -714 139 765 -479 -184 1235 -74
4090 -74 -973 829 1166 -883 -616 1064 44 -719 407 228 -892 98 577 -875 -546 1047 -169
4107 -169 -1518 439 1099 -650 -511 829 262 -299 541 286 -595 602 734 -761 -482 1096 178 -1370
4125 -1370 105 667 -441 -493 430 -314 -575 718 -193 -1013 346 940 -668 -776 1158 519 -717 85
4143 85 859 -2 7 453 -184 -63 814 44 -847 461 1001 -627 -922 621 420 -907 -255 -30 -632 -148
4163 -148 227 -808 -520 548 348 -819 172 961 -15 -240 575 591 317 429 146 -300 620 517 -638
4182 -638 -542 687 75 -1082 -478 293 -340 -637 -116 -253 -297 183 -103 -744 214 916 -185 -240 730 892
$$ packed form
4057a051J614J81k099J126J820j564j167J839M30j764M51J056j090o4J264j466
4073d84o76J787J3k070O38J901j229j373J703K91j215Q53O26j244K95J419j309
4090g4q99J802L37k049K67J680j020p63J126j79j120R90M79j452L29J593j216
4107a69j349J957O60j749J39J340n67n61Q40k55q81J197J32j495K79J578r18j548
4125a370J475N62j108n2R23p44k61J293r11q20J359N94j608j08J934o39j236Q02
4143H5P74q61RM46o37J21Q77p70q91J308N40j628k95J543k01j327O52K25o02M84
4163a48L75j035K88J068k00j167R91P89r76k25Q15J6k74J12k83m46R20j03j155
4182f38R6J229o12j157O04P71o33k97N21j37m4M80k86o41R58P02j101n5R70J62
$$ plain form
4202 892 8 36 370 252 166 253 -256 27 455 -27 -732 -106 596 -395 -835 8 262 -197 -280 -346 -211 171
4224 171 127 -305 -249 551 399 -361 94 710 344 -256 25 331 458 256 -101 -85 165 375 -346 -481 178
4245 178 163 -375 -450 -137 -58 -409 -490 -388 128 143 -53 -380 331 517 -11 -269 90 546 265 -185 -19 524
4267 524 410 -43 -239 147 382 -224 -505 -253 98 70 -478 -623 -11 281 -198 -425 108 420 -79 -335
4287 -335 -100 289 128 -77 -115 181 482 285 -329 131 672 162 -302 94 346 171 -233 -175 -148 -9 -43
4308 -43 -428 -374 227 438 -394 -232 492 393 -222 -201 345 201 -38 8 -115 135 347 -235 -531 346 540 -300
4330 -300 -572 274 183 -325 38 9 -241 241 265 -506 -84 769 27 -669 -84 472 -293 -615 154 -126 -265
4351 -265 141 -110 -344 366 636 -731 -234 638 380 -675 86 650 -70 -183 430 234 108 648 -7
$$ packed form
4202H92q84K8L34j18q6Q7n09K83M28m82p05O26P02r91m40Q43K54m59q3o6J35L82
4224A71m4m32N6Q00j52p60M55O16l66o00K81L06J27k02l57J6K50K10p21j35O59
4245A78j5n38p5L13P9l51q1J02N16J5j96l27P11J86n28k58L59M56k81m50J66N43
4267E24j14m53j96L86K35o06k81K52L51k8n48j45O12K92m79k27N33L12m99k56
4287c35K35L89j61k05l8K96L01j97o14M60N41n10m64L96K52j75m04N8K7J39l4
4308d3l85N4O01K11q32J62P24r9o15K1N46j44k39M6j23K50K12n82k96Q77J94q40
4330c00k72Q46r1n08L63k9k50M82K4p71M22Q53p42o96N85N56p65l22P69k80j39
4351b65M06k51k34P10K70j367M97Q72k58j055P61N64p20j13O13j96j26N40o55
$$ plain form
4370 -7 -802 215 471 -759 -788 301 28 -863 -79 324 -247 -171 380 -338 -324 731 143 -797 156 1048
4390 1048 -97 -613 580 605 -199 207 465 -334 144 628 -503 -594 815 320 -1111 -361 651 -502
4408 -502 -701 216 -6 -436 172 388 -606 141 780 -416 -876 919 625 -578 87 1007 64 -174 673
4427 673 46 -299 620 300 -1172 -77 829 -698 -892 541 335 -882 -267 561 -446 -180 542 -355
4445 -355 -491 649 686 -700 100 1358 113 -652 812 761 -449 178 533 -579 -334 619 -434 -1233
4463 -1233 526 317 -1103 -617 940 -187 -661 429 94 -588 172 625 -438 43 1187 6 -833
4480 -833 838 886 -715 -363 968 -222 -678 471 -221 -908 226 309 -1122 -479 801 -223 -993 488
4498 488 692 -654 -287 757 -126 -307 808 -2 -639 639 1059 -700 -146 1290 274 -1083 230
$$ packed form
4370gp95J017K56j230k9J089k73q91P84M03n71P6N51p18J4J055n88r40R53Q92
4390A048j145n16J193K5q04M06K58p99M78M84j131r1J409m95j431P50J012j153
4408e02j99R17k22m30O08K16r94P47O39j196m60J795k94j203O65R20r43k38Q47
4427F73o27l45R19l20j472J095R06j527j94J433k06j217O15Q28j007K66P22q97
4445c55j36J140L7j386Q00J258j245p65J464n1j210O27L55j112K45R53j053p99
4463a233J759k09j420M86J557j127m74J090l35o82P60M53j063M81J144j181q39
4480h33J671M8j601L52J331j190m56J149o92o87J134Q3j431O43J280j024p70J481
4498D88K04j346L67J044q83j81J115q10o37J278M20j759N54J436j016j357J313
$$ plain form
4515 230 409 -695 -402 384 -769 -615 579 -420 -1191 377 837 -896 -416 880 130 -710 526 463
4533 463 -443 314 895 -395 -337 1214 39 -1038 166 931 -668 -676 470 -169 -928 243 64 -1076
4551 -1076 235 818 -801 -576 1144 145 -1094 324 878 -486 -276 942 57 -489 725 155 -792
4568 -792 356 1011 -691 -752 1002 66 -1082 -22 620 -510 -274 630 -416 -373 821 73 -1098 261
4586 261 1178 -470 -684 907 287 -921 180 588 -547 -71 730 -637 -582 854 325 -1094 4
4603 4 950 -523 -374 576 189 -562 417 217 -751 166 1103 -589 -872 880 552 -994 -110 847 -290
4622 -290 -477 521 9 -567 649 166 -760 85 845 -488 -864 642 334 -843 -43 589 -279 -155 504
4641 504 -192 -425 810 559 -796 -121 1146 -61 -831 533 424 -711 -30 309 -322 -228 329 -402
$$ packed form
4515B30J79j104K93P86j153J54J194r99p71J568M60j733M80J296p50q40J236o3
4533D63r06P57N81j290N8J551j175j077J204P65j599qJ146o39p59J171j79j140
4551a076J311N83j619K25J720r99j239J418N54j364K10J218q85n46J214n70r47
4568g92J148O55j702o1J754r36j148J060O42j130K36R04j046M3J194p48j171J359
4586B61R17j648k14J591o20j208J101M08j135M76Q01j367N5J436n29j419J098
4603DR46j473J49R50l87p51R79k00r68R17R37j692k83J752l28j546Q84R57j137
4622b90j87R98n12n76J216m83r26Q45P60j333l76J506l08j177Q00O32q68J24O59
4641E04o96k33J235k51j355O75J267j207p70J364j09j135O81L39o31R4N57p31
$$ plain form
4659 -402 -704 441 178 -1018 -240 885 -127 -588 492 354 -404 523 511 -419 22 928 -95 -965
4677 -965 392 762 -878 -468 384 -55 -494 41 44 -537 398 255 -805 82 837 -114 -620 244 462 -435
4697 -435 -185 415 -139 -287 240 142 -489 270 225 -709 -323 381 1 -625 125 410 -286 -121 219 -452 -109
4718 -109 482 -114 -561 556 645 -465 -270 688 221 -517 126 281 -277 -107 263 -355 -282 443 -259 -506
4738 -506 223 303 -511 -341 200 45 -64 49 -161 -236 295 402 -385 -132 797 323 -516 264 470 -155 -232
4759 -232 155 -124 -206 31 -215 -474 -42 122 -420 -328 317 51 -404 -94 255 177 100 -7 -174 0 606
4780 606 5 -199 226 554 -281 -312 561 373 -2 -270 -49 62 -55 -147 -262 31 326 -188 -303 50 58
4801 58 -189 -211 -237 -52 -70 -4 -176 -48 356 337 -36 -115 466 525 -90 -236 201 350 -187 -244 10 270 -88
$$ packed form
4659d02l02J145k63j196P78J125j012m61J080j38p58R27j2r30M41R06j023q70
4677i65J357L70j640M10Q52m39m39N35Ln81R35j43j060Q87P55r51n06Q64K18q97
4697d35K50O00n54j48N27r8o31P59m5r34L86P04l80o26P50K85o96J65L40o71L43
4718a09N91n96m47J117Q9j110J95R58m67p38O43J55n58J70L70o18P3P25p02k47
4738e06P29Q0q14J70N41j55j09J13k10p5N31J07p87K53R29m74q39P80K06o25p7
4759b32L87k79q2K37k46k59M32J64n42R2O45k66m55L10L49p8p7j07j67J74O06
4780F06o01k04M25L28q35l1Q73j88l75k68K21J11j17r2j15K93K95n14j15L53Q
4801E8k47k2k6J85j8O6j72J28M04j9l73p9N81N9o15j46M37J49n37n7K54K60l58
$$ plain form
4824 -88 -375 -31 83 -83 -189 4 200 -38 -279 -130 -212 178 106 -100 179 109 282 -4 -123 156 122 137
4846 137 -193 -221 65 38 -186 -329 147 299 -301 -259 218 345 -76 -162 -7 40 76 45 -178 33 320 -279
4868 -279 -195 129 179 -312 -33 -29 -121 140 418 -37 -161 445 373 -233 -132 542 207 -432 -227 254 -20 -144
4890 -144 -160 -151 105 96 -304 -161 271 342 -414 -127 295 -109 -339 228 159 -137 355 315 -380 -68 749 18 -561
4913 -561 131 598 -132 -347 183 49 -138 30 -96 -239 252 165 -599 -263 802 -124 -683 251 224 -506
4933 -506 -308 339 12 -120 335 143 -376 352 539 -233 -273 573 249 -623 -109 283 -136 -11 143 -290
4953 -290 -242 495 -40 -634 271 514 -523 -486 335 201 -458 196 347 -327 132 511 -199 -317 562 5
4973 5 -470 153 418 -333 -215 411 46 -323 384 -41 -572 141 452 -559 -322 645 335 -780 80 682
$$ packed form
4824h8k87L44J14j66j06J93J96k38k41J49q2L90p2k06K79p0J73k86j19K79l4J5
4846A37l30k8K86k7k24j43M76J52o00M2M77J27m21q6J55M7L6l1k23K11K87n99
4868b79Q4L24N0m91K79Mr2K61K78m55j24O06p2o06J01O74l35o39K05M81k74j24
4890a44j6RK56rm00J43M32P1p56K87M22m04k30N67o9k96M92m0o95L12Q17p31n79
4913e61O92M67p30k15N30j34j87J68j26j43M91q7p64L36J065r26n59R34k7p30
4933e06J98O47l27j32M55j92n19P28J87p72m0Q46l24q72N14L92m19J25J54m33
4953b90M8P37n35n94R05K43j037L7Q21j34o59O54J51o74M59L79p10j18Q79n57
4973Em75O23K65p51J18O26l65l69P07m25n31P13L11j011K37R67l10j115Q60O02
$$ plain form
4993 682 -135 -305 560 62 -179 406 292 -450 55 568 -371 -457 476 239 -658 224 251 -359 -224 199 -417
5014 -417 -532 573 237 -889 92 865 -52 -628 588 397 -352 52 408 -375 -9 460 -203 -362 472
5033 472 273 -762 -1 821 -398 -536 211 52 -657 289 263 -729 -305 754 -226 -664 576 626 -481
5052 -481 -167 816 -44 -371 601 83 -370 436 349 -573 -30 765 -511 -619 426 336 -865 -248 530 -507
5072 -507 -603 518 -145 -686 386 696 -511 -88 956 155 -574 361 338 -339 -83 352 -429 -159 403
5091 403 -469 -983 376 530 -845 -361 718 -199 -727 342 410 -445 37 498 -491 -221 651 77 -730
5110 -730 530 646 -602 -84 506 -209 -316 298 68 -536 212 318 -790 -270 824 -80 -892 130
5128 130 696 -594 -372 574 70 -453 509 96 -512 414 527 -503 -256 711 -161 -581 147 382 -485
$$ packed form
4993F82q17j70Q65m98k41N85j14p42N05N13r39q6R33k37q97Q82K7o10J35M23o16
5014d17j15J105l36j126R81P73r17n76J216j91p49M04L56p83L66M69o63j59Q34
5033D72j99j035P61Q22j219j38P47j59p09R46k6r92M24J059r80m38J240N0j107
5052d81L14R83q60l27R72n18m53Q06q7r22N43P95j276j08J045r0j201O17P78j037
5072e07r6J121o63n41J072L10j207M23J044q01p29R35k3o77K56M35p81K70N62
5091D03q72n14J359J54j375M84J079r17n28J069O8q55M82M61r89K70Q72n74q07
5110g30J260J16j248N18N90p15j07O14k30o04P48J06j108N20J094r04q12J022
5128A30N66j290K22R46n04n23R62m13o08R26J13j030K47R67q72m20P28K35q67
$$ plain form
5147 -485 -138 314 -537 -563 515 -46 -861 319 696 -600 -605 776 83 -559 338 334 -359 -89 495 -429
5167 -429 -256 469 141 -883 253 622 -371 -613 246 -191 -559 292 227 -483 71 528 -399 -375 669 354
5187 354 -565 176 667 -410 -400 373 -13 -191 357 246 -456 67 605 -476 -490 500 30 -617 91 522
5207 522 -340 -244 549 96 -190 432 165 -525 53 717 -257 -456 356 169 -334 35 258 -197 -149 473 -278
5228 -278 -565 602 126 -710 -178 450 -344 -540 293 185 -117 -31 388 -238 75 763 -27 -473 563 309
5248 309 -552 -87 592 -166 -320 219 6 -411 54 -77 -559 -115 442 -296 -601 546 416 -497 62 260
5268 260 186 69 373 119 -142 309 175 -460 -24 452 -6 -381 137 49 -136 -180 55 -118 -155 395 -194
5289 -194 -460 339 73 -449 -206 576 122 -313 2 209 -30 56 -31 -189 167 342 -124 -311 270 359 -202
$$ packed form
5147d85L47M52q51k6J078n61q15J180L77j296nJ381o93o42Q97mo93K70N84r24
5167d29J73P25l28j024J136L69r93k42Q59m37l68Q51o5p10N54M57r27K4J044l15
5187C54r19P41M91j077J0P73l86j78N48j11p02N23N38j081j4R90m70o47P08M31
5207E22q62R6P93m53k86O22k67o90N78O64r74j99Q12j87n03L69K23m55M8O22p51
5228b78k87J167m76q36N32O28p94j96Q33j08l02Q6M19o26L13O88p90m46J036k54
5248C09q61M65O79p58j54N39k13m17M65j31m82M44N57p38l05J147j30r13N59J98
5268B60p4j17L04k54k61M51j34o35M36M76m58l75N18q8j85m4K35j73l7N50n89
5289a94k66P99k66n22K43P82m54m35L15K07k39Q6q7j58L56J75m66j87N81Q9n61
$$ plain form
5310 -202 -124 229 -9 -223 -59 -111 -242 92 22 -378 -32 409 -34 -217 171 358 -114 -39 245 -112 -113 158
5332 158 -121 -68 265 144 -204 -198 321 18 -329 15 59 -142 -87 -144 -212 -30 35 -80 -174 166 282 -288 -230
5355 -230 331 34 -89 -119 -66 116 -5 -39 16 264 88 36 -201 -35 120 -189 -41 -80 92 123 27 151 126
5378 126 9 135 -118 155 297 48 -231 -194 103 -16 -112 -208 -85 32 -43 -87 108 163 259 61 -62 118
5400 118 164 1 -251 83 145 -3 -278 -112 163 35 -319 -3 139 -45 -50 -50 54 191 69 -93 -191 347
5422 347 5 -54 -125 68 50 -43 9 -228 -12 -9 52 -287 77 278 -135 -213 140 321 -147 -194 50 -70 -1 113
5446 113 -194 62 255 27 -103 131 454 -77 -303 128 44 -218 -89 46 -179 -34 88 -103 -226 388
5466 388 169 -454 -92 468 61 -291 -112 380 30 97 83 -274 92 219 -65 -368 231 298 -481 -155 268
$$ packed form
5310b02P8L53k38k14J64n2j31L34p0m00L46M41m43j83L88J87m72P5K84l57jK71
5332A58k79N3L33j21l48ON19l03l47L44M4k01N5n7o8J82O5j15r4L40J16n70N8
5355b30N61k97j23l0N3J82j21l4N5K48j76n2k37J66J55l09J48l9J72L1r6J24k5
5378A26j17J26k53K73J42k49k79L7K97j19r6r6J23J17p5m4J95N5R6j98j23J80
5400A18M6j63k52L34O2j48k75J66K75j28l54L16J42j84n%J04J37j22j62r8N38
5422C47l42n9p1J93j8r3N2k37K16LO1l39L64K01m13p8L53J81m68m7K44j20O9J14
5446A13l07K56J93k28j30K34L23n31k26M31q4k62J29J35k25J45J22j91j23O14
5466C88k19o23L62N60m07l52J79M92l50O7j4l57L66J27k84l03N99O7p79L26M23
$$ plain form
5487 268 -49 -264 106 -101 -108 112 275 -410 9 429 41 -380 101 376 -235 -121 211 -62 -84 155 -70
5508 -70 -64 335 319 -583 -67 359 -60 -575 56 368 -333 112 202 -151 -64 143 6 -601 120 444 -494 -291
5530 -291 397 108 -275 211 228 -278 175 339 -196 -232 552 -28 -585 8 550 -326 -291 181 -58 -258 197
5551 197 177 -250 66 464 -372 -320 488 39 -541 -37 494 -302 -40 332 -14 -396 237 91 -587 71 436
5572 436 -360 -163 660 144 -359 102 300 -233 -160 192 -194 -361 517 13 -532 161 612 -227 -543 426
5592 426 316 -396 23 402 -345 21 508 -328 -190 693 203 -640 -106 597 -173 -449 496 35 -254 169
5612 169 131 -496 13 349 -369 -493 610 222 -611 -11 538 -85 -334 491 203 -396 389 360 -605 -45
5632 -45 606 -106 -441 254 364 -536 21 401 -237 -254 317 -262 -356 334 329 -620 -216 572 -231 -533 498
$$ packed form
5487B68l17k15L70k07pK20J63o85M19M20l88m21M81K75o11J14L32k73k2K39k25
5508g0OL99j6r02N16M26m19n15O31L12p01M45R0l53Q7K07j37o07P21L24r38K03
5530b91O88k89l83M86J7n06M53J64n35l6P84n80n57N93N42q76L5M72k39k00M55
5551A97k0m27L16L98q36N2Q08m49n80N04N31p96K62L72l46l82O33j46o78O58L65
5572D36p96J97Q23n16n03M61J98n33P3L52l86j67Q78n04n45O93M51q39l16R69
5592D26j10p12M19L79p47L66M87q36J38Q83m90q43N34P03p70k76R45m61k89M23
5612A69l8o27N09L36p18j24J103l88q33O00N49o23k49Q25k88n99P85k9r65N60
5632d5O51p12l35O95J10r00N57L80o38j7N71n79r4O90nr49M04P88q03l02J031
$$ plain form
5653 498 367 -393 56 423 -280 -280 515 -230 -589 435 356 -669 -83 565 -72 -580 202 168 -449 23 271
5674 271 -237 -125 548 -33 -622 351 311 -519 -217 608 -46 -398 288 42 -381 274 467 -199 -73 748
5694 748 -91 -486 476 394 -239 -123 501 -175 -302 258 0 -422 281 357 -607 -257 558 197 -535 281 409
5715 409 -432 -240 372 -174 -298 542 124 -499 142 415 -304 -362 492 38 -544 156 428 -268 -118 318
5735 318 -316 -205 434 60 -498 160 514 -379 -452 313 -2 -332 18 1 -466 70 354 -275 -126 588 187
5756 187 -448 215 443 -256 -99 281 -45 -284 318 92 -486 82 395 -422 -416 435 173 -550 -101 443 -118
5777 -118 -143 249 -157 -249 304 -103 -490 54 598 -183 -179 352 140 -222 208 292 -254 88 344 -111 -515 331
5799 331 128 -579 1 400 -235 -347 214 16 -287 126 234 -370 -2 207 -176 -262 268 166 -446 18
$$ packed form
5653D98j31p60M49L67p03%P95p45l59J024p9j025N86O48o37n08P82l4o17M72K48
5674B71n08J12O73n81n89R73m0q30L02Q25o54l52O86k46m23O55J93o66J26Q21
5694G48q39l95R62q2o33J16O24o76j27N60k58m22P03P6r64L50Q15l61p32Q16J28
5715D09q41J92O12n46j24Q40m18o23O41K73p19n8Q54m54n82P00K72o96J50M36
5735C18o34J11O39l74n58O58L54q93p3P65l15l30L50j7m67N36K84o29J49P14m01
5756A87o35O63K28o99J57L80l26k39O02k26n78N68L13q17OQ51k62p23M49N44n61
5777a18k5L92m06r2N53m07l87N44N44p81MN31k12l62M30Q4n46L42K56m55m04Q46
5799C31k03p07N80L99o35j12N61j98l03M13J08o04L68K09l83q6N30j02o12M64
$$ plain form
5819 18 435 -262 -251 228 34 -129 190 221 -338 4 342 -197 -312 253 261 -246 -84 151 39 34 180 -55
5841 -55 -203 310 220 -305 18 535 -36 -159 147 342 -165 -160 195 31 -183 258 -142 -293 196 212 -275 -42
5863 -42 209 -52 -51 152 217 -99 28 61 -110 108 290 -129 -116 126 330 -337 -134 203 33 -191 -136 100
5885 100 -28 146 73 -257 -143 256 -36 -356 51 343 -228 -142 55 4 -163 18 90 -127 -73 96 -160 116
5907 116 112 27 -238 -132 71 116 -216 18 -146 -90 163 -63 -132 86 24 -273 -30 128 178 -104 -2 279 180
5930 180 46 -52 104 20 106 -81 -126 73 143 52 -50 -74 134 -113 6 -100 -2 149 -110 -74 99 196 -22
5953 -22 -63 -138 175 45 -132 -4 50 272 96 -129 91 61 29 -239 -35 83 -39 8 -185 -98 200 -10 -303
5976 -303 -4 112 -26 -11 47 28 -40 52 11 -10 171 -5 -135 -131 206 134 -58 -34 275 137 -206 42 77 17
$$ packed form
5819A8M17o97J1M79j94j63L19L1n59L42L38n39j15N65Qn07J62K35j12nJ46k35
5841e5j48N13r0n25L23N17n71j23L06J95n07NL55j64k14M41m00j51M89J6m87K33
5863d2K51k61JK03O5l16J27L3j71K18J82m19J3K42K04o67K03L37j70k24N5K36
5885A00j28J74p3l30J14L99k92l20M07K92n71Q6J97n1j67J81P2k17N4J69k56K76
5907A16mq5k65J06K03M5l32K34j64N6K53k26o9K18o2k97K43J58N0k82J02K81r9
5930A80j34r8J56q4Q6j87m5J99P0r1j02k4K08k47J19j06R8J51k59L6J73R7k18
5953b2m1p5L13j30j77J28N4K22j76k25K20l0l2k68K04J18j22M7j93Q7K98k10k93
5976c03K99J16j38J5N8j9o8R2m1k1J81j76j30ML37p2j92K4L09j38l43K48L5o0
$$ plain form
6000 17 185 -270 -307 -199 125 -104 -229 312 94 -61 13 220 67 -79 191 -58 -216 192 45 -253 8
6021 8 257 -103 -262 144 298 -213 29 52 -72 -136 145 -154 -227 290 -95 -341 -91 243 -29 -268 131 105
6043 105 -65 60 196 -110 -5 438 -190 -277 289 326 -333 -110 363 51 -148 131 -203 -237 211 35 -104
6064 -104 -216 303 -61 -405 92 241 -305 -117 263 144 -132 35 61 -155 218 243 -341 -67 284 -118 -318
6085 -318 144 289 -136 43 84 -2 -162 219 4 -306 325 288 -422 -124 324 191 -386 -72 166 -219 29
6106 29 287 -201 3 416 204 -358 213 362 -202 -139 319 -68 -263 205 180 -152 49 207 -242 -214 343
6127 343 -33 -433 129 322 -180 -336 302 8 -179 44 168 -222 52 402 -408 -171 396 257 -551 -119
6147 -119 368 -69 -97 311 -47 -201 252 63 -440 88 498 -139 -459 434 54 -330 35 95 -263 3 369
$$ packed form
6000A7J68m55l7J08L24k29j25N41k18j55P4K07j53j46K70k49j58M08j47k98K61
6021HK49l60j59M06J54n11K42K3j24o4K81k99p3N17l85k46K50L34k72k39L99k6
6043A05j70J25J36l06J05M43o28q7N66L7o59K23M73l12j99K79l34l4M48j76j39
6064a04j12N19l64l44M97J49n46J88L80j19k76J67K6k16L73K5n84K74L51m02k00
6085c18M62J45m25J79M1q6j60L81k15l10O31l7p10K98M48j33n77L14K38l85K48
6106B9K58m88K04M13k12n62N71J49n64O3M58l87j95M68k5l32K01J58m49K8N57
6127C43l76m00N62J93n02j56O38k94j87K23J24l90K74L50q10K37N67j39q08M32
6147a19M87m37k8M08l58j54M53j89n03N28M10o37l20Q93l80l84L65O0l58K66L66
$$ plain form
6168 369 -114 -127 434 102 -476 62 517 -303 -471 454 200 -257 41 348 -289 -30 411 -286 -55 333
6188 333 173 -520 45 431 -141 -372 26 119 -300 161 186 -318 -63 401 -283 -364 131 333 -366 17 408
6209 408 -77 -139 116 -35 -165 297 119 -366 -102 479 2 -335 412 117 -380 -83 227 -227 -193 222 -132
6230 -132 -246 275 285 -355 -318 446 -119 -279 140 197 -190 172 349 -182 -62 614 -153 -322 247 409 -431
6251 -431 -150 625 -166 -449 218 186 -304 116 122 -337 -30 510 -138 -363 178 415 -420 -200 395 29 -287
6272 -287 327 193 -177 268 190 -393 -128 308 -81 -469 296 363 -317 -127 148 -284 -232 171 -132 -162 352
6293 352 319 -295 -369 368 223 -495 220 281 -83 79 166 -273 -195 269 2 -360 128 346 -330 -155 357 123
6315 123 -364 280 299 -165 56 360 -322 -181 521 56 -510 208 428 -106 -293 117 66 -264 -16 162 -345
$$ packed form
6168C69m83j3N61l32n78N38M55q20j68R25k54m57K98L07o37K59M41o97K31L88
6188C33j60o93N65L86n72k31L98R3m19M61K5n04K55M64o84q1M95K02o99L83L91
6209D08m85o2K55j51j30M62j78m85K64N81m77l37P47k95m97K97L10m54L4M15l54
6230a32j14N21J0o40L7P64n65j60M19N7l87L62J77n31J20O76p67j69N69J62q40
6251d31K81P75p91k83O67l2m90M20Om59L07N40o48k25N41K37q35K20N95l66l16
6272b87O14j34l70M45p8n83K65M36l89l88P65O7o80J90K75m32N2M03l03l0N14
6293C52l3o14p4P37j45p18P15O1l64J62Q7m39P8M64k67l62M88K18o76J75N12k34
6315A23m87O44J9m64K21L04o82J41P02m65n66P18K20n34j87M10n1l30K48J78n07
$$ plain form
6336 -345 14 347 -258 -190 374 17 -349 139 449 -88 -202 364 25 -100 290 156 -376 66 291 -386
6356 -386 -361 129 -109 -244 -13 99 -61 -138 107 -267 -155 291 121 -196 73 402 -219 -184 70 123 -217
6377 -217 -61 125 -46 154 47 -255 -254 218 130 -265 -5 355 -143 -185 20 60 -92 35 37 59 21 130 -158
6400 -158 -244 385 299 -142 -99 263 -11 -35 -24 21 14 293 148 -258 -26 173 -316 -310 301 110 -136 -98 208 -31
6424 -31 -93 19 110 -253 195 141 -135 -97 182 79 -53 86 158 -57 -79 -34 16 112 148 -69 -190 301 21 -408
6448 -408 -107 154 135 1 -10 116 61 -64 60 37 210 52 -9 -92 203 114 -38 -15 -22 175 89 -123 -102 -19
6472 -19 -23 -133 -188 -157 186 60 -243 96 254 119 -136 108 -62 185 58 20 -83 100 -169 -88 -93 192 5
6495 5 -181 -46 -76 140 33 -102 -109 224 60 -102 -195 71 74 -5 -155 35 77 -18 25 -134 267 145 -167 -246
$$ packed form
6336c45L59L33o05O8N64l57l66M88L10n37j14N66l39j25L90j34n32M42K25o77
6356c86K5M90k38j35K31J12j60p7K45l74J12M46j70l17K69L29o21L5K54N3l40
6377b17J56J86j71K00j07l02JM72q8l95K60L60m98m2K05M0j52J27KK2l8J09k88
6400a58q6O29q6m41M3L62k74k4J1M5pK79j45m06K32J99m89OO11j91k46L8L06k39
6424c1o2J12R1l63M48n4k76L8K79j03j32J39P2k15k2M5N0R6L6k17j21M91k80m29
6448d08L01K61j9j34j1J26n5j25J24k3J73j58o1q3K95q9j52K3pJ97q6k12K1Q3
6472a9mj10n5L1L43j26l03L39J58j35k55K44j70K47j27l8j03J83k69Q1nK85j87
6495Ej86J35l0K16j07j35pL33j64j62r3K66Lp9j50J90M2r5M3j59M01j22l12p9
$$ plain form
6519 -246 99 249 -180 303 46 107 -93 50 -46 50 -35 -235 -31 95 44 -5 1 -89 -9 168 -18 -72 195 137
6543 137 -6 -183 -73 286 -116 -237 -94 85 -104 -24 -6 -2 95 -58 -25 -106 205 10 -85 13 73 -6 -198 -27
6567 -27 78 -47 -57 -110 -204 -23 122 -152 -266 166 102 -289 -226 106 -66 -210 39 55 85 77 -116 -109 161 272
6591 272 -39 -65 48 180 -139 -25 345 111 1 119 81 -138 161 195 -326 -156 199 136 -229 -17 236
6612 236 -120 -16 -153 93 -162 176 -293 -172 319 223 -310 -134 414 172 -212 4 180 -203 123 98 -108
6633 -108 105 327 74 -189 443 230 -250 30 73 6 -42 45 65 -138 136 66 -360 -183 241 -96 -399 171
6655 171 359 -243 -159 155 -27 -64 104 -168 -162 234 198 -310 -280 290 64 -237 283 115 -156 -42 143 -102
6677 -102 -179 192 -164 -391 126 389 -368 -282 172 -52 -369 -20 324 -140 -35 236 -218 -83 226 124 -362
$$ packed form
6519b46L45J50m29M83k57O1k00J43r6R6q5k00K04J26n1m9Or0Q0J77j86n4K67n8
6543A37j43j77J10L59m02j21J43J79j89Q0J8MR7j53L3q1L11j95r5R8O0p9j92J71
6567b7J05j25j0n3r4J81J45k74j14M32o4l91O3L32j72j44K49J6L0qj93PK70J11
6591B72l11k6J13J32l19J14L70k34j10J18l8k19K99L4n21J70L55o3l65K12K53
6612B36l56J04j37K46k55L38m69J21M91r6n33J76N48k42l84K16J76l83L26k5k06
6633a08K13K22k53k63O32k13m80K80M3o7m8Q7K0k03K74p0m26J77M24l37l03N70
6655A71J88o02Q4L14j82l7J68k72OL96l6n08L0N70k26l01N20j68k71J14J85k45
6677a02p7L71l56k27N17K63p57Q6M54k24l17L49L44m64J05K71m54J35L09j02m86
$$ plain form
6698 -362 151 268 -257 -64 275 227 -158 -67 13 -249 142 266 -370 -223 477 78 -334 -15 210 -368 -318
6719 -318 -54 -146 -223 11 -55 -27 196 358 -296 -323 487 166 -362 -106 205 -254 -142 243 -234 -184 195 19
6741 19 -413 43 369 -214 -264 124 239 -280 -244 34 -111 76 66 -171 -129 424 183 -363 87 435 -135 -237
6763 -237 313 158 -185 240 140 -369 -131 314 -119 -83 95 38 -219 -32 280 -73 -91 166 51 -222 151
6784 151 326 -317 59 525 -192 -256 82 223 -214 -101 189 -34 -169 92 -145 -300 -19 191 -392 53
6804 53 291 -127 -371 137 121 -275 48 44 42 -36 191 -67 -202 294 223 -298 -100 374 -197 -368 159 40 -250
6827 -250 -65 255 -157 -88 372 -124 -258 311 349 -173 -87 462 -24 -189 149 80 -110 126 155 -320 -82 332
6849 332 80 -506 213 243 -240 -240 124 -48 -182 69 9 -40 302 78 -369 -130 362 42 -356 -84 376 -115
$$ packed form
6698c62N13J17n25J93L39m8l85R1Q0k62L91J24o36J47P00l99m12L19K25n78N0
6719c18K64r2p7K34o6K8K23J62o54k7Q10l21n28K56L11m59J12L85m77N0L79j76
6741A9m32M56L26n83n0L88J15n19L6K78j45J87j0k37M2N53k41n46M50L48n70j02
6763b37N50j55l43M25j00n09K38M45m33L6J78n7k57J87L12l53j8K57j15k73L73
6784A51J75o43L76M66p17o4L38J41m37J13K90k23j35K61k37j55K81K10n83M45
6804E3K38m18k44N08j6l96L23mkp8K27k58j35M96p1n21J98M74n71j71N27j19k90
6827b50J85L20m12O9M60m96j34N69L8n22Q6N49m86j65L38o9j90K36K9m75K38M14
6849C32k52n86P19L0m83%L64j72j34K51o0m9L42k24m47K39M92l20l98K72M60m91
$$ plain form
6871 -115 -201 366 -9 -143 290 -78 -368 43 241 -301 -309 242 112 -443 44 -28 -105 9 141 -91 -89 373
6893 373 11 -287 13 333 -193 34 230 133 -200 79 296 -266 -29 92 -35 -241 92 -85 -369 4
6913 4 371 -155 -41 364 14 -94 167 42 -199 74 256 -319 -134 194 260 -264 -82 250 -179 -39 22
6934 22 41 -201 -50 11 -79 54 355 -227 -349 224 82 -219 -116 160 -31 71 105 -154 -80 259 100 -285
6956 -285 -40 359 -39 -292 -11 59 -175 -96 -144 84 -101 89 -180 -148 353 164 -116 25 150 134 -34 52
6978 52 228 34 -60 -21 48 57 256 8 -162 140 89 -180 -131 168 -70 -232 5 3 140 161 133 -50 17 259
7002 259 13 -136 152 80 -105 -152 -41 58 -43 -130 -113 -13 69 -12 -147 -59 221 26 -172 -58 -81 49 -38
7025 -38 -79 -25 -33 153 -70 -42 138 141 -114 -77 230 12 15 -72 74 42 -35 -5 -94 163 73 -115 -360 136 101 45
$$ packed form
6871a15q6N67l75j34M33l68k90M11J98n42qN51j30n55M87p2p7J14J32k32KM62
6893C73l62k98L00L20n26K27J96r7l33K79K17n62K37J21j27k06L33j77k84L73
6913DL67n26J14M05l50j08K61j25k41K73J82n75J85L28O6n24J82L32m29J40O1
6934B2J9k42J51O1r0J33L01n82j22N73j42l01J03K76j91J02L4k59P4L39j59l85
6956b85K45L99l98k53K81P0k34P9m8K28j85J90k69L2N01j89k80J41J25j6j68Q6
6978E2J76j94r4L9O9RJ99k48j70L02n1k69M9K99k38j62K37kJ37K1k8j83O7K42
7002B59k46j49K88p2j85m7J11R9j01q7J7J00Q2q1j35Q8K80j95j98J14k3J30q7
7025c8m1N4qJ86k23K8J80Lk55L7L07k18Lq7J46l2p7L0q9K57r0j88k45M96l5n6
$$ plain form
7051 45 -108 42 16 -65 -126 108 198 198 -14 -5 -27 30 59 67 -146 151 180 -83 -203 39 13 -93 -73 -106 142 -210
7077 -210 -53 -100 89 48 -78 -362 -71 200 -31 -177 119 170 35 -154 -99 79 97 43 20 75 162 25 -229
7100 -229 -13 144 66 -97 -102 63 259 -38 -112 248 57 130 -78 -6 95 124 -140 -9 87 203 -106 -100 46
7123 46 2 78 -57 36 -55 91 64 -408 -16 80 -96 -185 -121 139 41 -47 211 -50 -10 142 -41 -203 145 116
7147 116 -261 -247 57 -103 -344 101 113 -113 27 -158 -164 109 199 97 -143 209 156 -187 -110 325 72 -36
7169 -36 -1 -62 -134 123 41 -109 -54 138 -94 -249 226 147 -81 -187 144 -31 13 22 28 143 155 -80 -151 0 143
7194 143 46 -372 77 82 -109 -8 74 -119 -21 133 37 -11 273 274 -241 -242 227 38 -232 -94 164 -224 -3 -14
7218 -14 -11 75 358 206 -234 -21 284 -57 -255 311 -104 -211 -90 137 -2 -3 43 -257 -189 336 -37 -235 108
$$ packed form
7051D5j53J50k6q1o1K34R0%k12Rk2N7K9Qk13K97K9k63j20K42k6j06K0l3K48l52
7077b10J57m7J89m1j26k84K91K71k31j46K96N1j35j89N5J78J8n4k3N5Q7j37k54
7100b29K16J57p8j63nJ65J96k97p4L60j91P3k08P2J01K9k64J31R6J16l09OJ46
7123D6m4P6j35R3r1J46k7m72L92R6j76q9O4K60r8q8K58k61M0J52j83j62L48k9
7147A16l77J4L04j60k41M45J2k26J40j85oK73R0j02k40L52n3l43P7M35k53j08
7169c6L5o1p2K57q2j50N5J92k32j55M75p9k28j06L31j75M4ROJ15J2k35p1J51J43
7194A43r7m18M49Nj91J01Q2j93R8J54r6m8K84Jn15jM69j89k70J38K58l88K21j1
7218a4LQ6K83j52m40K13L05l41j98N66m15j07J21K27j39jM6l00O8N25l73j98L43
$$ plain form
7241 108 337 19 -122 335 -1 -149 13 -145 -96 40 282 -247 -153 446 196 -375 97 312 -164 -146 253
7262 253 -99 -43 373 -88 -131 196 294 -17 -211 342 157 -232 -127 70 5 -68 180 -237 -229 311 -20 -321
7284 -321 65 130 -250 -88 -30 206 -124 -48 -37 -118 -40 203 -165 -201 499 96 -273 74 366 -87 -48 47 49 -281
7308 -281 104 -21 -214 33 288 -237 -351 374 142 -156 -37 297 -98 -51 207 6 -122 221 126 -337 -176
7329 -176 543 -108 -400 194 205 -367 -38 140 -12 -108 -5 -135 -328 227 119 -303 -45 314 24 -17 200
7350 200 205 -36 3 92 -75 -36 430 -147 -244 407 265 -301 -122 211 43 -157 52 213 -137 -30 262 -187
7372 -187 52 341 -55 -406 24 407 -283 -14 192 -53 23 12 111 -25 246 91 -272 -111 138 -42 -405
7393 -405 138 273 -99 -186 33 -80 -82 98 66 -181 237 295 -292 -289 168 -13 -343 -31 234 7 -10 -90 -308
$$ packed form
7241A08K29l18j41M57l36j48J62j58M9J36K42n29R4N99k50n71M72K15m76J8L99
7262B53l52N6M16m61m3L27R8l11j94N53j85l89J05J97o5p3K48m17QN40l31l01
7284c21L86O5l80J62N8K36l30P6J1q1P8K43l68l6P00m03l69L47K92m53L9R5Kl30
7308b81L85j25j93K47K55n25j14P25k32k98J19L34l95M7K58k01j28L43r5m63J61
7329a76P19o51k92N94J1n72L29J78j52r6J03j30j93N55j08m22K58L59k90m1K17
7350B00Nk41L9Q9j67L9M66n77r7O51j42n66J79L33j68k00K09J61l50J07K92m49
7372a87K39K89l96l51M30L83o90K69K06k45P6j1R9j36K71j55l63J61K49j80l63
7393d05N43J35l72q7K19j13kJ80l2k47M18N8n87LM57j81l30L12K65k27j7q0k18
$$ plain form
7416 -308 14 291 29 -265 49 271 -236 -360 281 39 -254 50 124 2 62 -1 -96 -136 316 87 -296 163
7438 163 371 -88 -214 147 98 -37 -234 -39 -305 16 311 -137 -80 190 94 -302 -160 330 8 -356 28
7459 28 48 132 153 -96 -299 58 145 -336 -239 98 176 -115 -117 58 26 -135 234 -223 -152 81 249 -381 31 259
7483 259 22 -335 143 97 -99 -50 -43 95 88 -53 -218 -113 210 -21 -330 -79 250 46 -303 27 106 -78
7505 -78 7 -17 -108 50 32 -73 -102 164 128 -139 -121 179 147 -22 50 -3 -16 143 129 -180 102 110 -16 -251 139
7530 139 117 -179 -44 51 53 -17 -38 36 -105 -16 -100 -230 -46 227 -76 -358 -144 23 -180 -113 -117 128 262 -34
7554 -34 -183 -61 195 82 -178 78 145 -41 -84 65 -117 -120 109 -64 -130 138 165 -106 -139 105 131 -58 31
7577 31 35 195 124 -33 -62 -54 -18 55 -250 -121 177 -225 -136 -14 113 -88 35 166 -5 94 60 24 -20 80 -30
$$ packed form
7416c08L22K77k62k94L14K22n07j24O41k42k93L04P4j22O0o3r5m0M52k29l83M59
7438A63K08m59j26L61m9j35j97J95k66L21K95m48N7K70r6l96J42M90l22l64L84
7459B8K0Q4K1k49k03L57Q7m81R7L37P8k91kJ75l2j61L69m57P1K33J68o30M12K28
7483B59k37l57M78m6j96M9PJ38pj41j65J05L23k31l09K51L29k04l49L30P9j84
7505g8Q5k4r1J58j8j05k9K66l6k67J8L00l2j69P2n3j3J59j4l09K82Qj26k35L90
7530A39k2k96J35R5Kp0k1P4j41Q9q4j30J84K73l03k82K14J67k03O7mK45J34k96
7554c4j49J22K56j13k60K56O7j86m3J49j82lK29j73o6K68K7k71l3K44K6j89Q9
7577C1MJ60p1j57k9QL6P3l05J29K98m02Q9J22J27k01J23J31j71R9l4l6m4J00j10
$$ plain form
7602 -30 -164 1 176 73 -225 -104 155 91 -2 -104 -94 226 -42 40 -117 14 157 29 -9 -1 134 -36 -57
7625 -57 -14 140 68 0 -150 29 95 65 -13 -22 159 -47 -72 -290 155 -111 -213 -71 -38 101 -45 -125 54 103
7649 103 63 -136 -55 102 49 -83 -26 8 170 80 -152 -33 9 -32 -106 -215 142 0 -11 -109 -84 31 -179 -189
7673 -189 -131 179 -6 -203 -193 -111 152 7 58 42 88 193 -30 -62 112 112 -238 -106 304 -15 -131 -71 -74 -19
7697 -19 15 32 -284 146 252 -43 -39 91 222 34 -133 -192 4 74 -150 -77 -79 274 -24 -173 47 70 123 -147
7721 -147 -84 162 -34 -153 -77 -6 21 232 17 -34 124 -88 -90 -146 330 -95 -63 -127 155 14 -114 -3 -170
7744 -170 67 51 -90 -77 92 -8 -159 -50 201 60 -26 -177 -60 -56 226 -52 -132 166 381 -39 -216 -32
7766 -32 215 -162 -107 23 -14 -33 78 -43 -164 145 95 -178 -102 272 174 -295 151 294 9 92 -62 -36 142
$$ packed form
7602c0j34J65J75j03k98J21K59o4r3j02J0L20k68Q2j57J31J43j28l8QJ35j70k1
7625e7M3J54p2o8j50J79O6l0p8rJ81k06k5k18M45k66j02J42L3J39j46q0J79M9
7649A03m0j99Q1J57n3j32N7L4J62r0k32J19M2m1p4j09L57j42j1r8K5J15k10j0
7673a89N8L10j85j97J0Q2K63j45N1j6M6J05k23l2J74%l50J32M10l19j16O0lN5
7697a9L4J7l16M30J06k95MJ30J31j88j67n9J96P0k24P3kL53k98j49K20K3N3k70
7721a47O3K46j96j19P6P1K7K11k15n1J58k12kn6M76m25L2o4K82j41j28J11j67
7744a70K37j6j41J3J69j00j51J09K51j41q6j51J17MK82k78q0K98K15m20j77J84
7766c2K47l77N5J30l7j9J11j21j21L09n0k73P6L74r8m69M46J43k85Q3j54K6J78
$$ plain form
7789 142 -38 136 -280 129 221 -152 -171 66 131 -217 -51 201 -32 94 -35 -22 -65 268 -114 -363 -42 333
7811 333 -86 -220 211 129 -156 8 137 -133 -20 38 -191 -102 93 -33 -341 -32 250 -70 -122 126 15
7832 15 32 -41 -42 -236 34 209 -11 -260 143 180 -239 -66 182 68 -154 47 -93 9 10 -106 -308 9 353
7855 353 -177 -292 91 -30 -227 41 260 -76 -11 53 -120 -107 248 221 -222 -30 239 2 -250 -86 199
7876 199 50 37 79 -135 161 120 28 -149 134 217 -336 -263 361 68 -136 -29 -177 -51 99 39 -167 -37
7898 -37 270 -141 -353 183 248 -190 -25 185 19 -58 57 64 -236 29 5 -269 -70 284 31 -302 28 172
7920 172 30 -153 84 -89 117 -44 -40 -90 29 64 -432 -220 177 99 -198 -89 45 -54 69 33 -68 84
7942 84 264 -50 -159 331 109 -254 -174 267 200 -262 -8 206 -112 77 -80 -223 62 213 23 -364 -18
$$ packed form
7789A42j80J74m16M09R2l73j9K37O5l48J66K52k33J26j29J3m3L33l82k49L21L75
7811C33m19j34M31q2k85J64J29k70J13N8k29Q9J95j26l08L09K82l20n2K48j11
7832A5J7p3jj94K70J75k20k49M03L7m19J73K48j14k22K01j40J02Jj16k02L17L44
7855C53n30j15L83j21j97K68K19l36O5O4j73J3L55k7m43J92K69k37k52J64K85
7876A99j49j3M2k14K96m1r2j77K83Q3n53P3O24k93k04J07j48J26J50o0k06J30
7898c7L07m11k12N36O5m38J65K10j66p7J15Pl00K65k4k74J99L54k53l33L30J44
7920A72j42j83K37j73K06j61Mn0J19L5m96K12L97p8k97J09J34r9J23l6j01J52
7942H4J80l14j09M90k22l63Q0M41o7m62K54K14l18J89j57j43K85J51j90l87L46
$$ plain form
7963 -18 -93 -89 -194 -44 -67 -106 114 13 -152 190 219 -151 -60 227 18 -158 35 139 53 -285 106 61 -18 -14
7987 -14 -108 -168 129 165 -161 -114 144 49 -172 -33 83 -237 28 144 -62 -85 130 -81 -174 67 132 -89 -186
8010 -186 194 165 -158 -53 129 -115 -141 43 -236 -202 134 145 -362 -170 111 -149 -61 137 140 -78 97 28 -24
8033 -24 170 205 78 -88 245 170 -310 61 146 -127 10 -10 53 -154 -266 -63 -101 -36 154 -210 -241 89 171
8056 171 3 -12 4 74 60 35 18 113 106 136 -178 -168 242 -136 -161 17 -56 12 -211 -43 -142 74 76 -171 -106 196
8082 196 217 -179 -77 134 94 -130 105 199 77 -79 15 -57 42 92 11 -210 113 28 -147 -184 211 -116 -112 -121 -267
8107 -267 100 -67 -87 -127 9 321 -24 -52 278 210 117 -30 -2 -15 84 -18 -38 -95 37 25 -145 -134 8 -62
8131 -62 43 28 169 -12 52 -129 42 50 24 -61 -49 41 55 -8 -130 55 194 -23 -6 91 2 23 -161 -189 116
$$ packed form
7963a8p5Mj05J50k3l9K20j01j65L42K9l70R1K87k09j76J93J04q6l38L91m5p9M
7987a4r4o0K97L6l26M7K58r5k21J39J16l20K65J16k06k3K15k11r3K41O5k21r7
8010a86L80k9l23J05J82k44k6J84k79L4L36J1n07J92K81k60Q8J98Lk18J75o9n2
8033b4J94L5j27j66L33p5m80L71Q5k73J37k0O3k07j12K03l8O5J90l64l1L30Q2
8056A71j68j5J6P0j4k5j7R5pL0l14J0M10l78k5J78p3O8k23J68r9K16Kk47O5L02
8082A96K1l96J02K11m0k24K35R4j22j56R4p2R9N0q1k21L23q5j75l7L95l27Mrj46
8107b67L67j67k0m0J36L12l45k8L30o8r3j47K8j3R9j02k0n7J32j2j70J1J42p0
8131f2J05j5J41j81O4j81J71Qk6q5J2R0J4o3j22J85J39k17J7R7q9K1j84k8L05
$$ plain form
8156 116 -23 -114 -37 83 112 -74 -94 17 27 72 78 -26 -62 189 31 -230 41 221 29 -359 21 39 40 -206
8180 -206 -62 71 57 -32 -146 10 123 -153 -231 144 -48
$$ packed form
8156A16j39r1P7J20K9j86k0J11J0M5Oj04l6K51j58k61K71J80j92l88L80J8Jk46
8180b06J44J33j4q9j14J56J13k76p8L75j92
8191d8
$$ Imaginary data points
##PAGE= N=2
##DATA TABLE= (X++(I..I)), XYDATA
$$ plain form
0 0 0 0 0 0 0 0 0 0 0 0 8 -8 8 -8 13 -16 17 -24 30 -33 41 -49 58 -73 81 -97 113 -130 148 -171 195 -222 253
33 253 -287 323 -364 410 -459 512 -572 638 -708 786 -871 961 -1064 1174 -1294 1426 -1571
50 -1571 1731 -1906 2103 -2321 2563 -2836 3149 -3509 3926 -4416 5006 -5728 6640 -7830 9454
65 9454 -11818 15585 -22569 39953 -181485 -213941 -2540 -215081 -165857 4154 -33750 -129774
77 -129774 15397 44454 -6503 102680 199575 81131 90743 207051 145045 57942 151650
88 151650 117968 -25461 32751 111753 -39179 -68916 73657 -18750 -215307 -123303 -43963
99 -43963 -198537 -178853 45851 20308 -123051 -33876 51046 -48349 -52030 39596 20786 28711
111 28711 111279 49535 -22305 100780 140380 -11346 -6674 111489 29027 -52365 64323
$$ packed form
0@%%%%%%%%%%Qj6J6j6K1k9L3m1N4o3P4r0J07j31J54j78K10k43K78l19L66m17M75
33B53n40O10o87P74q69R71j084J210j346J494j657J832k025K238k468K720k997
50a571L302l637M009m424M884n399N985o658P435q342R422j0734J2368j4470J7284
65I454k1272K7403l8154O2522k21438l2456K11401k12541M9224J70011l7904r6024
77a29774J45171K9057n0957J09183R6895j18444R612J16308o2006q7103R3708
88A51650l3682j43429N8212P9002j50932k9737J42573r2407j96557R2004P9340
99d3963j54574J9684K24704k5543j43359Q9175Q4922r9395l681R1626j8810P925
111B8711Q2568o1744p1840J23085L9600j51726M672J18163q2462q1392J16688
$$ plain form
122 64323 68936 -67019 -18834 50805 -111973 -177229 -556 26637 -95233 -25988 80308
133 80308 -12025 -66356 11617 2414 -32099 38894 46324 -15506 40632 79562 -20806 -13413
145 -13413 99558 26106 -90791 8294 70860 -54344 -61425 52578 -3421 -97059 -24974
156 -24974 -4232 -89614 -27853 87769 25293 -30922 54088 59689 -26727 -8255 36738 7228
168 7228 26204 55606 -18557 -31364 66201 30932 -80062 -13463 62405 -49066 -93090 23360
180 23360 21833 -70077 -21701 30104 -50749 -59954 28444 16731 -17461 50969 65003 -9697
192 -9697 2213 46222 -2581 -19168 36441 19044 -19232 24065 18423 -48298 -3697 56284
204 56284 -32370 -79684 22761 33731 -69220 -42026 50061 9226 -42951 2222 11734 -18987
$$ packed form
122F4323M613j35955M8185O9639j62778o5256J76673K7193j21870O9245J06296
133H0308r2333n4331P7973r203l4513P0993P430o1830N6138L8930j00368P393
145a3413J12971p3452j16897R9085O2566j25204p081J14003n5999r3638P2085
156b4974K0742q5382O1761J15622o2476n6215Q5010N601q6416J8472M4993k9510
168G228J8976K9402p4163j2807R7565l5269j10994O6599P5868j11471m4024J16450
180B3360j527r1910M8376N1805q0853r205Q8398j1713l4192O8430J4034p4700
192i697J1910M4009m8803j6587N5609j7397l8276M3297n642o6721M4601N9981
204E6284q8654m7314J02445J0970j02951K7194R2087m0835n2177M5173R512l0721
$$ plain form
216 -18987 19499 43884 728 10201 47248 -1795 -38589 10291 15196 -26654 -432 19514
228 19514 -31515 -24825 29535 -8088 -47454 19597 34803 -47736 -35619 46230 16363 -37591
240 -37591 14630 46036 -5903 -15405 18398 12859 11687 28963 1387 -18503 17059 8405 -44045
253 -44045 -20285 27280 -7565 -35338 1980 278 -31435 -354 20628 -24415 -21874 30969
265 30969 7202 -40178 3809 46510 6738 -14555 17665 20623 2116 8778 11171 7037 20974
278 20974 9777 -26363 -11832 19476 -10590 -34637 4531 13700 -29985 -28081 5754 -5602
290 -5602 -18394 5785 3854 -19370 -246 19801 -5026 -8859 27686 29091 -2737 -2856 16716
303 16716 18139 11840 4174 -1974 9756 14278 -16605 -29438 5549 15153 -22369 -28929 1221
$$ packed form
216a8987L8486K4385m3156R473L7047m9043l6794M8880M905m1850K6222J9946
228A9514n1029O690N4360l7623l9366O7051J5206q2539J2117Q1849k9867n3954
240c7591N2221L1406n1939r502L3803n539j172J7276k7576j9890L5562q654n2450
253d4045K3760M7565l4845k7773L7318j702l1713L1081K0982m5043K541N2843
265C0969k3767m7380M3987M2701l9772k1293L2220K958j8507O662K393m134J3937
278B0974j1197l6140J4531L1308l0066k4047L9168R169m3685J904L3835j1356
290e602j2792K4179j931k3224J9124K0047k4827l833L6545J405l1828j19J9572
303A6716J423o299p666o148J1730M522l0883j2833L4987R604l7522o560L0150
$$ plain form
316 1221 -1820 -25373 -15902 2521 -1095 -3635 1114 -3496 -2751 11665 13644 3919 8856 19242
330 19242 12635 1858 4288 14006 17463 7303 -5974 -2640 8040 -3073 -22721 -13624 6287
343 6287 -5155 -29622 -23647 -550 -521 -16452 -13512 5999 10639 -3401 -7036 7132 16333 12294
357 12294 8641 9114 10521 15256 14561 3876 3646 17262 13115 -10083 -14548 -450 -2334 -17312
371 -17312 -20051 -12695 -8956 -12409 -20684 -17014 3878 8556 -11965 -10074 17320 14882 -8530 1698
385 1698 24668 16542 4894 12773 13574 9345 17767 12811 -4842 3050 15433 -8872 -27257 -7508
399 -7508 231 -20570 -23400 -12698 -14994 -10555 -2534 -14744 -12675 16608 11745 -19585 -2503 30799
413 30799 10072 -9934 18605 29715 7109 9271 20830 7087 7343 19937 -2826 -20248 4653
$$ packed form
316A221l041k3553R471J8423l616k540M749m610P45J4416J979r725M937J0386
330A9242o607j0777K430R718L457j0160j3277L334J0680j1113j9648R097J9911
343F287j1442k4467N975K3097K9j5931K940J9511M640j4040l635J4168R201m039
357A2294l653M73J407M735o95j0685k30J3616m147k3198m465J4098j884j4978
371a7312k739P356L739l453q275L670K0892M678k0521J891K7394k438k3412J0228
385A698K2970q126j1648P879Q01m229Q422m956j7653P892J2383k4305j8385J9749
399g508P739k0801k830J0702k296M439Q021j2210K069K9283m863l1330J7082L3302
413C0799k0727k0006K8539J1110k2606K162J1559j3743K56J2594k2763j7422K4901
$$ plain form
426 4653 4986 -31534 -25758 3643 -13147 -31019 -8887 -2911 -15077 1457 8816 -14188 -1728
439 -1728 27785 1019 -21781 19236 34510 -5504 -3895 30532 15660 -5197 12041 7884 -12855
452 -12855 4405 8255 -28573 -21605 16093 -7908 -38326 -2074 16000 -17290 -11484 18887 2731
465 2731 -5344 21412 6802 -20565 12119 26440 -19314 -15425 33568 13560 -25102 5235 21650
478 21650 -14239 -12668 9329 -14803 -19798 14125 -2394 -32914 6809 28643 -18713 -18794 30904
491 30904 16748 -15642 13668 22980 -11236 -963 17394 -19762 -23821 22796 6070 -35196
503 -35196 3498 33461 -14448 -23851 19085 5530 -22469 6990 12276 -18944 5195 30348
515 30348 -12895 -19784 32255 15514 -32929 1923 32513 -12683 -21134 15711 -5707 -30748
$$ packed form
426D653L33l6520N776K9401j6790j7872K2132N976j2166J6534P359k3004J2460
439a728K9513k6766k2800M1017J5274m0014J609L4427j4872k0857J7238m157k0739
452a2855J7260L850l6828O968L7698k4001l0418L6252J8074l3290N806L0371j6156
465B731q075K6756j4610k7367L2684J4321m5754L889M8993k0008l8662L0337J6415
478B1650l5889J571K1997k4132m995L3923j6519l0520L9723K1834m7356q1M9698
491C0904j4156l2390K9310R312l4216J0273J8357l7156m059M6617j6726m1266
503c5196L8694K9963m7909r403M2936j3555k7999K9459N286l1220K4139K5153
515C0348m3243o889N2039j6741m8443L4852L0590m5196q451L6845k1418k5041
$$ plain form
527 -30748 4154 3123 -34063 -402 35805 -10854 -23813 31917 21279 -29636 -1965 27421
539 27421 -9117 -9342 26569 3596 -13821 28310 21055 -27849 2018 40426 -8587 -28634 23231
552 23231 15113 -33197 -11322 7207 -31915 -26081 10155 -19188 -35543 16665 14375 -39427 -12523
565 -12523 31288 -9718 -26245 27291 28114 -3374 28318 44145 3712 16111 51633 8321
577 8321 -18442 33841 29078 -34437 -17840 18734 -27495 -51706 -11786 -21984 -51039 -13132
589 -13132 835 -40981 -19820 26712 -12169 -37637 21991 33420 -12749 12053 54177 21977
601 21977 10826 47314 26008 -7250 29550 34373 -21986 -10360 34092 -8833 -47319 -3015
613 -3015 2531 -45404 -29816 2723 -27476 -28807 12260 -9059 -38925 6785 19936 -32307 -15464
$$ packed form
527c0748L4902j031l7186L3661L6207m6659j2959N5730j0638n0915K7671K9386
539B7421l6538k25L5911k2973j7417M2131p255m8904K9867L8408m9013k0047N1865
552B3231q118m8310K1875J8529l9122N834L6236k9343j6355N2208k290n3802K6904
565a2523M3811m1006j6527N3536Q23l1488L1692J5827m0433J2399L5522m3312
577H321k6763N2283m763o3515J6597L6574m6229k4211L9920j0198k9055L7907
589a3132J3967m1816K1161M6532l8881k5468N9628J1429m6169K4802M2124l2200
601B1977j1151L6488k1306l3258L6800M823n6359J1626M4452m2925l8486M4304
613c015N546m7935J5588L2539l0199j331M1067k1319k9866M5710J3151n2243J6843
$$ plain form
626 -15464 41003 14364 -14018 31485 38460 -3333 13877 35510 -4711 -5295 37818 8248 -31451
639 -31451 12532 26241 -32317 -29533 16533 -9691 -36643 1434 3738 -29516 -4121 14941
651 14941 -28291 -23603 26823 3040 -32002 16932 40675 -7397 -4285 34491 8175 -14381
663 -14381 19675 13996 -20591 8393 27668 -20959 -24122 23602 1670 -38827 -2194 19267
675 19267 -19467 -14843 17232 -6904 -19144 16748 5019 -29226 7957 34229 -12269 -14740
687 -14740 35507 18133 -22470 5766 20966 -14915 -8086 18656 -10076 -19966 18809 4724
699 4724 -35835 -3922 23218 -18610 -24678 19384 8466 -20478 5935 14674 -15481 96 24815
712 24815 -8271 -14929 29979 19592 -22996 2812 29839 -8729 -20492 13544 3706 -18503
$$ packed form
626a5464N6467k6639k8382M5503O975m1793J7210K1633m0221n84M3113k9570l9699
639c1451M3983J3709n8558K784M6066k6224k6952L8077K304l3254K5395J9062
651A4941m3232M688N0426k3783l5042M8934K3743m8072L112L8776k6316k2556
663a4381L4056n679l4587K8984J9275m8627l163M7724k1932m0497L6633K1461
675A9267l8734M624L2075k4136j2240L5892j1729l4245L7183K6272m6498k471
687a4740N0247j7374m0603K8236J5200l5881O829K6742k8732r890L8775j4085
699D724m0559L1913K7140m1828o068M4062j0918k8944K6413Q739l0155J5577K4719
712B4815l3086o658M4908j0387m2588K5808K7027l8568j1763L4036r838k2209
$$ plain form
724 -18503 5045 7862 -21508 -4176 18803 -15325 -25036 17424 12139 -24736 -2880 22133 -6424
737 -6424 -11993 14596 850 -13561 15068 14143 -18467 1712 29371 -5381 -22021 15901 15008
750 15008 -19052 -4899 14950 -6529 -7679 12435 -5699 -17689 11680 8482 -24377 -5197
762 -5197 23445 -4967 -20513 11042 11824 -13379 280 12347 -7971 -2497 18776 -1999 -16181
775 -16181 14422 15536 -18651 -8460 18672 -427 -16017 5033 5120 -10697 1570 5513 -13974
788 -13974 -3936 17196 -4641 -18292 12466 17275 -12734 -6573 15957 1830 -8916 7400
800 7400 3935 -8131 6916 9001 -13901 -6148 16557 -1636 -19134 3759 11763 -9835 -8142
813 -8142 5725 -3403 -5561 6424 -2337 -10515 9400 11219 -12954 -5964 18054 4814 -12607
$$ packed form
724a8503K3548K817k9370J7332K2979l4128r711M2460n285l6875K1856K5013k8557
737f424n569K6589j3746j4411K8629r25l2610K0179K7659l4752j6640L7922q93
750A5008l4060J4153J9849k1479j150K0114j8134j1990K9369l198l2859J9180
762e197K8642k8412j5546L1555P82k5203J3659J2067k0318N474K1273k0775j4182
775a6181L0603J114l4187J0191K7132j9099j5590K1050Q7j5817J2267L943j9487
788a3974J0038K1132k1837j3651L0758M809l0009O161K2530j4127j0746J6316
800G400l465j2066J5047K085k2902P753K2705j8193j7498K2893Q004k1598J693
813h142J3867r128k158J1985q761q178J9915J819k4173O990K4018j3240j7421
$$ plain form
826 -12607 3196 11116 -3304 -2280 5820 -2145 -1126 9420 -1708 -12041 5228 10244 -10355
839 -10355 -9995 7640 1922 -10502 -2879 1504 -3644 1171 3088 -6968 -1175 12508 1269 -11383
853 -11383 4321 12994 -3399 -7719 5264 5290 -2710 -863 -83 -1597 4277 3048 -8065 -4171 8751
868 8751 1812 -9812 -1337 7578 49 -4341 1007 2785 3232 3794 -1669 -4135 4706 5703 -6735
883 -6735 -7445 4348 3083 -8085 -7235 1382 2225 -1900 -4004 -2182 2938 3298 -2925 -4436 4006 7116
899 7116 -269 -3531 3493 7770 3577 -902 1614 6569 5621 -1284 -3942 994 3437 -2146 -6929
914 -6929 -3684 1488 -813 -7800 -8035 768 2947 -6188 -8840 -130 3170 -3649 -5311 863 4495
929 4495 3866 1588 176 5400 11212 5496 -1780 4957 11759 2530 -4776 1620 4786 -905 -3238
$$ packed form
826a2607J5803P920j4420J024Q100p965J019J0546j1128j0333J7269N016k0599
839a0355L60J7635n718j2424P623M383n148M815J917j0056N793J3683j1239j2652
853a1383J5704Q673j6393m320J2983K6q000J847P80j514N874j229j1113L894J2922
868H751o939j1624Q475Q915p529m390N348J778M47N62n463k466Q841R97j2438
883f735p10J1793j265j1168Q50Q617Q43m125k104J822N120L60o223j511Q442L110
899G116p385l262P024M277m193m479K516M955r48o905k658M936K443n583m783
914f929L245N172k301o987k35Q803K179r135k652Q710L300o819j662O174L632
929D495o29k278j412N224N812n716p276O737O802r229p306O396L166n691k333
$$ plain form
944 -3238 -3496 -4369 -641 -604 -10187 -9756 2803 -335 -13945 -7732 4965 -805 -7610 -114 4196 2147
960 2147 5071 4346 -261 7632 13747 822 -4303 10501 10810 -5502 -3437 7246 1185 -4787 -208
975 -208 -3350 -6592 2038 -1036 -14423 -5274 8497 -5525 -15218 2530 8406 -5818 -3786 7043
989 7043 2262 948 8018 453 -4548 9879 8917 -9994 -3316 13918 1294 -11513 3257 7583
1003 7583 -5469 -2332 3792 -6187 -3622 8170 -4368 -14214 5277 9704 -12649 -9025 11828
1016 11828 2915 -9657 3554 6857 -3934 3274 7704 -6850 -1706 15704 1502 -13266 7805
1029 7805 14738 -8891 -8481 9680 -297 -10895 1759 -948 -13232 189 6080 -15069 -10402
1042 -10402 14109 1719 -16656 4388 16036 -3771 -2793 13455 3418 -2640 12361 5297 -9407
$$ packed form
944c238k58q73L728L7r583M31J2559l138j3610O213J2697n770o805P496M310k049
960B147K924p25m607P893O115j2925n125J4804L09j6312K065J0683o061n972M579
975b08l142l242Q630l074j3387R149J3771j4022r693J7748N876j4224K032J0829
989G043m781j314P070p565n001J4427r62j8911O678J7234j2624j2807J4770M326
1003G583j3052L137O124r979K565J1792j2538r846J9491M427k2353L624K0853
1016A1828q913j2572J3211L303j0791P208M430j4554N144J7410j4202j4768K1071
1029G805O933k3629M10J8161r977j0598J2654k707j2284J3421N891k1149M667
1042a0402K4511j2390j8375K1044J1648j9807R78J6248j0037o058J5001p064j4704
$$ plain form
1055 -9407 8457 16239 -9982 -10106 14884 2702 -18926 -2173 7155 -11460 -8589 4914 -8828
1068 -8828 -11544 8827 308 -18545 2237 16440 -9179 -11650 15333 8133 -10523 4870 11448
1081 11448 -5522 2291 14874 -3962 -5834 19269 8370 -16712 2896 18538 -8621 -13892
1093 -13892 10135 2271 -13967 1556 3097 -16192 -3991 10350 -13186 -17217 12825 5895 -20090
1106 -20090 -1681 16534 -5452 -8759 12411 3702 -7272 12397 11245 -10594 4851 21760
1118 21760 -5694 -14530 15330 10896 -15623 -1342 14137 -6404 -8366 9128 -4279 -14873
1130 -14873 7935 5358 -20295 -4192 17207 -8404 -19152 9693 7727 -15233 -891 11763
1142 11763 -7158 -3122 15999 -1829 -12631 14873 13021 -16949 -2606 21743 -844 -13268
$$ packed form
1055i407J7864P782k6221j24K4990j2182k1628J6753R328j8615K871J3503j3742
1068h828k716K0371q519j8853K0782J4203k5619k471K6983p200j8656J5393O578
1081A1448j6970P813J2583j8836j872K5103j0899k5082J9608J5642k7159n271
1093a3892K4027p864j6238J5523J541j9289J2201J4341k3536m031L0042o930k5985
1106b0090J8409J8215k1986l307K1170q709j0974J9669j152k1839J5445J6909
1118B1760k7454q836K9860m434k6519J4281J5479k0541j962J7494j3407j0594
1130a4873K2808k577k5653J6103K1399k5611j0748K8845j966k2960J4342J2654
1142A1763j8921M036J9121j7828j0802K7504j852k9970J4343K4349k2587j2424
$$ plain form
1154 -13268 11720 8642 -11748 1722 8889 -12552 -4868 15578 -5619 -18522 11017 12058 -18574
1167 -18574 -7195 15852 -3554 -13329 8977 4368 -12023 5036 10185 -14625 -5727 18488 -2258
1180 -2258 -18010 10674 15499 -12245 -4604 14526 -2792 -9162 10221 1400 -12961 8724 13081
1193 13081 -15231 -7068 19043 -889 -18979 7390 13097 -11386 -3641 12229 -5028 -7297 12585
1206 12585 -46 -16192 7721 14550 -14660 -9049 17123 252 -17245 3886 6912 -12608
1218 -12608 -2042 9756 -9650 -7122 15983 1137 -18056 7434 17407 -10799 -7561 17492
1230 17492 5010 -9913 7738 8274 -9187 2953 11963 -9640 -8327 15940 1926 -18827 2430
1243 2430 12528 -12351 -11567 8332 -2967 -12141 5720 2379 -14218 2285 13033 -11490 -11437
$$ packed form
1154a3268K4988l078k0390J3470P167k1441P684K0446k1197j2903K9539J041l0632
1167a8574J1379K3047j9406r775K2306m609j6391J7059N149k4810Q898K4215k0746
1180b258j5752K8684M825k7744P641J9130j7318o370J9383q821j4361K1685M357
1193A3081k8312Q163K6111j9932j8090K6369N707k4483P745J5870j7257k269J9882
1206A2585j2631j6146K3913O829k9210N611K6172j6871j7497K1131L026j9520
1218a2608J0566J1798j9406K528K3105j4846j9193K5490R973k8206L238K5053
1230A7492j2482j4923J7651N36j7461J2140R010k1603J313K4267j4014k0753K1257
1243B430J0098k4879P84J9899j1299r174J7861l341j6597J6503J0748k4523N3
$$ plain form
1256 -11437 16268 6401 -14626 4044 15918 -3939 -3368 12133 652 -5045 12228 5434 -12066
1269 -12066 4917 15457 -10258 -12697 11476 2863 -16324 -1264 6457 -10347 -5453 7609 -7589
1282 -7589 -11281 9949 3739 -16156 527 16073 -4783 -10270 10816 6917 -7700 3221 7650
1295 7650 -5346 2162 12013 -4846 -7583 13443 6825 -13861 -93 13929 -4558 -9673 7145
1308 7145 1798 -9457 2255 2992 -11968 -2836 9614 -7600 -13409 8283 7100 -12104 -3233
1321 -3233 10242 -1342 -4130 7453 1677 -3149 9782 6493 -9281 1822 14215 -4100 -11662
1334 -11662 7682 6755 -10733 -4158 5516 -4977 -5571 4600 -3041 -8456 6059 5922 -9967 -2061
1348 -2061 12035 329 -7982 4858 6604 -3159 1390 4641 -3653 545 8319 -4130 -9452 6760
$$ packed form
1256a1437K7705r867k1027J8670J1874j9857N71J5501j1481n697J7273o794j7500
1269a2066J6983J0540k5715k439K4173q613j9187J5060P721j6804M894J3062j5198
1282g589l692K1230o210j9895J6683J5546k0856n487K1086l899j4617J0921M429
1295G650j2996P508R851j6859k737K1026o618k0686J3768J4022j8487n115J6818
1308G145n347j1255J1712P37j4960R132J2450j7214n809K1692j183j9204Q871
1321c233J3475j1584k788J1583n776m826J2931l289j5774J1103J2393j8315p562
1334a1662J9344r27j7488O575R674j0493n94J0171p641n415J4515j37j5889P906
1348b061J4096j1706q311J2840J746r763M549L251q294M198P774j2449n322J6212
$$ plain form
1362 6760 6244 -11505 -5626 8829 -736 -9464 760 3124 -4135 463 2819 -5433 -1212 7789
1376 7789 -1629 -7747 5296 7717 -4390 -2281 6995 2315 -685 4577 830 -2470 5836 4153
1390 4153 -8132 -3086 8545 -1239 -11263 -81 5364 -5289 -6738 520 -524 -2700 8 -2621
1404 -2621 -3851 3478 3524 -4967 -1453 7971 3299 -2651 3215 5732 1274 2230 3044 -1404 430 5344
1420 5344 -1915 -7383 1771 5682 -4863 -7243 2382 3111 -4457 -4637 -333 658 -460 -2674 -3750
1435 -3750 811 3957 -1830 -3821 3055 5343 -753 -1792 2593 2386 239 612 -657 -1223 2214 2363
1451 2363 -2839 -2257 4447 3859 -2701 -2320 3967 4069 -1815 -3942 1086 3773 -1014 -5409 -1629 3031
1467 3031 -322 -5006 -2498 1644 92 -4159 -3524 133 943 -1056 -2249 109 2536 2462 1638 1767
$$ packed form
1362F760n16j7749N879J4455r565q728J0224K364p259M598K356q252M221R001
1376G789r418o118J3043K421j2107K109R276m680l000N262l747l300Q306j683
1390D153j2285N046J1631r784j0024J1182N445j0653j449P258j044k176K708k629
1404b621j230P329M6q491L514R424m672n950N866K517m458R56Q14m448J834M914
1420E344p259n468R154L911j0545k380R625P29p568j80M304R91j118k214j076
1435c750M561L146n787j991O876K288o096j039M385k07k147L73j269n66L437J49
1451B363n202N82O704n88o560L81O287J02n884k127N028K687m787m395L780M660
1467C031l353m684K508M142j552m251O35L657Q10j999j193K358K427p4q24J29
$$ plain form
1483 1767 2589 4815 4754 147 -1419 4345 4701 -3936 -5349 2878 2883 -6253 -6240 1486 1240 -3989 -4623 -1363
1501 -1363 796 -318 -3907 -3575 2607 3620 -2641 -1857 4915 3610 -881 2091 3949 482 1950
1516 1950 4034 -2106 -3467 5050 3310 -6677 -2883 6624 878 -6944 -1312 3284 -1055 -3510 -2847
1531 -2847 -2271 1069 715 -6232 -3436 6749 2705 -6299 1590 9557 604 -2803 5739 4368 -2315
1546 -2315 2566 3809 -5087 -2427 6066 -1705 -9044 675 4521 -5682 -6360 1035 -461 -2980 -718
1561 -718 -3195 -2136 6088 2266 -6575 3284 12998 -5 -6185 8688 9419 -4979 -2008 6896 -1410
1576 -1410 -5429 2891 -686 -7745 762 3843 -7234 -5674 4873 -206 -7455 -424 1516 -3422
$$ packed form
1483A767Q22K226o1m607j566N764L56q637j413Q227Nr136J3P726k46n229o34L260
1501a363K159j114l589L32O182J013o261P84O772j305m491K972J858l467J468
1516A950K084o140j361Q517j740r987L794R507n746p822N632M596m339k455O63
1531b847N76L340l54o947K796J0185m044r004P889P967q953l407Q542j371o683
1546b315M881J243q896K660Q493p771p339R719L846j0203o78P395j496k519K262
1561g18k477J059Q224l822q841R859R714j3003o180J4873P31j4398K971Q904q306
1576a410m019Q320l577p059Q507L081j1077J560J0547n079p249P031J940m938
$$ [...]
8191A04
##END NTUPLES=NMR FID
##END=
