##TITLE=1H_AM_NV60.1
 1,4-dioxane
 8 sc, 
 26.9.2023
##JCAMPDX= 6.0         $$ Bruker NMR JCAMP-DX V2.0
##DATA TYPE= NMR FID
##DATA CLASS= NTUPLES
##ORIGIN= UXNMR, Bruker Analytische Messtechnik GmbH
##OWNER= root
$$ XWIN-NMR		Version 3.5
$$ Tue Sep 26 14:21:49 2023 Russian Standard Time (UT+4h)  she@DPX200
##.OBSERVE FREQUENCY= 200.1335
##.OBSERVE NUCLEUS= ^1H
##.DELAY= (6, 6)
##.ACQUISITION MODE= SIMULTANEOUS
##.ACQUISITION SCHEME= undefined
##.AVERAGES= 8
##.DIGITISER RES= 18
##SPECTROMETER/DATA SYSTEM= spect
##.PULSE SEQUENCE= zg30
##.SOLVENT NAME= CDCl3
##.SHIFT REFERENCE= (INTERNAL, CDCl3, 0, 15.7039)
##AUDIT TRAIL= $$ (NUMBER, WHEN, WHO, WHERE, WHAT)
$$ ##TITLE= Audit trail, XWIN-NMR		Version 3.5
$$ ##JCAMPDX= 5.01
$$ ##ORIGIN= Bruker BioSpin GmbH
$$ ##OWNER= she
$$ F:/spectra/data/she/nmr/H-F/1/audita.txt
$$ ##AUDIT TRAIL=  $$ (NUMBER, WHEN, WHO, WHERE, WHAT)
(   1,<2023-09-26 14:20:25.26 +0400>,<she>,<DPX200>,
      <created by zg, POWCHK disabled, PULCHK disabled
       configuration hash MD5:
       00 E9 B6 7A A2 85 ED C7 34 08 36 98 17 FE 4E 26
       data hash MD5: 16K
       32 D6 8E A3 C0 47 EA E2 AB 7B E8 80 3B 16 D8 81>)
$$ ##END=
$$ 
$$ hash MD5
$$ EA 92 1D 7F 7D 19 AA 63 FB ED E5 DD 00 24 D1 A0
##$RELAX= 
##$RELAX= 
##$RELAX= 
##$RELAX= 
##$RELAX= 
##$RELAX= 
$$ Bruker specific parameters
$$ --------------------------
##$DU= <F:/spectra>
##$EXPNO= 1
##$NAME= <H-F>
##$PROCNO= 1
##$TYPE= <nmr>
##$USER= <she>
##$AMP= (0..31)
100 100 100 100 100 100 100 100 100 100 100 100 100 100 100 100 100 100 
100 100 100 100 100 100 100 100 100 100 100 100 100 100 
##$AQSEQ= 0
##$AQ_mod= 1
##$AUNM= <au_zg>
##$AUTOPOS= <>
##$BF1= 200.13
##$BF2= 200.13
##$BF3= 200.13
##$BF4= 200.13
##$BF5= 200.13
##$BF6= 200.13
##$BF7= 200.13
##$BF8= 200.13
##$BYTORDA= 1
##$CFDGTYP= 0
##$CFRGTYP= 5
##$CHEMSTR= <none>
##$CNST= (0..31)
1 1 145 1 1 1 1 1 1 1 1 1 1 1 1 1 1 1 1 1 1 1 1 1 1 1 1 1 1 1 1 1 
##$CPDPRG= <>
##$CPDPRG1= <>
##$CPDPRG2= <>
##$CPDPRG3= <>
##$CPDPRG4= <mlev>
##$CPDPRG5= <mlev>
##$CPDPRG6= <mlev>
##$CPDPRG7= <mlev>
##$CPDPRG8= <mlev>
##$CPDPRGB= <>
##$CPDPRGT= <>
##$D= (0..31)
0 1.2 0 0 0 0 0 0 0 0.06 0 0.03 0 0 0 0 0.0002 0 0 0 0 0 0 0 0 0 0 0 0 
0 0 0 
##$DATE= 1695723624
##$DBL= (0..7)
120 120 120 120 120 120 120 120 
##$DBP= (0..7)
150 150 150 150 150 150 150 150 
##$DBP07= 0
##$DBPNAM0= <>
##$DBPNAM1= <>
##$DBPNAM2= <>
##$DBPNAM3= <>
##$DBPNAM4= <>
##$DBPNAM5= <>
##$DBPNAM6= <>
##$DBPNAM7= <>
##$DBPOAL= (0..7)
0.5 0.5 0.5 0.5 0.5 0.5 0.5 0.5 
##$DBPOFFS= (0..7)
0 0 0 0 0 0 0 0 
##$DE= 6
##$DECBNUC= <off>
##$DECIM= 32
##$DECNUC= <off>
##$DECSTAT= 4
##$DIGMOD= 1
##$DIGTYP= 9
##$DL= (0..7)
0 120 120 120 120 120 120 120 
##$DP= (0..7)
150 150 150 150 150 150 150 150 
##$DP07= 0
##$DPNAME0= <>
##$DPNAME1= <>
##$DPNAME2= <>
##$DPNAME3= <>
##$DPNAME4= <>
##$DPNAME5= <>
##$DPNAME6= <>
##$DPNAME7= <>
##$DPOAL= (0..7)
0.5 0.5 0.5 0.5 0.5 0.5 0.5 0.5 
##$DPOFFS= (0..7)
0 0 0 0 0 0 0 0 
##$DQDMODE= 0
##$DR= 18
##$DS= 0
##$DSLIST= <SSSSSSSSSSSSSSS>
$$ [...]
##$SUBNAM2= <"">
##$SUBNAM3= <"">
##$SUBNAM4= <"">
##$SUBNAM5= <"">
##$SUBNAM6= <"">
##$SUBNAM7= <"">
##$SUBNAM8= <"">
##$SUBNAM9= <"">
##$SW= 20.0186888072724
##$SWIBOX= (0..15)
0 0 2 0 0 0 0 0 0 0 0 0 0 0 0 0 
##$SW_h= 4006.41025641026
##$TD= 16384
##$TD0= 1
##$TE= 0
##$TE2= 300
##$TE3= 300
##$TEG= 300
##$TL= (0..7)
0 120 120 120 120 120 120 120 
##$TP= (0..7)
150 150 150 150 150 150 150 150 
##$TP07= 0
##$TPNAME0= <>
##$TPNAME1= <>
##$TPNAME2= <>
##$TPNAME3= <>
##$TPNAME4= <>
##$TPNAME5= <>
##$TPNAME6= <>
##$TPNAME7= <>
##$TPOAL= (0..7)
0.5 0.5 0.5 0.5 0.5 0.5 0.5 0.5 
##$TPOFFS= (0..7)
0 0 0 0 0 0 0 0 
##$TUNHIN= 0
##$TUNHOUT= 0
##$TUNXOUT= 0
##$USERA1= <user>
##$USERA2= <user>
##$USERA3= <user>
##$USERA4= <user>
##$USERA5= <user>
##$V9= 5
##$VALIST= <valist>
##$VCLIST= <CCCCCCCCCCCCCCC>
##$VD= 0
##$VDLIST= <DDDDDDDDDDDDDDD>
##$VPLIST= <PPPPPPPPPPPPPPP>
##$VTLIST= <TTTTTTTTTTTTTTT>
##$WBST= 1024
##$WBSW= 4
##$XGAIN= (0..3)
0 0 0 0 
##$XL= 0
##$YL= 0
##$YMAX_a= 272569
##$YMIN_a= -301916
##$ZGOPTNS= <>
##$ZL1= 120
##$ZL2= 120
##$ZL3= 120
##$ZL4= 120
##$ABSF1= 10
##$ABSF2= 0
##$ABSG= 5
##$ABSL= 3
##$ALPHA= 0
##$AQORDER= 0
##$ASSFAC= 0
##$ASSFACI= 0
##$ASSFACX= 0
##$ASSWID= 0
##$AUNMP= <proc_1d>
##$AZFE= 0.1
##$AZFW= 0.1
##$BCFW= 1
##$BC_mod= 2
##$BYTORDP= 1
##$COROFFS= 0
##$CY= 11.3945322036743
##$DATMOD= 1
##$DC= 2
##$DFILT= <>
##$DTYPP= 0
##$F1P= 15.7292609196834
##$F2P= 12.9074282941183
##$FCOR= 0.5
##$FTSIZE= 0
##$FT_mod= 4
##$GAMMA= 1
##$GB= 0.15
##$INTBC= 1
##$INTSCL= 1
##$ISEN= 128
##$LB= 0.24
##$LEV0= 0
##$LPBIN= 0
##$MAXI= 10000
##$MC2= 0
##$MEAN= 0
##$ME_mod= 0
##$MI= 1.114404
##$NCOEF= 0
##$NC_proc= 0
##$NLEV= 6
##$NOISF1= 3.799351
##$NOISF2= 2.8
##$NSP= 1
##$NTH_PI= 0
##$NZP= 0
##$OFFSET= 15.70392
##$PC= 1
##$PHC0= -21789.94
##$PHC1= 11.85271
##$PH_mod= 1
##$PKNL= yes
##$PPARMOD= 0
##$PSCAL= 0
##$PSIGN= 0
##$REVERSE= no
##$SF= 200.130013532006
##$SI= 16384
##$SIGF1= 3
##$SIGF2= 2
##$SINO= 400
##$SIOLD= 16384
##$SREGLST= <1H.CDCl3>
##$SSB= 0
##$STSI= 0
##$STSR= 0
##$SW_p= 3612.71676300578
##$SYMM= 0
##$S_DEV= 0
##$TDeff= 0
##$TDoff= 0
##$TI= <>
##$TILT= no
##$TM1= 0
##$TM2= 0
##$TOPLEV= 0
##$USERP1= <user>
##$USERP2= <user>
##$USERP3= <user>
##$USERP4= <user>
##$USERP5= <user>
##$WDW= 1
##$XDIM= 8192
##$YMAX_p= 0
##$YMIN_p= 0
$$ End of Bruker specific parameters
$$ ---------------------------------
##NTUPLES= NMR FID
##VAR_NAME=  TIME,          FID/REAL,        FID/IMAG
##SYMBOL=    X,             R,               I
##VAR_TYPE=  INDEPENDENT,   DEPENDENT,       DEPENDENT
##VAR_FORM=  AFFN,          ASDF,            ASDF
##VAR_DIM=   8192,          8192,            8192
##UNITS=     SECONDS,       ARBITRARY UNITS, ARBITRARY UNITS
##FACTOR=    0.0002496,     1,               1
##FIRST=     0,             0,               0
##LAST=      2.0444736,     0,               0
##MIN=       0,             -301916,         0
##MAX=       2.0444736,     272569,          0
$$ Real data points
##PAGE= N=1
##DATA TABLE= (X++(R..R)), XYDATA
0@%%%%%%%%%%%%Qj6J6j6J6k4L2m0M8n6O7p5Q9j05J23j45J67j93K22k52K87l25
$$ 0 0 0 0 0 0 0 0 0 0 0 0 0 8 -8 8 -8 8 -16 16 -24 24 -32 35 -40 49 -56 67 -78 89 -104 118 -134 153 -172
34a72L66m13M65n22N83o52P28q08Q97r94J100j215J342j480J630j796J980k182
$$ -172 194 -219 246 -276 307 -345 383 -425 472 -522 578 -637 705 -775 855 -941 1039 -1143
52a143K404k652K929l240L592l998M466n014N670o468P465q752J0486j2964J6835
$$ -1143 1261 -1391 1538 -1702 1890 -2108 2358 -2656 3014 -3454 4011 -4741 5745 -7219 9616
67I616k3793M0264j54423j73580R2933M6142Q9775N6936P8918O0444P3044M4358
$$ 9616 -14177 26087 -128336 -301916 -208983 -162841 -73066 -16130 62788 123232 196276 240634
79B40634K9549j3398l2212n9123o0389p0886o6433p1399o0207n0797k5506m624
$$ 240634 270183 256785 224573 165450 105061 34175 -32258 -103657 -163864 -214661 -240167 -244791
91b44791K2906M0609N9517O7369P3055O6748N7810M1244K6649Q926p191k7525
$$ -244791 -221885 -181276 -121759 -54390 18665 85413 143223 184467 211116 220042 212851 185326
103A85326m6249o3326p0377o8380n6615m2262k7552j4937m10J7345L8690N7614
$$ 185326 139077 75751 5374 -63006 -119621 -161883 -189435 -204372 -204782 -187437 -148747 -91133
115i1133O8780O7980N7743M2949K9308J7530N317j0871l0663m9747o2071o3974
$$ -91133 -22353 45627 103370 146319 175627 193157 198474 187603 156940 107193 45122 -18852
127a8852n6895m5409l3583k2486r803O397K5185M2415N3624N6718N3328M6530
$$ -18852 -75747 -121156 -154739 -177225 -187028 -180631 -155446 -113031 -59407 -2689 50639 97169
139I7169L7962K7342J3319l864k1497l5969m5048m8976m9332m7110m1327l0624
$$ 97169 135131 162473 175792 171928 150431 114462 69414 20438 -28894 -76004 -117331 -147955
151a47955j5356J860J7282K8581L6108M1654M6093M7906M4232L3554J7785J076
$$ -147955 -163311 -161451 -144169 -115588 -79480 -37826 8267 56173 100405 133959 151744 152820
163A52820j2756k2715l0577l8212m5168m8511m4979l3913j8522l409Q388J7063
$$ 152820 140064 117349 86772 48560 3392 -45119 -90098 -124011 -142533 -145942 -137554 -120491
175a20491K5077L3967M2513M7153M4879L5386K1782Q160l082j2511k1885l1790
$$ -120491 -95414 -61447 -18934 28219 73098 108484 130266 138426 135344 122833 100948 69158
187F9158m0493m4782m2654l4425k2962j1296r44Q676J8501K8265L6194L9974L8787
$$ 69158 28665 -16117 -58771 -93196 -116158 -127454 -128398 -119722 -101221 -72956 -36762 3212 41999
200D1999L3475K5620J6614O554m673j6442k6878l3842l6304l5025l1569k6679
$$ 41999 75474 101094 117708 124262 119589 103147 76269 42427 6123 -28902 -60471 -87150
212h7150k0009j0535J553J4277K4615L0520L2258L1665L0602K8564K3752J4509
$$ -87150 -107159 -117694 -116141 -101864 -77249 -46729 -14471 17194 47796 76360 100112 114621
224A14621J565j2002k2497k8138l0041l0314l0468k9507k5137j6225l951Q522
$$ 114621 116186 104184 81687 53549 23508 -6806 -37274 -66781 -91918 -108143 -112094 -103572
236a03572J8214K4138K7455K9611L0973L0214K5635J7076O058m754j3658k0248
$$ -103572 -85358 -61220 -33765 -4154 26819 57033 82668 99744 105802 101048 87390 67142
248F7142k5215k8902l0660k9522k4755j7162q264M45Q482J5939K2735K8021L0414
$$ 67142 41927 13025 -17635 -47157 -71912 -89074 -97338 -96893 -88411 -72472 -49737 -21716 8698
261H698K9152K4392J7521J0001K546m988j2854k0419k6340k8958k7867k3792j8157
$$ 8698 37850 62242 79763 89764 92310 87322 74468 54049 27709 -1249 -29116 -52908 -71065
274g1065j2233n901J347R779J8332K5130K8368K7652K4189J9280J3940P890N53
$$ -71065 -83298 -89199 -87852 -78073 -59741 -34611 -6243 21409 45598 64878 78818 86708 87261
287H7261q019j6506k2998k6182k5973k3694k0293j6047j0473l078N625J4091K0659
$$ 87261 79242 62736 39738 13556 -12417 -36111 -56404 -72451 -82924 -86002 -80377 -66286 -45627
300d5627K4322K5192K4097K1549J7384J1435L918m244j1674j7374k1121k3074
$$ -45627 -21305 3887 27984 49533 66917 78352 82270 78026 66352 48978 27857 4783
312D783k3441k2109j8557j2825n672J828Q648J4360J8930K2194K3650K2787J9151
$$ 4783 -18658 -40767 -59324 -72149 -77821 -75993 -67345 -52985 -34055 -11861 11789 34576 53727
325E3727J3294O416l31o329j1638j6402k0369k2747k2672j9822j4673q381j994
$$ 53727 67021 73437 73106 66777 55139 38737 18368 -4379 -27051 -46873 -61546 -69927 -71921
338g1921L985R654J4942J9427K2185K2468K0093J5487R703L658k188p756j2989
$$ -71921 -67936 -58282 -43340 -23913 -1728 20740 40833 56320 66023 69681 67493 59737 46748
351D6748j7479k0516k1501k0246j6859j1862n972K75O326J1756J6115J9062K0264
$$ 46748 29269 8753 -12748 -32994 -49853 -61715 -67687 -67412 -61086 -49330 -33215 -14153 6111
364F111J9692J7269J3072P592J474m518r779j4043j7099j8950j9348j7990j4576
$$ 6111 25803 43072 56144 63736 65210 60692 50913 36870 19771 821 -18527 -36517 -51093
377e1093r431l256K949Q516J2912J6093J7938J8426J7423J4729J0494N164o38
$$ -51093 -60524 -63780 -60831 -52315 -39403 -23310 -5372 13054 30477 45206 55700 60864 60226
390F0226o340j1226j4959j7250j7979j7364j5315j1806p000j177M928J0412J4394
$$ 60226 53886 42660 27701 10451 -7528 -24892 -40207 -52013 -59013 -60190 -55262 -44850 -30456
403c0456J6563J7025J6367J4871J2330Q544L397k608q431j3015j5773j6729j6389
$$ -30456 -13893 3132 19499 34370 46700 55244 58641 56033 47602 34587 18814 2085 -14304
416a4304j5219j3066r617m761J102P028J1834J4811J5940J5691J4734J3041J0329
$$ -14304 -29523 -42589 -52206 -56967 -55865 -48837 -37003 -22192 -6252 9439 24173 37214 47543
429D7543O289J032m706r841j3541j5496j5921j5278j3642j0845o855j923L303
$$ 47543 53832 54864 50158 40317 26776 11280 -4641 -19919 -33561 -44406 -51261 -53184 -49881
442d9881Q076J1816J4306J5470J5345J3932J1120P399L165j168n480r641j3384
$$ -49881 -41805 -29989 -15683 -213 15132 29064 40184 47583 50748 49580 44100 34459 21075
455B1075j5890j6399j4720j1280p205l453j53L332P437J1862J5348J6453J4908
$$ 21075 5185 -11214 -25934 -37214 -44419 -47872 -48025 -44693 -37256 -25394 -10046 6407 21315
468B1315J1508P749M663J965j280n747j0821j4913j6403j5100j2011q497n556
$$ 21315 32823 40572 45235 47200 45920 40173 29352 14439 -1964 -17064 -29075 -37572 -43128
481d3128k832M75M745R342J3086J4802J4459J2753J0279P477M123N2m422q542
$$ -43128 -45960 -45485 -40740 -31398 -18312 -3510 10949 23702 33981 41458 45581 45633 41211 32669
495C2669j1579j3237j3650j3176j1683q921m895j80M193P464R508J0956J2246
$$ 32669 21090 7853 -5797 -18973 -30656 -39577 -44472 -44652 -40459 -32995 -23487 -12531 -285
508b85J3300J3230J0912O425Q81l930o952q409r545j1144j2944j3612j1733p263
$$ -285 13015 26245 37157 43582 44463 40533 33581 25172 15627 4483 -8461 -22073 -33806 -41069
522d1069j733K893N620O934Q251J0444J2783J3870J2313Q194L095j287m194o200
$$ -41069 -42802 -39909 -34289 -27355 -19104 -8660 4123 17993 30306 38500 41595 40308 36114 29914
536B9914q181j0553j2490j2911j1341q154m491j138J838M901Q122J0902J2353
$$ 29914 21733 11180 -1310 -14221 -25562 -33716 -38207 -39345 -37507 -32606 -24484 -13582 -1229
549a229J2068J0521Q319O031L401m8m324q462j1157j1712j0585r143q133p328
$$ -1229 10839 21360 29679 35710 39111 39063 34739 26277 15120 3408 -7177 -16320 -24453 -31781
563c1781n599k044L002P886J0837J1274J0027Q824Q390Q128O627L012k160p095
$$ -31781 -37380 -39424 -36422 -28536 -17699 -6425 3602 12426 20816 28944 35571 38583 36423 29328
577B9328r985j0395r350q492q467q588p403m113P41N457Q582R645R537R296R356
$$ 29328 19343 8948 -402 -8894 -17361 -25949 -33352 -37465 -36724 -31267 -22685 -13040 -3503 5793 15149
592A5149Q952P161L811l68m065o513p925q921r831j0275r440o964l534k76K190
$$ 15149 24101 31262 35073 34705 30640 24127 16202 7281 -2550 -12825 -22265 -29229 -32763 -33039 -30849
607c0849M125O347R002J1213J1713R801O141K499L06p13j900m485q258j1369j1975
$$ -30849 -26724 -20377 -11375 -162 11551 21352 27493 29992 30298 29585 27685 23200 14942 3573 -8402
622h402r756o061k973j536r03O54M077Q324J1335J1502R235O093L846K747J702
$$ -8402 -18158 -24219 -27192 -28728 -29631 -28977 -24900 -16576 -5241 6261 15496 21589 25435 28182 29884
637B9884n20m044p626r697r664q394p075o114m994k713Q46M761P585Q543Q114
$$ 29884 29364 25320 17694 7997 -1667 -10061 -17136 -23250 -28244 -30957 -30111 -25350 -17765 -9222 -1108
652a108P539P470P394O181L182r47m654o713p009o715o983q029q674p463m065
$$ -1108 6431 13901 21295 27476 30658 29711 25057 18344 11335 4620 -2363 -10392 -19066 -26529 -30594
667c0594M25M228O150O415O344O889Q039Q595P293M132K84k798m423n117n957
$$ -30594 -30169 -25941 -19791 -13376 -7032 -143 7896 16491 23784 27916 28200 25402 20979 15862 9905
682I905p339q683q860p162m066q94J458K880M238O081Q068R117Q440O182L455
$$ 9905 2566 -6117 -14977 -22139 -26205 -27099 -25641 -22761 -18523 -12442 -4374 4743 13183 19365 22820
697B2820J460L36p92k832n824q573r550q370n868l517k202j494j02K569N928Q463
$$ 22820 24280 24616 23824 20992 15168 6595 -2955 -11325 -17193 -20710 -22912 -24406 -24508 -21939 -16011 -7548
713g548Q896P453N428M019L433K758Q77k321n689p808q012o912n805n235m733
$$ -7548 1348 8801 14229 18248 21681 24439 25316 22995 17306 9498 1486 -5426 -11231 -16466 -21199
728b1199l338o23K808N560O739O510N897N852O180N903M068Q63k618m979n738
$$ -21199 -24537 -25160 -22352 -16792 -10053 -3543 2354 8206 14386 20289 24357 25220 22602 17623 11885
743A1885n614n716o411p071o501m100o52K457M147M468M542N258O553P434O722
$$ 11885 6271 555 -5856 -12927 -19428 -23528 -24180 -21723 -17576 -13108 -8566 -3308 3245 10679 17401
758A7401M234J060j498k792l381m202n716p197p679o333l735j059O50J474K245
$$ 17401 21635 22695 21197 18405 15024 10822 5106 -2091 -9770 -16103 -19838 -20897 -20247 -18773 -16528
773a6528L712N769P316P431N978L751J891P67j67j691m011o327p480o983n349
$$ -16528 -12816 -7047 269 7700 13678 17429 19320 20087 19920 18229 14218 7891 411 -6572 -11921
788a1921l589k422j717o58J341L950O091O847O231N043M150L628K920J263j404
$$ -11921 -15510 -17932 -19649 -20307 -18966 -15016 -8925 -2078 4153 9196 13346 16974 19894 21157 19753
803A9753m250o044o294n492m628m310m213l459j531J237L755N122N236M808M696
$$ 19753 15503 9459 3165 -2327 -6955 -11265 -15478 -18937 -20468 -19231 -15476 -10354 -5118 -310 4386
818D386N029N110M014J687j204l451m469m527m478m835n339n229l857j563P64
$$ 4386 9415 14525 18539 20226 19022 15571 11102 6575 2097 -2738 -8077 -13306 -17163 -18726 -17962
833a7962K381L131L637M439N495O140N615L792J453n22j693k387l295m602n844
$$ -17962 -15581 -12450 -8813 -4374 1121 7261 12876 16668 18121 17599 15906 13519 10224 5622 -222
848b22o219n273l403j510k08N60J385K833M699O131O342N273L456J837P80k2j131
$$ -222 -6441 -11714 -15117 -16627 -16835 -16275 -14890 -12057 -7358 -1227 5115 10388 13844 15681 16461 16439 15308
865A5308k811m589n666n635m630l386k427j751q92N84K547M355N295N212M480
$$ 15308 12497 7908 2242 -3393 -8023 -11409 -13836 -15587 -16479 -15895 -13348 -8993 -3698 1514 5994
880E994L723L115K384J172o44k598m028m530m379m036l899l822l176j744L28K309
$$ 5994 9717 12832 15216 16388 15744 13146 9118 4588 209 -3827 -7726 -11548 -14724 -16468 -16140 -13831
896a3831L660M185M244M294M441M268L324J615m17k087l076l500l803m266m649
$$ -13831 -10171 -5986 -1742 2552 6993 11261 14585 16200 15783 13696 10620 7120 3317 -949 -5598
911e598m528l544j859p0J426K429L196L904M591M880M439L288J707K63q45j700
$$ -5598 -10126 -13670 -15529 -15599 -14173 -11744 -8548 -4644 -53 4827 9266 12554 14261 14524 13679 11979
927A1979k547l492m303m666m337l436k177r67R2J179K380L509M328M558M114L267
$$ 11979 9432 5940 1637 -3029 -7366 -10802 -12979 -13946 -13854 -12675 -10295 -6786 -2458 2100 6214 9481
943I481K275J309L53p02j923l144l958m304m103l556k839j949q93M47J905L238
$$ 9481 11756 13065 13418 12716 10793 7649 3691 -613 -4716 -8272 -11111 -13060 -13953 -13506 -11601 -8363
959h363M058M255L968L439K822K096J169l7j428k714l625l995l992l699l229k515
$$ -8363 -4305 -50 3918 7357 10179 12275 13444 13407 11979 9265 5640 1645 -2347 -6046 -9275 -11790
975a1790j469j74J235K464L337L739L806L591L168K486J548M87o14j627k546l254
$$ -11790 -13259 -13433 -12198 -9734 -6397 -2658 1148 4739 7907 10393 11941 12428 11814 10187 7641 4387
991D387l769l932l572k840j768o31M44J386K254K985L545L744L483K883J995J019
$$ 4387 618 -3314 -6886 -9726 -11494 -12125 -11681 -10295 -8041 -5056 -1511 2233 5716 8599 10594 11613
1007A1613P4r23j873k761l404l799l708l300k488j365j14J069K036K705L038L292
$$ 11613 11687 10764 8891 6130 2726 -1073 -4781 -8081 -10569 -11934 -12048 -10979 -8943 -6238 -3200 92
1023I2L380L243K813J885O18o77j717k460k891l215l459l398k985k042p67M53
$$ 92 3472 6715 9528 11413 12031 11354 9637 7177 4286 1071 -2388 -5786 -8771 -10813 -11580 -11127
1039a1127J449K136K590K938L221L193K809K130J222L11o15j573k520l227l579
$$ -11127 -9678 -7542 -4952 -2014 1207 4400 7209 9339 10561 10872 10257 8684 6164 2937 -642
1054f42l339k657j899j218o05Q1J082K247L186L573L296K569J952J511J139M52
$$ -642 -3981 -6638 -8537 -9755 -10360 -10279 -9197 -6950 -3764 -191 3105 5674 7626 9137 10276 10728
1070A0728o80k139l292l719l433k665k013j579j163n25N61J793K802L183L110
$$ 10728 10048 7909 4617 898 -2535 -5200 -7213 -8792 -9955 -10480 -9919 -8126 -5324 -2141 969
1085I69K773K478K171J601O44o16j716k492k733k806k817k740k484j731n74N77
$$ 969 3742 6220 8391 9992 10636 10020 8304 5812 3079 273 -2544 -5284 -7768 -9499 -10073 -9496
1101i496J421J813K018K326K850L190K997K145P49m88j273j601j816k194k843
$$ -9496 -8075 -6262 -4244 -1918 932 4122 7119 9264 10013 9525 8252 6651 4835 2641 -202
1116b02l224k965k101q60J97P74J048J451K170K984L431L115K211J037J06m23
$$ -202 -3426 -6391 -8492 -9352 -9155 -8381 -7333 -5882 -3712 -728 2703 5818 8029 9066 9172 8749
1132H749q67j492k332l037l249k691j867j118o61l26K58J297K452L157L209K555
$$ 8749 7882 6390 4058 1021 -2228 -4919 -6786 -7904 -8565 -8891 -8633 -7336 -4884 -1727 1482 4037
1148D037J833J400J170P61j88j505k627k976k628j980j590j739j869j390j31J441
$$ 4037 5870 7270 8440 9201 9013 7508 4881 1905 -723 -2703 -4293 -6032 -7901 -9291 -9422 -7981
1164g981K588K776K338J919J911K207K258J414j28j632k400k239j782j667k089
$$ -7981 -5393 -2617 -279 1640 3551 5758 8016 9430 9302 7670 5270 3031 1249 -418 -2507
1179b507k561k474j527k8J231J791J789J758K141K688K835K253J033k03r08j068
$$ -2507 -5068 -7542 -9069 -9097 -7866 -6075 -4286 -2528 -387 2301 5136 7389 8422 8219 7311 6243
1195F243j122j550k314k975k845k012q79q8J50K48P21J771K911L430K849J631
$$ 6243 5121 3571 1257 -1718 -4563 -6575 -7454 -7542 -7392 -7144 -6423 -4652 -1741 1689 4538 6169
1211F169N15Q1K06K67l81j630k850l275k659j576q05o37p92n15M66J850K929L084
$$ 6169 6684 6765 6971 7238 6857 5227 2377 -898 -3557 -5133 -5938 -6575 -7367 -7882 -7416 -5566 -2637 447
1229D47K415J494J042R84R71M52o11j775k366k329j943j678j715j851j437l63
$$ 447 2862 4356 5398 6382 7353 7805 7194 5419 3053 724 -1219 -2897 -4612 -6463 -7900 -8263
1245h263R99J986K161J808J522J676K082K216J573K13j097j760j570j192j243
$$ -8263 -7264 -5278 -3117 -1309 213 1889 3971 6187 7760 7973 6876 5116 3546 2354 1111
1260A111j916k656k680j754j65J122J611J344J093J362K109K673K432J425J22
$$ 1111 -805 -3461 -6141 -7895 -8060 -6938 -5327 -3983 -2890 -1528 581 3254 5686 7111 7233
1275G233o90q52p21r52j706k578k870k260j153j74K54K84M28J147K090K770K583
$$ 7233 6543 5691 4970 4018 2312 -266 -3136 -5396 -6549 -6723 -6469 -6185 -5757 -4610 -2520 250 2833
1292B833J629P53L34M68N77M8j131k364k872k451j465p48p05r53q40L9J398K402
$$ 2833 4462 5215 5549 6017 6594 6642 5511 3147 275 -2176 -3641 -4389 -5094 -6047 -6887 -6848 -5450 -3048
1310c048K505J871J104Q76J199J556J146p9j485k292k198j605j230j370j728j714
$$ -3048 -543 1328 2432 3308 4507 6063 7209 7130 5645 3353 1155 -450 -1680 -3050 -4778 -6492
1326f492q69M95J643J955J587J162J228J725K113J871Q01m94j358j492j261j216
$$ -6492 -7361 -6866 -5223 -3268 -1681 -519 709 2434 4547 6418 7219 6725 5367 3875 2614 1398
1342A398j666k200k225j545l79O21R55Q43P05J103J855K429K219J360L43k90l09
$$ 1398 -268 -2468 -4693 -6238 -6617 -5996 -5041 -4198 -3493 -2390 -535 1894 4113 5473 5816 5526 5217
1359E217k11n30j366k301k686k058r74q9J42j32k38K77J354K322K570J957R58
$$ 5217 5006 4476 3110 809 -1877 -3935 -4909 -4998 -4856 -4988 -5226 -4949 -3595 -1273 1297 3254 4212
1376D212M11L78N28L13n64j689k403k319j659q86o14p30p10k01P78J633J983J760
$$ 4212 4623 5001 5529 5842 5278 3589 1186 -1133 -2792 -3678 -4292 -5022 -5732 -5933 -5155 -3522 -1539 221
1394B21J353J195J299J381R40r2j190j797j670j270j007j252j618j642r95J62
$$ 221 1574 2769 4068 5449 6389 6297 5107 3310 1640 370 -637 -1889 -3507 -5149 -6144 -5982
1410e982J096J417J139Q28R65J599K071J893J018j91j037j174r06p86j109j701
$$ -5982 -4886 -3469 -2330 -1502 -537 1062 3133 5026 6044 5853 4816 3642 2736 1950 841 -860
1426h60j999j633q13P6N06N58N18Q61J518K124K118J457N98k5k22k36m76j063
$$ -860 -2859 -4492 -5305 -5229 -4723 -4165 -3647 -2786 -1268 856 2974 4431 5029 5004 4782 4546 4070 3007
1444C007j793k156j830j070m21k17l07k70K76J165J996K232J804J028N03M47M76
$$ 3007 1214 -942 -2772 -3842 -4263 -4480 -4787 -5057 -4781 -3616 -1620 612 2416 3444 3947 4394 4870
1461D870K99l67j231j782j812j395r35q11q63q82m78L78J166J595J573J308J147
$$ 4870 5169 4802 3571 1789 -23 -1418 -2353 -3164 -4027 -4909 -5387 -5009 -3843 -2248 -675 633 1780
1478A780J169J177Q94K50n77j115j250j089j001j213j484j528j109l07N47J012
$$ 1780 2949 4126 5020 5270 4693 3578 2328 1239 238 -975 -2459 -3987 -5096 -5403 -4856 -3844
1494c844J088J036J124J440J679J529R29J42n57p96p62p97j045j482j743j560
$$ -3844 -2756 -1720 -596 844 2523 4052 4981 5123 4566 3770 3008 2211 1166 -316 -2059 -3619
1510c619j011l15J97M85O24Q99J308J663J687J327P45K93Q0p3l10p38j272j603
$$ -3619 -4630 -4945 -4748 -4263 -3639 -2740 -1432 231 1918 3245 3990 4283 4363 4290 3980 3242 1970 367
1528C67j603j245q91n93m96k66K46R05J467J694J465J034P46O62O41M76m7p41
$$ 367 -1236 -2481 -3372 -3965 -4461 -4727 -4481 -3576 -2109 -415 1050 2084 2830 3492 4133 4609 4562 3821
1546C821j320j513j410j138r83r47q34n41J25Q19J323J454J312J115R99R38P91
$$ 3821 2501 988 -422 -1560 -2543 -3490 -4324 -4865 -4740 -3921 -2598 -1144 168 1283 2282 3220 4011
1563D011M90j4n23r34j139j252j360j354j208q38l78J12M71P47R46J185J366J386
$$ 4011 4501 4487 3964 3030 1891 639 -721 -2075 -3283 -4121 -4499 -4387 -3916 -3169 -2223 -1038 328 1714
1581A714J173P71L45O3j44l31o95j116j479j606j351r04m06j04J42L56O72R93
$$ 1714 2887 3658 4003 4066 3922 3591 2896 1780 301 -1305 -2656 -3560 -3966 -4070 -3928 -3572 -2900 -1907
1599a907J269J390J252R89O66L24M9k41n50r26j176j400j387j222q17l77J6L44
$$ -1907 -638 752 2004 2993 3659 3983 4032 3791 3241 2315 1139 -261 -1648 -2870 -3687 -4064 -4048 -3704
1617c704N61P85R48J166J290J240R94N77K13j47m36p30j010j256j363j247r77
$$ -3704 -3143 -2358 -1410 -244 1046 2286 3280 3857 4070 3923 3487 2757 1747 491 -872 -2119 -3096
1634c096n92k45N6L42O61R35J112J206J110R84Q20N48K27j78o13j013j191j224
$$ -3096 -3688 -3933 -3877 -3535 -2874 -1939 -827 379 1489 2473 3293 3841 4068 3890 3277 2264 1073 -151
1652a51j100r31p78n68k90L4M37Q08J007J118J085J000R02P59M89J06k96p79j068
$$ -151 -1251 -2182 -2960 -3528 -3818 -3784 -3347 -2539 -1532 -414 671 1671 2573 3332 3821 3927 3631 2852 1784
1671A784j177j113r36q24p37n20k29J75O02Q90R91J028J045J058R79O80K17k70
$$ 1784 607 -506 -1442 -2266 -3003 -3523 -3752 -3577 -2975 -2085 -1094 -66 979 2037 3016 3696 3913 3643
1689C643o49q56q85r51j043j102r93o37j52K15M29N07N90Q87J230J372J170O67
$$ 3643 2994 2138 1253 302 -741 -1843 -2836 -3473 -3625 -3410 -2981 -2474 -1884 -997 233 1605 2775 3442
1707C442J07k03l14l44n36q96j242j276r93n32j91j13j40L7M67R78J343J304R53
$$ 3442 3549 3346 3032 2688 2152 1256 14 -1262 -2255 -2787 -2978 -3091 -3231 -3194 -2727 -1749 -406 898 1851
1726A851N74L85L62K37j08o14j062j186j012o80n49o34o88m77M6O78J094J121
$$ 1851 2425 2810 3172 3409 3301 2687 1625 439 -573 -1253 -1802 -2436 -3124 -3601 -3555 -2877 -1783 -662
1744f62R23P37P28Q42P79L42k67q20j000q50o09n77q04j041r70m56K07P16Q59
$$ -662 261 998 1726 2568 3347 3689 3422 2602 1602 752 143 -434 -1238 -2279 -3249 -3705 -3498 -2782 -1923
1763a923O76O02P30J001J156R31L01k75o01n51l75m05p20j100j208r38m10M6K35
$$ -1923 -1247 -645 85 1086 2242 3173 3474 3199 2598 2047 1672 1267 547 -553 -1761 -2699 -3109 -3063 -2828
1782b828K39L23O13J024J263J114O56K07oN5N7j69o83j150j271r77n11k38k88
$$ -2828 -2589 -2266 -1653 -629 634 1748 2404 2611 2605 2660 2717 2548 1865 715 -556 -1533 -2044 -2282 -2570
1801b570l73k19L01R87J384J282P71K85J50L41M97L33k81r22j224j072o49l96
$$ -2570 -2943 -3162 -2861 -1874 -490 792 1563 1848 1998 2339 2836 3169 2888 1966 742 -330 -979 -1375
1819a375m41o57o40k44M27R30J065Q23N22M49O41P92O63J70l93o65o25m61m95
$$ -1375 -1816 -2473 -3113 -3357 -2930 -2000 -935 -112 410 859 1500 2292 2955 3125 2732 2067 1442 981 486
1838D86p56j103j105o58J3N43O39M15K61M49Q87J205J105N20j34m44l61j47j63
$$ 486 -270 -1373 -2478 -3136 -3123 -2580 -1941 -1526 -1265 -816 71 1276 2381 2901 2767 2323 1962 1815 1652
1857A652n91j167j376j061l60K14L85K38R2K96P76J199J158O84J49p6M0K33R8
$$ 1652 1061 -106 -1482 -2543 -2903 -2689 -2304 -2066 -1974 -1678 -902 297 1455 2139 2288 2212 2252 2485 2583
1876B583m45j069j313j049m84p6j06l76m61o9O20J144J161P02K20J29M59P89P04
$$ 2583 2138 1069 -244 -1293 -1777 -1853 -1959 -2335 -2796 -2865 -2245 -1101 60 762 982 1111 1570 2359 3063
1895C063J16o83j154j064o22l15l74o77p91m68J35P08Q77O84M19M18O62R08Q09
$$ 3063 3179 2496 1342 278 -344 -659 -1033 -1710 -2501 -2969 -2834 -2126 -1249 -565 -146 272 934 1842 2651
1914B651L12k82o58o57m86m57o97r66r82n69N1N04N27K91J22L18Q00J179J101
$$ 2651 2963 2681 2023 1366 880 423 -274 -1240 -2222 -2791 -2740 -2236 -1709 -1418 -1296 -978 -178 1001 2102
1933B102N61p8m07l11m8m2m37j002j287j030l69J86K96%k61r7M63J070J248R21
$$ 2102 2663 2585 2178 1867 1819 1777 1340 338 -949 -1979 -2348 -2162 -1866 -1866 -2127 -2224 -1761 -691 557 1478
1953A478L68L1R5K99K88j49p79j169j076n99k00j28l56m93k63L27Q56J030P91
$$ 1478 1846 1877 1972 2271 2559 2410 1631 462 -614 -1213 -1413 -1541 -1897 -2390 -2653 -2326 -1470 -440 351
1972C51M29L27N03O84N02j1o75r87q49m65k44m03o97q08m46J60O53P57N03K46
$$ 351 780 1107 1610 2294 2796 2785 2110 1123 274 -191 -435 -838 -1535 -2343 -2789 -2629 -1976 -1219 -716 -470
1992d70L27P00J013R38L76k80o91o22l26j24l36p61j031q92l65J72L98L27J33
$$ -470 -143 557 1570 2508 2884 2604 1913 1291 965 841 505 -256 -1287 -2179 -2544 -2372 -1974 -1647 -1514
2011a514K08N33R64J075Q09K97j38k58k02j62l49o71q90q33n40k08j05j17r9J59
$$ -1514 -1306 -773 191 1266 2075 2372 2234 1976 1774 1612 1263 592 -298 -1131 -1671 -1879 -1984 -2101 -2200 -2041
2031b041N90R75R96O90L02J18K01L36K38k20p74j052q67m12o8j59m45o80m53J75
$$ -2041 -1451 -476 520 1210 1512 1630 1831 2167 2405 2185 1411 359 -508 -920 -988 -1147 -1592 -2272 -2725 -2550
2051b550Q50J114Q69M21J31K30N01O40L72j66o76q26o70l97l17m60o47n95k88
$$ -2550 -1700 -586 283 704 835 1065 1566 2206 2578 2412 1736 910 240 -157 -474 -934 -1581 -2176 -2464
2070b464J27M70N96N76N88O53O57N84K86k1k13k35j82k70n56q82r59o94k34J62
$$ -2464 -2337 -1867 -1271 -695 -107 546 1203 1787 2073 2052 1839 1604 1422 1152 596 -286 -1245 -1939 -2173 -2011
2090b011K75J13M8J93O24J015J035O78J10k83k61k2J34m2n08r40j066p35k83L1
$$ -2011 -1736 -1623 -1575 -1382 -758 257 1292 1970 2080 1797 1536 1514 1648 1606 1098 158 -908 -1643 -1926 -1895
2110a895O5j7OK63N93Q21P91N49L02K09K13J32n8l55o06o36n57m72n02n53m88
$$ -1895 -1830 -1847 -1841 -1578 -985 -164 627 1176 1478 1687 1900 2032 1974 1619 1013 377 -180 -652 -1154 -1707 -2195
2131b195j81K54O08O97N50L45L18M63O26N66K45j66m96n82m85l90m41n82o71n23
$$ -2195 -2376 -2122 -1514 -817 -267 78 396 859 1485 2051 2296 2130 1634 1052 567 177 -264 -846 -1517 -2040
2151b040j98J60M26M82M68M32M71N46N43M18K25K4j45k72l83n46o61o93n91l91
$$ -2040 -2238 -2078 -1652 -1170 -702 -270 201 747 1290 1708 1933 1957 1812 1540 1157 611 -50 -743 -1334 -1725
2171a725j52J4J10J74L23M58O04O81N75M22K13Q5K9n5k33m57o82p55o51m44k16
$$ -1725 -1877 -1863 -1753 -1579 -1256 -798 -194 487 1062 1484 1697 1782 1811 1756 1523 1066 384 -371 -1022 -1466 -1682
2192a682q3lQ0K34M08N65O10N57M37L65K78J76k7k66n13o26n92m90m31l85l17
$$ -1682 -1765 -1768 -1688 -1454 -1046 -481 129 686 1123 1488 1766 1942 1915 1649 1136 510 -82 -572 -1003 -1388 -1705
2213a705k03L8K84M55M94M62M07M57M80M72L00M9k35m27n30n17n19m74m34l41
$$ -1705 -1908 -1870 -1586 -1131 -637 -175 232 689 1169 1641 1941 1990 1755 1328 798 281 -238 -712 -1146 -1487
2233a487k21o6Q2K49L61M93N52N68M82L61K64J70K2j93l80n73o39n67m35k74k21
$$ -1487 -1708 -1774 -1692 -1443 -1082 -589 -37 531 1013 1374 1638 1808 1830 1637 1257 684 45 -522 -957 -1231 -1452
2254a452j52j03N3K63M41N66N80N30M37L72K09N4j39k93m17m74n14n26m80l72
$$ -1452 -1604 -1707 -1654 -1391 -950 -384 196 726 1163 1535 1744 1798 1659 1366 949 475 -39 -565 -1045 -1417
2274a417k13j0R7J70K36L21N09O46O68N03K36k6j60k12k22k92m62n90n95m50k60
$$ -1417 -1630 -1640 -1543 -1373 -1137 -816 -307 339 1007 1510 1746 1720 1560 1348 1126 834 372 -218 -813 -1263 -1523
2295a523n2K1O5J36K91N12O21O09M90L02J48L5o3k25l93m76n05m43l68l19l06
$$ -1523 -1575 -1554 -1489 -1353 -1062 -550 71 680 1170 1472 1620 1655 1592 1367 974 498 -7 -450 -818 -1137 -1443
2316a443k54r6J64M22N61N46M42L57L47L74L07J01j99m69n52m45l00k42l66m68
$$ -1443 -1697 -1793 -1629 -1207 -646 -100 342 699 1046 1420 1727 1828 1629 1160 608 163 -137 -379 -745 -1213
2336a213m58k44J33M47N54M75L25L17M15N02M19J46j83m01m09l10k62l44m92n69
$$ -1213 -1671 -1915 -1782 -1335 -781 -306 19 336 751 1253 1672 1818 1635 1234 825 515 253 -91 -583 -1152
2356a152m28j69R0K59K80L19L86N10N92M91K80L4o5q3r1k01m07n85o14m43k47
$$ -1152 -1580 -1749 -1659 -1400 -1120 -801 -415 95 687 1178 1458 1492 1427 1344 1253 1052 645 60 -554 -997 -1244
2377a244j03j00j13J2K88N66P29N85L25R3N3J65K38J34k23n60p04n52l13j48j70
$$ -1244 -1347 -1447 -1560 -1548 -1260 -694 35 620 945 1038 1091 1256 1494 1628 1405 845 141 -411 -724 -872 -1042
2398a042l14l05j02K92O16P01N20K51J21J84L04L09J16k19m68n20m20l49l24m00
$$ -1042 -1356 -1661 -1763 -1471 -855 -154 366 617 738 922 1226 1535 1651 1432 964 444 24 -325 -649 -1049
2418a049l93k16P8L09L98L35K66L39M74N36L89R5j93k82j80m0j26m22p47p66m58
$$ -1049 -1442 -1658 -1580 -1271 -873 -538 -272 67 541 1077 1466 1561 1368 1086 906 866 740 318 -429 -1195 -1653
2439a653RL48L29J08p5N0M27P30P32M25j6k30j54M5Q2j23m97p51o77l77o5P8M7
$$ -1653 -1644 -1296 -967 -859 -934 -884 -457 273 1005 1430 1414 1184 1030 1075 1157 1034 537 -214 -891 -1268 -1333 -1255 -1208
2462a208j5O7K85M87N27L96K58J68K31K30R8j63m83n60m88k66j74k33l43l36q3
$$ -1208 -1223 -1156 -871 -384 143 539 797 965 1196 1426 1524 1361 878 318 -170 -436 -610 -843 -1186 -1522 -1605
2483a605K95N56N23L13R0R7L01N24M96J61l05n83n34k73j18j55l96n33m19m3L17
$$ -1605 -1310 -754 -231 82 172 269 570 1094 1590 1751 1446 863 329 56 -62 -217 -613 -1146 -1565 -1608 -1291
2504a291M61L37J15P1L03N48O13L70jk61k92j63j37k63n05o24m46j54J40J67M2
$$ -1291 -830 -493 -378 -307 -4 544 1157 1527 1526 1265 973 810 673 410 -95 -719 -1165 -1319 -1179 -1012 -970
2525i70p1O9L93O39O41L76N2j02PJ45Q4k25n80p18n26j61R2O4j61k79j45K30N81
$$ -970 -1041 -972 -579 60 701 1077 1129 1027 1034 1179 1263 1038 458 -260 -786 -947 -855 -791 -952 -1231 -1376 -1146 -565
2548e65O64M56J49J9J19K86K85M4l47n91n47l21j12r1k25l46k83k5K86M60L79
$$ -565 99 555 704 723 842 1128 1413 1457 1110 519 -28 -349 -461 -552 -777 -1123 -1406 -1431 -1145 -685 -306
2569c06K75K19L18M38L99J54j54l59l62k15j41k46m12n23l85p6K01K86J75O8J15
$$ -306 -31 188 506 944 1343 1497 1343 984 622 407 266 20 -392 -915 -1300 -1376 -1175 -889 -714 -646 -531
2590e31L74N96O24L15o3k98k62r0J2j12l73n98n25k31L9J57P4p0nK50N17O27M45
$$ -531 -157 439 1063 1378 1315 1017 755 665 677 565 192 -406 -931 -1162 -1123 -966 -892 -962 -967 -717 -200 427 872
2613H72J59l2k6M3R9n8l32n07m73l03j28j01k07k78j35J41M62N82M40K30J02J62
$$ 872 1031 999 973 1016 1115 1057 725 218 -255 -558 -686 -787 -994 -1272 -1407 -1266 -804 -222 218 448 550 712
2635G12K82K97R4k41m58m63k86j16j25k87m38l50m7K97M95M21K33R8J91L51M06
$$ 712 994 1291 1385 1144 686 223 -63 -179 -304 -591 -1029 -1379 -1426 -1129 -634 -213 20 118 309 660 1066
2656A066K41n9l27l50j93q9j19l34m86m53j90P1K35K35J06J41K79M53M93L12O1
$$ 1066 1307 1248 921 571 378 289 170 -164 -650 -1103 -1293 -1222 -987 -752 -646 -505 -226 227 720 1032 1093
2677A093q9p5QJ3j33l87n46n25k95q7Rl7r4K4K76M86N55M01J63K0M2J36J70j2
$$ 1093 1004 929 937 950 817 430 -116 -641 -936 -1023 -1014 -1051 -1145 -1121 -845 -359 196 597 760 780 822 958 1128 1116
2701A116k54m77m92l57j97j03j48j64p9J13L40M28L87K35J40J45K03K08J01p9
$$ 1116 862 385 -107 -464 -661 -764 -912 -1076 -1155 -1042 -702 -274 113 348 488 633 836 1044 1145 1066
2721A066k92l39k96k40k36l10l31k39m6J65L05K88K11J55K58L67M03K79R2j18
$$ 1066 774 435 139 -101 -337 -647 -978 -1217 -1263 -1098 -793 -505 -294 -139 119 486 889 1168 1260 1142
2741A142k09j96j83k27l67m78m18k43nJ38J86J49J24K36L52M22L70J95K7m9n1
$$ 1142 933 737 554 327 -40 -518 -936 -1179 -1184 -1046 -860 -711 -587 -351 1 423 793 988 1015 966 915
2762I15n8j60l23m48m45k97j15J2K5J4L4J50K94L81L54K57J52J13J17R7qk05l40
$$ 915 857 697 374 -74 -519 -816 -931 -919 -894 -880 -846 -696 -402 -21 333 590 742 855 972 1069 1061 856 516
2785E16m06l61k56j81j91j47p7N5J89K72K77K61K66K92L44K70J14p2k39l01k72
$$ 516 110 -251 -507 -688 -879 -1026 -1103 -1048 -859 -587 -310 -49 217 509 853 1123 1237 1165 926 625 353
2806C53k58k80l04l15k27o8Q5J94K12J94K19K72L19L16K68J02m6j75k25k47k62
$$ 353 95 -185 -489 -804 -1031 -1099 -1014 -820 -608 -414 -195 77 396 712 980 1082 1036 861 636 389 127
2827A27k78k61k29j85j10l7O2J45K00K52K94K79K91K46J82J11k6j37k48k98l03
$$ 127 -151 -412 -641 -826 -936 -973 -911 -766 -566 -314 -20 259 550 796 978 1089 1063 926 678 380 77
2848G7k97k38k19j70j35n2J9J51K56L29L62L29K61J96J16M3l4j57k57l35l31k75
$$ 77 -220 -458 -677 -847 -982 -1034 -1015 -864 -608 -279 83 412 673 869 985 1028 994 837 580 245 -86 -361
2870c61k04j52j05q0l7O6J87K91L63L44K58J88J07L1j1q1j56k35l04l20k56j72
$$ -361 -565 -717 -822 -902 -939 -873 -686 -395 -32 312 570 758 865 896 885 804 648 413 109 -211 -467 -639
2892f39j21p1o4k7Q6K15L29L78L59K27J41P1M1np4k10k85l18k83k30k06j67j28
$$ -639 -760 -831 -895 -922 -836 -621 -292 86 445 672 813 884 925 920 846 636 351 33 -250 -480 -686 -853 -981
2915i81m2P6K21K95L03K98K53K49K05J08l4j55k20j86j85j88k54l11k98j59J3
$$ -981 -1023 -947 -726 -431 -128 170 423 672 877 985 951 796 576 390 205 17 -237 -548 -846 -1005 -992
2936i92J45K08J84J93K22K90L13K63J20l6j21j43j10j35k09k89l27l01j69n7L6
$$ -992 -847 -639 -455 -262 -40 250 563 826 946 910 789 646 536 401 192 -97 -424 -725 -894 -951 -915
2957i15Q0J47J95K94L22K97K24J25M7L5J3o7j89l05l21l01k09j44j34j26o4Q0
$$ -915 -835 -688 -493 -199 123 420 644 769 816 851 864 797 608 303 -18 -319 -528 -672 -806 -932 -996 -916
2979i16K65M03L62K36Q1O8J38J87J56l3k48l58l36j98j28j36k24k44j30P7L02
$$ -916 -651 -248 114 350 431 499 637 824 980 947 699 341 5 -193 -321 -457 -681 -925 -1055 -978 -676
3000f76L57K74J57R8J74K50K45R7p3k15k05j73j80k44l21l13j99j9J39J78J33
$$ -676 -319 -45 112 210 384 634 879 976 903 688 483 310 130 -114 -435 -748 -947 -966 -827 -649 -516
3021e16J16J62K81L56L00J36j3p4m9k1n6k22l89m22l18j12M8R5M7j8M9K10L57
$$ -516 -400 -238 43 399 699 835 822 748 699 678 622 400 11 -411 -729 -841 -793 -698 -651 -669 -620 -410 -53
3044e3L78K64R9lQP0N9o0k85l95l72k47r7l8q2n8l1J48K76L22K39J32J02J88K28
$$ -53 325 589 688 685 693 763 822 762 477 82 -290 -537 -634 -672 -754 -812 -843 -695 -419 -97 142 274 376 564 792
3069G92J80j9k20l57k87j63q8j45k48k89j45J05K87L05J59L3N3K07L56L63J65
$$ 792 972 953 733 376 89 -74 -162 -307 -555 -844 -989 -884 -597 -292 -133 -100 -47 160 516 879 1044
3090A044r9k89k70j29o7j25k56l56k77q8J22J91J25M5M7K02L49L45K50N9n4o1
$$ 1044 945 656 386 257 190 65 -191 -547 -824 -912 -790 -599 -474 -429 -382 -180 169 514 764 823 769 708
3112G08n3n4j82l23l69k73j00K7K8n9r4J8K02L68L91K39P6j7N8J34J06n2k82m04
$$ 708 655 601 419 96 -273 -546 -646 -619 -591 -650 -744 -726 -524 -156 235 474 550 533 591 725 831 779 497 93
3136I3l45j60rJ5q7j79j57L3K60L49K81J60P2J09J95J82P8j45k92k65j82r2r9
$$ 93 -252 -412 -421 -406 -493 -672 -829 -796 -536 -187 94 254 326 435 630 812 890 745 453 188 6 -86 -185
3159a85k03k51j99j7J41K25J64Q8J24K17L42L16J43p6k15j99q3j6r1k38l49l05
$$ -185 -388 -639 -838 -855 -714 -489 -325 -237 -113 104 446 762 905 829 614 415 332 316 225 -13 -362 -667
3181f67j19R0J35R5MJ6J65L40L74K56K9j09j21k0M4m2k07l17l18j48j8M7l2j07
$$ -667 -786 -696 -561 -466 -462 -446 -281 59 433 689 718 609 488 468 512 470 263 -54 -372 -520 -538 -491 -523 -630
3205f30p0J17L15L87K47J02l0J0J21J29L7j68l10k94j66l5o5j43k27j64J8K44
$$ -630 -700 -583 -268 119 366 468 438 448 569 698 735 567 257 -37 -203 -238 -303 -446 -673 -837 -819 -575
3227e75L18K58J14O7J07K00K09Q6j18k19j98j13m5r3k02k98k23m5J32K25J57P3
$$ -575 -257 1 115 182 289 489 698 784 666 447 249 136 91 -2 -204 -502 -725 -770 -638 -413 -256 -183
3249a83M2J39K48K56J46k8j09j50m6%l9j78k95k81j54LR5P8K0L3J23K39K89K00
$$ -183 -141 -2 246 502 648 620 511 361 315 315 276 98 -197 -478 -632 -629 -534 -456 -436 -403 -280 -41 248 448
3273D48P1k7j8L1O6k8j65k88k78j85p7j8m5q5m3R0K27L05K11Q8QL0J10J50Q2q4
$$ 448 519 492 474 505 571 543 378 90 -188 -373 -450 -468 -513 -598 -641 -551 -324 -19 192 280 288 318 428 578 660 576
3299E76k23k72j87q8l7r3j60j15k1J44K19K07J11L0M7J40J77J40jj06j44j44p5
$$ 576 353 81 -106 -194 -231 -324 -484 -599 -620 -476 -257 -50 61 91 138 278 455 595 594 488 344 200 125
3322A25j06j62k15j89q2Q0J39J16M2K9J01K10K42J86N5n2o1l4k2n4k01k76k54
$$ 125 19 -143 -358 -547 -629 -549 -410 -294 -252 -223 -122 88 330 516 571 519 458 424 402 348 147 -129 -383
3345c83j35RO0L3mrP0J95K52J92R4K2ON2P4j7j48k23k47j69m9kk9o7n8K3J24J76
$$ -383 -518 -509 -449 -416 -420 -429 -359 -164 88 280 374 396 402 454 528 511 363 140 -107 -276 -325 -327 -356 -423 -481 -458 -334 -158
3373a58J94R5Q3Q4J01J06N2m2j49j78j71j09j13j03j02q2k4N4Q6J13R8J13J46
$$ -158 36 131 214 298 399 505 557 515 366 188 17 -92 -205 -308 -410 -492 -516 -462 -376 -263 -165 -52 94
3396I4J69J77J25J0n7j27j22q7j21j43j51j68q7MM5P0P2L4R4J65J94J83J14K0
$$ 94 263 440 565 575 518 391 269 182 61 -82 -233 -401 -488 -484 -439 -369 -297 -263 -169 -4 190 373 487 507
3420E07m4p4p6p0j08j56j48j24p1l3k0%J3Q1J30J60J57J35R0P2K9L3n2j12j51
$$ 507 463 389 313 243 135 -21 -169 -293 -364 -397 -417 -417 -404 -323 -193 -33 124 259 349 421 450 483 431 319 168
3445A68j52j14q6p8p9j06o0J0P8J44J78J42J36J03J07P9L3k2q3j29j41j25j15
$$ 168 16 -98 -184 -262 -341 -447 -507 -497 -419 -275 -97 45 181 284 391 470 503 481 398 269 128 3 -112
3468a12r1j02q3p7l2K9J16J46J63J48J20Q4O8N2Ll2p7j29j10j13j18j01o6p7n5
$$ -112 -203 -305 -388 -465 -497 -468 -352 -206 -43 105 225 309 377 429 432 400 323 194 84 -29 -147 -248 -314 -391 -446
3493d46rN2J19J56J57J31J07P4L7L0J4j9r7j08j36j37j17r7j01n7l1K4P7J25J62
$$ -446 -455 -403 -284 -128 29 160 267 341 378 408 422 403 306 198 62 -75 -192 -289 -390 -447 -478 -454 -377 -252 -90
3518i0J58J41J13O5J5Qk2m0n3q2j48j89j65j16l3LM1L1M9Q4J47J81J77R1Nl1k6
$$ -90 68 209 322 387 402 410 388 348 295 213 65 -124 -289 -405 -438 -435 -394 -363 -314 -230 -83 98 275 366 371 340 314
3545C14jJ4l7j10j90j74j29o3k0nL1N1Q2J23J37J17Q8P3O8O4lo5q0j44j01r9r7
$$ 314 313 327 290 180 -10 -184 -313 -376 -396 -401 -370 -319 -237 -114 23 140 228 301 369 433 430 365 285 141 40 -59 -156
3572a56j24j41j10NJ06J70J64Q0L0M4J14J54J53M9o8j61j58q4n5n1j18j64j44
$$ -156 -280 -421 -531 -526 -420 -250 -86 -6 24 68 182 336 489 538 470 309 151 67 12 -39 -157 -321 -465
3595d65m0Q0J30J35Q4N9L6J05J20J11N8k4m2n6q2j26j47j39j01l4QJ2k4oO2J44
$$ -465 -505 -425 -295 -160 -76 -17 19 124 244 355 413 389 347 291 209 83 -64 -203 -304 -338 -330 -318 -342 -348 -286 -142
3621a42J94J55N7qJ0L6R9P1o7j91k64k02p7L7K6l7p1p7M9J72K01J65O0K7M1Q3
$$ -142 52 207 264 256 266 302 401 472 405 214 -50 -252 -329 -292 -266 -303 -374 -451 -402 -230 -29 136 196 223 264 347
3647C47P9L9q1j51j76j28o6n6q2p3l7L6P7R8N9M3M3J30J77J44K1p7j29r3j3Lq0
$$ 347 426 465 384 233 57 -71 -137 -193 -275 -348 -385 -349 -272 -174 -115 -72 -29 101 278 422 443 366 237 144 131 134 54
3674E4j75j75j32J6R6R9M5m5j0R7K01K24J31J6p1q6l5mm8j21j85j55q2QK9J4j4
$$ 54 -121 -296 -428 -412 -316 -217 -172 -217 -227 -130 71 295 426 442 371 285 250 246 198 77 -108 -263 -345 -337 -308 -294 -308
3701c08k0P4J63J76J33N2K8J1L3L0m9j31j60j46l2nj3p1j10p4M8J35J75J23M1
$$ -308 -328 -254 -91 85 218 270 298 309 342 372 323 192 32 -114 -146 -151 -164 -235 -345 -419 -371 -236 -61 62 103
3726A03%N2J18J22N5r9j71j56o6J1J4q2j70j44m8Q5J51J27N9PP0J52J63R5l0j18
$$ 103 103 155 273 395 450 351 180 24 -42 -31 -17 -99 -269 -413 -461 -376 -225 -98 -39 -32 38 190 353 448 418 300
3752C00j08o3j0k6r5j74j45n9L2O4K4RPJ10J88J95R8j9q0m9L6N4jj35j91j53o8
$$ 300 192 129 119 93 -2 -176 -321 -380 -348 -284 -260 -251 -244 -134 54 249 347 328 248 199 235 289 288 153 -38 -191 -259
3779b59L2L6l7q2o0N2J88K14J45K2n2k5P4Q8M0p0j60j72q2l3ro6j20q7J3J21J68
$$ -259 -227 -191 -228 -310 -370 -318 -130 84 229 251 199 174 248 336 376 306 146 -26 -108 -141 -150 -216 -336 -423 -410 -289 -121
3806a21J33N4M1L8R6J01M8l5j27q8o0k8l9j22j64j37pQ8J14R3K2RO2J32J58R4
$$ -121 12 66 107 145 241 342 390 355 228 140 80 52 13 -109 -273 -410 -417 -329 -215 -122 -100 -91 -29 103 261 355
3832C55j0q0o6k2K3j1j00j90j70r1L2O9M5KlM2J18J79J25L4k5k2J3N1Rq3j65j78
$$ 355 345 265 199 177 200 189 89 -101 -271 -362 -330 -261 -216 -214 -217 -175 -57 122 247 281 256 234 247 298 307 224 59 -119
3860a19j08k8J2j8m9l1L4J30J61J31M0j3K4P7J01N4m7j38j78r7l3j4o2j04r7k
$$ -119 -227 -255 -243 -261 -310 -341 -307 -177 -16 115 155 142 166 243 344 398 351 213 35 -62 -95 -109 -171 -275 -372 -374
3886c74R3J49J08L5lL2R4J43Q8J4p7j24q0m6k4j01j40j15l8N1Q3O3K6pO5J11J56
$$ -374 -281 -132 -24 11 8 40 134 277 365 379 302 178 98 52 28 -73 -213 -328 -366 -315 -232 -169 -143 -150 -85 26 182
3913A82J15L2l5m0j7kl3j19j58j46o5PL6K8k0k0L2J05J46J38O5LOK3M1J5q3j44
$$ 182 297 329 294 254 237 235 202 83 -75 -221 -286 -279 -243 -215 -235 -255 -223 -118 28 166 231 234 240 263 304 319 236 92
3941I2j47r8k0j9j3n1o9jQ9J30J11O1L6M7Q7R5N1m4j03j40r8m4k8m5q3r4n1L7
$$ 92 -55 -153 -173 -192 -205 -256 -325 -326 -237 -107 4 65 101 148 235 330 381 337 234 94 -4 -48 -76 -121 -204 -298 -349 -312
3969c12P8J00N7M0O1R6J20Q8L3l7r3o0o9m4n8r9j02o0l2K8J8J4L0O7J18J34J13
$$ -312 -234 -134 -77 -37 24 120 240 328 361 324 231 171 102 58 0 -99 -201 -261 -293 -265 -247 -233 -203 -136 -18 116 229
3996B29N2mj0k7%k2p7j37j13q2l2j2j1m1j0J4R1J42J38R2N2K1J5J2Rm0o4j18q6
$$ 229 281 277 267 240 240 218 141 4 -109 -191 -223 -235 -246 -287 -297 -283 -192 -50 88 180 232 253 268 280 289 249 185 67 -19
4025a9p8n4m9n7n9NL4Q0R9Q8P0P3P8N7L2%o5n3o4m8n3q6q9j04n8K0K6N1N8O9P3
$$ -19 -97 -151 -200 -257 -316 -311 -277 -197 -98 -10 60 133 211 268 300 300 235 182 118 70 17 -69 -158 -262 -320 -300 -274 -223 -165 -96 -23
4056b3R5Q7R1M2Mm2k8l6n4o3q7j25r5o5k3K0L7N2O9R7O8J06O8N5L9lk4k5o9n6
$$ -23 72 159 250 292 296 254 226 190 136 73 -14 -139 -234 -299 -322 -302 -265 -213 -144 -47 21 127 195 250 289 286 262 237 168 112
4086A12q2q8r0q4o7k9PN6P8Q9O5O9P8M9P0N1Pj5o0o6q0p4p9o8j04m7k6J8P5R5
$$ 112 30 -58 -148 -232 -299 -328 -321 -265 -187 -98 -33 36 114 163 233 284 291 276 216 150 70 -4 -83 -151 -255 -302 -328 -310 -235 -140
4116a40R6Q0O9M0N4O0N3K1k8o7j13j17j00o2n6l6m8k2LP7R5J09R2O4L0M0M6Q0
$$ -140 -44 36 105 145 199 259 312 333 305 238 125 8 -92 -154 -210 -246 -294 -316 -313 -236 -141 -32 60 124 154 194 240 320
4144C20J4l1r2j16j24r0n3l6m3l2kK6N3O9R3Q8Q9Q4M4K4Qpm1n2r4j09j30j19n1
$$ 320 334 303 211 95 -29 -119 -172 -208 -251 -283 -285 -259 -206 -137 -44 44 133 217 261 285 293 286 245 193 99 -10 -140 -259 -310
4173c10J3M0L4K9oL5J04J48J29R1Nj9l6j4k4m6j14j40j24q5j6RL9K4%M9R6R4J05
$$ -310 -297 -257 -223 -194 -200 -165 -61 87 216 307 312 293 257 243 219 173 59 -81 -205 -290 -306 -297 -258 -234 -234 -185 -89 5 110
4202A10R4O9M5Qrm3r4j15q4n9n8o0q4n0kN2J03R8P9L7N0Q5J24R0J0q4j21j18p1
$$ 110 204 273 318 326 317 274 180 65 -19 -78 -136 -196 -280 -330 -332 -280 -177 -79 0 37 87 172 296 386 396 312 191 73 2
4231Bl6m1p7j06q1j0M3Q0R4N7N7Q0J12R4P4J1l3o2o8p5q3r8j03o6m2ljJK1O0J19
$$ 2 -34 -75 -152 -258 -339 -349 -306 -226 -132 -75 -18 62 174 268 342 353 320 258 190 115 32 -66 -169 -235 -277 -280 -281 -280 -259 -199 -80
4262h0J24J38Q7K6j9MJ2j7m1j14j51j16o1j8lk8m2k5M5J21J48J44P9K1RL0L3J4
$$ -80 44 182 269 295 276 280 292 275 234 120 -31 -147 -208 -226 -229 -257 -299 -324 -279 -158 -10 134 213 234 243 273 306 320
4290C20n5j05j25j08o5l3n3p0o1PP7J26J19Q0N0Q1Q0P3K1l8q7j01n8l3n2j12j23
$$ 320 265 160 35 -73 -138 -171 -224 -294 -355 -348 -271 -145 -26 54 104 185 265 338 359 321 234 133 75 42 -10 -122 -245
4317b45r5l2N4P3Q0M1K8J00J26J32Q3rn8p0k8jk2j11j52j34p7PK9J7J2J9Q3J32
$$ -245 -340 -372 -318 -245 -165 -124 -96 4 130 262 345 336 278 208 180 179 157 46 -106 -240 -317 -310 -281 -264 -252 -233 -150 -18
4345a8J45R8M6nj%K0j3p8j41j29r5m3l0m5l8j0O2J21J37J17N7J5K8P1N6L2o0j27
$$ -18 127 225 271 266 265 265 285 272 194 53 -76 -171 -214 -244 -289 -327 -337 -275 -154 -17 100 157 172 200 271 327 359 299 172
4374A72j25r2m1m5p7r5p8JQ5J21J25O4L6M5Q5J04O1No5r2o7n9m2r5j26j03o5L2
$$ 172 47 -45 -86 -131 -208 -303 -381 -380 -295 -174 -49 15 51 96 181 285 346 351 286 194 127 68 26 -69 -195 -298 -363 -331
4402c31O6P6L5N3N6J18J24Q2L8l6k8orn9j10j57j42p5%L2J3oJ4O1J18J51J10N3
$$ -331 -265 -189 -154 -101 -45 73 197 279 317 281 253 247 238 179 69 -88 -230 -305 -305 -273 -260 -266 -252 -191 -73 78 188 241
4430B41jKL4M0Kp6j51j53j01l9k7j1m1l7J9P9J36J05P0M7L8P8P5K6k9p6j19r9
$$ 241 240 242 276 316 318 242 91 -62 -163 -202 -229 -240 -281 -318 -299 -220 -84 21 91 138 176 254 329 355 326 250 131 32
4458C2o6o8o0j05n8k1N7Q3P2O0L7O1J07J26Q9K3n4r5n8o2n7q2j24j09n7NM9L9
$$ 32 -34 -102 -162 -267 -325 -346 -289 -206 -134 -74 -37 24 131 257 346 369 315 220 162 100 43 -39 -163 -272 -329 -324 -275 -236
4486b36L2N0N3J09J35J12N9jj8j6l0n4r0j36j16q4k7J2j2k8j3L3J08J41J20P9
$$ -236 -204 -154 -101 8 143 255 314 313 295 279 249 195 105 -31 -147 -231 -258 -246 -258 -286 -299 -266 -158 -17 103 182
4512A82K6K5M6L5Rm4j22j40j09o3j9k9o7m7k0M8J03J28J01N9N8P8O7L5j3n7j13
$$ 182 208 233 279 314 323 279 157 17 -92 -155 -174 -203 -270 -317 -337 -289 -186 -58 43 102 160 238 305 340 327 270 157
4539A57q7p1o7o1r6q5j7QN2R0M5O1P4J14J15Q5L1l4p2m9m7l5o2j15j28r2l4K2
$$ 157 70 -1 -68 -129 -225 -310 -327 -319 -267 -177 -132 -71 3 117 232 317 348 314 242 193 146 111 49 -66 -194 -286 -320 -298
4567b98L3K5K2M8J05J29J09R8L0j0kl2k1o0j02j16q8o6n3l9k7pN6R3J20J07Q8
$$ -298 -265 -240 -218 -170 -65 64 173 271 301 291 289 257 236 176 74 -42 -130 -196 -249 -288 -315 -322 -266 -173 -53 54 142
4594A42N3M2N3L5Ro6r1j06r1n9o0o9q4o0j2M2J05J06J07O4N7O9P2O4K0m1p2o8
$$ 142 195 237 290 325 334 268 177 71 -20 -79 -139 -208 -292 -352 -364 -322 -217 -111 -4 60 117 186 258 322 342 301 229 161
4622A61q8o2o2r6r2o6m5K5N5O6R8Q3J06P2P2N6K8nl2m0n8r0j13j19r1m2j8rJ8
$$ 161 73 11 -51 -147 -239 -305 -350 -325 -270 -204 -106 -23 83 155 227 283 311 306 274 234 176 86 -27 -146 -237 -279 -297 -306 -288
4651b88K7O0J17J19J12Q0K0L3pJ1pm2q5j32j12j08m0n5Oj4K6M6Q2J10R9Q7O7M5
$$ -288 -261 -201 -84 35 147 227 247 280 273 284 277 235 150 18 -94 -202 -242 -297 -291 -305 -279 -233 -151 -41 58 145 212 257
4679B57L2J3pk8o7q4j09r0j13p2n2LJ6N6N3P0P8R1J04Q6N6J5pm1n7m8r8q9j24
$$ 257 289 302 295 267 200 116 7 -83 -196 -268 -320 -317 -301 -245 -192 -122 -44 47 151 237 293 308 301 260 203 155 57 -32 -156
4708a56q0o9k3K2L6M9N7Q8Q2J03P5Q5L9J7k1l5p8q5q9r5q4r0n0k0RM0O7Q2O5Q4
$$ -156 -236 -305 -328 -306 -270 -221 -164 -76 6 109 184 269 308 325 304 269 191 106 17 -78 -162 -252 -302 -322 -313 -273 -206 -124 -59 25
4738B5Q9P8Q9M7Pk5o7q3q6j00q9p8p2m4pJ2M2O8Q8Q4R7Q8O9O1K8Jk6o4r4j20r6
$$ 25 114 192 281 328 335 310 243 160 74 -26 -115 -193 -265 -309 -316 -304 -262 -194 -106 -22 75 163 232 293 321 322 296 232 138 18 -78
4769g8q3m7n1k4pj0M4P7J05J06J01O8N8L8K7jl9p6j03j27r2p3m0m7l6j3K2O1Q6
$$ -78 -161 -208 -259 -283 -290 -300 -256 -179 -74 32 133 201 259 297 324 323 284 208 105 -22 -114 -187 -227 -274 -310 -323 -301 -240 -154
4798a54J06J12Q3P5O9L8Lk7n4q9r4r0r6q0p8m4j4J8N8O8P3R3J04J12Q6N2Rk5m5
$$ -154 -48 64 147 222 291 329 332 305 251 162 68 -22 -118 -198 -276 -320 -334 -316 -258 -190 -117 -24 80 192 278 330 339 314 269
4827B69p2o1q3j00j09q7n9j9qL5M6N8R5J19J10J07M8K9j0j0k6n5j07r8j15r4n7
$$ 269 197 136 53 -47 -156 -243 -302 -321 -329 -294 -248 -190 -95 24 134 241 289 318 308 298 272 217 110 12 -103 -197 -254
4854b54l5k8k0K4N6J01J20J28R0M7O1L9J3k1m9j09j07j01o9o3p0p8l8QP2J11J05
$$ -254 -289 -317 -337 -313 -257 -156 -36 92 182 229 290 329 342 321 272 163 56 -45 -114 -177 -247 -325 -363 -355 -283 -172 -67
4881f7Q6R0O2Q2Q1L5l4n9q1q5o8q4j03j03q3l5J5O3P0N3R3Q9J18R6Q7K4k0m2l2
$$ -67 19 109 171 253 334 369 335 276 195 110 42 -42 -145 -248 -331 -366 -351 -288 -218 -165 -72 17 135 231 318 342 322 280 248
4910B48m0q0j06j30j06p5m6QQL5M4R0J21J39R7O5K0K4K%m5q5j30j17j14q7l1l8
$$ 248 208 128 22 -108 -214 -289 -335 -327 -319 -284 -240 -150 -29 110 207 272 292 316 318 318 273 188 58 -59 -173 -260 -291 -329
4938c29j8%O0Q5J33J15Q8O8M8N1N3kl2j06j05j30q0p8p1o4o7LN5J08J06J01N1
$$ -329 -347 -347 -287 -202 -69 46 134 202 250 301 354 352 320 214 109 -21 -101 -179 -250 -314 -381 -378 -323 -215 -109 -8 43
4965D3R0Q7Q9O0Om2r0r1o6q6j01j18r7m6NM8O8N7N6Q7J18J18R3M8Jj8k6m1q0j05
$$ 43 133 220 309 369 375 333 243 152 86 0 -101 -219 -316 -362 -357 -309 -241 -184 -128 -41 77 195 288 336 337 319 293 252 172 67
4995F7j43j21p6m3j2J4J0L3O9J22J28J18R0L0L3RJ7j5r4j35j36j10p8l9m0k7p
$$ 67 -76 -197 -273 -316 -328 -314 -304 -271 -202 -80 48 166 256 286 319 328 345 330 236 101 -35 -145 -223 -262 -302 -329 -336
5022c36J2Q0J07J22J01P9O6O4N4K3k9q1j18j10q9q2q3q4m5k0L7P1J05O3Q6P7J10
$$ -336 -324 -244 -137 -15 86 165 231 295 349 372 343 262 144 34 -55 -137 -220 -304 -349 -369 -332 -261 -156 -93 -7 70 180
5049A80J17O1K2m4o8o0p0r5r1j28j11n4KJ3M6M7O8O6J14J34J31N2J6j8l0l1p0
$$ 180 297 358 380 336 268 208 138 43 -48 -176 -287 -341 -339 -326 -280 -233 -165 -99 15 149 280 332 348 330 300 269 199
5076A99j00j18j27q4n4l3%NJ2O4J05J21J18R9O3M6K0Ok0o0j14j14j16p7n7n0n0
$$ 199 99 -19 -146 -230 -284 -317 -317 -312 -300 -236 -131 -10 108 207 270 316 336 342 322 262 148 34 -82 -159 -216 -266 -316
5103c16l5J7O3J00J19J00Q2O9O6O6M4Kq9j03j10q7n4q2p6r4m1MM8Q7J02Q3Q4R6
$$ -316 -351 -334 -271 -171 -52 48 130 199 265 331 375 377 288 185 75 -12 -66 -148 -224 -318 -359 -355 -307 -220 -118 -35 49 145
5131A45R3R4L6j7m9p6o8q4q5j02j04q9j9lJ7M0O8R8J12J26R8O8K3lnl0m3q4j18
$$ 145 238 332 368 351 302 226 158 74 -11 -113 -217 -306 -325 -328 -311 -271 -203 -105 7 133 231 299 322 319 314 284 241 157 39
5160C9j13j16o7l5j0k7%N2R8J22J22R6Q0M4J5K5pm3p4j13j14p8q4p3n5l0QL6Q9
$$ 39 -74 -190 -257 -292 -302 -329 -329 -277 -179 -57 65 161 241 285 300 325 318 275 201 88 -26 -104 -188 -261 -316 -346 -338 -302 -213
5189b13J03R9J04Q2Q2N8K2Kl7p8q3p1r8q0j02r4m3oL8N9R1Q7Q7Q5J05Q0M1J5l3
$$ -213 -110 -11 93 175 257 315 337 339 302 224 141 70 -28 -108 -210 -304 -347 -353 -315 -256 -165 -78 9 94 199 279 320 335 302
5218C02m0n4p6r5j06j12q8n7j6RL5N1Q7R8J09J04R7M0K1Npl3p5j05j19j05q4m7
$$ 302 262 208 132 37 -69 -181 -269 -326 -342 -333 -298 -247 -160 -62 47 151 248 288 309 314 307 274 199 94 -25 -130 -214 -261
5246b61m1k5J6L6P4R8J07R9P8O5N1K2Kj7o4r4j12r7q2p9o4m5qL3O1Q2J00Q6Q6
$$ -261 -302 -327 -311 -275 -201 -103 4 103 181 246 297 319 321 304 240 146 34 -63 -145 -224 -288 -333 -341 -308 -247 -165 -65 21 107
5275A07Q3Q0N3J3j0n6o9q7j00r3j01p5m9k8K0M5N5Q1R4R1R4Q4O6L1J6l5n3q5r5
$$ 107 190 270 323 336 326 270 201 114 14 -79 -180 -255 -304 -332 -312 -267 -212 -131 -37 54 148 232 298 329 345 310 257 172 77
5304G7r8j09p3p3l6mJ2L6P9R1Q5J03Q5P7N6J9ml0o4r2j21r0r6o4m2k8qJ6N8P2
$$ 77 -21 -130 -203 -276 -312 -316 -304 -268 -189 -98 -13 90 175 252 308 327 323 293 229 137 16 -74 -170 -234 -276 -304 -312 -296 -238 -166
5334a66J06Q6J13P9O7L6%j0m5p7r3j10r0q3o7m2k9J6L0O7P7R9J07J06O4O5J7m
$$ -166 -60 26 139 218 285 321 321 311 266 189 96 -14 -104 -187 -254 -296 -325 -309 -279 -212 -135 -36 71 177 241 306 323 319
5362C19k1n9q8j11j03q6o7n9l6pK0M9O8J00R6J15P3O3N3J8k3m1o9j06q3j16p4
$$ 319 298 239 151 40 -63 -149 -216 -275 -311 -318 -298 -249 -181 -81 15 130 203 266 319 337 314 273 204 98 15 -101 -175
5389a75p4m0k5oK9N8R0R7J03R8P8O7J8Ol2n4p9r4q4r4r1p5l4j1J4M5O2Q0J10J04
$$ -175 -249 -289 -314 -320 -291 -233 -143 -46 57 155 233 300 318 324 292 238 159 65 -19 -113 -204 -279 -313 -324 -310 -265 -203 -123 -13 91
5419I1J05P6N0J0j4m9m9p1j01j00j07r0m5l3kM1M1P1J05J23J00Q8M8L0J2k2m4
$$ 91 196 272 322 332 318 269 220 149 48 -52 -159 -249 -294 -327 -329 -288 -247 -176 -71 52 152 240 288 318 330 308 264
5446B64p2j04j12q2q5p5l9l3pM1Q7J03J16Q2Q4P8N5L4%k8q0q8r7q7q5p9p9n7o
$$ 264 192 88 -24 -106 -191 -266 -305 -338 -345 -304 -217 -114 2 84 168 246 301 335 335 307 227 139 42 -45 -130 -209 -288 -345 -351
5475c51L1N4J00R9R0J04R0P4K9J4j7l4q3r3r6q1r7r7n1k7OM7O8P9R6R7J02R7N0
$$ -351 -320 -266 -166 -67 23 127 217 291 320 334 317 283 200 107 11 -70 -167 -264 -315 -342 -336 -289 -221 -142 -46 51 153 250 300
5504C00J6Pj5n2o3j02j16j19r1n8l1pJ2L8O1J11J22J06Q1P4K8L1Rj8p5r4j25j16
$$ 300 316 323 308 256 193 91 -25 -144 -235 -293 -324 -331 -319 -281 -220 -109 13 119 200 274 302 333 342 324 249 155 30 -86
5532h6j00o0m6m9j2K2O6J06J01J04Q7P9O4M3K6k0n7q0r2j09q4j05q2n4k1K6N2
$$ -86 -186 -246 -292 -341 -353 -331 -265 -159 -58 46 133 212 276 319 345 325 268 188 96 -13 -97 -202 -284 -338 -359 -333 -281
5559b81Q3P7R4Q8R3R9P6K9k1m1m8o6j05j08j15j02q3k6J5L5N1P0Q6R0J32J01P5
$$ -281 -198 -121 -27 61 154 253 329 358 337 296 248 182 77 -31 -146 -248 -331 -357 -342 -307 -256 -186 -100 -10 122 223 298
5586B98M8j0k2k1o9q3j26j23j03p4m1k0QK6O3R0J18J10Q2Q0O1M1K5k2n7r6j19
$$ 298 346 336 314 293 224 141 15 -108 -211 -285 -326 -346 -338 -312 -249 -159 -41 69 151 231 292 333 358 336 279 183 64
5613F4j06r2p7o5n4k9K0M8R4J05R1J02O8R4N9M2J0o6o6j04j03q9r8r3p3m0lM6
$$ 64 -42 -134 -211 -276 -330 -359 -339 -291 -197 -92 -1 101 169 263 322 364 374 308 242 138 35 -54 -152 -245 -318 -358 -361 -315
5641c15P3O9Q7Q9J10J13P3N5Ll0o2o6q6j05j04j16q6m9%J2L2O5R2J02J24J19P9
$$ -315 -242 -173 -86 3 113 226 299 354 357 327 265 199 113 8 -96 -212 -298 -347 -347 -335 -303 -238 -146 -44 80 199 278
5668B78M7K2jk5n6q7j24j17j00q6n1k9rKM2Q0J11J33J03P7O4N1J8nk7r2j14j08
$$ 278 325 347 346 321 265 178 54 -63 -163 -249 -300 -329 -338 -336 -294 -214 -103 30 133 210 274 325 343 338 311 219 105 -3
5696cj03p9p5n5m1mL2Q1R8J01R4J04Q5P0N0Lk4p4q6r2j11r8q1r3m7j6K4M3P8J00
$$ -3 -106 -185 -260 -315 -356 -360 -328 -247 -149 -48 46 150 235 305 355 358 334 260 174 82 -29 -127 -208 -301 -348 -364 -340 -297 -219 -119
5726a19J04J10J10P9N0K2j9n2n4q1r1j14j22q5n7k4KK2M3P9J14J31J06Q6O1L5
$$ -119 -15 95 205 284 334 356 337 285 231 150 59 -55 -177 -262 -319 -343 -341 -319 -276 -197 -83 48 154 240 301 336
5752C36oj7l7o0r9j28j06j03o8k9k2mL4P8R9J14J19Q0R1M3K8Lk7o9q9j04j12r8
$$ 336 330 313 276 216 117 -11 -117 -220 -288 -317 -339 -343 -309 -231 -132 -18 101 181 272 315 343 346 319 250 161 57 -55 -153
5780a53p7p5m5j8L1O0Q9J15R9Q8Q8R1M7J8j6n3q5q6r4j06j05r1o1l3K1N1P0Q5
$$ -153 -230 -305 -350 -368 -337 -277 -188 -73 26 114 202 293 340 358 342 289 204 118 24 -82 -187 -278 -339 -372 -351 -300 -230 -145
5808a45J00J04J01R9O2K8j2k4n7p7q7j09j16r7p0m2j5K7M7Q5Q3J24J01Q4P4M3
$$ -145 -45 59 160 259 321 349 337 313 256 179 92 -17 -133 -230 -300 -342 -357 -330 -283 -198 -115 9 110 194 268 311
5834C11K9Jk7p3j01j09j12j04o8o0l6JK2O7Q8J20J04Q8Q6O8M0J8k1l6q4j16j14
$$ 311 340 341 314 241 140 31 -81 -185 -253 -313 -349 -348 -326 -259 -171 -51 53 141 227 295 335 353 332 296 212 96 -18
5861a8r7q2q0m5l1PM7P5J04J17P7J04P6O1L7pk9o8q1j26r3j08r3o0m9QM3M7Q3
$$ -18 -115 -197 -277 -322 -353 -346 -299 -224 -120 -3 74 178 254 315 352 345 316 248 167 41 -52 -160 -253 -313 -362 -354 -311 -264 -181
5890a81J04J08R4Q6Q1M9Lj7l2q0q3j18j11r0r8l4noK7O3J00R3J14J00Q7M7L3J3
$$ -181 -77 31 125 211 292 341 344 327 295 215 132 14 -97 -187 -285 -319 -324 -330 -303 -240 -140 -47 67 167 254 301 334 347
5918C47l0n2q7j02j19r3r1p4l3j1K4M3P2J08R9R8R0Q6M4K0qk8p8q8j02j12r2p5
$$ 347 317 265 178 76 -43 -136 -227 -301 -334 -345 -321 -278 -206 -98 1 99 189 275 319 339 331 303 225 137 35 -77 -169 -244
5946b44o9k4MK6O8O9R9J02J07Q4P5M4Nk2m7p9r5j14j06q9o2o1rJ5L8O1J02Q9J13
$$ -244 -313 -337 -333 -307 -239 -170 -71 31 138 222 297 341 346 324 277 198 103 -11 -117 -206 -268 -329 -338 -323 -285 -224 -122 -33 80
5975H0R9Q5N3K4J2m6o5q9j16j03p1r4n7m3j0J9O6Q1R5J02R7J02O6L3K7k5l3p6
$$ 80 179 264 317 341 353 307 242 153 37 -66 -137 -231 -288 -331 -341 -322 -256 -175 -80 22 119 221 287 320 347 322 289 213
6003B13r4r2j18q6q4n1k9NK8O1Q7J02J15J05Q5O1K7kk8m6p6j09r5j09r3o4l7o
$$ 213 119 27 -91 -177 -261 -312 -341 -336 -308 -247 -160 -58 57 162 247 308 335 333 305 259 183 74 -21 -130 -223 -287 -324 -330
6031c30NL7P8R0J12J09R9P2M8J6Pm4o5q4j19j02q9p6n3n0%K4N6R2J01J02R2P8
$$ -330 -325 -288 -210 -120 -8 101 200 272 320 336 343 299 234 150 31 -71 -160 -236 -289 -339 -339 -315 -259 -167 -66 36 128 206
6059B06P3N0J6j1n3r7q4r7j01q8p8o7k3QM2O8R3R8J14R4R1N8M0j9k0o1p6j01r9
$$ 206 279 329 345 334 281 184 100 3 -98 -186 -264 -331 -354 -346 -304 -236 -143 -45 69 163 254 312 352 333 313 252 176 75 -24
6088b4j09r4o4n1lK9M0Q0R7J07J13Q8P8L6K2k6k7o7r3r6j13j03q0n9rqK5M7R5
$$ -24 -133 -227 -291 -342 -345 -316 -276 -196 -99 8 121 209 287 323 345 319 292 225 132 36 -77 -180 -260 -319 -328 -336 -311 -264 -169
6117a69J02J26R2P4O4K5J1om2q0r2j22r8r3p6l4l0J9L6Q0R7J05Q6R2P5N9L0Nk4
$$ -169 -67 59 151 225 289 314 325 319 277 197 105 -17 -115 -208 -284 -318 -348 -329 -293 -213 -116 -11 75 167 242 301 331 336 312
6146C12p8r0r4r3j05q4q4l7OK6N8Q0J01Q6J06Q5Q4N5Lk3l6q8q5r4r1j10q9n4j1
$$ 312 234 144 50 -43 -148 -232 -316 -353 -347 -321 -263 -183 -82 4 110 195 279 334 337 314 278 190 105 11 -80 -190 -279 -333 -344
6175c44J7L6O2P9J08R2J18P7N8J7J3k9m0q3r9j02j25p5p4k7rQL1Q4R3J12J03Q0
$$ -344 -327 -291 -229 -150 -42 50 168 245 303 320 333 304 264 181 82 -20 -145 -220 -294 -321 -330 -322 -291 -207 -114 -2 101 181
6203A81P8M4J6K9m8o4j08j21q5q3o9o5m7jK7N8R9R6J01P9Q6O6N7J6j0o0p8j01
$$ 181 259 303 319 348 300 236 128 7 -78 -161 -230 -295 -342 -343 -316 -258 -159 -63 38 117 203 269 326 342 332 272 194 93
6231I3r5j04q6p5n1k6J4M6O3J01R3R8J05P4N6L8j0m6n0p8j03r8j08r5o8qlL0K8
$$ 93 -2 -106 -192 -267 -318 -344 -330 -284 -221 -120 -27 71 176 250 306 344 334 288 238 160 57 -41 -149 -244 -312 -320 -323 -293 -265
6260b65O2R3J25J07Q7O6M3J1k7j8n9j05r7j12j07o3l2k4kK3N5Q2J08J00J00P9
$$ -265 -203 -110 15 122 209 275 318 329 302 284 225 120 23 -89 -196 -259 -291 -315 -317 -294 -239 -157 -49 51 151 230
6286B30N7L7Nk3m6r0j01r3r7q6p0l7k5J7M1P2J01R1J01Q5R4M9L9k2m1p3q5q6r7
$$ 230 287 324 329 306 260 170 69 -24 -121 -207 -277 -314 -339 -322 -281 -209 -108 -17 84 169 263 312 351 329 288 215 130 44 -53
6315e3r0r4o0l9ML6O4O8Q7J02R4J03P6L5ol0l4p2r1r5j01r2p5m2j1J7K3N4R0Q4
$$ -53 -143 -237 -297 -336 -332 -296 -232 -164 -77 25 119 222 298 333 327 297 263 191 100 5 -96 -188 -263 -305 -316 -299 -276 -222 -132 -48
6345d8J24R4P5N5J4prn5q2r9j02r6q6m4m8mLN0P7J09R1J04P8O8M6K3ql2p8r0j04
$$ -48 76 170 245 300 314 307 298 243 161 62 -40 -136 -222 -266 -314 -318 -315 -265 -188 -79 12 116 194 262 308 331 323 291 213 123 19
6376A9r6q8q1m0m6oM1Q4P3P9J21R1Q3N8L3Ml5n7p4q2j07r6q8o4m4j1J9M9O3R0
$$ 19 -77 -165 -246 -286 -332 -338 -297 -213 -140 -61 60 151 234 292 325 329 294 237 163 81 -26 -122 -210 -274 -318 -329 -310 -261 -198 -108
6406a08J06J00Q9P6M2J6j2k9o3p4j03r7r3q9n5j6lK1M1Q7R3J00J09Q3L7N3Nj9
$$ -108 -2 98 187 263 305 321 309 280 217 143 40 -57 -150 -239 -294 -310 -313 -292 -251 -164 -71 29 138 221 258 311 316 297
6434B97k9q1q9j03j12p8o6m0k5JM4O5Q5J19Q6R3P3L6L2J0k5n7q7r5r7q6r4l9m5
$$ 297 268 187 98 -5 -117 -195 -261 -301 -326 -325 -281 -216 -131 -12 74 167 240 276 308 318 293 236 149 54 -43 -129 -223 -262 -307
6463c07k5L5M7Q0Q9R7Q6Q6O9N3J0mn3o8q9q3j01r6p4o5oLL2O9O8R7Q9J02Q3N6
$$ -307 -332 -297 -250 -170 -81 16 102 188 257 310 320 316 263 195 106 23 -78 -174 -248 -313 -319 -316 -284 -215 -147 -50 39 141 224 280
6493B80K1Pk4l9p0q9j08j10p5o2l6j3K9L0P8P7J09R7P0Q1M8NOl9o0q6j01r9q2
$$ 280 301 308 284 245 175 86 -22 -132 -207 -269 -305 -318 -289 -259 -181 -104 5 102 172 253 301 306 312 273 213 127 26 -73 -155
6522a55q5m3k6LK4N6O9R6Q5J03Q1N9M3Kj4n6o6r4r6q2r7n3m9j0QL7O3P6J05Q5
$$ -155 -240 -283 -309 -306 -282 -226 -157 -61 24 127 208 267 310 312 298 242 176 82 -14 -96 -193 -246 -295 -305 -297 -260 -197 -121 -16 69
6552F9Q9O3N6K5Ql3n6q0r6q8q5p8n8l5QPM5O3Q8R1J00Q3N5M3J8j8k9p4q2j03r2
$$ 69 158 221 277 302 310 277 221 141 45 -43 -128 -206 -264 -299 -291 -284 -239 -176 -88 3 103 186 241 284 302 284 255 181 99 -4 -96
6583i6p8o0l9k2mK8N0Q1R8R4Q9O8N9K8Rl2m1p5r4r4r1p3n8l2%ML6O2R0R4R0Q5
$$ -96 -174 -234 -273 -295 -299 -271 -221 -140 -42 52 141 209 268 296 305 273 232 157 63 -31 -122 -195 -253 -285 -285 -281 -245 -183 -93 1 91 176
6615A76O5L3K4j6k5o9p5r5q3q9p7l9j2j0K4M3P3R3R5P5R2M1L6Mk1l2p4q0q7q4
$$ 176 241 274 298 282 257 188 113 18 -65 -154 -231 -270 -282 -292 -268 -225 -152 -59 36 111 203 244 280 284 263 231 157 77 -10 -94
6645i4p6o8m2jjL3O2Q6Q9Q1P7P7M4K5ql6m7o3r8q1r0p0n4l5oK1N2O5Q8Q3Q2Q0
$$ -94 -170 -238 -280 -281 -282 -249 -187 -101 -12 69 146 223 267 292 284 248 201 138 40 -41 -131 -201 -255 -290 -296 -275 -223 -158 -70 13 95 175
6677A75O4K3K8k1m2o7o4q9q7p1o9m8qjK7N7O5J01R2Q2O0M9J4J0k6l8p3o9j03j00
$$ 175 239 262 290 269 227 160 96 7 -80 -151 -220 -268 -276 -277 -250 -193 -128 -27 65 147 207 256 270 280 254 216 143 74 -29 -129
6707a29n8n3l3kMM0P2P7Q8Q3O9O5L3J1mk6n5p0r9p2q8n1m4l9kJ8N1Q1R1Q2Q2P1
$$ -129 -187 -240 -273 -275 -271 -231 -159 -82 6 89 158 223 256 267 263 237 182 112 13 -59 -147 -198 -242 -281 -283 -265 -214 -133 -42 40 122 193
6739A93M3L5J1pn8o4p4q7p7p4o2m7qK1K3O3P8P9Q1P9N2N7Rml2n3n7q4p1p9q0o0
$$ 193 236 271 282 275 217 153 79 -8 -85 -159 -221 -268 -276 -255 -232 -169 -91 -12 69 148 200 257 266 262 230 177 120 36 -35 -114 -194 -254
6771b54j9nK9N4N0P9Q3Q3O5N6K2J6j4j7o0o9r0q9p3n2m2j7PK0N1P2P6R2Q1N2L6
$$ -254 -273 -278 -249 -195 -145 -66 17 100 165 221 243 259 245 228 168 99 9 -80 -153 -205 -247 -264 -257 -237 -186 -114 -38 54 135 187 223
6802B23L7Nj0m2p5p7j04q0m7m8l9k6K0M1O8Q1O4Q0P2O7M0K8om1n8p7q3o9p9p8
$$ 223 260 265 255 213 138 61 -43 -123 -170 -218 -257 -283 -263 -222 -154 -73 -9 71 143 210 250 278 272 231 173 96 13 -56 -135 -213
6832b13l5j7jK4N3P9O0Q5P2P6N8K9pj8l8m8p1r6p5p6o3k4j6K0K7M9N6Q9Q7Q0O5
$$ -213 -248 -265 -266 -242 -189 -110 -50 35 107 183 241 270 263 245 207 159 88 -8 -83 -159 -222 -246 -262 -242 -215 -166 -110 -21 66 146 211
6863B11L4ROl4k7o9q3r5q5n8l8j5oML4O1P9Q8Q6N4N9L7J5pk8o1q5p5r2m9o3k9
$$ 211 245 254 260 226 199 130 47 -48 -133 -191 -229 -244 -250 -246 -212 -151 -72 16 102 156 215 252 267 260 232 171 86 11 -81 -130 -193 -222
6895b22m5J2K7M7P9P4N9Q1P3M6L4lk2m9q5o0o8o7p4n4m0j4K6M1N4O5P3P8Q1N8
$$ -222 -267 -255 -228 -181 -102 -28 31 112 185 231 265 262 240 191 106 46 -22 -89 -163 -217 -257 -271 -245 -204 -150 -85 -12 66 147 205
6925B05M5K1j1n0l9o2p8q2q1o0l7j5mK4K1P0Q0R2Q4O1K4M0jj6k4o2p1r1p8o2m8
$$ 205 250 271 260 210 171 109 31 -51 -132 -192 -229 -244 -248 -224 -203 -133 -53 39 123 184 208 248 247 231 207 145 74 -17 -95 -157 -205
6956b05l5j4JK4N7P1R2P1O9N5L9J8J3l0m3p4q1q1o1n9l4l3j3J1M1Q5P0P0P2O8
$$ -205 -240 -254 -253 -229 -172 -101 -9 62 131 186 225 243 256 226 183 109 28 -53 -114 -173 -207 -240 -253 -242 -201 -116 -46 24 96 164
6986A64M8M1Qj4l9o0n9p9q6o4o0l7k5J7L3N9M8O4R1P0P1M3L2k4j6n6m7o4p7r0
$$ 164 212 253 261 247 208 148 89 10 -76 -140 -200 -237 -262 -245 -212 -153 -105 -41 50 120 191 234 266 242 226 170 123 59 -18 -108
7016a08n9n0j9j5J2L2N7Q4P6Q6N9N3L0J3Kl6n6o2p7o8q7n0l1m0J1J7L9Q2Q8O8
$$ -108 -167 -217 -236 -251 -239 -207 -150 -66 10 96 155 208 238 251 253 217 161 99 22 -46 -133 -183 -214 -254 -243 -226 -187 -105 -17 51
7046E1O5O0M5NL1j0n0o5p9p4p8m4o4l4k7K7L4O5O3P4P0O9N4L9K6kk5m0q2o6q0
$$ 51 116 176 221 226 257 247 197 132 53 -21 -99 -143 -207 -241 -268 -241 -207 -142 -79 -5 65 134 188 227 253 251 226 186 104 38 -42
7077d2p5o1m9j5MK1M0N9O4P1P8P2M6K7J1j2m3m7n6r1q3p2m6m1j1J4K5M7N8R0P6
$$ -42 -117 -178 -227 -242 -238 -217 -177 -118 -54 17 95 167 213 240 251 239 196 149 93 2 -81 -153 -199 -240 -251 -237 -212 -165 -107 -17 59
7108E9P0N3N0K2qj5m6o5p6p9o7n7n1l2%J8L8N9P4O0Q5M6N8L1QJ0m1n8p3p3p2o3
$$ 59 129 182 232 254 246 231 185 120 44 -35 -102 -159 -210 -242 -242 -224 -186 -127 -53 7 92 138 196 227 235 245 204 146 73 0 -72 -135
7140a35m7m7k3J0K8N1O3O3O9P8N5N2K4Lk7k9o5o5q1p5n4n7k8j2J8L3M9Q2P1P3
$$ -135 -182 -229 -252 -242 -214 -163 -100 -37 32 110 165 217 241 244 217 188 123 58 -23 -98 -152 -209 -237 -249 -231 -198 -149 -67 4 77
7170G7N6P0L8Nkj7o2o2p4p3p8n1l5k7JK6M7M1P8O6Q7M6M6L1Olm0o3o0p8p7n9m1
$$ 77 133 203 241 246 244 227 165 103 29 -44 -122 -173 -208 -235 -234 -208 -161 -120 -42 24 111 157 203 234 240 237 197 134 74 -4 -81 -140 -181
7203a81l1k6QM0M8N2O5R4O9M7L9J2jk1m7m7q4o7p4n6m5j8nJ1L5N6O5Q0O7O6N5
$$ -181 -212 -238 -230 -190 -142 -90 -25 69 138 185 224 236 235 214 167 120 36 -31 -105 -161 -206 -224 -229 -218 -183 -127 -62 18 85 151 206
7234B06K5Pj8l4m8o7o9p3o1n3l9j6QJ6N0O3P6P7O2O4M4J1Mj2n1n2p3o5p2o0m4
$$ 206 231 238 220 186 138 71 2 -71 -132 -185 -224 -240 -232 -216 -166 -103 -27 50 112 176 220 231 235 223 172 120 47 -18 -90 -150 -194
7265a94l2j2K2L1M5P9P3O4O9N3K6J2jm1m6n6o9p0o6n2m9j9jK5L8N3O7P5Q9N2M9
$$ -194 -226 -238 -216 -185 -140 -61 12 76 145 198 224 236 235 194 148 92 23 -47 -113 -165 -214 -233 -234 -209 -171 -118 -51 24 113 165 214
7296B14J2J2k3k9n5o2o3p7p2m2l5j5K5J4M7O4Q4O9P2M7K7K4jk8m8o3n4q6n8n8
$$ 214 226 238 215 186 131 69 6 -71 -143 -185 -220 -235 -210 -196 -149 -85 -1 68 140 187 214 238 237 209 161 98 44 -42 -100 -158
7326a58n4qj8K7K6O9O8O9O4O1L9L5J1j6l8m4n8o3p1p0n6l5j9J1L0M5P2O7O0O6
$$ -158 -212 -220 -238 -211 -185 -116 -48 21 85 146 185 220 231 215 177 133 75 12 -59 -129 -185 -220 -239 -228 -198 -153 -81 -14 46 112
7356A12N4M4K8j1k5m6m8o3o5o1o5n1l4LJ9L7N2L9P7P1O5N8K5J2qk2m5n2q3p2o6
$$ 112 166 210 238 227 202 156 108 45 -20 -81 -146 -197 -231 -228 -209 -172 -120 -81 -4 67 132 190 215 227 219 197 152 100 17 -55 -121
7387a21n7k8j8J6KL1N7P9P3O8N7L0J7J9Jk9o6o1r4n7m9m9k6j4qL1O2O3O3P0L7
$$ -121 -178 -206 -224 -208 -206 -175 -118 -39 34 102 159 189 206 225 226 197 131 70 -24 -81 -130 -179 -205 -219 -227 -196 -134 -71 -8 62 99
7418I9O5L4L7j0l0m2n9o4q1n1n0l9k7lK1M3M5O1N8O7P0M4K6J8k0l0n3n4o2p7n9
$$ 99 164 198 235 225 195 153 94 30 -51 -102 -152 -191 -218 -221 -200 -157 -112 -51 7 74 144 188 214 232 212 182 129 75 13 -64 -123
7449a23m1l7j2MJ8M0N6N2P9P6N9K8J3lmk9o0p3p1p9m5l8k0P%J2M8O7P7O4N5N3
$$ -123 -164 -201 -213 -209 -191 -151 -95 -43 36 112 171 199 212 209 205 176 116 43 -28 -107 -152 -190 -210 -203 -203 -191 -143 -76 1 65 120 173
7481A73K6J9mk6m4o7p4o0o4k8m6l1QJ1M2O1O7N6O9N6M5K6Krm0n1n6o3n2o8n1l6
$$ 173 199 218 214 188 144 77 3 -57 -121 -149 -195 -226 -218 -207 -165 -104 -37 19 88 144 189 215 217 208 168 117 61 -2 -54 -122 -173 -209
7513b09j1PL4L1N8N7O8O6N4M3J4kl3l7m3o3m5q2o1k8k3jPK7M8O7N4Q2N9L0L7M
$$ -209 -220 -213 -179 -148 -90 -33 35 101 155 198 212 210 177 140 97 34 -11 -93 -154 -182 -205 -206 -199 -172 -124 -57 -3 79 138 168 205 209
7545B09j8j3l5n8q0o5o0l2l8k6J7MM4M5P1O2O6N2L6L0Jj7m5l5r0m7m2p3k7l9j9
$$ 209 191 178 143 85 5 -60 -120 -152 -190 -216 -199 -195 -151 -106 -35 27 93 145 181 211 212 195 150 115 25 -22 -64 -137 -164 -203 -222
7576b22J5J9O4N9P0M7M6M9N1J9lm1k7o6m9n2o8n3m6j9JK5L8L2N6O5P9M0M7K9m
$$ -222 -207 -188 -124 -65 5 52 98 147 198 217 214 173 146 80 31 -21 -89 -142 -188 -207 -206 -181 -143 -111 -55 10 89 129 176 205 201
7607B01rk8m0o6n1p2n3m1m9KmJ3L9O6O8O9O7M4PK6%%k2o5n5o4p1n0k9k3j8MK9
$$ 201 192 164 124 58 7 -65 -118 -159 -208 -206 -210 -197 -158 -92 -24 45 112 156 163 189 189 189 167 102 47 -17 -88 -138 -167 -190 -208 -204 -175
7640a75N6N3Q7M7M4M2K9K2Ql2m3n8o1o8o4m0l7j6j3K3K5O8O0O7N9M4M6K0Jj3k8
$$ -175 -119 -66 21 68 112 154 183 205 213 181 138 80 19 -49 -113 -153 -190 -206 -219 -196 -171 -103 -43 24 83 127 173 193 194 181 153
7671A53m0o5o2o1n2n1l1OQK6M0M7O7O3O2N1K6J0Jk6k7n1n6n7q5n8l5j2PJ3K5N6
$$ 153 113 48 -14 -75 -127 -178 -209 -203 -195 -169 -129 -82 -15 48 110 161 187 197 198 172 145 94 38 -19 -104 -162 -197 -209 -202 -189 -164 -108
7703a08N1O4O0M0N7K3J9j3l0m5n2o3n9n4n0k7j8JK4L7O3N0O7M4M3N0K6Nj4l5n5
$$ -108 -57 7 67 107 164 187 206 193 163 118 66 3 -56 -110 -160 -187 -205 -204 -180 -143 -80 -30 37 81 124 174 200 205 191 156 101
7734A01n3n9n7m8o0k4j1OM1M3M6O6N8N2M4L1L1ll0m8n8n3o1o2m6l1j9lK0M1L5
$$ 101 48 -11 -68 -116 -176 -200 -211 -205 -164 -121 -75 -9 49 101 145 176 207 204 174 126 68 15 -46 -108 -154 -185 -204 -207 -187 -146 -111
7765a11P5L7Q0M8K2M4ljk9n1n2p0n8n3l9l2j3J5K7L4N1O1O9N3M1L6J1nol7m6o4
$$ -111 -36 1 81 129 151 195 192 191 162 111 59 -11 -69 -122 -161 -193 -206 -191 -164 -130 -79 -18 51 104 145 181 192 187 181 144 98 34
7797C4o3o4m8l0k2j0mL8M5O1O1O4N3M3K3J2pk3m8n2p0n2l6n4l4k0JK6M0M1N7O0
$$ 34 -29 -93 -141 -171 -193 -203 -207 -169 -124 -63 -2 62 115 158 181 193 186 163 115 63 -7 -59 -95 -149 -183 -203 -202 -176 -136 -95 -38 22
7829B2O3N4K8K5jk2j9m8o2n9n6n7l3l6JKL4L9M8N8O9N2M7L6NJk0m8m2o3n6n2m9
$$ 22 85 139 167 192 191 169 150 102 40 -19 -75 -132 -165 -201 -200 -198 -164 -125 -77 -19 50 102 149 185 190 191 171 123 81 18 -38 -90 -139
7862a39m2j3JJ4L3L8O6N7M9O8M1K6Pl1l1k1o0o9n4m3o3k7mOK5L4N6O5M6O0M7L0
$$ -139 -181 -194 -193 -179 -146 -108 -42 15 64 132 173 199 206 175 144 123 63 -6 -60 -103 -166 -193 -197 -191 -166 -132 -76 -11 35 95 142 172
7894A72K6pj4m5m4n9p5m2m1m9j7j1J9L6L6O2O9M9M1M6K6J3Kk8m4n2o1n4n9l4l6
$$ 172 198 191 177 132 88 29 -46 -88 -129 -178 -195 -206 -187 -151 -115 -53 16 65 106 152 178 191 193 165 121 69 8 -46 -105 -139 -175
7925a75k0jK6M2M2O3N1O9K7L3K9Mj8k6m6n9n5n2n9k9m3oRK1N4N3N1O0N9L3N0J
$$ -175 -195 -196 -170 -128 -86 -23 28 97 124 157 186 190 172 146 100 41 -14 -66 -125 -154 -197 -203 -194 -173 -119 -66 -15 45 104 137 187 188
7957A88lj4n2l8n8p0n0m3l8j3MMM9K6N2Q5M5O2L3J7%jk6l6n7p5o0n5l2l3JJK0
$$ 188 185 171 119 81 23 -47 -97 -140 -178 -191 -187 -183 -134 -108 -56 29 74 136 169 186 186 185 159 123 66 -9 -69 -124 -156 -189 -188 -187 -167
7990a67K6O1P0N6M7L4L3K4Mk2l3m4n4p0n2n2k9k1nPL9M0N8N6M3N4M0L3O%k1n1
$$ -167 -141 -80 -10 46 93 127 160 184 188 166 133 89 35 -35 -87 -139 -168 -189 -194 -187 -148 -108 -50 6 49 103 143 176 182 182 161 110
8022A10l4m8o5n9n7k4j5pK5M1L6M8O7M7O4L7J8Jl2l1k6n5n7n9m7m4k4NJ3J0M2
$$ 110 76 28 -37 -96 -153 -177 -192 -199 -174 -133 -97 -49 18 65 129 166 184 185 153 122 96 41 -16 -75 -122 -166 -190 -185 -172 -162 -120
8053a20M8N2O7N9L9K7MLj4l5n6o9m3n5m3k9k2LJ5L6M1N1O0N0M2L5K7J6rl2m4o6
$$ -120 -72 -20 47 106 145 172 176 179 165 130 74 5 -38 -93 -136 -165 -187 -184 -169 -133 -92 -41 19 69 111 146 173 189 180 148 104 38
8085C8n1m1m5m7l3pkK7M1N0M8M7O3L0N8J1jrm6m5n0m8n6m7l6l1lJ5K6L6M4O3N8
$$ 38 -13 -54 -99 -146 -179 -186 -188 -161 -120 -70 -22 25 88 118 176 187 186 177 131 86 36 -12 -68 -115 -151 -182 -185 -170 -144 -108 -64 -1 57
8118E7M6N1K3jqj7m0l5o6m8n9m3k3nj7J0L3M8N9O3N5L8K4J8Pj2j7m0o8m9o4l8
$$ 57 103 154 177 176 168 151 111 76 10 -38 -97 -140 -163 -168 -185 -175 -142 -94 -35 28 83 121 145 163 170 158 141 101 33 -16 -80 -118
8150a18j8k8rj1J5N8M6N4N8M5M0K9NQj4m5l4p3l4n8n0l0qjkL0M7M8M9O8M0K9K6
$$ -118 -136 -164 -173 -184 -169 -111 -65 -11 47 92 132 161 166 174 160 115 81 8 -26 -84 -134 -164 -172 -173 -175 -145 -98 -50 -1 67 107 136 162
8183A62%Jk5m4l7m0n9n7
$$ 162 162 163 138 94 57 17 -42 -99
8191i9
$$ Imaginary data points
##PAGE= N=2
##DATA TABLE= (X++(I..I)), XYDATA
0@%%%%%%%%%%%%%%%%%%%%%%%%%%%%jJmPpQrRrJ3j7K0k2K3k4K5k8L1l4L6l9M6n2
$$ 0 0 0 0 0 0 0 0 0 0 0 0 0 0 0 0 0 0 0 0 0 0 0 0 0 0 0 0 0 -1 0 -4 3 -4 4 -5 4 -5 8 -9 11 -11 12 -12 13 -15 16 -18 18 -21 25 -27
51b7N6o1O6p4Q5r4J06j18J31j52J78k09K56l22M21n97R69k083J2187P2100P2292
$$ -27 29 -32 34 -40 45 -49 57 -61 70 -82 96 -113 143 -179 242 -355 614 -1469 10718 82818 155110
72A55110N8836M0550J8073q279l5569n9675p4684p8687p2945o3281n3453m3977
$$ 155110 213946 254496 272569 264290 228721 169046 94362 15675 -57270 -120551 -174004 -217981
84b17981l0281q745K0347M9845P0761P7334P1577O0584N1050M3594L3530J5061
$$ -217981 -248262 -257007 -236660 -186815 -116054 -38720 32857 93441 144491 188085 221615 236676
96B36676j1795m0618o1754o9841o6319n8045n0640m4502l5415j9041M380K9473
$$ 236676 224881 184263 122509 52668 -13651 -71696 -122336 -166838 -202253 -221294 -216914 -187441
108a87441M9386O0427O3388O1442N6845M8918L6104J8219k346k1870l7791m9524
$$ -187441 -138055 -77628 -14240 47202 104047 152965 189069 207288 204942 183072 145281 95757
120I5757n7661o1720o0262n1640l6588j8335o10J4460K7442L9744N1481N9766
$$ 95757 38096 -23624 -83886 -135526 -172114 -190449 -191059 -176599 -149157 -109413 -57932 1834
132A834O0902N3057L7938K0395M574q164j9660l1985m5060n5232n8230n2132l8763
$$ 1834 62736 115793 153731 174126 178700 170536 150876 118891 73831 18599 -39631 -91763 -130526
145a30526k2982q761K920J3956K6275L9427M9886N3568M9085L8376K5488J3616
$$ -130526 -153508 -162269 -159349 -145393 -119118 -79691 -29805 23763 72848 111224 136712 150328
157A50328L009q306k1471l5263m6107n0414m7516l9349k9026j8435p330N376J9452
$$ 150328 153337 145031 123560 88297 42190 -8224 -55740 -95089 -124115 -142550 -149880 -144504 -125052
170a25052L2650M1908M5311M3596L8633L1865K3242J1878k076j6643k8874l6729
$$ -125052 -92402 -50494 -5183 38413 77046 108911 132153 144031 141955 125312 96438 59709
182E9709m0275m1013l9927l6010k7697j4546J199J5641K5780L1319L4299L6750
$$ 59709 19434 -21579 -61506 -97516 -125213 -139759 -138560 -122919 -97139 -65820 -31521 5229
194E229L8533L6986K9662J6681J525j1530k0279k5484k9830l4511l8116l7509
$$ 5229 43762 80748 110410 127091 128616 117086 96807 71323 41493 6982 -31134 -68643
206f8643l0505j8183m113P876J6338K2263K7569L2682L6004L5350K9503J9618
$$ -68643 -99148 -117331 -121444 -113568 -97230 -74967 -47398 -14716 21288 56638 86141 105759
218A05759Q323k209j1248j9147k6404l2205l5131l4033k8864k0916j1723k266
$$ 105759 114082 111873 100625 81478 55074 22869 -12262 -46295 -75159 -96075 -107798 -110064
230a10064P286J6750K5238L1327L3632L2112K7680K1691J4841O825k776j3480
$$ -110064 -102778 -86028 -60790 -29463 4169 36281 63961 85652 100493 107318 104542 91062
242I1062k3351l0155l2352l0618k6685k2033j6791r951o58J0266K0382K7145K9507
$$ 91062 67711 37556 5204 -25414 -52099 -74132 -90923 -100874 -101532 -91266 -70884 -43739 -14232
255a4232K8445K5986K3014J9040J2619L276p679j7608k4168k6944k6969k5840
$$ -14232 14213 40199 63213 82253 94872 98148 90469 72861 48693 21749 -5220 -31060
267c1060k3867k0095j3620m630N225J3845J9976K3715K5777K6536K5571K1719
$$ -31060 -54927 -75022 -88642 -93272 -88047 -74202 -54226 -30511 -4734 21802 47373 69092
279F9092J4937O116k936j0886j7149k2023k5463k6982k5877k1649j4974p227L24
$$ 69092 84029 90145 87209 76323 59174 37151 11688 -15294 -41171 -62820 -77794 -85021 -84697
292h4697P197J3528J9420K4287K6852K6249K2373J6178R147K196m543j1286j7822
$$ -84697 -77500 -63972 -44552 -20265 6587 32836 55209 71387 80534 82730 78187 66901 49079
305D9079k3148k5844k5229k1663j6250j0321m449J629Q214J4988K0822K4229K4484
$$ 49079 25931 87 -25142 -46805 -63055 -73376 -77825 -76196 -67982 -52994 -32172 -7943 16541
318A6541K1974J7592J2282O523K12o624j3419j9069k2431k3067k1449j8103j3646
$$ 16541 38515 56107 68389 74912 75124 68500 55081 36012 13581 -9486 -30935 -49038 -62684
331f2684q270k094M554J1102J6580K0384K2115K1829J9650J5536R918L321l464
$$ -62684 -70954 -73048 -68494 -57392 -40812 -20428 1687 23516 43166 58702 68620 71941 68477
344F8477r666j4726j8405k0619k1193j9966j6641j1444n111J432P432J2512J6560
$$ 68477 58811 44085 25680 5061 -16132 -36098 -52739 -64183 -69294 -67862 -60430 -47918 -31358
357c1358J9431K0828K0377J7633J2760O575P1n894j0853j4759j7642j9341j9522
$$ -31358 -11927 8901 29278 46911 59671 66246 66317 60423 49570 34811 17169 -2172 -21694
370b1694j7790j4018q636k454L639R095J3450J6679J8590J9034J7822J4688R928
$$ -21694 -39484 -53502 -62138 -64592 -60953 -51858 -38408 -21729 -3139 15895 33717 48405 58333
383E8333M044k074p649j2109j5244j7147j7830j7357j5373j1650o379j72N940
$$ 58333 62377 60303 52654 40545 25301 8154 -9676 -27033 -42406 -54056 -60435 -60607 -54667
396e4667J1027J4597J6710J7476J7172J5505J2222P407J594m252r290j2998j5433
$$ -54667 -43640 -29043 -12333 5143 22315 37820 50042 57449 59043 54791 45501 32503 17070
409A7070j6676j6863j5745j3004q846l619K015P371J1864J5174J6897J6924J5404
$$ 17070 394 -16469 -32214 -45218 -54064 -57683 -55668 -48297 -36433 -21259 -4362 12562 27966
422B7966J2585Q954M742Q5m954r919j4003j6381j6607j5216j2731r821o462k257
$$ 27966 40551 49505 54247 54332 49378 39459 25456 9075 -7532 -22748 -35479 -45300 -51762 -54019
436e4019K952Q646J3467J6274J6478J4851J2420R868P187L664j041o595j1632
$$ -54019 -51067 -42421 -28954 -12680 3798 18649 31069 40937 48124 51788 50747 44152 32520
449C2520j4965j5905j4955j3104j0876q307m831j97N203J0232J3798J5258J4901
$$ 32520 17555 1650 -13305 -26409 -37285 -45592 -50423 -50620 -45417 -35185 -21387 -6129 8772
462H772J3454J1399Q764N413J224l477p946j1523j3907j4842j4596j3023j0055
$$ 8772 22226 33625 42389 47802 49026 45549 37603 26080 12173 -2669 -17265 -30288 -40343
475d0343n999j448K867O535R528J2124J4156J5075J4099J0946O380J718j926m612
$$ -40343 -46342 -47790 -44923 -38388 -28860 -16736 -2580 12495 26594 37540 43920 45638 43712 39100
489C9100p101j0230j3592j5766j5402j2040o939k093J285L464N734Q986J2675
$$ 39100 31999 21769 8177 -7589 -22991 -35031 -41970 -44063 -42778 -39314 -33580 -24594 -11919
502a1919J5133J4946J2056P669L655O40j848m836q541j2176j4246j4068j1985
$$ -11919 3214 18160 30216 37885 41540 42180 40332 35496 26955 14779 533 -13535 -25520
515b5520q873n636k435J092M977Q642J1257J2296J2079J1311J0112Q124M848K20
$$ -25520 -34393 -40029 -42464 -41372 -36395 -27753 -16496 -4200 7879 19190 29302 37426 42274 42494
529D2494m709q625j0675j1139j0955j1014j0924r575o191j066M250Q082R708R863
$$ 42494 37785 29160 18485 7346 -3609 -14623 -25547 -35122 -41313 -42379 -38129 -30047 -20339 -10476
543a0476R841J0494J1269J0684P677K606k937p087r001r432r647j0364j1208j0712
$$ -10476 -635 9859 21128 31812 39489 42095 39158 32071 23070 13638 3991 -6373 -17581 -28293
557b8293p956l336J617N405P430Q367R271J0442J1335J0736Q158M182M9l310n829
$$ -28293 -36249 -39585 -37968 -32563 -25133 -16766 -7495 2947 14282 25018 33176 37358 37407 34097 28268
572B8268p930r865j1252j1323r819p092m166j664O47L446O848J0162J1921J1453
$$ 28268 20338 10473 -779 -12102 -21921 -29013 -33179 -34843 -34196 -30750 -23902 -13740 -1819 9634
586I634R241O605M664L362J467k008o602j0680j2350j1110q362n962m916m499
$$ 9634 18875 25480 30144 33506 34973 32965 26363 15683 3333 -7777 -16139 -22101 -27017 -31516
600c1516l051N52N510R818J1649J0734Q598O844O067N369L327m83n120q735j0244
$$ -31516 -34567 -34015 -28505 -18687 -7038 3696 12294 19138 25205 30574 33901 33418 28298 19563 9319
615I319r715q505p641p032n821l254M04M123O730Q027Q601R082R458Q890O571
$$ 9319 -396 -8901 -16542 -23574 -29395 -32649 -32245 -28122 -21392 -13365 -4764 4318 13776 22666 29237
630B9237K792j168m010n390o005p104q769j0156r791p000k849R12K962L703M463
$$ 29237 32029 30861 26851 21461 15456 8352 -417 -10573 -20364 -27364 -30213 -29301 -26339 -22636 -18173
645a8173O398R111J0982J0455P323L072l44k055k833m006o294q872j0221r465
$$ -18173 -11775 -2664 8318 18773 26096 29168 28824 26769 23936 19930 13636 4764 -5457 -14922
659a4922o856l873j641j59J459L936O949R264R716Q463O370M521L236J731p68
$$ -14922 -21778 -25651 -27292 -27451 -25992 -22056 -15107 -5843 3873 12336 18706 23227 26463 28194 27426
674B7426m174p355q974q528p063n809n326m982l551l75L842P304Q761Q104O726
$$ 27426 23252 15897 6923 -1605 -8668 -14477 -19803 -24785 -28336 -28711 -24869 -17565 -8804 -700 6026
689F026N910N852N581L905N64l433o423p473p054o379o361o754o360m291q06K818
$$ 6026 11936 17788 23369 27274 27838 24405 17982 10509 3455 -2924 -9285 -16039 -22399 -26690 -27496 -24678
705b4678N325O250O398O636P276P568O483L810L90k404l853m424n108o476q000
$$ -24678 -19353 -13103 -6705 -69 7207 14775 21258 25068 25458 23054 19201 14777 9669 3193 -4807
720d807q453o954l832n23J721K708L408M756O841Q499Q564O582L477Q01o33j288
$$ -4807 -13260 -20214 -24046 -24569 -22848 -20140 -16732 -11976 -5135 3364 11928 18510 21987 22788 22155 20867
736B0867k321m388o913q497q206o283l800j925q33K88K242M935P245Q037P132
$$ 20867 18546 14158 7245 -1252 -9458 -15741 -19541 -21466 -22299 -22011 -19769 -14834 -7589 448 7580
751G580N358L797K997K289P65j879m871o929p245o320n214m618m329l364j116
$$ 7580 12938 16735 19732 22021 22786 20907 16036 9107 1862 -4458 -9672 -14290 -18619 -21983 -23099
766b3099K085M971O446O279N428M922N040N101L956J446j720m249n398n405n196
$$ -23099 -21014 -16043 -9597 -3318 2110 7032 12072 17173 21129 22575 20855 16606 11208 5803 607
781F07n525o050n889m184j274J798L820M524M544M825N657O428O100M213J405
$$ 607 -4918 -10968 -16857 -21041 -22315 -20517 -16697 -12173 -7629 -2804 2853 9281 15381 19594 20999
796B0999j151k715l359l913n008o325o986o170l939j276P54J828K488L459N002
$$ 20999 19848 17133 13774 9861 4853 -1472 -8458 -14628 -18567 -19843 -19089 -17261 -14773 -11314 -6312
811f312O336O689N612L639J742N06l36j507l337n409o723o524n124l323k015j308
$$ -6312 24 6713 12325 15964 17706 18212 17876 16369 13032 7623 900 -5624 -10748 -14071 -16086 -17394
827a7394m96J031L268N330O282N830M614L469K886K452J405o98l307n388o110
$$ -17394 -17890 -16859 -13591 -8261 -1979 3851 8465 11934 14820 17272 18677 17979 14672 9284 3174
842C174n583m556l833l432k815j426Q01L121M685N147M856M540M491M338L483
$$ 3174 -2409 -6965 -10798 -14230 -17045 -18471 -17670 -14549 -9864 -4717 139 4679 9170 13508 16991
857A6991J615p84k906m148m509m531m706m956m677l416j387P90K291L006L362
$$ 16991 18606 17822 14916 10768 6259 1728 -2978 -7934 -12611 -16027 -17414 -16624 -14333 -11327 -7965
872g965L886M724N383N132L743J610l33j664k348k974l915m895n406m902l432
$$ -7965 -4079 645 6028 11160 14903 16513 16180 14516 12168 9194 5279 384 -5022 -9924 -13356
887a3356j641k03P23J448K442L788M999N446M920L652K165R51p4j210k629m094
$$ -13356 -14997 -15200 -14477 -13029 -10587 -6799 -1800 3646 8566 12218 14383 15334 15260 14050 11421 7327
903G327n058n172m461l391k384j541o41O77K303L885M839M957M440L690K942K092
$$ 7327 2269 -2903 -7364 -10755 -13139 -14680 -15321 -14644 -12341 -8456 -3617 1340 5780 9470 12412 14504
919A4504R67o07k341l734m400m400l994l534l162k510j426J40J779L072L818M012
$$ 14504 15471 14864 12523 8789 4389 -11 -4005 -7539 -10701 -13211 -14637 -14497 -12718 -9646 -5828 -1816
935a816M049L923L647K874J537q3j636k710l336l549l774l901l726l108j879m50
$$ -1816 2233 6156 9803 12677 14214 14131 12495 9785 6449 2900 -874 -4775 -8501 -11609 -13488 -13938
951a3938R70K108K950L605M108M289M003L184J923N39p26j782k672l408l925m139
$$ -13938 -12968 -10860 -7910 -4305 -197 4092 8095 11279 13202 13741 13015 11233 8561 5153 1228 -2911
967b911l859l181k195j104KJ174K283L370M050M299L963L166K184J171J78q03
$$ -2911 -6770 -9951 -12146 -13250 -13248 -12074 -9791 -6421 -2371 1928 5891 9057 11241 12412 12590 11787
983A1787j792k799l538l902l807l265k532j643p42K77J372K473L370L861L917
$$ 11787 9995 7196 3658 -244 -4051 -7316 -9848 -11491 -12233 -11956 -10584 -8111 -4741 -880 3037
998C037L438K690J741P75j92j115j985k768l350l705l655l205k358j239r6J009
$$ 3037 6475 9165 10906 11681 11489 10374 8389 5621 2271 -1434 -5089 -8294 -10652 -11891 -11987 -10978
1014a0978J942K748L346L701L695L229K415J357K65p42j604k418l038l420l551
$$ -10978 -9036 -6288 -2942 759 4454 7683 10098 11455 11720 10978 9374 6956 3918 498 -3053
1029c053l262k718j921q95K71J443K551L221L397L228K820K431K015J376L92r12
$$ -3053 -6315 -9033 -10954 -11849 -11578 -10135 -7584 -4363 -966 2262 5082 7513 9528 10904 11296 10384
1045A0384k162k979l148l015k775k611k462j867p46P10K034K861L019K915K795
$$ 10384 8222 5243 2095 -920 -3695 -6306 -8768 -10635 -11381 -10671 -8637 -5776 -2757 158 2953
1060B953K650K470J857Q54l47j385k137k641l025l320l256k765j814o53L22J074
$$ 2953 5603 8073 9930 10784 10437 9052 6915 4274 1249 -2071 -5327 -8092 -9906 -10559 -10237 -9163
1076i163J660K314K990L508L415K714J664O66J7m57r81j891k931l674l706k892
$$ -9163 -7503 -5189 -2199 1309 4724 7438 9102 9768 9785 9328 8347 6456 3525 -149 -3855 -6747
1092f747j799p82j72K54P81J662K648L295L360K751J945J239P80K88m77j557k594
$$ -6747 -8546 -9328 -9500 -9246 -8465 -6803 -4155 -860 2500 5251 7196 8435 9215 9503 9026 7469 4875
1109D875l184l227k710k106j642j146n04N19J614K507K784K672K400K201K187
$$ 4875 1691 -1536 -4246 -6352 -7994 -9140 -9644 -9125 -7511 -5004 -2220 452 2852 5053 7240
1124G240J866J027l66j703k593k692k472k324k372k477k100j022M56J704K215
$$ 7240 9106 10133 9767 8064 5471 2779 307 -2017 -4389 -6866 -8966 -9988 -9532 -7828 -5613
1139e613K116J926K156K652K915K494J204l19j469j850j843j883k373k938k949
$$ -5613 -3497 -1571 585 3237 6152 8646 9850 9531 8062 6212 4369 2486 113 -2825 -5774
1154e774k254r19K86R80J108J214J693K488L188L041K217J034J40l30o38j197
$$ -5774 -8028 -8947 -8661 -7681 -6573 -5359 -3666 -1178 2010 5051 7268 8302 8442 8112 7474 6277
1170F277k088k923l228k637j662q43m82m16o7R02K185L072L155K420J524J125
$$ 6277 4189 1266 -1962 -4599 -6261 -7104 -7586 -8002 -8069 -7167 -4982 -1910 1245 3665 5189 6314
1186F314J133J072L07j109k569l222k876j934j195j166j512j490n91R41K287K816
$$ 6314 7447 8519 8826 7717 5148 1926 -950 -2884 -4079 -5245 -6757 -8247 -8838 -7897 -5610 -2794
1202b794K467J912J634J812J988J515K93j172k158k300j965j781j931k178k110
$$ -2794 -327 1585 3219 5031 7019 8534 8827 7655 5497 3197 1232 -549 -2480 -4658 -6768
1217f768j313j05R66J441J463J526J984K671K885K340J050l06j073j115r42j160
$$ -6768 -8081 -8186 -7220 -5779 -4316 -2790 -806 1865 4750 7090 8140 7834 6761 5646 4704 3544
1233C544j890k813l006k256r79K03O12N05M66J022K092L059L161K223R56m9l22
$$ 3544 1654 -1159 -4165 -6421 -7400 -7197 -6585 -6080 -5614 -4592 -2500 559 3720 5943 6899 6850 6528
1250F528k39l88j130k104k779k673j834j009n78n57l83L32J515K508K824K355
$$ 6528 6289 5901 4771 2667 -112 -2785 -4619 -5628 -6206 -6763 -7146 -6814 -5299 -2791 33 2388
1266B388J485J020J027J086O04n39j870k554k375j677j154j235j701j811r12O40
$$ 2388 3873 4893 5920 7006 7610 7071 5201 2647 272 -1405 -2559 -3794 -5495 -7306 -8218 -7578
1282g578K075K572K152J473J196J541J961J790O98p99j810j945j437j153j416
$$ -7578 -5503 -2931 -779 694 1890 3431 5392 7182 7880 7081 5271 3326 1889 736 -680
1297f80k057k338j856n96P15J402J396J143J270J882K407K264J424K17n97p92
$$ -680 -2737 -5075 -6931 -7527 -6812 -5410 -4014 -2871 -1601 281 2688 4952 6376 6593 5996 5204
1313E204o01o81j311k226k736k326j317k41K64L03K90Q19J741K570K695J892Q76
$$ 5204 4603 3922 2611 385 -2351 -4677 -5994 -6235 -5971 -5668 -5378 -4559 -2818 -248 2447 4339 5215
1330E215J95J51L25J15p92j947k673k552j674q49n34p25p27p6J116K250K607K096
$$ 5215 5410 5561 5886 6001 5209 3262 589 -1963 -3637 -4486 -5020 -5745 -6472 -6548 -5432 -3182 -575 1521
1348A521J198O60P99J156J115K49j061k031k196j761j229j106j345j492j035O3
$$ 1521 2719 3379 4178 5334 6449 6698 5637 3606 1410 -351 -1580 -2686 -4031 -5523 -6558 -6495
1364f495J228J803J652J279J154J428J733J644Q74k12j031j252j067j063j510
$$ -6495 -5267 -3464 -1812 -533 621 2049 3782 5426 6300 6088 5057 3805 2738 1675 165
1379A65k105k271j674n01O22J115R34O35Q02J532K301K368J611M27m79o95m63
$$ 165 -1940 -4211 -5885 -6386 -5764 -4649 -3715 -3080 -2278 -746 1555 3923 5534 5961 5482 4787 4324
1396D324m03r36j825k531k327j412l53L02L57K06L80J003J768K203J897J171N60
$$ 4324 3921 2985 1160 -1371 -3698 -5110 -5463 -5161 -4804 -4598 -4218 -3215 -1447 756 2653 3824 4384
1413D384L95M01K22m81j370k025k090j565r49o54p47p88l19N96J500J894J703
$$ 4384 4779 5180 5402 4921 3551 1526 -564 -2129 -3078 -3732 -4479 -5267 -5586 -4990 -3490 -1596 107
1430A07J178Q77J036J267J177M46p38j666j906j595j159j009j205j342j033k02
$$ 107 1285 2162 3198 4465 5642 6088 5350 3684 1778 183 -976 -1985 -3190 -4532 -5565 -5767
1446e767P85J384J377J164J094J352J662J576J020L9p62j111j041r99j252j654
$$ -5767 -4982 -3598 -2221 -1057 37 1389 3051 4627 5647 5686 4924 3813 2772 1773 521 -1133
1462a133j816j438o79J16N39N40M67O65J267J897K045J548P19K3k56k83l85p89
$$ -1133 -2949 -4387 -5066 -4950 -4411 -3871 -3404 -2739 -1472 425 2470 4018 4737 4760 4504 4221 3836 3047
1480C047j420j921j858j292o28j97j06p5J93P90J482J885J800J337Q34N23L97
$$ 3047 1627 -294 -2152 -3444 -4072 -4269 -4375 -4450 -4257 -3467 -1985 -100 1700 3037 3871 4394 4791
1497D791J15m34j075j564j710j448j072q24p68p24l87L15J048J499J567J355J115
$$ 4791 4906 4472 3397 1833 123 -1325 -2397 -3221 -3989 -4713 -5100 -4785 -3737 -2238 -671 684 1799
1514A799J081J082R04L78m31j134j386j300j052r43j112j244j099n92J86Q48J111
$$ 1799 2880 3962 4866 5244 4813 3679 2293 993 -59 -1002 -2114 -3358 -4457 -5049 -4863 -4015 -2904
1531b904J112J141J197J402J379J049M34k25o76q46q97j025j276j437j361r70
$$ -2904 -1792 -651 546 1948 3327 4376 4810 4585 3909 3063 2166 1141 -135 -1572 -2933 -3903
1547c903n05p6K33N15Q48J292J632J672J301P58L35R6o8k93p27j214j579j557
$$ -3903 -4408 -4484 -4251 -3736 -2888 -1596 36 1708 3009 3767 4102 4198 4130 3837 3110 1896 317 -1240
1565a240j224p99n19m02k36J36P42J292J634J592J248Q45N68L67J88j26n72r66
$$ -1240 -2464 -3263 -3782 -4184 -4420 -4284 -3542 -2250 -616 976 2224 3069 3637 4004 4192 4066 3494 2528
1583B528j262j371j297j129q68o11k85R8M99Q57J178J369J378J229R16N65K19
$$ 2528 1266 -105 -1402 -2531 -3399 -4010 -4295 -4197 -3698 -2841 -1663 -294 1084 2313 3229 3794 4013
1600D013p7l38n99q62j148j339j356j179q35m35l6L59O57R08J128J263J268J139
$$ 4013 3936 3598 2999 2137 989 -350 -1706 -2885 -3720 -4155 -4191 -3832 -3175 -2267 -1139 124 1392 2531
1618B531Q65N14J32k31n27p16r71j149j274j268j087p47k96J60N95Q27R97J091
$$ 2531 3396 3910 4042 3811 3284 2568 1597 448 -826 -2094 -3181 -3928 -4224 -4064 -3469 -2642 -1645 -554
1636e54J117J122J015P90M41O5l42o51q64j050j152j207j138r15n69j29L16O28
$$ -554 563 1685 2700 3490 3931 3996 3654 3003 2139 1089 -63 -1270 -2408 -3323 -3892 -4021 -3705 -3077
1654c077Q13R70J042J100J067R05O48L01k5l39o14q72j148j286j223r72o25k62
$$ -3077 -2264 -1294 -252 848 1915 2820 3468 3769 3744 3405 2791 1919 771 -515 -1738 -2710 -3335 -3597
1672c597oK42M65P88J075J237J184R32O34L86K32L0l01p67j180j408j288r44o06
$$ -3597 -3603 -3361 -2896 -2108 -1033 204 1388 2320 2954 3340 3572 3602 3301 2534 1354 -54 -1342 -2286 -2892
1691b892l77k30o3K81P04J078J212J099Q54O87O46N33K73k05p54j099j202j012
$$ -2892 -3269 -3499 -3562 -3281 -2577 -1499 -287 812 1666 2353 2999 3532 3805 3600 2846 1747 545 -467
1709d67q33p53p58o22k63K53P06Q58Q19P13P64J009J102R02L98k54o80p54o91
$$ -467 -1300 -2053 -2811 -3433 -3696 -3443 -2737 -1879 -1060 -347 417 1426 2528 3430 3828 3574 2894 2140 1449
1728A449o90q74j147j165q18j99K84M78M29L74N89R99J350J293Q29K17j86l31
$$ 1449 759 -115 -1262 -2427 -3245 -3444 -3160 -2682 -2253 -1879 -1290 -291 1059 2352 3181 3398 3212 2881
1746B881l18m34q02j196j336j049n46j18J6j9N6L46Q71J242J279R55N33L44L15
$$ 2881 2563 2129 1327 131 -1205 -2254 -2800 -2918 -2902 -2921 -2865 -2519 -1648 -406 873 1828 2361 2705 3020
1765C020K81k5n79j080j219j011n97l85m76o45n90j51N14J008J084Q33N65N75
$$ 3020 3301 3276 2697 1617 398 -613 -1210 -1595 -2071 -2716 -3306 -3457 -2943 -1935 -851 -18 547 1122
1783A122P73R35O54L5o62j024r60o45m30n51q67r74p10p5N21Q07P88O30O25Q47
$$ 1122 1895 2830 3484 3519 2857 1833 873 228 -202 -753 -1620 -2594 -3304 -3379 -2858 -2051 -1263 -633 -8 839
1803H39J063R54M84j44n70o71n45m90o57r81j090q47l28J32L32K47K09M41R15
$$ 839 1902 2856 3340 3196 2626 1955 1410 920 263 -718 -1808 -2655 -2983 -2851 -2519 -2272 -2063 -1622 -707
1822g07J322J276P44J03k56j95M8Q0l41r44j322j182o41j26j7k23m10j28N04J156
$$ -707 615 1891 2635 2738 2482 2287 2335 2415 2074 1130 -192 -1374 -2015 -2141 -2158 -2381 -2791 -2919 -2415 -1259
1842a259J370J031N18J70K26M31L92n0o61j090j037o78m00m45o72p33l80L32R65
$$ -1259 111 1142 1660 1830 2056 2487 2879 2829 2168 1078 41 -637 -1037 -1482 -2154 -2887 -3267 -2935 -1970
1861a970J137Q73M81L50N72Q21P18K19n13r27q61n18k87m55q27j062q23j77M95
$$ -1970 -833 40 521 871 1443 2264 2982 3201 2688 1761 900 382 95 -360 -1187 -2249 -3072 -3249 -2754
1880b754Q07O78M17L75O28R52R78O05M2l33l76j98j74m46r38j215j043m88J6K02
$$ -2754 -1947 -1269 -852 -477 151 1103 2081 2686 2728 2395 2019 1821 1647 1201 263 -952 -1995 -2483 -2467 -2265
1900b265Q5l1J82P11J212J264P86J72j87l9K73L48j45q65j398j302p20r7J06j27
$$ -2265 -2180 -2211 -2029 -1318 -106 1158 1944 2116 1929 1890 2163 2511 2366 1501 103 -1199 -1919 -2016 -1910 -2037
1920b037l71k16L61J045J306J008M26K9J09M08N31J86m69r87j061p40m22l44n27
$$ -2037 -2408 -2624 -2263 -1218 88 1096 1522 1551 1660 2068 2599 2785 2316 1329 268 -472 -894 -1238 -1765
1939a765o62m38J15O80Q57O75L54L03N69Q59Q65M45j58n88o20l81l06m98r16j109
$$ -1765 -2427 -2865 -2750 -2070 -1213 -538 -184 119 688 1547 2412 2857 2699 2111 1491 1110 804 306 -610 -1719
1959a719q57k23L74O20M39J55J69N46J023J154P73J63l39m10k15r2l19q11j201
$$ -1719 -2576 -2799 -2425 -1805 -1366 -1211 -1042 -496 527 1681 2454 2617 2278 1868 1653 1561 1242 431 -770
1978g70j123n72L8L69K87L2J7L56Q56J125R31M53L2m3J20J65j18o05j019j061
$$ -770 -1893 -2465 -2427 -2058 -1771 -1739 -1722 -1366 -510 615 1546 1999 2031 1988 2108 2273 2155 1550 531 -530
1998e30p07k81j18k40l76k18K30P13R19P19L96L05M75P12O76J87m85r45r25n49
$$ -530 -1237 -1518 -1636 -1876 -2252 -2470 -2240 -1527 -608 111 507 812 1287 1999 2675 2862 2377 1432 507 -42
2018d2k14k90n91q49o62p7N71Q47P16L33J96M09P99R44O42L7n78p82o49m12l20
$$ -42 -256 -546 -1137 -1986 -2648 -2725 -2154 -1307 -591 -258 -62 347 1146 2090 2732 2769 2191 1409 760 348 28
2039B8m85p28p08m48k7L03M12L67L91N22P46Q04O45L35M0j03j64k22m37p54q96
$$ 28 -457 -1185 -1893 -2341 -2368 -2065 -1653 -1286 -895 -373 373 1177 1822 2157 2197 2094 1930 1708 1271 517 -379
2060c79p89m12r1oj49k76j21L64R06J169R52M14J3j9J95L63J46m05r50j128q29
$$ -379 -1168 -1580 -1671 -1677 -1826 -2102 -2223 -1859 -953 216 1168 1582 1595 1576 1771 2134 2280 1875 925 -203 -1032
2081a032l15Ro4l08m47j43L98Q48R78P72M77K89K87L01J35j80m86o14n50m63m88
$$ -1032 -1347 -1338 -1402 -1710 -2157 -2300 -1902 -1054 -76 696 1173 1462 1749 2050 2185 2005 1519 905 355 -108 -596
2102e96n70o13m18n2L05M57L78L34L91O35Q73Q19M20r9m44m71k67j22k37n65q84
$$ -596 -1166 -1779 -2197 -2249 -1944 -1487 -1109 -775 -384 251 1124 1943 2363 2264 1820 1349 1082 960 723 158 -726
2123g26q83n29q8K43L22K55K48L91O75Q39P45M37J11j08j98k12k96m54o26o68
$$ -726 -1609 -2138 -2226 -1983 -1661 -1406 -1158 -767 -92 747 1492 1929 2040 1932 1734 1522 1226 772 146 -522
2143e22o12m23k65j78m5J50M31O71P64O71M49K74K08K18J80l4l44o19o83o17m55
$$ -522 -1134 -1557 -1822 -2000 -2045 -1895 -1464 -793 -29 642 1091 1365 1573 1791 1971 1937 1593 974 291 -326 -781
2164g81l41l49l55k66JL43O08P08O17M69L71L58L31K16J8k36m30m97n14n32n51
$$ -781 -1122 -1471 -1826 -2092 -2091 -1748 -1140 -432 185 654 1025 1383 1714 1930 1948 1712 1282 785 271 -261 -812
2185h12n70m37k26N0K88M26M63M41N12N76N39M36K08l1j87k86l28l96n23o35o56
$$ -812 -1382 -1819 -2045 -1995 -1707 -1281 -818 -377 135 711 1250 1686 1894 1863 1676 1390 1062 666 143 -492 -1148
2206a148n30k69mK04K89L72M37N13N36N26M36K75J52Pj35k91m69n83o03n49m36
$$ -1148 -1678 -1947 -1951 -1747 -1458 -1086 -649 -136 400 926 1362 1637 1789 1796 1661 1370 901 318 -285 -834 -1270
2227a270k98k18o2J10L16N05N66N43M43L58L27K83K12L2k02m16n82o08n80m66
$$ -1270 -1568 -1786 -1848 -1738 -1422 -917 -351 192 635 993 1320 1603 1815 1847 1645 1229 647 39 -541 -1007
2247a007l62k43j22J2J73L12M40N37N65N05M11K57J63P5l9j71m17n83p00o33m29
$$ -1007 -1369 -1612 -1734 -1722 -1549 -1237 -797 -260 305 810 1221 1478 1641 1716 1677 1506 1089 506 -194 -827 -1256
2268a256k23q2k9K4J38L05M82N87N66M55L36K36J59M0j49l57n25n84n43m47l80
$$ -1256 -1479 -1561 -1590 -1566 -1428 -1123 -641 -54 512 967 1303 1539 1698 1738 1589 1232 707 123 -420 -867 -1247
2289a247k75j57rJ95L57L98L85L99M38N29M90L28N3k50m22m31l80l49m34n29n15
$$ -1247 -1522 -1679 -1688 -1493 -1136 -738 -353 46 484 1013 1503 1831 1884 1634 1212 781 401 52 -382 -911 -1426
2310a426l17l7K23L43L05K49L01M69O16O08L97J05j52k86l09l40l93n07n42m68
$$ -1426 -1743 -1780 -1557 -1214 -909 -660 -359 110 726 1334 1731 1836 1684 1398 1089 749 356 -151 -693 -1161
2330a161k84j08K1Q2J45K93M62N71N74M47K85J77J37J2j61m06n86o05m71k73j73
$$ -1161 -1445 -1553 -1532 -1450 -1305 -1012 -550 21 595 1042 1327 1504 1641 1653 1492 1086 500 -105 -576 -849 -1022
2351a022k06k59k17L4L61N95O25M79K86K49K91L58K38q7m30o37n60l57j90k10
$$ -1022 -1228 -1487 -1704 -1670 -1309 -714 -89 390 676 925 1216 1574 1812 1725 1295 658 98 -259 -449 -659
2371f59l47m49l31kL63N52N08L66K74L55M65M61K41r3l93m63l80k59k78m08n08
$$ -659 -1006 -1455 -1786 -1788 -1425 -873 -365 1 275 630 1095 1556 1797 1704 1311 848 468 209 -69 -477 -985
2392i85m56j91O6K15K40K49L38N11O31N67K91j4j52j22k7p5l24o15p26n24j86
$$ -985 -1441 -1632 -1566 -1351 -1111 -862 -524 -13 618 1185 1476 1462 1310 1188 1161 1086 762 147 -579 -1103 -1289
2413a289N4N6r4j62M4M30P70Q15N29J23j25q1J27J75Pl68o48o83m71k06r1j19
$$ -1289 -1235 -1179 -1273 -1435 -1391 -961 -191 624 1153 1276 1151 1070 1197 1372 1379 1011 363 -320 -791 -997 -1088 -1207
2435a207j86j22J18M11N82N54L91K76K43K31J75j4k40l84l60k78k41l55n15n45
$$ -1207 -1393 -1515 -1397 -986 -404 150 541 817 1060 1291 1466 1452 1212 828 468 190 -51 -406 -921 -1466
2455a466k98R8M32M85L22J37J33L63O08O11K88j48m49m22j48K7j14m67p41o88
$$ -1466 -1764 -1666 -1234 -749 -427 -290 -157 206 814 1425 1713 1565 1116 694 546 573 459 -8 -749 -1437
2475a437k75J48M16L32J38P2K32N16O28M70J32j27j58o3%j50m16o40n87l35q1
$$ -1437 -1712 -1564 -1148 -816 -678 -606 -374 142 770 1240 1372 1245 1087 1024 1024 874 458 -182 -769 -1104 -1185
2496a185J7l9r0N3L32N79O17L96J18%J19K86K92J5m01o42o20l55j14q5k53l69
$$ -1185 -1168 -1207 -1297 -1244 -912 -333 284 680 798 798 917 1203 1495 1510 1109 467 -153 -508 -622 -707 -960 -1329
2518a329k59R5M82O33M90J84N6J42L60M74K86j11m48n56l88k00j67l14m53m01
$$ -1329 -1588 -1493 -1011 -378 112 296 352 494 854 1328 1614 1503 1055 499 111 -89 -256 -570 -1023 -1424
2538a424j05K54M33L76J80J09K36M42N25L39K7k25k38j69q6k15m89o38n07j64
$$ -1424 -1529 -1275 -842 -466 -286 -177 59 501 1026 1365 1392 1167 929 760 674 459 -30 -668 -1175 -1339
2558a339J48K40Q9p0k6K62N78O81M75J06j10o4J15J62l2m27p05o77l81j9J09k
$$ -1339 -1191 -951 -862 -932 -958 -696 -118 563 1038 1144 1034 970 1085 1247 1215 788 83 -594 -975 -994 -885 -887
2580h87j89j59P2M11N91N22K87J06R9J79K25O5k39m85n28l80k00j05j96k69k00
$$ -887 -1076 -1235 -1163 -752 -161 361 648 754 853 1032 1257 1322 1083 598 70 -310 -510 -615 -811 -1080 -1280
2601a280J5K95M17L65K11J38K49M00M23K55r1l91m58k95j26j06l00m59m59k16
$$ -1280 -1265 -970 -553 -188 23 161 410 810 1233 1488 1397 1006 548 253 127 21 -279 -738 -1197 -1413
2621a413R7L23L03J32N2J98M57O16M93J85j54l02k09q5j15k96m99n36l39m1J13
$$ -1413 -1316 -993 -690 -558 -506 -308 149 765 1258 1443 1289 987 778 693 578 282 -217 -753 -1092 -1133 -1020
2642a020R9Lk7J93M57N97N00K20j6o9K0N2m7l10n13m91l05m9Pj04k42j92P9L82
$$ -1020 -921 -918 -945 -752 -295 302 802 1022 1006 937 957 1009 962 652 139 -352 -657 -706 -699 -803 -1045 -1237 -1158 -776
2666g76N47M77K61P8J09K28K78J27j63m21m70l32j48j21k20l67l39j71J38L76
$$ -776 -229 248 509 587 696 924 1202 1329 1166 745 275 -57 -205 -326 -546 -913 -1252 -1423 -1285 -909
$$ [...]
8191a44
##END NTUPLES=NMR FID
##END=
