##TITLE=1H_AM_NV55.1
 aceton-d6
 8 sc, 
 7.9.2023
##JCAMPDX= 6.0         $$ Bruker NMR JCAMP-DX V2.0
##DATA TYPE= NMR FID
##DATA CLASS= NTUPLES
##ORIGIN= UXNMR, Bruker Analytische Messtechnik GmbH
##OWNER= root
$$ XWIN-NMR		Version 3.5
$$ Thu Sep  7 14:29:21 2023 Russian Standard Time (UT+4h)  she@DPX200
##.OBSERVE FREQUENCY= 200.13135
##.OBSERVE NUCLEUS= ^1H
##.DELAY= (6, 6)
##.ACQUISITION MODE= SIMULTANEOUS
##.ACQUISITION SCHEME= undefined
##.AVERAGES= 8
##.DIGITISER RES= 18
##SPECTROMETER/DATA SYSTEM= spect
##.PULSE SEQUENCE= zg30
##.SOLVENT NAME= Acetone
##.SHIFT REFERENCE= (INTERNAL, Acetone, 0, 15.7039)
##AUDIT TRAIL= $$ (NUMBER, WHEN, WHO, WHERE, WHAT)
$$ ##TITLE= Audit trail, XWIN-NMR		Version 3.5
$$ ##JCAMPDX= 5.01
$$ ##ORIGIN= Bruker BioSpin GmbH
$$ ##OWNER= she
$$ F:/spectra/data/she/nmr/H-F/1/audita.txt
$$ ##AUDIT TRAIL=  $$ (NUMBER, WHEN, WHO, WHERE, WHAT)
(   1,<2023-09-07 14:27:57.15 +0400>,<she>,<DPX200>,
      <created by zg, POWCHK disabled, PULCHK disabled
       configuration hash MD5:
       00 E9 B6 7A A2 85 ED C7 34 08 36 98 17 FE 4E 26
       data hash MD5: 16K
       8A CD 50 43 28 CD EE 78 C0 25 91 A5 85 F3 75 83>)
$$ ##END=
$$ 
$$ hash MD5
$$ F8 99 45 CF F9 E7 81 44 53 93 B8 B6 C3 33 3E 98
##$RELAX= 
##$RELAX= 
##$RELAX= 
##$RELAX= 
##$RELAX= 
##$RELAX= 
$$ Bruker specific parameters
$$ --------------------------
##$DU= <F:/spectra>
##$EXPNO= 1
##$NAME= <H-F>
##$PROCNO= 1
##$TYPE= <nmr>
##$USER= <she>
##$AMP= (0..31)
100 100 100 100 100 100 100 100 100 100 100 100 100 100 100 100 100 100 
100 100 100 100 100 100 100 100 100 100 100 100 100 100 
##$AQSEQ= 0
##$AQ_mod= 1
##$AUNM= <au_zg>
##$AUTOPOS= <>
##$BF1= 200.13
##$BF2= 200.13
##$BF3= 200.13
##$BF4= 200.13
##$BF5= 200.13
##$BF6= 200.13
##$BF7= 200.13
##$BF8= 200.13
##$BYTORDA= 1
##$CFDGTYP= 0
##$CFRGTYP= 5
##$CHEMSTR= <none>
##$CNST= (0..31)
1 1 145 1 1 1 1 1 1 1 1 1 1 1 1 1 1 1 1 1 1 1 1 1 1 1 1 1 1 1 1 1 
##$CPDPRG= <>
##$CPDPRG1= <>
##$CPDPRG2= <>
##$CPDPRG3= <>
##$CPDPRG4= <mlev>
##$CPDPRG5= <mlev>
##$CPDPRG6= <mlev>
##$CPDPRG7= <mlev>
##$CPDPRG8= <mlev>
##$CPDPRGB= <>
##$CPDPRGT= <>
##$D= (0..31)
0 1.2 0 0 0 0 0 0 0 0.06 0 0.03 0 0 0 0 0.0002 0 0 0 0 0 0 0 0 0 0 0 0 
0 0 0 
##$DATE= 1694082476
##$DBL= (0..7)
120 120 120 120 120 120 120 120 
##$DBP= (0..7)
150 150 150 150 150 150 150 150 
##$DBP07= 0
##$DBPNAM0= <>
##$DBPNAM1= <>
##$DBPNAM2= <>
##$DBPNAM3= <>
##$DBPNAM4= <>
##$DBPNAM5= <>
##$DBPNAM6= <>
##$DBPNAM7= <>
##$DBPOAL= (0..7)
0.5 0.5 0.5 0.5 0.5 0.5 0.5 0.5 
##$DBPOFFS= (0..7)
0 0 0 0 0 0 0 0 
##$DE= 6
##$DECBNUC= <off>
##$DECIM= 32
##$DECNUC= <off>
##$DECSTAT= 4
##$DIGMOD= 1
##$DIGTYP= 9
##$DL= (0..7)
0 120 120 120 120 120 120 120 
##$DP= (0..7)
150 150 150 150 150 150 150 150 
##$DP07= 0
##$DPNAME0= <>
##$DPNAME1= <>
##$DPNAME2= <>
##$DPNAME3= <>
##$DPNAME4= <>
##$DPNAME5= <>
##$DPNAME6= <>
##$DPNAME7= <>
##$DPOAL= (0..7)
0.5 0.5 0.5 0.5 0.5 0.5 0.5 0.5 
##$DPOFFS= (0..7)
0 0 0 0 0 0 0 0 
##$DQDMODE= 0
##$DR= 18
##$DS= 0
##$DSLIST= <SSSSSSSSSSSSSSS>
$$ [...]
##$SUBNAM2= <"">
##$SUBNAM3= <"">
##$SUBNAM4= <"">
##$SUBNAM5= <"">
##$SUBNAM6= <"">
##$SUBNAM7= <"">
##$SUBNAM8= <"">
##$SUBNAM9= <"">
##$SW= 18.05172834244
##$SWIBOX= (0..15)
0 0 2 0 0 0 0 0 0 0 0 0 0 0 0 0 
##$SW_h= 3612.71676300578
##$TD= 16384
##$TD0= 1
##$TE= 0
##$TE2= 300
##$TE3= 300
##$TEG= 300
##$TL= (0..7)
0 120 120 120 120 120 120 120 
##$TP= (0..7)
150 150 150 150 150 150 150 150 
##$TP07= 0
##$TPNAME0= <>
##$TPNAME1= <>
##$TPNAME2= <>
##$TPNAME3= <>
##$TPNAME4= <>
##$TPNAME5= <>
##$TPNAME6= <>
##$TPNAME7= <>
##$TPOAL= (0..7)
0.5 0.5 0.5 0.5 0.5 0.5 0.5 0.5 
##$TPOFFS= (0..7)
0 0 0 0 0 0 0 0 
##$TUNHIN= 0
##$TUNHOUT= 0
##$TUNXOUT= 0
##$USERA1= <user>
##$USERA2= <user>
##$USERA3= <user>
##$USERA4= <user>
##$USERA5= <user>
##$V9= 5
##$VALIST= <valist>
##$VCLIST= <CCCCCCCCCCCCCCC>
##$VD= 0
##$VDLIST= <DDDDDDDDDDDDDDD>
##$VPLIST= <PPPPPPPPPPPPPPP>
##$VTLIST= <TTTTTTTTTTTTTTT>
##$WBST= 1024
##$WBSW= 4
##$XGAIN= (0..3)
0 0 0 0 
##$XL= 0
##$YL= 0
##$YMAX_a= 772078
##$YMIN_a= -825396
##$ZGOPTNS= <>
##$ZL1= 120
##$ZL2= 120
##$ZL3= 120
##$ZL4= 120
##$ABSF1= 10
##$ABSF2= 0
##$ABSG= 5
##$ABSL= 3
##$ALPHA= 0
##$AQORDER= 0
##$ASSFAC= 0
##$ASSFACI= 0
##$ASSFACX= 0
##$ASSWID= 0
##$AUNMP= <proc_1d>
##$AZFE= 0.1
##$AZFW= 0.1
##$BCFW= 1
##$BC_mod= 2
##$BYTORDP= 1
##$COROFFS= 0
##$CY= 11.3945322036743
##$DATMOD= 1
##$DC= 2
##$DFILT= <>
##$DTYPP= 0
##$F1P= 15.7292609196834
##$F2P= 12.9074282941183
##$FCOR= 0.5
##$FTSIZE= 0
##$FT_mod= 4
##$GAMMA= 1
##$GB= 0.15
##$INTBC= 1
##$INTSCL= 1
##$ISEN= 128
##$LB= 0.24
##$LEV0= 0
##$LPBIN= 0
##$MAXI= 10000
##$MC2= 0
##$MEAN= 0
##$ME_mod= 0
##$MI= 1.114404
##$NCOEF= 0
##$NC_proc= 0
##$NLEV= 6
##$NOISF1= 3.799351
##$NOISF2= 2.8
##$NSP= 1
##$NTH_PI= 0
##$NZP= 0
##$OFFSET= 15.70392
##$PC= 1
##$PHC0= -21047.02
##$PHC1= 8.852709
##$PH_mod= 1
##$PKNL= yes
##$PPARMOD= 0
##$PSCAL= 0
##$PSIGN= 0
##$REVERSE= no
##$SF= 200.130013532006
##$SI= 16384
##$SIGF1= 3
##$SIGF2= 2
##$SINO= 400
##$SIOLD= 16384
##$SREGLST= <1H.CDCl3>
##$SSB= 0
##$STSI= 0
##$STSR= 0
##$SW_p= 3612.71676300578
##$SYMM= 0
##$S_DEV= 0
##$TDeff= 0
##$TDoff= 0
##$TI= <>
##$TILT= no
##$TM1= 0
##$TM2= 0
##$TOPLEV= 0
##$USERP1= <user>
##$USERP2= <user>
##$USERP3= <user>
##$USERP4= <user>
##$USERP5= <user>
##$WDW= 1
##$XDIM= 8192
##$YMAX_p= 0
##$YMIN_p= 0
$$ End of Bruker specific parameters
$$ ---------------------------------
##NTUPLES= NMR FID
##VAR_NAME=  TIME,          FID/REAL,        FID/IMAG
##SYMBOL=    X,             R,               I
##VAR_TYPE=  INDEPENDENT,   DEPENDENT,       DEPENDENT
##VAR_FORM=  AFFN,          ASDF,            ASDF
##VAR_DIM=   8192,          8192,            8192
##UNITS=     SECONDS,       ARBITRARY UNITS, ARBITRARY UNITS
##FACTOR=    0.0002768,     1,               1
##FIRST=     0,             0,               0
##LAST=      2.2672688,     0,               0
##MIN=       0,             -825396,         0
##MAX=       2.2672688,     772078,          0
$$ Real data points
##PAGE= N=1
##DATA TABLE= (X++(R..R)), XYDATA
0 0 0 0 0 0 0 0 8 0 8 -8 8 -16 16 -24 24 -34 41 -51 63 -75 91 -108 131 -149 179 -206 242 -280 322 -369 421
31 421 -480 546 -618 698 -789 883 -989 1105 -1235 1374 -1527 1693 -1873 2076 -2291 2529
47 2529 -2787 3073 -3385 3729 -4109 4529 -4999 5523 -6118 6791 -7569 8471 -9535 10815
61 10815 -12389 14379 -16982 20561 -25799 34258 -50238 91338 -436760 -825396 -236042
72 -236042 -53973 119289 255969 572364 736112 772078 604252 397780 178001 118880
82 118880 82352 -68082 -372301 -515371 -404631 -201421 -153262 -173642 -142574 -20797 100122
93 100122 179842 130505 -22627 -120601 -4709 175494 191770 55793 4078 96559 188108
104 188108 154638 33721 -105186 -186598 -161366 -91241 -139991 -307742 -371376 -195177 51772
115 51772 163382 172206 222413 330221 419008 425156 304189 68742 -134477 -172102 -136573
126 -136573 -224226 -414840 -488464 -360051 -174012 -57719 7849 76149 171639 307804 424889
137 424889 387610 181235 524 -7222 41729 -28149 -178093 -245059 -187005 -83892 -5726
148 -5726 9760 -37465 -59783 33083 159614 139201 -31909 -153700 -115094 -26167 -10843 -44866
160 -44866 -47538 12098 125743 237193 237484 104198 -16465 248 62392 5911 -149141 -245384
172 -245384 -218591 -136905 -71775 -45493 -47513 -15936 109576 259280 272811 130880 1186
183 1186 -3472 29626 -14626 -115576 -182860 -172381 -89146 16948 54223 -2487 -37916 51602
195 51602 178947 181136 57520 -47691 -58357 -29747 -27920 -64114 -114343 -119116 -25054 111546
207 111546 148202 54496 -27834 5746 75762 61266 -29391 -107070 -122078 -79452 -18051 -3663
219 -3663 -54539 -78530 17229 163346 203700 115180 26853 20535 45614 27845 -41357 -125553
231 -125553 -167772 -119589 -21273 10646 -55440 -100570 -24294 103580 150323 100112 38215 23458
243 23458 45353 61534 24303 -68424 -132573 -84175 24716 59259 -9745 -69015 -37685 36981
255 36981 69839 39106 -19208 -50338 -16739 45535 44171 -42743 -109091 -60416 48584 93323
267 93323 48708 -5648 -8658 29989 61596 37686 -41003 -99520 -62445 28042 50353 -23394
279 -23394 -87669 -56356 28997 76679 57846 9709 -14133 15318 65155 55495 -33848 -109481
291 -109481 -80041 11546 48066 -164 -53659 -45648 11064 60372 57989 5479 -34988 -2027
303 -2027 71907 83063 727 -80728 -71679 -2105 36725 9545 -42285 -58923 -18012 43463
315 43463 52518 -9557 -64891 -32311 54508 87354 31025 -40586 -50893 -4698 37599 28113
327 28113 -25309 -59823 -22830 52207 72955 9700 -56745 -44541 23788 61472 28551 -33586
339 -33586 -61611 -31269 19531 25212 -29926 -75823 -39325 48589 89385 44742 -19635 -28226
351 -28226 16909 56079 40059 -21457 -66703 -43082 20819 40072 -15934 -74132 -53868 25736
363 25736 76883 54834 -2294 -29596 -3437 38403 33915 -28619 -83681 -62764 12010 50624
375 50624 13052 -41492 -39309 19878 72743 66475 11743 -31845 -18760 26326 31662 -29110 -91308
388 -91308 -78376 -916 58985 50041 4697 -11164 25529 72650 67838 621 -65869 -66555 -17116
401 -17116 3781 -40547 -97089 -91326 -16811 61265 82784 52142 27635 51017 95884 92197
413 92197 17853 -64910 -81956 -37993 -4879 -27991 -76684 -86020 -32989 40070 67133 33767
425 33767 -5702 5935 53244 65065 7188 -67798 -85591 -35903 22781 33586 779 -19522
437 -19522 13293 72411 88472 34778 -34104 -48528 -10595 13222 -21516 -83284 -102746 -53540
449 -53540 21081 56861 38788 15282 37671 90156 105148 47498 -36324 -74457 -51649 -20740
461 -20740 -34316 -81742 -104827 -63503 13592 60153 47885 19955 34550 87126 115397 74807
473 74807 -4728 -54909 -42524 -5144 -1765 -43247 -78040 -54885 8978 47017 22656 -27462
485 -27462 -39914 -1025 37482 23625 -33147 -71461 -47548 13840 49652 33817 8568 27619
497 27619 85035 118411 84446 8805 -45490 -47414 -30034 -45784 -100623 -142785 -120160 -46763
509 -46763 14859 25526 15617 39892 105042 157810 144765 74283 5520 -15654 -6808 -21763
521 -21763 -78128 -132688 -128624 -66732 -7036 2670 -20580 -19485 29250 86943 97280 51431 1028
534 1028 -3573 28898 45242 13182 -34452 -43069 -688 42488 34546 -20061 -65422 -61768 -28814
547 -28814 -19782 -53344 -88543 -72542 -6189 56038 69853 50188 49058 90130 136414 131279 65023
560 65023 -12588 -48107 -45807 -55166 -102840 -155045 -156157 -94129 -18125 18213 14079 16507 60328
573 60328 121250 143352 103464 40674 10432 18258 19139 -23816 -87517 -115379 -83121 -26543 190
586 190 -16527 -35966 -15269 36792 69008 48911 3902 -10406 19652 53017 42230 -6347
598 -6347 -41257 -25844 18127 37459 7549 -37859 -48931 -19776 4429 -14801 -60029 -75878
610 -75878 -36414 23998 51364 34001 12374 28754 74190 97940 68498 11261 -21776 -13759
622 -13759 -1046 -25743 -80221 -114132 -90990 -32004 9861 8967 -6077 8953 56531 91668
634 91668 75126 23691 -11457 -3261 20333 13479 -32077 -73638 -67680 -19984 20256 17041 -9223
647 -9223 -11766 23621 58297 48500 12 -38645 -31363 5124 22804 -544 -34693 -34934 5021
660 5021 41656 35033 -3374 -25096 -5801 25733 23428 -17416 -57023 -54775 -13977 20680 16696
673 16696 -8966 -11564 24689 62834 59061 16067 -20204 -15359 13965 22446 -9021 -51301 -59628
686 -59628 -25880 11387 12315 -14977 -26022 3455 45022 52199 16649 -23226 -26109 4517 26580
699 26580 10773 -25142 -36961 -8498 27624 29177 -3554 -27318 -12297 24123 38783 11722
711 11722 -29431 -40870 -13951 15295 11335 -18309 -30955 -3972 36237 45718 15919 -18047
723 -18047 -18779 11471 32787 15527 -24610 -43278 -21861 10439 12075 -16718 -35389 -14400 27703
736 27703 48180 27639 -8876 -20592 2671 28033 19852 -16095 -37348 -19643 13322 19918
748 19918 -7807 -35148 -27808 8643 36394 27173 -6110 -22536 -3800 25011 24990 -5897 -29529
761 -29529 -16436 18321 33174 10840 -24793 -34222 -8271 21271 19898 -10139 -29764 -13402
773 -13402 18696 26351 145 -27464 -22076 11633 37034 25888 -8833 -27284 -10107 18369
785 18369 20310 -7143 -29059 -17105 14568 28388 8140 -23964 -30555 -3437 27332 27375 -1703
798 -1703 -22460 -9703 18369 24154 -1154 -28343 -25164 4651 27172 16177 -16617 -33955 -14765
811 -14765 17734 25219 1996 -18644 -8066 21851 34137 12758 -19551 -28287 -5586 20826
823 20826 18749 -11053 -33055 -21004 9182 19830 1190 -20295 -13608 16725 37916 25726
835 25726 -7502 -26509 -12278 14454 17876 -7139 -30416 -23201 5714 21440 6424 -18687
847 -18687 -21333 5479 34453 33116 2763 -21868 -15142 9314 16983 -3907 -28660 -25481 2614
860 2614 24997 16712 -11459 -25425 -7201 22309 27951 3673 -20301 -16556 7654 20215 4857
873 4857 -19789 -22978 2076 29380 28124 -370 -24103 -17443 6807 15203 -4331 -27454 -25166
886 -25166 1581 23822 17537 -7027 -18430 280 29977 35921 10331 -18105 -20338 -814 9190
899 9190 -7211 -31702 -34086 -7299 22675 26272 4225 -13397 -2723 24095 33796 13996 -13400
912 -13400 -18572 -622 12727 548 -26510 -37547 -17111 14868 25255 7149 -13953 -10815
924 -10815 11920 24922 10924 -14140 -21073 -1245 21342 18987 -6746 -26136 -15362 13096
936 13096 26828 11677 -11734 -15956 2177 16363 6358 -19697 -31399 -13314 16148 24836
948 24836 5744 -14942 -11255 12209 26500 14462 -9568 -17894 -3291 14097 8745 -17481 -35814
961 -35814 -24109 5847 22620 12331 -6750 -7561 12201 28568 20345 -4586 -18551 -6352 15652
974 15652 18553 -3989 -27776 -25546 -1035 17299 10663 -9207 -15653 20 17891 13828 -11004
987 -11004 -28948 -19551 7299 21667 9980 -9769 -11024 8902 27016 22053 -178 -13249 -3189
1000 -3189 14873 14203 -9901 -33399 -31556 -7462 11941 8518 -7375 -11075 6626 26823 25910
1013 25910 3821 -14606 -8517 12099 19655 2048 -22764 -28378 -10804 7924 6742 -9947 -17924
1026 -17924 -4071 18613 23466 4457 -15430 -13012 8992 24300 16273 -4509 -13368 -1375 14918
1039 14918 12810 -7486 -23405 -16604 4568 13404 -802 -22085 -24817 -5422 15027 15937 921
1052 921 -7385 4408 23759 26568 6859 -14652 -15995 1399 13630 4016 -17828 -27016 -13689
1065 -13689 5957 9863 -3686 -13716 -3217 19295 29151 14910 -7422 -13568 -40 14081
1077 14081 9831 -9219 -21607 -12786 5212 10017 -4311 -19564 -14649 7253 22602 15903 -3527
1090 -3527 -12873 -2185 14263 15623 -296 -14404 -8874 9244 16847 2901 -17888 -22402 -6372
1103 -6372 10840 9957 -5713 -15936 -6896 11393 17640 4721 -10103 -7152 11149 23308 13591
1116 13591 -8272 -19445 -9975 5565 7451 -6303 -17612 -10893 7933 17123 6697 -10860 -13556
1129 -13556 2280 18062 15524 -2618 -15894 -10631 4649 9540 -2002 -15825 -12598 5639 19168
1142 19168 12556 -6165 -14768 -4030 12571 15704 1860 -11831 -8785 6465 13743 2900 -13923
1155 -13923 -16613 -1375 14246 12207 -4750 -16927 -11293 4668 11185 1123 -11821 -9962 6350
1168 6350 18224 11119 -6648 -14808 -4177 12089 15237 1835 -12104 -10292 4111 12825 4479
1181 4479 -10889 -13001 1595 16392 14037 -2926 -15862 -11180 3530 9485 -916 -14517 -14128
1194 -14128 784 12832 7844 -7366 -12779 -175 16697 19531 5924 -8182 -8185 3813 10734
1207 10734 1821 -13533 -16563 -3155 11294 9998 -4655 -14358 -7636 8433 15540 6200 -8268
1220 -8268 -10099 1884 12164 5959 -9498 -16323 -5491 10507 13824 1832 -10964 -9602 3913
1233 3913 12671 5666 -8433 -12294 -440 12620 10420 -4079 -14054 -7714 7120 13983 4962 -8784
1247 -8784 -11251 119 10285 5051 -9340 -15252 -4539 10572 13951 2902 -8712 -7564 5376
1260 5376 14362 8165 -6428 -11746 -2056 9336 7040 -7312 -16750 -10338 4806 12459 5438 -6792
1274 -6792 -8668 2578 13385 8878 -5431 -12384 -4011 9004 10404 -1369 -12674 -11060 2183
1287 2183 12236 8127 -3950 -7897 2293 13345 10804 -3268 -13482 -8796 3648 9115 1119
1300 1119 -11531 -13909 -2781 8743 6907 -4614 -9782 -621 12315 14000 2766 -8986 -8713
1313 -8713 2825 11673 6766 -6194 -11328 -2222 8971 7652 -4353 -12100 -6014 6401 11583 4054
1327 4054 -8000 -10962 -1320 9274 7303 -4858 -10627 -2825 8750 10007 -554 -10850 -9892 1239
1341 1239 9890 6132 -6151 -11154 -2474 9239 9694 -803 -7574 -1858 9405 13788 5934 -6658
1355 -6658 -11250 -3466 5755 3403 -8474 -14985 -7396 4770 7493 -287 -7591 -4578 6677 15364
1369 15364 11204 -1386 -8481 -2502 6884 5350 -5764 -13157 -7952 3316 8299 3373 -5769 -7730
1383 -7730 1704 12265 10752 -1198 -9070 -3991 5415 6181 -2672 -10682 -9183 705 9351 7010 -3752
1398 -3752 -9303 -2133 8352 8392 -2312 -9674 -5373 4309 8397 3100 -5678 -7595 1224 11551 11093
1413 11093 -298 -8199 -3261 5553 5881 -3378 -11536 -10672 -1867 6277 4774 -4254 -8857 -788 10860
1428 10860 11957 2017 -5843 -3221 4644 6842 679 -8826 -11878 -4340 6175 7187 -1913 -7362
1442 -7362 -1072 9663 11147 2806 -5508 -6004 556 5929 2680 -7515 -13211 -5996 6047 8421
1456 8421 435 -5610 -877 7528 10021 3779 -5783 -10315 -4895 3856 4163 -5156 -11174 -4429 7521
1471 7521 11121 4752 -1307 -548 5252 9683 6001 -5376 -13300 -9033 1400 3271 -4500 -9967 -4304
1486 -4304 5767 9856 5993 -1253 -4419 125 7675 7072 -3906 -12095 -7192 3294 6551 462
1500 462 -4539 -2164 4631 10032 7750 -1766 -9515 -6002 3407 4669 -4150 -11064 -6617 2988 7368
1515 7368 4685 -670 -2617 2169 9788 9540 -1456 -10959 -8388 880 2405 -4342 -9652 -6431 1339
1530 1339 7957 8387 2182 -2951 1256 10492 11373 990 -8658 -7162 -455 1574 -2859 -7853 -8740
1545 -8740 -3184 6007 8988 1535 -5924 -2206 7439 8876 652 -6504 -6151 -1175 2981 2732 -2920
1560 -2920 -7385 -2595 8052 11219 2740 -5492 -3547 3240 4515 -839 -6821 -8517 -4495 3411 6560
1575 6560 617 -5720 -1523 8804 11201 3077 -4743 -4945 -1585 883 -1024 -6794 -11162 -6813 4184
1590 4184 9588 3759 -2604 1031 8788 10469 4581 -2533 -6018 -4579 74 1286 -4875 -12062 -7523
1605 -7523 3966 9023 3778 -1525 196 4868 7002 4443 -2061 -8105 -6933 1303 4690 -1960 -8461
1620 -8461 -4655 4544 7894 4279 -494 -1993 -58 4002 4690 -1974 -9899 -7957 1706 6089 691
1635 691 -4245 -1855 3977 7039 5784 989 -4376 -3785 2344 4827 -2272 -10356 -8226 590 4300
1650 4300 1371 -1683 -1189 2502 6804 8140 2086 -5702 -5320 2194 4723 -1769 -8659 -6925 -913
1665 -913 2889 2944 715 -1743 67 7026 9946 2758 -6305 -6451 -1 2289 -2114 -6084 -5906 -1868
1681 -1868 3312 6411 3495 -2002 -696 6903 9554 1944 -6646 -7095 -3146 -978 -2379 -4466 -5826
1696 -5826 -3106 4275 9448 5066 -2069 -1277 5458 7075 1465 -4672 -6166 -4239 -881 1455 -600
1711 -600 -4326 -2584 5769 10399 4912 -2762 -3693 147 1268 -1450 -4872 -7293 -5914 391 5474
1726 5474 2989 -2294 -758 6848 9812 4717 -1856 -4200 -3427 -1736 -1247 -4122 -8205 -6319 2188
1741 2188 8093 4934 -321 848 5794 7640 4593 -185 -4431 -5283 -2365 65 -3291 -8912 -7692
1756 -7692 944 6098 3638 -433 -390 2061 4188 4400 1180 -3859 -4389 955 5004 1247 -4532 -3357
1772 -3357 2612 6239 4550 873 -1692 -2492 -296 1363 -2599 -9096 -9091 -2243 2818 970 -2156 -982
1788 -982 3327 6925 7803 5315 522 -1807 1676 3693 -1700 -8499 -8852 -2871 1403 1465 215 -195
1804 -195 1468 5138 7188 3998 -3037 -5116 -977 1712 -2347 -7586 -7260 -2661 1851 4290 3877 1449
1820 1449 1421 5128 7528 2622 -4738 -6677 -2430 511 -923 -3208 -3238 -852 3346 6906 5552 221
1836 221 -1351 2060 3976 -973 -7484 -8965 -5685 -2190 -29 186 -933 41 5178 9098 6519 205
1852 205 -1496 1722 3200 108 -4041 -6123 -4858 -1516 1846 1568 -1495 -1578 2844 6342 3052 -2971
1868 -2971 -4700 -2277 -107 300 -1294 -3354 -3160 1199 5641 4386 113 -517 3378 5839 2902 -2024
1884 -2024 -4800 -4624 -2534 -395 -977 -3849 -3835 1140 5658 4192 115 -645 2043 3782 3069 -198
1900 -198 -3885 -5304 -2661 394 -422 -3797 -3313 1850 5866 5004 1730 -38 369 2119 2792 631
1916 631 -3898 -5509 -2578 1079 -67 -3186 -3277 654 3964 4117 1664 -1186 -2377 -522 1608 224
1932 224 -3641 -4439 -224 3599 3417 650 -97 1521 3605 4291 2133 -2300 -4568 -2649 -222 -1448
1948 -1448 -4959 -4981 -985 2865 3947 2243 672 320 2349 3816 1809 -2549 -4330 -2192 582 -334
1964 -334 -2788 -3423 -1219 2292 4228 3202 201 -1034 792 2810 1459 -2356 -3515 -1341 1610
1979 1610 1750 -173 -1834 -1655 808 2691 1899 -1841 -3510 -1311 1053 90 -2739 -3605 -1099 2205
1995 2205 4094 3194 913 -43 1737 3810 2346 -1295 -3459 -2154 -216 -614 -2627 -4326 -3545 -407
2011 -407 2606 2783 784 131 2332 4607 3835 538 -1431 -783 627 625 -1509 -4471 -5427 -3206 -306
2028 -306 73 -1801 -2130 797 3854 4429 2916 1036 1007 2657 3784 2466 -1205 -3465 -2500 -580 -1270
2045 -1270 -3423 -4250 -2713 -41 1383 819 -1024 -1063 1518 4027 3956 1427 -25 1259 2835 2196 -202
2062 -202 -2831 -3235 -1602 -603 -1501 -4005 -4842 -2327 1163 2117 1207 1133 3153 5546 6135 3783 793
2079 793 -1068 -978 -336 -1771 -4859 -6710 -5282 -2534 -1256 -1400 -1376 252 3538 5529 5179 2970 1216
2096 1216 1816 3138 2246 -684 -3066 -2603 -1058 -846 -2056 -3679 -3673 -1197 1292 1620 -74 -939 550
2113 550 2829 3145 1300 -439 -609 620 1340 258 -2249 -3432 -1983 401 623 -442 -1513 -455
2129 -455 1607 2469 1466 -224 -420 1087 2548 2288 -77 -1636 -1264 609 373 -1082 -3060 -2773 -1481
2146 -1481 -127 -665 -1856 -2104 38 2716 3514 2190 860 1307 2386 2145 81 -2275 -2900 -1849
2162 -1849 -8 92 -963 -1407 18 2435 3138 1684 2 -691 -7 -125 -1527 -3544 -4455 -2866 -292
2179 -292 844 465 170 1530 3421 4368 2666 770 -345 32 674 -332 -2140 -3331 -2298 -338
2195 -338 759 -140 -1243 -651 677 1090 792 -862 -1383 -228 1752 2141 1382 71 565 1819 2013
2212 2013 587 -1460 -2253 -1756 -985 -1650 -2836 -3292 -1842 590 2150 1808 1226 1620 2958 3515 2445
2229 2445 503 -903 -590 -195 -761 -2579 -3763 -3571 -2147 -671 -722 -1040 -429 1760 3523 3594 2500
2246 2500 1603 1909 2574 2082 294 -2055 -2903 -2473 -1840 -2320 -3170 -2962 -1484 536 1143 688 191 818
2264 818 2097 2865 2003 1006 514 1241 1988 1376 -233 -1416 -1470 -773 -793 -2204 -3377 -3626 -2108 -591
2282 -591 -106 -295 473 2393 3990 4125 2897 1231 455 751 -11 -1541 -3209 -3735 -2628 -1382 -776
2299 -776 -830 -452 1018 2802 3299 2387 921 312 677 1010 115 -1079 -1698 -1154 -117 134 -516 -1526
2317 -1526 -1144 162 872 333 -826 -895 88 1259 1512 471 105 832 1480 1713 575 -1091 -1211 -554
2335 -554 -161 -430 -1266 -1333 -543 759 742 264 -362 -162 699 879 279 -698 -1089 -341 442 266 -390 -642
2355 -642 -45 990 1470 336 -451 -363 822 1126 638 -372 -816 -653 0 -402 -817 -1494 -1382 -132 467
2374 467 659 -24 229 1016 1688 1691 606 -268 -163 242 77 -694 -1734 -1972 -974 -6 161 -287 -239 455
2394 455 1570 1619 951 217 102 834 949 318 -793 -1182 -690 -131 -243 -922 -1474 -1079 -126 377 108 -393
2414 -393 -189 927 1681 1618 1092 432 919 1272 784 -118 -1316 -1352 -952 -692 -1215 -1761 -1514 -738 460 460
2434 460 304 179 709 1498 1954 1244 124 17 309 386 -236 -1037 -1634 -1402 -555 -456 -611 -929 -407 745
2454 745 1309 1244 696 485 1066 1471 1048 105 -435 -716 -285 -446 -1116 -1667 -1601 -901 -240 19 -57 86 933
2475 933 1712 2050 1781 824 656 1014 447 -285 -1507 -1776 -1740 -1127 -1286 -1546 -1388 -395 636 1397 1494 1360
2495 1360 1579 1996 2245 1334 280 -535 -945 -827 -1334 -2004 -2396 -2195 -1361 -434 -324 -214 363 1639 2479
2514 2479 2665 2173 1709 1492 1543 790 -557 -1797 -2442 -2373 -2450 -2686 -2751 -2199 -882 613 1568 2210 2170 2796
2534 2796 3181 3206 2068 676 -595 -768 -1348 -2162 -3073 -3449 -2883 -1996 -1011 -633 -130 775 2019 3115
2552 3115 3162 2740 2470 2289 2036 1117 -511 -1901 -2675 -2904 -3227 -3586 -3567 -3170 -1665 -112 1299 1993 2722
2571 2722 3388 4102 3975 3026 1812 303 -146 -1072 -1982 -3346 -3697 -3256 -2350 -1967 -1483 -853 293 1401
2589 1401 2438 2379 2334 2230 2436 2243 1362 454 -310 -876 -1368 -1827 -2461 -2981 -2633 -1946 -823 -404 305 819
2609 819 1923 2452 3081 2634 1583 1108 591 -51 -1094 -2066 -2312 -2416 -2072 -1543 -1473 -894 56 819 1461
2628 1461 1347 1089 1341 1417 1589 842 48 -476 -216 -281 -546 -1184 -1277 -1174 -697 -452 -458 -433 8 544 1052 1068
2650 1068 741 372 730 435 119 -250 -948 -726 -589 -4 125 -73 317 408 639 608 140 -417 -516 -524 -509 -619
2672 -619 -930 -625 100 572 421 288 206 572 675 499 -125 -396 -301 -37 244 73 29 -68 323 465 183
2693 183 -275 -876 -551 -298 -156 -359 -273 117 815 997 1078 767 431 53 -201 -513 -1126 -1506 -1391 -1065 -519
2714 -519 -473 -19 390 1101 1532 1464 1076 570 425 371 -70 -618 -900 -904 -882 -258 -301 -676 -385 -188 88 188
2736 188 275 71 160 568 811 542 213 331 314 399 135 -292 -841 -579 -463 -469 -597 -802 -758 -46 190 247 137
2759 137 208 583 860 633 519 127 -134 178 61 -483 -918 -930 -929 -388 -489 -391 -282 74 671 1378 1548 1199
2781 1199 1039 1041 859 362 -557 -1118 -1285 -1366 -1231 -1419 -1335 -907 -27 446 898 1001 1106 1247 1407 1016 320
2802 320 -91 -115 -179 -339 -822 -927 -806 -573 -403 -256 -748 -543 -185 342 521 596 647 871 1327 1100 738
2823 738 405 -249 -472 -789 -1138 -1685 -2016 -1548 -843 -311 -43 546 1189 1809 2160 2048 1535 1114 499 517
2843 517 -351 -1278 -1878 -1900 -1799 -1588 -1316 -870 -435 200 1009 1341 1243 1348 1679 1464 1377 640 -252 -300 -608
2864 -608 -745 -1406 -1693 -1559 -1019 -514 -355 29 -40 568 1079 1271 1292 1005 835 735 724 145 -287 -718 -916
2885 -916 -922 -837 -1218 -1097 -655 -284 134 300 572 813 1079 1320 1251 817 410 122 202 -21 -892 -1009 -1109 -1058
2907 -1058 -664 -482 -545 -369 66 691 913 658 452 718 662 754 302 -45 -21 -297 -83 -456 -769 -874 -612
2928 -612 -332 -169 -151 -248 87 344 494 220 150 76 130 305 301 116 -309 -163 -82 87 -207 -40 -468 -159 -162
2951 -162 26 -413 -515 -116 144 158 520 425 325 602 595 513 18 -188 -291 -191 -348 -458 -656 -775 -166 -145
2973 -145 227 227 263 643 768 592 120 20 172 260 21 -254 -678 -349 -426 -291 -393 -540 -470 47 388 428
2995 428 325 320 424 661 528 488 -98 -242 -347 -291 -390 -894 -847 -740 26 222 76 310 345 704 850 535
3017 535 -35 -205 -232 -103 -207 -445 -506 -398 -180 -217 -315 -445 -182 34 688 679 346 388 828 916 837 285 -21
3040 -21 -336 -521 -563 -1030 -1439 -1323 -988 -430 193 172 552 1158 1626 1815 1611 966 359 -122 -154 -840 -1416
3061 -1416 -1760 -1518 -1109 -829 -458 -254 109 935 1092 1082 1081 861 906 939 678 -46 -92 -421 -462 -603 -893 -1098
3083 -1098 -1173 -700 -298 -234 -58 78 674 1317 1225 1276 681 771 603 333 -45 -566 -988 -1181 -954 -1080 -1180
3104 -1180 -811 -412 -22 125 483 778 836 1073 1216 1216 679 344 218 141 -433 -914 -1427 -1335 -1182 -798 -772 -383
3126 -383 -408 290 965 1231 1250 935 1019 845 453 -9 -443 -777 -811 -725 -692 -767 -801 -363 112 64 9 -71 102 230
3150 230 301 225 112 265 436 899 793 300 91 51 -31 -510 -790 -852 -1175 -927 -468 5 109 108 662 1180
3172 1180 1051 672 576 500 87 -140 -274 -490 -876 -839 -226 -159 -237 -531 126 335 149 -19 201 313 266 447
3194 447 549 384 141 24 544 313 -366 -677 -456 -568 -812 -665 -660 -680 -602 -91 465 220 313 764 1301 784
3216 784 739 472 482 152 32 63 -626 -1103 -1047 -772 -851 -886 -947 -368 -28 285 668 920 721 672 1231 1191 432
3239 432 51 62 284 -369 -1089 -883 -812 -1065 -717 -452 -278 -278 64 791 733 635 539 879 984 648 592 170 -140
3262 -140 -600 -548 -590 -1297 -1784 -1337 -944 -432 -356 -32 726 1046 1456 1675 1586 1066 726 863 286 -434 -977
3283 -977 -1180 -1342 -1599 -1699 -1203 -921 -903 -273 594 731 525 938 1593 1590 1047 929 597 314 -20 -94 -591
3304 -591 -1248 -1522 -1087 -1019 -1072 -1077 -533 335 398 847 1312 1384 1177 1285 1196 676 63 -587 -581 -874 -1409 -1518 -1372
3327 -1372 -1036 -810 -120 65 313 637 1357 1702 1353 760 916 852 259 -136 -706 -727 -1328 -1097 -823 -739 -949
3348 -949 -473 -145 208 306 508 733 909 860 937 918 548 118 214 189 -217 -935 -1176 -384 -551 -862 -482 -78
3370 -78 -158 86 751 843 584 494 912 782 192 -134 -199 -326 -829 -588 -619 -605 -768 -415 447 316 110 390
3392 390 848 786 318 373 171 195 -33 107 -166 -664 -338 -70 -55 -303 -525 -234 -3 121 202 93 278 82
3414 82 41 633 281 -158 -20 277 233 -254 -324 -199 -176 -230 -269 23 -382 -240 169 566 175 -125 151 450
3436 450 150 168 262 189 -279 -187 73 152 -391 -448 -90 -28 -144 -170 152 99 255 310 454 -76 -139 107 317 33
3460 33 -231 -159 -190 -69 -11 -128 -102 -434 -216 191 47 -207 -287 208 484 225 -107 301 247 29 110 -22 -195
3483 -195 -654 -264 17 -359 -397 -258 150 225 81 476 283 -64 31 174 -141 -527 -746 -126 -55 -320 -393 -246
3505 -246 -9 11 140 169 56 43 123 367 461 161 86 388 102 -280 -154 -397 -535 -551 -565 -169 -705 -228 -37
3528 -37 401 500 501 609 707 499 319 226 -123 -519 -641 -262 -470 -642 -636 -209 13 150 292 314 208 123 386
3551 386 552 87 -261 -23 229 -84 -422 -183 -212 -114 -213 117 -118 -396 -48 108 193 242 177 360 484 407
3573 407 64 103 -15 -12 -62 -4 -374 -527 -434 -77 -275 -302 -187 -31 196 182 570 565 305 247 590 659 268 -311
3597 -311 -367 -186 -519 -660 -554 -446 -312 14 333 384 259 546 737 342 185 -48 -212 -236 -130 -394 -130
3618 -130 -405 16 338 411 313 -214 -29 81 -58 -333 -487 -305 -369 -14 504 416 378 504 825 420 157 -324
3640 -324 -400 -696 -941 -1033 -743 -649 -42 224 604 704 619 917 922 658 302 -71 -297 -567 -438 -712 -533 -483
3662 -483 -634 -86 -12 18 164 424 255 268 149 -9 -82 115 108 303 -41 124 138 185 314 31 -71 -416 -427
3685 -427 -557 -335 -526 -478 -265 196 420 504 703 652 736 730 528 53 -343 -458 -695 -820 -1124 -1149 -1091 -184 -196
3708 -196 330 694 787 1047 1273 1061 1029 172 -200 -316 -807 -970 -911 -874 -523 -218 -26 198 408 303 445
3729 445 365 116 61 74 -124 -44 -70 182 204 394 360 358 330 -28 -225 -329 -349 -729 -701 -819 -310 -89 299 584
3753 584 957 1083 999 897 764 45 -243 -400 -740 -972 -1210 -1059 -526 -121 162 453 632 794 958 900 752
3774 752 256 -40 -73 -250 -444 -465 -482 -300 3 69 94 21 227 64 -32 -144 -395 -408 -287 -136 -42 -154 92
3797 92 288 672 627 609 563 96 176 -102 -199 -710 -682 -742 -614 -281 -51 13 251 614 1092 896 682 552 202
3820 202 -129 -486 -548 -880 -657 -538 -343 -193 -43 81 423 609 484 386 31 4 73 -185 -269 -212 -407 -80
3842 -80 -9 191 -30 -93 71 89 50 -259 -364 -390 -326 -177 -259 -18 245 432 499 475 631 346 185 120 -195 -517
3866 -517 -882 -930 -794 -480 -106 -11 124 509 861 852 630 621 338 199 -171 -312 -745 -858 -820 -624 -418 -293
3888 -293 -147 103 797 843 916 653 638 359 155 15 -461 -605 -278 -681 -173 -240 -235 -95 -184 253 227 75 -67
3911 -67 71 136 99 137 154 -38 153 168 185 74 -57 -51 38 -251 -494 -605 -319 -85 -291 79 197 338 706
3934 706 760 590 566 384 175 -92 -482 -651 -956 -957 -755 -663 -278 4 398 574 838 789 1095 1088 729 668 261
3957 261 -439 -769 -929 -1157 -891 -848 -485 -216 285 481 503 838 965 511 509 315 268 -236 -286 -383 -391 -473 -405 -365
3981 -365 -308 -34 61 126 111 126 173 221 -59 42 -81 286 346 361 186 150 -83 -243 -267 -571 -682 -839 -800 -609
4005 -609 -299 134 395 652 912 1109 1130 824 623 268 -79 -514 -881 -1178 -1435 -1184 -990 -539 -171 165
4025 165 652 1042 1258 1304 821 903 516 -79 -443 -819 -787 -902 -890 -757 -560 -211 86 487 733 539 581 756
4047 756 540 520 87 71 -465 -416 -275 -449 -430 -300 35 -261 169 168 29 85 67 62 184 268 243 234 360 449 473
4072 473 312 -41 -313 -413 -748 -881 -931 -717 -666 -374 -54 452 768 1108 1202 1137 919 513 387 -199 -437
4093 -437 -815 -1428 -1403 -1301 -954 -497 -171 409 921 1346 1272 1242 1003 477 203 -160 -430 -718 -916 -810 -853
4114 -853 -647 -440 -21 416 464 524 496 566 349 251 412 -26 -145 165 204 -107 9 158 -195 -57 -57 -180 -469
4137 -469 -350 -315 -288 -147 -71 277 475 620 1009 722 749 462 209 -156 -326 -634 -1031 -970 -693 -583 -371 -252
4159 -252 53 490 840 943 827 671 478 249 -48 -448 -801 -869 -895 -663 -487 -257 24 159 535 562 693
4180 693 750 894 315 271 -13 -388 -510 -662 -542 -316 -410 -223 -46 263 423 347 365 275 224 137 -59 -1 -304
4203 -304 -142 -262 5 36 -84 -77 210 92 -161 -373 -275 -479 -308 91 -14 16 59 456 559 785 306 290
4225 290 103 -308 -425 -597 -708 -689 -808 -528 -110 -71 301 544 921 930 628 453 419 311 -162 -156 -491 -786
4247 -786 -783 -748 -582 -317 -226 272 408 540 531 301 488 439 383 5 -171 -663 -640 -621 -477 -577 -212 34 62 319
4271 319 197 619 309 461 497 362 31 195 5 4 -86 -462 -286 -248 -241 -219 -124 -247 -360 -138 -87 95 111 95
4295 95 175 311 501 706 608 415 338 179 -66 -212 -638 -808 -706 -778 -825 -463 -176 536 803 1059 1077 938
4317 938 778 376 -158 -573 -773 -1192 -1062 -1007 -668 -690 -94 49 821 985 1068 1109 925 488 262 -158 -322
4338 -322 -621 -580 -826 -643 -523 -133 168 46 438 504 446 345 277 128 -84 -214 -323 -281 -177 -46 100 145
4360 145 275 282 286 139 159 -282 -501 -506 -558 -359 -272 181 99 547 638 537 516 226 259 -162 -256 -522 -1036 -1109 -600
4385 -600 -480 -142 -14 547 1153 1104 1144 1065 772 496 120 -544 -755 -1177 -1127 -960 -753 -527 -192 500 827
4406 827 1065 883 1022 608 322 -169 -462 -777 -804 -688 -424 -511 97 333 522 946 632 510 126 -141 -499
4427 -499 -633 -687 -779 -611 -136 307 675 862 819 797 534 369 -47 -506 -917 -1077 -1005 -808 -631 -387 284 778
4449 778 1136 1338 1225 906 593 315 -565 -987 -1214 -1542 -1398 -1224 -714 -68 454 847 1230 1287 1180 794
4469 794 536 159 -326 -566 -918 -917 -932 -308 -221 125 335 595 599 561 270 33 -209 -361 -620 -587 -412 -240 165
4492 165 298 593 676 912 673 421 210 -225 -804 -965 -943 -833 -890 -379 -246 556 832 1447 1424 1327 760 584
4514 584 -194 -709 -972 -1482 -1413 -1349 -725 -476 139 632 1414 1594 1304 1285 753 164 -304 -627 -1123 -1173 -1135 -1021
4536 -1021 -506 -234 153 442 743 1121 1019 680 441 152 -319 -493 -928 -682 -601 -217 80 136 626 483
4556 483 654 315 177 -238 -554 -680 -548 -681 -502 -119 335 530 1014 663 840 465 103 -27 -426 -1179
4576 -1179 -1226 -988 -919 -669 -83 401 1061 1282 1509 1349 1088 570 173 -380 -853 -1423 -1305 -1308 -1095 -606 -86
4597 -86 274 715 988 1354 1296 817 415 218 -55 -413 -652 -943 -671 -749 -486 17 -151 255 448 621 482
4618 482 96 -122 -183 -404 -286 -229 -322 -159 26 188 453 307 341 102 -37 -254 -496 -453 -384 -425 -506 209 210
4641 210 396 565 558 857 461 216 249 -433 -665 -478 -725 -718 -540 -170 112 121 377 704 845 649 514 476 40
4664 40 -180 -525 -674 -615 -757 -475 -170 -43 -107 192 576 675 561 570 232 179 -76 -104 -10 -514 -295 -113 -129
4687 -129 85 -106 183 255 173 9 118 122 -122 -131 -233 -65 -58 65 118 222 235 119 348 -76 -116 -95 -113 -317
4711 -317 -171 -111 -44 -382 -46 180 394 482 399 596 394 144 -48 -46 -289 -369 -539 -279 -328 -62 49 172 125
4734 125 30 158 445 109 -127 98 406 75 -77 160 -2 -178 -60 -84 -208 -291 -120 -81 69 -15 4 417
4756 417 182 184 243 468 -11 -194 -8 -32 -257 -447 -145 13 210 -126 256 418 186 260 20 45 -56 -222
4778 -222 3 -8 -247 -178 266 287 -17 26 127 25 -270 -436 -149 -532 -544 -42 157 340 326 527 831 684
4800 684 392 197 328 -230 -690 -573 -695 -787 -746 -290 5 30 452 764 782 674 467 379 308 -332 -562 -350
4822 -350 -629 -760 -689 -345 -194 115 348 538 461 293 506 294 71 -467 -176 -113 -478 -511 -53 -151 -47 -132
4844 -132 484 69 -23 107 197 -34 -442 -428 -254 -218 -130 -171 506 452 301 490 614 217 -274 -181 -394 -583 -1138
4867 -1138 -713 -430 -494 -174 403 698 642 819 1109 891 379 -127 -396 -894 -989 -880 -818 -647 -431 313 878
4888 878 840 727 813 973 481 -77 -404 -378 -1082 -1041 -529 -398 -293 359 607 1031 664 362 578 337 -35
4909 -35 -656 -512 -675 -987 -442 81 260 -21 508 887 723 415 -94 -43 -743 -1028 -785 -433 -727 -557 396
4930 396 618 568 832 1053 1032 290 49 -318 -675 -1036 -1198 -866 -876 -632 -234 538 557 551 907 944 604 564 40
4953 40 -219 -743 -1003 -758 -540 -676 -354 57 651 497 571 727 785 265 -11 112 -394 -905 -739 -383 -372
4974 -372 -282 79 414 542 525 621 624 54 -452 -506 -410 -686 -798 -376 4 169 538 971 1018 776 709 651 20
4997 20 -402 -895 -850 -1035 -1277 -1082 -144 272 438 905 1170 1145 553 629 379 -322 -908 -937 -818 -1071 -703 -235
5019 -235 4 279 354 1026 845 670 572 32 -268 -863 -989 -638 -531 -685 -271 366 386 413 792 893 562
5040 562 85 -46 271 -298 -744 -396 -365 -185 -189 82 509 367 157 571 343 -205 -280 -341 -336 -657 -463 -52
5062 -52 12 297 499 975 671 610 436 345 53 -726 -835 -504 -968 -1011 -338 -179 269 502 1111 1311 800 622
5084 622 516 331 -251 -875 -679 -767 -1004 -786 -267 49 67 351 874 964 711 371 397 98 -330 -412 -325 -662
5106 -662 -917 -446 -12 -118 13 372 492 249 -29 349 14 -180 -271 58 129 -174 18 408 529 80 160
5127 160 415 219 -135 -510 -347 -330 -830 -221 -117 -105 35 474 844 592 381 352 231 -173 -387 -308 -575
5148 -575 -825 -651 -109 119 66 235 720 703 443 342 380 118 -74 -287 -405 -730 -946 -653 -113 -76 -9 140
5170 140 576 607 576 480 252 -201 17 41 -244 -319 -365 -250 70 46 13 88 123 53 -40 126 25 -366 -261 22
5194 22 -115 7 -30 234 337 264 271 423 -357 -188 -50 58 -500 -215 -241 -87 -57 -13 251 331 172 -28 224
5217 224 -33 -312 -332 -193 -259 -138 -247 -90 -63 221 137 263 -128 101 302 94 -60 -250 -183 46 -80 -130
5239 -130 -103 -23 -151 -122 213 12 -203 -28 145 -33 133 86 149 121 -88 -52 -5 -168 -128 197 279 66 25 -116
5263 -116 96 79 -70 28 15 -112 -50 -124 -370 -123 -259 38 74 -112 -181 130 119 85 -64 -189 201 -153 85
5286 85 243 38 -66 156 105 146 101 80 121 -63 -252 -79 -244 -135 -283 49 -8 -115 -338 137 171 -19 -40
5309 -40 -123 -208 -103 230 -25 -326 -288 52 154 -114 7 -30 130 -10 -103 50 -217 -151 -92 203 81 49 -155
5332 -155 -34 -44 108 -49 18 -36 -81 34 118 161 53 28 136 40 -121 -155 -177 -249 22 61 -45 -161 -11 41
5356 41 368 69 -99 19 47 72 -150 -322 -75 -76 -3 -44 110 -23 141 237 232 60 -103 -364 -276 -131 12 -166
5380 -166 -162 -162 320 261 340 -43 20 -26 -24 -99 -415 -268 -209 12 23 -16 157 45 217 502 146 -74 -153 -2 -244
5405 -244 -54 -105 -339 -167 175 113 85 199 284 253 208 28 28 -18 35 -56 -107 -353 -299 -93 45 3 227 -86 82
5430 82 14 -24 217 -53 -195 64 182 60 2 -131 -147 -14 -208 -98 -101 -39 10 33 -71 -236 -59 -101 203 150
5454 150 66 111 92 121 159 134 24 -169 -304 -98 -202 -232 -242 -182 -6 83 346 286 402 412 438 423 191 -120 -118
5479 -118 -213 -461 -158 -595 -230 -157 5 17 191 293 303 232 203 141 -264 -53 -68 -33 -248 -136 -37 -7 4 -150
5503 -150 92 -33 13 -63 -154 -208 -258 -355 148 77 247 -2 -49 105 360 372 -102 -126 -91 -15 -72 -140 -50 -175 -289
5528 -289 276 5 35 146 60 184 167 -21 -183 -176 -308 5 105 -67 -55 -25 113 173 36 26 -104 15 -71
5551 -71 -87 -329 -446 -136 -123 66 209 355 429 367 299 366 140 -164 -270 48 -274 -426 -471 -292 -220 -385 -83
5574 -83 -65 214 342 284 306 217 107 221 146 -7 -291 -259 -254 -239 126 16 -215 -116 7 87 176 -43 -123 196 160
5599 160 119 80 -165 -203 127 23 223 -241 24 -118 -49 -51 -128 -22 39 -75 176 87 5 -28 301 326 29 89
5623 89 -237 -276 -79 -308 -182 -179 -357 129 -77 -22 80 199 542 391 483 132 132 55 -77 -108 -241 -359 -435 -22
5647 -22 39 98 -83 -55 -36 372 309 108 33 247 1 141 -183 -94 -196 43 28 150 95 146 24 183 118 -172
5671 -172 -124 -106 -18 253 16 -72 -219 -15 239 41 -53 -101 -121 -27 138 125 -260 -168 151 40 192 36 -67
5694 -67 94 251 197 6 12 -395 -112 -52 -38 -276 -126 -3 203 220 26 74 138 171 329 -55 -235 -359 -120
5717 -120 67 -286 -287 -239 -46 26 75 52 71 -78 238 274 66 -62 -157 159 62 -120 -95 -95 -196 163 104 -33 -78
5742 -78 -59 -37 89 269 185 -20 110 129 26 -16 89 -126 10 28 74 -164 -256 -293 143 10 -66 -23 61 202
5766 202 191 119 -208 -42 28 180 -101 -87 -63 -219 -46 -102 -45 -168 -223 13 199 11 -67 26 175 208 240 -47
5790 -47 -259 -325 143 -101 -240 -463 -204 -26 248 135 82 -139 -6 43 107 -6 -295 -308 -87 75 11 -205
5812 -205 -164 -94 84 222 -27 -81 -204 77 179 65 184 -182 -35 60 114 -69 -169 51 24 118 -65 -287
5834 -287 20 -75 57 -77 -68 25 170 326 158 171 -50 231 206 10 60 -246 -31 -93 129 -17 -14 -55 -139 26
5858 26 -14 -59 10 3 102 39 -80 -20 -297 -111 292 235 -39 -132 31 152 166 94 -35 -69 80 20 -56 -201 -374
5883 -374 -254 12 77 -117 -34 175 162 265 38 -81 -104 -41 94 98 -135 -240 -39 18 21 -64 -299 -198 188 0
5907 0 238 91 21 -17 34 154 76 -51 -107 3 -53 154 -99 -298 -35 -10 -99 -43 27 71 165 375 149 -83 -66
5932 -66 84 148 186 -55 -137 -154 76 66 16 -216 -320 11 27 90 29 16 282 103 101 -45 -113 -108 137 5 -107
5957 -107 -214 -373 -94 117 32 -109 -56 63 321 79 -18 -66 60 4 362 172 -6 -120 -31 89 117 -37
5979 -37 -280 -104 122 85 38 -313 -172 114 168 223 -107 -25 -44 115 119 148 -176 89 -36 11 136 -9 -79 -24
6003 -24 12 203 -96 -186 -209 -74 325 164 -247 -166 134 21 132 115 -221 87 142 224 33 -68 175 -80 221
6026 221 -47 -289 -102 -27 99 61 -7 -146 -159 24 359 45 -79 -126 102 230 60 12 -134 31 -87 -110
6048 -110 -138 -211 -39 137 99 161 -19 -26 170 8 33 -56 -322 -63 23 13 -276 -210 -205 28 208 -63 -19 -147 144
6073 144 81 260 81 99 92 375 152 149 86 -245 -138 132 -27 -419 -140 -184 35 2 22 -103 -209 246 123
6096 123 519 70 -120 41 212 33 64 -393 -342 -200 -97 -81 0 -71 -181 46 162 90 140 -75 321 338 -2
6119 -2 -212 -85 -141 -118 266 -259 -278 -121 193 125 194 -42 -78 276 249 180 -224 -166 -79 115 263 -43 -249 -131
6143 -131 -17 11 -128 -251 -352 -34 129 -23 -46 97 29 157 54 223 -4 78 38 330 41 -69 -245 -287
6165 -287 63 206 -94 -68 -180 144 66 304 4 -20 122 127 115 105 -198 -73 -46 151 -46 3 3 -17 362 278
6189 278 -69 9 -120 223 24 73 -386 59 98 145 75 -210 -184 -136 199 326 -122 -49 1 172 -53 -141 -126 -179
6213 -179 -66 33 184 17 98 56 107 273 -53 -102 -114 131 -89 -98 -286 -209 -84 219 253 -34 -63 41 42 87 2
6238 2 -16 -114 -138 95 -135 -263 -93 -4 176 277 9 -235 -140 55 3 131 -87 -21 -63 146 131 -27 4 92
6262 92 433 252 63 -114 -131 -56 10 54 -138 -241 -199 69 110 145 -199 211 285 270 253 -85 -285 -32 58 -59
6286 -59 39 33 -135 80 109 73 -43 74 120 8 304 112 -28 -96 6 115 -102 -273 -260 -7 241 22 -37
6309 -37 116 -24 -25 59 -176 -180 -119 -52 116 42 39 167 373 174 249 137 -54 -175 35 142 -5 -173 -389 13
6333 13 314 -63 -41 -35 99 324 344 177 -195 16 -123 94 -102 -117 -176 90 107 147 2 -40 -151 56 61 -91
6357 -91 -269 -208 -18 71 35 -80 143 92 254 125 101 153 -223 199 311 -19 -238 -5 -98 -134 134 -46 20
6380 20 19 275 394 41 -131 3 103 231 3 -144 -1 -131 -112 0 62 110 -23 209 211 99 -40 -147 18
6403 18 150 -61 63 -219 -362 -84 101 325 -263 63 64 25 -75 -165 -280 -128 -28 142 34 -159 -215 326
6425 326 266 -62 -51 -229 69 89 108 -164 -258 -30 -15 48 122 -100 -60 230 139 256 -16 -91 -80 16 69 -47 -245
6450 -245 -128 1 248 150 -129 -207 173 94 140 28 -151 -67 173 130 60 -175 -320 23 278 -31 66 166 136
6473 136 283 56 61 -71 -194 98 10 -182 -401 -141 224 48 99 -127 215 -17 -31 202 94 -298 -112 144
6495 144 149 -127 -189 -319 68 153 -52 -41 -126 -140 -101 69 163 -247 -235 31 35 -156 -179 -55 142 -5 248 178 -45
6520 -45 -56 16 182 -40 -589 121 78 -40 -95 128 -10 68 360 262 198 -113 -227 -8 188 -163 -141 -350 -5
6543 -5 -125 144 12 -104 -28 -11 294 80 -6 4 46 97 -14 -166 -160 -325 -175 -47 67 -85 -48 174 339 241
6567 241 24 164 98 -129 18 -27 -392 -134 146 109 -191 -85 -60 186 230 24 201 -54 -268 -97 57 -23
6589 -23 -46 -237 142 44 -39 -43 184 31 -93 -170 -41 81 -431 -130 90 110 -353 -80 442 121 314 153 120
6612 120 -44 -45 256 -34 -330 -402 -196 -179 -101 -362 -52 128 361 112 295 89 -186 -126 45 -136 -402 -611
6634 -611 -66 52 -11 30 169 123 108 427 237 -122 -167 -83 25 -10 -475 -345 -111 -109 159 54 240 -93 181
6657 181 229 312 -67 -87 -106 5 -253 -115 -144 231 -39 251 314 262 -158 185 362 77 -193 -330 -22 -90 -92
6680 -92 38 -83 89 232 497 388 198 40 58 132 -223 -114 -220 -361 -159 11 219 198 -95 276 545
6701 545 382 106 -77 -87 -66 -193 -242 -220 -440 -53 395 372 104 314 407 361 180 9 -110 -170 -231 -244 -147 -214
6725 -214 -3 -144 242 429 431 -50 238 199 6 -162 -96 -411 -326 -144 -75 -261 -33 293 486 132 99 143 26
6748 26 13 -109 -155 -402 -451 -173 275 -2 34 120 288 403 126 15 -119 -304 -105 -271 -211 -393 -432 -120 249
6771 249 67 215 223 252 358 258 27 -122 -313 -368 -289 -21 -416 -390 117 230 128 98 132 290 248 -71 69
6794 69 -199 -351 -504 -285 -217 -77 -78 81 270 349 396 342 -11 -53 70 65 -220 -319 -162 -132 254 137 79 215
6818 215 50 198 330 278 -92 -116 -109 -390 -494 -183 -98 140 174 217 231 350 313 339 335 -190 -220 -233 -227 -210 -216 -199 -125
6845 -125 -54 165 56 315 132 158 76 42 -207 -490 -420 -467 -190 -93 -167 146 132 383 243 17 37 -33 -185 -83
6869 -83 -209 -40 -148 -221 -87 -70 198 112 207 252 174 92 -75 45 -39 44 -290 -327 -56 -120 196 253 141 -11
6893 -11 167 102 277 75 -72 -26 -416 -121 -140 56 -201 -55 279 167 -19 99 10 184 -188 -249 -21 -210
6915 -210 -188 46 58 257 301 286 361 280 78 -205 -189 -167 -157 -185 -255 -170 -250 146 100 153 187 123 202 119 103 -260 -26
6942 -26 133 139 -165 1 -102 -295 107 130 234 -129 122 201 151 42 -143 -139 -67 87 111 175 -41 -106 36 94
6966 94 56 -49 203 63 156 187 86 115 -87 -67 -61 18 -270 -282 10 -100 -29 70 -93 -22 -39 222 144 -168 -247
6991 -247 83 73 108 -170 78 -205 -64 -27 -170 -175 -13 -130 -143 -50 -81 192 117 216 178 128 -119 13 -72 46
7015 46 -123 -226 -331 -188 80 99 -30 85 3 211 153 -27 74 -122 7 32 51 -1 -180 -121 48 -50 -49 -100
7039 -100 19 -3 -42 -6 -77 97 51 277 378 172 49 48 181 104 -271 -237 -203 -319 -325 -247 -152 -124 389 330 268 334
7065 334 451 460 193 31 -175 -264 -275 -203 -313 -238 -256 -101 137 439 329 130 -6 179 185 -68 116 38 69 63
7089 63 -33 -7 -80 26 4 131 -221 -24 -33 -105 -65 -123 -56 -198 -133 278 322 345 385 39 188 -14 7 -64 -57 -336
7115 -336 -172 124 143 -13 -12 127 135 172 251 23 21 -23 79 -175 -302 -544 -386 -408 -241 -159 222 348 267 156
7139 156 375 51 132 -32 -119 -138 -260 -160 -139 42 -61 176 85 74 279 247 237 181 14 -96 -101 -436 -227 -164
7163 -164 -51 -82 117 290 255 328 361 -109 29 -83 -362 -48 -267 -23 -55 20 170 166 113 150 189 114 -106 -90
7187 -90 -31 -312 -400 -155 -43 63 18 219 100 297 257 241 -59 -186 -140 -168 -239 -462 -365 -95 -82 144 132 43
7211 43 129 205 68 392 -24 -79 -108 -280 -406 -337 -378 -296 -1 95 192 51 202 -71 110 72 -212 -67 -316 -261
7235 -261 -34 -38 -231 36 74 262 226 59 86 -14 -139 75 -283 -346 -310 -306 -57 -60 140 419 317 5 209 151
7259 151 189 -28 -287 -342 -336 -323 -288 -239 -167 6 121 297 265 142 290 256 14 -10 -98 -211 -244 -409 -112 -73 13
7284 13 291 175 154 163 108 -6 -60 -126 -257 65 -46 -207 2 95 126 119 170 209 212 -88 -103 -110 -238 -242 -336 -145 -198
7311 -198 -175 29 -63 61 111 164 180 24 -19 -358 31 -76 -144 -143 6 78 162 148 79 1 88 164 208 53 -168 -179
7337 -179 -171 31 -138 -33 63 19 212 176 108 187 33 123 76 -121 -324 -175 -70 28 -9 61 301 57 182 279
7361 279 130 168 -167 -69 -74 -352 -270 -352 -8 -108 -46 150 48 141 149 20 39 113 -37 -15 -123 0 -79 -129 -14
7386 -14 130 104 0 139 20 -25 -251 -297 -352 -108 25 -90 55 89 273 185 200 388 156 -92 -64 -201 -33
7409 -33 -82 -126 -171 -121 98 148 136 254 36 166 233 -55 13 -48 12 -22 -130 -217 -212 -120 -78 8 -59 -90 47 -43 101
7436 101 116 115 37 44 120 79 -41 150 -22 87 209 105 54 -13 11 -134 -180 -154 -95 -269 -80 -219 -32 26 99
7461 99 52 161 193 91 -32 -57 -76 -185 94 -94 -316 -101 131 49 -104 -101 72 12 169 -113 64 -69 33
7484 33 -98 -187 47 196 0 183 71 156 23 134 -134 -183 -65 -328 -177 -60 -72 34 -110 142 341 280
7506 280 195 184 -162 -52 -149 -196 -205 -208 -151 -95 125 238 156 245 314 107 65 49 -163 28 6 59 -88 -86 -407 -177
7532 -177 -10 -87 67 -13 20 6 17 141 70 -26 58 60 134 12 254 46 315 -165 -134 -161 -105 -214 -205 23 -75 49
7558 49 96 118 177 208 191 113 106 187 -53 -13 -49 -120 -92 -131 -164 -150 -30 153 102 167 253 102 386 -91 -95 -42 -119 -133
7586 -133 -54 -136 -143 -235 0 -76 131 43 -121 79 127 -41 88 -51 -37 -138 -104 -87 -11 58 258 146 -83 -49 -123
7611 -123 -31 16 -101 32 -102 63 -94 14 -57 71 105 91 -26 0 246 219 -80 45 -257 -178 -109 -16 -28 228
7635 228 125 -177 102 -138 109 101 -70 59 -249 -39 -10 -3 23 1 73 239 94 86 336 5 50 -250 -354 -99
7659 -99 -202 -193 -62 106 110 116 135 -54 58 107 58 -83 -81 -63 98 -90 -124 -3 -36 44 -36 163 116 -7 -34 179
7685 179 20 192 -133 -75 73 27 58 237 -72 111 81 -43 7 -82 -107 -159 61 -104 -22 48 336 129 17
7708 17 320 -23 356 7 143 62 -93 -165 -27 80 -95 -94 -48 -41 -80 15 -82 39 108 155 132 -38 25 -62 59
7733 59 -198 -81 2 -220 -2 78 35 -29 -91 -128 129 -74 93 -178 -31 144 183 -229 -24 -16 93 4 42 -192
7757 -192 -3 42 -192 -2 -28 -156 -118 161 26 242 47 160 170 161 333 140 125 126 -372 -40 -42 -129 36 -38
7781 -38 -97 71 101 -91 72 -100 -14 -130 61 152 26 -36 -43 -91 108 144 -197 110 -53 4 64 -26 -76 -178 -332
7806 -332 -27 83 -166 -84 63 107 303 107 25 -112 183 45 -18 -42 -65 45 -99 -25 -137 -160 -128 3 -30
7829 -30 41 145 17 -110 92 22 90 -120 -80 85 159 205 -18 -10 141 -186 68 -95 -164 -100 47 -73 -22 -112
7853 -112 187 206 -20 162 133 118 219 87 -66 58 -260 -84 -221 -273 115 338 103 121 90 16 136 165 137
7876 137 17 29 31 -17 -96 53 124 100 112 104 -170 -200 -196 -149 -63 -158 -256 155 84 105 129 124 108 170 235 22 52 -23 53
7905 53 -74 -222 -189 -66 108 176 -157 -110 78 140 250 -7 123 162 55 -25 -242 -233 65 10 -33 45 -8 -19 -146
7930 -146 -89 -87 32 128 164 149 46 49 38 18 -60 -39 -49 -73 106 91 -5 -5 -53 -17 -200 -56 -165 -72 -211 -53 31
7957 31 177 -73 178 -51 -15 29 -30 206 -67 -24 -34 91 70 -40 -15 30 57 100 112 -96 51 -161 37 208
7981 208 -33 -282 79 39 44 -29 -157 -85 20 -44 -71 29 8 -183 65 22 -47 -85 -66 52 -156 52 45 218 -51
8006 -51 -28 -84 -135 -138 10 103 17 70 -13 12 7 73 169 -25 187 123 223 -44 -40 -8 101 -101 257 19 226 -14
8032 -14 -38 -71 -31 46 45 -23 116 130 -105 -70 -92 -20 -76 138 -125 51 36 56 34 52 -164 81 -49 192 11 250
8058 250 -225 -6 -68 13 -67 -6 45 -87 -135 -93 -95 -160 63 134 -8 23 157 -142 166 49 -11 -2 66 74 28 -21 57
8085 57 -199 -120 -53 113 -22 99 17 -220 -95 -67 -97 -57 -15 4 114 338 172 -88 -84 -50 4 -105 -14 -103 -26
8110 -26 126 113 -83 125 86 -93 24 135 -37 11 136 -6 -227 78 -130 107 -70 151 78 91 -35 190
8132 190 43 98 157 -53 -139 -18 146 165 -44 -77 45 -31 114 48 -61 -4 -257 -15 2 -47 -112 25 108 -154
8156 -154 22 88 -92 -180 -44 -9 -22 -4 -70 88 -34 134 119 288 59 -103 -72 23 51 8 136 44 -172 48
8180 48 59 54 149 41 32 -84 -134 3 107 204 185
8191A85
$$ Imaginary data points
##PAGE= N=2
##DATA TABLE= (X++(I..I)), XYDATA
0 0 0 0 0 0 0 0 0 0 2 0 8 0 8 -8 8 -16 16 -19 23 -30 33 -41 48 -55 65 -75 87 -100 119 -133 152 -174 197 -223
34 -223 252 -282 317 -355 398 -444 492 -549 606 -673 744 -822 906 -999 1101 -1213 1337
51 1337 -1470 1622 -1791 1981 -2193 2436 -2719 3043 -3433 3898 -4477 5208 -6176 7516 -9508
66 -9508 12785 -19154 36355 -188359 -630066 -687987 -708193 -624871 -629372 -623034 -448787 -16120
78 -16120 362413 480325 422877 444967 517277 501919 337664 115566 -95751 -188116 -124702
89 -124702 -29090 -100568 -266017 -282259 -98523 45652 12636 -87083 -104432 -44911 36014
100 36014 78171 26054 -81463 -67914 130771 317042 284218 123762 53698 89995 75366
111 75366 -52658 -224587 -358233 -386017 -276514 -133970 -115258 -174310 -95432 164819 390029
122 390029 422326 349777 308205 296817 251620 138178 -61807 -300115 -423790 -349442 -224071
133 -224071 -230134 -300460 -236842 -28754 152401 213530 202626 180926 182543 222759 235539 110693
145 110693 -106477 -211205 -122785 -9528 -24315 -94289 -81291 14060 99600 117532 51013
156 51013 -65932 -125402 -59905 21792 -32494 -168348 -192343 -60823 77732 120361 108864
167 108864 110596 145378 201493 218833 113351 -81642 -198969 -155195 -79733 -110693 -191312
178 -191312 -182795 -70317 53682 123815 124329 79680 66948 135014 191982 106239 -78492 -179354
190 -179354 -133839 -61307 -60171 -94001 -88705 -22764 81766 160840 135546 21914 -42149 17786
202 17786 88386 36900 -87519 -142093 -92455 -17608 21187 15616 -9583 4216 91881 173383
214 173383 127413 -21888 -114932 -81293 -24516 -44114 -107672 -130657 -84980 5402 86020 93297
226 93297 33579 12591 96758 186540 148671 12614 -80181 -76554 -44659 -50878 -93927 -134785
238 -134785 -120128 -25748 78862 84922 2295 -37242 33073 117921 108534 25324 -39126 -42160
250 -42160 -6555 19473 -8896 -76668 -94319 -8114 95272 94229 3156 -54663 -24727 29347
262 29347 34770 -12474 -67649 -75052 -14689 54921 44996 -36213 -71507 1544 96991 103892 31490
275 31490 -30312 -31867 3152 23525 -9769 -78907 -101918 -29343 65759 70137 -8258 -54112
287 -54112 -8959 62312 78819 33201 -24429 -42635 -6051 37369 14530 -68670 -109709 -45716
299 -45716 49360 67434 9080 -36258 -18416 35974 67867 42437 -20258 -49093 -1269 65472
311 65472 53970 -34270 -92788 -57148 18109 45065 8218 -39503 -41767 9180 60531 46540
323 46540 -25962 -66916 -18076 58873 65258 -3159 -62183 -51796 4640 42685 25468 -23928
335 -23928 -40054 12386 78237 71455 -7740 -65995 -40346 22653 40343 -5088 -60585 -68224
347 -68224 -19124 35316 31777 -24033 -52052 1180 79819 90114 22531 -42239 -41689 4963 33758
360 33758 7718 -48237 -68512 -19632 48809 55098 -6446 -50756 -16325 53882 75875 27501
372 27501 -36840 -56084 -21936 16398 4812 -49482 -74627 -23212 58106 81356 30140 -24135
384 -24135 -18436 30482 56107 21655 -44571 -76684 -42825 12835 19466 -28824 -58490 -12731
396 -12731 72205 111985 74983 10125 -16989 5255 26170 -6335 -79806 -122756 -87309 -14210
408 -14210 16400 -13561 -41637 -8711 68392 120252 102588 40144 -1398 9817 35318 11734
420 11734 -60835 -110470 -82599 -7715 35894 16783 -22809 -22562 24827 68607 53953 -11064
432 -11064 -58531 -41373 7653 16654 -30236 -71051 -46063 30586 89093 82510 32903 2793
444 2793 20809 49419 27741 -46058 -105555 -93234 -32343 4769 -13866 -45207 -29257 38796
456 38796 103153 107518 57825 14381 18292 42723 24742 -48142 -117477 -120532 -64207 -12744 -11244
469 -11244 -38868 -36688 19585 85172 98579 52566 6377 11312 49047 56523 6222 -58831 -74271
482 -74271 -28234 25622 30837 -8633 -34108 -8263 36950 38817 -17450 -77340 -82746 -36923 1727
495 1727 -6302 -39801 -39366 18908 91697 116530 83948 46473 50146 76049 64643 -7262 -95521
508 -95521 -135816 -113884 -74078 -67080 -87470 -83157 -19429 69655 117431 101383 66430 66077 96845
521 96845 103631 49884 -36107 -90583 -82803 -48193 -41805 -71844 -90519 -53804 16448 57426 37952
534 37952 -5620 -14983 22525 60705 52670 6525 -21789 2378 51865 68356 32586 -13270
546 -13270 -19501 10589 24048 -16872 -87337 -126224 -104087 -54351 -31068 -41846 -41012 11335 93781
559 93781 144882 132413 87258 63822 76505 82124 36631 -50132 -118819 -126629 -95306 -79103
571 -79103 -96693 -107688 -66737 16437 84361 94213 63646 46029 66995 94688 79827 18194
583 18194 -41491 -51835 -24247 -11463 -40574 -79650 -77161 -25346 28730 36750 3185 -22838
595 -22838 -5209 36424 50455 18799 -19614 -15974 29112 62981 46073 -2959 -29123 -9272
607 -9272 23480 19359 -29060 -75928 -76536 -39220 -13525 -27902 -52892 -38818 22466 84041 97048
620 97048 64016 33805 40346 64013 56855 3031 -58073 -77195 -52026 -28212 -40813 -72470
632 -72470 -73553 -24229 40408 68031 47015 16710 20521 49314 56543 17351 -38162 -57934 -29564
645 -29564 6105 5982 -26368 -46514 -21318 28664 52508 28086 -10695 -16915 12107 32408 10459
658 10459 -34248 -52148 -21762 25137 41439 16790 -12494 -6966 26768 43215 14175 -34142
670 -34142 -51549 -25552 5160 777 -33122 -52611 -27579 23433 52689 37936 7196 4277
682 4277 33678 53805 29436 -21515 -49635 -31509 4090 12052 -16466 -45104 -34990 7061
694 7061 36334 23444 -10159 -19260 9202 38956 29724 -12154 -42290 -29780 8783 28745 10555
707 10555 -19241 -19309 14073 40072 25538 -14350 -34920 -15427 17605 22148 -9171 -41437 -36715
720 -36715 980 29615 20329 -8928 -13952 16250 46223 38466 -2656 -34937 -28110 3865 19233
733 19233 -2549 -35851 -38943 -5584 25585 20146 -9488 -21095 4364 39383 43714 11449 -24641
746 -24641 -28073 -613 20537 6580 -25594 -34538 -7099 23902 21501 -10322 -32465 -17437 18970
759 18970 36792 17813 -15529 -23756 2081 27856 19974 -11936 -28034 -7152 25074 29631 -586
772 -586 -33235 -33044 -1608 23548 13799 -15967 -26245 -2398 26160 24506 -5786 -27174 -13947
785 -13947 19805 35601 14888 -19708 -29368 -5396 19915 13983 -14446 -28229 -8354 21780
797 21780 27583 1580 -26359 -23961 7545 33125 23471 -8558 -22884 -4484 20656 17623 -12126
810 -12126 -33727 -21884 9768 26105 8355 -22508 -29041 -2132 27658 26529 -313 -16099
822 -16099 -649 25589 27233 -1706 -31027 -30456 -2416 20397 11392 -17190 -29001 -7935 21535
835 21535 24869 1340 -16814 -5806 22312 33430 11135 -23152 -33801 -12270 13990 12716
847 12716 -12439 -26710 -9917 19886 27996 6880 -18111 -15819 11554 31604 19462 -13723
859 -13723 -30861 -14645 11468 14616 -6904 -23729 -11965 17095 30411 12447 -18232 -27149
871 -27149 -5208 20199 17912 -8001 -24363 -10324 17200 25051 5779 -16403 -14146 11722 30126
884 30126 16991 -16565 -35288 -20817 5485 10715 -7981 -22872 -10186 20207 35656 20677
896 20677 -7256 -16375 2960 24458 18977 -11867 -33935 -25469 -915 8561 -6896 -23543 -15046
909 -15046 15573 38531 30045 1130 -15436 -3231 18635 18950 -5136 -26976 -21868 1974 14719
922 14719 561 -22434 -25051 426 27354 26719 519 -19781 -12488 9309 16345 -944 -21253
935 -21253 -18431 7293 27449 19003 -8093 -21381 -5764 19424 22781 603 -21325 -18801 1598
948 1598 12735 -322 -21695 -23082 2562 29355 29259 4917 -14561 -7436 13099 18593 -80
961 -80 -23052 -24445 -4441 11885 3822 -19351 -28113 -7914 21889 30685 12561 -7987 -6597 11713
975 11713 21395 6227 -17585 -23138 -3049 19535 18514 -4827 -21901 -12650 11368 21157 5684
988 5684 -16212 -19947 -2857 10872 2092 -20469 -28164 -8280 20639 29557 13282 -5264 -3074
1001 -3074 14735 24407 10223 -14611 -23427 -8788 9014 5562 -16600 -30858 -18091 9627 24400
1014 24400 14788 -2795 -4736 11346 24529 14923 -9983 -22905 -10339 11041 14593 -4669 -24202
1027 -24202 -21269 -627 13927 6630 -11298 -15456 1040 20041 17875 -2917 -17090 -7230 16111
1040 16111 26467 13215 -7492 -12005 2001 13529 5258 -16713 -27587 -14772 6583 11724
1052 11724 -4186 -20679 -15789 7179 23855 18600 1086 -5356 6927 21572 16064 -7249 -24829
1065 -24829 -18840 1075 10603 -1096 -18763 -20003 -1649 15968 14466 -1678 -9250 3132 21738
1078 21738 23033 3339 -16975 -17172 -467 11915 4648 -13170 -19086 -5501 11610 11292 -5554
1091 -5554 -18080 -8517 12574 22293 10300 -8549 -12834 1266 15843 12447 -5082 -15083 -5654
1104 -5654 10851 12942 -4765 -22642 -20252 -653 13886 9080 -6161 -11530 1164 17330 16979
1117 16979 578 -12502 -6312 11211 17717 3548 -16386 -20543 -5963 9609 9020 -4798 -12501
1130 -12501 -2237 14775 17968 2061 -14798 -13689 3037 15255 8277 -9967 -18234 -7557 8189
1143 8189 10129 -3320 -13804 -6239 11722 19759 7682 -10801 -14759 -702 14159 12773 -2281
1156 -2281 -12377 -4727 10063 13034 -1347 -16205 -14003 3036 14802 7866 -9515 -17440 -7021
1169 -7021 8735 11463 -929 -11838 -6316 9908 16692 5350 -12250 -15708 -2040 12959 12269
1182 12269 -2195 -12481 -5340 10116 15123 3469 -10494 -8813 6460 16535 8175 -10660 -19575
1195 -19575 -10553 3986 6585 -4568 -14575 -9032 7826 16490 7372 -7422 -9427 4371 17541
1208 17541 14487 -2016 -13653 -9147 4190 8691 -1582 -14043 -11798 4088 15549 9609 -6042
1221 -6042 -13598 -3985 10284 12841 465 -12034 -9471 4447 12215 3449 -11158 -13116 443
1234 443 13841 12161 -2783 -13194 -7968 5720 11121 1594 -10660 -9791 4745 15051 8991 -6343
1248 -6343 -12859 -3864 9607 11445 -322 -13106 -11499 1715 9953 2499 -10591 -11965 1862
1261 1862 15511 14229 510 -9736 -5753 7008 12091 2335 -11438 -12452 275 10259 4805
1274 4805 -8897 -14123 -4091 10175 13414 2897 -8653 -7723 4121 11042 3035 -10725 -13287
1287 -13287 -1497 10481 9167 -3112 -11399 -5615 8190 14924 6858 -5876 -7262 3501 12000
1300 12000 5223 -9351 -15540 -7036 5859 8746 -1025 -11638 -10087 2666 11676 5886 -6452
1313 -6452 -8623 2324 12526 9891 -2929 -11751 -7506 4956 11326 3553 -8057 -9171 2009
1326 2009 11000 6210 -6517 -11133 -2769 8591 10440 735 -9976 -9574 2126 10606 5223 -6795
1340 -6795 -9935 -259 9303 6898 -5181 -13001 -8825 3109 10127 4033 -7077 -8194 3136 13202
1354 13202 10036 -1557 -6221 583 10118 10012 -708 -12528 -13274 -2942 5366 1047 -9422 -11118
1368 -11118 -249 10792 9977 634 -5976 -2086 7798 12123 4184 -8842 -12317 -3117 6020 3152
1382 3152 -6997 -10148 -1808 8805 11277 3604 -5917 -6276 3258 11318 5939 -6578 -11034 -2677
1396 -2677 6588 5392 -3823 -9261 -5076 4912 10279 4414 -7332 -10691 -1472 7594 4526 -5747
1410 -5747 -9526 -2016 7938 10176 3462 -4469 -4780 4367 12040 6827 -5694 -11158 -4204 4189 2707
1425 2707 -5918 -10967 -6789 3773 10436 6664 -3283 -6035 2567 11033 7572 -4317 -10163 -4927
1439 -4927 2700 3918 -2226 -9272 -8303 2111 11801 9441 -1479 -5589 1499 9262 6528 -3938
1453 -3938 -10205 -7724 306 5262 1859 -6542 -8359 1162 11696 9945 -580 -5983 -1760 4633
1467 4633 3978 -3338 -11117 -11639 -2709 7391 6470 -2522 -5445 3296 12765 11188 1416 -4888 -3956 1329
1483 1329 4259 -444 -10002 -13126 -3956 7219 7031 -1451 -5134 1119 8445 7778 693 -6985 -8650
1498 -8650 -2123 5673 3743 -5656 -9463 -1057 9694 9608 1844 -2984 -1248 3982 6442 1585 -8284
1513 -8284 -12939 -5432 4878 5146 -3218 -6298 416 9142 10032 4233 -2302 -4469 383 5757 2546
1528 2546 -8777 -14326 -7167 3006 3714 -2285 -4786 -109 7512 11369 8388 -364 -5259 -195 7489
1543 7489 5332 -5986 -11823 -6272 1743 3259 -443 -4459 -3874 2632 9493 8119 -2158 -8897 -3381
1558 -3381 4864 4078 -4150 -8330 -4616 2169 6428 5000 -1045 -4569 1172 9361 7989 -3034 -9787
1573 -9787 -5327 1531 1962 -2404 -6043 -4694 1757 9691 9731 1221 -4825 -415 7208 5181 -4746 -10649
1589 -10649 -8482 -2963 362 -234 -4020 -5756 1350 11706 12430 3267 -3491 -87 5441 3757 -3077
1604 -3077 -8583 -8849 -4256 2490 3815 -2213 -6575 44 10067 10168 1652 -4119 -2120 1328 2106
1619 2106 -789 -5992 -9235 -3961 5617 7549 -14 -5111 -189 6897 6784 714 -4116 -5290 -2181
1634 -2181 2031 2162 -4178 -8823 -3085 6837 8666 2023 -2555 188 4535 4837 1693 -4005 -8060
1649 -8060 -4866 2339 3665 -3753 -8648 -3069 5588 7444 3134 -368 -194 2263 5009 3796 -3575
1664 -3575 -9926 -6379 2404 3811 -2488 -6128 -1737 4387 6677 5033 1557 -2053 -343 4858 4519
1679 4519 -4298 -11048 -7273 702 2682 -475 -2442 -269 3961 7932 8139 2157 -4217 -2564 3716
1694 3716 3363 -4626 -10445 -7281 -1065 1578 1103 -343 -931 2073 7946 8734 951 -6323 -4466 1853
1710 1853 2292 -2686 -5660 -3968 34 4621 6059 2720 -1891 -24 6468 6293 -1890 -8885 -7458
1725 -7458 -2467 -747 -1695 -2984 -2969 747 7154 9776 3961 -2443 -1181 4540 3898 -2750 -8066 -7882
1741 -7882 -4799 -1300 679 -1098 -3230 471 8698 11035 4798 -1623 -610 2771 2822 -859 -4743
1756 -4743 -6916 -5554 -641 2401 -1627 -5905 -2547 5038 7027 1979 -2739 -2735 -222 1581 1600 -1524
1772 -1524 -4604 -2353 4877 7769 2991 -1960 153 5104 5461 1585 -2769 -5738 -5738 -2576 -1158 -4816
1788 -4816 -8707 -4986 3641 7602 4174 1046 1869 4533 5253 4020 -456 -5364 -5758 -966 1061 -2910
1804 -2910 -6974 -3517 3917 6990 5541 2949 934 977 2354 2209 -3017 -8783 -7745 -1403 1933 -955
1820 -955 -3604 -1233 3212 6197 6101 2836 -1419 -2405 838 1818 -3288 -8462 -5814 866 4728 3839
1836 3839 2123 1781 3178 5556 5790 1034 -5137 -6157 -1997 -600 -4535 -7988 -6002 -535 3447
1851 3447 5003 3948 1679 1875 5236 5987 811 -5074 -4869 -359 1582 -535 -3064 -2929 -523 3090
1867 3090 5228 2498 -1776 -2163 1539 2793 -2063 -6681 -6087 -2022 1179 1878 922 -524 625 4664
1883 4664 6975 3436 -1866 -2174 1107 2190 -1324 -5027 -5830 -3742 -188 2323 1575 -980 53 4634
1899 4634 6231 2856 -2125 -3053 -577 506 -621 -3197 -5310 -4459 -74 3281 2022 -1032 380
1914 380 4682 6411 3333 -990 -2605 -1995 90 669 -1366 -4138 -3724 926 3728 1789 -1685 -1611
1930 -1611 1469 2821 1510 -1904 -4429 -4466 -1215 1461 385 -1937 -825 3988 6312 4240 793
1945 793 -709 53 1263 950 -1993 -5164 -5575 -1699 1461 44 -2102 -821 2824 5147 4165 1113
1961 1113 -1579 -2073 -247 993 -966 -4256 -4357 -242 2565 1341 -1118 -981 893 3255 3471 1347
1977 1347 -1795 -2513 255 2224 400 -2564 -1946 1460 3393 2689 132 -1922 -1824 44 1542 -686
1993 -686 -4162 -4327 -883 1566 755 -1413 -957 1503 4108 4758 3011 34 -1317 536 1852 -524
2009 -524 -3779 -4491 -2196 94 -293 -1868 -2407 -829 2446 4752 3703 1146 630 2516 3873 1533
2025 1533 -1739 -3358 -2055 -771 -1024 -2764 -4903 -4758 -1478 1564 1485 -255 364 2859 5076 4344
2041 4344 1881 109 217 1572 2011 233 -3008 -4486 -2329 -479 -1069 -3099 -3444 -1095 1424 2339
2057 2339 941 -465 -61 2621 4695 3914 969 -355 837 1461 43 -3160 -4955 -4575 -2677 -806
2073 -806 -1596 -2847 -2143 1411 4619 5038 3500 3075 3844 4942 3496 252 -3253 -4716 -3549 -2320
2089 -2320 -3251 -5133 -4926 -2253 722 1795 998 705 2119 4528 5094 3320 643 -850 401 1648
2105 1648 406 -2134 -3428 -2157 -647 -275 -1788 -2712 -2245 438 2657 2092 535 -428 918 2434
2121 2434 1870 -254 -1767 -1334 -76 639 -772 -2657 -2914 -724 1373 1087 -479 -1087 175 1956
2137 1956 2357 943 -334 133 1776 3162 1993 -690 -2072 -1479 -370 -702 -2745 -3794 -2893 -495
2153 -495 873 824 -277 -194 2032 3779 3218 795 -1056 -947 -57 -317 -1724 -2685 -2026 348 2523 2748
2171 2748 1188 618 1602 2770 1387 -991 -3023 -3223 -2379 -1609 -2138 -2995 -2143 487 2862 3103 1996
2188 1996 784 1408 2505 1988 376 -1547 -1587 -480 653 100 -1691 -2054 -996 757 629 -887 -2084
2205 -2084 -1527 82 886 305 -737 -72 1897 3407 3232 1244 25 10 552 -21 -1715 -3530 -3542 -2099
2223 -2099 -793 -733 -1585 -1397 979 2861 3586 2296 1523 1664 2401 2213 442 -1536 -2200 -1968 -1133 -1720
2241 -1720 -3367 -3780 -2547 -308 900 900 872 1845 3313 4397 3441 1643 303 470 693 137 -1683 -3571
2259 -3571 -3318 -1737 -1114 -1343 -1978 -1499 -103 1217 1258 248 -250 878 2280 3005 2063 1000 963 1662
2277 1662 1771 543 -1664 -2880 -2862 -2066 -2234 -2820 -3115 -1800 399 2332 2701 1970 2472 3173 3243 2001
2295 2001 -236 -2036 -2204 -1842 -1738 -2325 -2874 -2099 -258 948 1522 770 801 1461 2366 1807 305 -606
2313 -606 -844 134 613 61 -1098 -1183 -406 248 235 -1558 -1907 -1354 221 417 -111 -599 -298 963 1784
2332 1784 1524 378 148 195 1000 631 -628 -1462 -1264 -110 440 -16 -388 -679 27 943 721 -117 -866
2351 -866 -342 364 321 -339 -1029 -1050 60 555 545 -400 -142 503 1298 1265 472 -447 -129 622 728 138 -1194
2372 -1194 -1309 -1050 -355 -434 -1234 -1259 -259 996 1555 1204 451 434 1067 1427 529 -468 -1158 -876 -547 -393
2392 -393 -1130 -1549 -765 301 956 813 343 147 822 1287 1236 251 -234 -46 633 713 -347 -1128 -1305 -820
2412 -820 -404 -522 -1294 -1446 -672 535 865 307 150 781 1644 2010 1449 640 180 292 539 -230 -1159 -1734
2432 -1734 -1397 -603 -617 -821 -1178 -731 361 1233 1203 778 493 937 1508 1330 333 -470 -728 -249 -264 -917
2452 -917 -1653 -1631 -994 -195 303 -100 -135 333 1399 1728 1310 784 626 890 870 339 -653 -1512 -1358 -1028 -1095
2473 -1095 -1376 -1690 -1148 31 832 803 636 1026 1873 2316 1746 823 -9 -352 -455 -724 -1535 -2312 -2178 -1439
2493 -1439 -388 -502 -162 152 1094 2106 2394 1879 1322 1200 1381 901 -289 -1267 -1596 -1843 -1518 -1610 -2187
2512 -2187 -2169 -1246 28 892 1232 1372 1924 2653 3258 2511 1543 648 6 -348 -1378 -2599 -3439 -3249 -2500
2531 -2500 -1822 -1261 -560 77 1430 2884 3086 3037 2533 2253 1821 1345 -103 -1490 -2101 -2396 -2383 -2684 -2997
2550 -2997 -2711 -1929 -365 640 1019 1443 2285 3465 3883 3200 2295 1305 838 -305 -1443 -2928 -4002
2567 -4002 -3947 -3491 -2849 -2579 -1830 -290 1572 2598 3321 3655 3316 3288 2887 1883 536 -875 -1709 -2096
2585 -2096 -2334 -2841 -3144 -2720 -1897 -840 -202 21 490 1422 2572 2760 2571 1955 1812 1695 1108 -31 -1245
2604 -1245 -1902 -2266 -2314 -2568 -2403 -2222 -1151 338 1235 1652 1961 2205 2759 2460 1812 837 -62 -662 -1166
2623 -1166 -1477 -1937 -2320 -2062 -1183 -395 -278 42 399 766 1382 1494 1129 821 879 1104 882 244 -527 -892
2643 -892 -708 -520 -716 -1087 -1160 -758 -109 421 551 370 482 875 950 441 -163 -482 -330 -225 -259 -406 -303
2664 -303 44 583 899 495 386 144 286 280 -432 -791 -879 -726 -442 -25 -226 -225 146 390 698 303 -124 -190
2686 -190 -42 -38 97 -17 124 218 394 562 233 -242 -405 -102 -407 -683 -862 -948 -237 350 891 833 765 1013
2708 1013 1195 1130 351 -535 -758 -1175 -1163 -1150 -1202 -1086 -582 131 708 852 763 876 1076 1052 837 161 -83 -173
2730 -173 -266 -159 -585 -752 -603 -293 -276 -502 -653 -569 -191 233 146 191 378 717 748 869 620 263 73 229
2752 229 255 -258 -549 -623 -587 -421 -368 -373 -628 -60 212 745 650 434 542 833 1075 607 276 -292 -467 -540 -784
2775 -784 -1290 -1522 -1089 -576 -249 64 256 744 1310 1818 1600 1256 733 453 20 -378 -1349 -1772 -1707 -1352
2795 -1352 -819 -809 -460 -134 385 856 992 932 702 581 879 821 255 -222 -359 -267 -340 -294 -739 -1093 -941 -786
2817 -786 -682 -500 -307 -10 719 1106 1363 1190 1150 996 803 271 -241 -1160 -1443 -1587 -1659 -1631 -1418 -1213 -375
2838 -375 578 954 1333 1793 1860 2003 1788 1176 192 -186 -737 -1005 -1475 -1925 -1844 -1555 -1083 -519 -237 18 523
2859 523 1361 1559 1576 1351 875 963 755 263 -333 -811 -1001 -1192 -1172 -1264 -1408 -765 -360 -73 286 466 732
2880 732 899 1306 1410 805 567 271 261 70 -614 -1315 -1317 -1049 -1093 -891 -580 -621 15 536 976 895 706 1104
2902 1104 1193 888 692 57 -354 -518 -390 -789 -1034 -1227 -920 -316 -274 -222 -220 336 706 880 992 623 570 490
2924 490 513 282 18 -629 -446 -250 -156 -365 -774 -498 -192 8 233 -124 -24 152 402 434 244 -88 90
2945 90 295 330 369 -67 -233 -21 17 -25 -225 -737 -802 -390 4 -225 -130 -241 275 587 758 513 339 401 382
2968 382 53 -74 -589 -602 -350 -280 -241 -386 -123 -167 173 343 480 228 355 516 531 245 -104 -144 76 -50
2990 -50 -134 -476 -672 -566 -319 -127 -235 -159 69 371 604 543 391 287 289 215 160 -246 -654 -902 -608 -379 -362
3013 -362 -473 -27 399 661 782 443 400 307 438 366 156 -59 -354 -10 -147 -355 -682 -689 -430 -288 -124 -177
3035 -177 -85 -37 564 1102 1154 781 823 780 698 -76 -767 -1131 -1507 -1422 -1188 -1098 -1016 -560 408 1155 1258 1642 1054
3058 1054 1513 1186 1124 361 -379 -965 -1062 -1036 -1003 -1315 -1317 -686 -326 -99 58 425 495 1083 1060 997 734 567 569
3081 569 621 210 -593 -603 -875 -992 -1033 -953 -1084 -750 -277 367 570 508 803 1329 1455 1112 698 386 33 -215
3103 -215 -343 -792 -1259 -1482 -1088 -632 -617 -734 -292 178 868 817 886 942 861 1043 954 632 -62 -464 -631 -729
3125 -729 -1187 -1225 -1292 -940 -630 25 254 632 638 1046 1288 958 430 187 215 -105 -304 -545 -620 -624 -379 -123 -50
3148 -50 -534 -734 -352 -136 -316 -354 -86 234 345 700 989 719 491 553 588 218 -545 -893 -747 -749 -903 -912 -781
3171 -781 -444 -36 574 728 598 458 930 918 426 -103 -367 -243 -342 -264 -180 -331 -685 -652 -5 -166 -410 -316
3193 -316 -35 154 68 324 387 507 751 852 626 364 -11 181 259 -360 -734 -983 -677 -833 -849 -739 -204
3214 -204 -128 -73 692 755 786 514 1064 1111 1022 516 395 47 -203 -605 -659 -1020 -1445 -945 -476 -482 -465 -334 346
3237 346 552 519 853 1047 646 452 762 690 -53 -518 -456 -299 -688 -1095 -827 -732 -679 -149 8 -67 120 638
3259 638 1180 1355 924 730 1214 844 496 27 -502 -1062 -1555 -1356 -1061 -1563 -1447 -670 226 478 559 1140
3279 1140 1521 1519 1735 1572 946 325 -55 -123 -562 -1306 -1466 -1403 -1053 -1217 -993 -562 -344 -92 560 1060 850
3300 850 884 1425 1554 1134 556 177 164 -281 -646 -741 -1282 -1464 -1533 -944 -267 -393 -123 789 1132 1297 1352 1445
3322 1445 1204 800 595 300 -585 -1306 -1337 -944 -1229 -1394 -1142 -473 -205 129 613 921 1098 1093 1415 1422 775
3343 775 225 514 53 -615 -913 -779 -974 -912 -713 -246 -551 -613 105 524 602 289 486 878 857 618 600 429
3365 429 -190 -446 -283 -269 -995 -1146 -870 -351 -463 -152 252 356 427 628 1183 730 319 203 439 80 -419
3386 -419 -690 -573 -561 -607 -666 -195 -184 -130 388 654 212 -76 284 346 398 120 97 168 -234 -258 -82 -276 -510
3409 -510 -342 -157 65 -217 -411 -48 205 164 146 383 161 -46 182 406 148 -313 -210 1 -172 -205 -337
3430 -337 -220 -86 -219 183 -141 -449 -71 239 419 90 -109 205 384 33 -106 17 -266 -490 -170 81
3450 81 -157 -531 -362 253 257 78 54 287 197 127 46 86 -219 -240 35 307 -145 -373 11 21 -162 -278 -84
3473 -84 -27 -287 90 308 246 -149 -56 466 693 73 65 82 -44 -82 -121 -378 -455 -420 17 245 90 63 253 519
3497 519 124 236 305 -62 -254 -240 259 -143 -334 -498 71 250 -83 -233 -168 63 -102 284 121 170 176 454
3519 454 610 323 -74 65 136 -90 -368 -470 -629 -679 -474 -126 65 -57 318 624 914 683 405 309 249
3540 249 -81 -327 -191 -623 -542 -461 81 -217 -323 93 406 392 291 276 322 197 250 333 226 -69 -244 -78
3562 -78 67 -1 -276 -308 -236 -367 -115 -46 -2 -248 370 510 453 138 262 433 552 112 -55 -15 -164 -555 -332
3585 -332 -194 -464 -555 -341 -163 -213 -137 41 380 661 543 474 446 112 323 204 -248 -525 -750 -673 -404 -521
3607 -521 -289 -18 116 139 520 764 388 234 208 107 -1 -405 -560 -245 -33 181 252 302 337 143 366 -51
3629 -51 -344 -464 -574 -214 -529 -179 82 171 358 668 782 752 182 -38 -174 -327 -917 -1218 -1106 -923 -484
3650 -484 -205 -68 396 591 936 1038 676 409 475 263 -182 -394 -603 -724 -492 -275 -255 -216 -161 -62 336 -75
3672 -75 -114 -325 -4 -115 -56 230 56 454 118 409 458 115 227 22 -104 -332 -452 -837 -893 -605 -423 -168
3694 -168 -222 234 578 770 972 921 709 716 407 -31 -393 -767 -933 -1009 -964 -760 -738 -313 21 636 732 903 1165
3717 1165 889 961 421 323 -362 -537 -738 -803 -399 -296 -338 35 29 240 189 -25 3 -185 -28 -170 -332 -30
3739 -30 39 278 481 557 790 479 523 208 -76 -431 -1124 -993 -805 -955 -598 -252 387 591 964 969 1004 826
3761 826 450 493 -114 -566 -821 -999 -941 -1019 -677 -397 77 396 562 573 712 502 393 266 323 -43 -301 -279
3783 -279 -308 -353 -65 70 92 278 326 92 17 -256 -360 -178 -313 -488 -467 -320 17 316 456 487 634 819
3805 819 425 333 -223 -194 -479 -600 -602 -734 -806 -573 -18 248 430 540 696 711 591 474 373 -228 -564 -562 -564
3828 -564 -627 -787 -422 -86 -13 567 234 442 265 291 209 -68 -46 -382 -160 -257 -143 186 95 28 151 413 265
3851 265 -118 -369 -202 -280 -448 -398 -450 -394 -81 241 413 494 507 779 533 393 1 -381 -527 -700 -642 -784
3873 -784 -817 -486 95 268 551 796 728 826 717 462 123 -287 -559 -706 -613 -764 -759 -642 -207 9 207 333
3895 333 760 747 774 617 266 79 5 -89 -284 -277 -345 -325 -257 10 -88 -301 -339 38 -167 -98 -4 -13 -112 82 59 400
3921 400 409 184 374 164 96 -9 -250 -362 -276 -536 -545 -573 -411 -106 138 617 507 725 665 814 610 248 -73
3944 -73 -291 -577 -1005 -1154 -1016 -746 -573 -253 188 669 690 747 1311 1120 818 778 205 -280 -478 -696 -886
3965 -886 -1121 -873 -516 -166 192 132 396 471 808 838 468 358 1 12 -123 -363 -188 -333 -299 -70 -103 -124
3987 -124 -9 -241 -42 -70 -178 112 62 373 514 523 467 490 385 351 244 -53 -206 -741 -736 -872 -716 -923 -636
4010 -636 -140 354 696 1090 1066 1149 1180 805 339 -73 -358 -837 -1211 -1374 -1328 -1075 -763 -328 192 366 877
4031 877 963 1240 1167 620 299 96 -115 -564 -606 -778 -919 -724 -451 -98 98 159 349 571 482 512 335 281
4053 281 51 199 -18 -306 -404 -304 -340 -103 -264 -281 -383 -208 -115 -22 -38 -122 -2 45 405 610 582 621 444
4076 444 375 111 -171 -465 -699 -795 -1052 -1010 -981 -551 -216 147 563 988 1282 1289 1351 1037 566 6 -532 -614 -1125
4099 -1125 -1220 -1142 -1035 -637 -223 83 726 688 1054 1124 889 767 247 -114 -455 -504 -617 -820 -719 -639 -179 -26
4121 -26 93 278 83 67 264 266 32 25 44 -110 240 274 182 222 241 13 186 -199 -269 -712 -668 -659 -532 -178 -226
4146 -226 245 572 532 926 673 634 377 44 -111 -647 -647 -737 -876 -849 -742 -545 -213 192 420 972 782 700
4168 700 800 494 138 -149 -449 -633 -750 -608 -540 -384 -261 -72 171 422 554 523 496 437 379 66 -112 -158
4190 -158 -378 -505 -325 -550 -288 92 -11 4 284 153 288 107 397 -88 -92 22 59 16 5 -10 -20 168 100
4213 100 -52 -295 -350 -286 -300 -445 -416 -203 -10 105 269 542 529 686 748 451 34 -126 -522 -493 -564 -713 -844
4236 -844 -744 -511 103 285 364 625 642 933 630 474 59 -40 -302 -448 -756 -721 -721 -511 -319 -129 194 332
4258 332 496 595 515 683 420 72 -43 -139 -181 -598 -600 -601 -542 -341 -47 -29 -114 169 397 536 620 545 312 353 258
4283 258 163 -179 -191 37 107 -182 -136 -152 -332 -290 -238 -313 -270 -318 -143 115 228 364 322 532 669 709 487 183
4307 183 -78 -305 -774 -755 -904 -1017 -808 -352 88 569 565 828 1029 941 696 184 63 -440 -633 -1079 -1145 -1032
4329 -1032 -803 -533 -74 127 667 744 809 980 812 775 222 -51 -284 -510 -474 -574 -405 -281 -71 77 90
4350 90 122 248 149 191 -102 -178 -293 -328 -257 -172 -14 374 411 536 398 297 -42 -21 -345 -484 -510 -486 -381 -417
4374 -417 -55 198 370 380 740 801 805 666 197 -147 -442 -545 -998 -967 -772 -556 -82 -17 664 714 1146 1286
4396 1286 1116 662 318 -33 -270 -854 -1064 -1055 -978 -841 -343 211 643 838 811 731 716 462 219 -299 -376 -795
4418 -795 -766 -626 -327 -60 188 543 782 601 446 416 199 -275 -803 -845 -978 -536 -459 -126 405 453 1116 1018
4440 1018 878 876 192 -163 -729 -1085 -1182 -1408 -966 -565 -142 346 906 1281 1350 1392 1079 646 2 -393 -982
4461 -982 -1156 -1225 -1384 -1128 -463 -151 317 721 956 1149 1065 769 422 100 -207 -585 -754 -698 -647 -479 74
4482 74 127 431 363 511 433 111 57 -165 -654 -766 -640 -557 -56 227 489 676 1023 1178 916 270 -127 -668
4504 -668 -801 -1150 -1365 -1322 -709 -292 175 500 951 1432 1494 1208 1024 322 -324 -657 -1007 -1498 -1549 -1402 -1063
4525 -1063 -123 168 748 1086 1290 1318 1154 819 314 -184 -529 -784 -1194 -1170 -984 -489 -108 387 610 532 945
4546 945 727 549 202 -206 -406 -718 -691 -370 -292 -214 178 542 427 751 398 328 -128 -240 -553 -623 -826 -415
4568 -415 -437 261 191 537 840 885 801 501 134 -301 -720 -1058 -1086 -1263 -1214 -838 -62 436 792 1272 1415 1214
4590 1214 1008 823 225 -339 -935 -1139 -986 -1286 -1117 -766 -232 216 701 1049 908 1034 789 449 153 -287
4610 -287 -598 -366 -646 -556 -531 -263 -15 277 605 464 352 221 -86 -59 -343 -502 -327 -232 -80 183 492
4631 492 393 300 475 392 167 -177 -351 -581 -682 -624 -583 -339 -231 183 382 636 866 430 403 553 280 -336
4653 -336 -458 -664 -890 -841 -586 -56 -140 176 647 611 664 764 706 225 184 -98 -442 -595 -719 -485 -522 -421
4675 -421 -271 238 248 465 434 363 469 429 69 -89 -45 -358 -357 -156 33 -166 -41 75 282 247 212 134 34
4698 34 -131 -101 -153 -36 -381 -25 429 130 22 402 264 202 154 -60 -273 -420 -286 -96 -377 -290 -334 64
4720 64 137 384 347 387 354 345 184 122 -33 -485 -257 -8 -354 -437 -196 -28 -308 -69 31 50 -86 74 209
4743 209 592 150 74 175 129 92 -350 -181 -304 -149 -373 55 -54 -91 -102 175 344 124 180 569 72 15
4765 15 -318 -255 -391 -357 -332 -82 -130 -49 186 549 107 55 123 162 -36 -146 -78 -128 -218 -79 270 124 111 39 214
4790 214 308 -273 -332 -377 -555 -683 -236 -7 173 198 814 747 618 541 576 657 -130 -268 -640 -505 -963 -802 -321
4813 -321 -239 -194 56 513 787 545 625 605 244 -67 -272 -283 -570 -608 -611 -237 -393 -91 204 276 427 222 341
4836 341 328 63 -271 64 76 -416 -392 -119 -22 -37 -102 110 314 121 96 253 -155 -481 -353 -146 -225 -462 -99
4859 -99 287 318 385 667 900 105 155 307 -86 -707 -1067 -948 -874 -757 -633 70 472 694 992 1085 997 491
4881 491 291 46 -470 -1188 -1187 -750 -919 -698 -141 280 387 995 966 1143 554 11 -118 -262 -809 -1224 -704
4902 -704 -500 -260 -182 415 694 661 622 933 423 -128 -450 -422 -356 -801 -687 -230 -85 223 641 960 445 449
4924 449 433 153 -317 -668 -644 -584 -834 -705 82 321 139 664 1269 1070 601 287 438 -269 -662 -866 -817
4945 -817 -979 -1018 -530 123 130 276 863 1316 767 466 494 233 -413 -887 -438 -713 -828 -461 -208 153 225 427
4967 427 899 806 303 -26 -102 -207 -851 -569 -259 -433 -552 -48 480 561 484 538 444 219 -147 -374 -440 -937
4989 -937 -900 -504 -166 -314 38 754 1346 741 694 887 605 -56 -651 -851 -1226 -1307 -1035 -484 -118 9 619
5010 619 1066 927 819 821 649 -53 -574 -377 -732 -979 -1037 -522 -153 183 329 925 1040 661 737 331 75
5031 75 -448 -655 -466 -722 -741 -573 -5 24 245 767 725 416 94 93 62 -369 -713 -319 -363 -357 -162 95 602
5054 602 437 460 687 182 -328 -307 -323 -568 -867 -651 -237 92 -62 389 928 904 735 839 598 153 -419
5075 -419 -456 -527 -1082 -1205 -800 -239 -214 124 730 976 741 856 865 529 -84 -459 -555 -778 -973 -925 -571 -458
5097 -458 -337 318 772 659 505 701 780 447 -99 -100 -121 -500 -524 -315 -19 -183 -76 154 274 -116 -211 43
5119 43 66 -419 -630 -101 -54 -8 336 338 441 384 414 646 190 -83 -311 -253 -468 -684 -320 -409 -450 -67 390 804
5143 804 493 508 775 542 38 -269 -249 -539 -833 -622 -337 -260 -241 11 330 592 540 364 769 384 -10 -139
5165 -139 -360 -664 -662 -649 -558 -282 -215 44 357 222 279 335 318 80 -44 181 -136 -369 -312 -66 87 122 52 284
5189 284 368 66 43 -17 -281 -193 -81 -239 -241 -205 -40 260 163 274 191 482 52 32 101 4 -258 -450 -378 34
5213 34 -472 -67 163 447 303 161 480 293 -220 -236 -8 -527 -439 -250 15 -68 -8 -74 327 227 239 277 68
5236 68 22 35 57 114 -168 -98 -167 -99 -148 -25 66 -218 -189 -94 113 81 -132 52 81 -73 -112 -11 -71 158 1
5261 1 48 -7 46 5 93 301 132 -93 44 100 -184 94 -110 -12 27 190 89 -54 -87 -1 177 17 87 -110
5285 -110 32 -38 -207 -155 17 -2 -3 64 228 16 115 146 180 17 -134 -130 50 -80 -112 -26 -67 -294 13 263 172
5310 172 -80 -5 -149 101 156 -37 41 115 178 91 266 52 -88 209 195 -98 -55 -305 128 -103 177 27 91
5333 91 87 -58 12 135 -163 -129 -99 -52 115 20 75 -42 204 343 110 -51 -198 -131 93 50 -150 -236 -40 -71
5357 -71 174 213 159 -20 163 -61 172 -338 -129 -58 -329 83 -68 140 164 26 229 276 -26 -177 -109 -41 -108
5380 -108 -105 -307 -303 166 62 103 193 100 131 238 237 -52 -220 -257 -182 -167 -41 77 147 99 222 471 157 77 124 311
5406 311 7 25 -204 -280 -225 -137 -6 -31 84 248 177 173 114 191 -17 103 99 75 -47 -153 -22 12 -14 -196 -159
5431 -159 78 122 129 37 1 27 215 88 1 -35 106 180 154 153 -72 -223 -7 -17 40 -81 -49 -128 31 232 124
5456 124 -110 61 312 228 491 141 95 22 104 52 -467 -282 -342 -440 -158 -59 -77 16 145 356 495 248 142
5479 142 447 258 97 -187 -358 -342 -414 -194 -372 -178 -354 0 111 281 74 216 56 39 -46 -174 -140 -269
5501 -269 -120 249 -239 55 -123 -31 33 156 -74 -280 -89 -152 128 41 -58 39 50 115 268 190 229 85 261
5524 261 169 -19 -64 -211 -322 -47 -104 -113 13 57 240 312 -17 -41 -152 72 -120 -19 -93 -309 -226 -141 247 168
5548 168 36 20 35 32 209 -218 -155 -260 -239 -62 -26 -135 -308 104 189 271 173 -58 340 295 31 -5 -108 -344
5572 -344 -82 -382 -372 -430 67 -39 41 0 99 142 26 348 97 -87 102 -43 -133 -323 -68 -148 -121 -132 36
5595 36 99 22 -80 -156 -32 97 142 48 126 15 126 225 -69 -111 -3 172 18 -160 -413 -313 -258 -120 -198 -167
5619 -167 -23 284 228 385 344 -15 236 185 201 -73 -252 -367 -33 -278 -321 -349 -186 129 347 206 154 144 267
5642 267 123 60 140 -153 -389 -112 -54 -184 -334 -248 -267 147 275 307 73 -18 317 -127 24 -107 -231 -98
5664 -98 -8 -166 -14 -281 -66 70 246 193 -146 -232 -106 56 1 -49 -108 -22 123 141 215 -15 116 -13 135
5687 135 47 -75 -55 -114 1 -5 -224 -225 134 131 215 117 95 34 -46 -2 -193 -126 -306 -198 48 -244 -59 -195 47
5712 47 137 250 129 -404 32 109 84 -40 -173 -270 -222 -109 -166 33 -89 -77 63 149 308 124 -120 -98 80
5735 80 161 0 -448 -288 -254 -257 53 -116 -260 190 274 277 269 -106 -274 183 291 220 -30 -47 -16 10 -47 -72 -148 -88
5761 -88 63 138 -99 -240 -130 78 167 192 124 -264 82 268 125 289 -198 239 2 61 -67 -138 -158 -217 -171
5784 -171 -12 -64 -17 -72 297 255 211 -178 -62 115 155 -7 -194 -262 -125 -127 137 -181 -254 60 90 360 146 -70
5808 -70 46 -60 122 116 -64 68 -107 239 235 -69 90 -235 -180 -3 165 -104 -307 0 66 133 -88 -151 -231
5831 -231 186 168 -69 -79 -234 26 12 -39 -304 -177 -112 8 -22 -172 -252 -134 35 332 95 -17 -196 -188 61
5854 61 -33 9 -44 -291 -5 87 -58 -204 -122 -6 29 169 -5 -105 -49 248 -88 -64 -43 -112 92 216 127 157
5878 157 -77 -44 154 94 -102 -87 41 20 153 111 -385 -261 -256 96 21 -2 -74 -43 260 -22 -109 -45 11 -78 110
5903 110 112 -343 -281 -149 -226 65 -37 -122 147 304 173 199 57 -152 163 94 123 2 -218 -45 11 130 16
5926 16 -186 -323 168 -58 60 -9 -8 257 190 217 122 -47 -160 108 211 -78 -236 -64 139 -50 51 -73
5948 -73 -48 -59 223 195 131 203 9 -84 74 109 -233 -72 -136 5 90 -66 -139 -122 78 168 137 101 -163 -132 288
5973 288 47 45 -179 -103 36 155 4 -66 -237 -37 96 -27 111 -193 -143 -5 363 -42 -223 -62 -18 164
5995 164 -45 -125 18 0 49 19 59 -9 87 207 31 26 -39 -179 65 141 58 -201 -359 -90 5 19 -95 -66 -257
6020 -257 73 313 290 66 -48 -23 118 48 52 -154 -156 -68 146 -181 -189 -142 -174 37 192 22 -163 40 318 393
6044 393 168 -181 -104 -87 -34 -96 -276 -65 -61 219 152 -248 -226 -144 103 262 88 100 0 164 28 94 -241 -155
6068 -155 -59 -103 50 -210 -165 -193 25 208 109 4 68 66 289 182 -29 59 -41 96 69 255 -247 -160 -108 -25
6092 -25 -237 -66 -353 -56 210 108 82 -99 -206 318 263 139 90 -64 54 -83 -10 -33 -220 -154 -41 124
6114 124 -23 -97 43 75 422 109 -99 59 77 86 3 -115 -77 -219 -50 114 -120 42 -158 -83 66 230 -3
6137 -3 -22 -234 100 110 40 82 -31 259 105 71 -86 -54 11 33 -48 135 -121 -202 222 222 154 69 160 26 42 232
6163 232 91 -49 -176 -62 61 52 -411 -169 -31 -72 176 -44 -49 104 200 127 -91 1 -118 -68 -85 -82 -105 -298
6187 -298 -263 223 25 -54 -28 -95 72 -62 -3 -279 -199 67 -25 -16 -23 -78 -6 106 127 -16 -89 17 290 54 13
6212 13 -77 -195 -155 36 72 18 -166 -58 -31 253 266 -171 -149 -153 99 -8 -12 -361 -360 102 -26 -46 -120 -31 161 153
6238 153 96 58 -42 -62 49 176 1 -166 -105 -4 59 237 41 41 21 234 106 -285 -216 -192 16 -171 58
6261 58 -296 21 59 164 248 18 -176 2 153 156 -163 -169 -106 -159 51 10 -81 -155 173 207 128 232 132 116 9
6286 9 -54 -131 -137 -71 42 131 -68 -65 -196 25 232 100 -95 42 13 -166 59 -156 -216 -176 -120 190 98 108 -174
6311 -174 130 350 58 -232 -111 -171 91 -183 8 9 -127 -139 113 395 111 -130 -2 265 213 -158 -56 -283
6333 -283 -153 -83 88 -14 -189 -309 29 201 -35 -30 -94 -162 112 -119 -140 -40 -198 87 164 92 -155 102 79
6356 79 150 276 99 -142 61 90 62 -97 -480 -215 -18 -23 -62 81 87 176 294 32 -117 -19 -151 -9 36 -258
6380 -258 -68 -108 157 -14 -51 -29 -32 220 93 159 -212 -200 -103 136 -118 -106 -120 -73 153 16 65 50 -13 -42 152
6405 152 300 -163 -160 -222 34 -46 -110 -12 -63 106 215 300 -60 -242 35 -39 -98 -147 -233 -199 113 -54 69 -18 -136
6430 -136 82 36 42 -94 -321 -215 52 -116 -97 -157 42 -113 53 523 200 -105 -90 59 32 41 -55 109 15 70
6454 70 41 -133 -111 -315 -15 197 -127 9 -67 296 -12 -193 16 -159 -140 -82 -39 -98 -306 -111 220 129 -93
6477 -93 -214 96 -209 165 146 -84 -110 -276 49 -147 15 -322 -113 202 66 109 60 119 -121 51 18 -196
6499 -196 -242 -288 168 240 -47 -227 36 126 197 48 -57 -91 -273 33 -45 -29 -260 59 -135 34 19 111 102 22
6523 22 208 45 -70 -287 -230 -140 -167 -231 -160 -132 13 324 27 71 98 -7 242 364 68 -323 -217 -92 67
6546 67 -155 -260 -35 -142 -67 184 125 -28 118 180 243 172 -206 -51 44 -244 -163 -232 -227 -343 -109 1 -27 -130
6570 -130 171 238 270 82 -53 -85 69 -119 67 167 -48 -71 -14 221 229 -30 213 -72 103 -271 -24 -148
6592 -148 -290 63 -82 18 -134 -51 205 351 33 -51 -52 -226 -266 -305 -191 -451 -100 105 103 118 -132 141 168
6615 168 306 147 -25 -208 -295 7 -60 -170 -212 -146 270 438 94 230 59 305 -144 103 45 -250 -304 -302 -242
6638 -242 -125 -339 -233 234 162 62 60 415 136 -88 -106 -55 -355 -385 36 44 -102 -60 -7 138 241 100 246
6661 246 16 -131 -159 316 16 -464 -120 -42 32 23 226 266 145 71 239 -110 0 -261 -98 -103 -188 -457 -196
6684 -196 36 -33 -34 426 326 212 194 116 76 -278 -510 -72 -333 -384 -54 -328 31 238 225 491 73 -3 239
6707 239 297 34 -302 -533 -334 -194 -173 -88 13 116 178 430 419 91 127 105 24 -480 -286 -276 -103 -131 147
6730 147 223 182 376 436 523 273 -76 -60 114 -438 -142 -250 -193 -32 110 429 359 68 165 55 4 -13 -120
6753 -120 -306 -138 -146 -184 -12 -49 -131 257 449 308 227 166 226 -11 -84 -181 -530 -222 -258 -14 -19 15 -98 425 283
6778 283 548 184 35 112 -172 -65 -388 -334 -190 -128 94 51 -51 10 345 624 442 201 19 -176 -158 63
6800 63 -210 6 -195 -50 167 156 152 305 446 194 69 106 -193 -158 -327 -133 -276 -311 -139 113 198 124 84
6823 84 230 174 72 32 -86 -198 -248 -449 -47 -162 -83 -103 423 461 168 284 -80 61 -210 -132 -60 -200 -478
6846 -478 -116 34 53 288 146 178 321 220 422 -62 -350 -82 -39 -161 -74 -277 -38 -10 236 258 219 31
6868 31 136 127 -35 -53 -167 -119 -192 -184 -250 31 -30 70 330 319 236 19 -128 244 158 -407 -247 -163 -290 -206 -39
6893 -39 99 202 321 334 299 92 -239 -3 -45 -161 -174 -96 -207 35 235 92 128 -114 352 326 195 18 -267
6916 -267 -47 -69 31 -81 58 77 -64 117 421 67 -58 18 -21 135 -189 -294 -125 -53 -83 -26 -216 -118 -36
6939 -36 256 137 -41 -82 -130 17 -81 -336 -145 -39 38 76 85 165 70 122 95 264 29 56 -236 158 -80 -39 -91
6964 -91 -67 -53 105 71 40 -123 26 -31 361 135 128 76 38 107 -125 -170 -124 -270 -1 55 -87 15 -163 -27 139
6989 139 60 22 73 12 62 113 121 -288 -225 98 19 94 -79 -199 -240 -127 -104 -253 -1 -52 97 192 82 96 186 176
7015 176 207 -221 -196 -159 -274 -184 -235 -129 -141 -212 -17 210 56 -96 71 242 94 64 111 -59 40 -38 130 34
7039 34 -32 -133 4 2 -58 -94 -73 -212 118 226 106 343 330 242 352 207 -202 -38 -16 -76 -263 -460 -247 -469
7063 -469 -112 -70 132 170 159 236 284 48 -18 201 -35 -81 -323 -229 -314 -375 -218 48 13 -101 66 337 248 18
7087 18 -25 -160 -109 -48 -50 -26 -197 47 50 177 105 118 -98 33 -209 0 -381 -239 -14 120 204 297 76 287
7111 287 103 117 203 -85 70 -88 -45 -97 -301 -70 -237 68 91 116 275 165 240 135 29 124 -246 -271 -300
7134 -300 -198 -162 -438 -222 -33 52 377 301 92 113 213 250 -56 -206 -382 -331 -604 -210 -285 153 27 329
7156 329 332 139 199 95 196 66 -155 -420 -222 -368 -190 -159 23 76 381 361 165 210 118 -101 -100 29 51 -96
7180 -96 -231 -59 223 279 216 196 120 127 -26 -11 -302 -310 -228 -318 -50 -253 -22 82 314 313 391 109 207 557 53
7205 53 -315 -392 -442 -317 -386 -75 -147 1 249 277 472 327 422 122 25 5 -202 -167 -336 -22 -338 91 5 129
7229 129 74 254 311 43 43 37 5 -30 -57 -110 -184 -178 58 99 201 -14 88 284 263 65 -227 -226 -93 -327 -108 93
7255 93 -91 -10 85 201 413 342 320 172 -69 -151 -40 -332 -228 -128 -159 -33 -196 10 108 316 99 192 246
7278 246 2 21 -214 133 -256 -332 -101 113 135 -113 34 110 269 230 51 -162 -78 -288 -111 -203 -238 80 -22
7301 -22 320 261 135 229 270 211 -45 -93 -379 -201 -211 -316 -78 -140 -63 150 336 235 208 105 156 75 214 -142
7325 -142 -167 -345 -195 -237 -349 -166 -216 132 121 38 -8 77 128 -93 -110 17 -143 -174 -91 44 -77 -33 192 94
7349 94 59 121 244 103 -144 29 -65 -204 -65 -190 -6 -92 307 476 151 232 286 212 -27 -253 -216 -179 -392
7372 -392 1 -139 61 -177 159 146 144 -56 1 116 36 -147 -66 -131 160 88 -141 78 85 130 197 205 25 -180 -106
7397 -106 -219 -17 -7 -121 -109 55 120 249 334 179 138 61 -12 -157 33 -296 -139 69 -183 -21 -62 128 76
7420 76 147 434 47 197 9 -67 12 91 -95 -92 -218 284 -6 -134 -203 -124 13 -113 15 -14 -54 -13 111 119 35
7445 35 -63 112 3 -75 50 83 170 153 74 -159 -203 -20 -19 -140 -100 -30 -154 65 83 171 -1 154 -31 117 -13
7470 -13 333 -261 -160 55 -188 -24 114 7 85 200 95 66 -109 17 115 -95 187 -12 -70 -2 -38 -80 3
7493 3 8 196 188 39 -10 -48 -112 -390 -113 -248 62 -39 91 119 101 264 -55 80 -45 128 23 -172 -304 -238
7517 -238 -155 -78 -131 138 240 191 319 105 57 112 223 38 -109 -223 -81 -31 -109 30 -1 -386 66 22 -56 132
7541 132 -123 -143 -153 -17 -37 64 -82 -10 152 275 393 55 167 -30 -270 -155 -129 -92 -86 -63 87 92 74 220
7565 220 110 143 86 -70 -71 148 -8 -28 -94 -106 -147 -47 97 -110 -137 36 139 166 280 65 63 290 5 25
7589 25 57 -41 -89 -35 -41 172 -9 144 74 63 147 -125 -27 11 214 65 -41 -174 -104 221 174 211 67 42 -88
7614 -88 -104 -16 -105 -127 -90 -49 -106 169 -50 -27 216 152 108 166 -13 47 -156 149 -251 -240 -15 -55 186 115 225
7639 225 -24 247 50 -13 -7 -137 -115 -37 -91 -218 34 -170 170 -94 314 -50 230 3 -267 190 95 -38
7661 -38 -317 -59 -14 -19 -83 -32 6 3 285 25 135 2 10 -37 -10 -40 -103 -41 -68 24 103 -51 -72 94 30 -251 133
7688 133 -5 -106 39 -149 96 56 129 72 29 -94 101 -117 3 50 -235 -89 -31 -305 -94 -116 50 -29 85
7711 85 -76 -92 -203 0 143 67 100 -39 -229 -12 -42 -98 13 -125 -182 -120 149 345 94 -102 50 -55 40
7734 40 125 161 5 67 -55 127 -105 44 78 -101 172 166 84 -161 55 -145 -267 80 66 2 206 -103 -26 7
7758 7 -151 -164 -54 -50 -60 -168 -118 -95 6 216 -123 121 74 23 -12 7 -78 52 -176 -7 97 25 -376 63 -24
7783 -24 -101 -126 15 62 -54 129 -20 -219 65 -8 91 -40 3 -213 15 5 21 207 264 334 122 141 123 -142
7807 -142 -168 -84 -75 -395 -117 -31 -246 -50 409 73 216 183 43 -106 64 -154 -40 60 39 -132 46 113 168
7830 168 -27 107 15 -55 -63 -95 123 158 -101 -138 8 -22 -37 132 284 57 113 -66 -39 -186 -166 -283 -267 -163
7854 -163 -108 -86 -96 234 -142 162 233 289 -46 -47 101 -11 -163 -76 14 -99 -121 -100 35 13 250 34 210 6
7878 6 -96 -17 129 17 9 43 79 51 -101 -54 -218 -20 -29 -121 -119 -114 -84 -129 -96 233 37 42 104 105 176 41 223 61
7906 61 103 -38 134 107 -93 43 -50 116 7 110 185 -123 222 25 131 -93 240 8 16 -4 -106 38 -52
7929 -52 -87 -92 -64 103 -89 27 133 89 126 -40 -34 -82 158 43 -57 165 -2 -186 104 78 106 -16 170 -54
7953 -54 -206 -51 -257 -144 106 -239 -120 -130 8 56 163 153 273 138 -26 3 -17 148 -35 -76 -20 -39 -29
7976 -29 -69 -39 56 -136 -112 74 107 17 -237 -22 -26 76 276 -99 -83 -66 6 161 36 -126 130 84 -39 142
8000 142 -49 218 -119 -125 202 169 128 -95 66 96 11 178 -54 117 -36 66 21 -140 16 113 -160 -134 159
8023 159 -2 -130 0 105 200 -187 -37 -41 -46 11 34 91 61 172 2 -57 -241 95 225 172 -117 175 -26 123
8047 123 30 53 -162 -3 -73 -173 -148 21 -56 -171 -5 -159 203 -53 -123 13 -134 51 24 -6 -140 44 35
8070 35 25 -88 21 -84 -185 251 -42 160 7 52 -47 -104 94 170 87 51 -125 -129 -68 -14 -105 -9 -96 -105 -64 -4
8096 -4 3 -24 33 -78 -53 -78 309 42 47 13 84 105 217 113 43 163 -3 -281 57 -36 164 162 -141 139 -74 -67
8122 -67 80 64 -86 -30 -137 -144 -38 32 17 -223 -63 0 145 -61 47 22 -40 -45 -154 -38 42 -167 -49 -104 -84
8147 -84 -32 -37 59 -36 72 55 33 -12 -118 -27 -37 -1 -83 139 -23 -83 -94 143 -77 49 -28 68 -62 -151 -10 81
8173 81 -32 114 -16 141 53 113 -54 152 19 -109 95 -121 -131 -72 53 72 -69 65
8191F5
##END NTUPLES=NMR FID
##END=
