##TITLE=1H_AM_NV55
 Aceton-d6
 8 sc, 
 5.9.2023
##JCAMPDX= 6.0         $$ Bruker NMR JCAMP-DX V2.0
##DATA TYPE= NMR FID
##DATA CLASS= NTUPLES
##ORIGIN= UXNMR, Bruker Analytische Messtechnik GmbH
##OWNER= root
$$ XWIN-NMR		Version 3.5
$$ Tue Sep  5 14:03:02 2023 Russian Standard Time (UT+4h)  she@DPX200
##.OBSERVE FREQUENCY= 200.13135
##.OBSERVE NUCLEUS= ^1H
##.DELAY= (6, 6)
##.ACQUISITION MODE= SIMULTANEOUS
##.ACQUISITION SCHEME= undefined
##.AVERAGES= 8
##.DIGITISER RES= 18
##SPECTROMETER/DATA SYSTEM= spect
##.PULSE SEQUENCE= zg30
##.SOLVENT NAME= Acetone
##.SHIFT REFERENCE= (INTERNAL, Acetone, 0, 15.7039)
##AUDIT TRAIL= $$ (NUMBER, WHEN, WHO, WHERE, WHAT)
$$ ##TITLE= Audit trail, XWIN-NMR		Version 3.5
$$ ##JCAMPDX= 5.01
$$ ##ORIGIN= Bruker BioSpin GmbH
$$ ##OWNER= she
$$ F:/spectra/data/she/nmr/H-F/1/audita.txt
$$ ##AUDIT TRAIL=  $$ (NUMBER, WHEN, WHO, WHERE, WHAT)
(   1,<2023-09-05 14:01:57.54 +0400>,<she>,<DPX200>,
      <created by zg, POWCHK disabled, PULCHK disabled
       configuration hash MD5:
       00 E9 B6 7A A2 85 ED C7 34 08 36 98 17 FE 4E 26
       data hash MD5: 16K
       01 62 BB A6 56 5E 47 40 C9 DB AC 43 4A 5E 0F 98>)
$$ ##END=
$$ 
$$ hash MD5
$$ C0 81 4E A0 A8 D1 A9 5D A4 55 9F A1 84 47 AF A5
##$RELAX= 
##$RELAX= 
##$RELAX= 
##$RELAX= 
##$RELAX= 
##$RELAX= 
$$ Bruker specific parameters
$$ --------------------------
##$DU= <F:/spectra>
##$EXPNO= 1
##$NAME= <H-F>
##$PROCNO= 1
##$TYPE= <nmr>
##$USER= <she>
##$AMP= (0..31)
100 100 100 100 100 100 100 100 100 100 100 100 100 100 100 100 100 100 
100 100 100 100 100 100 100 100 100 100 100 100 100 100 
##$AQSEQ= 0
##$AQ_mod= 1
##$AUNM= <au_zg>
##$AUTOPOS= <>
##$BF1= 200.13
##$BF2= 200.13
##$BF3= 200.13
##$BF4= 200.13
##$BF5= 200.13
##$BF6= 200.13
##$BF7= 200.13
##$BF8= 200.13
##$BYTORDA= 1
##$CFDGTYP= 0
##$CFRGTYP= 5
##$CHEMSTR= <none>
##$CNST= (0..31)
1 1 145 1 1 1 1 1 1 1 1 1 1 1 1 1 1 1 1 1 1 1 1 1 1 1 1 1 1 1 1 1 
##$CPDPRG= <>
##$CPDPRG1= <>
##$CPDPRG2= <>
##$CPDPRG3= <>
##$CPDPRG4= <mlev>
##$CPDPRG5= <mlev>
##$CPDPRG6= <mlev>
##$CPDPRG7= <mlev>
##$CPDPRG8= <mlev>
##$CPDPRGB= <>
##$CPDPRGT= <>
##$D= (0..31)
0 1.2 0 0 0 0 0 0 0 0.06 0 0.03 0 0 0 0 0.0002 0 0 0 0 0 0 0 0 0 0 0 0 
0 0 0 
##$DATE= 1693908116
##$DBL= (0..7)
120 120 120 120 120 120 120 120 
##$DBP= (0..7)
150 150 150 150 150 150 150 150 
##$DBP07= 0
##$DBPNAM0= <>
##$DBPNAM1= <>
##$DBPNAM2= <>
##$DBPNAM3= <>
##$DBPNAM4= <>
##$DBPNAM5= <>
##$DBPNAM6= <>
##$DBPNAM7= <>
##$DBPOAL= (0..7)
0.5 0.5 0.5 0.5 0.5 0.5 0.5 0.5 
##$DBPOFFS= (0..7)
0 0 0 0 0 0 0 0 
##$DE= 6
##$DECBNUC= <off>
##$DECIM= 32
##$DECNUC= <off>
##$DECSTAT= 4
##$DIGMOD= 1
##$DIGTYP= 9
##$DL= (0..7)
0 120 120 120 120 120 120 120 
##$DP= (0..7)
150 150 150 150 150 150 150 150 
##$DP07= 0
##$DPNAME0= <>
##$DPNAME1= <>
##$DPNAME2= <>
##$DPNAME3= <>
##$DPNAME4= <>
##$DPNAME5= <>
##$DPNAME6= <>
##$DPNAME7= <>
##$DPOAL= (0..7)
0.5 0.5 0.5 0.5 0.5 0.5 0.5 0.5 
##$DPOFFS= (0..7)
0 0 0 0 0 0 0 0 
##$DQDMODE= 0
##$DR= 18
##$DS= 0
##$DSLIST= <SSSSSSSSSSSSSSS>
$$ [...]
##$SUBNAM2= <"">
##$SUBNAM3= <"">
##$SUBNAM4= <"">
##$SUBNAM5= <"">
##$SUBNAM6= <"">
##$SUBNAM7= <"">
##$SUBNAM8= <"">
##$SUBNAM9= <"">
##$SW= 18.05172834244
##$SWIBOX= (0..15)
0 0 2 0 0 0 0 0 0 0 0 0 0 0 0 0 
##$SW_h= 3612.71676300578
##$TD= 16384
##$TD0= 1
##$TE= 0
##$TE2= 300
##$TE3= 300
##$TEG= 300
##$TL= (0..7)
0 120 120 120 120 120 120 120 
##$TP= (0..7)
150 150 150 150 150 150 150 150 
##$TP07= 0
##$TPNAME0= <>
##$TPNAME1= <>
##$TPNAME2= <>
##$TPNAME3= <>
##$TPNAME4= <>
##$TPNAME5= <>
##$TPNAME6= <>
##$TPNAME7= <>
##$TPOAL= (0..7)
0.5 0.5 0.5 0.5 0.5 0.5 0.5 0.5 
##$TPOFFS= (0..7)
0 0 0 0 0 0 0 0 
##$TUNHIN= 0
##$TUNHOUT= 0
##$TUNXOUT= 0
##$USERA1= <user>
##$USERA2= <user>
##$USERA3= <user>
##$USERA4= <user>
##$USERA5= <user>
##$V9= 5
##$VALIST= <valist>
##$VCLIST= <CCCCCCCCCCCCCCC>
##$VD= 0
##$VDLIST= <DDDDDDDDDDDDDDD>
##$VPLIST= <PPPPPPPPPPPPPPP>
##$VTLIST= <TTTTTTTTTTTTTTT>
##$WBST= 1024
##$WBSW= 4
##$XGAIN= (0..3)
0 0 0 0 
##$XL= 0
##$YL= 0
##$YMAX_a= 301958
##$YMIN_a= -288185
##$ZGOPTNS= <>
##$ZL1= 120
##$ZL2= 120
##$ZL3= 120
##$ZL4= 120
##$ABSF1= 10
##$ABSF2= 0
##$ABSG= 5
##$ABSL= 3
##$ALPHA= 0
##$AQORDER= 0
##$ASSFAC= 0
##$ASSFACI= 0
##$ASSFACX= 0
##$ASSWID= 0
##$AUNMP= <proc_1d>
##$AZFE= 0.1
##$AZFW= 0.1
##$BCFW= 1
##$BC_mod= 2
##$BYTORDP= 1
##$COROFFS= 0
##$CY= 11.3945322036743
##$DATMOD= 1
##$DC= 2
##$DFILT= <>
##$DTYPP= 0
##$F1P= 15.7292609196834
##$F2P= 12.9074282941183
##$FCOR= 0.5
##$FTSIZE= 0
##$FT_mod= 4
##$GAMMA= 1
##$GB= 0.15
##$INTBC= 1
##$INTSCL= 1
##$ISEN= 128
##$LB= 0.24
##$LEV0= 0
##$LPBIN= 0
##$MAXI= 10000
##$MC2= 0
##$MEAN= 0
##$ME_mod= 0
##$MI= 1.114404
##$NCOEF= 0
##$NC_proc= 0
##$NLEV= 6
##$NOISF1= 3.799351
##$NOISF2= 2.8
##$NSP= 1
##$NTH_PI= 0
##$NZP= 0
##$OFFSET= 15.70392
##$PC= 1
##$PHC0= -21205.73
##$PHC1= 9.25272
##$PH_mod= 1
##$PKNL= yes
##$PPARMOD= 0
##$PSCAL= 0
##$PSIGN= 0
##$REVERSE= no
##$SF= 200.130013532006
##$SI= 16384
##$SIGF1= 3
##$SIGF2= 2
##$SINO= 400
##$SIOLD= 16384
##$SREGLST= <1H.CDCl3>
##$SSB= 0
##$STSI= 0
##$STSR= 0
##$SW_p= 3612.71676300578
##$SYMM= 0
##$S_DEV= 0
##$TDeff= 0
##$TDoff= 0
##$TI= <>
##$TILT= no
##$TM1= 0
##$TM2= 0
##$TOPLEV= 0
##$USERP1= <user>
##$USERP2= <user>
##$USERP3= <user>
##$USERP4= <user>
##$USERP5= <user>
##$WDW= 1
##$XDIM= 8192
##$YMAX_p= 0
##$YMIN_p= 0
$$ End of Bruker specific parameters
$$ ---------------------------------
##NTUPLES= NMR FID
##VAR_NAME=  TIME,          FID/REAL,        FID/IMAG
##SYMBOL=    X,             R,               I
##VAR_TYPE=  INDEPENDENT,   DEPENDENT,       DEPENDENT
##VAR_FORM=  AFFN,          ASDF,            ASDF
##VAR_DIM=   8192,          8192,            8192
##UNITS=     SECONDS,       ARBITRARY UNITS, ARBITRARY UNITS
##FACTOR=    0.0002768,     1,               1
##FIRST=     0,             0,               0
##LAST=      2.2672688,     0,               0
##MIN=       0,             -288185,         0
##MAX=       2.2672688,     301958,          0
$$ Real data points
##PAGE= N=1
##DATA TABLE= (X++(R..R)), XYDATA
$$ [...]
1673A712Q95k660j275M066N353l05n590m373K72J977j85l063l742j094L859N673
1689A520J678k982j581L987M975Mm522m206r36J633J307j565m269k231L611N826
1705B249J285l607k311K380L618O24k817m022j758K263M006N52l636k062L663
1720D27N443P46l752l681o12J240O64k336m625l062L028N902K286k146n67M173
1736C128N253J689k497m238k990j38R55k207n963l974K540N507K249j319m51K990
1752E34M419L112o07m079l704N69K744r09n212l591J969M357K188j187j984k50
1768a631K426L094m07m809l997J435M136J000k791j637K267M426L275j35l216
1783C436k921O76K242j604o071m790Q16L671J998n42m97J752M692N070J607l422
$$ y = [1712, 2607, -53, -1328, 2738, 8091, 7786, 2196, -2177, -1905, 72, -113, -3176, -6918, -8012, -4153, 1520, 3198, 216, -1365, 2622, 7597, 7601, 3079, -1127, -2063, -430, 877, -688, -4957, -7188, -3577, 2249, 3534, -73, -2384, -4, 3614, 4238, 1421, -2601, -4359, -2096, 1910, 2462, -1174, -3236, 427, 5870, 6616, 2864, -817, -1429, -189, 475, -1861, -6486, -9548, -6520, -618, 1668, -478, -1045, 3128, 8381, 10070, 7573, 3335, 345, 207, 1162, -1045, -7008, -10982, -8442, -2935, -686, -2005, -2456, 534, 4953, 8065, 7458, 3379, -325, 244, 2988, 2079, -3133, -6724, -4755, -398, 1790, 603, -1381, -1631, 795, 3889, 3482, -1327, -5324, -3889, 247, 1247, -1544, -3181, -914, 3512, 6787, 6652, 3436, 515, 1191, 3433, 1829, -4242, -9032, -8216, -4545, -2547, -3089, -3586, -1834, 2858, 7928, 9535, 6113]
1799F113l744K61K058j504n736m703l74K621K599N53j128j37L703N330J456l832
1815C536m050K96K362l40l442l280m35K910M156J759k088j920K158L917N5m650
1831I44m696j017J526J032q59k067m22L572N984K872j987k433J153K664m97m309
1847A460n122k559O30K185N20k050j106L527O150K814k003k491K97J858K16k665
1863A661m395k863J061L575J569k200j710K473M693J699k260l398j507P17J327
1878D42q63l437k530K077N119K768j298j550J522L118J173k178m378l579k84J687
1894b191Kl165k327K474N491L340k16j138M90K181J691j315m600m311m36K177
1910a853N70k798k166J819M357L310K06j641j037J240K099k66l996l931Q2K986
$$ y = [6113, 2369, 2630, 4688, 3184, -2552, -7255, -7629, -5008, -2409, -1856, -2984, -3121, 582, 5912, 7368, 3536, -514, -218, 2144, 1804, -1638, -4918, -5353, -2443, 1713, 3472, 1384, -536, 1622, 5539, 5594, 944, -3752, -4769, -3243, -2211, -3070, -5137, -5559, -1987, 3997, 6869, 4882, 2449, 3602, 6266, 5769, 1460, -3662, -6221, -5591, -3406, -2886, -4936, -6042, -2515, 3635, 6449, 4446, 1955, 2252, 4110, 4326, 1661, -2734, -5597, -4536, -961, 608, -1592, -3302, -829, 3864, 5563, 3303, -95, -1602, -885, 442, -421, -3858, -6388, -4311, 808, 3576, 2278, 728, 2250, 5368, 6541, 4363, -15, -3594, -3878, -2191, -2189, -5354, -7681, -5207, 284, 3624, 3408, 2270, 2760, 4941, 6632, 5317, 717, -3594, -4030, -1853, -1283, -4081, -6247, -4428, -71, 3239, 3445, 1804, 767, 2007, 4106, 3840, -156, -4087, -4005, -1019]
1926a019J506j446j702P74L155K929K50k697k960L2K222O4l505l210O54L368K727
1943A142L09j163M5K308K975L82l428m053o78J674K43k800k777K22K973L372J429
1960B175j101r73J694L167P89l133l915q60J633P67j525k486p43K181L505J467
1976B642j655k133R15K906R50k543l173o89J830K007O6j945j289J625L373J196
1992D083k326l075m11J962P27j873k733j133J784L160J535j145j255J603L483
2007D386J573k037l186j284P00O90j589l125k254R65L156J911q26j221J641L677
2023C177K431p60k289j436P00J115o99l385l176q0K295J337j436j785N47K921
2039e23K777M56j500j177J189K485P22k257k963m11J915J018j502k751j181J198
$$ y = [-1019, 487, -959, -2661, -1887, 1268, 4197, 4447, 1750, -1210, -1178, 1044, 1108, -2397, -5607, -4953, -1585, 1142, 1451, 288, 333, 2641, 5616, 5998, 2570, -1483, -2161, -487, -244, -3044, -5821, -5599, -2626, 746, 2175, 1074, 101, 1795, 4962, 5751, 2618, -1297, -2157, -524, 243, -1282, -3768, -4511, -2330, 1175, 2642, 987, -1146, -231, 2675, 3625, 1082, -2091, -2780, -950, 1057, 1123, -822, -2111, -486, 2887, 4083, 1757, -1318, -1729, 233, 960, -913, -3646, -4779, -2995, 165, 1700, 555, -700, 903, 4386, 5959, 3922, 736, -548, 152, 842, -747, -3872, -6126, -5161, -2005, -94, -920, -2141, -500, 3177, 5608, 4848, 2559, 1123, 1823, 2938, 2239, -1146, -4322, -4402, -2107, -770, -2206, -3991, -3444, -523, 2254, 2710, 1210, 33, 1222, 3707, 4429, 2172, -791, -1202, 713, 1731, 229, -2522, -3703, -2505]
2055b505K127M31j964j739R70L061K024q86j679M17K528K116m19k464k185O0J367
2072A260l44l018l220l62K229J853k36j126O98K924L524J446j256j773J08J502
2088D209m7l053l950j816Q56J169m50j562l79K228L844K360m83j379N60K151R86
2105E244j957l324k042M38J265k75k007j553R53L085J981p49j833j20J943J508
2121B557o23k398j578P52K273J082j308j773M09K286J509j228k718j581O95J274
2137c70j82k043j476J148L166K330k82j255J86J938J285j243l082k636k10J100
2153a626K49j538j495J096L298K895L21j275m75J127J124q98l194k978n64J493
2169b440J093o69j043R19L200K935N16j515j400J45P06q11k994l096o52J707J862
$$ y = [-2505, -378, 53, -1911, -3650, -2680, 381, 2405, 1519, -160, 257, 2785, 4901, 4482, 2018, -167, -107, 1260, 916, -2102, -5322, -5684, -3455, -1602, -1838, -2964, -2266, 658, 4182, 5628, 4372, 2599, 2707, 4209, 4162, 1109, -2841, -4657, -3801, -2632, -3082, -4644, -5023, -2795, 1049, 3409, 2926, 1547, 2107, 4258, 5244, 3287, -37, -2079, -1641, -376, -651, -2658, -4211, -3258, -173, 1808, 1059, -774, -894, 1049, 2557, 1934, -464, -2042, -1290, 983, 2065, 757, -1016, -607, 1679, 3188, 1960, -758, -2339, -1644, -370, -552, -2595, -4071, -2923, 243, 2573, 2291, 1036, 1222, 3160, 4445, 3202, 120, -2516, -2726, -1626, -1377, -2915, -4410, -3314, -16, 2879, 3200, 1925, 1450, 2577, 3701, 2803, -391, -3369, -3933, -2440, -1347, -2016, -3059, -2140, 1060, 3995, 4511, 2996, 1596, 1741, 2447, 1636, -1358, -4454, -5106, -3399, -1537]
2186a537J36p33P14K748K927O93j581k107m82P87k01k263k753o71J824K312N18
2203C31q87k64J538K229M88j954k594r00J019Q23q72j567r1K296K941J160q73
2220B823j138J55J094k76k619l432j585O09J432P3o64N12K761L659K047m83j289
2237C679m18O24l45k692l672k235K72J331N12n38J36K099L336K154k86j572q23
2254A562O34K82j432k792j768O29K022J152m41p03Q43K017J163j075k581j636
2270b124J99Q52k71j346o98J575L009K345J60r79k48R39M08j700l401k629n15
2287d424Q84L46o15k84J655L345K827O96q37o56M88L11j358l038k747o10R49R93
2305b075k40n48R23K698K463L93j332j306J16N36n93k200k073k13J680J739K46
$$ y = [-1537, -1401, -2134, -1420, 1328, 4255, 4948, 3367, 1260, 778, 1565, 1364, -899, -3652, -4323, -2499, -187, 331, -556, -820, 718, 2947, 3435, 1481, -1113, -2013, -994, -171, -1043, -2610, -2701, -405, 2536, 3696, 2823, 1685, 1840, 2934, 2658, 39, -3393, -4978, -4369, -2937, -2864, -3528, -3016, -255, 3404, 5451, 4968, 3679, 3261, 3885, 3540, 848, -2824, -5059, -4787, -3456, -2944, -3482, -3346, -1247, 2089, 4243, 3957, 2385, 1562, 2196, 2478, 1046, -1746, -3514, -2885, -863, 289, -152, -855, -12, 2005, 3168, 2093, -488, -2124, -1925, -1073, -1344, -2690, -3388, -1813, 1196, 3541, 3701, 2722, 2474, 3413, 3821, 2121, -1280, -3909, -4424, -3540, -3194, -3809, -4093, -2438, 907, 3734, 4430, 3593, 2937, 3425, 3736, 2378, -660, -3407, -4017, -3068, -2075, -2315, -2863, -1940, 758, 3221, 3614, 2282, 976, 1092, 1628, 1035, -1165, -3238, -3451, -1771, -32, 214]
2322B14n76J79J760J756M0j910j999o28N78Q4j324j483RK036K308Q80o55k71Q62
2341A860J317j88k036k449r18O35O36n32j111K08J962K512J015p48r87J68P71
2358B115j34j877k482j026Q34J363L56o38J35J791K228J045q67j625p05M01o5
2375H49j453k256j059J001J757R46k44j21J242J974J052q50j946j094K82M29q83
2392c74j799r90Q84J879J122l57o64M02J421Q78q46j917j118M23J033N9j068o55
2410a687Q55J765J214m14j305m89P50O61q62j862j253L53J342P81l43n89O60J783
2428A360J470k86j406j026L22O88n45j816j411J85J318J042k32p57K74J525J457
2445B162J7j314j060K38R18O4j239j291j45J130J109j98j079m99R73J186K00j141
$$ y = [214, -362, -183, 1577, 3333, 3373, 1463, -536, -1164, -586, -502, -1826, -3309, -3300, -1264, 1044, 1924, 1269, 998, 1860, 3177, 2989, 953, -1496, -2414, -1779, -1143, -1675, -2786, -2578, -616, 1896, 2911, 2163, 1176, 1344, 2115, 1981, 104, -2378, -3404, -2570, -1207, -851, -1489, -1354, 437, 2665, 3710, 2843, 1218, 513, 914, 849, -604, -2860, -3919, -2918, -1161, -215, -459, -580, 662, 2636, 3688, 2838, 892, -202, 80, 509, -374, -2173, -3163, -2279, -400, 722, 365, -299, 103, 1524, 2402, 1556, -361, -1479, -1056, -23, 36, -1032, -1687, -832, 933, 2147, 1733, 428, -61, 689, 1350, 488, -1374, -2627, -2274, -932, -151, -494, -1083, -423, 1360, 2830, 2544, 1138, 112, 434, 1122, 577, -1239, -2650, -2465, -1147, -105, -337, -1094, -820, 705, 2162, 2179, 865, -195, 43, 961, 1025, -214, -1505, -1650, -520, 589, 391, -688, -1187, -214, 972, 1172, 31]
2463C1j091K40J151P74n52j082k24J130J096j08j372r89K89R94J09r60j163JJ296
2482d30J230l3r67l18J102J290N1j128j247o9Q05K40q22j312n05J031J200J34
2500B52q25m43R04J450N33p03r28j43Q18O52o43j539r05M53Q67l6j122p84M15
2519a727J493J057j65n65R6J204J194j91j345j143j2M79k22j389j273k36R93J144
2537f08P8m24R6J408J594M75p26r83m5N10P4j153j622p78N93Q60n1p61m11R00
2557i74J427O58l84p38L9R79P23l74j126o20N90Q42n4j110j055n9O30L23o51j024
2577a958j47J086J373N05l57J1Q99J229L25r83j421p87j0j42r85j471o34Q12J517
2596a138Q53J29J82J099J471P49n58j354r65j18j9q54j512q74N91J242P87rj28
$$ y = [31, -1060, -820, 331, 1105, 553, -529, -753, 377, 1473, 1365, -7, -996, -707, 287, 396, -564, -1727, -1726, -430, 800, 767, -200, -518, 584, 1874, 1925, 797, -450, -519, 286, 526, -296, -1608, -2113, -1082, 118, 252, -573, -1016, -112, 1338, 1871, 1168, 240, 97, 915, 1567, 924, -615, -1520, -1067, -200, -236, -1358, -2142, -1727, -234, 823, 658, 93, 189, 1393, 2587, 2396, 1051, -92, -104, 375, 153, -1236, -2509, -2745, -1752, -608, -530, -954, -858, 550, 2144, 2619, 1893, 910, 865, 1375, 1449, 296, -1326, -2104, -1511, -651, -702, -1463, -1874, -974, 453, 1111, 727, -11, 28, 1007, 1730, 1356, 230, -390, 200, 1042, 988, -122, -1177, -1236, -606, -283, -934, -1958, -2105, -1019, 354, 859, 502, 513, 1412, 2641, 2966, 1983, 562, -225, -235, -377, -1362, -2833, -3467, -2655, -1138, -285, -156, 26, 1125, 2596, 3345, 2787, 1433, 468, 350, 331, -523, -2035, -2909, -2318, -1076, -289, -298, -426]
2615d26M82J156Q07l52j241q89J61N68j34q65n28M00J221Q72l16p59k40M06N04
2634H27n17j212q87K38R29O78l47j78N21J209R29k11j021q67l7K47m67j319r09
2653b394J48J178R01K48j84L96J080R77r4j208j141l00J93l07q64q22J19J207
2671h67J309M20k57P4O15P84k23j314j368m79K37J04l94n16K88J211J489O31l26
2690A418l54K61M64l21j363j401n84L15N00m4l22K39J184J412N43m59p44j68K62
2709H38j86r62j241l68M71J073L90j91O8P90J009K74p77j130n71J2K5n19q41j21
2729a957Q35J315P87jj64L74N84J40r25j400q62l4K74j82n08p3Q78J416R42K7
2749A466l85L2M64L8p71j356r68J9M76J34k71j64O38J201R41j47o24k81K17J78
$$ y = [-426, 56, 1212, 2019, 1667, 426, -463, -302, 266, 132, -733, -1261, -861, 360, 1232, 916, 157, -83, 323, 827, 310, -902, -1789, -1551, -622, 56, -291, -469, 52, 1261, 2190, 1979, 958, 91, 54, 301, -166, -1485, -2394, -2246, -1068, -167, 81, -103, 293, 1373, 2350, 2256, 1048, -93, -393, -200, -507, -1371, -2193, -2074, -867, 442, 862, 605, 679, 1294, 2078, 1855, 541, -827, -1306, -1069, -965, -1359, -1875, -1587, -376, 1113, 1744, 1418, 1064, 1325, 1789, 1468, 105, -1296, -1880, -1565, -1065, -1109, -1431, -1192, -8, 1404, 1947, 1488, 744, 576, 838, 652, -310, -1551, -1919, -1448, -375, 15, -176, -108, 682, 1691, 1965, 1188, 58, -513, -501, -476, -995, -1836, -1957, -1122, 193, 980, 979, 815, 1189, 1773, 1913, 988, -412, -1274, -1308, -1034, -1216, -1724, -1797, -919, 497, 1439, 1466, 1081, 1113, 1577, 1615, 844, -512, -1480, -1461, -985, -851, -1122, -1286, -648, 553, 1494, 1347, 723, 442, 659, 837]
2769H37m89j090p55K10P64O10j65j95L09Q44O60l17q77p54m2K36k68o33n46L40
2789a321J116R42J49k03R0N10M01m34j158j016l10K36M7m48l09M71J152J103L62
2808A380k16j34L71K85l80j093j176l81K34K67l24l11K40R77J054L88k88l39J05
2827F59L75p4o85r39l28M26M63o1l79j13N68O99J96m89o97p5M23K89l74o71K1
2848g66O70Q13J44l71k60K59M49n1p53q60m82K79L43j11l18J9P69R42N26k18k67
2869G56K9L77l8o75j003n82J02L42k6l18k06N75R23N69k3l55JM51K31m65q07m69
2891f11R5M12L0m20l24J92O50M65j55m23j46K79M60j27m92l78J62N82K38k59m79
2912b49N6L92L88j67o31m13J70M56P8l88l43R6P30M08j29m03j08M37L09q3n69
$$ y = [837, 348, -742, -1497, -1287, -523, 87, -78, -273, 36, 880, 1540, 1223, 346, -408, -450, -214, -482, -1115, -1661, -1321, -205, 737, 886, 683, 773, 1283, 1684, 1250, 92, -924, -1234, -998, -951, -1399, -1708, -1237, -85, 1018, 1380, 1164, 1030, 1401, 1686, 1306, 213, -963, -1344, -1110, -843, -1167, -1478, -1238, -261, 793, 1181, 893, 554, 659, 1034, 960, 275, -664, -992, -566, -103, -164, -543, -656, -88, 611, 807, 318, -379, -454, -31, 258, -116, -787, -766, -96, 717, 861, 490, 230, 489, 938, 887, 134, -726, -1208, -929, -586, -697, -1015, -996, -227, 715, 1241, 1023, 756, 785, 1162, 1124, 449, -554, -1136, -1034, -692, -718, -1036, -1242, -667, 256, 825, 802, 447, 448, 899, 1130, 665, -142, -611, -516, -104, -74, -494, -818, -626, 24, 489, 334, -89, -235, 44, 504, 377, -115, -493, -331, 251, 489, 230, -249, -193, 199, 587, 420, -211, -624, -454, 2, 80, -308, -651, -555, 175, 583, 454, 51, -57, 380, 689, 606, 37]
2933C7m64M1M03J54m33m69L6N81M38J0m41j61L36N17J08m46n01lM48K27l55n32
2955d69q5L27M85rl41l15J34N03K78k72n51j20N01L50j93m19k54L08M13K00l18
2976A53m18k3M26K94l15m44j85K49M28k7k01k86K11M93K80k16m34j26L27K42l09
2997A19n21k50J14M09J40k44k38J50O03N28j72m51j16K96J40k46m70n37q4M03
3017d27L21j64k59Q7O45N21N2l37k07J02J31m1m81n04j50K77L62j10l62Q1M83
3038B0M62P3l18k64o6K73J93k52n14o6M16M68k11k03k05J85J94J4k97m91n1L86
3060b54L43j19k95R8N45M78j7j88l28j10O9L7n16n87k43L40M60j0p6J17N13M77
3082G34K27p6l93l07J84P3m56p74j81J79L71M4m6M6L05M37L99p8m65j55J87K87
$$ y = [37, -427, -386, 17, 171, -262, -731, -695, -114, 324, 334, -107, -268, 68, 585, 693, 247, -254, -257, 191, 418, 63, -469, -554, -227, 258, 249, -92, -407, -273, 230, 508, 236, -315, -435, 66, 416, 223, -196, -450, -142, 271, 471, 153, -265, -288, 138, 432, 117, -327, -512, -263, 165, 138, -63, -349, -138, 355, 635, 419, -15, -141, 186, 428, 119, -402, -652, -538, -129, 11, -233, -471, -321, 282, 810, 638, 187, 71, 367, 507, 261, -209, -746, -830, -427, -106, -270, -529, -442, 203, 724, 776, 439, 232, 334, 465, 424, -57, -561, -711, -434, -72, -182, -544, -463, 20, 482, 555, 237, -27, -93, 180, 373, 121, -393, -459, -43, 425, 214, 11, -194, -9, 185, 199, -98, -589, -640, -254, 89, -30, -325, -227, 318, 796, 779, 591, 263, 153, 222, 259, -257, -844, -1087, -747, -287, -297, -373, -256, 257, 734, 961, 885, 492, 185, 369, 442, -14, -788, -969, -790, -419, -375, -421, -375, -70, 367, 766, 688, 223, 68, 255, 542]
3104E42l68m55j95K32J68J06k6j39j16K94L52k09n31j32L42J36k4j47K5J62L26
3125C43L70k3l76k89K45O7l20o40k54J91J45K27N6J7J39N24N44Qn10j89N7P4l58
3148D8n02j99r6J87L24R7j41k1M74M60k5m60j89J50M5o2j81j89m1K58L92L3l96
3171c4q8K18K53k73m45j03KJ01J61J21j67j9N13N47l0l93j48K11n1k51k54k41
3193c70l41J03L77M5k51o8N44M21J5l11L4j3qJ7J6m03k68K30M87q1m33j0K89J21
3217A42rj77j13j54N4L53N6l26j13M44M27p9k10q9j7n7n8o1m04m34J92M28K4k60
3241d41NN14L80N5k3n6k5q1J46m6n33m51K21L32j50k90NK73L7J49P6r4k41J56
3265h2M70O2m25j04K91K22j34j71%k01r8J26k9m13k87K84M38J2j44Q1L71J69Q8
$$ y = [542, 174, -281, -476, -244, -76, 30, 4, -135, -251, 43, 395, 186, -345, -477, -135, 1, -23, -170, -145, 17, 343, 713, 690, 314, 25, 270, 337, 17, -623, -877, -686, -541, -314, -258, -241, -102, 422, 966, 974, 464, 275, 332, 406, 48, -454, -653, -749, -562, -238, -141, -282, -303, 171, 631, 606, 146, -43, 107, 152, 90, -91, -280, -321, -63, 329, 362, -34, -122, 96, 349, 76, -369, -472, -470, -369, -208, -87, -254, -273, 240, 787, 757, 364, 216, 427, 376, 125, -129, -370, -711, -608, -231, -186, -437, -505, 39, 460, 475, 164, 198, 185, 177, 194, 210, -193, -461, -231, 256, 175, -258, -268, 21, 142, 133, -44, -157, -311, -257, 96, 152, -174, -287, 157, 584, 505, 295, 206, 189, 132, 74, 13, -391, -825, -633, -205, -181, -441, -436, 78, 458, 513, 490, 434, 409, 328, 474, 428, -105, -556, -335, -3, -153, -443, -438, -165, -128, 21, 97, 3, -238, -82, 388, 450, 25, -79, 212, 434, 300, 129, 129, -72, -170, -44, -73, -486, -773, -489, -51, -39, -183, -102, 269, 438, 526]
3288E26J19j68l78n9K40j84n06l40K77J65o2m3J56J62J10L59K40k69l53K21L23
3309E36j22m98j08J36m6o4L9r0j78L4L68J33l88j46L24L86n7j32J09Q6p4J35R6
3332D79l46l91L8K06j44m51L4K25J59M0J92Q3l4J42L78J20l70m27J06J77k93k75
3354c52o5P2n1K03K38m8k37K31L86O9l71j52K01J15j75j31J14j93q1K55J94k79
3376e7l03J92L56j73k62M5O7P4J26J95p2l25K01L17L7l72k09J21L1j44p1L3j26
3399c19J7K99K63j84j55K21K99j16k16m1n7j64M6Q6j25k08L4L93J44k51j17J77
3421B6K41j21j24L4j18j44K05J70j48l44K14L59p5k33j9N7j5p6J34n9j64k1K97
3444G6K14k63j66K29K07n8j75L8j35j50J25J57j42l07J39L66L0k01j9J30L8k0
$$ y = [526, 645, 477, 99, 40, 280, 96, -410, -750, -473, -308, -370, -413, -257, -95, 15, 374, 614, 345, -8, 213, 536, 414, -84, -192, -56, -102, -166, -127, -217, -395, -361, 7, 140, -248, -394, -70, 316, 259, 127, 236, 322, 248, 383, 479, 133, -258, -220, -14, -158, -609, -575, -350, -191, -151, 41, 124, 90, 232, 610, 730, 360, -67, 39, 216, -77, -352, -417, -345, -396, -193, 45, -3, -240, -9, 377, 446, 75, -77, 124, 239, 64, -67, 47, -146, -227, 28, 222, -57, -360, -168, 188, 15, -247, -202, -135, -61, 65, 260, 188, -137, 64, 381, 418, 46, -163, -42, -11, -155, -226, -193, -319, -302, -3, 260, 76, -79, 142, 441, 325, 109, 68, 11, -153, -107, -21, -146, -354, -320, 73, 217, -34, -151, 26, 267, 146, 22, 56, -62, -206, -1, 169, 21, -323, -109, 250, 175, -58, -77, -20, -35, -111, 23, -36, -200, -221, 76, 290, 27, -139, 90, 297, 239, 64, 102, -33, -183, -58, 99, -43, -350, -211, 155, 185, -16, -35, 95, 133, 113]
3466A13K1j2k76j03K79J95k81j93J73J48rj24L0M1j07J30J82q5k71J02L04Mk46
3489A5j24J24P0j01k3K5j93m2J81K26j88j34J08K47Nq2o7j4o2K1Q8m8k80kK72
3514B2J05k29o1J46J74j12L4N3j49j22K19J12q5k80Q7K48j8j51m1omj0J22n8k17
3539b21l5L17J43j71n5J43J45o4m0m8j77r4P5Q0k31j66P5K93J26n5Q0R3K3LR0
3564C29j55k09k10R6J19j91j07J37J57L3Q0R5m1o4J01J24j76k73m1J28L7r5l3
3587a59J67QR7J50m6k02m4L8L8j73k21J14J28L6J30O1M4J9J11Q9j86k24j62P5
3611a12l3j96j14J32J16J28K57Q9k5M4O6L1j50k61o3n3j08p5K4J01P8J32K10O1
3635B79j09l1P5nj96k02j03L7L6Q7J54k8P6J63J42j1k31o4q2q0k02k5m9J1J38
$$ y = [113, 134, 122, -154, -257, 22, 217, -64, -257, -84, 64, 55, -69, -39, 2, -105, 25, 207, 122, -149, -47, 257, 261, 15, -109, 15, 85, -16, -39, -14, -207, -249, -68, 158, -30, -164, -56, 191, 196, 114, 47, 33, -29, -8, 80, 32, -248, -250, 22, 127, -102, -163, -17, 157, 45, 79, 132, -17, -139, 80, 192, 107, -173, -86, 162, 144, -7, -48, -54, -58, -68, 54, -4, -221, -256, 61, 204, 33, -22, 121, 266, 202, 162, 114, -63, -157, -82, -2, -233, -399, -324, -31, 95, 40, 120, 213, 236, 239, 329, 174, -35, -245, -149, -30, -221, -328, -191, -34, -1, 79, 174, 133, 69, 170, 294, 118, -155, -196, -68, -31, -126, -159, 8, 16, 113, 263, 217, 15, -29, 9, 47, -126, -347, -233, -105, -69, 61, 122, 166, 185, 296, 385, 199, -25, -187, -112, -145, -341, -455, -323, -207, -79, 178, 267, 242, 286, 352, 383, 233, -28, -91, -144, -252, -327, -303, -202, -124, 8, 218, 279, 170, 139, 214, 209, 13, -189, -292, -255, -219, -132, 22, -6, 70, 233, 375, 364, 133, 69, -13, -93, -295, -320, -369, -358, -220]
3660b20J98J56L8Q3J75J17o4l05o8k02j56j09l4j10M8J55K39J40J11K9J62K1p9
3683C25j64j64q1j36pk4PLK37K22Mj8j1lo7j51r9j71o2R6R2J49kJ62J89J33M2
3710E01j26j42j38j83j25j51j38m3J30J88J95J13J56K28M9J7j25j79k57j01j10
3731b41q8k03L6J52K20J20P8J43J26M8M6j60k20j62o1k8M1j3j1J66K10j8P0o5
3755A86Pnj81n2k25j32L1O9R8J28J11J38J33J03O9j83j43q2j15j70j93jj4J08
3779c15J17J84J13J47Q2J22Lj91j82j03o8j48q8n2R5J04J71Q1O0J40JO7p4k05
3803F1j47j10j5l7l3Q8L1J56K00M1L4jk5l3j50j93j77o4LN8J34N2O5K31J20J18
3829D07j2j25p6o4j20j34j78n4L4N9J00O7J39J01Q7O4j9r9n2o8j02j08j03j7M1
$$ y = [-220, -22, 134, 172, 255, 430, 547, 483, 178, 110, -92, -248, -357, -391, -501, -453, -298, -59, 81, 192, 221, 383, 404, 325, 161, -3, -84, -220, -227, -251, -244, -241, -4, 218, 222, 204, 193, 190, 123, -28, -127, -298, -360, -264, -172, -23, -25, 137, 326, 459, 501, 375, 233, 95, -88, -213, -364, -502, -545, -415, -227, -32, 81, 237, 465, 514, 531, 406, 227, -30, -131, -241, -329, -532, -496, -344, -124, -4, 74, 217, 343, 391, 437, 277, 57, -105, -166, -194, -153, -166, -177, -11, 199, 181, 251, 186, 193, 188, 7, -45, -270, -402, -371, -302, -204, -76, 35, 173, 306, 409, 478, 295, 152, 70, -45, -215, -408, -409, -423, -315, -198, -14, 99, 246, 328, 450, 453, 262, 80, -23, -91, -239, -327, -379, -284, -180, -9, 72, 132, 272, 273, 340, 266, 61, -86, -196, -211, -248, -281, -193, -162, -6, 194, 235, 269, 268, 243, 210, 60, -133, -310, -374, -371, -313, -179, -127, -62, 169, 289, 407, 395, 270, 194, 130, 10, -124, -302, -356, -322, -263, -163, -96, 43, 144, 231, 295, 276, 177, 125, 57, -45, -153, -256, -273, -232]
3854b32Q8R2P2M6J19N9Nq0j14r7J1j27l4O3M6NR6J88Jj9J1k9o9r2r1j00q4lN0
3883b19M0N0J16K04J04J0l0Nj12n5j43o7k04J5kL7L4Q6J16J37J45Rj3k0o2K8j84
3910B5j29j07o6L9K0J17NL0O5J63L8j9J0q6n7rj11o1j0M7O4M3m2R7%K2J0n1j38
3939i1k6L3q3K6M3J3R7J05K0O2j3LRn1j54j86k9p6K3K1R3Q6J33J14R2Q2j5n0n1
3968B30r2r6j31k20k7M7l9L9J13J65J27J23K2R6l9n5j04j5j85j10m7k4oN9K7P6
3994f6Q2J15k3j7Kkm8mk5r4k0Q7R2m9N0OlM6j04l9p0q7p4P8M7J0M4J49J15Q1n
4025B74Oq6p2o7r6j69j01p8J19l9M6K18J69Q6J34J32r8k1j19o1j93k04m1q8nN8
4051b96j3J51J02J58J55M1mL0o9l9j58j66o8kl0k1R4J3N7R5J19r7Mj4K3o6k3J5
$$ y = [-232, -144, -52, 20, 66, 185, 244, 249, 169, 55, -42, -31, -158, -192, -129, -83, -78, 18, 206, 207, 188, 199, 170, 101, 9, -82, -182, -266, -269, -219, -179, -129, -13, 191, 295, 305, 275, 280, 168, 113, -30, -97, -301, -286, -288, -251, -217, -131, -15, 122, 267, 276, 263, 243, 181, 209, 25, -104, -211, -277, -238, -218, -101, -96, -66, -1, 162, 200, 181, 191, 105, 48, 39, -72, -133, -143, -96, -32, 11, -31, 66, 66, 88, 98, 47, -91, -117, -84, -167, -141, -98, -85, 12, 117, 137, 199, 186, 189, 198, 147, -7, -193, -222, -298, -275, -254, -161, -75, 58, 172, 264, 346, 331, 281, 230, 138, 42, -89, -309, -336, -289, -328, -289, -176, -11, 116, 239, 261, 357, 318, 263, 159, 144, -41, -151, -198, -222, -228, -169, -142, -66, 16, 131, 108, 91, 93, 91, 43, 39, 14, -80, -100, -13, 79, 30, 80, 86, 83, 129, 25, -14, -84, -171, -245, -167, -120, -110, -66, 83, 198, 279, 274, 280, 194, 122, 55, -41, -210, -311, -389, -270, -309, -263, -45, 124, 210, 344, 476, 378, 357, 238, 177, -16, -220, -261, -349, -354, -296, -309, -158, -56, 102, 257, 298, 294, 324, 255, 216, 58, -108, -176, -178, -208, -229, -135, -122, -65, 30, 149, 52, 56, 42, 65, -1, -24, -9]
4079iOO1pNJ41jj36j6Nj09q8j05l3N5j9J11Q3J09J63R3L3M7p0j10l9k22r4j25
4107b71j31k3K8J10O4J03J80K25M8M3k9k9r5j32r0j37p3p2J3L0J08k3J71J01K1
4132A40M7j5J7q4o3m9k3j12O1M4O1l0k1R9o3L8q7j7n3k0M6j8N4L5J27L6j5Q7k4
4161A98l3q4o1j22o4o3l5KR7M0J05Q1J24L8Q2l9m7j32j1p8j01q7j26P4PK9J10
4188i6J40P9R4L8k0m9o0j7q5j25q5K2n9M5J4K9J04K2O1Q7J3o9K7J4o1l8Mm0o1
4217g2O3j0Nn0K5j9P2l7l9k5K9k0j1J01J6K9J01j6l6o4lk0n2o8n7m0J8K9j1P2
4247i0K5J42R4O9K4m6n1Q9j41j22n5j21j24L5L2N0M9P9J41J15O0k5L6l7n0m1r9
4274C8j31l0k1m0k4klJ28J35L3M3l0N1J4M6j41j4j1k5q9Pk8N3l2noM2j6O7k6K6
$$ y = [-9, -3, 58, 51, 56, 197, 196, 60, 44, 49, -60, -148, -253, -286, -231, -250, -139, -56, 53, 216, 309, 342, 389, 319, 209, 170, -52, -146, -271, -402, -425, -397, -287, -223, -120, 60, 285, 333, 376, 347, 318, 223, 91, 1, -136, -209, -281, -268, -238, -130, -153, 18, 119, 140, 187, 172, 189, 105, 42, -7, -30, -142, -81, -37, 24, -6, -27, 72, 9, 47, -40, -57, -110, -130, -84, -102, -48, -13, 114, 150, 135, 222, 198, 165, 81, 20, -102, -166, -229, -264, -262, -165, -125, -20, 61, 185, 223, 305, 266, 219, 87, 76, -2, -103, -190, -316, -242, -235, -206, -96, 44, 123, 217, 255, 235, 186, 126, 109, 24, -101, -186, -164, -223, -178, -164, -135, -31, -9, 52, 139, 152, 83, 110, 124, 63, 25, 29, -11, -72, -9, -19, -14, -64, -39, -58, 14, -23, -62, -87, -58, -78, -89, 12, 28, 57, 158, 142, 106, 42, 39, 19, -33, -101, -158, -198, -180, -151, -162, -90, -65, 77, 171, 240, 264, 218, 167, 256, 115, -7, -62, -183, -307, -272, -240, -190, -141, -62, 79, 194, 254, 229, 265, 228, 178, 137, 38, -93, -123, -144, -184, -208, -210, -213, -85, 50, 83, 126, 96, 147, 161, 207, 66, 52, 41, 16, -73, -66, -94, -41, -73, -78, -84, -42, -58, 9, -17, 9]
4305IN8p5L7O9R7m3k4l7j3Ml2j81J0j39N7l8J8O0N2J43J05R0K3R5m5l5j23p4j57
4334h9j20l2p7L4pO0R1K21K6J53P0k7O0q9j58j36q3n6n3rj7j0J28R2R4M0O8L7
4362B11k5o8mq5q1q9K6M7O3kN9N7nm5p7Kn5m2K7o2O5K2M1J17N6R3n0L8p3o5j23
4393b7j22j28Lm3j6J35K5J55J82Q5J33l6k8l3j39r6j91p4j23pl6R1J51Q2J31J31
4419B05mP6K8j49j5q7q0r1rj0L0K3N4P1P0kJ0m3q7m5J4r4j00N4R7N3N7J05Q2K0
4449B33k4L3j54q9k34n6K1r0J15LR5K70Q6R5R2Pj7j34j20j72j26j73l5nK9M8J11
4476a91J86J81R9N9qn3J6j32j09j82p2k9kJ1N5J30L4L0Q6m6j1p1J4p2j9lM3M4
4504a2Q0M4N1J6k2k6J1j92j35Kp0p1M1J05Q0J78J68P8M3k3Jo3j25k12j20j50p9
$$ y = [9, 67, -8, 29, 98, 195, 152, 128, 91, 78, 82, 50, -131, -121, -260, -203, -241, -223, -163, -111, 32, 137, 227, 250, 345, 300, 265, 142, 68, -89, -209, -241, -318, -284, -291, -231, -140, 81, 107, 260, 330, 303, 363, 274, 116, -20, -103, -159, -212, -221, -238, -248, -120, -28, 66, 106, 174, 211, 186, 118, 114, 29, -52, -141, -115, -68, -5, -7, 52, 109, 104, 59, -18, -16, -71, -113, -86, -148, -83, -61, -20, 97, 153, 246, 196, 234, 161, 96, -27, -149, -277, -274, -317, -333, -198, -173, -18, 164, 249, 382, 346, 318, 285, 146, 50, -141, -215, -338, -345, -381, -290, -139, -57, 74, 205, 201, 277, 305, 156, 141, 54, -26, -117, -126, -136, -106, -83, -29, 42, 112, 110, 120, 77, -10, -55, -41, -135, -235, -181, -84, -31, 26, 131, 213, 233, 209, 242, 88, -1, -235, -291, -270, -360, -245, -242, -147, 123, 209, 304, 396, 403, 386, 252, 132, -40, -166, -339, -374, -379, -350, -302, -191, -5, 176, 275, 334, 326, 273, 289, 157, 48, -134, -206, -235, -237, -226, -171, -41, -7, 23, 109, 63, 52, -19, -5, -77, -96, -99, -56, -12, 68, 112, 163, 179, 157, 131, 142, -50, -185, -183, -253, -324, -283, -178, -98, 80, 248, 326, 369, 346, 347, 284, 159, -53, -173, -323, -402]
4531d02Ro3J23K04J43K04J30O9O8m2p9j75j69j64j07r6k1L7L9R1J04J53J19N5
4555B30JJ9m0k4j09n8r1j8J8mo3N2Q9K3o1nk2k5QK4L5n0M8J53P7K4M1n6l9j12
4585F5p5j78j06l8j7PN7Q1J82J85J07Q2L9L4j30r6q8j35k16q7o3l6O2N7R6K60
4611D9J25Q1J27q8kj7r4q0j36j61J0l3k1k3J26J7N4J24N3Mp4R5kj5j11n8K5j7
4639d2J3m4jj3M3K2l0m7m3K4M2M4Q1J9N5M4M3J5n9q6n0l3j23r8j7p0Q2J7P3J30
4669iM9J09J01O7j14Pm3j3j41j11k3l7q2mQ4K1J2R6J29N3k9l1O4k6q7L1l1r0k2
4698g0N5k4k1r5R8K4k0L6l4J4P7l3M9K3j4m4J29Ql6q2n5n4P9j07k4m4PN4K7L6
4728d1M1J11K9k9L8N1n4o0j6j9o9r6l5L8%p5KJ00K4O6M0O6J5J3ML1l6n0n0j7n0
$$ y = [-402, -393, -456, -333, -129, 14, 218, 348, 417, 485, 443, 364, 189, 20, -144, -251, -347, -368, -331, -292, -201, -97, 56, 175, 230, 231, 250, 210, 186, 77, 19, -72, -90, -72, -76, -139, -87, 2, 25, -36, -41, -63, -88, -80, -56, -21, -71, -23, 130, 207, 231, 272, 216, 177, 65, -10, -188, -294, -332, -349, -342, -285, -204, -22, 163, 270, 352, 391, 425, 295, 199, 111, -24, -240, -327, -390, -426, -364, -307, -211, 49, 174, 255, 382, 294, 292, 275, 181, 101, -35, -196, -186, -219, -240, -263, -137, -120, -66, 58, 111, 115, 41, 136, 134, 119, 8, -50, -25, -42, -29, -73, -74, -87, -44, -22, -52, -99, -142, -118, -76, -32, 49, 68, 123, 167, 210, 225, 166, 80, 30, -3, -126, -224, -241, -311, -229, -212, -139, -9, 40, 149, 250, 317, 203, 210, 167, 154, 13, -98, -121, -158, -240, -244, -160, -139, -127, -31, 98, 151, 122, 91, 155, 129, 42, 73, 42, -48, -70, -15, -39, -60, -155, -57, -33, -53, -17, -51, -37, 40, 7, 56, 79, 65, 21, 150, 158, 122, 40, -15, -69, 10, -97, -121, -165, -158, -104, -77, -41, 0, 111, 140, 111, 149, 200, 146, 86, 70, 51, -18, -114, -149, -111, -111, -186, -184, -84, -60, 6, 46, 112, 127, 140, 144, 175, 139, 89, 39, 22, -28]
4759b8j61L5rJ7j10J77O9jM5P8J12p6n3M6m1Kj18j1l7l2q9J08n3K3L6P2O5k9j1
4788B6O2nj2O0k9q7K0M5J5j70n2O5km3k2J08n3K0J9J39%l0J71pqj35n5J5j22p9
4818a46n7m6On5J63R3KJ24J38J06o1l7l9m3j75n5j37jn8k1P3P2L6J09J95k8N6
4845B14M5j5j07j16ooj26r0N2Q0o4Q0P4J8k0k1L4L3o2m9J15L6p2L1RO6p0l0l1
4874Bm1q7o6N9j12l4N5J87J05k2J04J20Pm8J03j67j11j54k2m4j83J2M6R9L6J64
4900HJ25R7NN9J02j43j72o0k0j12j21J3J0P6k1Q9J02J1J3O2Nl2r4j7Q9j68j8J58
4928D6k5m1K4J25m7p5m8M6j21pk3M2k1M5J07J14N9mO2M8j70j01k3p0j02j53L9
4955b74LK1J02J78J14K0Q0J18l7j61l9p3j38j26L7l8m1L5O4J64mK7J35L3o9n4
$$ y = [-28, -189, -154, -163, -146, -256, -79, -10, -11, 34, 112, 224, 148, 95, 141, 100, 102, -16, -27, -64, -96, -185, -77, -130, -107, -71, 1, 66, 37, 26, 88, 83, 71, 131, 102, 15, 35, 80, 95, -75, -127, -62, -64, -107, -129, -21, -74, -54, -35, 104, 104, 74, 245, 238, 230, 95, 40, 55, -67, -146, -203, -249, -243, -298, -135, -42, -40, 84, 222, 328, 267, 230, 191, 148, -27, -82, -219, -220, -278, -299, -226, -154, -118, -9, 186, 158, 214, 259, 244, 137, 21, 15, 9, -117, -207, -155, -75, -139, -59, 15, 33, 13, -8, 26, 59, -3, -52, 63, 99, 27, 58, 67, 133, 63, 33, 2, -39, -126, -192, -133, -245, -279, -224, -37, 68, 46, 150, 270, 277, 229, 332, 165, 54, -100, -122, -166, -349, -337, -291, -192, -156, 8, 133, 230, 235, 294, 396, 253, 81, 21, 1, -111, -232, -219, -209, -133, -154, -65, 37, 48, 61, 123, 128, 96, 2, -15, 74, -94, -112, 46, 21, -20, 4, 129, 82, 7, -41, 5, -116, -123, -146, -104, -125, -80, 27, 141, 200, 196, 258, 306, 136, 35, 12, -58, -160, -313, -274, -271, -250, -148, 30, 144, 164, 244, 362, 325, 164, 125, 52, -86, -212, -175, -213, -254, -219, -155, 9, 5, 32, 167, 200, 131, 77]
4981G7M5m5r2p8R0qn9N4J12l4Lo8K4K7j75K6plJ8J02M0K3L9P1Q4o8j86L6j18q0
5011a50q3o2P2Kj0K16J17pR8J43K0j03r7q1r8r1j16k9p2l3J30J26J03P5J28J08
5037C06N6j03k9j36m3j94j5l4j01rJ30N4P5K8P0J8K9J8Qn2o3j1L9n7K0j1K0k5
5065a2q5K7Q2p4j01N7M8l0k5J65J10k9J9N7Kr0o4m1j00j63q8P4J3n7J64J38M6
5092D3J27J20K7Nr2L1q1j97j71o0l5k3k2J01J06M7J34R5J24m9KK2o2j40p2l2o2
5119a14r6J4K0j2J6P2O5J11k1M4K7p2L9J0K6r1oN4j00o5POoj35J3J07J2k0Q6P5
5149F6QP1R7K4o1p6j8n3j21j46%j9M4n5MJ62K2J59J16K8k1o1J5l3n1j36p9n0k9
5178a93oK6L1LJ04J20L1p2O9N8m5k8m9j5m9q9M0N2n3j7L7M2m0L4j4pK1M4K9n5
$$ y = [77, 122, 77, -15, -93, -3, -11, -70, -16, 96, 62, 65, -3, 21, 48, -127, -101, -108, -111, -93, 9, 49, 72, 111, 182, 266, 198, 12, 48, -70, -150, -233, -295, -223, -221, -231, -15, 102, 95, 193, 336, 356, 253, 156, 75, -23, -114, -230, -259, -331, -364, -234, -108, -5, 70, 198, 306, 362, 259, 230, 94, 51, -143, -158, -192, -293, -302, -172, -118, -43, -15, 55, 73, 102, 120, 128, 76, 13, 2, 41, -16, 4, -7, 13, -12, -97, -70, 12, -62, -163, -106, -58, -88, -113, 52, 162, 133, 152, 209, 211, 121, 57, 16, -84, -247, -335, -261, -248, -305, -141, -3, 43, 170, 290, 317, 322, 230, 261, 180, -17, -188, -248, -283, -306, -328, -227, -121, -74, 60, 155, 279, 230, 232, 254, 192, 52, -20, -52, -114, -210, -196, -176, -188, -172, -100, -35, 76, 55, 99, 126, 54, 93, 103, 129, 38, 32, 86, -14, -79, -72, -66, -72, -207, -194, -87, -75, -95, -9, 66, 74, 145, 242, 266, 205, 129, 111, 58, -63, -209, -209, -228, -184, -239, -235, -73, -51, 108, 224, 252, 231, 170, 185, 152, 101, -35, -114, -164, -193, -199, -173, -142, -139, -35, 85, 116, 44, 113, 171, 126, 98, 49, 34, -15, -104, -64, -12, -65, -82, -45, -3, -43, -9, -23, -30, -9, 35, 64, 9]
5208Ij0N3KK6l7qj5l1m0pp0L5j2O1Qk0J1K9J86q1n4K4K8p3J4m1k3n2J9P9Pm2N
5241b0O8L0j5m2Rnj6mK4m8o6R3Ok7o9P1N5j0jK1nj02N2qM6o2l7L5K5L0ql0O7p4
5275a7N6k8q5L0M0QKk8L2K2k5%M2n5J0m0N6J7p9qM8O9q7J6j9L7m1l2Q6k7m6N2
5307FL9K5p0n0R5p7L8nm7K7l3J37o3k4pL2oJ4L0p1Nlj3K2o2k3L1Q2n9k2J9N1L8
5340E6M9j02llJ4l2Nl0o5J10k7K2m2j0M3O4k7n0lqL8J0K0l8K3J9j1J1j4pjjQ4
5373I4r4k3m4J08p7J1K5lM6o6P2j5J0p7K4j1Jk0lL7O8m2M0q7K5j5M6J2j28N1n9
5404i4L4M8K6j1M8K5O9n4J3q5O6o9n8Po0m8J4M4rj2Q8Q6J9M6p5J13l5j4n6o6k9
5435b9n3J3qq8J6K2M5N0M2K7N9K6j1J06q2p6k0N5o7n0j6m6J1j4Ln9M1k0N9J05
$$ y = [9, -1, 52, 54, 80, 43, 35, 20, -11, -51, -58, -128, -93, -105, -44, -36, -56, -45, -16, 170, 89, 35, 59, 87, 14, 28, -13, -36, -88, -69, 10, 17, -25, -20, 48, 78, 63, 21, 30, 25, 9, 5, 29, -19, -85, 8, 14, -13, -82, -11, 44, 34, 33, 54, 49, -53, -1, -9, 37, -25, -62, -27, -2, 28, 20, -10, 57, -17, 39, 11, -74, -44, -4, 4, 6, -22, 10, 32, 7, 7, 49, -6, 4, -36, 20, 37, -42, -50, -2, 67, -20, -4, -23, 14, -27, -59, 27, 0, -46, 6, 45, 70, 0, -50, 45, -32, 6, 1, -46, -19, -52, 85, 22, -2, -9, 23, 17, 31, 61, -10, -5, -8, -21, 1, -61, -84, -53, 29, -30, -52, -33, 18, 56, 105, 3, 0, -3, 11, -21, -16, -46, -111, -1, -28, -6, -48, -58, -15, 49, 22, -28, -31, -39, -1, 9, 29, -9, 14, 33, 22, 33, 19, 12, 11, 10, 94, 0, -23, -67, 41, -36, -25, 0, -3, 43, -23, 49, 34, 44, -33, -9, -20, -19, -39, -42, -5, 63, 21, 61, -26, -1, -16, 30, 42, -86, -35, -94, -60, -12, 14, 3, 51, 76, 145, 91, 104, 19, 85, 16, -42, -35, -95, -143, -129, -85, -94, -106, -18, 68, 87, 133, 58, 171, 136, 122, 66, 0, -29, -82, -69, -77, -165, -149, -127, -82, -32, 10, 37, 96, 122, 111, 217, 135, 59, 39, 94, 27, -23, -39, -85, -74, -88, -85, -144, -103, -123, -64, 41]
5465D1%J00o6P4oJ0k8n7m1l5k0j08k6l2L0J02m3L3K2Q3J07J8j3m7N9j4l8j16p9
5494i0K3j10O8l8k6Q0J5J00jJ5mOJ8L9l3o5LOK5n0k5q2P3O3k2k3r0K6O9J5OkJ3
5527BQK9M1p7M0p4O8J8j8n4n2P2J9m4k4K2m5R7L8r2k8N8K0N7q7n1RQ3M9Pm9l0
5559A2LM4Po1p7l3K2k9j8n7M4J03M7Q1K5J4j3R1n1m5q9n8m0o4oj7k5O4MJ51jk8
5591@J24L6L1n1l5l7J3m5l1r3j12L5O5j2RJ3K5OR0L4%k1J1J24k7L5j45L9Nj19
5621c3q2J3k9Jj3NP5k1J07J4J22K5K3q4pK7n6j12o1m1n1L1j9k2rJ26Q0Q5NJ9P5
5652A93n4K8o4j53Rj6n4n8nj9PJ75K5rRO7L4l5k3Pp2N7o3K9p7m1J4N9Rq6M3rJ09
5685C6M3k0j8o4P2J2L6j6j08M0k1K3l4r3O6k0L7J3k3N1K3M2K6j4k8N7p3Qm3j14
$$ y = [41, 41, 141, 75, 149, 143, 153, 125, 68, 27, -8, -28, -136, -162, -194, -164, -62, -105, -72, -50, 33, 140, 158, 145, 98, 157, 143, 105, -11, -90, -67, -177, -109, -147, -173, -93, -78, 22, 21, 36, 32, 38, 56, 95, 62, -3, 0, 6, 31, -19, -44, -126, -53, 10, -12, -35, -125, -99, -30, -15, -9, -11, 2, 10, 39, 80, 3, 43, -31, 37, 55, 37, -17, -69, 3, 22, -22, -46, -24, -69, 28, 66, -26, -54, 4, 24, 81, -6, -57, -48, 35, 84, 91, 42, 12, 15, 59, 66, 5, -72, -105, -83, -112, -130, -187, -143, -40, 7, 88, 113, 127, 114, 205, 154, 109, 20, -38, -78, -142, -148, -165, -190, -126, -122, 29, 28, 0, 124, 160, 191, 140, 105, 68, 81, 36, 5, -88, -200, -165, -100, -112, -103, -90, -65, -59, 31, 65, 65, 44, 55, 179, 152, 187, 42, 81, 86, -33, -115, -102, -131, -130, -143, -138, -63, -84, 23, 37, 159, 184, 207, 123, 116, 143, 87, -25, -86, -127, -178, -147, -166, -188, -197, -71, 9, 94, 99, 118, 193, 139, 167, 103, -50, -41, -57, -111, -169, -174, -193, -186, -11, 14, 5, 14, 81, 115, 80, 57, 64, -8, 49, -14, 15, -62, -103, -89, -30, -21, -107, -64, -73, 36, 79, 59, 41, -23, 49, 61, 97, 81, -27, 13, -8, 15, -19, -112, -46, -66, -29, -16, -39, 12, 35, 77, 103, 89, 61, 118, 45, 53, 10, -104]
5715a04J9m4N6%k4M3P2pJ43l7m3J1O4q9j4j18j04KL6J02r7JP8J01J2M2l4kO0Q
5745A33n7p5pl4J4op4lqM4R5l3k1j0J27k3M7p1Ml0K5M2o8o9K7m3O1j6p9qmJ05
5777a5Kl5lM0J25m9Q3p0j2J3k7j6j06m9jM6l0L7k7K1O7R3L3k4k7j5R9m4j21o9
5807h1o9P1K8j1q2RP8K9K9P9o9kJ19k2l2q9lPN8n6j6q8J02LM3k0n5L6J2qKj6K
5840a2M0K1M4r1j6N6M4l1j8r2J0M3M5n0n6K3NN0J6k3m7l4J07K7j3l9j9KM8J2j7
5871C5l7oQ9J8n9n1j9l4Q5o1q6K7j0O1R6mk4R2M4k4K0j12k6j4l2p0m7o5N1O3L4
5902f6O8k1O0O7O3l8J2m0j6O8j29r3q3K7L3J9k1l6rP4J26Ok7l1PQ6N4q5n6Oo1
5933c6J16o8j25j9LJ9PnqO1Q6K8nj8K4Q8mL2j15rn4m6J9q4o9l3P3J16Oj2O8L7
$$ y = [-104, -85, -129, -73, -73, -97, -54, 18, 11, 154, 117, 74, 85, 149, 60, 46, -72, -176, -174, -138, -36, -133, -132, -54, 47, 59, 101, 67, 65, 125, 133, 76, 1, -6, -40, -26, -32, -106, -109, -117, -73, 22, -11, -32, -42, 85, 62, 109, 38, 42, 12, 37, 79, 11, -58, -31, -74, -13, -29, -108, -116, -120, -15, -13, -48, -51, -11, 114, 65, 148, 78, 66, 79, 52, 36, -70, -119, -120, -74, -104, -67, -94, -73, -6, 87, 120, 96, 69, 54, 153, 109, -12, -81, -150, -79, -51, -62, -144, -135, -57, -28, 1, 80, 11, 9, 128, 106, 74, -15, -18, -11, 47, -9, -25, -113, -11, -8, 35, 15, -40, -4, 8, 0, 2, -14, -12, 28, 49, 93, 2, -14, 42, 86, 55, 37, -55, -45, -2, 43, -7, -63, -40, -35, 15, 31, 8, -39, -73, 34, 61, 48, 9, -10, -8, 40, 52, 35, -2, -8, 81, 99, 40, -11, -30, -64, 21, -40, -126, -99, -109, -48, 48, 44, 20, 112, 156, 132, 152, 40, 14, 0, -32, -102, -149, -214, -163, -100, -66, 2, -19, 41, 108, 171, 133, 145, 105, 89, 157, 28, -65, -148, -121, -88, -69, -90, -126, -135, -61, 65, 71, 44, 13, 20, 106, 160, 75, 19, 25, -36, 80, 12, -113, -132, -129, -110, -103, -108, -116, -55, 31, 59, 54, 36, 60, 148, 144, 176, 61, 52, -2, -48, -29, -113, -182, -215, -142, -26, -20, -32, 36, 73]
5965G3P7O2p3J2j00pO8j03r8j23J04M2O3m8l3M7N4R1j3n9k5J6Q8q6q2o2J09l2
5993c8P8o4l6M2N8N8l8m3m5L3K8J9j32m1M8K0O3m6lrR4L1lm2j2K4%O3j12p7J4
6024f8M5j1Mn5j2N0M4N2n4l1R2L5P5k6q6o6L9N8l8j29o9J7N1j1m1jL3J20Q5J4
6054A16k0L7J08j6k0m8j79jr0N1q9j01J5O0R2N3K5pJ62J00M2j04q2J6km3j29n5
6082a09o4k6P1k4m2K6M4J94RR7r5J8R8Om3m7j23K7n1k2k7r8nP3kk9M7kJ09R8K8
6113A36m7mO5M1k3r4k0j00m8Pr4l2m7L9J47O0Qk0J22P4P8l5q4n5j8P0j34j02j03
6142b13j6R9M7l8m2J10Q8O9k5L4l6K1M6l3q8j30J2R3j7M6j03ML6M9k4j6o8Q5j7
6171b7P8l9m1J9P3L7j0j4m9n2L8J8p1j12K6M7N1M7o0L1N6P3m3j2ll6L4rn1j53
$$ y = [73, 150, 212, 139, 151, 51, 44, 112, 9, -89, -212, -108, -66, -3, -51, -84, -37, 17, 108, 95, 36, 11, 27, 115, 29, -53, -115, -6, -38, 40, -24, -60, -18, 40, 98, 60, 17, -28, 5, 33, 52, -80, -121, -73, -53, 10, -36, -39, -48, 46, 77, 74, 32, 20, 44, 44, 107, -5, -82, -68, -23, -34, -30, -85, -97, -47, -3, 49, -5, -36, 56, 91, 166, 140, 54, -12, 27, 85, 47, -82, -151, -134, -83, -94, -135, -136, -103, 17, 102, 116, 96, 133, 241, 225, 205, 157, -22, -23, -113, -62, -151, -252, -237, -177, -85, -32, -7, -14, 148, 248, 290, 186, 104, 120, 118, 75, -54, -109, -173, -199, -128, -152, -194, -168, -124, 70, 79, 176, 81, 99, 197, 203, 160, 113, -10, 17, -34, -56, -83, -181, -186, -113, -115, -144, -97, -99, 10, 108, 136, 89, 85, 150, 191, 168, 74, 54, -46, -94, -87, -181, -213, -260, -221, -74, -14, -6, -26, 96, 170, 248, 213, 129, 74, 56, 126, -8, -110, -213, -229, -130, -83, -121, -163, -53, 35, 104, 79, 113, 77, 98, 144, 111, 23, -107, -95, -2, -19, 27, -76, -72, -36, 13, -11, -27, -95, -10, -27, 51, 12, -29, -10, 63, 100, 90, 76, 27, -25, 13, 31, -40, -152, -126, -79, -28, 19, -41, -10, 46, 119, 76, 64, 61, 25, 59, 50, -1, -154]
6201a54Q7pN3Mo9N0L2R0n2m0m2o5J34P4j63O5j03Q7O5N7m0k5M4L7k5k9j19m5P1
6230b8n3Jr4j4J13R2J04k5q1L0R1k6qj33oK4%k3o3j1P2P7J8l8p4RP3J09o4r4j4
6261c6R3jm1l8l3L2J10Nm2p1q0L1Q3l1l9o1O4Q9O3j4p5O1O2O3j48j17K7J6n7L7
6291d8r3m6j6J85P3l8Kk9O4P6K7j34m6NJ1L9n2r1RR0K1P5j20PpO0J9q3l7KK7Q8
6323D0Oo6K7P0O4l8o0n5nJ6qo7j10j5J35K8L3m9K9L1J21M8p1m1j4M4Qq1r5o4R1
6354d8K8pr2j2J41NK4m9Oj0R2N7m2o0k3L6O2m5l4j23n0O2N4o2r7k2J49J02j3j3
6384A6M9N5K6M8K7j01q2M1j6j16j28q1P7J6O5p8M0N7J88N4LL0QK4k1p3j03j12
6412h7L5n7Rk9p6mQ0J29Nnl8J66N0K9j09k3p2N9N8j14j40l5K4P8k4q7M4M5R9Q8
$$ y = [-154, -67, -74, -21, -17, -86, -36, -4, 86, 34, -6, -48, -113, 21, 95, -68, -3, -106, -19, 46, 103, 63, 38, 82, 119, 94, 65, -54, -99, -28, -81, -80, -174, -188, -75, 17, 121, 96, 15, 45, 136, 110, 102, -31, -37, -13, -13, -36, -99, -110, -38, 39, 57, 19, -55, -46, 27, 136, 72, -22, -36, 57, 56, 15, -23, -56, -24, 86, 91, 49, -22, -102, -71, 12, -19, -58, -119, -55, 34, 97, 83, 8, 69, 131, 194, 46, -71, -44, -28, -85, -48, -141, -187, -203, -18, 55, 17, 19, -10, 54, 130, 157, 23, -23, -18, -7, 32, -20, -111, -102, -12, 9, 84, -36, -29, -36, 24, 43, -40, -77, -75, -48, 40, 46, -20, 7, 77, 141, 103, 43, -12, -17, -1, -9, -76, -186, -201, -66, -38, -5, -54, -25, 6, 127, 175, 104, 63, 49, 93, 101, 20, -75, -139, -48, -20, -27, -119, -131, 10, 15, 39, -10, -4, -14, 78, 135, 93, 33, 10, 46, 108, 63, 29, -94, -144, -82, -28, -90, -187, -209, -60, 42, 29, 16, 65, 120, 146, 194, 221, 120, 38, 79, 63, -53, -181, -262, -185, -169, -104, -182, -142, -85, 103, 157, 160, 190, 198, 222, 201, 128, 25, -87, -52, -109, -100, -129, -205, -209, -129, 0, 5, 0, -38, 128, 178, 207, 98, 75, 3, 62, 120, 6, -134, -169, -145, -67, -91, -178, -134, -89, 10, 98]
6442I8j4o9M8J30K2q8j33L9n8K9r7q7j9j7J00R8OrJ7J18P2J2j5j31L9N3r4p8r2
6471a20j11J9J14o0J0J0J45J20M8K4l0j0L5kj07j73q4M6K4r7p1j2J46Q0M3Q9l1
6498D5P6Q8Q5n3j22n2k5Oj33j20p4J1mJ49K9p1J6K28J18L0m1M3mM3n1j99o2j13
6526a57j1K5l9j57j1J57J46rR7J2J58J06K8l2p1p0np0j24k21j34J7L8N5n0N1Q0
6553a91K50J60R1J9m9J74k8j00j87j89q5q8Qj43m5o7K01J70Q7M3QK38J02qK2j30
6579B63j49k8nj18k47q2O3P5L9j40J37J10J29J62j9n7N8R2O3p4k04p1n1mj2j37
6605b07j43M1N1J49K8n8J01J88J41M5j03L9Rj05n4p1j88r1q8J01k7j64R3K25J50
6630F2O5R3K8L9N3O3j28k17j27k9L0j70q8l7Q0J32J59k6PR1J07J22l4j00p2rK6
$$ y = [98, 84, 15, 63, 193, 215, 127, -6, 33, -25, 4, -93, -180, -199, -216, -116, -18, -12, -21, -4, 114, 186, 198, 183, 52, 91, 144, 50, -28, -120, -231, -212, -98, -158, -148, -138, 7, 127, 175, 199, 169, 159, 194, 192, 85, -88, -172, -126, -102, -199, -270, -282, -136, -56, -13, 76, 45, 121, 209, 294, 241, 119, 67, 42, 48, -85, -205, -279, -268, -272, -123, -94, -165, -149, 79, 197, 227, 186, 229, 225, 268, 217, 18, -44, -157, -168, -143, -182, -339, -350, -193, -47, -56, 41, 53, 211, 317, 345, 313, 242, 172, 167, 97, -27, -248, -382, -365, -327, -272, -322, -271, -191, 59, 219, 310, 329, 280, 454, 426, 326, 139, -50, -135, -223, -215, -358, -403, -470, -269, -99, -12, 31, 39, 277, 379, 371, 393, 263, 114, 86, 81, -37, -284, -366, -303, -228, -189, -329, -192, -82, 47, 209, 190, 133, 191, 283, 346, 272, 68, -3, -54, -58, -70, -207, -350, -309, -258, -109, -81, -139, -38, 150, 291, 336, 233, 272, 281, 176, 122, 51, -137, -228, -316, -215, -242, -406, -313, -88, 62, 127, 220, 248, 287, 340, 403, 275, 58, -69, -98, -68, -238, -326, -363, -283, -151, 8, -18, -11, 80, 187, 309, 275, 175, 103, 94, 120]
6657A20p8j45p1o1P4R1mo4J6J23M9L9m1J7j0J58n2p9j3m2j1Q0j34p6j21L7Q7k9
6685a40l0J0J44R2J48L8m4p9nJ51j31k21o4m5M0o4k7k2L0J36K43M7n4k5O6P4n0
6712B18j51j33j0m3M8n5o0m3R5K20j0k1k2N7N3k6k4o1m1kP5rr5r9Q0R1km8o8M6
6742d0L0R8j03m5l2R3J02P5j35l5O8L6o9o1q0r5K7M5k3PK0R8J64Qm5k5P0K1n4
6771A20j3j30j29NO6k6k7k5J36Q3Q0L9r5L0K0N5o5j51j12K4R7j0j02MM3P9M4K8
6799F8m7n0mR9L0j55l1J00L9K1q9lL2K2P6m7j43q7M5J29p0j5KM0J24N5K7q1J7
6828A04k6M5l3j71k5l2Q0Jj00K7J6J44P9N2p9l1M7P0o7o0k04K5Q2K7l0k7k8Q1
6856c3J31or2j09R6N3L3q1K4m3O0Q2l4l7n9M9O8rq4j07jP7K5o5r2P8O5J13L7q1
$$ y = [120, 42, -103, -174, -235, -161, -70, -74, -138, -122, 1, 50, 89, 48, 65, 55, 213, 161, 82, 69, 27, 16, 96, -38, -114, -235, -198, -111, -140, -170, -160, -16, 76, 224, 262, 218, 139, 134, 285, 154, -67, -131, -176, -136, -200, -227, -249, -219, -83, 160, 207, 153, 128, 194, 268, 218, 67, -66, -76, -119, -71, -126, -186, -229, -134, 86, 76, 55, 33, 90, 143, 117, 93, 32, -9, -11, 64, 55, -40, -139, -59, 32, 30, -18, -86, -40, -10, 88, -15, -60, -92, 1, 103, 178, 43, 8, 76, 112, 43, -18, -98, -193, -166, -121, -144, -137, -117, -19, 145, 153, 108, 83, 153, 174, 120, 107, -23, -152, -147, -81, -107, -134, -159, -23, 60, 140, 179, 84, 114, 134, 189, 124, -27, -139, -115, -18, -28, -130, -126, -83, -4, 40, 68, 21, -29, -33, 66, 96, -59, -90, 10, 49, 70, -19, -22, 10, 32, 108, 61, -82, -169, -124, 5, -65, -80, -78, -38, 86, 141, 168, 87, 104, 78, 123, 90, -81, -106, -138, -58, -57, -157, -130, -114, 30, 109, 161, 82, 51, 98, 168, 101, 41, -163, -138, -56, -29, -59, -86, -114, -33, 98, 92, 0, -109, -13, 40, 73, -8, 16, -27, 33, 115, 81, 44, -15, 34, 102, 93, 9, -98, -99, -22, 3, -62, -154, -76, -11, 102, 139, 58]
6886E8l0O5O9m2j09p8j3M8J1n5m1k6P2J19%Mo3J8J34Jq8o2k2L3N4n0p3q2P9O5
6916dO4j17mnM7O5o4q9J1O7J40j0q2q7J10J0O1q6j21l7J23J6lj05QQ7P4J03j08
6945F4j1m0O7J7l2j52o8L9J10q0po4Q0J49J07p0o3n3J32nm7l2j13NP1l8p4m6L5
6974a19O6P7M1o2J4N1J05Pp0p0o3J09p4j05n7o9K9L5P7r2K2P1K09J02l2m3J4K9
7002B02P4j39j41q8m1k6k0r9p9J10R2Q7R2k0J04J21Q6K7r6l6j23j2l3j85p7r4
7028c14M8P8%q4J15J11J37J61j0j6N8K1M0j43j60m2n9k5j58j38k8J1J10J33Q1
7053g3LJ81J13J19Q3o2j14Rm0j07k21j55j40L6L3k9qJ27J74K44J2R1M3m8R1l9
7079C23r6k14p0k8m3l6j92J6J38Q5M6jM0O4J33Q2m8l5L3l0j7m9q1j90L1M5p4k5
$$ y = [58, 28, 93, 162, 120, 11, -67, -80, -32, -21, -76, -117, -143, -71, 48, 48, 52, -11, 7, 141, 142, 54, -8, -30, 3, 57, 7, -66, -148, -69, -4, 60, -57, -61, -66, -19, 46, -18, -107, -96, -29, 111, 101, 19, -68, 42, 52, 113, 27, -94, -131, -8, 8, 5, -100, -92, -5, 69, 172, 64, 53, 13, 80, 97, 65, -87, -155, -116, -6, -86, -93, -157, -77, 72, 179, 109, 46, -7, 125, 120, 73, 41, -72, -67, 4, -34, -108, -154, -119, -53, 24, 65, 3, 17, 68, 173, 180, 110, 40, -23, 86, 12, -93, -150, -219, -190, -155, -78, -170, -148, -77, 132, 234, 202, 159, 173, 202, 276, 137, -4, -92, -133, -159, -179, -278, -357, -247, -155, -68, 24, 4, 108, 229, 315, 342, 246, 210, 87, 75, 42, -143, -220, -314, -266, -188, -188, -272, -157, -46, 91, 252, 242, 226, 284, 305, 345, 202, 42, 0, -59, -84, -242, -380, -408, -397, -287, -154, -73, -70, 111, 224, 343, 426, 364, 250, 259, 219, 112, -109, -264, -404, -368, -335, -364, -372, -245, -71, 173, 185, 276, 319, 271, 362, 323, 227, 13, -57, -85, -128, -164, -356, -340, -202, -117, -71, -72, -32, 32, 165, 247, 199, 164, 197, 167, 150, 101, 20, -170, -139, -94, -168, -193]
7107a93o2MJ45J01R4k8K3J48M1O3j50j10p4Q7p6j23j35l7L9J19R1j4l6J65J25
7132B07R3n3r8j07L0Jj13j62r7J63N5lk1oO1J53P3Qp6o1JJ9r0q0l2l0J28K4n7
7161g0j6j4J88J07q0m2r2L0Q7K0j29l3l9P7K4j02k6k6Q1P4Kj15k6O7J30J5j3m
7189G5l4J04P0j07j34r5j1K7k5n8m3K8J52P9N7k1J20N8O1k6k01q0k9mm5j22k6
7216b30nJ02J50o0L6LR9J55o7o3p4m6R6r0l9p7l1R1rP6q4n7Q0J9L6l4j22O0J17
7245C2O3J6n5PN9M0M7j35j73RRKk6j38MR7J35K4L0MO6Q1O9j16j70j1Q7j9j08j47
7275b17k6P8J07J8l7m7O4J26N7m6o3j6Q5L5Pr7k3L7L6N5j17j12K9l7O2r9n0J7
7303a74P8Q2P6l2Q9k1J42L6j47j02p4j5p0jj19o5J11J17P2K2k4O3P7R4m7o3n6
$$ y = [-193, -255, -251, -106, -5, 89, 61, 84, 232, 273, 336, 186, 76, 2, 89, 13, -110, -245, -282, -243, -124, -33, -47, -83, 82, 207, 300, 247, 149, 42, 72, 73, -40, -202, -299, -136, -81, -84, -105, -111, -50, 103, 176, 184, 108, 47, 48, 67, -23, -103, -135, -165, -37, -13, -70, -86, -100, 88, 195, 115, 73, -19, 11, 98, 118, -11, -44, -83, -6, 18, -84, -110, -136, -55, 19, 21, -94, -120, -53, 77, 92, 79, 75, 41, 145, 215, 108, -26, -121, -132, -105, -130, -188, -231, -203, -51, 28, 85, 64, 184, 242, 303, 277, 76, -4, -33, -37, -82, -204, -230, -235, -133, 17, -43, -7, -4, 95, 250, 183, 120, 46, 0, 96, 6, -33, -110, -141, -50, -59, 17, -67, -124, -44, -25, 11, -23, -145, -85, 32, 95, 111, 56, 63, 122, 162, 209, 74, -99, -90, -81, -79, -105, -243, -239, -142, -7, 17, 47, 51, 117, 198, 267, 151, -19, -30, 57, 38, -70, -217, -243, -165, -58, -40, -77, -124, -60, 66, 123, 77, 14, -2, 83, 118, 125, 28, 5, 42, 78, 133, 16, -96, -67, -104, -42, -141, -191, -174, -96, -14, 62, 30, 119, 98, 240, 276, 129, 27, -47, -62, -132, -133, -252, -317, -206, -89, -17, 5, -19, 44, 121, 215, 168, 105, 49]
7330D9k4O6l9j36j0l7Q3M4m8r4J13PQ0J4q8m1K1J18Oj8p3L1J09K6p3r3o8M2J9
7359a4m1p7o2M4R8N5K6j3k0Q9J22k4q7m4kL1J6j32m3n1M0P4K1p4rO8O3Qj09L3
7389a4L0N0J4M9j33l9J45L1j5j32m8J2j6M8j44j29P5J39Q8J8m9N9M6J33j5o8n8
7416G7m0J9m3k1j60qL6K5L2j7k4Q3J19J4j8n8N1J7K0n6n4o0Q3lO3j17p7k7R7L9
7446hp6j25M9J02J07Q5j03L4J7Q9Nm1j71k0M1nn7m0n2N2P6J8Jn0P2J27L2m2p8
7475C9j8N7PLr9p9J5R3p1J1p0k2R9L0l3l3o0O7J46K8L3j40J11N4L5j43o0J4q0
7504f6O6o7j03m1N6J19Q2k0o9O6J43N6n9p4%k0M8p2j18j37J08k1L0m0m2OO0J70
7532F1Km0J9O0Q0O4q0j39L9Ll2r2q1q6nJ12j1k5N8l8J97J10J7J5o1J18l8k2j20
$$ y = [49, 25, 91, 52, -84, -94, -131, -48, -4, -52, -146, -33, -26, 54, 68, -20, -61, -40, 78, 84, 66, -7, 24, 133, 159, 86, -7, -75, -33, -14, -55, -132, -194, -150, -52, 3, 29, 16, -4, 85, 207, 183, 96, 52, 50, 81, 97, -35, -78, -129, -89, -15, 6, -68, -77, -9, 54, 62, -47, -14, 16, 66, 80, 129, -4, -43, 102, 133, 118, -14, -62, -50, -66, -18, -162, -291, -216, -77, 11, 29, -20, 39, 85, 218, 203, 135, 77, 37, 56, 13, -8, -168, -176, -140, -115, -83, -100, -124, -41, 78, 92, 74, 16, 67, 84, 104, 48, -6, -66, 17, 14, 77, -40, -117, -144, -47, -8, -84, -209, -160, -58, 49, 134, 31, 65, 82, 171, 176, 135, -36, -56, -15, -20, -77, -117, -169, -117, -41, -23, -22, -72, 0, 127, 159, 117, 39, 21, 78, 85, 88, -11, -90, -75, 18, -53, -42, -112, -134, -35, -5, -38, -71, -131, -64, 82, 110, 143, 3, 114, 168, 203, 60, 0, 14, -66, 0, -67, -170, -211, -155, -36, 46, 26, -43, 23, 166, 222, 163, 89, 89, 69, 117, 45, -73, -210, -102, -123, -93, -133, -175, -169, -109, 61, 63, 23, 42, 102, 182, 246, 166, 27, 66, 69, 37, -55, -136, -222, -227, -115, -126, -151, -93, -131, 66, 176, 193, 208, 147, 265, 227, 205, 85]
7561H5j37l9j2n5j20pJ4J27J59k3K5qJ77J8L6n8p4j02L5m2o6j16m0N0N2lK3j5
7589a16J07O8OK6m8N0L9Q3j27p5o8N7L5p7p3j12P4J6O4kk0%J82M7kql8lL4K2j70
7620b9j1j35P7L5qj7l1Q8J35Ol3j7M0j4kp4r8l7M7Q4J4q1J6oJ25Q4j20j4k3P0
7650G1k9pj50lR5l1L1k6m0N8N9J03n0j4oJO2p7p4o8Q3Rpq9j3l3J21O5kk9l9O8
7682C9R3L5q5o0kP8j6l6j04k7j0N2m4p0n6Q1J04M5J9%R1J01L3j01n0j10m7N9n4
7711d2j78nL5J09j4M8rL4J05J36k6r8k8Q1ok8j09j11k3O2j2l7n8M9M2M3L3m7K
7740e2O5J17N3o9n4k6Q0P3j10j37k4k1J29p8q3K4m0J25M3K5m5P8oJ24l2q1n0P
7768C5Qj6m1j09N1O3oo3L8k3k2J31k8K3p7lO7R2p2m9j9L9R7j5j7j45%L6M3j16
$$ y = [85, -52, -91, -103, -158, -278, -285, -271, -144, 15, -8, 17, 9, 186, 204, 240, 182, 108, 6, 41, -1, -67, -183, -223, -173, -121, -124, -101, -116, -9, 59, 65, 91, 43, 93, 132, 215, 88, 13, -55, 2, 37, -40, -113, -225, -151, -135, -71, -73, -93, -93, 89, 136, 134, 126, 88, 85, 119, 141, -29, -40, -175, -98, -63, -71, -88, -119, -31, 104, 110, 77, 60, 100, 86, 84, 10, -88, -125, -78, 6, 20, -61, -45, -51, 74, 158, 38, 24, 1, 71, 42, 35, -115, -118, -23, -54, -23, -49, -89, -31, 28, 131, 81, 67, 61, 62, 124, 47, -27, -95, -12, -3, -10, -99, -112, -145, -24, 41, 39, 10, -29, 39, 132, 167, 82, 22, 20, 98, 82, 46, -58, -85, -95, -43, -87, -157, -213, -132, -28, 17, 36, 36, 127, 228, 261, 160, 110, 0, -47, 12, -42, -220, -225, -190, -81, -95, -47, -56, -22, 83, 219, 193, 95, 67, 148, 142, 114, 5, -106, -129, -67, -79, -116, -174, -125, -83, -40, -7, -54, -52, 13, 130, 183, 114, 60, 34, 114, 187, 77, -60, -84, -105, 24, -54, -137, -113, -153, -28, 15, 40, -5, 73, 67, 191, 159, 78, 28, 35, 43, 27, -14, -123, -72, -9, -15, -78, -40, -63, -85, 46, 18, 41, -36, -39, 28, 120, 48, -1, -20, 19, 116, 101, 84, -61, -61, -25, 18, -98]
7798i8K5p7P0O5L0o2m0R0J06O7j08L7p1O7m0J0o9q8N5L2l6n4p9N1Q9L1Qq2K2M8
7828aJ17qj7J0N6m7%l4q4o2L4Mr7r0jP6M1L6kM1Q9J43N1l9n0o4Q2k4o5r2j52k4
7860a73Rjl2k5P3P3J11J8N0k6J27L0q8Kj8q7P2o5r6j25m7J2L7l9JJ5M6J85P5Q
7890A22K6M7J04L8p3j55q2m5J4j09r9p6L4N8%L0L6J11Q6J20M5j7m8KM3n3j04j41
7918h6l5Ol0j7p1J8L9J33O6jm7J21J17L7j13k4j0l0K2r2l5o9l5mN2o4p1O5J32
7947b6M7j9Q8l9N5M4N7j40o3j1k8N5q1j20j5P0Q7m3J0kN2N2O1n2n7N8M6J7l4l6
7977C3p3O1l2J8n8m7j7J56l9o4k9K9L8O2J2m0%M4N2k1j6j9m3LJ7r4l8L3j1R1o8
8008f0nm3O1J36K5q6N7n0R2jk4n2l8j8j0L8j11m5m0J01J0Lk8N9O1N3K3Lk7l0M9
$$ y = [-98, -73, -150, -80, -15, 15, -47, -87, 3, 109, 176, 68, 105, 34, 101, 61, 71, 2, -86, -31, 1, -35, -89, -168, -117, -28, 3, 11, -71, -49, -1, 116, 108, 91, 101, 157, 110, 110, 76, -8, -70, -36, -32, -129, -219, -220, -144, -103, -67, -69, -28, 61, 204, 255, 216, 166, 102, 184, 160, 95, 3, -149, -173, -164, -165, -197, -222, -149, -76, 35, 53, 103, 77, 204, 234, 146, 148, 130, 43, 115, 50, -46, -171, -218, -206, -169, -208, -207, -192, -146, 39, 114, 122, 148, 195, 299, 337, 264, 109, 27, -18, -4, -113, -212, -288, -254, -196, -196, -166, -130, -19, 67, 187, 232, 215, 167, 169, 212, 159, 55, -86, -121, -115, -145, -162, -233, -215, -176, -43, 23, 22, -25, 96, 213, 250, 137, 113, 103, 73, 95, 3, -32, -101, -136, -140, -88, -152, -223, -158, -26, 21, 2, 90, 51, 106, 150, 207, 67, 4, -7, -35, 20, -61, -181, -196, -126, -39, -82, -72, -74, -22, 30, 91, 39, -18, 40, 86, 103, 69, 33, -40, 21, -11, 7, -51, -98, -115, 41, 2, -62, -91, -62, -24, 38, 50, 10, 10, 54, 106, 85, 69, 50, 7, 10, 27, -67, -105, -72, -83, 8, -60, -65, -108, -47, 89, 114, 28, 85, 35, 127, 126, 102, 50, 12, -6, -16, 22, -89, -134, -174, -73, -63, -60, -88, -29, 32, 85, 108, 111, 84, 54, 103]
8039A03J1q4j51N1k9J2o0M8j06J24L2P4N3k2M1M3N3m4n3jp2lm5n9j39M5M2R8k3
8068f1p7Q1P3J59o1O7o0k1O5q4k6j28l7L0Pq1q9K2Q8R3J9l8N6J02J34k4kl0j12
8097F5L1%j07j27p9M3K2N2rj1L8J32M2O6o0K0O0j8mj04j02j4J0K9o7q3l2R1J48
8126C2n2l7O2M4R9k7K3m5n0O1m3m9o6lJL9n1m2l6K8Q3J17k3oLQ2M8r6j0r0JJ9
8158A6n1n0o9P1o2P6N1q3M8J43OR4j06Rj3kk3r8j3j5P3m4K7m3J2l3J42j8L1r5
8188a9M7L1m4
$$ y = [103, 114, 30, -121, -70, -99, -87, -147, -99, -205, -81, -49, 25, 78, 56, 97, 140, 193, 149, 96, 95, 23, 20, -25, -84, -223, -178, -136, -38, -61, -138, -57, 16, 175, 114, 181, 121, 100, 165, 81, 55, -73, -110, -80, -73, -154, -243, -221, -133, -40, -21, -59, -3, 99, 233, 209, 207, 177, 65, 96, 96, -11, -138, -217, -174, -152, -100, -109, -120, -82, 50, 92, 158, 98, 118, 178, 160, 156, 52, -50, -64, -54, -25, -92, -175, -207, -116, 32, -20, -57, 5, 49, 148, 121, 144, 99, 49, 110, 67, 18, -48, -51, -50, -11, -62, -104, -140, -112, -29, 88, 65, 59, 62, 144, 192, 96, 86, -4, -3, 16, -35, -85, -154, -83, -145, -69, -18, -101, -53, 90, 96, 190, 84, 93, 80, 78, 55, -43, -56, -71, 2, -42, -15, -58, -46, -79, 63, 45, 76, -19, 28, 59, 15]
8191A5
$$ Imaginary data points
##PAGE= N=2
##DATA TABLE= (X++(I..I)), XYDATA
0@%%%%%%%%%%%%kJ0j6J6j6J9k7L2l5M3n4O3p4Q9j04J19j36J56j78K02k29K61k95
35a56L33l75M20m70N25n83O48p20P97q82R75j079J191j311J441j588J751j930
53a013K130k353K604k888L216l592M033m563N209o017P063q481J0516j3710J9503
68A1657l3411J31322J92390m8781k5493m9788j4855m8830r1333j47623r2710l86
80b17841N5867J0143j5903J8775Q9901J00514O5124N147k7334k1197K3854K9391
92A16441k6680q2768m9605K5313M8035j574m2949l5973J292K6973K0038k5335
104b6792o2270l5844L7940O7164K2075k0438P973O4881P6126L3958j9040m9522
116I6211m1872j0228n717n5365r8703o4947J5890N1141K3167j291K0657O2469
$$ y = [0, 0, 0, 0, 0, 0, 0, 0, 0, 0, 0, 0, 0, -2, 8, -8, 8, -8, 11, -16, 16, -19, 24, -30, 33, -41, 48, -56, 63, -73, 83, -95, 107, -122, 139, -156, 177, -198, 222, -248, 277, -306, 342, -378, 419, -463, 512, -567, 624, -687, 754, -834, 917, -1013, 1117, -1236, 1368, -1520, 1696, -1896, 2137, -2426, 2783, -3234, 3829, -4652, 5864, -7846, 11657, -21754, 109568, 301958, 253177, 227684, 177896, 163041, 114211, 22878, -124745, -217455, -217841, -161974, -151831, -167734, -148959, -59058, 41456, 106580, 111727, 84393, 63196, 87050, 116441, 89761, 6993, -42612, -17299, 30736, 29162, -13787, -49760, -48468, -21495, -1457, -26792, -89062, -124906, -86966, -19802, 2273, -18165, -10192, 54689, 130815, 164773, 145733, 96211, 54339, 44111, 38394, -16971, -115674, -180621, -164731, -113590, -90423, -91714, -71057, -8588]
128h588Q2986O5554J3956l6752l8340J036Q825m4248q9382o1589L476L3025J6433
141e3608n607n234K0562N4852N8450R547m4520l7405J3092K7770j4568n0330l2197
154e9196J4293M2654L6570N587k2453j3246K5449L4442j4424o3631n0010J883
166f2082K4216L359j9170j3454J7434N2026N8293K0678k4439k2520J6062K4501
178G4904j9798o1235n0947r373J8395J6036m222j7384J466M3632N7841J6764l1184
191C4895k7511J1062K2843p404l9000l8943r872K4366L4654R006k1920j2324K9382
204I234M2582K957l9613l6204l297J5437N523j7034k8414q949L1621M9340J9276
217D2459j9830j5544K0621L1653o73l6926m1520j8027Q688J5316n694k8707j5169
$$ y = [-8588, 74398, 139952, 153908, 117156, 78816, 79852, 88677, 44429, -44953, -106542, -103066, -70041, -53608, -59215, -64449, -43887, 10965, 69415, 78962, 34442, -2963, 10129, 37899, 23331, -26999, -59196, -44903, -2249, 34321, 39908, 17455, 4209, 29658, 64100, 49676, -13955, -63965, -62082, -37866, -34507, -53677, -67131, -49697, 2329, 60622, 81300, 56861, 34341, 50403, 74904, 55106, -6129, -57076, -66449, -48054, -32018, -36240, -53624, -52158, -8526, 49315, 66079, 34895, 7384, 18446, 41289, 33885, -5115, -44058, -53930, -29564, 5090, 14096, -7824, -20148, 9234, 51816, 54773, 15160, -21044, -24341, -8904, -3381, -20415, -48829, -57778, -26157, 23183, 42459, 22629, 7085, 27706, 59359, 58686, 21760, -19760, -37787, -29099, -13783, -19477, -48184, -63353]
230f3353K9793N0904K0982j7682j6455J3411K7257Q559k2740l9046k4944Q744
242b4570K4806J607k8951j9895K1402M0835J6394j7042k1864q22J9546J7880q376
255B0950l3330k4193J3650L3440R751k2676j9437J2722L0742J5667j4202k9685
267f601j6663J2080K3455n19l0697k3869J4991L6040J5618j5292j9102L511K4392
280A7344K0972o412l1663k4966Q375K6078L694k7392k3693R723L0672J8226q493
293A2465k0581p066J8460K6366K159k8468k5890P260K6840P912k1721k4455L48
306b6371K3388K1627k294k3425j6040J4232K9969Q297k4124k5009M619K5246J3026
319B3141j4541k5896r579J7329K5512L843k3102k0311J0561K9144J1552j8805
$$ y = [-63353, -33560, 17344, 38326, 20644, 4189, 17600, 44857, 53416, 30676, -8370, -33314, -24570, 236, 1843, -27108, -47003, -25601, 15234, 31628, 14586, -7278, -8100, 11446, 29326, 20950, -12380, -36573, -22923, 10517, 20268, -2408, -21845, -9123, 21619, 37286, 23084, -6601, -23264, -11184, 12271, 11752, -18945, -42814, -27823, 8217, 23835, 8543, -10559, -7048, 17344, 38316, 31904, 241, -24725, -16350, 9728, 13422, -13970, -37663, -27940, 2732, 20958, 12465, -8116, -15182, 3278, 29644, 31803, 3335, -22555, -15295, 11545, 19457, -2264, -26719, -26371, -2983, 18644, 16350, -7075, -23115, -8883, 21086, 29383, 5259, -19750, -15131, 10115, 23141, 8600, -17296, -26875, -9546, 15966, 19809, -3293, -23604, -13043, 16101, 27653, 8848]
331H848k4552k116J9874J7271o755k5648j6740J2806K8454R946j8847k0128P114
344a0473K6655J4870j3048k6081j1772J3243K0387m19k5347k1569R215K9625J5109
357B0395j3437j9674J693K3040J9151o432k6863j9711P715K2379N458k1323k1582
370b9191O339K8136J8712p885k0260o650J5493J9534k409k7022k4602L442K3490
383b873J2075j2950j7501M974K7358K3817j669k2495j7056N966J6962q87k7254
396a1533k8149n29K3806J9135l853j3910K004K5378K8328M332k2495k3637r33
409b056J4406J483k3601k7948m452K1332K2566K110j3788n322J8225K7111P569
422C7635k0529k5234l664J5588R118j3314k2328n255K0343K6478O697j6604j6151
$$ y = [8848, -15704, -17820, 2054, 19325, 12570, -13078, -29818, -17012, 11442, 21388, 2541, -17587, -10473, 16182, 31052, 18004, -8077, -19849, -6606, 13781, 13362, -11985, -33554, -24339, 5286, 20395, 6958, -12716, -11023, 12017, 31168, 24736, -2127, -21838, -14123, 8256, 13714, -7609, -29191, -22852, 5284, 23996, 16111, -4149, -10799, 4694, 24228, 21819, -5203, -29805, -26363, -2873, 9202, -3748, -21249, -16275, 11083, 34900, 33231, 10736, -6320, -354, 16608, 15721, -11533, -39682, -40211, -16405, 2730, -1123, -15033, -13029, 12349, 40677, 45009, 22514, -1123, -2056, 12350, 13833, -9768, -37716, -42168, -20836, 1730, 3840, -9948, -15270, 2955, 30066, 37635, 17106, -8128, -11792, 3796, 12914, -400, -22728, -27983, -7640, 18838, 25535, 8931, -7220]
435g220N636J9360M862k1892k8975q366J5889J7739j021j4552l462K1887L2215
448C2100J3894j3940k0745k968J2483K581k2036l2305j5304J1197J9952N235j1065
461b0921n564J8404L2477J8416r314k0581o406J1062P526j4501k8881j7304R319
474b6268K2880R971j0895j2778P127K3510J4311j1641k5437j3090R575J5271j192
487A344j7627j0749J4746L0697J9224n583j5825k944J1974O135j7717l4207k4691
500d5223Q47J4798N333j0237o610J7226L6059K8942M084j1531m558J0347Q718
513D8195j3400l4079l0717o460J1611N848j1689j3848O222K7389K5958M299j2924
526F405p393J1560J8509K523j8879k0381L4J8174J2917q320j9366p838J0736J2357
$$ y = [-7220, -1584, 17776, 22638, 746, -28229, -36595, -20706, -2967, -3988, -18540, -22002, -115, 32100, 45994, 32054, 11309, 8341, 20824, 23405, 1369, -30936, -46240, -35043, -15091, -9856, -20921, -26485, -8081, 24396, 42812, 33498, 12917, 6511, 17573, 25099, 10598, -18283, -35587, -26268, -3388, 6583, -4312, -17090, -9963, 13547, 27858, 16217, -9220, -22310, -12735, 2536, 1344, -16283, -27032, -12286, 18411, 37635, 32052, 16227, 13283, 25257, 31392, 13675, -20532, -45223, -44376, -29578, -24245, -34482, -41092, -23866, 12193, 41135, 45219, 33688, 29130, 39477, 48195, 34795, 716, -30001, -36461, -24850, -19002, -30691, -44539, -38317, -10928, 15030, 19329, 6405, -988, 10572, 29081, 31604, 12725, -7656, -7622, 10552, 23469, 15149, -4217, -12055, -1319, 11038]
540A1038o598k4852k0620J978J8020J1434n669q285J0352L0199K8117N937j2718
553C8333r803N062Q063j0706l3240l4786j3781P248P373o616j0666P040L0901
566a5578L5666J7076l680n135R468J6121K04k4566l2581j6703L027N001r792j8916
580d0388o809J6481K6202J2558p220r981O476K0067J2537q829j9077o916J2418
593G519J5921n93j7208j4455M014J4892L440j7868k4064p701J2242J3491k081
606a2451j2054p99K0863K8914J4124p012j1888J564J2491K817j9966l0784j8032
619c2213L088R386k629j3595n345J6595K9256J9302j712j0063J181J4563R642
632C7456j1143k5316j7092K817J1899P91j4505j3075O000K1476J5566m530j5434
$$ y = [11038, 4440, -20412, -41032, -39054, -21034, -9600, -15269, -23554, -13202, 16997, 45114, 51051, 38333, 28530, 33592, 41655, 30949, -2291, -37077, -50858, -43610, -36237, -42853, -53519, -46479, -15578, 20088, 37164, 33484, 28349, 37817, 53938, 54142, 29576, -3005, -19708, -16681, -11680, -21472, -40388, -47197, -30716, -4514, 8044, 824, -9157, -2681, 17386, 29923, 21094, 2017, -4899, 7519, 23440, 22847, 5639, -8816, -4802, 10090, 13530, -4338, -28402, -36103, -23861, -10370, -12451, -24505, -25304, -4441, 24473, 38597, 31585, 19697, 21261, 33752, 36569, 16603, -14181, -32213, -29125, -19739, -22368, -35963, -41308, -24713, 4543, 23845, 22133, 12070, 13251, 27814, 37456, 26313, 997, -16095, -13278, -1379, -588, -15093, -28168, -22168, -692, 14874, 10344, -5090]
645e090n223J1792J3749k654j7606j3101O578J8854R906q594j4162P0J5491J2356
659B2366o833k0192j2875N280J2439R21j4156j2824N611K1079J6058k531j2469
672A874k652J3077J3350l959j9713j6426J210J2405M561j1627j5228M95J8254
685d379J7404k64j3198o502R852J4744J076j5905j6506k18J4334J0224o684j4769
699a0791l393J3996J5937J24j4928j1821L977J3057M135j2358j6208j738J5100
712d911J4764q88j2157n087J1143J6035K670j4262j5638j064J1731P106r347j7069
726a6974n277J2607J6202K212j1213p848P635J6374O814j0738j6200l532J1522
739A584J0444n174j5911q003Q916J4787L369j1099j1427K775J4616R667o826j5159
$$ y = [-5090, -10313, 1479, 15228, 12574, -5032, -18133, -11555, 7299, 17205, 8611, -5551, -5481, 10010, 22366, 15533, -4659, -17534, -12254, 185, 1106, -13050, -25874, -20263, 816, 16874, 14343, 1874, -778, 12299, 25649, 21690, 1977, -14449, -13239, -834, 3727, -7900, -23128, -22633, -4379, 13025, 12761, -437, -6939, 2913, 17657, 18733, 2828, -13678, -13896, 438, 10662, 3978, -10791, -14184, -188, 15749, 15873, 945, -10876, -6899, 6158, 10293, -2065, -18273, -20011, -4911, 9853, 8965, -3192, -8279, 2864, 18899, 21569, 7307, -8331, -9395, 2336, 9442, 95, -16974, -22251, -9644, 6558, 8770, -2443, -10291, -2656, 13718, 20532, 9794, -6406, -9938, 1584, 12028, 6854, -9057, -17060, -8144, 6643, 10012, -1087, -12514, -9739, 4877, 14544, 7718, -7441]
753g441m944J1015J3401m23j3298r637N506J4032N573j0128j4672k525J2175J1531
767A0165l627j4492p290R175J5009L656j0549j1131K554J3865Q872p212j5470
780f475n959R529J2071j284j3486r686N729J4107O240q420j2208l81J2974J1750
794A4501l220j3839p487P516J2549J595j2007j2211J301J2593Q386o315j3644
807a0282l982J1282J3925Q24j1583q558N367J3095M816r854j4247k973J0500R870
821H200l985j3653o545Q928J4383M010r056r408K892J2660P655p208j4826o071
835a2024Q325J0833j256j2415q603N894J4001O528p237j1061p05J1600J0230l802
849A0308j4024q148O685J2192K299j0420j0253K387J2666Q229n961j3112m673
$$ y = [-7441, -12385, -1370, 12031, 11608, -1690, -11327, -5821, 8211, 13784, 3656, -11016, -13541, -1366, 10165, 6538, -7954, -15244, -6069, 8940, 12596, 2047, -9084, -6530, 7335, 16207, 8995, -6475, -12434, -2905, 9166, 7882, -5604, -15290, -9561, 4546, 10786, 2366, -9842, -10223, 2751, 14501, 11281, -2558, -10045, -2529, 10020, 11615, -392, -12603, -11302, 1291, 9677, 3362, -10282, -14264, -2982, 10943, 11767, 184, -8374, -3007, 10088, 14904, 5050, -9197, -12170, -1670, 8200, 4215, -9438, -15983, -7055, 7328, 11338, 2282, -7126, -4234, 8426, 16081, 8873, -5953, -12024, -3699, 7134, 5878, -6537, -15140, -9246, 4755, 11283, 4046, -7015, -7720, 3880, 14110, 10308, -3716, -11864, -5179, 7013, 9312, -1108, -11361, -8974, 3692, 11921, 5960, -7152, -11825]
862a1825R206J1366n84j1845q393N591J3381N973p416j0992p35J0750Q794m840
876H431j4487q435N746J1103J994r621q727M096J4296J0065l812j1063l384Q991
890E193J0169k682j4438j1489K260J0193L906p983j0294J184J3437J2376q24j0572
904D36n309P479J1049N10j1989j1906K28R828O096n978j1418k507J0549J2239
918I307N18j0653p971M477J1193L816q583j1308p72J0826R937k353j1050n678
932h294P067J1299J399j1106j1381J94R850O270n769j0902k027J1023J2936J654
946A2213r090p034M618J0560K889r837j2963l000Q413P693l618j0934m378Q743
960e725J3048L784q019q466J940J0185N532o823j2472m300Q234J0283j89r934
$$ y = [-11825, -2619, 8747, 8163, -3682, -12075, -6484, 6897, 12870, 5454, -5538, -6273, 4477, 13271, 8431, -6056, -14491, -8745, 2358, 4352, -5269, -13996, -9900, 4396, 14461, 10649, -414, -3798, 5193, 15362, 12680, -1758, -13247, -10987, -794, 3112, -4871, -15165, -13981, -544, 11832, 11008, 436, -4873, 2606, 13655, 14165, 2176, -9730, -9502, 326, 6422, 444, -10974, -13481, -2932, 9307, 9825, -828, -8799, -4322, 6871, 10687, 2104, -9204, -9976, 850, 10787, 8434, -2616, -8294, -1227, 10072, 11471, 365, -11016, -10822, -972, 5298, -471, -11373, -13400, -2377, 10559, 12213, 3123, -3911, 707, 11267, 14156, 4319, -8644, -11644, -3231, 4462, 844, -10090, -14468, -5725, 7323, 11107, 3088, -5378, -3438, 6747, 12279, 5456, -7016, -11316, -3082, 7201, 7012, -2922]
974b922o692N305J1706M448p910j1085j867Q515P191m046j1541n185P980J2456
988F353L733p203p115L259J0863N680o935j2567n206N973P315k623j1184p202
1002a6859N345J2336O125m938p487J577J0884Q665l391j1454o496M930Q695J46
1016H078j0129r716J209R909O162m995r938k255Q954R940j10r035n941N395J1227
1031H755M622o541r165o95Q180O087n374j2346o905M639Q474P99q165o856M137
1046a0354J2264Q627k215p380j053Q500Q433k357j2011r661J084O912J387q328
1060f152r675l3J0079R489n24p107k226Q002J0970K131q314q778O67P692L629
1075I850o736j0963l758O531P844j037q785n710M964J0610M956m991p277Q11R251
$$ y = [-2922, -9614, -4309, 7397, 11845, 3935, -7150, -9017, -502, 6689, 2643, -8898, -14083, -6103, 6353, 10086, 2883, -4232, -973, 9890, 15570, 8635, -3932, -9138, -3165, 4150, 1527, -9657, -16859, -11514, 822, 6947, 2009, -5478, -3901, 6983, 15648, 12257, 803, -5693, -763, 7932, 8078, -2051, -11767, -10558, -649, 5513, 518, -9420, -11675, -2721, 7219, 7109, -1926, -7867, -2472, 8755, 13377, 6836, -2329, -3024, 5156, 11243, 5869, -6477, -13382, -8743, -269, 530, -7635, -14491, -10354, 1910, 10537, 8322, 942, -111, 8389, 16822, 14465, 2454, -7207, -6123, 789, 2176, -6152, -15827, -15860, -5781, 3708, 3184, -3923, -6149, 1853, 12823, 14954, 6640, -2138, -1471, 6221, 9850, 3114, -7849, -11607, -5076, 2768, 1731, -7054, -12764, -7800, 2810, 7766, 2775, -4502, -3691, 5560]
1090E560P684k718r786n502M379P585k60r534r212M59Q412N785l734p783r11R051
1106e25J0143Q75p638n742L515Q424K154p819j0194k182O629N890k916q700l658
1121a1744O768J0115K679o426o461K207Q802M881m937r359l315O004P215j127
1135E302q686o271L612R201L671n725p992k03P927O883k309q349m134N324Q579
1150F830J387p505p566J299Q053M609m678q507k381O758P903k51p538n179L966
1165b800Q839L193o201q524j104O706N634k922q504m068N502Q996K350o106o316
1180e325K105Q443M887m552r055l490N160O397j114q242n800L896R291M284m628
1195B257o683N69P681O306k616q602m871L830O927N25p609p266J541Q349N178
$$ y = [5560, 13244, 10526, 740, -4762, -383, 7202, 6942, -2592, -11804, -11345, -2933, 2852, -882, -8665, -9576, -525, 9618, 10493, 2855, -2887, 628, 9052, 11206, 3387, -6807, -8989, -2360, 3530, 614, -8086, -11744, -4976, 5139, 7818, 1392, -5069, -2862, 5940, 10821, 5884, -3475, -6790, -786, 6429, 5302, -3384, -9655, -6043, 3158, 6829, 1104, -6888, -7091, 836, 7719, 5410, -2939, -7073, -1749, 6830, 8217, 712, -6854, -5555, 2498, 7107, 2429, -6078, -8459, -1701, 6202, 5951, -1587, -6766, -2800, 6039, 9232, 3031, -5493, -6597, 109, 5743, 2821, -5683, -9751, -4249, 4747, 7097, 991, -5325, -3220, 5223, 10110, 5558, -3497, -6987, -1827, 4570, 3456, -4786, -10586, -6690, 2601, 6885, 2257, -4426, -3857, 3824, 10130, 7514, -1088, -5959, -2129, 4798, 5323, -2286, -9552, -8011, 338, 5516]
1210E516l400p130j612O592P417%p348n727L006P963L046n780p971r38O663N673
1226E970k430q011m277M441P760J765o180o187K032Q483N403l352p384k142N507
1241A398O273j168q174o316K086P243K822n492o887L45P822O919j037o513l374
1256d053M483P252R21p286p678K91O671M051m032p346j829O269P584Q47o012m850
1272d717K998P730K877n974q013j265N917M949k336p148l434M588P884K324n381
1287I99n704J667P546M297m093p826k788M593N622n32o792n392K566P729L733
1302E625m342o522O5O929N917j535o700l874L525O493J212o369o891M47O629M007
1318D616l994p038j866N500O595N47n361m075L288P873L594m716o797p76N426
$$ y = [5516, 2116, -5014, -6626, -34, 7383, 7383, 35, -5692, -2686, 5277, 8323, 2543, -5428, -6366, 297, 5970, 3540, -4471, -8748, -4307, 3453, 5218, -962, -7149, -5117, 3366, 8769, 5417, -1967, -4109, 1398, 7671, 6503, -1671, -7987, -5901, 1342, 4164, -1328, -8215, -7870, -48, 6871, 5834, -679, -4053, 430, 7682, 8603, 1317, -6361, -6070, 601, 4652, 620, -6726, -8555, -2286, 5298, 6145, 133, -4717, -1719, 6011, 8888, 2914, -5099, -6364, -447, 4502, 2166, -4982, -8416, -3828, 4056, 6380, 999, -4705, -3038, 4508, 8805, 4712, -3114, -5902, -1309, 4313, 3781, -3011, -8403, -5837, 1892, 5625, 1283, -5239, -5174, 1755, 7672, 6137, -563, -4437, -912, 5581, 6793, 424, -6467, -6020, 609, 4616, 622, -6416, -8282, -2782, 3813, 4360, -1001, -5076, -1788, 6085, 9679, 4963, -1834, -2610, 2816]
1333B816M045l157p759m794K651N945J546n055n191K321Q512N883j890n508j082
1348g17N014N458q49p362o702K02N102J715n623o899Q8P110O449j80m323j545
1364c062M814P048J921n621o728l49N276K470m906p625k365M496N704N59m759
1379c127l762K890P411L710l867o160l01N912M690j957o175l499K755N571J318
1394E409n417o429J30N932L655l573o134j113N430O339J129m032l532K560O518
1409F872K769n060p485j736M219L175l092o293l034L595O724L236k984m171J908
1424a357P043M174l642p081k768L129L663j018n590m482J804O777M117l051n290
1439c572L72O005M233k459o284l577K081M780J498m272m918J430P064M849k536
$$ y = [2816, 6861, 3704, -4055, -8849, -6198, -253, 1293, -3762, -8953, -6632, 1880, 7763, 5873, 365, -717, 4297, 9755, 8906, 1544, -5158, -4956, 146, 1861, -3762, -10661, -10573, -3463, 2986, 2806, -1517, -3062, 1752, 8800, 10721, 5100, -1628, -1977, 3299, 5769, 863, -6762, -9127, -4631, 1073, 1632, -3127, -6889, -3999, 3412, 7122, 3255, -2905, -3206, 2706, 7396, 5439, -736, -4235, -1480, 4091, 5409, -8, -6437, -6307, -375, 3280, -293, -6427, -7540, -2110, 4229, 5358, 1326, -2206, 354, 6872, 9641, 4581, -2904, -4640, -421, 2754, -338, -6631, -9665, -6070, 654, 3890, 906, -3265, -1357, 5686, 9860, 6218, -863, -3631, -502, 3161, 2143, -3447, -7929, -6125, 652, 4769, 1718, -3572, -3200, 2805, 7038, 4579, -1705, -5282, -3201, 1579, 3077, -1195, -6113, -4683, 2381, 7230, 4694]
1454D694n659j343M043L781j293o034n260N85N395L336l220n020R20O972N543
1469G440j114m960k822K115M032N06n337o385m69N592M272k673n073k13N360N253
1485E524J01m599m228P54M802K589m133o064j98O032M941j407m707k124K605M261
1501D149P30m953o400r86N061M003k564m805L10O156O313J253l303l538M13L819
1517E658J342n523q302k607M060L769j650l974l32N076P003L622k005m057j38
1532A942M693K454m862q002l089K929L268q16l713k544K382O402M439j915n000
1547a432n06N205L911k581n727k655K332M092J478l275m696l83N091L735l264
1562A325o421j772M027M074m05l296j998K394O020M320j930n124j067M324K674
$$ y = [4694, -965, -2308, 1735, 5516, 4223, -1811, -7071, -6486, -1091, 2245, -975, -5995, -5075, 1897, 7440, 6326, 1366, -1456, 659, 4691, 5197, -140, -6525, -6994, -1402, 2870, 197, -4876, -5089, 271, 5524, 5625, 1026, -3202, -2448, 2354, 4943, 810, -5254, -5452, 580, 5521, 4114, -593, -2717, -112, 4149, 4879, -74, -6474, -7460, -2399, 1604, -960, -5765, -5455, 701, 7014, 8267, 4964, 1426, 1839, 5658, 7000, 1477, -6825, -9432, -5372, -1603, -3253, -7227, -7559, -2483, 4520, 8142, 6137, 2080, 1942, 6635, 9089, 4227, -3775, -6864, -3935, -667, -1483, -5196, -7740, -5358, 1044, 5483, 3568, -1432, -1938, 3267, 7178, 4597, -1130, -3785, -1453, 2639, 4117, 842, -3854, -4237, 854, 4589, 1325, -5096, -6868, -2841, 1233, 828, -2468, -4466, -2072, 3948, 8268, 6338, 1214, 147, 4471, 7145]
1577G145l948p214l761J335L035J032k405k936J737P293O294m73m375p29M081
1592F111K849k606o187n224j010K593K146k448m532L28O822O201k20l754j028
1607D1K993L191j23m188n354j487L700L680k243n103m89N272M619m84l732k870
1623b577O44L255J959k761n360j113N190N006r70m068r45L404L641K67l499m941
1639b868j679K941L078k469n245q69N310N289M39k609j466J601L410J625l193
1654C295o215k652L292L390j974m655o13M343M966J870j548k823m09L210K564
1669F041l186o916k858L019L497p82k967p41K909N054L706p57l954j701L111K670
1685F145l326o729l252K014K967O75j712j584J337N318M871n90m651j962L165
$$ y = [7145, 3197, -4017, -7778, -6443, -3408, -2376, -4781, -7717, -5980, 1313, 7607, 7134, 2759, 2030, 6111, 8960, 6354, 167, -5057, -6067, -3474, -1328, -3776, -8308, -7980, -1158, 5043, 4823, 1069, 41, 3034, 6225, 6102, 1914, -3440, -4927, -1227, 2453, 210, -4893, -5382, -110, 4509, 4025, 293, -2577, -1933, 1322, 3281, 520, -4840, -5953, -763, 4243, 3273, -795, -1740, 1664, 5305, 5572, 2073, -2868, -4547, -1606, 1472, -997, -6242, -7111, -1801, 3488, 3927, 1318, -148, 1453, 4863, 6488, 3295, -2920, -5572, -2280, 1110, -864, -5519, -6132, -1789, 3177, 5047, 3499, 676, 267, 3477, 6041, 2855, -4061, -6919, -3900, -403, -1185, -4152, -4893, -1984, 3070, 6776, 6019, 2065, 364, 3475, 6145, 2819, -3910, -7162, -5148, -2181, -1506, -3218, -4802, -3465, 1853, 6724, 6134, 1483, -479, 2686]
1700B686K721k371n174l011Q89L063K359j002l207m53M461M409j349n347k462
1715c788K130K641k72k642k348O27M587M743M2l913j433L320K840k548n918m117
1731f049k57J730J260j267k449O67O084O589J055k952j031K763K308j905n045
1746A501n234k386J226K174j089l609m57N424O048J154k471j259J562K277N70
1761E431k860m862k408K530L856m83l827j064L659M056K61k985l401j102J786
1776a413J880j661m344j410M456N535J277k028n03K363K948O02l175n535l710
1791d718O81J882j627m624j252M385N757K717j83m94J240K986K048k219o024m271
1807c716Q03K214j228l908j405K885M637K998q7k109j012K463K548j785n590l408
$$ y = [2686, 5407, 3036, -2138, -5149, -4260, -1197, 1162, 160, -3047, -3500, 961, 5370, 4021, -1326, -3788, -1658, 983, 711, -1931, -4279, -3652, 935, 5678, 5720, 1807, 374, 3694, 6534, 3986, -1932, -6049, -6306, -4576, -3316, -4583, -7032, -6365, -281, 6308, 7363, 4411, 3380, 6143, 8451, 6546, 1501, -3733, -6119, -4893, -2719, -3808, -7417, -7874, -2450, 3598, 4752, 2281, 1022, 2584, 4861, 5431, 2571, -2291, -4699, -2169, 1687, 1204, -2623, -3687, -28, 4028, 4289, 1304, -2097, -3199, -1413, 467, -1194, -5538, -6948, -2492, 3043, 4320, 2292, 1789, 4152, 7100, 7702, 4527, -1008, -4718, -4037, -2155, -3782, -8406, -9658, -5273, 484, 3201, 3018, 2524, 3764, 6750, 8798, 6579, 555, -3716, -2913, -699, -1927, -5835, -7240, -4355, 282, 3280, 3193, 1084, 72, 2535, 5083, 3298, -2292, -5700]
1823e700J805L408O75j579r47J790L984L407m82m337l250R04J956k064n088k910
1839h428J606L863K859P20p07R04M032M122n49n002l979J47J235j681m017k863
1855g738N72L606L944J283j738m46L502L855o72m579l691J04J671K80j842k420
1871d309q8L623M525Q48k932k088J743K428j025m158l668n46K040K533L37j732
1887b469l8M126N021R10l245k816J28J078j026l579m150j712K102L619J317j736
1903b470r8M006M723J119k601l020q08P66K36k327m152k117K151M120J259j762
1919i75q90K484L461J086k083l328j799R81J861o83l269j685K591M418J452j656
1935A966j641N26J962R03k047m069k696J132K765M12k265q74K762M326K161r82
$$ y = [-5700, -3895, -487, 188, -1391, -2338, -548, 3436, 6843, 6361, 2024, -1226, -322, 1634, -430, -5518, -8428, -6822, -2959, -100, 620, -87, 817, 4849, 8971, 8422, 3420, -559, -412, 823, -858, -4875, -7738, -7166, -3560, 384, 1667, -71, -517, 2985, 6840, 6168, 1589, -2102, -1998, -327, -47, -1889, -4309, -4397, -774, 3751, 4599, 1667, -421, 1322, 3750, 2725, -1433, -5101, -5647, -3607, -1074, -737, -2469, -2507, 1619, 6640, 7550, 4305, 1489, 1617, 2695, 1669, -1910, -6060, -7772, -5670, -2051, -734, -2470, -2568, 1438, 6161, 7280, 4679, 1659, 851, 1617, 1853, -474, -4626, -6743, -4592, -472, 787, -975, -1865, 619, 4080, 5166, 3083, -245, -2044, -1063, 798, 115, -3154, -4839, -2248, 2170, 3622, 1966, 325, 851, 2813, 3716, 1669, -2400, -5096, -3964, -1199, -787, -3052, -3926, -1164, 3162, 5323, 4341]
1951D341k068r53J083J169j642m443l205R64K881R44j521r90J851L521K737k65
1967D404k511j785J001J973p93l798k846Q67K857J332j069j620K79K529K555k53
1983C122l136k324R39K574K41k565j967J037K930K314l45k118j137J514K185o77
1999B587l646l091L22K154P77j259j476O60L154L415R07j800j476J312K231m43
2015D328l596l445q48J214P56j155k106l43K623L897J509j374j061J660K761O99
2031E519k222l053j330Q41J022j087l044j886J393L013J115j511j398J202K945
2046A519J933m61k081r74J415K209r1k760k387M70J941M56k165k569n33J686J968
2063d24j42j765r04K161L558J536j272j402O66K124Q39j890l397k316J33J109
$$ y = [4341, 2273, 1320, 2403, 3572, 1930, -2513, -5718, -4754, -1873, -929, -2450, -3440, -1589, 1932, 4669, 4404, 1893, 108, 1109, 3082, 2289, -1509, -4355, -3488, -631, 701, -368, -1988, -1709, 820, 3375, 3122, -14, -2338, -1399, 1175, 1416, -1149, -3116, -2079, 851, 3165, 2820, 702, -435, 1079, 3264, 2587, -1059, -4150, -3828, -1674, -897, -2156, -3632, -2972, 182, 3597, 4504, 2704, 1228, 2540, 4771, 4328, 732, -2713, -3561, -2347, -1591, -2746, -4852, -5195, -2572, 1325, 2834, 1460, 399, 2059, 4820, 5519, 3297, 244, -1086, -245, 777, -310, -3354, -5240, -3847, -834, 281, -1230, -2628, -1426, 1519, 3452, 2991, 910, -64, 1351, 3560, 3469, 709, -1678, -1208, 733, 1189, -976, -3545, -4078, -2392, -424, -566, -2331, -3235, -1074, 2484, 4020, 2748, 1346, 2012, 4136, 4975, 3085, -312, -2628, -2495, -1386]
2079a386o21k683j820J487L521K422N9n54J128K804K192n48k919k632l43Q07q59
2096E5l178k807J20K404K153J56p77N30K703L059O31k131k175J07J451J8k459
2113a40k683n38J663J926O5j688q53J476K549O34j985k276p0J899J334q63j737
2130a287l82J999K662M90j862j889K27J465J32k414k832p22J662K011L61r63j53
2147a495K323L142J092j629k441n97P87Jk191k929j139J505K607J232o25k88J804
2164A159K866J087j657k883j570L86K99j321k369j139J676L201K068k76n29R93
2180A991K289Q83j738l266k228o0P31o05j956j028J549L370K324m8r39K33J665
2197C167J027j409k962k209P7J366M42j247j022J057K795J933l83j909j108N63
$$ y = [-1386, -2007, -4690, -6510, -5023, -1502, 920, 979, 425, 1553, 4357, 6549, 6001, 3082, 450, 107, 914, 55, -3123, -5930, -5810, -3406, -1253, -1097, -1874, -1344, 1359, 4418, 5049, 2918, 743, 850, 2301, 2319, -140, -2823, -3361, -1698, 228, 293, -1395, -2248, -772, 1777, 2411, 426, -1850, -1920, -21, 1313, 450, -1287, -1669, 330, 2992, 3482, 1620, -269, -42, 1423, 1555, -859, -3691, -4413, -2751, -740, -379, -1342, -1495, 828, 3970, 5062, 3433, 992, 395, 1182, 1183, -1008, -3937, -5076, -3571, -964, 268, -357, -645, 1159, 4025, 5112, 3455, 572, -998, -612, -313, -1634, -4003, -5142, -3466, -265, 1803, 1527, 998, 1991, 4280, 5163, 3425, 159, -2069, -2129, -1398, -2003, -3959, -4987, -3438, -68, 2256, 2208, 1269, 1502, 3167, 4194, 2785, -177, -2386, -2309, -943, -501, -1748, -2770, -1713, 1082, 3015, 2632, 723, -385, 178]
2213A78Q25r04k489j790O28K466J958J16n91J054K350J688p65k814k495o96Q2
2230a199r49k415j862O61L016K794J123J4J014K237J960l83k792k887j229L4n48
2247a411k102j929K28K430K725J105l79l4J416J730p1k210k588q10R37Q43o88
2264h08j170J40K181K341O12j508j588k09N54l56k176k344m32J756K283R85j42
2281A19O38K129K367N51j818k585j569j74o13k036k378o77J737K691J655K91M48
2298G76J693K193P88j621k612j700j08J9j239j914o97J494K613J638j43n61O11
2315A230J541O36j481k580j569K91R81lj089m35J366K561J640m28j353n04N85
2332A389L88j305k419j615M99J575R10k39l19J123K251J570n51j857j281J00L36
$$ y = [178, 1003, 99, -2390, -4180, -3552, -1086, 872, 988, 397, 1451, 3801, 5489, 4724, 1910, -585, -1281, -1199, -2148, -4563, -6425, -5764, -2748, 46, 1169, 1183, 2197, 4434, 6394, 6011, 3219, 332, -897, -863, -1411, -3513, -5442, -5214, -2784, -59, 1046, 667, 633, 2049, 3779, 3708, 1498, -1090, -1900, -963, -120, -808, -1978, -1838, 343, 2684, 3296, 1788, 200, -9, 545, 189, -1987, -4331, -4763, -3007, -724, 261, 119, 757, 2886, 5253, 5804, 3986, 1401, -168, -342, -955, -2991, -5369, -6046, -4309, -1618, 37, 328, 776, 2469, 4662, 5450, 3829, 1217, -483, -591, -572, -1811, -3725, -4422, -2928, -315, 1323, 1180, 619, 1230, 2771, 3407, 1926, -654, -2223, -1932, -951, -954, -2043, -2478, -1112, 1449, 3089, 2661, 1308, 804, 1389, 1777, 472, -1947, -3562, -3063, -1488, -578, -817, -1136, -13, 2238, 3808, 3257, 1400, 119, 219, 555]
2349E55r37k039j378O08K022J695P7m57N21J841J192p00k213j831l76N47j71j313
2367b357j177P23K323K034M63o45m0J078Q64o69k212k208n73O59M66p78r46N37
2385b458K195K083O11q64o50N43Q60k77j856k030m41J034R61k26r87J06J559J696
2403A859L67j283j308m0Q53K51j202j519k35J469J565L29p55l57R36J294R8j371
2421I51j885o41O59M99o82j303j15J472J892P64n24o28N70J182L58j324j965q44
2439a564N73P91m09j209m93J061J737Q41n45r12J39J186P44p44j566p83O56R86
2457D89O2r90r13M09J396O92p44j305k80R88R62k39j027p09Q39J415N55q13j083
2476b96n0J094N84p82j549p80P01J027J86r27o70O49J604Q78l84j084j30Q43Q11
$$ y = [555, -382, -2421, -3799, -3191, -1169, 526, 603, 146, 667, 2508, 3700, 3000, 787, -1044, -1420, -873, -1044, -2357, -3534, -2811, -488, 1546, 2009, 1364, 1324, 2402, 3266, 2597, 385, -1823, -2396, -1737, -1271, -2049, -2995, -2458, -263, 1820, 2431, 1567, 917, 1460, 2320, 2043, 187, -1843, -2284, -1250, -289, -515, -1502, -1396, 163, 1859, 2226, 943, -365, -405, 448, 699, -503, -2022, -2257, -788, 777, 1106, 351, -6, 930, 2224, 2322, 951, -934, -1575, -916, -417, -1099, -2402, -2517, -1045, 847, 1611, 1087, 459, 1029, 2211, 2569, 1245, -720, -1564, -991, -200, -609, -1818, -2311, -1250, 487, 1328, 783, -129, 10, 1196, 1940, 1196, -370, -1153, -497, 489, 551, -439, -1352, -943, 453, 1145, 401, -904, -1184, -196, 766, 527, -500, -1209, -370, 1045, 1600, 787, -296, -346, 748, 1332, 550, -999, -1779, -1078, -51, 135, -792, -1462, -813, 791, 1669, 1285, 201, 71, 914, 1725]
2495A725n78j447j037K18R37K21r35r39J92J312J138j50q75j42J032J208R8j044
2513I34j010m1P66K47j089j562n24Q52R49j32p46j96J073J692Q08l94p22M8R40
2532A893M02r02j753j139J00N97k46j010n99O06J633J207Q4n07K61J091R26l93
2550B251j376j105OM76o1j070j107j5J036R83r7p97k54R76J144J62p45o08L30
2569A29J062O72n45j056m08N54N22o06j512r91J63P46L86l41l55O43J674J501
2587B238K05n68m24N18L61q05j811j589n71L84K93l79m81N68J743J760O15l00
2605A757k09L16M94l36j384j687o27M04N18k82o08J4J200J358M57o03o34j9N28
2624F57K20q47j149k84Q76J114M8n18k32O50Q62J07j019j244n00M01M43m50q53
$$ y = [1725, 1147, -300, -1337, -1119, -182, 39, -896, -1835, -1643, -331, 807, 657, -218, -360, 672, 1880, 1978, 934, -76, -117, 649, 896, -193, -1755, -2279, -1427, -478, -610, -1356, -1552, -479, 1213, 2021, 1627, 905, 953, 1893, 2295, 1393, -360, -1499, -1399, -802, -1048, -2058, -2657, -2051, -418, 789, 873, 366, 627, 1718, 2644, 2251, 875, -230, -224, 252, 191, -879, -1986, -2001, -965, 18, -79, -876, -1130, -154, 990, 1152, 407, -201, 129, 1191, 1863, 1318, 262, -146, 408, 930, 324, -1188, -2179, -2016, -1270, -884, -1225, -1580, -937, 737, 2238, 2443, 1875, 1451, 1969, 2330, 1525, -286, -1875, -2446, -2062, -1769, -2148, -2629, -2061, -318, 1442, 2057, 1757, 1548, 1864, 2358, 2022, 638, -1049, -1676, -1272, -754, -1036, -1644, -1630, -430, 928, 1385, 782, 148, 129, 657, 877, 30, -1119, -1403, -527, 587, 635, 117, -115, 535, 1397, 1504, 485, -759, -1259, -858, -415, -865, -1718]
2643a718MJ205J381P08l20m24K71N76J6j083j553q17K43N47j07n38J8J087J504
2662A000Q36j74n96j74L23P9r84j501q55L06Q19K87k19P3Q74J388P63l22r44o96
2682B83Q3j1q13j331p27M12J123R07R8K4N52J215P75m85j204r89k01O0l91j061
2702a681n87M96J258R56K57j84J38O80N55n21j329j068j69M11J32m07l11N08J313
2721D47J061J14n72m64J71K45m99j364j107m0P02O71J24j51N22J194J082Q7p82
2740A441q73k74N6m38j084r43j65Q84R50L88j23L44R11R34J19q37j117l51J46
2759c2j95o94p98j29Q42J028N24k78j13N63P07J2q56j036m47K50L15j42n68PQ58
2780a82J119L63k83n75QL20r8q78j014n18M13P01K90j28J17Q84J043M49m71q35
$$ y = [-1718, -1714, -509, 872, 1580, 1260, 836, 1107, 1683, 1699, 616, -937, -1754, -1511, -964, -1071, -1609, -1591, -504, 1000, 1836, 1662, 1066, 892, 1215, 1294, 310, -1191, -2046, -1740, -921, -634, -853, -780, 94, 1482, 2245, 1923, 979, 283, 366, 355, -458, -1789, -2516, -2104, -981, -74, 24, 48, 600, 1815, 2590, 2105, 901, -88, -289, -229, -620, -1681, -2268, -1772, -514, 442, 699, 515, 653, 1333, 1888, 1367, 38, -1030, -1199, -788, -656, -1063, -1374, -866, 447, 1508, 1622, 1050, 586, 757, 1002, 503, -861, -1968, -2008, -1306, -635, -511, -662, -140, 1054, 2136, 2223, 1441, 568, 294, 350, -88, -1172, -2115, -2280, -1396, -446, -58, -181, 163, 1074, 2008, 2127, 1290, 173, -178, -32, -227, -921, -1719, -1848, -1006, 22, 546, 268, 155, 718, 1425, 1437, 581, -455, -902, -652, -337, -479, -1047, -1040, -182, 937, 1300, 1017, 442, 450, 770, 672, -206, -1220, -1738, -1325, -624, -334, -462, -345, 539, 1582, 2031, 1560, 725]
2800G25m32K7j50q43j079m58M53R74M89R9J29O96J034N12m25r44n54j38J01n82
2820c66r56n51L67Q98N96n2j78L75P90M62k34q15n70P2M05j13n71n09L35Q04N19
2841G08k05n88j66L66L14k98p86m17K00O78M96j93k33K90P22N20j68p62o09qJ44
2862El27p06o21J62Q03O25J61q6J77P84O32p7o68o68j47J29j96o88o96j6N82N43
2884b93K17k69J22N75O73J69n56n98n1L57Q6m95n78j66M24N02J18m29k73L40M56
2905C31J56m38n17k2M99L43j17l44k00M43N31J4l78n07KM04P5m19n24j57M30M74
2927G9Q6k85l11L93O49K30l46m95q0L28K70l14o08l13K13N40J09l56l30J39O35
2948B33L36j98m06j31K99L81j00m51l66O8M97J55l28m68M4M70L15r5l95k71K55
$$ y = [725, 293, 320, 170, -673, -1752, -2210, -1757, -783, -294, -195, -66, 630, 1664, 2176, 1751, 807, 253, 115, 216, -366, -1322, -1873, -1506, -608, -12, -64, -242, 133, 923, 1385, 1151, 336, -234, -162, 243, 130, -441, -950, -615, 189, 708, 503, -85, -251, 115, 429, 131, -655, -1072, -872, -194, 302, 109, -124, 166, 888, 1408, 1240, 478, -131, -139, 5, -322, -1028, -1649, -1487, -684, -59, 102, 16, 193, 977, 1609, 1532, 864, 196, 49, 178, -18, -706, -1402, -1418, -836, -293, -76, -345, -223, 352, 1025, 1194, 638, 40, -11, 346, 432, -63, -641, -807, -383, 119, 237, -192, -465, -125, 331, 487, 49, -468, -490, 9, 352, 235, -109, -309, 134, 665, 679, 301, -206, -204, 200, 275, -144, -668, -825, -395, 79, 165, -120, -431, -38, 611, 841, 495, 0, -80, 248, 518, 204, -404, -717, -504, 36, 145, -211, -541, -402, 233, 569, 371, -35, -166, 133, 514, 414, -37, -403, -335, 162, 317, -11, -479, -435, 35, 350, 255, -140, -411, -156]
2969a56M66O5l97m00Q4N44K21k78l42j01L79M22j18m70l20M4L98J73l15m19pN18
2991iL55o8j93j38K08M92R8m95n10q3K96O9l05l96q8M20M53K40k23j36L03N00
3013G90J29m63n92j76K21nk23l78j70L05N24L80j34k81K36N59J41k85n13k45R0
3034i0J08m3l53l15J49O31K77k49l44J06L99J78k52k77k88J27L85K52k50l57J61
3055d5N03J56l04m66k18P6R7l7k41k56K05O00M60j21j51J31L96Q4l02m82m50k30
3077e95K26j0k99l09J59P21N05j8n8J96K56J64j19m58n65k34J78J32l93l80J28
3098g73M97M14J2r0j9J69K97J48l90m83j66M52J91k35l46P4L05K20K8k06l08k10
3120d19K80J99l07m44J07N41L33K2k7O2P0K46O7l90n68k68J99R2l96l47J78M40
$$ y = [-156, 310, 375, -22, -422, -338, 206, 427, 149, -193, -294, 85, 507, 389, -81, -401, -357, 41, 214, -101, -520, -527, -9, 346, 278, 85, -53, 155, 647, 745, 250, -260, -343, -47, 22, -283, -679, -767, -347, 106, 346, 123, -13, 290, 790, 919, 456, -136, -312, -91, -96, -319, -697, -867, -562, -38, 342, 208, -73, 163, 722, 863, 578, 65, -180, -90, 18, -25, -378, -693, -544, 87, 364, 115, -229, -123, 276, 454, 202, -75, -363, -236, 149, 401, 151, -206, -45, 458, 614, 310, -156, -374, -298, -201, -238, -479, -735, -530, 70, 530, 409, 258, 389, 785, 869, 567, 85, -365, -595, -369, -379, -678, -987, -828, -107, 398, 380, 322, 518, 774, 938, 819, 361, -204, -438, -260, -128, -521, -901, -773, -276, 138, 150, 60, 41, 210, 507, 655, 265, -218, -384, 68, 259, 24, -322, -248, 57, 277, 305, 99, -209, -419, -139, 60, -247, -691, -584, -43, 290, 312, 285, 347, 417, 663, 730, 340, -228, -496, -297, -205, -601, -948, -770, -330]
3142c30L77K76J64j21LL30K23m40o98j58K11qk37j88R3J44L52K30O5l03o3L43
3164B65K44l96m44J8K55J72J3oj27P3K85K65k46n90k18L04P3l63k28P4J35L14
3186a28L52J47j40l5M03K59l58m75j54O8m6j99o8j33k9K77M00O3l60M0M66J54
3208E04k34k42j09Q0L8J16j4k69j17L61L51k48m63qK24qj85k2p9q2K87M55Q4l38
3232H2L9M89K04m00l54j25r1j43n4n3k61j31M60M73K4k25J10M51J02j10j33j18
3254B36k12m0J86m7n12j66M25K63k48k54Q2J87N3L9J09j89p4K79M33j06l61j8
3276F5K67J27k70l06j06k46m0K21N5l63o4N43M90r0n1J44J76O6j26p7l70m02N1
3299c06K19j33m48o0M96K77q9J00K6O2P4K58ql53k11J86L70l07l40jK22j52r9
$$ y = [-330, 47, 323, 487, 366, 369, 699, 922, 482, -216, -374, -163, -171, -408, -596, -503, -359, -7, 223, 288, -15, -78, 265, 509, 113, -331, -313, -58, 114, 127, 121, -6, 67, 352, 617, 371, -219, -437, -133, -60, -423, -651, -577, -442, -128, 224, 371, 231, 196, 599, 858, 500, 25, -129, -61, -107, -306, -374, -507, -536, -259, 141, 204, -156, -116, 350, 504, 270, 28, -81, -1, 37, 153, 139, -130, -247, 114, 465, 217, -246, -254, -30, -38, -223, -245, -324, -406, -119, 336, 420, 82, 121, 610, 814, 414, 60, -65, -156, -299, -353, -406, -667, -798, -338, 135, 159, -66, 44, 495, 597, 487, 354, 236, 24, -16, 170, 123, -389, -555, -130, 133, -115, -369, -287, -100, -47, -8, 101, -88, -162, 117, 550, 444, 83, 65, 332, 459, 189, -117, -223, -469, -509, -288, -233, -596, -660, -117, 373, 283, 232, 376, 552, 618, 492, 415, 45, -357, -306, -87, -220, -668, -728, -232, 45, -44, 56, 82, 144, 218, 476, 468, 115, -96, 90, 460, 153, -187, -188, 34, -118, -217]
3322b17J08j49k48K03L75j3k99K2M50K59j57LK5r4j32J35r9m65l24J83L53j28
3344b09l40J72L72K00K5J93J9k73J05J91m9n70k81K34J66k24j55J78P1JJ61L22
3366C09k15k48K03L53j16m00J3J59O4p9KO3k38L3K37ll30k37L48J30m3k29J81
3389d3J34J9J26J55j56k94P8L49j83m74j31K74L6j33Q0J06m7P3K92J35k82k26
3411a12K42J59j48l68P4K5k2R3R0mk96J76L77m1k57j43J78J87j81m6N9k56P4K90
3435A50J67l15j91K22J96j18k42n9P5Ln0J25%j86J09M01L8l26m5J43P4j34j32
3458i5L1q6m7R9K38k17j73K68K73l5k60rN9J7n3J21n7k20j2L49l8k37j05J31J78
3483A20j05k3k4m9j1J84J18j21k03J61K11n8k79r1J40%j08J29m8j81R4K72J70
$$ y = [-217, -109, -258, -506, -303, 72, 59, -240, -218, 232, 491, 334, 337, 362, 268, 136, 271, 172, -293, -617, -434, -81, -209, -549, -377, -5, 195, 220, 413, 432, 159, 264, 455, 406, -164, -445, -211, -45, -269, -424, -246, -175, -174, -13, 309, 94, -154, 49, 402, 286, -114, -101, 58, 122, 43, 45, 108, -130, -97, 140, 137, -193, -430, -82, 48, 5, -224, -43, 91, 110, 236, 391, 235, -59, 19, 368, 185, -289, -420, -146, -110, -243, -163, -57, -104, -31, 261, 396, 114, -112, 130, 289, 141, -227, -153, -128, -150, -57, 33, 29, -267, -91, 286, 245, -12, -155, 23, 210, 29, -17, 42, -214, -140, 150, 317, 2, -189, 33, 229, 111, -131, -190, -115, -112, -162, -37, -37, -223, -114, 287, 325, -1, -46, 97, 171, 37, -95, -64, -150, -197, -98, 140, -77, -250, 18, 291, 256, -4, -13, 46, 63, 10, 131, 74, -146, -158, 191, 153, -84, -189, -58, 120, 15, -8, -32, -81, -92, 92, 210, 89, -114, 47, 258, 200, -79, -170, -30, -30, -138, -9, -57, -238, -144, 128, 298]
3506B98l00l0J20J59j16j72NRj19R1J41j66j04P6K61J9k37l2O9J12o0j2k3n4J3
3531e2J85J37k89q6J36Q7o7j74o2J0pP6J49q5j07O6L86M2j72q2O5M9j91k0j24
3556a30j33n9J31J81j11n8K23K68J0r9m7jj06m4k1j85j70P1J90R2j66j5K42J36
3580A99K1p6j8j54o3L5J18k34r9R4J85O8J6Q1L1j01LNj29k75n1J17J28p7j5K17
3606B6K25O7K6j7j08n5o4kl02k28n0J65J12k6J06J76J64R5J33o6j90j55P3k3k90
3631b08j42P0Q7O9P7J05Q1jJ24K8j25k22j34J03q0j01j1J18J53P8J83Q0n4m9J5
3656B44p0j82k86r1L7o8J2J25J05J73K21K47J7j68J0k9o7k92k04o6o4J9M5J59
3680a73K7J89J98J55k2j77m2l3q0j30j64j4m6K20P6J41j7P4P7rn1k51r7j48k8
$$ y = [298, -2, -32, 88, 247, 131, -41, -36, -27, -146, -55, 86, -80, -184, -108, 153, 172, -65, -97, -28, 84, 24, 12, -11, -65, -52, 133, 270, -19, -105, 31, 118, 51, -123, -185, -175, -182, -106, 43, -42, -149, -83, 303, 345, 173, 91, 156, 205, 14, -6, -130, -263, -322, -191, -10, -121, -179, 44, 312, 322, 223, 176, 175, 69, 25, 4, -181, -351, -280, -90, 2, -164, -179, 63, 199, 220, 144, 126, -28, -91, -56, 62, -172, -271, -177, 8, 76, 92, 173, 204, 103, 106, 111, -18, -293, -344, -227, -99, -176, -191, 26, 251, 318, 344, 327, 219, 164, 100, 98, -204, -432, -482, -317, -205, -231, -125, 51, 215, 310, 443, 377, 187, 32, 105, 82, -208, -350, -280, -193, -124, -47, 58, 139, 138, 262, 290, 165, -57, -191, -88, -168, -269, -280, -162, -9, 69, 252, 332, 278, 229, 244, 174, -8, -294, -385, -348, -416, -404, -279, -174, -1, 220, 467, 484, 316, 326, 297, 230, -62, -266, -332, -396, -377, -332, -173, -146, 43, 241, 396, 374, 197, 155, 122, 42, -88, -252, -266, -312, -92, -16, 125, 108, 182, 259, 250, 199, -52, -149, -297, -325]
3705c25j7k0L3J86K78J79M9K1O3K6j58j87k76k09p9p2Q1O9rK31L01K71R2o4j7
3730D47r7n9k24j92k10j32O7O0M5J29R9K04J75l9p7K4j60j12n7j01q3O2P1J71
3754A1L8R3N6R5P0j17j03k36j34k5n2p4pL8K34J93J68J15j7O0J8j83r6k69j83
3779c07q4j0O0k7J46K03K14J23P3j3r5o0n0j81k13j28o0J14J09K1J20J91J18j5
3803B49K9n7r2n1j18j47j34kJ03N7J76P7Q8J26J6P6j08j75j60p7j30p8r0P2Q8
3828b62J81Q9J11J48O5rL9j53j57j29j08l4p2M4r3J63J24J81J14k7O6m1n7p4j00
3853Ij59o5nkK0N9J02Q0J74nj5n8l3n7j34m9o7j7R2M0Q9R0P5P9J3l0q4r1o1p2
3883h2j59m3m2J7J12J00R6J42R4R8j1L7j31j48j14j13m4o6k5j3J04P4J65L6R0
$$ y = [-325, -342, -362, -329, -143, 135, 314, 363, 384, 447, 473, 315, 128, -148, -357, -436, -508, -427, -358, -367, -136, 165, 436, 528, 464, 447, 350, 291, 67, -125, -335, -467, -400, -340, -295, -166, -67, 137, 312, 273, 196, 220, 60, -52, -109, -210, -293, -231, -160, 11, 49, 142, 198, 293, 363, 246, 143, -93, -227, -252, -304, -378, -385, -347, -113, 80, 248, 363, 346, 406, 424, 241, 145, -124, -307, -391, -401, -341, -368, -222, -19, 195, 318, 391, 378, 283, 223, 173, -8, -221, -349, -409, -295, -186, -165, -45, 146, 264, 249, 278, 221, 129, 78, -40, -187, -321, -323, -220, -163, 13, 90, 178, 304, 320, 396, 288, 113, -47, -124, -254, -332, -422, -350, -262, -81, 8, 119, 267, 332, 323, 362, 209, 52, -77, -185, -219, -291, -247, -340, -177, -53, 128, 242, 215, 281, 240, 183, 109, 9, -150, -215, -220, -222, -202, -143, -41, 39, 213, 208, 193, 135, 102, 45, -89, -138, -205, -222, -130, -90, -1, 89, 164, 243, 256, 226, 142, 51, -10, -82, -241, -284, -326, -309, -197, -97, -1, 141, 235, 333, 322, 359, 228, 80, -34, -147, -191, -257, -282, -295, -191, -117, 48, 84, 174]
3908A74J04j9Oo4j50p4r6o5jl6r1J05O9J86K7O4kL3k6p2m4j37J6N9j4l3N4Q5J8
3937G6M5P1j36m1J8o5m4r9o3R5N9R1N8O6O0N6JL6j38j17o1j17j09k4j10Q7O1J93
3965e1Q4J27P4L8K6M1o0j78o6j45j23r5j3M2L7J68J00M4R6P6O2Pl2p3j62l6n1
3992f3n1n6m8N8J29L0K5m3O4oOnj35J4J2kP3Mk0P1R9Om3m8m0j24n1n5k9K6N0O2
4024i0J13M6J28Q2J9Q2j08j33r1j86k5j12o7n0M3N7K25J43J50N4R9N5p4r2j85
4049H3j09q4j27n8o4j1J83L2J67O8P1P3O3j2p0r8j11k9p2nk7M7j5N6L4L1qk6M5
4078B7M1j14l8k0P8Q7k3J10l7L4K1P0j39j05j42n0j6r1m1MJ02J69J90P3J41L3
4104C64K9Rj10j42j35j29j34j18j6K5N5J17J63R2J16N0O4P1p0j18j17k5j15m9
$$ y = [174, 278, 259, 265, 201, 51, -23, -119, -184, -185, -221, -312, -207, -138, 48, 75, 139, 137, 170, 144, 72, 28, -109, -93, -34, -48, -81, -27, 58, 76, 121, 192, 56, 15, 33, -32, -76, -175, -238, -143, -84, 7, 65, 131, 191, 247, 248, 284, 146, 29, -32, -149, -258, -282, -392, -305, -244, -51, 33, 160, 234, 272, 298, 339, 279, 101, 35, -110, -233, -328, -341, -299, -262, -94, 6, 50, 146, 222, 284, 291, 259, 186, 24, -12, -63, -114, -170, -218, -160, -31, -1, 24, -19, 45, 39, 45, 40, -95, -81, -69, -71, 2, 6, -14, 57, 156, 162, 119, 71, 31, -93, -144, -199, -228, -202, -152, -90, 23, 69, 197, 279, 298, 380, 272, 139, 48, -138, -163, -275, -342, -392, -349, -292, -67, 76, 226, 280, 379, 434, 360, 268, 83, -26, -110, -237, -295, -359, -370, -187, -155, 12, 80, 151, 224, 287, 275, 205, 107, -4, -33, -105, -110, -137, -90, -105, -49, -15, 16, 8, -18, 27, 68, -46, -84, -104, -26, 61, 38, 148, 111, 145, 166, 236, 97, -8, -150, -200, -216, -307, -348, -344, -242, -73, 117, 190, 331, 364, 393, 402, 292, 150, 15, -114, -248, -366, -382, -357, -302, -185, -22, 70, 186, 236, 300, 371, 301, 183, 66, 41, -74, -123]
4128a23j04l4PJ28P8J2Q8J7K6k5L2r0J0m6M8n7L8q4R4O9j2Qj26N2k6l4j0n8m7
4157a69Q5lL7J72L6jP1m0Mo8j58k9n6j16L0p7J3J28Q5J43K8O0O4M8J5j57j10j03
4185f8m1q0k4p3L8J03Q7R5J01KJ07j8P1r4q6q1q9n8J0m3p4O4jQ6N0J3J4Q2rKN
4216I1j04N2m0o8Q4j2n2N2J4J1Kn6l9j0J3m8QN3O2K6N0O6k8O7k8n6p1m7p8m3m6
4247a75j1k4J7Q7L2J45L6Q9K7N8j4n4q1j01j31m7j35Noj3J17J03Q8L8Q3J38m5
4274B26rMr6l1j33o1Rj21KlR7N4M7P9oP4j3L6q8M2m4Kj0r8J9j0K8m8k6l5K7j4
4306a00j0L9j1K5j4J13R0o4J07PJ3Jj11o2p5r5kj13m9O6M5J11N0Q4J25J15Q7k6
4334C46l6j07j38j14j13m2j41l8N8J13J12J8J80N6J38pn4m2p8o2j09j59jj4LN8
$$ y = [-123, -227, -261, -254, -126, -48, -36, 52, 69, 95, 70, 102, 12, 22, -24, 24, -33, 5, -79, 15, 84, 72, 80, -46, 6, -20, -54, -64, -122, -169, -84, -87, -50, 122, 158, 157, 228, 188, 192, 124, -34, -63, -119, -235, -205, -282, -269, -141, -56, 87, 115, 175, 239, 287, 302, 145, 35, -68, -109, -189, -213, -286, -248, -145, -58, 37, 138, 140, 247, 229, 300, 206, 120, 39, -50, -108, -98, -141, -215, -151, -152, -66, -16, -3, 11, 93, 84, 86, 91, -13, 39, -1, -69, 15, 3, -49, 3, 17, 28, 30, -26, -65, -75, -62, -110, -102, -49, 13, 39, 89, 155, 127, 194, 166, 110, 39, -8, -86, -129, -175, -186, -210, -193, -106, -74, 71, 107, 196, 223, 281, 267, 213, 132, 31, -100, -147, -282, -277, -283, -296, -179, -76, 12, 50, 133, 271, 226, 217, 221, 125, 94, -39, -100, -91, -212, -210, -213, -116, -62, -15, 64, 58, 132, 119, 155, 67, 109, 65, 67, 57, -41, -22, -32, -4, -52, -78, -113, -86, -100, -110, -71, -82, -57, -71, 42, 132, 68, 175, 182, 195, 196, 85, 23, -52, -147, -149, -262, -311, -245, -200, -89, -39, 45, 170, 285, 372, 346, 310, 203, 65, -49, -162, -204, -345, -383, -325, -212, -100, -82, 98, 154, 292, 285, 231, 189, 111, 49, -60, -219, -220, -234, -231, -173]
4360a73P1N8J44M0K6J2m4q8j6L0o8Rn9J6J6J28%k6pj9o1n0n4q4k3MR9L0J76M4
4390A31L5O9O7l5j19j06p3p8j98m0Ok8J35J13J37J29J39K7R3K7j80j36k9j67r1
4415a72j46q0Q2Q6Q0J68K2O1P5K6K9j08p6o0n2m0J2n5N6P7N3L3K6k6j0o0n2m1
4443i2q8k2K0M6Q3R7R4Q9O0N8k3j75j09m3p5j54j23n4L1J66J09J20J50R9J84k0
4469D28n9r1j48j27j56j75l1l8lJ21J67R4J60O6N9M2j4j00j06k5j23q5k6N6kP9
4495c7J13j7J0m6N0j2q0j10NK4K7R0l8J04Q6L3N2m7n2j60q8j23q6m7m5M2J68J05
4523g9J67R9J84P5m1m5n8k15j49q6j91r1j7L7Q7J56K10J09J06J67M7k3j79r2j15
4548F3j21j44p9l4l7Q7R0P2Q6N0J25M4l2Mo2q1J8o2j9M6l9P7ml6o6l1O3r1k0J8
$$ y = [-173, -102, -44, 100, 140, 166, 178, 134, 46, 30, 60, -8, 1, -58, -42, -26, 102, 102, 76, 69, 50, -11, -61, -115, -199, -222, -218, -119, -89, 87, 131, 166, 235, 302, 267, 148, 42, -31, -109, -307, -347, -341, -369, -234, -121, 16, 145, 284, 311, 404, 431, 251, 115, 86, -81, -172, -318, -398, -316, -230, -150, 18, 40, 101, 176, 202, 231, 123, 47, -13, -65, -105, -93, -148, -92, -15, 38, 71, 97, 71, 61, 1, -51, -92, -180, -202, -182, -136, -53, 44, 138, 227, 287, 345, 322, 147, 38, -5, -80, -234, -357, -411, -380, -214, -105, 15, 165, 264, 448, 428, 369, 278, 130, 3, -153, -328, -359, -397, -400, -279, -112, -18, 142, 208, 267, 309, 295, 195, 89, 64, -59, -144, -170, -114, -116, -37, 76, 59, 69, 23, 73, 61, -19, -129, -124, -100, -73, 17, -21, 83, 169, 202, 254, 207, 155, -5, -93, -216, -302, -349, -394, -352, -184, -79, 88, 187, 371, 446, 405, 360, 302, 87, -62, -148, -339, -430, -447, -410, -323, -167, 43, 152, 258, 425, 472, 449, 270, 178, 63, -58, -202, -281, -315, -352, -265, -175, -103, -17, 33, 158, 202, 170, 174, 112, 31, 49, -13, -32, 14, -25, 52, 48, 12, -54, -85, -22, -113, -133, -115]
4578a15m6Q3P8J07M0O4N6N7M5j09j29j57j04j05j59k1L4O0J23J77O7J76R3O9P4
4603D58o8r7j26j98j27j55p9m3O3K5K30M0J44J45R3nRj9p2k14On8j82rO4K8J25
4630b2p4P8L5P7n8P3K0m7q1M6J0J8n3JN9l8n4J5j38m2rpL8m6Q3P9J51N1NR3Rp1
4662B01n2n8q0j31l5k9r6L2L6R8O1O6J19Q6kQK2L5j81j11J6r5k4j19N2%K2O2J46
4691D9q2J6O1R2k1pj9Pm7p3N3k0rk8k5qm1o7Q3L7l2K0OJ05nM0PN1m1Lql3j21J5
4725d2l4l5j5o5O6k8mJ52M1%K1R8L1r5m4M2k4r5J7k0p0p5j3R9j4n1N7J26Q5k1
4755I0K7M5j0K3k0Kj32q1kk6q7o8J06PP9J5Q9K3N7j6NL1n2o0Jk0r8k2qm0pM2J20
4788A3p5lM3J01L5j7j9M2l1j9N6p5l9q5J07p4p2n9J10q3K3rJ12L9N1P9Q0j9r5
$$ y = [-115, -161, -78, 0, 107, 147, 211, 267, 324, 369, 260, 131, -26, -130, -235, -394, -415, -381, -321, -198, -21, 46, 222, 315, 384, 458, 390, 293, 167, -31, -158, -313, -392, -435, -372, -347, -117, -77, 67, 212, 305, 300, 309, 290, 218, 4, 10, -48, -230, -239, -175, -147, -22, -96, -18, 17, 94, 36, 109, 129, 82, 1, 47, 57, 75, 22, 23, 82, 44, -10, 5, -133, -175, -184, -191, -153, -199, -116, -37, 114, 165, 170, 263, 272, 201, 149, 91, 11, -120, -155, -184, -280, -248, -212, -114, -53, 13, 132, 218, 216, 224, 246, 281, 100, -11, 5, -90, -114, -233, -181, -181, -159, -97, 49, -33, -17, 44, 136, 115, 108, 89, 96, 49, -24, 29, 9, 0, -28, -53, -61, -102, -169, -86, -49, -81, -61, -55, 50, 45, 85, 92, 143, 102, 105, 97, 64, -57, -42, -76, -111, -126, -191, -125, -153, -157, -5, 36, 36, 57, 155, 186, 91, 47, 89, 65, -30, -13, -33, -103, -178, -191, -92, -106, -157, -100, 26, 111, 90, 117, 162, 152, 175, 155, 157, 25, -56, -58, -84, -171, -239, -133, -126, -47, -32, 57, 80, 137, 121, 126, 157, 105, 45, 46, 26, -72, -94, -102, -142, -149, -107, 13, -62, -65, -22, 79, 114, 97, 78, 120, 89, 70, 126, 51, 12, -73, 34, -40, -112, -171, -61, -144, -121, -130, -18, 21, 72, 151, 231, 212, 117]
4817A17P0k4r9j76m0k5n8q6P9J42m3Q1K40N1n1R1Lj0o8j48p5j15p3o0K5N7l5J60
4845g0J38LJ5R0L6j5j56L5l7q6m8R4mq9pK4M5m5M2j7J7%K2M6o0j8Q4J25M0j21
4875H3J2P3j15p1o4m9j31j0M9N0M5P4J39J39K7MN3K4j40j18Rk29j47JPl0P8M9
4903a88J51J42R6M7M7r6l2n7k5j52r1J9L0q0J9Q8J01n5J00O9j6l2j10M8j6p8K3
4930d8J11l9J6R4k3L4l2j4o5j46q2RL1q5K6J81R1P9O1J11K1n5j19j0j04k21p5
4957b53j9K8n5pK35Q9N8R4J55j4j14K8J7j76j04j31J6l4n3J06P2j1M4J49J7mn8
4984G5L5l3o2o5K5m0lR4J36j06r6O7N8o3j60N4k6j3OO0N3K9R2J02P3o8o1K0j06
5013G7j67j09nk8o0J7J66M0N5J63J76j3o0k4J5j07k51Kj21q0o8J07J06j8J53J57
$$ y = [117, 187, 163, 64, -112, -152, -177, -235, -321, -242, -100, -143, -62, 178, 229, 178, 269, 272, 262, 194, 46, -29, -144, -217, -277, -252, -195, -230, -70, 68, 71, 86, 176, 212, 197, 41, 76, 39, -47, -95, -1, -5, -94, -101, -77, -32, -77, -35, -52, -35, -35, -13, 33, -27, -45, 39, 164, 204, 83, 95, 168, 53, -18, -82, -131, -262, -272, -223, -173, -128, -54, 85, 224, 251, 255, 308, 332, 192, 74, 83, -146, -293, -292, -285, -315, -237, -188, -37, 105, 201, 248, 295, 199, 167, 110, 85, -67, -158, -139, -109, -189, -170, -82, 19, -36, 64, 133, 117, 85, -25, 23, 7, -71, -48, 63, 24, 40, 134, 111, 145, 113, 99, 34, -112, -194, -185, -154, -239, -213, -32, 59, 138, 199, 310, 331, 276, 157, 147, 43, -178, -253, -272, -244, -299, -306, -71, 18, 76, 170, 325, 311, 197, 225, 242, 66, -38, -169, -153, -187, -240, -134, -62, -73, -29, 120, 137, 133, 75, 110, 77, 15, -50, -25, -65, -68, 26, 162, 56, -40, 27, 85, 22, -138, -84, -110, -123, -117, -57, -4, 25, 117, 219, 292, 224, 163, 183, 77, -90, -199, -204, -232, -292, -275, -109, -69, -14, 149, 325, 312, 252, 228, 243, 136, -115, -113, -234, -314, -382, -275, -169, -187, -34, 123]
5039A23J10Lo1N9J3j35p9p4o1r3K7K5L3k0j5K32m0l0L0J14j07r1N7P4l6q2O8R2
5067A36q8k7r5Q6j07n0j0M5p0O9R0O6J6M8K04l5m4k2n2j24j22j18l9p8n0J17J22
5094a32R7N9J28J29L9OJ6o1r6j44j35r0r9m5K8P9rP9K10O0O2M4N1n6q5qn8n6j06
5123i3r8J21o2p3R0L5j1O5N8O7n5mM5Q8n5j7Pl5K2r4l4n8k7n1K6o7M8%J40KJ18
$$ y = [123, 233, 236, 175, 234, 247, 112, 33, -41, -102, -195, -168, -143, -110, -130, -145, 87, 47, 17, 47, 161, 54, -37, 20, 94, 58, -24, 44, 136, 48, 21, -74, 12, -95, -145, -155, -110, -180, -111, -21, 45, 61, 109, 313, 278, 234, 212, 160, 36, -86, -204, -243, -321, -371, -254, -132, -35, 24, 152, 281, 320, 326, 342, 281, 185, 41, -94, -184, -283, -328, -300, -221, -230, -151, 59, 119, 181, 225, 276, 220, 135, 127, 69, 13, -93, -191, -70, -132, -205, -115, -80, -91, -26, 32, 99, 44, 40, 85, 173, 118, 101, 108, 73, 95, 1, -33, -91, -118, -169, -143, -210, -162, -162, -22, -20, 98]
$$ [...]
8191a6
##END NTUPLES=NMR FID
##END=
