##TITLE=1H_AM_NV54.1
 CDCl3
 8 sc, 
 7.9.2023
##JCAMPDX= 6.0         $$ Bruker NMR JCAMP-DX V2.0
##DATA TYPE= NMR FID
##DATA CLASS= NTUPLES
##ORIGIN= UXNMR, Bruker Analytische Messtechnik GmbH
##OWNER= root
$$ XWIN-NMR		Version 3.5
$$ Thu Sep  7 14:20:25 2023 Russian Standard Time (UT+4h)  she@DPX200
##.OBSERVE FREQUENCY= 200.13135
##.OBSERVE NUCLEUS= ^1H
##.DELAY= (6, 6)
##.ACQUISITION MODE= SIMULTANEOUS
##.ACQUISITION SCHEME= undefined
##.AVERAGES= 8
##.DIGITISER RES= 18
##SPECTROMETER/DATA SYSTEM= spect
##.PULSE SEQUENCE= zg30
##.SOLVENT NAME= CDCl3
##.SHIFT REFERENCE= (INTERNAL, CDCl3, 0, 15.7039)
##AUDIT TRAIL= $$ (NUMBER, WHEN, WHO, WHERE, WHAT)
$$ ##TITLE= Audit trail, XWIN-NMR		Version 3.5
$$ ##JCAMPDX= 5.01
$$ ##ORIGIN= Bruker BioSpin GmbH
$$ ##OWNER= she
$$ F:/spectra/data/she/nmr/H-F/1/audita.txt
$$ ##AUDIT TRAIL=  $$ (NUMBER, WHEN, WHO, WHERE, WHAT)
(   1,<2023-09-07 14:19:06.92 +0400>,<she>,<DPX200>,
      <created by zg, POWCHK disabled, PULCHK disabled
       configuration hash MD5:
       00 E9 B6 7A A2 85 ED C7 34 08 36 98 17 FE 4E 26
       data hash MD5: 16K
       C2 D0 4E CD B7 63 C9 67 66 2B C0 6C F4 E9 C2 F3>)
$$ ##END=
$$ 
$$ hash MD5
$$ D9 ED 7A 26 44 FA 22 9F AB 8C 65 13 FC 9B 19 86
##$RELAX= 
##$RELAX= 
##$RELAX= 
##$RELAX= 
##$RELAX= 
##$RELAX= 
$$ Bruker specific parameters
$$ --------------------------
##$DU= <F:/spectra>
##$EXPNO= 1
##$NAME= <H-F>
##$PROCNO= 1
##$TYPE= <nmr>
##$USER= <she>
##$AMP= (0..31)
100 100 100 100 100 100 100 100 100 100 100 100 100 100 100 100 100 100 
100 100 100 100 100 100 100 100 100 100 100 100 100 100 
##$AQSEQ= 0
##$AQ_mod= 1
##$AUNM= <au_zg>
##$AUTOPOS= <>
##$BF1= 200.13
##$BF2= 200.13
##$BF3= 200.13
##$BF4= 200.13
##$BF5= 200.13
##$BF6= 200.13
##$BF7= 200.13
##$BF8= 200.13
##$BYTORDA= 1
##$CFDGTYP= 0
##$CFRGTYP= 5
##$CHEMSTR= <none>
##$CNST= (0..31)
1 1 145 1 1 1 1 1 1 1 1 1 1 1 1 1 1 1 1 1 1 1 1 1 1 1 1 1 1 1 1 1 
##$CPDPRG= <>
##$CPDPRG1= <>
##$CPDPRG2= <>
##$CPDPRG3= <>
##$CPDPRG4= <mlev>
##$CPDPRG5= <mlev>
##$CPDPRG6= <mlev>
##$CPDPRG7= <mlev>
##$CPDPRG8= <mlev>
##$CPDPRGB= <>
##$CPDPRGT= <>
##$D= (0..31)
0 1.2 0 0 0 0 0 0 0 0.06 0 0.03 0 0 0 0 0.0002 0 0 0 0 0 0 0 0 0 0 0 0 
0 0 0 
##$DATE= 1694081946
##$DBL= (0..7)
120 120 120 120 120 120 120 120 
##$DBP= (0..7)
150 150 150 150 150 150 150 150 
##$DBP07= 0
##$DBPNAM0= <>
##$DBPNAM1= <>
##$DBPNAM2= <>
##$DBPNAM3= <>
##$DBPNAM4= <>
##$DBPNAM5= <>
##$DBPNAM6= <>
##$DBPNAM7= <>
##$DBPOAL= (0..7)
0.5 0.5 0.5 0.5 0.5 0.5 0.5 0.5 
##$DBPOFFS= (0..7)
0 0 0 0 0 0 0 0 
##$DE= 6
##$DECBNUC= <off>
##$DECIM= 32
##$DECNUC= <off>
##$DECSTAT= 4
##$DIGMOD= 1
##$DIGTYP= 9
##$DL= (0..7)
0 120 120 120 120 120 120 120 
##$DP= (0..7)
150 150 150 150 150 150 150 150 
##$DP07= 0
##$DPNAME0= <>
##$DPNAME1= <>
##$DPNAME2= <>
##$DPNAME3= <>
##$DPNAME4= <>
##$DPNAME5= <>
##$DPNAME6= <>
##$DPNAME7= <>
##$DPOAL= (0..7)
0.5 0.5 0.5 0.5 0.5 0.5 0.5 0.5 
##$DPOFFS= (0..7)
0 0 0 0 0 0 0 0 
##$DQDMODE= 0
##$DR= 18
##$DS= 0
##$DSLIST= <SSSSSSSSSSSSSSS>
$$ [...]
##$SUBNAM1= <"">
##$SUBNAM2= <"">
##$SUBNAM3= <"">
##$SUBNAM4= <"">
##$SUBNAM5= <"">
##$SUBNAM6= <"">
##$SUBNAM7= <"">
##$SUBNAM8= <"">
##$SUBNAM9= <"">
##$SW= 18.05172834244
##$SWIBOX= (0..15)
0 0 2 0 0 0 0 0 0 0 0 0 0 0 0 0 
##$SW_h= 3612.71676300578
##$TD= 16384
##$TD0= 1
##$TE= 0
##$TE2= 300
##$TE3= 300
##$TEG= 300
##$TL= (0..7)
0 120 120 120 120 120 120 120 
##$TP= (0..7)
150 150 150 150 150 150 150 150 
##$TP07= 0
##$TPNAME0= <>
##$TPNAME1= <>
##$TPNAME2= <>
##$TPNAME3= <>
##$TPNAME4= <>
##$TPNAME5= <>
##$TPNAME6= <>
##$TPNAME7= <>
##$TPOAL= (0..7)
0.5 0.5 0.5 0.5 0.5 0.5 0.5 0.5 
##$TPOFFS= (0..7)
0 0 0 0 0 0 0 0 
##$TUNHIN= 0
##$TUNHOUT= 0
##$TUNXOUT= 0
##$USERA1= <user>
##$USERA2= <user>
##$USERA3= <user>
##$USERA4= <user>
##$USERA5= <user>
##$V9= 5
##$VALIST= <valist>
##$VCLIST= <CCCCCCCCCCCCCCC>
##$VD= 0
##$VDLIST= <DDDDDDDDDDDDDDD>
##$VPLIST= <PPPPPPPPPPPPPPP>
##$VTLIST= <TTTTTTTTTTTTTTT>
##$WBST= 1024
##$WBSW= 4
##$XGAIN= (0..3)
0 0 0 0 
##$XL= 0
##$YL= 0
##$YMAX_a= 44249
##$YMIN_a= -44170
##$ZGOPTNS= <>
##$ZL1= 120
##$ZL2= 120
##$ZL3= 120
##$ZL4= 120
##$ABSF1= 10
##$ABSF2= 0
##$ABSG= 5
##$ABSL= 3
##$ALPHA= 0
##$AQORDER= 0
##$ASSFAC= 0
##$ASSFACI= 0
##$ASSFACX= 0
##$ASSWID= 0
##$AUNMP= <proc_1d>
##$AZFE= 0.1
##$AZFW= 0.1
##$BCFW= 1
##$BC_mod= 2
##$BYTORDP= 1
##$COROFFS= 0
##$CY= 11.3945322036743
##$DATMOD= 1
##$DC= 2
##$DFILT= <>
##$DTYPP= 0
##$F1P= 15.7292609196834
##$F2P= 12.9074282941183
##$FCOR= 0.5
##$FTSIZE= 0
##$FT_mod= 4
##$GAMMA= 1
##$GB= 0.15
##$INTBC= 1
##$INTSCL= 1
##$ISEN= 128
##$LB= 0.24
##$LEV0= 0
##$LPBIN= 0
##$MAXI= 10000
##$MC2= 0
##$MEAN= 0
##$ME_mod= 0
##$MI= 1.114404
##$NCOEF= 0
##$NC_proc= 0
##$NLEV= 6
##$NOISF1= 3.799351
##$NOISF2= 2.8
##$NSP= 1
##$NTH_PI= 0
##$NZP= 0
##$OFFSET= 15.70392
##$PC= 1
##$PHC0= -21058
##$PHC1= 27.45271
##$PH_mod= 1
##$PKNL= yes
##$PPARMOD= 0
##$PSCAL= 0
##$PSIGN= 0
##$REVERSE= no
##$SF= 200.130013532006
##$SI= 16384
##$SIGF1= 3
##$SIGF2= 2
##$SINO= 400
##$SIOLD= 16384
##$SREGLST= <1H.CDCl3>
##$SSB= 0
##$STSI= 0
##$STSR= 0
##$SW_p= 3612.71676300578
##$SYMM= 0
##$S_DEV= 0
##$TDeff= 0
##$TDoff= 0
##$TI= <>
##$TILT= no
##$TM1= 0
##$TM2= 0
##$TOPLEV= 0
##$USERP1= <user>
##$USERP2= <user>
##$USERP3= <user>
##$USERP4= <user>
##$USERP5= <user>
##$WDW= 1
##$XDIM= 8192
##$YMAX_p= 0
##$YMIN_p= 0
$$ End of Bruker specific parameters
$$ ---------------------------------
##NTUPLES= NMR FID
##VAR_NAME=  TIME,          FID/REAL,        FID/IMAG
##SYMBOL=    X,             R,               I
##VAR_TYPE=  INDEPENDENT,   DEPENDENT,       DEPENDENT
##VAR_FORM=  AFFN,          ASDF,            ASDF
##VAR_DIM=   8192,          8192,            8192
##UNITS=     SECONDS,       ARBITRARY UNITS, ARBITRARY UNITS
##FACTOR=    0.0002768,     1,               1
##FIRST=     0,             0,               0
##LAST=      2.2672688,     0,               0
##MIN=       0,             -44170,          0
##MAX=       2.2672688,     44249,           0
$$ Real data points
##PAGE= N=1
##DATA TABLE= (X++(R..R)), XYDATA
0@%%%%%%%%%%%%%%%%%jRj6J6j6J6j7K5l2L2l8M6m9N7o6P4q6R6j07J22j38J54j71
$$ 0 0 0 0 0 0 0 0 0 0 0 0 0 0 0 0 0 0 -1 8 -8 8 -8 8 -9 16 -16 16 -22 24 -25 32 -34 40 -46 50 -57 65 -73 81 -90
40i0J92k13K36k62K89l20L53l89M29m73N20n74O34o99P71q52R47j054J175j320
$$ -90 102 -111 125 -137 152 -168 185 -204 225 -248 272 -302 332 -367 404 -448 499 -555 620 -700
60g00J493j703J968k308K765l415M422o203J0249l6511N918O8274n2338k9093
$$ -700 793 -910 1058 -1250 1515 -1900 2522 -3681 6568 -29943 -24025 44249 -8089 -37182
74c7182N2124J0299m8443J9663K7637k7952o738L0698j7813j8117K8756J109l5003
$$ -37182 14942 25241 -23202 -3539 24098 -3854 -10592 20106 2293 -15824 12932 14041 -20962
87b0962J7931K7358l0646j5985L7684J090l4771J0254K6786j9018j5770J9330
$$ -20962 -3031 24327 -6319 -22304 15380 16470 -18301 -8047 18739 -279 -16049 3281
99C281L622j7743M559J1739r067n418J0893K035p751J983P246k724l609M125J957
$$ 3281 6903 -10840 -6281 5458 -3609 -9027 1866 3901 -3850 -1867 5379 2655 -954 3171 5128
114E128n054m93N040k110n443L454L419n317q98N703l498l763O751k88r598M168
$$ 5128 74 -419 4621 2511 -2932 522 3941 -1376 -2274 3429 -69 -3832 2919 2631 -6967 -2799
130b799R042r107p153J1514K775j1724J952J0501m247o289O316L818l854j310
$$ -2799 6243 -2864 -10017 1497 4272 -7452 -5500 5001 754 -5535 781 4599 745 -565
144e65J991J067J244k469l280M664L205o672k862P471%p102J131M496k710j969
$$ -565 1426 2493 3737 1268 -2012 2652 5857 -815 -3677 3794 3794 -3308 -2177 2319 -391 -2360
160b360J274m66J24Q70k340K1M153k135l576M936K634o082O56O334l107l699N642
$$ -2360 -1086 -1552 -1428 -558 -2898 -2877 1276 -859 -4435 501 3135 -2947 -2291 4043 936 -2763 2879
177B879Q56n618K815M900n201k644N906j03n496J050K967k016j990O39n86O91
$$ 2879 3735 -1883 932 5832 631 -2013 3893 3790 -1706 -656 2311 295 -1695 -1056 -1642 -951
193i51M37k279q6L524p21l690K510L701l003k822L704K389l156k096L079K834
$$ -951 -514 -2793 -2879 645 -76 -3766 -1256 2445 -558 -3380 324 2713 -443 -2539 540 3374
209C374k342l143L330L924l701l499M781K163n437j470M693j126m238J187J875
$$ 3374 1032 -2111 1219 5143 1442 -2057 2724 4887 -550 -2020 2673 1547 -2691 -1504 371
224C71j666q03P01l98P90J073k051k78L895j016l746K651L079l171k076M164R57
$$ 371 -1295 -2098 -1397 -1795 -1005 68 -1983 -2261 1634 618 -3128 -477 2602 -569 -2645 1519 2476
241B476l455P20L553j494k259K277J664k638j367K475j16k990j94K558j851k601
$$ 2476 -979 -259 3294 1800 -459 1818 3482 844 -523 1952 1836 -1154 -1348 1210 -641 -3242
257c242K103J739k840l72L088q37k055K483M33k430J578K019l195j27M739k163
$$ -3242 -1139 600 -2240 -2612 476 -361 -2416 67 500 -1930 -352 1667 -1528 -1655 3084 921
273I21m253N316L140o725m94P882k624o786M733M277o677j800N865j962m658L359
$$ 921 -3332 1984 5124 -1601 -2095 5787 3163 -3623 1110 5387 -1290 -3090 2775 813 -3845 -486
289d86J727m180R73L104l059q78M067j258l786L731K625m621m00N065r21m058
$$ -486 1241 -2939 -1966 1138 -1921 -2799 1268 10 -3776 -45 2580 -2041 -2441 2624 1703 -2355
305b355K533L217k835j503L197M30k924L65K337j401j978J444R26k562n32K107
$$ -2355 178 3395 560 -943 2254 2684 -240 125 2462 1061 -917 527 1453 -1109 -1641 466
321D66p41k367J593J514k404n66L117q17k305K129J499k518J62K906j360j886
$$ 466 -275 -2642 -1049 465 -1939 -2505 612 -205 -2510 -381 1118 -1400 -1238 1668 308 -1578
337a578L183P35l279J358K878k564j784L448K05l704Q15K830k516k091K441O24
$$ -1578 1605 2340 -939 419 3297 733 -1051 2397 2602 -1102 -287 2543 27 -2064 377 1001
353A001l013L05K006j136j136J127O97j078J24Q12j21m14P15N98n78J04J188m10
$$ 1001 -2012 -1707 299 -837 -1973 -846 -149 -1227 -1103 -291 -412 -826 -111 487 -91 13 1201 791
371G91p33J067Q47j383o75K112j68k645R49K306k861j701L133p2l616J209K684
$$ 791 58 1125 1972 589 -86 2026 1858 -787 162 2468 -393 -2094 1039 967 -2649 -1440 1244
388A244k704j606L447r4l320K167K093k817L2L045j004k179K515J402k945N51
$$ 1244 -1460 -3066 381 287 -3033 -866 1227 -1590 -1558 1487 483 -1696 819 2221 -724 -173
404a73K814j769j793K811M11k878O45K277k001j831K345j9k426L99J979j761j228
$$ -173 2641 872 -921 1890 2301 -577 68 2345 344 -1487 858 839 -1587 -1188 791 -970 -2198
421b198J743J38j348J83J488o26p48J233O18r29J19R21Pl89O95K35l22k8P21n25
$$ -2198 -455 -317 -1665 -1482 6 -620 -1368 -135 483 -446 -327 594 601 212 907 1142 820 792 1513 988
441I88l87K76L76j113k43Q11o02r81L18M80o41r12Q99O62j240k80J119M15j210
$$ 988 601 877 1253 140 -103 708 106 -875 -557 -77 -718 -1630 -731 -69 -1309 -1589 -470 -55 -1265
460a265L81J394n64n99J120N49q30K17R91o06n05J134j35j329O03J089j636o18
$$ -1265 -884 510 -54 -653 467 1016 186 403 1394 788 283 1417 1282 -47 556 1645 9 -609
478f09J633j15k216P11J368j767r68K008j98k049R03J714j431o94J916o1j354
$$ -609 1024 909 -1307 -596 772 -995 -1963 45 -153 -2202 -1299 415 -1016 -1710 206 145 -1209
495a209J161J437j365n16J897rj736J034J285j407q06J664j34j939Q06J125j632
$$ -1209 -48 1389 24 -492 1405 1396 -340 694 1979 572 -234 1430 1296 -643 163 1288 -344
512c44q33J711jk264P71J381j664r56K003K49k320J194J985j683o83K136L12j893
$$ -344 -1177 534 533 -1731 -960 421 -1243 -2199 -196 53 -2267 -1073 912 -771 -1454 682 994 -899
530h99J083J811j578p96K155k01k015Q24J782k053q61K186o28k296J402J195k069
$$ -899 184 1995 417 -379 1776 1575 -440 384 2166 113 -748 1438 810 -1486 -84 1111 -958
547i58p72K232o68j976J365J114j878l39K201m09j341J138J428j407j97J766j99
$$ -958 -1730 502 -166 -2142 -777 337 -1541 -1880 321 -88 -1429 -291 1137 -270 -467 1299 1100
564A100j207P98J165j342n29J336j26j527O64J123j295r26J490k66j781N17J433
$$ 1100 -107 691 1856 514 -15 1321 1195 -332 332 1455 160 -766 724 458 -1323 -806 627
581F27j205j266J593K00j676N29J536r46r26J694M72j522O29J811j008j026J574
$$ 627 -578 -1844 -251 -51 -1727 -1198 338 -608 -1534 160 632 -890 -261 1550 542 -484 1090
598A090M48j589M75J261j061q79J210P2j427K90J140j150r64J077R5j368J90J022
$$ 1090 1538 -51 424 1685 624 -255 955 1027 -400 -110 1030 -120 -1084 -7 88 -1280 -1090 -68
616f8q10o39J049L44j033J53J312l35p77R40R19r51k56J404j96j012N18J210j326
$$ -68 -878 -1517 -468 -124 -1157 -1004 308 -27 -804 136 1055 104 -152 1252 1056 44 562 1772 446
635D46o71J386k05j538N07J051j325n59J166j35j735P48J306j564o06J808l5j926
$$ 446 -225 1161 956 -582 -75 976 -349 -908 258 123 -1612 -864 442 -1122 -1728 80 45 -1881
653a881J292J551j469q03K164M5j608J070J486j676l94J854m56j689J217J084
$$ -1881 -589 962 -507 -1310 854 899 -709 361 1847 171 -223 1631 1175 -514 703 1787
669A787j876m63J656n13j855J190R71j854m80J792p33j556J299J271j635n60J874
$$ 1787 -89 -552 1104 591 -1264 -74 897 -957 -1437 355 -378 -1934 -635 636 -999 -1559 315
686C15k63j442J218J226j291m08J795k43j264R03J062j476k79J661n11j565J052
$$ 315 52 -1390 -172 1054 -237 -645 1150 907 -357 546 1608 132 -147 1514 1003 -562 490
703D90O87j430m00J242m59j484Q07Q64j311l26J235k62j058P30R32r37k26J327
$$ 490 1177 -253 -653 589 130 -1354 -547 317 -994 -1320 -85 -347 -1405 -675 257 -680 -906 421
721D21q9j063P89J099j015m33J482P7j195L35R63o96q51R95J5j433M85R10j113
$$ 421 332 -731 58 1157 142 -291 1191 1268 73 408 1371 675 -176 819 834 -599 -114 796 -317
740c17q86J076K13j417L46R37o17q58J306K33j131M64J105n51o17J387K47j353
$$ -317 -1203 -127 86 -1331 -985 -48 -665 -1523 -217 16 -1115 -651 454 -97 -714 673 920 -433
758d33N15J483q28r64J350L80j706M10J216j021j033J197K0j376J87Q67o29r61
$$ -433 82 1565 737 -227 1123 1503 -203 207 1423 402 -631 566 586 -790 -603 264 -365 -1326
776a326R96M77j361J65J294o62q14J160L22r82K13J490n64r32J154O86j309nJ309
$$ -1326 -330 147 -1214 -1049 245 -417 -1231 -71 251 -731 -518 972 408 -524 630 1316 7 2 1311
795A311o07q34R14L32j223k13J316q21j010P18O01j444j28J298n03j051P59R06
$$ 1311 704 -130 784 1116 -107 -320 996 175 -835 -117 484 -960 -1088 210 -293 -1344 -585 321
813C21j304j16J255m1j090R63O18r25P8J327k49r11O96O15j061o6R22k10j094
$$ 321 -983 -1099 156 115 -975 -12 606 -319 -241 1086 837 -74 622 1237 176 110 1032 822 -272
832b72M88N95r11m32O73j90r73N54N12p38l61Q41k6r12N16Q54n93l64R04L70r32
$$ -272 216 811 -100 -532 141 -49 -1022 -468 44 -694 -1055 -214 -240 -1152 -636 218 -375 -739 165 535 -397
853c97K75J141o58m39R31L11j136J10J174q75p39R37O6j140L8R83p03r06R15O8
$$ -397 -122 1019 361 -78 853 1164 28 138 1312 437 -302 635 701 -439 -401 582 -121 -1027 -112 -44
873d4j071L20R31q09p57J314J65j045N56J168q72n59J332K39r74J86J070p43m45
$$ -44 -1115 -795 136 -673 -1430 -116 49 -996 -440 728 -144 -703 629 868 -106 80 1150 407 -38
892c8R78K8j129M61P27r89o72J059K33j681N33R74j054o65J164j34q45L33R19
$$ -38 940 968 -161 300 1027 38 -634 425 658 -1023 -490 484 -570 -1235 -71 -205 -1050 -717 202
911B02p09m10R80L08j106O24J004q43l20J142P6j083L17J065o15q38P42K72j129
$$ 202 -507 -917 63 371 -735 -111 893 50 -270 872 948 -135 182 1247 632 -206 536 808 -321
930c21L45P18q88p82J160q0j294N33O51p60l67J073q2r40M67J047q30k71J082
$$ -321 24 742 -146 -928 232 152 -1142 -609 42 -718 -1085 -12 -94 -1034 -567 480 -350 -621 461
949D61J56j041P44O32n79l41Q68Np86J93O68p95l88N60J16j030J26P85n85p83
$$ 461 617 -424 320 952 373 32 900 905 119 312 980 185 -203 357 473 -557 -431 354 -231 -1014
969a014Q59J36j085L22Q26l07o14P15K03o40L46Q61m95l09P01L04p20N0J014n72
$$ -1014 -155 -19 -1104 -782 44 -263 -877 -162 41 -599 -253 608 113 -196 505 809 89 139 1153 581
989E81n29N75K64q55j05P52l15p82K39N96r20j98P99m00p54O36L71p83J4J018
$$ 581 52 627 891 36 -69 683 368 -414 -175 421 -499 -697 102 -298 -1052 -416 -45 -828 -814 204
1009B04l10o00O59O54p35q3Q62J4p78M89P33r81k35R74j80q75M68N92q62m18R37
$$ 204 -106 -706 -47 607 -128 -211 651 665 -113 376 1109 128 -107 867 687 -188 280 872 10 -408 529
1030E29l92r35N51O79j097j72R04l98r80Q80O65p29l42J131j09p68N27Q59q41
$$ 529 137 -798 -247 432 -665 -837 67 -331 -1311 -431 234 -495 -837 294 185 -583 -56 803 -38
1049c8k58J126Qr46M07Q39j161Q2P27l10q90M98N50q46m39Q82n1j147M78O45q09
$$ -38 -296 830 838 -108 299 1138 -23 59 786 476 -414 84 634 -212 -651 231 180 -967 -489 156 -653
1070f53j18O67lo60N46O34p18l81J206l5p09M66P91p01m36J074p3r44J52Q10o72
$$ -653 -771 -104 -107 -767 -221 413 -305 -686 520 485 -224 242 1033 332 -104 970 897 -47 105 915 243
1091B43n97O80M7j045L07P44n91p21O73J71r21L75P97p59n32J102K63r36M60Q87
$$ 243 -354 326 373 -672 -365 379 -212 -933 -260 -89 -1010 -635 162 -597 -1129 -27 236 -700 -240 647
1111F47n42l71R50L41j025J88Q55n07p82P41L40r49L8R32o97o94O83J11j054J41
$$ 647 105 -266 684 1025 0 188 1043 536 -246 495 835 -114 -76 856 159 -535 148 259 -795 -654
1131f54Q10o30o04O42L96p57J04Q77l22o48P74M44p80J83R54k02q11P69L04o82
$$ -654 156 -474 -1078 -436 -40 -797 -693 184 -138 -786 -12 432 -348 -165 789 587 -224 545 849 167
1151A67j27P14l47o79N92L05q06k01P38l17q59N08N02r65r8Q72j98o95M41P19
$$ 167 40 754 407 -272 320 625 -181 -382 356 39 -820 -312 190 -775 -873 -1 -199 -894 -453 266
1171B66p94k77J072J23r34O45O84p13k05R22r3q92P15M93q66l90Q92j94r67N26
$$ 266 -528 -805 267 390 -544 101 785 72 -133 789 696 -196 519 1012 146 -244 648 454 -513 13
1191A3M59q51l43Q58l26o51M32O14q86l6Q04k04p85O36O80p09p4R26j43m75M67
$$ 13 472 -379 -722 136 -190 -841 -409 205 -681 -717 87 -117 -902 -266 414 -295 -369 557 414 -61 406
1212D06N62q50k79Q59p3p72M07M36p48k23O56j87o66K78L82n56l80P53j52n56
$$ 406 968 118 -161 698 625 -147 260 696 -52 -275 381 194 -472 -194 188 -368 -748 5 -147 -703
1232g03J31O63l78m49Q73L0n96L21O34m20l55Q54J82p48L8O81m62l55O49M8p04
$$ -703 -572 91 -287 -736 137 167 -429 -108 526 106 -249 605 787 39 77 758 296 -59 590 638 -66
1253f6P1N48n88l98L43L28q13p2M89k32m47O30K87p43J87N77Jp74Q32L22p59R4
$$ -66 5 553 -35 -433 -90 238 -575 -647 -158 -390 -837 -207 80 -663 -476 101 102 -672 160 482 -277 -183
1275a83Q86l30n23M96N33q94J38O92m07o73P06J63q27j4N36l91q13P18K55p57
$$ -183 703 373 -150 346 879 -15 123 815 408 -265 441 604 -223 -237 299 -92 -905 -187 68 -689
1295f89l3Q15m25n66P45L64p61R0Q55k11n33N86L66n81L7N64j25o25N74J52o25
$$ -689 -722 93 -332 -898 -153 211 -550 -460 395 184 -349 237 603 22 59 623 498 -127 447 599 -26
1316b6J7O58m05o98O72J62p91j07N23l13n71M73L57n33l1O31j41m01N54L01n30
$$ -26 -9 649 244 -454 218 380 -411 -518 5 -308 -879 -406 -49 -582 -613 18 -123 -524 30 331 -199
1337a99M8N08J2p56Q97J66n87j3N54j19o79L69K78n27k89M27M2o85Q2O05n85k94
$$ -199 -151 357 369 -387 510 676 89 76 630 511 -168 201 479 -48 -337 90 132 -553 -471 134 -451 -745
1359g45N69K31o49K96L46l29k57M66J67n79N97M25n06j76O11Q8m80K61M78m34
$$ -745 -176 55 -594 -298 48 -281 -538 -72 95 -484 113 538 32 -144 467 555 75 336 814 380
1379C80l54M97%n53k24O77o22k45M44J07o63N5O05m96k03N03o2m02K44M19m12
$$ 380 26 523 523 -30 -254 423 -199 -444 0 107 -556 -501 104 -392 -595 -92 -154 -556 -312 107 -305
1400c05k73Q45R5o50L94P56m15p11Q81K32q69J91M65n22l21L47J37o74J69M18
$$ -305 -578 267 362 -288 106 862 447 -264 617 849 -20 171 636 114 -207 140 277 -397 -228 190
1420A90n22k72P41N9j020L91O73n34m18Q38j40n08J37Q71l72m92P83Q0m94R9P73
$$ 190 -332 -604 137 196 -824 -433 240 -294 -712 126 -14 -522 -385 486 114 -378 405 485 -9 90 863
1441H63n10l32N17J19o61K62K24l73n77O61jo75K52K96k39n42O02J31n93J26P21
$$ 863 353 21 538 657 -4 258 482 109 -468 193 192 -483 -231 65 -174 -716 -114 17 -576 -450 271
1462B71m53n15P65K54n89P8N25J2l09M41K45o55J00M86k14n41J87J78n43k9N45
$$ 271 -182 -697 68 322 -267 -189 336 348 39 480 725 70 170 656 442 -99 88 266 -277 -306 239
1483B39k92n87N89K76o16k04M93j52n06O16K98n16jN80j16m56L97M20m62j14O97
$$ 239 -53 -640 -51 225 -391 -595 -102 -254 -760 -144 154 -362 -363 217 101 -355 42 462 0 -114 583
1504E83j2q02N00N37o43k27O41l50n80M59L40n96l35P03j64r78O82M64p09j20
$$ 583 571 -231 269 806 163 -64 577 227 -353 106 446 -150 -485 218 54 -924 -242 222 -487 -607
1524f07M39J24m10L37L30n45J66M88Rp05P15K90p93J01O73pp25M21N55q14k05
$$ -607 -168 -44 -454 -117 213 -332 -166 322 331 -374 341 631 -162 -61 612 605 -120 301 856 42 -163
1545a63O36j98n54J92M90n80m18M99j16k55L5L27k68j99O79j28n09N19M63n33
$$ -163 473 275 -279 -87 403 -177 -595 -96 -212 -467 -432 -105 -373 -572 107 -21 -530 -11 452 -81
1565h1l8N98Kn02O1O44m13k63M29N2n72J48L80l46l09K19J27n31OL56n87R3M83
$$ -81 -119 479 481 -21 40 684 271 8 437 489 -83 65 445 99 -210 9 136 -395 -389 -33 -620 -527 -44
1588d4r6l97J03O67l25m52P31R2o15M09M95m52k61O45M6n62O8N37k85n71L37L36
$$ -44 -140 -537 -434 233 -92 -544 187 279 -336 73 568 116 -145 500 546 -16 52 589 304 -267 70 406
1610D06o82N5M43k71m48N88Lp29J22O75m37m56N31L50p72K18Q42m55m99Q67K09
$$ 406 -276 -221 222 -49 -497 91 94 -635 -513 162 -275 -731 -200 150 -622 -404 438 -17 -516 351 560
1631E60p47R9O53l67l55O50J32r48L23N67n53k73M62j8o77K26L35k98m05N83J5
$$ 560 -187 -88 565 198 -157 493 625 -323 0 567 14 -259 203 185 -492 -266 69 -229 -634 -51 -36
1652c6o00J69M00k52l41P58R5l89L22P2j12j68M12N0k77r0N31k00k76K42J27m64
$$ -36 -636 -467 -67 -319 -660 98 193 -196 126 198 86 -82 330 380 103 13 544 344 68 310 437 -27
1674b7j81N28k43n08K76J08k30k61N23l2m39P7M49m48%L64J57m10L42L41l56j75
$$ -27 -208 320 77 -431 -155 -47 -277 -538 -15 -47 -486 -409 40 -408 -408 -44 113 -297 45 386 30 -145
1696a45L86M34q32N49J87l46l64P37k30m98L2O26m34n26N34j36m84J23M24n34
$$ -145 241 675 -157 392 579 233 -131 606 376 -122 -90 536 102 -424 110 -26 -510 -387 37 -497
1716d97l0O59j45o05N00K24l97r2O58Ro59M44L88l21k54O52l47k52M19L51m24
$$ -497 -527 132 -13 -618 -118 106 -291 -383 275 284 -375 69 457 136 -118 534 187 -65 354 705 281
1737B81l51L50j29l70LM39n42j18L44n3m45K96L25l27j44M78q2k72L24L24m77
$$ 281 -70 280 151 -219 -216 223 -319 -437 -93 -146 -591 -295 30 -297 -441 37 -45 -317 7 331 -146
1758a46n6M72ok42R0M73m16j28M25k58j32Q6L36n14j67L01j54j97p0L18k56k81
$$ -146 -202 270 264 22 112 585 169 41 466 208 76 162 498 -16 -183 118 -36 -233 -303 15 -241 -522
1780e22L04L42m98k9N74k77m48O19K30m99J61M79j08l59J17L33l42qN19m05l61
$$ -522 -218 124 -374 -403 171 -106 -554 65 295 -204 -43 436 328 -31 86 419 77 69 588 183 -178
1801a78M43J29n09l7N41l32n92M69L6l90J50K97j92m04L34M6j24lM85r7m60M33
$$ -178 265 394 -115 -152 389 57 -535 -66 -30 -420 -270 27 -165 -569 -235 -189 -313 -316 169 72 -388 45
1823D5N47p03J10O39l85k29K70K85o13n0N30l21m02O46J32p53K2M03m73l19M23
$$ 45 592 -111 -1 638 253 24 294 579 -34 -84 446 125 -277 369 501 -252 -230 173 -300 -619 -196
1844a96J69m10P9M38k88l49N55K35n44Q3N60k61k55M85K33n09N5M82m04k87L37
$$ -196 -27 -437 -358 80 -208 -557 -2 233 -311 -228 332 71 -184 301 534 25 80 562 158 -129 208
1865B08L42n71J6K14j54l95K62L34n86j7L17j12l28L52L2j08l56O61j81m33L38
$$ 208 550 -21 -5 209 55 -340 -78 256 -330 -347 -30 -142 -470 -118 -86 -194 -550 111 -70 -503 -165
1886a65M28j61k49M68p7k00K5M25l50k85M27J71n69J25L93m06j36M62l27k36M
$$ -165 263 102 -147 321 244 44 69 494 144 -141 286 457 -112 13 406 0 -136 326 -1 -237 -233
1907b33L13k62k53M39K1m51J78K40j72j27M42M5m62L76K00j25j40M44%m32L73
$$ -233 80 -182 -435 4 25 -426 -248 -8 -180 -307 135 180 -282 94 294 169 29 473 473 41 414
1928D14J30m43l08M10J9n14K70L05j96m89L13J59l37K9L40l64k27N98k2m25K68
$$ 414 544 101 -207 203 222 -292 -22 283 87 -402 -89 70 -267 -238 102 -262 -489 109 87 -338 -70
1949g0L09k70l03N60j41k00K10L06j91oJ57j21k50L7M39l50l34L63J56n41Q0L09
$$ -70 239 -31 -334 226 85 -115 95 401 210 204 361 240 -10 27 466 116 -218 145 301 -240 -160 149
1971A49l41k03M52l9k23N4J86l21J79J35o6L8n1J87ln7P4J80k24qK65k05l6L5
$$ 149 -192 -395 57 18 -205 -151 35 -286 -107 28 -38 0 -51 136 133 76 150 330 106 98 363 158 122 157
1995A57J44l26p8R3J02j31nN4j95j59L11j11k53K80K0r9%J58Q4k03K43J00j80
$$ 157 301 -25 -103 -10 92 -39 -44 10 -185 -344 -33 -144 -397 -117 -97 -196 -196 -38 46 -157 86 186 6
2018Fj02L89P0n07J94L95k51j53K14j1m58K39L83m87m46O19J1l64P6M68m63k81
$$ 6 -96 293 363 -144 50 445 194 41 255 244 -214 25 408 -79 -525 94 105 -259 -183 285 -178 -459
2040d59M94Q3n08J50M05l11l08P62j25l69J58N42m93M3L21r5k56R5L71m36n6M04
$$ -459 35 118 -390 -240 165 -146 -454 308 183 -186 -28 514 21 64 385 290 34 129 500 64 8 412
2062D12l20m25L82J10m38j93M10K4l28K34K44l41K8K53Pj93J57K22l47J62J52
$$ 412 92 -333 49 159 -279 -472 -62 -38 -366 -132 112 -229 -201 52 59 -134 23 245 -102 60 212
2083B12k0k21J79J31j81j37M09j49k84J95M5j72j15J87n5l50J33L05m67N9K87
$$ 212 192 -29 150 281 100 -37 372 223 -61 134 179 7 -108 79 24 -326 -193 112 -355 -296 -9
2104il3l40K16N1j5k28M10K06l74n7L95j57j51L60P2l34p0M12j24k38Q5L08m72
$$ -9 -42 -382 -166 -115 -130 -358 52 258 -116 -173 222 65 -86 274 346 12 -58 354 230 -8 77 385 -87
2127h7n8M82k26n22M05J0m46K37J78j24l04L55K25m05N9L71l21j41M33J45l98
$$ -87 -145 337 111 -411 -6 4 -442 -205 -27 -151 -455 -100 125 -280 -221 150 -171 -312 121 266 -132
2148a32K7M34j00l04L84K6k83k14N07k36k24K62J21o51L10L74l32m24M57K47o02
$$ -132 -105 329 229 -75 309 335 52 -162 345 109 -115 147 268 -383 -73 301 -31 -455 2 249 -353
2169c53J69K19j99k22L53o5n7q0M12m9l01L47Q8m54L11K44o4m52L01L0j65L1K73
$$ -353 -184 35 -164 -386 -33 -98 -155 -235 177 128 -173 174 262 -192 119 363 299 -153 148 178 13 44 317
2192C17k70j98M9L42l23j78K24m0k77R2L10j43j53M2J73k61J15L49j62K3K01p7
$$ 317 47 -151 -102 240 -83 -261 -37 -77 -354 -262 48 -95 -248 -206 -33 -294 -179 170 8 31 232 155
2214A55j52p8M30l92k9M01K5m70J20K00j29l59M98k17k20K03K46k33m92M99j5
$$ 155 3 -75 355 -37 -66 335 360 -110 10 210 81 -278 220 3 -217 -14 232 -1 -493 6 -9
2235ij26N0J76k39mJ76q7k60L20L87j32l26L24N3j60J5K88l24j10K68Ml67O8J77
$$ -9 -135 -85 91 -148 -152 24 -63 -323 -3 384 252 -74 250 303 143 158 446 122 12 280 284 -83 -15 162
2259A62o7k52K53mn50K58K15k62n0P5K67l90K12L68l80k7M55j79j26R5J55n5j14
$$ 162 95 -157 96 92 -458 -200 15 -247 -297 -222 45 -345 -133 235 -145 -172 283 104 -22 73 228 173 59
2282E9J44K0k19J15J55m01K08J25J5m94J41J96k57j51L16O4k56L0J62j93r6K37
$$ 59 203 223 4 119 274 -127 81 206 221 -273 -132 64 -193 -344 -28 36 -220 -190 -28 -221 -317 -80
2304h0J19k79J57J85j04j43K99O7p4k7K55k84j50P9K11k57O0J75j47j75K42l9
$$ -80 39 -240 -83 102 -2 -145 154 221 147 120 375 91 -59 20 231 -26 34 209 62 -113 129 90
2326I0l68J28K62l77j63K17J52k37J40J96j02j10Q3J69j94J17K45n2k61J66J81
$$ 90 -278 -150 112 -265 -428 -211 -59 -296 -156 40 -62 -172 -89 80 -114 3 248 196 -65 101 282
2347B82k42J29K34k83l52L54Q9j48k20K69k52j39K72M2l95R9L58l16q2K43J48
$$ 282 40 169 403 120 -232 122 211 63 -157 112 -140 -279 -7 35 -360 -261 97 -219 -301 -58 90
2368I0k08j96L86n1m08M81J83k40r6L58q1j94R0K85l29n0J43j49j20J36K05k83
$$ 90 -118 -314 72 21 -387 94 277 37 -59 299 218 24 114 399 70 20 163 14 -106 30 235 -48
2390d8r1K41j49l22L48k5k02Q1Q9Q5k50K55J64j91j24J06J72m8J6J61Qk49J67
$$ -48 -139 102 -47 -369 -21 -46 -248 -167 -78 7 -243 12 176 -15 -139 -33 139 91 107 268 276 27 194
2413A94j4k11K83r5k7o3rj38KR1L2j48j92L26l8k77J47J73j57J0Q1J61l27K11
$$ 194 180 -31 252 157 130 67 58 -80 -78 13 45 -103 -295 31 -7 -284 -137 36 -121 -111 -30 131 -196 15
2437A5K54l03j03L07J05k49Q3K82m85M0L47k35j84M8K25m21J73J37m2k88M2K85
$$ 15 269 -34 -137 170 275 26 109 391 -94 -54 293 58 -126 -78 147 -274 -101 36 -6 -294 -252 33
2459C3k21k04M06n0k03J36P7o0m8J17J22j20o0L16j14q4L23j00k87J18K05j99
$$ 33 -188 -392 14 -36 -239 -103 -26 -86 -134 -17 105 -15 -75 241 127 43 366 266 -21 97 302 103
2481A03j13R9Q5k37nJ83m15O4J42K8k92L25J27l04n2J54N3l1j06L49j96k12L33
$$ 103 -10 89 174 -63 -68 115 -300 -236 -94 -66 -358 -33 94 -210 -262 -108 -55 -86 -192 157 -39 -251 82
2504H2m0j0L3J90J51l65J66p7j60M5p1J84k68K79m1k79J5K82j11l84M46L0j80
$$ 82 42 32 65 255 406 41 207 130 -30 15 -56 128 -140 139 98 -181 -166 116 5 -379 67 97 -83
2527h3j78L06k9j77J81J12j93m8K27J6m59M77J52k28l7K40j66q5L19l37q2N2J24
$$ -83 -261 45 16 -161 20 132 -61 -109 118 134 -325 152 304 76 39 279 113 28 347 10 -72 -20 104
2550A04q0k79M58l11r4K4j3K04k33J36K32k89q8L14n3j84J26R8j23n0M38l06j08
$$ 104 24 -255 203 -108 -202 -178 -191 13 -220 -84 148 -141 -229 85 32 -152 -26 72 -51 -101 337 31 -77
2573g7K59j9L2k17K91j86j80J82P6l13%K74r1k89J82j9k55J26J71j74J04K1J53
$$ -77 182 163 195 -22 269 83 -97 85 161 -152 -152 122 31 -258 -76 -95 -350 -224 -53 -227 -123 -102 51
2596E1j2j68K19lj82J68J57j57K05k05J54q7Qj15j4O3PL8j66J12p3r1p8j1L01
$$ 51 39 -129 90 87 -95 73 230 73 278 73 227 140 148 33 19 82 89 127 -39 73 0 -91 -169 -180 121
2621A21l71L9K23j35j72K31L1r9MK51l1j69L63o7k20J19M9l5j85L34q6k20J41
$$ 121 -250 -211 12 -123 -295 -64 -33 -132 -128 123 92 -77 286 219 -1 118 167 132 -53 281 195 -25 116
2644A16j16L6j13K32l1k93J00J25l11L1P2J08k03M02j96M0l39L36Q2k16K71O6
$$ 116 0 36 -77 155 124 -169 -69 56 -255 -224 -152 -44 -247 155 -41 -1 -340 -4 78 -138 133 199
2666A99m1k38L12Pk55N5K93j34l11J74K9j35l4K07j44j84J90L8k04p7K21o3p3
$$ 199 158 -80 232 239 -16 39 332 198 -113 61 90 -45 -79 128 -16 -200 -10 28 -176 -253 -32 -95 -168
2689a68J6J88j25o0K95j49j94J65K99k55j13L50j26p2J7K35k29q1K42j2k94j79
$$ -168 -152 36 -89 -149 146 -3 -197 -32 267 12 -101 249 123 51 68 303 74 -7 235 223 -71 -250
2711b50N21m92l2K47Q3j84j16Q0m0N0K08j26l0N4J5k6q2K04n9k8J23LM0n0K42
$$ -250 271 -221 -253 -6 77 -107 -223 -143 -183 -133 75 -51 -81 -27 -12 -38 -120 84 25 -3 120 123 163 113 355
2736C55k58p9J50q5m4j25J47%j30j1j4J80k43K0J82k45N4K72k06k07J62p1K15
$$ 355 97 18 168 83 39 -86 61 61 -69 -80 -94 86 -157 -137 45 -200 -146 126 -80 -287 -125 -196 19
2759A9j48K13M9j63J39M2k33J46K39k82p7K55n5j03L0P9j01j71J47q8r0J43J15
$$ 19 -129 84 133 -30 109 151 -82 64 303 21 -56 199 144 41 71 150 49 -122 25 -63 -153 -10 105
2782A05l16k25M94j23p7JJ56M2l06J18K39j03O8Llj61J79K8q3j28K66j84p7P3
$$ 105 -211 -436 58 -65 -142 -141 15 57 -249 -131 108 5 73 76 73 -88 91 119 36 -92 174 -10 -87 -14
2806a4R5j85J22K09l42mJ21N1l13J44J02J08m91L69J25j03j52L42j12p9J43m6
$$ -14 81 -104 18 227 -115 -119 2 53 -260 -116 -14 94 -397 -28 97 -6 -158 184 72 -7 136 90
2828I0r4k33M42j16k22L73j73o0l3K91k33j37N7L12k40q0Q9q5j52J09R9r4j14
$$ 90 -4 -237 205 89 -133 240 67 7 -26 265 32 -105 -48 264 24 -56 33 -52 -204 -95 4 -90 -204
2851b04K24j48N9n8K39l26K11K90j27k15K04O7j07K7J04J21m38L17j3r4j91K02
$$ -204 20 -128 -69 -127 112 -214 -3 287 160 -55 149 216 109 136 240 361 -77 240 227 133 -58 144
2873A44o2k22J8Q5Pr8Q2n4k2K3J99k35q9L77p2l94L70J63k26K1J20J9m31K13L55
$$ 144 82 -140 -122 -37 -30 -128 -46 -100 -122 -99 100 -135 -224 153 81 -313 57 220 -6 15 135 154 -277 -64 291
2898B91l73K15J15j17j89Q4J17k39R8L3j70J08j51J95k55L8K27pj40J1J54j11
$$ 291 -82 133 248 131 -58 26 143 -96 2 35 -135 -27 -178 17 -238 -200 27 20 -120 -109 45 -66
2920f6p7K43R3l68J63K73l73Q6J97o9l6r2J79j45j25L03j30j87J72O1j81J1P0
$$ -66 -143 100 193 -175 -12 261 -112 -26 171 102 66 -26 153 8 -117 186 56 -131 41 102 -79 -68 2
2943Bn8M7k02J60q5p6K57k4k03J73Q9j21o9K78Q8j27p8J01k09P9j37L96l59J54
$$ 2 -56 -9 -211 -51 -136 -212 45 21 -182 -9 80 -41 -110 168 256 129 51 152 -57 22 -115 281 -78 76
2967G6k6L0l62K68R8k34R3K8M8j11q9MO0j29L39j72j59K39k9JJ7L3j2m8K45m0
$$ 76 50 80 -282 -14 84 -150 -57 -29 19 -92 -181 -177 -117 -246 93 -79 -238 1 -28 -27 -10 23 11 -37 208 168
2993A68j36n3K69j67j88K08J60k91k3P9n2j54n7K82j73M5J77k6k71L02mk14P1
$$ 168 32 -21 248 81 -107 101 261 -30 -53 26 -26 -180 -237 45 -128 -83 94 68 -203 99 95 -119 -48
3016d8K08k76mK29P5k25m7J70m7l3R1J02k35O9J63j74k0j7K0p4L8k0R1p0L4j15
$$ -48 160 -116 -120 109 184 -41 -88 82 35 2 93 195 -40 29 192 18 -2 -19 1 -73 -35 -55 36 -34 0 -115
3042a15j0qK80j15j03P3Q3j00p8J12N1j62K2J60j50K27o5j35K5k0J85j58K7K25
$$ -115 -125 -133 147 32 -71 2 85 -15 -93 19 70 -92 -70 90 -60 167 102 -33 -8 -28 157 -1 26 251
3066B51k99P5m3jj77l0K53j30j7J39j1m8j67R9J15j04J59m4l9k2N9J28j45J30
$$ 251 -48 27 -16 -17 -194 -224 29 -101 -118 21 10 -38 -205 -106 9 -95 64 20 -19 -41 18 146 1 131
3090A31Nlj49K50l4k13OK10k53j8J56j23O6n5J13j73q9J30P2k89K17K91j82k22
$$ 131 136 133 -16 234 200 -13 -7 203 -50 -68 88 -35 31 -24 89 -84 -173 -43 29 -260 -43 248 66 -156
3114a56J58R6O3j19K1L8J23j35O4r2O0L2j6k61L94p2k55J05l9n6L3K25j54k35
$$ -156 2 98 161 42 63 101 224 89 153 61 121 153 137 -124 270 198 -57 48 9 -47 -14 211 57 -178
3138a78R8J99k27l2J6P9O3j18K11j31j33J60K72l29J94m9J7l50K59J44j40L2j7
$$ -178 -80 119 -108 -140 -124 -45 18 -100 111 -20 -153 7 279 -50 144 95 112 -238 21 165 25 57 40
3161D0J24l82K66O2j05Q2r0Jl6N1J04k48j36K42K0j38N3J32k05qK25Q8l11K76
$$ 40 164 -218 48 110 5 87 -3 -2 -38 13 117 -131 -267 -25 -5 -143 -90 42 -163 -171 54 142 -169 107
3185A07l9j22o1L32r8J6P6j81l5q7J50j52lj07K43j07P9Lj84N2J12J76l10J55
$$ 107 68 -54 -115 217 119 135 211 30 -5 -92 58 -94 -97 -204 39 -68 11 14 -170 -118 -6 170 -140 15
3209A5j68K35r7j7m1J6l8P3K56k55Q1M8j49M6N2pj72O4K61l06K7J43J23j98K0
$$ 15 -153 82 -15 -32 -73 -57 -95 -22 234 -21 60 108 -41 5 57 50 -122 -58 203 -103 -76 67 190 -8 12
3234A2p5N4k74J55KL0j08J35J38j55J84K5l01L11Q5q6j08P2P9k07J71L5k20m3
$$ 12 -63 -9 -283 -128 -126 -96 -204 -69 69 -86 98 123 -178 133 218 132 24 96 175 -32 139 174 -46 -89
3258h9K19k56J39j47J18n8KJ32n8j17J07Q9j88N3J59j43k59L21M6j43Q8O3P4k33
$$ -89 130 -126 13 -134 -16 -74 -72 60 2 -115 -8 81 -107 -54 105 -38 -297 24 70 -73 15 78 152 -81
3282h1J01J89l41J54K37j86q9M1j2o4m4K1oP3K3J26j18j23K15j4j59k7Q8r6R4
$$ -81 20 209 -132 22 259 73 -16 25 13 -51 -95 -74 -80 -7 16 142 24 -99 116 102 -57 -84 4 -92 2
3307BJ92j99j10k6L81q7k39K04n8o1J08JO6l92K99k8J8k38M33l22o7J95K6k01
$$ 2 194 -5 -115 -141 240 153 -86 118 60 -1 107 108 174 -218 81 53 71 -167 266 -56 -123 72 98 -103
3331a03j02K06k66M9P1J82j72J78km4q4J26J4j85N2J27P0j33J51K3k49O1K65j53
$$ -103 -205 1 -265 -216 -145 37 -135 43 41 -3 -87 39 53 -132 -80 47 117 -16 135 158 -91 -30 235 82
3355H2j37J29q6r7j08K35Oo0N8L2k26Q3R4qp3k3J91k1k31K13j1j02j6L34j35k19
$$ 82 -55 74 -12 -109 -217 18 24 -36 22 54 -172 -89 5 -3 -76 -99 92 71 -160 53 42 -60 -76 258 123 -96
3381i6J37N3j60J80n4r5m5L4M2R0r3r6r1O6Q8k6j08J12R2k03M6K72k19j19L32
$$ -96 41 94 -66 114 60 -35 -80 -46 -4 86 -7 -103 -194 -128 -40 -66 -174 -62 30 -173 -127 145 -74 -193 139
3406A39o7j08j6j1K52k41K14j7L0j72J85j10j20J90r9l9k8L1o9m5r0J86q2j18
$$ 139 72 -36 -52 -63 189 -52 162 145 175 3 188 78 -42 148 49 10 -18 13 -56 -101 -191 -5 -87 -205
3430b05K06j22m4l4J46O0m2J08j33j06J84J54j05j9KO3o9J52j32j20R8R2m7q7
$$ -205 1 -121 -165 -199 -53 7 -35 73 -60 -166 18 172 67 48 50 113 44 196 64 -56 42 134 87 0
3454@J0j52J75k04J64J7N8j98J15j45M9J53QO0j14J5Q0k52K77j06j04K3K66p0
$$ 0 10 -142 33 -171 -7 10 68 -130 -15 -160 -111 42 50 110 -4 11 91 -161 116 10 -94 -71 195 125
3478A25l13L41j3k23rJ58J99l20P9Pj96K62J16j16j10ro4j89M2K26J6k23J85Q5
$$ 125 -188 153 140 -83 -92 66 265 -55 24 31 -165 97 213 97 -13 -22 -86 -275 -233 -7 9 -214 -29 56
3502E6j31rK3k5L4K15n8o4k3J91k20o8J31P0j68L0L6k7j07J95j5j42K3Q7l8j0
$$ 56 -75 -84 -61 -86 -52 163 105 41 18 209 -11 -79 52 122 -46 -16 20 -7 -114 81 66 -76 -53 34 -4 -14
3528a4qK4j44N2J63j07J38j29RP3rJ50j4j55m4K61j58m8K62k38j45K37o3o1M1
$$ -14 -22 2 -142 -90 73 -34 104 -25 -16 57 48 198 184 29 -15 246 88 40 302 64 -81 156 93 32 73
3553G3l3M6k09J18k0r6j29J59K33k02J80j73o6K13j52K05j61N4L8p7N9K05j63
$$ 73 40 86 -123 -5 -25 -121 -250 -91 142 -60 120 -53 -119 94 -58 147 -14 40 78 1 60 265 102
3576A02j13M9N7%k4%LJ6j11J75j44j66J15Q0l02K00R5j12M4J4J08j12K05j56q0
$$ 102 -11 38 95 95 71 71 74 90 -21 154 10 -156 -41 39 -263 -63 32 -80 -36 -22 86 -26 179 23 -57
3601e7J91O0j46j58J76m0j12J35j0m7r3O8K35l02K7R3O7k57oL93j30k98L56k37
$$ -57 134 194 48 -110 66 26 -86 49 39 -8 -101 -33 202 -100 -73 20 87 -170 -176 217 87 -211 145 -92
3625i2rn3J28L6j65j0J83k9N1J22o5j02J8R3J0m1m4J10l03J76N7jJ8J05k89J49
$$ -92 -101 -154 -26 10 -155 -165 18 -11 40 162 97 -5 13 106 116 75 31 141 -162 14 71 70 88 193 -96 53
3651E3L7N9j01j36K10j51m9kJ5N7j10J90j73M9R1K2j73Q6j11K47j42O8P6r1L8
$$ 53 90 149 48 -88 122 -29 -78 -80 -65 -8 -118 72 -101 -52 39 61 -112 -26 -137 110 -32 36 112 21 59
3676E9o9J36l2j43J05lK5o8q1r6P6K02k80J55L7Lr0j2P2K5j26J63j01K22k32J94
$$ 59 -10 126 94 -49 56 53 78 10 -71 -167 -91 111 -169 -14 23 26 -64 -76 -4 21 -105 58 -43 179 -53 141
3702A41j82j05K20j58R1O3M2k70J75J15j60N7q8pm3k5K62j79j0Rj19N8K86k66
$$ 141 -41 -146 74 -84 7 70 112 -158 17 132 -28 29 -59 -66 -109 -134 128 -51 -61 -52 -171 -113 173 -93
3726i3j62J43J59mn1M3j27J57k5O0M6q9PP6j06l9M7J9j42O0K19m9q6p1K7j07j05
$$ -93 -255 -112 47 43 -8 35 -92 65 40 100 146 57 64 140 34 -5 42 61 -81 -21 198 149 63 -8 19 -88 -193
3753a93K50m2n4J48l1j82J52k18J55R7j58J22j28oJ27j7P4Q0j38K37k69L2j08
$$ -193 57 15 -39 109 78 -104 48 -170 -15 82 -76 46 -82 -88 39 22 96 176 38 275 6 38 -70
3776g0J51j97J06p8l5K3J94j02N9Km5k07L57k28l5K19l9J3j28j38K86J03k23J22
$$ -70 81 -116 -10 -88 -123 -100 94 -8 51 53 8 -199 158 -70 -105 114 75 88 -40 -178 108 211 -12 110
3800A10k9m4J16j26r7J69j20kr4K22m0j04J09K0Mj47L6m4j20L7J02o7r8K70j08
$$ 110 81 37 153 27 -70 99 -21 -23 -117 105 65 -39 70 90 94 -53 -17 -61 -181 -144 -42 -109 -207 63 -45
3825d5K8q0Q2r0K24k00J35j84J15Q2q5N8p1Q3n3O4j5j02p8J60r9J19o0M8j82L4
$$ -45 -17 -97 -15 -105 119 -81 54 -130 -15 67 -18 40 -31 52 -1 63 48 -54 -132 28 -71 48 -12 36 -146 -112
3851a12K03j42m7l3J88pq3O8J3j17rJ21J1p8P4n1Mj63Q3R6j85L25J3mk11J91j04
$$ -112 91 -51 -98 -131 57 50 -33 35 48 -69 -78 43 54 -24 50 -1 3 -160 -77 19 -166 159 172 168 -43 148 44
3878D4q1J45l6L5j58J26j45p9N7J80j54l%j48K32p3J46q4rJ63k5j19Q9p5l2O8
$$ 44 -37 108 72 107 -51 75 -70 -149 -92 88 -66 -69 -69 -217 15 -58 88 4 -5 158 133 14 103 28 -4 64
3904F4p8J45k32J00R5p9m7J97k54lJ9p7J47Q1o3n5J12k05L11k89k7R6Q8J1LN9
$$ 64 -14 131 -101 -1 94 15 -32 165 -89 -92 -73 -150 -3 78 15 -40 72 -133 178 -111 -138 -42 46 57 60 119
3930A19M4j84J47J0j43J05Mk27K22J03j76J7n9N5k9j95J12J56j26P4N7o9p0J21
$$ 119 163 -21 126 136 -7 98 102 -125 97 200 24 41 -18 37 8 -187 -75 81 -45 29 86 17 -53 68
3954F8k2mQ0j60mk11K51J81k93K72j09r7J61j5p3j4p3K5j53J51K21j20j06pJ13
$$ 68 46 42 122 -38 -42 -253 -2 179 -114 158 49 -48 113 98 25 11 -62 -37 -190 -39 182 62 -44 -51 62
3979F2j56j62L4K28Ll8j13Q0j41K51J80j30j13K13j56m6J73m3l3m7P0j37K3M8
$$ 62 -94 -256 -222 6 9 -29 -142 -62 -203 48 228 98 -15 198 42 -4 169 126 93 46 116 -21 2 50
4003E0J01l85J37M7P1q1j9j5J30p4l7L9o6j34J80J25k6N4p8m2M1J52r5k6p8R9
$$ 50 151 -234 -97 -50 21 -60 -79 -94 36 -38 -75 -36 -102 -236 -56 69 43 97 19 -23 18 170 75 49 -29 70
4029G0j44P1K69k48q0L31r7l28K66n7j11j51K84j08p5J28j34J46o5Q0p1j13J52
$$ 70 -74 -3 266 18 -62 269 172 -156 110 53 -58 -209 75 -33 -108 20 -114 32 -33 47 -24 -137 15
4052A5K7j43oP1J22Jj65K12q5Q3np6N3j77N8O5lj62J29j83K41K4j48Q0J4Oj66
$$ 15 42 -101 -107 -36 86 87 -78 134 49 132 127 51 104 -73 -15 50 47 -115 14 -169 72 96 -52 28 42 48 -118
4079a18K0J61k14J83L2o4k2j6n8M9J84Nj32n5m3J86j59J66P3q8o0N5K1j70J28
$$ -118 -98 63 -151 32 64 0 -22 -38 -96 -47 137 142 10 -45 -88 98 -61 105 178 90 30 85 106 -64 64
4104F4q8R5k49N8J08j21L8N8J78k47J21J25j41r8L3o4J55M6j5o4l5L20n9k52j00
$$ 64 -24 71 -178 -120 -12 -133 -95 -37 141 -106 15 140 -1 -99 -66 -130 25 71 56 -8 -43 277 218 -34 -134
4129a34J68n8j02J6K09j16J3J24k35J80m4j72k7K5K39O0M1j64j94J36K3J57k53
$$ -134 34 -24 -126 -110 99 -17 -4 120 -115 65 21 -151 -178 -153 86 146 187 23 -171 -35 -12 145 -108
4152a08P2N1J33k07JJ54j78M5L5j68J35LR7m5r0J2Q1r8jJ46j11l1p2J71j56J54
$$ -108 -36 15 148 -59 -58 96 -82 -37 -2 -170 -35 -32 65 20 -70 -58 23 -75 -76 70 -41 -72 -144 27 -129 25
4178B5p5M1j12R7j02K39j14q6N1j02K15j11J21j41Q8R8j11l7R0k12J14J49j97
$$ 25 -50 -9 -121 -24 -126 113 -1 -87 -36 -138 77 -34 87 -54 34 132 21 -16 74 -138 -24 125 -72
4201g2m5K22j52m2K4K9l6J61j50J74k34O7j10K08j3L8r5o7J25P2L2q5L4Q1k47
$$ -72 -117 105 -47 -89 -65 -36 -72 89 -61 113 -121 -54 -164 44 31 69 -26 -93 32 104 136 51 85 166 -81
4226h1n9K65j11j19n4K74j71J2m1m4J73j4Kj65m0K40N3o3j30J47n5j09R4l4q4
$$ -81 -140 125 14 -105 -159 115 -56 -44 -85 -129 44 30 32 -133 -173 67 120 57 -73 74 19 -90 4 -30 -114
4251a14K12P6j23Rj11P1n3m0J84l3j37J48j11K5PN4j05%K1j18K2J80j06o3o7K81
$$ -114 98 174 51 60 -51 20 -33 -73 111 78 -59 89 -22 3 10 64 -41 -41 -20 -138 -116 64 -42 -105 -172 109
4277A09j30o9L6O3j08ML3J84q6J38j04j09m1R4K27l57L0k6oL6J26q5J6L2J42l07
$$ 109 -21 -90 -54 9 -99 -95 -62 122 36 174 70 -39 -80 14 241 -116 -86 -112 -118 -82 44 -41 -25 7 149 -158
4303a58R6J10j37Rq%K4q2J94n0o6JK35j00m9N3m5L4q5J0k14K17j5j5J93q9O8j41
$$ -158 -62 48 -89 -80 -88 -88 -64 -146 48 -2 -68 -67 168 68 19 72 27 61 -24 -14 -228 -11 -26 -41 152 63 131 -10
4331a0j10rJ79p3J58j39P3o4l1on0r3K92R1k12O3O4j20L3K5j29Q1O8k24N8N6M
$$ -10 -120 -129 50 -23 135 -4 69 5 -26 -32 -82 -175 117 208 -4 59 123 3 36 61 -68 13 81 -143 -85 -29 -25
4358b5lj27K34k5p0J2M3l2j13j26J58N9r6K81j68j65J28P0J2j57K10j72J09k5
$$ -25 -28 -155 79 54 -16 -4 39 7 -106 -232 -74 -15 -111 170 2 -163 -35 35 47 -110 100 -72 37 12
4382A2n2l3PN4K6Q6j39Q3j7j64L38r2j71J38j27j85K02m6L2j14K28j64J16J8N
$$ 12 -40 -73 -66 -12 14 100 -39 44 27 -137 201 109 -62 76 -51 -236 -34 -80 -48 -162 66 -98 18 36 41
4407D1N8j27L7j73J83rm4K91k39Q1N4k08K30k85J03K1Qq8lm1O2pJ01j16L6j14
$$ 41 99 -28 9 -164 19 10 -34 257 18 99 153 -55 175 -110 -7 14 22 -66 -69 -110 -48 -55 46 -70 -34 -148
4433a48J19m8J40j72L1J71o8m7Q3O6j36o9J96k06L3L0J06l6q9J36K8j56N9r5O9
$$ -148 -29 -77 63 -109 -78 93 25 -22 61 127 -9 -78 118 -88 -55 -25 81 45 -44 92 120 -36 23 -72 -3
4458cK5K7j26r9K26K6j31K1J26k29J00P1O2j91L3J06r7j7QR9RK6o1J39j84lM0
$$ -3 22 49 -77 -176 50 76 -55 -34 92 -137 -37 34 96 -95 -62 44 -53 -70 -62 37 46 72 11 150 -34 -37 3
4485COJ20j25J31K8l9o5L7r3J70q3o6j0Q2k33L3J80o2j93L03j73P7K3j40N3K3
$$ 3 9 129 4 135 163 124 59 96 3 173 90 24 14 96 -137 -104 76 14 -179 124 -49 28 51 -89 -36 -13
4511a3K5pM3j03R4j3j12M5K29k52J07p7Q0o4j93K09l3K08j63j68J91j54J20k25
$$ -13 12 5 48 -55 39 26 -86 -41 188 -64 43 -34 46 -18 -211 -2 -35 173 10 -158 33 -121 -1 -226
4535b26K08L1p1j72J25L4P5P1okrL7n9q8J5k2J23J7L8k14l1J50O2j36j52L96j98
$$ -226 -18 13 -58 -230 -105 -71 4 75 69 67 58 95 36 -52 -37 -59 64 81 119 -95 -126 24 86 -50 -202 194 -4
4562dj13nl7K05K5j05J21m0j1q2J20n9q0kM5oJ83j31j40J95J23r8k14J00q9L8
$$ -4 -117 -122 -159 46 71 -34 87 47 36 -46 74 15 -65 -67 -22 -28 155 24 -116 79 202 104 -110 -10 -99 -61
4588f1J77j67L6j79K20ro4J43j67j2j68K28rj26K9L06l07P5P6k9O8K3o5o4Q1N1
$$ -61 116 -51 -15 -194 26 17 -47 96 -71 -83 -251 -23 -32 -158 -129 177 -130 -55 21 -8 60 83 18 -46 35 86
4614H6n4p9N0O1m0j82J36m1Ok3Q2N4j15o1J5lK12k01K3J43j69L4J67r4j05Q5l2
$$ 86 32 -47 3 64 24 -158 -22 -63 -57 -80 2 56 -59 -120 -105 -108 104 -97 -74 69 -100 -66 101 7 -98 -13 -45
4641d5J54j49N4N4p4PR3p2J2j65R3QJ45j17q5J30o8R6n4o2O7j63J12m3K02o4m6
$$ -45 109 -40 14 68 -6 1 94 22 34 -131 -38 -30 115 -2 -87 43 -25 71 17 -45 22 -141 -29 -72 130 66 20
4668B0L2p7J56j06o6J10j93Q1J3O5j10R2k0J63k90J77K0o7PO6j74k0K56r5o7M6
$$ 20 52 -25 131 25 -41 69 -124 -43 -30 35 -75 17 -3 160 -130 47 67 0 7 73 -101 -121 135 40 -27 19
4694A9O5j68L4K18j40j59J25O6Kk0rJ90j97k10K04N2J05j17r7Q9P4o0j82M2j1
$$ 19 84 -84 -50 168 28 -131 -6 60 62 42 33 223 26 -184 20 72 177 60 -37 52 126 66 -116 -74 -85
4719h5N9l3j82M08k22n5K91j15q7j39K35l6o9L0O4r7L7j55K12r6m0J92k55K13
$$ -85 -26 -59 -241 167 -55 -110 181 66 -21 -160 75 39 -30 0 64 -33 4 -151 61 -35 -75 117 -138 75
4743G5O9q4J34j11%j65k7R7kj61K83j68O1k97L08PL3J7J1j81J30%j04O5j50J39
$$ 75 144 60 194 83 83 -82 -109 -12 -14 -175 108 -60 1 -296 12 19 52 69 80 -101 29 29 -75 -10 -160 -21
4769b1K8P8J4j57O3J61j25Qpl3l8j01K38m4j21KJ23p1Pm1Q4j17n8J63j19J52J4
$$ -21 7 85 99 -58 5 166 41 49 42 9 -29 -130 108 64 -57 -55 68 -3 4 -37 47 -70 -128 35 -84 68 82
4796H2n9m6M4Q9k14K38k61L40k09r8O2m1j22K94J2q2j7J48k59K18k90J28n7j0
$$ 82 23 -23 21 110 -104 134 -127 213 4 -94 -32 -73 -195 99 111 29 12 160 -99 119 -171 -43 -100 -110
4820a10J33j64k4J82R0j59L4N7m6p7J45Mj66j5J12k5j29L05k21l1K50o4O8j8N8
$$ -110 23 -141 -165 17 107 -52 -18 39 -7 -84 61 65 -101 -116 -4 -29 -158 147 -74 -105 145 81 149 131 189
4845A89j14j28L6kn3L2m9O9j70J19J34p8p5K8M5Qo5J74P6j98k0K5o8M4q2N5J12
$$ 189 75 -53 -17 -19 -72 -40 -89 -20 -190 -71 63 -15 -90 -62 -17 -9 -74 100 176 -22 -42 -17 -85 -41 -123 -68 44
4872D4k7J18j34O1J0j60J2J96j73Q0q5J42l5m6o9J01j1p8J10r2k28K42O7J20n0
$$ 44 17 135 1 62 72 -88 -76 120 -53 27 -58 84 49 3 -66 35 24 -54 56 -36 -264 -22 45 165 115
4897A15j58l9m6J19J43k1n1J10k08J47p0j52K1o1K27j4j6l1j03P6M1n4m4K91l26
$$ 115 -43 -82 -128 -9 134 113 62 172 -36 111 41 -111 -90 -151 76 62 46 15 -88 -12 29 -25 -69 222 -104
4922a04J71j55N2J1qP6j69Q7J16j27R1K5j18Q8Q6o2j13o4K86j49k8J19j22n8J49
$$ -104 67 -88 -36 -25 -33 43 -126 -39 77 -50 41 66 -52 36 122 60 -53 -117 169 20 -8 111 -11 -69 80
4947H0J3k13k1J39L4Kj44J53j39RK83q5q6O8Ro9p1o7J7R8r9K12j25q3J84j85p3
$$ 80 93 -120 -141 -2 32 34 -110 43 -96 -87 196 111 25 93 102 33 -38 -105 -88 10 -89 123 -2 -85 99 -86 -159
4974a59K03q3K07j83R1rk5k7n3P4j34K07j44o3J02O0j09k7K14j17N2M3j49Q5N7
$$ -159 44 -39 168 -15 76 67 42 15 -38 36 -98 109 -35 -98 4 64 -45 -72 142 25 77 120 -29 56 113
4999A13j02pm1J30l6j13L2M6j5q8K23n2j0j6n8r8J40k0L3j47J59n8k8k5j18P7
$$ 113 11 4 -37 93 57 -56 -24 22 7 -81 142 90 80 64 6 -92 48 28 61 -86 73 15 -13 -38 -156 -79
5025g9R0K7P0j08j02j27K22j17K55p9l9j65K76j07o1M7k2k7m3J95l8q7j92N2O3
$$ -79 11 38 108 0 -102 -229 -7 -124 131 52 13 -152 124 17 -44 3 -19 -46 -89 106 68 -19 -211 -159 -96
5050i6J92j94J41J5k18K26j72J11L3j03L0J82rj41p1J3K30m0j42J54k78K12j29
$$ -96 96 -98 43 58 -160 66 -106 5 38 -65 -35 147 138 -3 -74 -61 169 129 -13 141 -137 75 -54
5073e4O9P8mM9j37N4j68K42j25N6J05k02L6j9J34p7M4J11j57J9j11J79j64J39
$$ -54 15 93 89 138 1 55 -113 129 4 60 165 -37 -1 -20 114 37 81 192 35 54 -57 122 -42 97
5097I7q7pO5j32J60p6j08NJ89j25j40J39%j48O0J92l76K01R7M3k22J06J33j96
$$ 97 10 3 68 -64 96 20 -88 -83 106 -19 -159 -20 -20 -168 -108 84 -292 -91 6 49 -173 -67 66 -130
5121a30O5R9J31k20O0k0J37p9M7qj45J07j32J6J99p0k1o9LJ99l05K1J72n8l5O0
$$ -130 -65 34 165 -55 5 -15 122 43 90 82 -63 44 -88 -72 127 57 36 -33 -30 169 -136 -115 57 -1 -36 24
5147B4Kj03J14N7p6J63k12Qm0JK16l8j40Q3l9J27j47r1J32l4O1j15J11m8k17J41
$$ 24 26 -77 37 94 18 181 -31 -23 -63 -62 154 116 -24 59 20 147 0 -91 41 7 68 -47 64 16 -201 -60
5173f0kJ14K9j78j2L0K54k55J28j28J15j62L60j02j66nj33K02l5Q3O9k33L5N8
$$ -60 -62 52 81 -97 -109 -79 175 -80 48 -80 35 -127 233 131 -35 -40 -173 29 -6 77 146 -87 -52 6
5197Fj13J55L9j42p7R9R1J6k67J68Q6j24k7LQ0p0J6K68n4l00R1K9j74J89l9l0
$$ 6 -107 48 87 -55 -132 -33 58 74 -193 -25 61 -63 -90 -87 -7 -77 -61 207 153 -147 -56 -27 -201 -12 -51 -81
5223h1j7J22q0O0J49k40K70j69n2Q3Pp1l3K05j04l00K98p5j3J01j58J54j57J79
$$ -81 -98 24 -56 4 153 -87 183 14 -38 45 52 -19 -52 153 49 -251 47 -28 -41 60 -98 56 -101 78
5247G8q7N0J05j78K9J24r3J18k03L0n1J5K40m4l03L39K5k17R4j28N8L0r6OP2j47
$$ 78 -9 41 146 -32 -3 121 28 146 -57 -27 -78 -63 177 133 -170 169 194 -23 71 -57 1 31 -65 -59 13 -134
5273a34R5Q1k8j77p8J42l1J37M4j02K9J58j28NJ25j97Q6l8K05k23Jk4M0o1n8J91
$$ -134 -39 42 14 -163 -241 -99 -130 7 51 -51 -22 136 8 13 138 -59 27 -11 194 -29 -28 -52 -12 -73 -131 60
5299F0j31J75k55O0J21k47Q3K17k29R4Q3j56K3J55j44L7L3m5L9N7O8J5k19J98
$$ 60 -71 104 -151 -91 30 -217 -134 83 -146 -52 31 -125 -102 53 -91 -54 -21 -66 -27 30 98 113 -106 92
5323I2j54p9J13J52j68q2K51j13J9j57J90J28l22JL24l32J1R2j8k1m0R2Q8N0j09
$$ 92 -62 -141 -28 124 -44 -126 125 12 31 -126 64 192 -130 -129 195 -137 -126 -34 -52 -73 -113 -21 67 117 8
5348HN2j53K2J74o6j26K08k04R3j17pJ86p0O8j61J33M0Qm4j00J65l33J64j75K93
$$ 8 60 -93 -71 103 37 -89 119 -85 8 -109 -116 70 0 68 -93 40 80 88 44 -56 109 -224 -60 -235 58
5373E8j21m3J16j31p7J40J13j41O9J06q0k61K05L8kK04j56Rl1J55n2o1K0n5j98
$$ 58 -63 -106 10 -121 -198 -58 55 -86 -17 89 9 -252 -47 -9 -11 193 37 46 15 170 118 57 77 22 -176
5398a76J75J81k52j4j38J20R3K8k8M1o8Lm4N9J9r5J17o0o7J92J23l07J50j31o
$$ -176 -1 180 -72 -86 -224 -104 -11 17 -11 30 -38 -35 -79 -20 -1 -96 21 -39 -106 86 209 -98 52 -79 -85
5423h5J75q7n5M0QPm3Q4j22J03q4J62j66J9O5m3r9J8m8K61j33j9N0mK4JL6j91
$$ -85 90 3 -52 -12 -4 3 -40 44 -78 25 -59 103 -63 -44 21 -22 -121 -103 -151 110 -23 -42 8 4 28 29 65 -126
5451a26K76k9L5k24N8R3k98P2L92j20j90J2K12k38P8k2PL1k87L18Lk92J97L7O0
$$ -126 150 121 156 -68 -10 83 -215 -143 249 129 -61 -49 163 -75 3 -19 -12 19 -268 50 53 -239 -42 -5 55
5476E5o4o1J25j1L7k9lO1l7o1l5J6Nr0J16Oj48J66q2O7p1n8J11j11J76k63J14
$$ 55 -9 -70 55 44 81 52 49 110 73 12 -23 -7 -2 -92 24 30 -118 48 -34 33 -38 -96 15 -96 80 -183 -69
5503f9l6R8O3m7NJ66j72ln5J34q3j75K29R5j28K7J0k11K89K2J2k67J83N6j11J4
$$ -69 -105 -7 56 9 14 180 8 5 -50 84 1 -174 55 150 22 49 59 -152 137 159 171 -96 87 143 32 46
5529D6n1N7j02r6M2o2L6%J26KM8mm2K2K8n2K4r5Q9Q1r2K1m3P4R4n7k3l34L80o4
$$ 46 -5 52 -50 -146 -104 -166 -130 -130 -4 -2 46 42 0 22 50 -2 22 -73 16 97 5 26 -17 57 151 94 71 -263 117 53
5559E3J54k97j02J71p8J89j77M2j0Q6m9j78K34m5P0L1m9q2J04MM5j92L0L8L1l
$$ 53 207 -90 -192 -21 -99 90 -87 -45 -55 31 -18 -196 38 -7 63 94 45 -37 67 71 116 -76 -46 -8 23 20
5585B0l0N9n9P1j69J8K36j71O9k05N7k8M9J20j09J76l06K16J26q0o2J2n2P6m2
$$ 20 -10 49 -10 61 -108 -90 146 -25 44 -161 -104 -132 -83 37 -72 104 -202 14 140 60 -2 10 -42 34 -8
5610hM9l0Q4o6m1r0J0R7Q7r6j1l4N0P1R3o3j84K18j19j70pJ02r9K20j19L8k2l
$$ -8 41 11 95 29 -12 -102 -92 5 92 -4 -15 -49 1 72 165 102 -82 136 17 -153 -160 -58 -157 63 -56 -18 -40 -43
5638d3J54j5j17K4pk7M2O5Q7j81P4Q2j56k39J96O4K5j32O4J23o7N8o0O0J18k48
$$ -43 111 96 -21 3 -4 -31 11 76 163 -18 56 138 -18 -257 -61 3 28 -104 -40 83 16 74 14 74 192 -56
5664e6j50K5n6L24M3k71J56j0n3m1Q6q7L4P6R8p9k2K5J4r2R9j19k7L6k5N7k4J50
$$ -56 -206 -181 -237 87 130 -141 15 5 -48 -89 -3 -90 -56 20 118 39 17 42 56 -36 63 -56 -83 -47 -72 -15 -39 111
5692A11O2k86J29R3k24NN9j1L2L03k54k34K14P4n4j03M1O6m1J49k82K16j15K8
$$ 111 173 -113 16 109 -115 -110 -51 -62 -30 273 19 -215 -1 73 19 -84 -43 23 -18 131 -151 65 -50 -22
5716b2J30k35l8J40J81p7o8N8m6n5j2M5k2p6K62Lk34J96o4K4N4k04M3O2o6R6j08
$$ -22 108 -127 -165 -25 156 79 11 69 23 -32 -44 1 -21 -97 165 168 -66 130 66 90 144 -60 -17 45 -21 75 -33
5743c3J08r1j3Q7j16L5k3R5j72R0P8L2k20J63L3j57L0K7N9J4L3j07Q2j13J65r7
$$ -33 75 -16 -29 58 -58 -23 -46 49 -123 -33 45 77 -143 20 53 -104 -74 -47 12 26 59 -48 34 -79 86 -11
5769a1o8J49q3K17k47P9j39K77k04O8Q7l1j56Q6J2j34l6R9J2J76l18J59K8n1J56
$$ -11 -79 70 -13 204 -43 36 -103 174 -30 38 125 94 -62 24 36 -98 -134 -35 -23 153 -165 -6 22 -29 127
5794A27j29qL1j48J18r1J78k15O9q2P1n6L15l5q5k9Ol1R2o1l4l9l4pK7o4J10l0
$$ 127 -2 -10 21 -127 -9 -100 78 -137 -68 -150 -79 -135 180 145 60 31 37 6 98 37 3 -36 -70 -77 -50 -114 -4 -34
5822c4J75l62J54L0r1K09k44O0j2J47p2q2Q4P4j56J38J09L9k64J70o0Rk9p4P9
$$ -34 141 -221 -67 -37 -128 81 -163 -103 -115 32 -40 -122 -38 36 -120 18 127 166 -98 72 12 21 -8 -82 -3
5847cJ4K4q9J06Mk5L1j79l7J44J20r8p7M8q3j54L84J43k89K07j37k3N1j67K28
$$ -3 11 35 -54 52 56 31 62 -117 -154 -10 110 12 -65 -17 -100 -254 130 273 -16 191 54 31 82 -85 143
5872A43k80J29K07j46K0K7j9k15J81j07K9o0K5J33q5N7o2m3J34n4K2p3J72j55
$$ 143 -137 -8 199 53 73 100 81 -134 47 -60 -31 -91 -66 67 -18 39 -23 -66 68 14 36 -37 135 -20
5896b0j11J87r3J07o7Q7j24P3j18p5L52l73J94r3L8k5P3j12J02p5R6j18j4K82
$$ -20 -131 56 -37 70 3 90 -34 39 -79 -154 198 -175 19 -74 -36 -61 12 -100 2 -73 23 -95 -109 173
5920A73n5j64R3o3J1J37j26K3O9j00j9J09k57L03k29R3n9J30l7l6QK1j11P9O1
$$ 173 118 -46 47 -16 -5 132 6 29 98 -2 -21 88 -169 134 -95 -2 -61 69 32 -4 4 25 -86 -7 54
5945E4j99N4o6N6J41j38J45j81Q3L7j00oJ32J9n8M7OL5j33K21j45m3J56j42J1
$$ 54 -145 -91 -157 -101 40 -98 47 -134 -51 -14 -114 -120 12 31 -27 20 26 61 -72 149 4 -39 117 -25 -14
5970a4Qo8J06P2j38OJ08m4m7J55k07N7Q4L4k75J53J4q3J12r6O3j54K77j03o9p3
$$ -14 -6 -74 32 104 -34 -28 80 36 -11 144 -63 -6 78 112 -163 -10 4 -79 33 -63 0 -154 123 20 -49 -122
5996a22K85j61n6LJ34k49K41N9j44rJ01j36J64j57M0P5k36L6J08j29N3MJ56j18
$$ -122 163 2 -54 -51 83 -166 75 134 -10 -19 82 -54 110 -47 -7 68 -168 -132 -24 -153 -100 -96 60 -58
6020e8Q9l8O7k84J85J13k05J64R5Oj11L0o3lN9M9n9j77J44P6m4M8j07Q9n9j8o1
$$ -58 31 -7 60 -224 -39 74 -131 33 128 134 23 53 -10 -13 46 95 36 -141 3 79 35 83 -24 65 6 -12 -73
6047g3R3j01Q6ql8qM4J1j2j79J25J34j02J64j53K16j85L4L2l7R1j11j23K76k17
$$ -73 20 -81 5 -3 -41 -49 -5 6 -6 -185 -60 74 -28 136 -17 199 14 48 80 43 134 23 -100 176 -41
6072d1J83k22J31j4l2J26k35L3m2K24k53J26j67J18J32q5j26K08j11J43J0r2j68
$$ -41 142 -80 51 37 5 131 -104 -71 -113 111 -142 -16 -183 -65 67 -18 -144 64 -47 96 106 14 -154
6095a54J15Q7m7M4M7j29J60p4J6M5O2j7k70K39r4m9L6j6m1J9J68k01J12j5J10
$$ -154 -39 48 1 45 92 -37 123 49 65 110 172 155 -115 124 30 -19 17 1 -40 -21 147 -54 58 43 153
6120A53j54p5O2K6l9p4P2rJ12Rj98R5n5J17O4k30J76P3r9P2k53J08J98R6l08J0
$$ 153 -1 -76 -14 12 -27 -101 -29 -38 74 83 -115 -20 -75 42 106 -124 52 125 26 98 -155 -47 151 247 -61 -51
6146e1%j76K39j66K67p8qK13l16N4M9r3K5p8R4L4j90K02K21k15O4k8o3j6j98L20
$$ -51 -51 -227 12 -154 113 35 27 240 -76 -22 27 -66 -41 -119 -25 9 -181 21 242 27 91 63 0 -16 -214 106
6172A06j0o4j02qk7J18q0O7J25l06J13J19r6N1j03J80k23J18J04qnL2J9j65J97
$$ 106 96 32 -70 -78 -105 13 -67 0 125 -181 -68 51 -45 6 -97 83 -140 -22 82 74 69 101 120 -45 152
6197A52k0k56J27l5Q5l4p4O4N8j05J13p5j28J25l7P9o9p6L0n5J74p6K7n2J70j45
$$ 152 132 -124 3 -32 53 19 -55 9 67 -38 75 0 -128 -3 -40 39 -30 -106 -76 -131 43 -33 -6 -58 112 -33
6223c3nL4N8L8k12J34L5l0j5R9Pj90J66o0j46J16N8p2j20L3R9nj32J43j88J38
$$ -33 -38 -4 54 92 -120 14 49 19 4 103 110 -80 86 26 -120 -4 54 -18 -138 -105 -6 -11 -143 0 -188 -50
6249e0J35P1k50R3M4j65J04M0j90P1J01J73k48J35Oq6P6J2n5L8l4k1Ok14K27q4
$$ -50 85 156 -94 -1 43 -122 -18 22 -168 -97 4 177 -71 64 70 -16 60 72 17 55 21 0 6 -208 19 -65
6275f5J40n6J14o8j87J64n3q8R9p8K09o1o7j7l6j04L91l45Q3M2Q9j01p4J32o3
$$ -65 75 19 133 65 -122 42 -11 -99 0 -78 131 70 3 -14 -50 -154 237 -108 -25 17 106 5 -69 63 0
6300@Mj07q8J30J3o8k3J67n2J41k46J43L2J9j39R5j2J6r2J17J85k83J30r5J48
$$ 0 4 -103 -191 -61 -48 -116 -139 28 -24 117 -129 14 46 65 -74 21 9 25 -67 50 235 -48 82 -13 135
6325A35j07j39O2J87j27P6jmpq4K4j2N4j0M2k58K29j18j84J86j44J58P6Nn1K4
$$ 135 28 -111 -49 138 11 87 86 82 75 -9 15 3 57 47 89 -169 60 -58 -242 -56 -200 -42 34 39 -12 12
6351A2K3R2j07O9P2q3p1J0j3j07J99m1m6K1j09K50l64J44P1L0R0j42Q7L4l6j12
$$ 12 35 127 20 89 161 78 7 17 4 -103 96 55 9 30 -79 171 -193 -49 22 52 142 0 87 121 85 -27
6377b7N2j8M1j04O4L4M4k28K09Pm2m3R9q2k26J02L17j14jJ0n8q2J61j74L9J2k15
$$ -27 25 7 48 -56 8 42 86 -142 67 74 32 -11 88 6 -220 -118 199 85 84 94 36 -46 115 -59 -20 -8 -223
6404b23K50R1k48K00Rm5j1M2l06J92J28j46l7j2K61k18q4K21L3n1o6k3K3Qk2p
$$ -223 27 118 -130 70 79 34 23 65 -241 -49 79 -67 -104 -116 145 -73 -157 64 97 46 -20 -43 -20 -12 -34 -41
6430d1L5J35j66N0q1lJ97l54J68J99l05K78j21j01J53j67J16j3M0J06j41J36m2
$$ -41 -6 129 -37 13 -68 -71 126 -228 -60 139 -166 112 -9 -110 43 -124 -8 -21 19 125 -16 120 78
6453G8pN2r7J07q6j19N0J10j00N6j48R9l1J09N8q3j94K00L6k43KK24j3o5j6j14
$$ 78 71 123 26 133 47 -72 -22 88 -12 44 -104 -5 -36 73 131 48 -146 54 90 -153 -151 73 60 -5 -21 -135
6479a35P1M0J98l44K91r7K4k5m2O9K0k12K45K0k6l0j4L9n9k1q8j0%N7r2J65o1
$$ -135 -64 -24 174 -170 121 24 48 23 -19 50 70 -142 103 123 97 67 53 92 33 12 -76 -86 -86 -29 -121 44 -17
6506a7j85R1J33k2nk7l6O1r7j19L11j33n2J00k0l4J62k44rJ53K05k50l3KR6p2
$$ -17 -202 -111 22 0 -5 -32 -68 -7 -104 -223 88 -45 -97 3 -17 -51 111 -133 -142 11 216 -34 -67 -65 31 -41
6532d1L6j12J63o7j64N5J08J60j05J00j92K7j08J56M6J69j57r1j5q7K6P1O2Mj7
$$ -41 -5 -117 46 -21 -185 -130 -22 138 33 133 -59 -32 -140 16 62 231 74 -17 -32 -119 -93 -22 40 44 27
6557B7j09M5o3rQ2R1K6r2j2N2J1l9Q8j37l5J01l3K7j6J25j47l9J43j52NJ60m7
$$ 27 -82 -37 -100 -109 -27 64 90 -2 -14 38 49 10 98 -39 -74 27 -6 21 5 130 -17 -56 87 -65 -60 100 53
6584E3K3l8M4j21n3n6L0Q8j40L34j05q7J57qk36J48L8k5k41J85O5r9k5K58j82
$$ 53 76 38 82 -39 -92 -148 -118 -30 -170 164 59 -28 129 121 -115 33 71 46 -195 -10 55 -44 -69 189 7
6609Gp9N2K00k71J34L0j11J05p6J04J1j15p3K03j32K09j66Q8k60K27m5j34N6m5
$$ 7 -72 -20 180 -91 43 73 -38 67 -9 95 106 -9 -82 121 -11 198 32 120 -140 87 42 -92 -36 -81
6633h1L1j94J98O6p4J3J40j45q3K84j03OO9j06O7j05j1J58j24j24J11p1N2pJ40
$$ -81 -50 -244 -46 20 -54 -41 99 -46 -129 155 52 58 127 21 88 -17 -28 130 6 -118 -7 -78 -26 -33 107
6658A07j55L6kl5Ml0K0R6j4j03m2J60k6J60j79j70J4J4R6N9m0o2K08l8j87K02
$$ 107 -48 -12 -14 -49 -45 -75 -55 41 27 -76 -118 42 16 176 -3 -173 -159 -145 -49 10 -30 -92 116 78 -109 93
6684I3k9j53o9J41j5N5r0N7K1j33O7N3j37R6J5N7j59M2K02o8k1n0m1k3n9K83o2
$$ 93 64 -89 -158 -17 -32 23 -67 -10 11 -122 -55 -2 -139 -43 -28 29 -130 -88 114 46 25 -25 -66 -89 -148 135 73
6711G3q1MJ71j54J43n3n0Qo1j2K1P4q6R6k90J64L0j91J11J0J8O2q8l8M7J27o2
$$ 73 -8 -4 167 13 156 103 53 61 0 -12 9 83 -3 93 -197 -33 -3 -194 -83 -73 -55 7 -81 -119 -72 55 -7
6738gj67J28K6J4j4m3J04k3o3O0J03j53J14j66J72r7M6R1o0K6j27J22k86J98O4
$$ -7 -174 -46 -20 -6 -20 -63 41 18 -45 15 118 -35 79 -87 85 -12 34 125 65 91 -36 86 -200 -2 62
6763F2r9P9p4p2L9R7lJ8J77l03Qn8R6N1k4m6j0P2m7J14k1n4o5L61l64J15j92L90
$$ 62 -37 42 -32 -104 -65 32 29 47 224 -79 -71 -129 -33 18 -6 -52 -62 10 -37 77 56 2 -63 298 -66 49 -143 247
6791B47j94r9J53l09L58k82L33j35O3j11j2p7J5L7J16o7l9J18p7j8j13J45k74
$$ 247 53 -46 107 -202 156 -126 207 72 135 24 12 -65 -50 -13 103 36 -3 115 38 20 -93 52 -222
6814b22K93Q9j04j88J86k09K44M9j40k7R2p9O1J8p3m2N2J5j55K27j50N5N2q9J88
$$ -222 71 160 56 -132 54 -155 89 138 -2 -29 63 -16 45 63 -10 -52 0 15 -140 87 -63 -8 44 -45 143
6839A43q6j3q4K60j10j02M1J03k16L8k0J01j39L9Q6o3q9n8Q1Q4qm3J29L9J3M0
$$ 143 57 44 -40 220 110 8 49 152 -64 -26 -46 55 -84 -45 41 -22 -111 -169 -88 -4 -12 -55 74 113 126 166
6865A66j60kQ5p1K7K6J46j26j39J13L8j59J81O6k56L2J38p0k7q6J45q6J56j40
$$ 166 6 4 89 18 45 71 217 91 -48 65 103 -56 125 191 -65 -33 105 35 8 -78 67 -19 137 -3
6889cL6j45J80j6k03J15J79k10m1R0J34r6p4R7J8n3N1J05j24K7O3j91J1k3K10
$$ -3 33 -112 68 52 -151 -36 143 -67 -108 -18 116 20 -54 43 61 8 59 164 40 67 130 -61 -50 -73 137
6914A37j51j14K30j4j69l9j1n0J56M4R4j59rJ12P0r1j97J48MQ9j58J75j5Om4k1
$$ 137 -14 -128 102 88 -81 -120 -131 -181 -25 19 113 -46 -55 57 127 36 -161 -13 -9 80 -78 97 82 88 44 23
6940B3J85k22q9J76k9n5Q7N0k06J36j73K49p6r7K4k5R6k4J3j19L3M6Q6n0J9R1
$$ 23 208 -14 -103 73 44 -11 76 126 -80 56 -117 132 56 -41 -17 -42 54 30 43 -76 -43 3 89 39 58 149
6966A49j4j98J46m5j54q9K60j29M9j4mm3N7Pj9J23k0m2o6j38L88j35j98K00q0
$$ 149 135 -63 83 38 -116 -205 55 -74 -25 -39 -43 -86 -29 -22 -41 82 62 20 -46 -184 204 69 -129 71 -9
6991ip3R9R4j03N9L5k09O6J03j66K57k18J71m1J1j45J13j52J80J3o0l9J52M0r1
$$ -9 -82 17 111 8 67 102 -107 -41 62 -104 153 -65 106 65 76 -69 44 -108 72 85 25 -14 138 178 87
7016H7r7MJ19j99o4J30p4L1j56K12l3N7o3N3K8K10j36l1j62R5r6J01l5K9K4m7
$$ 87 -10 -6 113 -86 -150 -20 -94 -63 -219 -7 -40 17 -46 7 35 245 109 78 -84 11 -85 16 -19 10 34 -13
7042a3OK5l1LQ4M8l95K33P7K5j54N0J39o8n6nPnqJ20o8j08R4j10M9Q9l5n7M0K2
$$ -13 -7 18 -13 -10 74 122 -273 -40 37 62 -92 -42 97 29 -27 -32 -25 -30 -38 82 14 -94 0 -110 -61 28 -7 -64 -24 -2
7072bO1j22K44j36J08p2j0k19J5K68j62O6O1j28M5n3N3nk8Lp6n5J99l9m8J07j34
$$ -2 59 -63 181 45 153 81 71 -148 -133 135 -27 39 100 -28 17 -36 17 12 -16 -13 -89 -144 55 16 -32 75 -59
7099e9J1J5R2q9O8l33L69o6j25J81j12J89k30K25j08j53J72J25j76j01O5J30r0
$$ -59 -48 -33 59 -30 38 -295 74 8 -117 64 -48 141 -89 136 28 -125 47 172 -4 -105 -40 90 0
7122@j83K90p3R6k90J21J54j33J55j34QN3n2j6J83j93n6J69j56M5n2J87m0L1j38
$$ 0 -183 107 34 130 -160 -39 115 -18 137 3 11 64 12 -4 179 -14 -70 99 -57 -12 -64 123 83 114 -24
7147b4j5j75J26j6q4K94k03K09k18J49k47K71N1p8m7N4r0j6J12j00K8J04n5ko6
$$ -24 -39 -214 -88 -104 -188 106 -97 112 -106 43 -204 67 118 40 -7 47 -43 -59 53 -47 -19 85 30 28 -38
7172c8j27n3K81M8j52Q0k2lq8j46J69QK7j35R8L3j27K05j03j3O8O2j6k30L23j51
$$ -38 -165 -218 63 111 -41 39 17 14 -74 -220 -51 -43 -16 -151 -53 -20 -147 58 -45 -58 10 72 56 -174 149 -2
7198bJ58j82q7O1J23l8o5j56J73jn9M3N8L1j20m1n0M1J04k9O0LN6R5j50j19K71
$$ -2 156 -26 -113 -52 71 33 -32 -188 -15 -16 -75 -32 26 57 -63 -104 -154 -113 -9 -38 22 25 81 176 26 -93 178
7225A78k39K07j61J87j04k93K64k5j50L6O8RK6p0J12j23RJ6P8j09j5J10plq9K96
$$ 178 -61 146 -15 172 68 -225 39 14 -136 -100 -32 -23 3 -67 45 -78 -69 -53 25 -84 -99 11 4 1 -88 208
7251B08j92j51M5L2L6J78k69M9O8N2k7j3LJ2n7l5p0J14J19j13l3r3J04Mj57J24
$$ 208 16 -135 -90 -58 -22 156 -113 -64 4 56 29 16 19 31 -26 -61 -131 -17 102 -11 -44 -137 -33 -29 -186 -62
7277f2J66O3j34rQj02N2P0k40K20l7K6Mj76J48P8J5k13J82q6RJ19%j52J7p6J26
$$ -62 104 167 33 24 32 -70 -18 52 -188 32 -5 21 25 -151 -3 75 90 -123 59 -27 -18 101 101 -51 -34 -110 16
7304A6j04P4Q2J0L8k50L23k71J55J9J2n1p3o9L3J57p8N6m1N4j38J82n1J5q0Rj8
$$ 16 -88 -14 68 78 116 -134 189 -82 73 92 104 53 -20 -89 -56 101 23 79 38 92 -46 136 85 100 20 29 11
7331A1J42j60P1j89Q1LJ3J38p3n5J13j82Kj97K47L1P2n8K8k8P4r7p9J94N0O3k07
$$ 11 153 -7 64 -125 -44 -41 -28 110 37 -18 95 -87 -85 -282 -35 -4 68 10 38 10 84 -13 -92 102 152 215 8
7358HQ1n4p0nJ64q2j27J58L8j65j01J33J11p0j44M9J12rL1j09Q9m1k7J16j60J01
$$ 8 89 35 -35 -40 124 42 -85 73 111 -54 -155 -22 89 19 -125 -76 36 27 58 -51 38 -3 -30 86 -74 27
7384B7j7j09K1J80j52KM1J88k58K42j36j45K28j23J70N8k44K00p5l1r4M7q6K7
$$ 27 10 -99 -78 102 -50 -48 -7 181 -77 165 29 -116 112 -11 159 217 -27 173 98 67 -27 20 -66 -39
7408c9m1L8J88p8J08k07O0q1J36L2k23j48K67L5P4j46R3p4N0j1Q8j53q5J38j64
$$ -39 -80 -42 146 68 176 -31 29 -52 84 116 -107 -255 12 47 121 -25 68 -6 44 33 121 -32 -117 21 -143
7433a43J77K40k31Pj44o3R0P0k3N4M2oo0j25J23J24l92J79q1J41L9P8j44J3K83
$$ -143 34 274 43 50 -94 -157 -67 3 -20 34 76 70 10 -115 8 132 -260 -81 -162 -21 18 96 -48 -35 248
7458B48m78K68N3N2l31J76Mp0J06k5O9Lk62K14j6o4N7N4o8L7JQ4j07J2j47K02
$$ 248 -230 38 91 143 -188 -12 -8 -78 28 3 72 75 -187 27 11 -53 4 58 -10 27 28 112 5 17 -130 72
7484G2l9r9M8j23R5O2p4K4K74j42k19J82j16j9K10j87P4m4R1j96M2P1j7J17o4
$$ 72 33 -66 -18 -141 -46 16 -58 -34 240 98 -121 61 -55 -74 136 -51 23 -21 70 -126 -84 -13 -30 87 23
7509B3J6L6j16k6MJ38r3J4L6n9J65q0P2j52L7J5Q7l0N3j96O1l0o7J29K9j91J09
$$ 23 39 75 -41 -67 -63 75 -18 -4 32 -27 138 58 130 -22 15 30 117 87 140 -56 5 -25 -92 37 66 -125 -16
7536a6qJ2Oo3n5J82j13OJ58q3O8J7q8Qk4Pj08J0O4j4KP9P0o0J1o9l7j24K44j9
$$ -16 -24 -12 -6 -69 -124 58 -55 -49 109 26 94 111 23 31 7 14 -94 -84 -20 -34 -32 47 117 57 68 -1 -38 -162 82 63
7566F3K9j6o3n6m0O0j35Q8J03N2j80K34o8l3Kjj05N7j1kJ00op0l5kL5j1n0N9n8
$$ 63 92 76 13 -43 -83 -23 -158 -70 33 85 -95 139 71 38 40 39 -66 -9 -20 -22 78 72 2 -33 -35 0 -11 -61 -2 -60
7596f0Q3Lm4R0j32J07m7j13K07k56K55M0l0l5q7O8l4k00J44P9j08R9J6p1Q4j83
$$ -60 23 26 -18 72 -60 47 0 -113 94 -162 93 133 103 68 -19 49 15 -185 -41 38 -70 29 45 -26 58 -125
7622a25K13o0K1P9j98J7N8JM1j13%R8K20k67j5r7J04P2n8p4J14o6O2q2J10j31
$$ -125 88 28 49 128 -70 -53 5 6 47 -66 -66 32 252 -15 -30 -127 -23 49 -9 -83 31 -35 27 -55 55 -76
7648g6N5J29m4r4J8P0p4k6k1J64k72J42N6j16J78k2j47J51j82N4P8L6q7O4K1p5
$$ -76 -21 108 64 -30 -12 58 -16 -42 -63 101 -171 -29 27 -89 89 67 -80 71 -111 -57 21 57 -30 34 55 -20
7674b0J1K05j41l5j01Kp5K06j46J02J55j85L3k4l5L9jn7J62r9m2J34k14J4K6M6
$$ -20 -9 196 55 20 -81 -79 -154 52 -94 8 163 -22 11 -13 -48 -9 -10 -67 95 -4 -46 88 -126 -112 -86 -40
7700d0lq3K00o7R6j61O1j54J40J22k20O6m6J92j75n6J71j58L74l99J53J11j68
$$ -40 -43 -126 74 7 103 -58 3 -151 -11 111 -109 -43 -89 103 -72 -128 43 -115 259 -140 13 124 -44
7723d4K3M7K0J9J1j2r0n5J59j33jl2J7k9L8lJ45j12O9M2o6m8J67j45L2rq1R4j54
$$ -44 -21 26 46 65 76 64 -26 -81 78 -55 -56 -88 -71 -100 -62 -65 80 -32 37 79 13 -35 132 -13 19 10 -71 23 -131
7752a31Q8N9O6m6Q3k98R6m6J11k6J35k62K87k1j66J57j90N0J66j46P5r8O8k23
$$ -131 -43 16 82 36 119 -179 -83 -129 -18 -44 91 -171 116 95 -71 86 -104 -54 112 -34 41 -57 11 -212
7776b12J38o6J48N8n6n7J10j13ln8N5J40j30J46j61m0J0Q0j0j77K17K7k0l1k9
$$ -212 -74 -140 8 66 10 -47 63 -50 -53 -111 -56 84 -46 100 -61 -101 -91 -11 -21 -198 19 46 26 -5 -34
7801c4K0J8j67Q3R4m0j24K69n2n0P9j10j01J63m2l6J25K9j62N7J27j48j11R9J48
$$ -34 -14 4 -163 -80 14 -26 -150 119 67 17 96 -14 -115 48 6 -30 95 124 -38 19 146 -2 -113 -14 134
7826A34k43J28l22L31n9K0P7p5n9N6J8j20K82k95J36J23j75L1l5J8m2J23r4N5
$$ 134 -109 19 -303 28 -31 -11 66 -9 -68 -12 6 -114 168 -127 9 132 -43 -12 -47 -29 -71 52 -42 13
7850A3n5J14n5J95j59r7q0J94j40O0n1J53j49kP3L5r5m3J28j15J23qJ08j26J7
$$ 13 -42 72 17 212 53 -44 -124 70 -70 -10 -61 92 -57 -59 14 49 -46 -89 39 -76 47 39 147 21 38
7875C8p9N7m4K1o8M0K6o9J00J05j67R0p5J98k86J45p8J44K7k71K1M6PK91j89M5
$$ 38 -41 16 -28 -7 -75 -35 -9 -78 22 127 -40 50 -25 173 -113 32 -46 98 125 -146 -125 -79 -72 219 30 75
7901G5q2P3j84K32k57P6J14j2L9l7j46K17Nl2q6J03j21l3J14j45J9j17L34l78
$$ 75 -7 66 -118 114 -143 -67 47 35 74 37 -109 108 113 81 -5 98 -23 -56 58 -87 -68 -185 149 -229
7925b29L18j02lJ1j73K69n5p6r7J61nQ6M3m4j99Q2lL7j3j01K39q2J28j40k8j33
$$ -229 89 -13 -16 -5 -178 91 36 -40 -137 24 19 105 148 104 -95 -13 -16 21 8 -93 146 64 192 52 24 -109
7951a09J01J59p9j49J51k46L4R8J3o1Q4j82J83Q7k33J77k16P3N1L5l6n8J27n6
$$ -109 -8 151 72 -77 74 -172 -138 -40 -27 -88 -4 -186 -3 84 -149 28 -188 -115 -64 -29 -65 -123 4 -52
7975e2K02k93K97q8j46J98o5o6j18J42m4J30j98K6J24n1j51J1K45l0O4n6j32j5
$$ -52 150 -143 154 66 -80 118 53 -13 -131 11 -33 97 -101 -75 49 -2 -153 -142 103 73 137 81 -51 -66
7999f6Q0p0K87k51l7N9l1l8J84J1p9j11J32k4j42J61n6L8m4J8l7k15L17j1K4m1
$$ -66 14 -56 231 -20 -57 2 -29 -67 117 128 49 -62 70 46 -96 65 9 47 3 21 -16 -231 86 75 99 58
8025E8nO2j18j9r7J88r5L7J34j55m4j12J35Nl4J10Q7j28M3K2j50J38j08L7oq2
$$ 58 53 115 -3 -22 -119 69 -26 11 145 -10 -54 -166 -31 -26 -60 50 137 9 52 74 -76 62 -46 -9 -15 -97
8051i7R2k9q9J02N7j79J04J48q0l3P7j76J92n2o0M5j33J17j68K44R8j06j43J31
$$ -97 -5 -34 -123 -21 36 -143 -39 109 29 -4 73 -103 89 37 -23 22 -111 6 -162 82 180 74 -69 62
8075F2m0O5j32k0O1j7P8n7m2J04q8Nj78J94j11J34j23K1O8K4j07R4J09k47K54
$$ 62 22 87 -45 -65 -4 -21 57 0 -42 62 -26 -21 -199 -5 -116 18 -105 -84 -16 8 -99 -5 104 -143 111
8100A11j09o9J59K4j68M6k9J60k8j50P5K3q5J56Pk74O8Q1Nj56L9L2J39n7j01R0
$$ 111 2 -67 92 116 -52 -6 -35 125 97 -53 22 45 -40 116 123 -151 -83 -2 3 -153 -114 -82 57 0 -101 -11
8126a1R4j76P7O5j94K19n5k6J17j09K1J58p0k51L34r0q3n1j3Q1k47L20j26J2M6
$$ -11 83 -93 -16 49 -145 74 19 -7 110 1 22 180 110 -141 193 103 20 -31 -44 37 -210 110 -16 -4 42
8151D2j41J06J7j18J36j08pQ0J3j12KK24k45J82Kq0j92J32M5M5K8m8R2K7l0q2
$$ 42 -99 7 24 -94 42 -66 -73 7 20 -92 -90 134 -111 71 73 -7 -199 -67 -22 23 51 3 95 122 92 10
8177A0K1n4m5M3K00k61J48m5P4q7L8k11J69J7
$$ 10 31 -23 -68 -25 175 -86 62 17 91 4 42 -169 0 17
8191A7
$$ Imaginary data points
##PAGE= N=2
##DATA TABLE= (X++(I..I)), XYDATA
0@%%%%%%%%%%%%%%%%%%%%%%%oJ4j6J6j6J6j6K1k8L1l2L8m5M9n6O2p0P8q6R7j06
$$ 0 0 0 0 0 0 0 0 0 0 0 0 0 0 0 0 0 0 0 0 0 0 0 0 -6 8 -8 8 -8 8 -8 13 -15 16 -16 22 -23 26 -30 32 -38 40 -46 51 -55
44e5J18j31J44j60J76j93K14k36K60k87L16l49L87m29M76n31N93o69P62q74J019
$$ -55 63 -68 76 -84 92 -101 113 -123 137 -150 166 -183 204 -225 251 -280 313 -356 406 -468 551
65E51j209J467j839K397m573M2511l2923n0552N5290J8460n0802M434L9544k6031
$$ 551 -658 809 -1030 1367 -3206 39305 6382 -44170 11120 29580 -21222 -16788 22756 -3275
79c275j6978L0503n293k5645K5455J0330l2076R230L3281k4677k1434L5191Q823
$$ -3275 -20253 10250 4957 -20688 4767 15097 -16979 -7749 25532 855 -20579 14612 23435
92B3435l7717M895L0652j5827k2136J9267Q754j9085J51J4798p341q444R837L626
$$ 23435 -14282 -9387 21265 5438 -16698 2569 11323 -7762 -7611 7187 -154 -8598 1239 4865
106D865r769M86P319k823n300L668K927m434r02N629k29m776L382N395m314j984
$$ 4865 -4904 -4418 2901 78 -5222 -1554 1373 -3061 -3963 1666 1437 -3339 43 5438 1124 -860
122h60N758r90m879M752J750q896J658R327p314q775J0151M655j2307m25J1135
$$ -860 4898 3908 -971 3781 5531 -3365 -1707 7620 306 -8469 1682 6337 -5970 -6395 4740
137D740l656q293N396M907n353k021L352J101p8j400j994L930L995n215l143P546
$$ 4740 1084 -7209 -1813 3094 -2259 -4280 -928 173 95 -1305 -3299 631 4626 -589 -3732 3814
153C814K038p304M08N909k238l157J860K53j006O74j577j155L016j462m306L249
$$ 3814 5852 -1452 -1044 4865 2627 -530 1330 1583 577 1251 -326 -1481 1535 73 -4233 -984
169i84L062n749j080O287j650n243M837K931n817J408N907l794l511O099J349
$$ -984 2078 -3671 -4751 1536 -114 -5357 -520 2411 -3406 -1998 3909 115 -3396 2703 4052
184D052n733J005M382j797k172J403N00k88N92j683o26K642n33m187J189L528
$$ 4052 -1681 -676 3706 1909 -263 1140 1640 1352 1944 261 -365 2277 1744 -2443 -1254 2274
200B274l422l323K980K513l397k102L251K650k468k179L026L723l061l520M416
$$ 2274 -1148 -4471 -1491 1022 -2375 -4477 -1226 1424 -1044 -3223 -197 3526 465 -3055 1361
215A361K816m876j572N181K39m407J048L243j606j403J192j51k23L79j676j160
$$ 1361 4177 -699 -2271 2910 3149 -1258 -210 3033 1427 24 1216 1065 842 1221 -455 -1615
231a615K691q17l833J278L401l176k394L784J913l849L87L910p42k693K060K417
$$ -1615 1076 259 -3574 -2296 1105 -2071 -4465 -681 1232 -2617 -2230 1680 938 -1755 305 2722
247B722k429j448K859M19k655J62K822o74k836J978K028k535j398K679m79l023
$$ 2722 293 -1155 1704 2123 -532 -370 2452 1778 -1058 920 2948 413 -985 1694 1215 -1808
263a808J266J076k887L21K077k231j205M074o65m366L902M219n884j590P768p24
$$ -1808 -542 534 -2353 -2032 45 -2186 -3391 683 18 -4348 -446 3773 -2111 -3701 4067 3343
279C343p567M154N760o024k842O551p1n511K791L181m074l97L494k337k400L520
$$ 3343 -4224 -70 5690 -334 -3176 3375 3304 -2207 584 3765 -309 -706 2788 451 -1949 1571
295A571m01m528K257K934m362j500M785p6m283J488M036k573k025L402J092k520
$$ 1571 1170 -3358 -1101 1833 -2529 -4029 756 680 -3603 -2115 1921 -652 -2677 725 1817 -703
311g03KK801q16j946J613J427k054n36K177j19k326J118J528k116j319K538n55
$$ -703 -701 2100 1284 -662 951 2378 324 -212 1965 1846 -480 638 2166 50 -1269 1269 714
328G14l013J343J882k782r95L009o71k509K484J454k997N55L539j705k538L353
$$ 714 -2299 -956 926 -1856 -2851 158 -513 -3022 -538 916 -2081 -1526 2013 308 -2230 1123
344A123J461l773P26L454j750k376K602J217k750j44K193q01j759P08P63j492
$$ 1123 2584 -1189 -463 2991 1241 -1135 1467 2684 -66 -210 1983 1182 -577 131 894 -598
360e98m41P41l32o65K54L39o24J4P08J90j160R48J424r65q61J981O72k373P55
$$ -598 -1039 -298 -630 -1295 -1041 -702 -1326 -1312 -604 -414 -1574 -626 798 -167 -1028 953 1625 -748 7
379GK664j636k122L037Q30l345M68K974k249k173K700N72l577R14K341k696j397
$$ 7 2671 1035 -1087 1950 2780 -565 -97 2877 628 -1545 1155 1727 -1850 -936 1405 -1291 -2688
396b688K947m60k689J949J900k979P9L208j109k100K380J301k436R3K845j268
$$ -2688 259 -201 -2890 -941 959 -2020 -1941 1267 158 -1942 438 1739 -697 -604 2241 973
412I73j766K234P81k263J77K164j548j362J324P36k061k48J382p72j326P99M52
$$ 973 -793 1441 2222 -41 136 2300 752 -610 714 1450 -611 -859 523 -249 -1575 -776 -324
429c24q46l22P42l6o20P03M87n58K68P66r8n1M11N13n99NR73l1j131N69P50p23
$$ -324 -1170 -1492 -750 -786 -1406 -703 -216 -774 -506 260 162 111 522 1035 436 441 1414 1383 252 821 1571 848
451H48r99O06N32j112q49J110K68j534l4R66l74j032N51Q80j024K8J005l39l41
$$ 848 -151 455 987 -125 -974 136 404 -1130 -1164 -198 -572 -1604 -1053 -173 -1197 -1169 -164 -503 -844
470h44J137K14j039O27J393q51q75J596M66j946N47J663j412j133J364L06k059
$$ -844 293 507 -532 95 1488 637 -238 1358 1824 -122 425 2088 676 -457 907 1213 -846
487h46J35J617j298j220J445K36j829N71J369j287r05J807K32j692R69J718j154
$$ -846 -711 906 -392 -1612 -167 69 -1760 -1189 180 -1107 -2012 -205 27 -1665 -696 1022 -132
504a32q18K025L46j597L60J862j338j098J936L81k237L47J819j556j356J774K58
$$ -132 -950 1075 1421 -176 184 2046 708 -390 1546 1927 -310 37 1856 300 -1056 718 976
521I76k287K62J837j271j735K037M57k216M76K222j403j490K297O53k102P42K414
$$ 976 -1311 -1049 788 -483 -2218 -181 276 -1940 -1464 758 -645 -2135 162 815 -1287 -545 1869
538A869j707q98K338L50k429J097J916k015j213K270k06k139O00J663j766j148
$$ 1869 162 -736 1602 1952 -477 620 2536 521 -692 1578 1372 -767 -167 1496 -270 -1418
554a418J668J14k016P57J438j456r61J646J39j541P94J337r31p05J719L65j427
$$ -1418 250 364 -1652 -895 543 -913 -1874 -228 -89 -1630 -836 501 -430 -1135 584 949 -478
571d78O12J705j125q65J375M61j563J4J411r85j388J318M05j643k86J655r36j155
$$ -478 134 1839 714 -151 1224 1685 122 136 1547 562 -826 492 897 -746 -1032 623 -313 -1468
589a468J091N75j725J84J493o83j225J540O48j421OJ934n95q95J280O27j309J72
$$ -1468 -377 198 -1527 -1343 150 -533 -1758 -218 430 -991 -985 949 354 -541 739 1366 57 229
607B29J439o57j136J102O22j749l6J279q15r56M73N33j324k12J129l06j040O41
$$ 229 1668 1011 -125 977 1599 -150 -186 1093 278 -678 -205 328 -996 -1208 -79 -385 -1425 -784
625g84R79j196m81J429J30j170M32J394o38p55J563K07j194M40J431j091r85J614
$$ -784 195 -1001 -1482 -53 77 -1093 -661 733 95 -660 903 1110 -84 356 1787 696 -289 1325
643A325M4j551L46J418j453j270J808rk253N59J706j444j008J527L93j865O58
$$ 1325 1369 -182 164 1582 129 -1141 667 658 -1595 -1036 670 -774 -1782 -255 138 -1727 -1069
660a069J729j474p10K082Q9j772J032J775j488q60K064j08j603N40J765j560j033
$$ -1069 660 -814 -1524 558 647 -1125 -93 1682 194 -666 1398 1290 -313 227 1992 432 -601
677f01J839j54j940P82J169j573n97J450k5k118Q92J355j269q02J480N1j347O65
$$ -601 1238 1084 -856 -74 1095 -478 -1075 375 350 -1768 -876 479 -790 -1592 -112 -61 -1408 -743
695g43J527j263l10J509%j285Q50J535j537n66J599R6j667N44J195j302p04J114
$$ -743 784 -479 -789 720 720 -565 285 1820 283 -283 1316 1412 -255 289 1484 182 -522 592
713E92o6j309L34Q10j061p61J331o6j218K36J355p52o79J109L32q99K90J191n13
$$ 592 526 -783 -449 361 -700 -1461 -130 -196 -1414 -1178 177 -575 -1254 -145 187 -712 -422 769 256
732B56o13R45N77j108J37J211m96j115J097K02j059k99J049n06j077P29O89j612
$$ 256 -357 588 1165 57 194 1405 909 -206 891 1093 34 -265 784 278 -799 -70 619 -993
750i93n0J314q21r80J107M43j031m0J378l60j150J311O89j142k4J481j81j269
$$ -993 -1043 271 -550 -1530 -423 20 -1011 -1051 327 -33 -1183 128 817 -325 -349 1132 951 -318
768c18J041P20j363n7J186l50j345J015N56j449j79J226o97j167P48P43j456p1
$$ -318 723 1443 80 23 1209 859 -486 529 1085 -364 -543 683 -14 -1181 -433 310 -1146 -1217
786a217J195k47j070P09Q75q49k12J251l11p60Q61Q21j167l5J336k81j028P24
$$ -1217 -22 -269 -1339 -630 245 -604 -816 435 124 -636 225 1046 -121 -156 1180 899 -129 595
804E95O53j152k71J184l40j385O38P42j078m63J027l01j033N56O85q05k52J020
$$ 595 1248 96 -175 1009 669 -716 -78 664 -414 -877 150 -151 -1184 -628 57 -748 -1000 20
822B0j96r82Q82O99p44j96J252j0p87M15R45p76n15R63N9r48O8R59q94n99P87
$$ 20 -176 -1158 -276 423 -321 -517 735 725 -62 353 1298 522 7 970 1029 81 149 1108 214 -385 402
843D02R7j016n6Q30o33p63P42K60r67P8J037l71o59Q99M33q30R1J238l90q54R56
$$ 402 499 -517 -573 257 -376 -1139 -397 -137 -1104 -1026 11 -360 -1019 -120 313 -517 -426 812 422 -432 524
864E24O76j101j8J089n62r62J139N04j494j3R99p34j008R17M38j511J80J167p75
$$ 524 1200 99 81 1170 608 -354 785 1289 -205 -218 781 47 -961 -44 394 -1117 -937 230 -545
883e45p78Q89O86j397L44J135m74p56J263L31j190N93J003n74q26J252K77j319
$$ -545 -1323 -434 252 -1145 -801 334 -140 -896 367 698 -492 101 1104 530 -296 956 1233 -86
901h6J87R69n28r04Q46L14j318o3R22l98j033Q07L84j306K73R31n13n10R23L17
$$ -86 101 1070 542 -362 484 798 -520 -583 339 -59 -1092 -285 99 -1207 -934 -3 -516 -1026 -103 214
921B14j011L64J218o00o66R68O18r83Q4P38k06p19P02M26j317M0J139p07r03P69
$$ 214 -797 -433 785 185 -481 487 1105 122 206 944 738 19 721 1147 -170 -130 1009 302 -601 168
941A68J77j151K32Q24p78o62R29L96j038%R98l06p06J034L14q97J18J162n29m97
$$ 168 345 -806 -574 250 -528 -1190 -261 135 -903 -903 95 -211 -917 117 431 -466 -348 814 285 -212
961b12J082J9o52mQ50m92p53P74J28r43j8O98m66p57L51L64o75j83Q63l82n71
$$ -212 870 889 237 233 1083 591 -162 612 740 -203 -221 477 11 -746 -395 -31 -706 -889 -26 -408 -979
982i79N07M25o39l1Q57r3o69P63N96n14m15R93J34r34L82O31n72m46P36o3q87
$$ -979 -472 -47 -686 -717 140 47 -622 141 737 223 -192 801 935 1 383 1014 442 -4 732 669 -218
1003b18K06N50q05l79Q12j65q57K50P82p73n29J061P1q57M52P98o43l26R46K11
$$ -218 -12 538 -267 -646 166 1 -856 -606 176 -597 -1126 -65 6 -851 -399 399 -244 -570 376 587
1023E87r83N33J022p71o42J073K4r95M97O18o97o20Q21p1j036L21Q36j112m16
$$ 587 -396 137 1159 388 -254 819 843 -152 345 963 266 -354 467 396 -640 -319 517 -595 -1011
1042a011R31q9r70N32P18p18l10Q53N4p12L89J025q58j97J106k7p87N18P26p76
$$ -1011 -80 -169 -1139 -607 111 -607 -917 -64 -10 -722 -333 692 -166 -363 743 716 -71 447 1173 397
1062C97m26J061k41q76K22O47o12p47Q46Q1j055LR10o62o03P01L47r82L42P31
$$ 397 -29 1032 791 -85 137 784 172 -575 271 352 -703 -700 210 -452 -1055 -354 -7 -989 -647 84
1082H4l50l90Q26L31q73K72R14m51m38O25L90p00j91R02l71p73N82M25j108j3
$$ 84 -266 -656 170 501 -372 -100 814 363 -75 550 940 240 49 951 580 -193 389 814 -294 -307
1102c07P67m74q09P42L31j136k6R67m40n83O25O48j153K45J140n73n11P26M93
$$ -307 460 -14 -823 -81 250 -886 -912 55 -385 -968 -343 305 -848 -603 537 -36 -547 179 672
1121F72p85j8J077l67p00O10M99q54j08Q84m38r86O32L94r62r3Q53m55p12M25
$$ 672 -113 -131 946 579 -121 489 988 134 26 910 472 -514 118 512 -450 -543 310 -145 -857 -432
1141d32O43r63m8Q15o7q80P77N09o55k10J052p4q52O78M83m66n52J096k38p82
$$ -432 211 -752 -800 15 -52 -932 -155 354 -301 -511 541 467 -385 293 776 310 -242 854 616 -166
1161a66K49Q18p51m62R25k69j080M90N78p40l23O77Pq80L16P93o48m06J012J35
$$ -166 83 901 150 -312 613 344 -736 -246 332 -408 -731 -54 -47 -927 -611 182 -466 -872 140 275
1181B75r67N55P71q76K4O85J44q66M25R45p38o41Q07j3p12K49N54n62m79L97J60
$$ 275 -692 -137 634 -242 -218 467 611 -255 170 1115 377 -264 543 530 -182 67 621 59 -420 -23 137
1202A37p83J91P14o92n62Q20L49q94K0Q35n18j69Q24J76p65L91P13m07n41P16
$$ 137 -646 -455 259 -433 -995 -175 174 -720 -700 135 -383 -552 272 448 -317 74 787 380 -161 555
1222E55K88q85J53P26n04n70O30J20p96kN90l81n94N50J15n40k1N54k33p69P42
$$ 555 843 -42 111 837 333 -237 393 513 -283 -285 305 -76 -670 -120 -5 -545 -566 -12 -245 -1014 -272
1243b72N16p60O5O54p2m48P08K65p22L31O98o35l82N42L21q67oN74j77n96J95
$$ -272 244 -516 -451 203 131 -317 391 656 -66 265 963 328 -54 488 809 -58 -64 510 333 -263 -68
1264f8M42r23L8P79m07o98N42L06o30J20N05m3o48M48O27q52J59P83J30p71N87
$$ -68 374 -549 -511 268 -139 -837 -295 11 -619 -499 6 -37 -685 -237 390 -462 -303 480 610 -161 426
1285D26O33j047K7P60j69p62M05L08n65k95O92j97q53L55M23q05q6P01j94p23
$$ 426 1059 12 39 799 630 -132 273 581 16 -279 413 216 -637 -282 141 -664 -750 -49 -243 -966
1305i66N43O45n79k39P76j12o61N36O37p31M1P28r0m40L88M29p33j52N88j38n45
$$ -966 -423 222 -357 -596 180 68 -593 -57 580 -151 -110 618 528 88 476 905 172 20 608 470 -75
1326g5n2N66m39n50N66j75m77K63J93l13k48O18J00o84K53N75k31k74P51j8o27
$$ -75 -127 439 0 -550 16 -159 -636 -373 -180 -493 -741 -123 -23 -707 -454 121 -110 -384 367 349 -278
1347b78K48N88l15l62P09J90p49J33N45l81m46M23J29o43r8N34m09m69O32j57
$$ -278 -30 558 243 -119 590 780 31 164 709 328 -118 305 434 -209 -307 227 -182 -651 -19 -176
1367a76m74K52N35n46j10M62P4l21K0P29l89k80N28L18o66K48N64l11m19M73L23
$$ -176 -650 -398 137 -409 -519 -57 17 -304 -284 445 56 -224 304 622 -44 204 768 457 38 511 834
1388H34q30J0N29m34l57L60P4p92K19O05n98l47M62L40p31n2R24m08l75N72K89
$$ 834 4 14 543 109 -248 112 186 -606 -387 218 -380 -727 -265 75 -656 -708 216 -192 -567 5 294
1409B94n49j8Q55l56n06P61N6o57K21O11m53l89Q11l8p87KL18k70m84M81J41o86
$$ 294 -255 -273 582 226 -280 481 537 -120 101 712 259 -130 681 643 -144 -142 176 -94 -578 -97 44 -642
1431f42J07P51o20m10P99R8n79J86N76k69m09M29L38l60K6N09q1l61K30L07n34
$$ -642 -535 216 -404 -814 -15 83 -496 -310 266 -3 -412 17 355 -5 21 530 449 88 318 625 91
1452I1J10K82l59l95M85J7m84k20N81k05o49M07M23n62J7M68k75j91K42M90m83
$$ 91 201 483 124 -271 214 231 -253 -473 108 -97 -746 -339 84 -478 -461 7 -268 -459 -217 273 -210
1473b10k12Q50p0o69M38K88m60J33N95k01p60M75N08o25l07O45p8o60L56K03n04
$$ -210 -422 428 358 -311 127 415 -45 88 683 482 -278 197 705 80 -227 418 340 -320 36 239 -265
1494b65l21N46Q7q09K73Q09p23j47N13K25o50L23O13q07J07P44m9p79N54N56o03
$$ -265 -586 -40 47 -762 -489 320 -403 -550 -37 188 -462 -139 474 -333 -226 518 469 -310 244 800 197
1515A97l18Q38j68p08K13N23l70o07O70n2o44RM75m44l04P54q6p08N50N32n62
$$ 197 -121 717 549 -159 54 577 207 -400 270 218 -426 -417 58 -386 -690 64 -22 -730 -180 352 -210
1536b10m35R12Lo93N22M28m98k29Q24j01p14M12M36m05m59N87j07o77K87M26n19
$$ -210 -645 267 270 -423 99 527 29 -200 624 523 -191 221 657 252 -207 380 273 -404 -117 309 -210
1557b10j25L26Ro53J67M80k22n13P48r3n15L39L82k8l67N93J79l81r6O21l66l24
$$ -210 -335 -9 0 -653 -486 -6 -228 -741 7 -86 -601 -262 120 92 -275 318 497 116 20 641 275 -49
1579d9M98J04n75M9N61o05k98M58J26o11rM45j30m98K79L58q68O5O20K0o32O11
$$ -49 449 553 -22 27 588 -17 -315 143 269 -342 -351 94 -36 -534 -255 103 -765 -700 -80 -60 -692 -81
1601h1K53l17q5N16r8m08M08N85o55J42L66k25m81L24N02o98k08O43l18o66L82
$$ -81 172 -145 -230 286 188 -220 188 773 118 260 626 401 -80 244 746 48 -160 483 165 -501 -119
1622a19M29q47r7Q54n20m72N50M88r94K11N76l2n83N56N01q01J48O22k55m43O24
$$ -119 310 -537 -634 220 -300 -772 -222 266 -728 -517 59 27 -556 0 501 -300 -152 470 215 -228 396
1643C96K28n65j11O48m35l20L41J01n49L2M02m65q1J73M0l84K27K55j10m63M91
$$ 396 624 59 -52 596 161 -159 182 283 -266 -234 168 -297 -378 -205 -165 -549 -322 -67 -177 -640 -149
1664a49J48k40%M86j65k97K49M56l41j79O05j60l52K02K83l09k19K81L2m81M0
$$ -149 -1 -241 -241 245 80 -217 32 488 147 -32 573 413 61 263 546 237 18 299 331 -150 -110
1685a10J61j16k62L44P5l99j09M38l64k02L28L78p05L60N59m05j04K83M46q11
$$ -110 51 -65 -327 17 92 -307 -416 22 -342 -544 -216 162 -543 -183 376 -29 -133 150 596 -215
1705b15M13M32l17m74O92Q6p96J79M15l78k50L94K16p53K55L25m89k37N47p8m93
$$ -215 198 630 313 -161 531 617 -179 0 415 37 -213 181 397 -356 -101 224 -265 -502 45 -33 -526
1726e26L50L44l09k82M92K24n87K12O64l51k55M44K3n44K82M61m11m04N69j47
$$ -526 -176 168 -141 -423 69 293 -294 -82 582 231 -24 420 443 -101 181 642 231 -173 396 249
1746B49m82K52M19n44p7K21J71n43J81Q8k25k90M76n9l19K53M97m06p4L24K34
$$ 249 -233 19 438 -106 -183 38 209 -334 -153 -65 -290 -580 -104 -163 -482 -229 268 -138 -212 112 346
1767C46k15j12L82j93j78L36Q6m45M5L46j37l54J85L04o26R0K09n6m88K14L91
$$ 346 131 19 401 208 30 366 452 7 52 398 261 -93 92 396 -230 -140 69 13 -475 -261 130
1788A30m21l02N11n0k52J13M09k27k82N28j34j81L29L69l76J6L77k06m69L52L90
$$ 130 -291 -593 -82 -132 -384 -271 138 -89 -371 157 23 -158 171 540 164 180 557 351 -118 234 624
1809F24o22k15N00q4o53L73L00m15l05O42j26o63J80M62j44k23L19J57m43K65
$$ 624 2 -213 287 203 -450 -77 223 -192 -497 145 19 -644 -464 -2 -146 -369 -50 107 -336 -71
1829g1K14r9l49O03km35K42M05l15k85O81k02n32L24K47n59r8M66k61m50K72K15
$$ -71 143 44 -305 298 296 -139 103 508 193 -92 589 387 -145 179 426 -133 -231 235 -26 -476 -204 11
1851A1l53k8K93j31j93J06N01n27j84P46j57k49J07N35l66k93O73m6m43K20M02
$$ 11 -342 -370 -77 -208 -401 -295 206 -321 -505 241 84 -165 -58 477 111 -182 491 445 2 222 624
1872F24n24k4K44j08m07K84R7l34k19M14J0m16M4M03l11k76L60J27l39J38N10
$$ 624 100 76 320 212 -195 89 186 -148 -367 47 57 -359 -315 88 -223 -499 -139 -12 -351 -213 297
1893B97l65k59L55K62m86L05M80m66j16K53K54l08j46L84j69m41K16J42m79l7
$$ 297 -68 -327 28 290 -196 109 589 123 7 260 514 206 60 444 275 -166 50 192 -287 -324
1913c24M05k01k06J90nj86N6M33l69k71M04L06l39k31O59j48n30N65J16l83J16
$$ -324 81 -120 -326 -136 -141 -327 -271 162 -207 -478 -74 232 -107 -338 321 173 -357 208 324 -59 57
1934E7M07j67k42K36P8n33J26L08l54k9p9L50n31L1M45k89l85O21J14n58R9M01
$$ 57 464 297 55 291 369 -164 -38 270 -84 -113 -192 158 -373 -342 103 -186 -571 50 164 -394 -295 106
1956A06j52l56N29K2m53K10L88j91j01K56Q1l68R7K51J8l26J55L7l94R5Q6J31
$$ 106 -46 -402 127 149 -304 -94 294 103 2 258 339 -29 68 319 337 11 166 203 -191 -96 -10 121
1978A21m29J92N8j92O0J67k02p1J28J95q6p2M3J59J5j12L83k99PJ50K5n6j8K13
$$ 121 -308 -116 -58 -250 -190 -23 -225 -296 -168 27 -59 -131 -88 71 86 -26 357 58 65 215 240 184 166 379
2002C79m13MJ07L07m41Q8J95l17k50K44J57m65N0L17p7m21M46K00l20j3K50m6
$$ 379 -34 -30 77 384 -57 31 226 -91 -341 -97 60 -405 -355 -38 -115 -536 -90 110 -210 -223 27 -19
2024a9j67L29J93k73r0L48j76k53L44O3m33K36J81k17k61M47R4n80J25O08o66
$$ -19 -186 143 336 63 -27 321 145 -108 236 299 -134 102 283 66 -195 252 346 -234 -109 499 -167
2045a67j95L53k8l67l2O78l76l32N51J28m92K80K58k21j92N19J2m64K72K06m16
$$ -167 -362 -9 -37 -404 -436 242 -134 -466 85 213 -279 1 259 38 -154 365 377 -87 185 391 -25
2066b5O1K73j7n92L24L11l13k99K55L30o76J74K53l13j51L64p1k16J76L09k07
$$ -25 36 309 292 -300 24 335 22 -277 -22 308 -368 -194 59 -254 -405 -41 -112 -328 -152 157 -50
2087e0p3K82l7k08J77K77k15j62J26J85k18L3K19j48l13L24k4k48r7K76q7k04
$$ -50 -123 159 122 -86 91 368 153 -9 117 302 84 117 336 188 -125 199 175 -73 -170 106 19 -185
2109a85K8K91l48n5K31k04m9K60K22m45ML51J13m35L43M01m55l5K35j61k11K09
$$ -185 -157 134 -214 -269 -38 -242 -291 -31 191 -254 -250 101 214 -221 122 523 68 33 268 107 -104 105
2131A05L72m69PK82j52m63K78K67n15J36J68o7l82K85M4l05K5M49k85j9K92Q4
$$ 105 477 8 15 297 145 -318 -40 227 -288 -152 16 -51 -433 -148 -104 -409 -384 65 -220 -239 53 137
2153A37k52Q4L81k20k69M10J97n25K9K81k1m38M25J01k85r0L01l79j8O0rk34N3
$$ 137 -115 -31 350 130 -139 271 468 -57 -28 253 232 -206 219 320 35 -55 246 -133 -151 -91 -100 -334 -281
2176b81J57O3m12L50K11k04k71O15l06j92M30J1o9k36M33j2l11K37J25j37j24
$$ -281 -124 -61 -473 -123 88 -116 -387 228 -78 -270 160 171 102 -134 299 287 -24 213 338 201 77
2197G7J00M2k51L2K06k05j78K46j18l28K28K49l34j35L00j08j18J68K74k49j86
$$ 77 177 219 -32 0 206 1 -177 69 -49 -377 -149 100 -234 -369 -69 -177 -295 -127 147 -102 -288
2218b88N37k03m9rM80k85n6K11r5n4j19K99j92j87J42J29m20j2L04l00k39N27
$$ -288 249 46 -3 -12 468 183 127 338 243 189 70 369 177 -10 132 261 -159 -171 133 -167 -406 121
2240A21q8k42j27M78m38QL37j8k08J88K43k12k17L84L8k13N7L28j61l88K27P7
$$ 121 33 -209 -336 142 -296 -288 49 31 -177 11 254 42 -175 209 247 34 91 419 258 -130 97 174
2262A74k04r5L01j07k14J63O2l46P5J41m0k69L69l5k41l3M05j49k13K04J77k60
$$ 174 -30 -125 176 69 -145 18 80 -266 -191 -50 -90 -359 10 -25 -266 -299 106 -43 -256 -52 125 -135
2284a35K25K28r2k48J73J89k08j77L33j73j23K63J52o61J19K60j58j27M3Q4n9
$$ -135 90 318 226 -22 151 340 132 -45 288 115 -8 255 407 -254 -135 125 -33 -160 -117 -33 -92
2305i2j80K37r4l15M37J27k17p0L5L9L8K83j04p8j85N02j32k40J21J34j32j51
$$ -92 -272 -35 -129 -444 -7 120 -97 -167 -132 -93 -55 228 124 46 -139 363 231 -9 112 246 114 -37
2327c7K54j30k02K24K78n36r4L58r3k35k8J89j57j15J91K3j02L0L00k24nK04J07
$$ -37 217 87 -115 109 387 -149 -243 115 22 -213 -241 -52 -209 -324 -133 -110 -212 -182 118 -106 -111 93 200
2350B00j26l8L06k38k92N59k39k59K07J95m92J33K61l1j88j86M16k93k31K39j6
$$ 200 74 36 342 104 -188 371 132 -127 80 275 -217 -84 177 146 -42 -228 188 -105 -336 -97 -113
2371a13k52L86J92m00o8K70P1l07J20K31k60k8N13j05j79m1J61p3j01L09k58j60
$$ -113 -365 21 213 -187 -255 15 86 -221 -101 130 -130 -158 355 250 71 30 191 118 17 326 68 -92
2393i2J93Q8k21j51M17l32j36J66J91l04m2L06k15k57K84J24Kk14L53K6k31J08
$$ -92 101 189 -32 -183 234 -98 -234 -68 123 -181 -223 83 -132 -389 -105 19 21 -193 160 186 -45 63
2415F3L23l10k8J70J19l05J18J04n3l32J33J39j08M9j9j33j33J58J51n16K83J79
$$ 63 386 76 48 218 337 32 150 254 201 -131 2 141 33 82 63 -70 -203 -45 106 -410 -127 52
2437E2l88J29R6J10l06L31L6J0j54L35j04j57J03O5R1l69K48M8j86L11j23k19
$$ 52 -336 -207 -111 -1 -307 24 60 70 -84 251 147 -10 93 158 249 -120 128 176 -10 301 178 -41
2459d1j11J25J48j80j4J76k75j13oM11k81J8K29j28j74K32K43k36j22L69j30j23
$$ -41 -152 -27 121 -59 -73 103 -172 -285 -291 120 -161 -143 86 -42 -216 16 259 23 -99 270 140 17
2481A7K05J7k47k3K71k63PO3J66k16k04M00k13r0J06j29Q3j12J48q1l47L72R6
$$ 17 222 239 -8 -31 240 -23 -16 47 213 -3 -207 193 -20 -110 -4 -133 -50 -162 -14 -95 -442 -70 26
2504B6q2q3J19M6k62K80K30l61K13n7J81j64N8L0k57J21K21j59o2mJ03l22K3L05
$$ 26 -56 -139 -20 26 -236 44 274 -87 126 69 250 86 144 174 -83 38 259 100 38 34 137 -185 -162 143
2528A43j52j56L5J46k82j2K00J60k78P5K39l18M2M13o4k93K66J56m07J00L70k59
$$ 143 -9 -165 -130 16 -266 -278 -78 82 -196 -121 118 -200 -158 255 191 -102 164 320 -87 13 383 124
2550A24r4J45J28k63K9J96j75k0j40J45k39j75K61J91k33Q6K4j03m5K87l25qJ11
$$ 124 30 175 303 40 69 265 90 70 -70 75 -164 -339 -78 113 -120 -34 -10 -113 -158 129 -196 -204 -93
2573i3K59k82O3J90Rj19qL09k13j47K03P8k24R0K4r7j54J45R3k34l8K61k39n8
$$ -93 166 -116 -53 137 146 27 19 328 115 -32 171 249 25 115 139 42 -112 33 126 -108 -146 115 -124 -182
2597a82J27p0q2OJ12N1j8R5K5j64k8L89k36q8K21J02j92P0P4m6j46K8O4l9n4R1
$$ -182 -55 -125 -207 -201 -89 -38 -56 39 64 -100 -128 261 25 -63 158 260 68 138 212 166 20 48 112 73 19 110
2623A10r1k58O8L36l52J22Q9m16K37mJ15j11k3L31o4k43J75K01l75J10L24j53
$$ 110 19 -239 -171 165 -187 -65 24 -392 -155 -159 -44 -155 -178 153 89 -154 21 222 -153 -43 281 128
2645A28j15K87k82N3NR6q3q4J45j52p7j15K22j20k01J18J54k02JK06o2l7J69j38
$$ 128 13 300 18 71 76 172 89 5 150 -2 -79 -194 28 -92 -293 -175 -21 -223 -222 -16 -78 -115 54 -84
2669h4J14r2J28mj15J0L54l13R0K88j94j55R6J60l12j11K34j3j49j9Q1k15M5J32
$$ -84 30 -62 66 62 -53 -43 311 -2 88 376 182 27 123 283 -29 -140 94 81 -68 -87 -6 -221 -176 -44
2693d4m9j16J5J43j59P7R0j2j67J38K64j95p4K75j54L8O0J22k36j7J17J13l87
$$ -44 -93 -209 -194 -51 -210 -133 -43 -55 -222 -84 180 -15 -89 186 32 70 130 252 16 -1 116 229 -158
2716a58k4L25j10j81L04q5l38L22J6k24l6J47lo6K66k6k16L2O7J57j54J1K17l22
$$ -158 -182 143 33 -148 156 71 -267 55 71 -153 -189 -42 -45 -111 155 129 -87 -55 12 169 15 26 243 -79
2740g9J01R7K47k90J53j34O1j75N1O3k90M6K32k47j65L01K32m38O9N8O4k43K62
$$ -79 22 119 366 76 229 95 156 -19 32 95 -195 -149 83 -164 -329 -28 204 -234 -165 -107 -43 -286 -24
2763b4K22l94j4L83j82r1K02P3k07J07L28l12LJ56r2j67J04J37j23l24J46J11
$$ -24 198 -196 -210 173 -9 -100 102 175 -32 75 403 91 94 250 158 -9 95 232 109 -215 -69 42
2785D2k72J38Q3q1j37J44K64k77pK03k39qQ8J36k36K2J02p6o8L59J5k94j8L19
$$ 42 -230 -92 -9 -90 -227 -83 181 -96 -103 100 -139 -147 -59 77 -159 -137 -35 -111 -179 180 195 -99 -117 202
2809B02N9l20L33j81j24j50L45j83p0K07L4k76N8M6L5k53K12J36k55P2K38k74
$$ 202 261 -59 274 93 -31 -181 164 -19 -89 118 152 -124 -66 -20 15 -238 -26 110 -145 -73 165 -109
2831a09j19J08L26k80R8LJ01k89J75K74m58J87K88p7k94O1J58k11r7Q0J79l99
$$ -109 -228 -120 206 -74 24 27 128 -161 14 288 -170 17 305 228 -66 -5 153 -58 -155 -75 104 -295
2853b95J76L56l13p8P2K25k65K8N4k24J23J74M2j83R1P7r0R6n8M0j18K17K18k75
$$ -295 -119 237 -76 -154 -82 143 -122 -94 -40 -264 -141 33 75 -108 -17 60 -30 66 8 48 -70 147 365 90
2877I0l02K26lj60KK98j63n7N1k8j83K8K17k30l2K42r5O2J35j6j83m0K47R8k20
$$ 90 -212 14 11 -149 -147 151 -12 -69 -18 -46 -229 -201 16 -214 -246 -4 -99 -37 98 82 -101 -141 106 204 -16
2902a6o1K48j57J02O3j92L7j15J64P0k05J34Ql02k9L65r1j68J27p3j49M5K31n5
$$ -16 -77 171 14 116 179 -13 24 -91 73 143 -62 72 80 -222 -251 114 23 -145 -18 -91 -240 -195 36 -19
2926a9p6k5Q9j23K18O0m8j79J71R6k29J1K90j6l77K92J16k31J1K09k52j19K3J81
$$ -19 -95 -120 -31 -154 64 124 76 -103 68 164 -65 -54 236 220 -157 135 251 20 31 240 -12 -131 -108 73
2950G3k69J18L39m11k19L92m8j44O2P4q1Q3K7J12j67J55K5j45JJ80j2k02K46j13
$$ 73 -196 -78 261 -150 -369 23 -25 -169 -107 -33 -114 -31 -4 108 -59 96 121 -24 -23 157 145 -57 189 76
2974G6J00j22J44j38j42J00r8O5k36J82k8j1K8J65n2r3j11K00j08m9J67J21j10
$$ 76 176 54 198 60 -82 18 -80 -15 -251 -69 -97 -108 -80 85 33 -60 -171 29 -79 -128 39 160 50
2997E0K29j33j86J06O2Lp3p2J26k75kK52j23l0j0P3j69R2L1o8j64J75J77r5j78
$$ 50 279 146 -40 66 128 131 58 -14 112 -163 -165 87 -36 -66 -76 -3 -172 -80 -49 -117 -281 -106 71 -24 -202
3022b02L68k05j09J23J1p7N0MK62m66K96jK2l1O7l2p4K4Q2j58j10J74K5k01J82
$$ -202 166 -39 -148 -25 -14 -91 -41 -37 225 -241 55 54 76 45 112 80 6 30 112 -46 -156 18 43 -158 24
3047B4K9j23o4K0O7j47J06J65k21N0J83p3r1K32J53k50MR0R8k01k0n1J21j69J22
$$ 24 53 -70 -134 -114 -47 -194 -88 77 -144 -94 89 16 -75 157 310 60 64 154 252 51 31 -20 101 -68 54
3072E4J40k73J11L8l4k09J69J05l98K51K8r9n9K22l8r2K4Q4Jq9J84k8J23j35J05
$$ 54 194 -79 32 70 36 -173 -4 101 -297 -46 -18 -117 -176 46 8 -84 -60 24 25 -64 120 92 215 80 185
3097A85n0j14J82r7j51J62J5j14j16J88Qk52J43K2j01k42K94J02k55J76Q3j84
$$ 185 135 21 203 106 -45 117 132 18 -98 90 98 -154 -11 11 -90 -332 -38 64 -191 -15 68 -116
3119a16MJ84l6n0q7O2J75l39K79J36j09q0K56j18r1%P7k55J66J13j68k87L75j34
$$ -116 -112 72 36 -14 -101 -39 136 -203 76 212 103 23 279 161 70 70 147 -108 58 171 3 -284 91 -43
3143d3j13J1J82o0j59J24J04j44J02J22j53j29P9K63n8k3l8Qj64J71J05j32n4
$$ -43 -156 -145 37 -23 -182 -58 46 -98 4 126 -27 -156 -77 186 128 105 67 75 -89 82 187 55 1
3166AJ05n5k50K15K31k61o5q1K53k78K20p6j70J79J02j62o9J83Q3j88k0j1K68
$$ 1 106 51 -199 16 247 -14 -79 -160 93 -185 35 -41 -211 -32 70 -92 -161 22 105 -83 -103 -114 154
3189A54j72%J16n4j50M28k33q0MJ13p5l2L8o3j15J00mj09N7M4K9kj39J04k9J8
$$ 154 -18 -18 98 44 -106 322 89 9 13 126 51 19 57 -6 -121 -21 -25 -134 -77 -33 -4 -6 -145 -41 -70 -52
3215e2J24k5K4k10K07kp8L5J8k4J30J6j77L6J20L0k38o9J30R3j22R1n3j72P8K5
$$ -52 72 47 71 -139 68 66 -12 23 41 17 147 163 -14 22 142 172 -66 -135 -5 88 -34 57 4 -168 -90 -65
3241f5Q2j02k9O4j6l3P8J89l39K27J20j88L9q6K60k05J21R8j08j19J82rj99P3
$$ -65 17 -85 -114 -50 -66 -99 -21 168 -171 56 176 -12 27 -59 201 -4 117 215 107 -12 170 161 -38 35
3265C5O5j53j02K58j48j51J47J46k14O8J85j04j58J30Q8k32K17L0j7k22O8N5o2
$$ 35 100 -53 -155 103 -45 -196 -49 97 -117 -49 136 32 -126 4 92 -140 77 107 90 -132 -64 -9 -71
3288g1J46J26Nk89R3L3p0N3M8k92K43nO6r5j02J95r7j21J54R4k62j37J39K73l48
$$ -71 75 201 206 -83 10 43 -27 26 74 -218 25 20 86 -9 -111 84 -13 -134 20 114 -148 -285 -146 127 -221
3313b21K18Kj46K05PM8k82K04J39j58P6p3j4lJ52n3k6j23K40j54k70qL27m35K04
$$ -221 -3 -1 -147 58 65 113 -169 35 174 16 92 19 5 2 154 101 75 -48 192 38 -232 -240 87 -348 -144
3338a44J11j7n8Oj34K07n4P4R2k61K19j3n9p4J67n7P4M5k35J36J25K4j07oj60
$$ -144 -33 -50 -108 -102 -236 -29 -83 -9 83 -178 41 28 -31 -105 62 5 79 124 -111 25 150 174 67 61 -99
3363i9L59l20r0K15M7k09N4K76l25j31K15p3M6N4l2k4o8J05N2K5R7l2j73J60K3
$$ -99 260 -60 -150 65 112 -97 -43 233 -92 -223 -8 -81 -35 19 -13 -37 -105 0 52 77 174 142 -31 129 152
3388A52N5j61J00J10l14k9K08j74j56K19NJ4k24K03m0l9J5%Nj31K85L0l20J74
$$ 152 207 46 146 256 -58 -87 121 -53 -209 10 15 29 -195 8 -32 -71 -56 -56 -51 -182 103 133 -187 -13
3412a3J91k08m6rqL0O8mr6k4J86j26J5J70J03k70l1K36j24j90J58J10P2k22K0
$$ -13 178 -30 -76 -85 -93 -63 5 1 -95 -119 67 -59 -44 126 229 -41 -72 164 40 -150 8 118 190 -32 -12
3437a2Lk06J57K04l32O1J80j75J9J63%j2j8n8J50j47J46rj59k7J23J3j24N3J32
$$ -12 -9 -215 -58 146 -186 -125 55 -120 -101 62 62 50 32 -26 124 -23 123 114 -45 -72 51 64 -60 -7 125
3462A25k42O7J01K1q7J3J3J30k82J76L0j93P4m2j4lJ10J22p4r1r6Q4L0P7O2p2
$$ 125 -117 -50 51 72 -15 -2 11 141 -141 35 65 -128 -54 -96 -110 -113 -3 119 45 -46 -142 -58 -28 49 111 39
3488C9N3j42K21k27M4J1K9n5O6j64j3R6J48l47N3L37j27j6j7O8k20N2K71o3k03
$$ 39 92 -50 171 -56 -12 -1 28 -27 39 -125 -138 -42 106 -241 -188 149 22 6 -11 57 -163 -111 160 97 -106
3513a06J46N7p0o4J97m5j20J20m6j19J05N6n0k24J07J73j38j90K68j56K14j78
$$ -106 40 97 27 -37 160 115 -5 115 69 -50 55 111 61 -163 -56 117 -21 -211 57 -99 115 -63
3535f3L4l2J08p8O0j36R5O1o7o8P1P1j54K07j05OMJ30j71J05j38J81j20m7R4L
$$ -63 -29 -61 47 -31 29 -107 -12 49 -18 -86 -15 56 -98 109 4 10 14 144 -27 78 -60 121 1 -46 48 51
3561E1k97R3K29o1j59Q3O7p1J18k3j30r0J85j09p2J59N6l2l3P2K39l62J45J59
$$ 51 -246 -153 76 15 -144 -61 6 -65 53 30 -100 -190 -5 -114 -186 -27 29 -3 -36 36 275 -87 58 217
3585B17k46J2P2J11k39J12K4o5J40j42N1j50L5J03j42O3J17j65r2k7M09j33k03
$$ 217 -29 -17 55 166 -73 39 63 -2 138 -4 47 -103 -68 35 -107 -44 73 -92 -184 -211 198 65 -138
3608a38J13J26k54J52R9j63O9M1LL4k10K85n3k56J32j6Q3Km9j28J51m9J30m6k86
$$ -138 -25 101 -153 -1 98 -65 4 45 48 82 -128 157 104 -152 -20 -36 47 49 0 -128 23 -26 104 58 -228
3633b28R2K4r1J67j50J71L7j88O5J42j40N4R2q2R4J48p8m6N1lk22P5l9J63j28
$$ -228 -136 -112 -203 -36 -186 -15 22 -166 -101 41 -99 -45 47 -35 59 207 129 83 134 131 -91 -16 -55 108 -20
3658b0J7M3j59O6Rj37K50j26k01J56M7jK2m1J26k70P5K07M2k03K15L8m2r8J30
$$ -20 -3 40 -119 -53 -44 -181 69 -57 -258 -102 -55 -56 -34 -75 51 -219 -144 63 105 -98 117 155 113 15 145
3683A45j14q2J13j44K0l5J06p4o4j03K12r7k1J64k05J47rJ77l47J32K63j69j83
$$ 145 31 -51 62 -82 -62 -97 9 -65 -129 -232 -20 -117 -138 26 -179 -32 -41 136 -211 -79 184 15 -168
3706a68K70j68o4R4lo3Q6Q9O0j29j53J21M1k9m5J15j0j3o5N3j14P3k6Pp7l4J17
$$ -168 102 -66 -130 -36 -39 -102 -16 73 133 4 -149 -28 13 -16 -61 54 44 31 -34 19 -95 -22 -48 -41 -118 -152 -35
3733c5n5l9K62q7OL5m0q8J33l4o5j14K91j05j57N9P6Q1j47N3L4L6j13J71j88J39
$$ -35 -90 -129 133 46 52 87 47 -41 92 58 -7 -121 170 65 -92 -33 43 124 -23 30 64 100 -13 158 -30 109
3759A09j31o3j08J68K67l09L9j26K78q8j80J22k1M6J64j35j08J09R2j83J60l5
$$ 109 -22 -85 -193 -25 242 -67 -28 -154 124 36 -144 -22 -43 3 167 32 -76 33 125 -58 102 67
3781F7k7k3n0J08k0k14K24j07P4j70K51k65K2P3J43j82J68n3q8j6J64M3j66J24
$$ 67 40 17 -33 75 55 -159 65 -42 32 -138 113 -152 -130 -57 86 -96 72 19 -69 -85 79 122 -44 80
3805H0q7J67m3n1j66k4L02j89j03NnJ51j02J3r2K32k40J77P1k38j33L93k10j2
$$ 80 -7 160 117 66 -100 -124 178 -11 -114 -109 -114 37 -65 -52 -144 88 -152 25 96 -142 -275 118 -92 -104
3829a04O7L7j09J01o7O6l6R9J01j42j29K93k79K1Q7O7p5J9J48j08j16L7k8O0n6
$$ -104 -37 0 -109 -8 -75 -9 -45 54 155 13 -116 177 -102 -81 6 73 -2 17 165 57 -59 -22 -50 10 -46
3854d6j05J42L7n1oj14R0N1O6k50K77lj65J52q2R8q6K60q5N5j81n0P0J2j26J2
$$ -46 -151 -9 28 -23 -29 -143 -53 -2 64 -186 91 88 -77 75 -7 91 5 265 180 235 54 4 74 86 -40 -28
3880b8J71j71L7m8q4J59o4K8n2J86q3j34j47M80m30R6J92j48k8J24L1Lj95J38
$$ -28 143 -28 9 -39 -123 36 -28 0 -52 134 51 -83 -230 250 -180 -84 108 -40 -68 56 87 90 -105 33
3904C3M2l5pp3J02M5r3R9k94J78L4r9K09j68NO9O6k2N2k05O9O8j87O3mK0P3q6
$$ 33 75 40 33 -40 62 107 14 113 -181 -3 31 -68 141 -27 -22 47 113 91 143 -62 7 75 -112 -49 -53 -33 40 -46
3932d6L8l3O3K4Q6j80O7n4K2p8K64k27O3l3J43r2p0K4J2m6O1N1j54O2K0j62J02
$$ -46 -8 -41 22 46 132 -48 19 -35 -13 -91 173 -54 9 -24 119 27 -43 -19 -7 -53 8 59 -95 -33 -13 -175 -73
3959g3K6J1j99J89K06j15j12J08p2K3j15J89l9o3j6K72j24n1Q4O1j68j00J67j04
$$ -73 -47 -36 -235 -46 160 45 -67 41 -31 -8 -123 66 27 -36 -52 220 96 45 129 190 22 -78 89 -15
3983a5J38j10j35K5mK56j60j56J60j47QK21j54l5k4P2K53j64k25K90q6P5J32j34
$$ -15 123 13 -122 -97 -101 155 -5 -161 -1 -148 -140 81 -73 -108 -132 -60 193 29 -196 94 8 83 215 81
4007H1K8j8j73J84m2k1j23n4K64j25r9N6j6k5J06q3m2P5J6J47k25O0j0p4J7J36
$$ 81 109 91 -82 102 60 39 -84 -138 126 1 -98 -42 -58 -83 23 -60 -102 -27 -11 136 -89 -29 -39 -113 -96 40
4033D0j5m4J6j45K46npN7l0j22J03j94J18o2J7P7j34J28j13M8N9P2k25k3p4L70
$$ 40 25 -19 -3 -148 98 93 86 143 113 -9 94 -100 18 -44 -27 50 -84 44 -69 -21 38 110 -115 -138 -212 158
4059A58j53q0J96J7k35P4n8J11RkJ06j37J25qj4mL1j07q5k0jO6m5J01j03j89J18
$$ 158 5 -75 121 138 -97 -23 -81 30 39 37 143 6 131 123 109 105 136 29 -56 -76 -77 -11 -56 45 -58 -247 -129
4086a29O4Mk11K47o3M6L3Q0j41q1J34J45q0Lq9L2M5L1J45k44J1m1J33o0m8Mk6
$$ -129 -65 -61 -272 -25 -88 -42 -9 71 -70 -151 -17 128 48 51 -38 -6 39 70 215 -29 -18 -59 74 14 -34 -30 -56
4113e6J24o2l2Kr7R7k4l5P1R6j96J80n8N3j73R9j15m3L32k04Q8o9R4R7p3j2m9
$$ -56 68 6 -26 -24 -121 -24 -48 -83 -12 84 -112 68 10 63 -110 -11 -126 -169 163 -41 47 -22 72 169 96 84 35
4140C5m9nn2P1j94J99J43l06J00P9o3k8L9l9m3J78n2m3j60K13J76l20K43r4k7
$$ 35 -14 -19 -71 0 -194 5 148 -158 -58 21 -42 -70 -31 -70 -113 65 13 -30 -190 23 199 -121 122 28 1
4165AM2j59L71k54L8M4m2o5K36n0q9j22J04k50J48K0R4L4j87J62j13r4K73k66
$$ 1 43 -116 255 1 39 83 41 -24 212 162 73 -49 55 -195 -47 -27 67 101 -86 76 -37 -131 142 -124
4189a24R2L5qM8L6k6J50j61O0j7r1M6k2Rq8P1J89j92o8m8N2q5J06l0p0Q8O2k4
$$ -124 -32 3 -5 43 79 53 203 42 102 85 -6 40 18 27 -61 10 199 7 -61 -109 -57 -142 -36 -66 -136 -48 14 -10
4217a0j24r2K06J37k24J44J23m6j02J2j13N9J87n8k38J57N5j33M5J2q4J42p8J40
$$ -10 -134 -226 -20 117 -107 37 160 114 12 24 -89 -30 157 99 -139 18 73 -60 -15 -3 -87 55 -23 117
4241A17j35r3Q1K5q0n1J60o0Q5m4j11J72r2N1Nk2J18j55R6r0J33L1j25Q5j0J55
$$ 117 -18 -111 -30 -5 -85 -136 24 -36 49 5 -106 66 -26 25 30 8 126 -29 67 -23 110 141 16 101 91 246
4267B46l26J58O4j50OJ4K7j87J50q5K4j51J76N3q0qO0j26Q9J01j23p6J62mJ6M8
$$ 246 -80 78 142 -8 -2 12 39 -148 2 -83 -59 -210 -34 19 -61 -69 -9 -135 -46 55 -68 -144 18 14 30 78
4293G8JK1j18J98k33Q5J3k4j1m4m6N0K0l8j9j1L2k0N3Kj40K44j33r1K45j86J37
$$ 78 79 100 -18 180 -53 32 45 21 10 -34 -80 -30 -10 -48 -67 -78 -46 -66 -13 -11 -151 93 -40 -131 114 -72 65
4320F5lP6j04KM1N1n9k1L6m4L6J15j64Q6j42O2l8j26Q0k4L1r3P2OO0N0M7j57j08
$$ 65 62 138 34 36 77 128 69 48 84 40 76 191 27 113 -29 33 -5 -131 -51 -75 -44 -137 -65 -59 1 51 98 -59 -167
4349a67L56k94O1J48j7k59O5l6K28p5l5J11j40O8J57k23P0n1k3j0PK27j10j97
$$ -167 189 -105 -44 104 87 -172 -107 -143 85 10 -25 86 -54 14 171 -52 18 -33 -56 -66 -59 168 58 -139
4373a39J87J48l74N4K33k69j6J29J10k21K99j55k8P1j8qj12J72R3j65L0J82J02
$$ -139 48 196 -178 -124 109 -160 -176 -47 63 -158 141 -14 -42 29 11 3 -109 63 156 -9 21 203 305
4396C05k82J1L7N0j10L0l0j04J32q3J01k57K27mj75J36J66k82J11j28K00mq4n7
$$ 305 23 34 71 121 11 41 11 -93 39 -44 57 -200 27 23 -152 -16 150 -132 -21 -149 51 47 -37 -94
4420i4O6P6j3R3j52R0R0p4p5j03J41j16J13o4n0J44m0pj24j2J14K1j52J19j34
$$ -94 -28 48 35 128 -24 66 156 82 7 -96 45 -71 42 -22 -72 72 32 25 -99 -111 3 24 -128 -9 -143
4445a43O0Q8Q0R7j44j8Q9j07jR3o5J78j73o2K2j64L13j64r8J17J07j64J55j33
$$ -143 -83 5 85 182 38 20 109 2 1 94 29 207 34 -28 -6 -170 143 -21 -119 -2 105 -59 96 -37
$$ [...]
8191D0
##END NTUPLES=NMR FID
##END=
