##TITLE=1H_AM_NV54
 CDCl3
 8 sc, 
 5.9.2023
##JCAMPDX= 6.0         $$ Bruker NMR JCAMP-DX V2.0
##DATA TYPE= NMR FID
##DATA CLASS= NTUPLES
##ORIGIN= UXNMR, Bruker Analytische Messtechnik GmbH
##OWNER= root
$$ XWIN-NMR		Version 3.5
$$ Tue Sep  5 13:44:06 2023 Russian Standard Time (UT+4h)  she@DPX200
##.OBSERVE FREQUENCY= 200.13135
##.OBSERVE NUCLEUS= ^1H
##.DELAY= (6, 6)
##.ACQUISITION MODE= SIMULTANEOUS
##.ACQUISITION SCHEME= undefined
##.AVERAGES= 8
##.DIGITISER RES= 18
##SPECTROMETER/DATA SYSTEM= spect
##.PULSE SEQUENCE= zg30
##.SOLVENT NAME= CDCl3
##.SHIFT REFERENCE= (INTERNAL, CDCl3, 0, 15.7039)
##AUDIT TRAIL= $$ (NUMBER, WHEN, WHO, WHERE, WHAT)
$$ ##TITLE= Audit trail, XWIN-NMR		Version 3.5
$$ ##JCAMPDX= 5.01
$$ ##ORIGIN= Bruker BioSpin GmbH
$$ ##OWNER= she
$$ F:/spectra/data/she/nmr/H-F/1/audita.txt
$$ ##AUDIT TRAIL=  $$ (NUMBER, WHEN, WHO, WHERE, WHAT)
(   1,<2023-09-05 13:42:45.21 +0400>,<she>,<DPX200>,
      <created by zg, POWCHK disabled, PULCHK disabled
       configuration hash MD5:
       00 E9 B6 7A A2 85 ED C7 34 08 36 98 17 FE 4E 26
       data hash MD5: 16K
       02 D4 44 E2 2E 85 D2 7B 09 58 2D 4E 46 39 0C B5>)
$$ ##END=
$$ 
$$ hash MD5
$$ 15 C3 18 0E 24 45 14 75 F2 CB B1 46 82 8F E3 06
##$RELAX= 
##$RELAX= 
##$RELAX= 
##$RELAX= 
##$RELAX= 
##$RELAX= 
$$ Bruker specific parameters
$$ --------------------------
##$DU= <F:/spectra>
##$EXPNO= 1
##$NAME= <H-F>
##$PROCNO= 1
##$TYPE= <nmr>
##$USER= <she>
##$AMP= (0..31)
100 100 100 100 100 100 100 100 100 100 100 100 100 100 100 100 100 100 
100 100 100 100 100 100 100 100 100 100 100 100 100 100 
##$AQSEQ= 0
##$AQ_mod= 1
##$AUNM= <au_zg>
##$AUTOPOS= <>
##$BF1= 200.13
##$BF2= 200.13
##$BF3= 200.13
##$BF4= 200.13
##$BF5= 200.13
##$BF6= 200.13
##$BF7= 200.13
##$BF8= 200.13
##$BYTORDA= 1
##$CFDGTYP= 0
##$CFRGTYP= 5
##$CHEMSTR= <none>
##$CNST= (0..31)
1 1 145 1 1 1 1 1 1 1 1 1 1 1 1 1 1 1 1 1 1 1 1 1 1 1 1 1 1 1 1 1 
##$CPDPRG= <>
##$CPDPRG1= <>
##$CPDPRG2= <>
##$CPDPRG3= <>
##$CPDPRG4= <mlev>
##$CPDPRG5= <mlev>
##$CPDPRG6= <mlev>
##$CPDPRG7= <mlev>
##$CPDPRG8= <mlev>
##$CPDPRGB= <>
##$CPDPRGT= <>
##$D= (0..31)
0 1.2 0 0 0 0 0 0 0 0.06 0 0.03 0 0 0 0 0.0002 0 0 0 0 0 0 0 0 0 0 0 0 
0 0 0 
##$DATE= 1693906964
##$DBL= (0..7)
120 120 120 120 120 120 120 120 
##$DBP= (0..7)
150 150 150 150 150 150 150 150 
##$DBP07= 0
##$DBPNAM0= <>
##$DBPNAM1= <>
##$DBPNAM2= <>
##$DBPNAM3= <>
##$DBPNAM4= <>
##$DBPNAM5= <>
##$DBPNAM6= <>
##$DBPNAM7= <>
##$DBPOAL= (0..7)
0.5 0.5 0.5 0.5 0.5 0.5 0.5 0.5 
##$DBPOFFS= (0..7)
0 0 0 0 0 0 0 0 
##$DE= 6
##$DECBNUC= <off>
##$DECIM= 32
##$DECNUC= <off>
##$DECSTAT= 4
##$DIGMOD= 1
##$DIGTYP= 9
##$DL= (0..7)
0 120 120 120 120 120 120 120 
##$DP= (0..7)
150 150 150 150 150 150 150 150 
##$DP07= 0
##$DPNAME0= <>
##$DPNAME1= <>
##$DPNAME2= <>
##$DPNAME3= <>
##$DPNAME4= <>
##$DPNAME5= <>
##$DPNAME6= <>
##$DPNAME7= <>
##$DPOAL= (0..7)
0.5 0.5 0.5 0.5 0.5 0.5 0.5 0.5 
##$DPOFFS= (0..7)
0 0 0 0 0 0 0 0 
##$DQDMODE= 0
##$DR= 18
##$DS= 0
##$DSLIST= <SSSSSSSSSSSSSSS>
$$ [...]
##$SUBNAM2= <"">
##$SUBNAM3= <"">
##$SUBNAM4= <"">
##$SUBNAM5= <"">
##$SUBNAM6= <"">
##$SUBNAM7= <"">
##$SUBNAM8= <"">
##$SUBNAM9= <"">
##$SW= 18.05172834244
##$SWIBOX= (0..15)
0 0 2 0 0 0 0 0 0 0 0 0 0 0 0 0 
##$SW_h= 3612.71676300578
##$TD= 16384
##$TD0= 1
##$TE= 0
##$TE2= 300
##$TE3= 300
##$TEG= 300
##$TL= (0..7)
0 120 120 120 120 120 120 120 
##$TP= (0..7)
150 150 150 150 150 150 150 150 
##$TP07= 0
##$TPNAME0= <>
##$TPNAME1= <>
##$TPNAME2= <>
##$TPNAME3= <>
##$TPNAME4= <>
##$TPNAME5= <>
##$TPNAME6= <>
##$TPNAME7= <>
##$TPOAL= (0..7)
0.5 0.5 0.5 0.5 0.5 0.5 0.5 0.5 
##$TPOFFS= (0..7)
0 0 0 0 0 0 0 0 
##$TUNHIN= 0
##$TUNHOUT= 0
##$TUNXOUT= 0
##$USERA1= <user>
##$USERA2= <user>
##$USERA3= <user>
##$USERA4= <user>
##$USERA5= <user>
##$V9= 5
##$VALIST= <valist>
##$VCLIST= <CCCCCCCCCCCCCCC>
##$VD= 0
##$VDLIST= <DDDDDDDDDDDDDDD>
##$VPLIST= <PPPPPPPPPPPPPPP>
##$VTLIST= <TTTTTTTTTTTTTTT>
##$WBST= 1024
##$WBSW= 4
##$XGAIN= (0..3)
0 0 0 0 
##$XL= 0
##$YL= 0
##$YMAX_a= 212662
##$YMIN_a= -142138
##$ZGOPTNS= <>
##$ZL1= 120
##$ZL2= 120
##$ZL3= 120
##$ZL4= 120
##$ABSF1= 10
##$ABSF2= 0
##$ABSG= 5
##$ABSL= 3
##$ALPHA= 0
##$AQORDER= 0
##$ASSFAC= 0
##$ASSFACI= 0
##$ASSFACX= 0
##$ASSWID= 0
##$AUNMP= <proc_1d>
##$AZFE= 0.1
##$AZFW= 0.1
##$BCFW= 1
##$BC_mod= 2
##$BYTORDP= 1
##$COROFFS= 0
##$CY= 11.3945322036743
##$DATMOD= 1
##$DC= 2
##$DFILT= <>
##$DTYPP= 0
##$F1P= 15.7292609196834
##$F2P= 12.9074282941183
##$FCOR= 0.5
##$FTSIZE= 0
##$FT_mod= 4
##$GAMMA= 1
##$GB= 0.15
##$INTBC= 1
##$INTSCL= 1
##$ISEN= 128
##$LB= 0.24
##$LEV0= 0
##$LPBIN= 0
##$MAXI= 10000
##$MC2= 0
##$MEAN= 0
##$ME_mod= 0
##$MI= 1.114404
##$NCOEF= 0
##$NC_proc= 0
##$NLEV= 6
##$NOISF1= 3.799351
##$NOISF2= 2.8
##$NSP= 1
##$NTH_PI= 0
##$NZP= 0
##$OFFSET= 15.70392
##$PC= 1
##$PHC0= -21205.45
##$PHC1= 11.45272
##$PH_mod= 1
##$PKNL= yes
##$PPARMOD= 0
##$PSCAL= 0
##$PSIGN= 0
##$REVERSE= no
##$SF= 200.130013532006
##$SI= 16384
##$SIGF1= 3
##$SIGF2= 2
##$SINO= 400
##$SIOLD= 16384
##$SREGLST= <1H.CDCl3>
##$SSB= 0
##$STSI= 0
##$STSR= 0
##$SW_p= 3612.71676300578
##$SYMM= 0
##$S_DEV= 0
##$TDeff= 0
##$TDoff= 0
##$TI= <>
##$TILT= no
##$TM1= 0
##$TM2= 0
##$TOPLEV= 0
##$USERP1= <user>
##$USERP2= <user>
##$USERP3= <user>
##$USERP4= <user>
##$USERP5= <user>
##$WDW= 1
##$XDIM= 8192
##$YMAX_p= 0
##$YMIN_p= 0
$$ End of Bruker specific parameters
$$ ---------------------------------
##NTUPLES= NMR FID
##VAR_NAME=  TIME,          FID/REAL,        FID/IMAG
##SYMBOL=    X,             R,               I
##VAR_TYPE=  INDEPENDENT,   DEPENDENT,       DEPENDENT
##VAR_FORM=  AFFN,          ASDF,            ASDF
##VAR_DIM=   8192,          8192,            8192
##UNITS=     SECONDS,       ARBITRARY UNITS, ARBITRARY UNITS
##FACTOR=    0.0002768,     1,               1
##FIRST=     0,             0,               0
##LAST=      2.2672688,     0,               0
##MIN=       0,             -142138,         0
##MAX=       2.2672688,     212662,          0
$$ Real data points
##PAGE= N=1
##DATA TABLE= (X++(R..R)), XYDATA
$$ [...]
721g52r64O34Q5J93P91n66k04K022N28k009L5J988r81k085R68Q87j584l51J665
740C00j25q99J170R68r91k47J029n22j167J16K20p47l8M96l95K47J192J7o67P65
760G22P49p71m36L42r14p82J039K7j971J97K308L2j528M95J487K44n39n05k79
779h3Q16M78j812q22K050N29k110P6K208k68j505N24N12q59NJ5j326j38J503j72
799c79j189O20J230L94L10o3o60Q12J232j218j822P18R91j014q05K47O6K99O07
818C76n38o90R44P06j171p92O64N84n51o68K05J023J069p59j182J416K252r92
836A896k908L61K599m73l150p85K127R85j484r56Q03J503Q02j108j139J356J563
853A992j464j911J232J249j363r98R08P50j8Q8q19j28J815K07k618p02K415J66
$$ plain form
721 -752 -1716 -1082 -997 -804 -13 -579 -783 1239 1767 -242 -207 1781 800 -1285 -317 570 -1014 -1365 300
740 300 175 -724 446 1414 423 176 1205 683 -484 -368 -148 -895 -933 -437 -832 -585 607 624 -43 722
760 722 1471 700 264 606 -308 -1090 -51 -24 -1995 -1798 510 542 -986 -491 996 1240 701 196 -83
779 -83 733 1211 -601 -1423 627 1156 -954 -878 1330 1062 -443 81 593 -266 -261 -246 -1572 -1710 -207 -379
799 -379 -1568 -948 282 676 986 923 263 1075 2307 1089 -733 -15 976 -38 -843 -596 -530 -231 376
818 376 -162 -852 92 798 -373 -1165 -501 83 -468 -1136 -931 92 1161 402 -780 636 2888 1896
836 1896 -1012 -651 1948 1475 -1675 -2460 -333 652 -832 -1788 -985 518 1320 212 -927 429 1992
853 1992 528 -1383 -151 1098 -265 -1263 -355 395 377 465 -354 -482 1333 1540 -1078 -1780 635 801
871H01k177l13J231N58K82r7n08P71J322n90r93L98o2q97K24n2j300Q6J278m11
891d49p05R92N61o36M70L52o97J89N31j324l81J970j21k102Q28K331n55j266P03
910F91K16m61O74p54k055M41J960j137k033J222J538m59k10N96J48K57M07n95
928D46n50M76K8j013j01Q49N6o17Q1P25O49m09p12J47O52l85q00k30k2p7N81P9
950a47p01N05J217jp08L93J85n93j9J52q20m57O08k6m07N23N37l89J87J034j9
971A054j056kO77j96p46l34K7K52M88q9o08M19J134k46r74K40O24p16q81L71L43
992b19n49l81O04N87K84J01l31L02R54N7j392m65R90K63j226o99N78O50q0k63
1012b35q4M10N91j18p76k14P50k53j205L2J229j07j048M02J392J65o99J34M76
$$ plain form
871 801 -1376 -1689 -458 100 382 285 -223 548 1870 1280 287 685 623 -274 -50 -102 -1402 -1316 -38 -449
891 -449 -1154 -162 399 -237 233 585 -112 77 608 -716 -1097 873 752 -1350 -522 1809 1254 -12 691
910 691 907 446 1120 366 -1689 -1248 712 -425 -2458 -1236 302 -157 -367 229 377 634 1041 446
928 446 -104 372 400 -613 -714 135 191 -426 -345 380 1029 620 -92 55 707 322 -478 -708 -730 -807 -226 -147
950 -147 -848 -343 874 873 165 558 743 150 131 283 -537 -994 -386 -412 -819 -296 241 -148 39 1073 1054
971 1054 -2 -4 673 477 -269 -603 -576 -324 164 75 -533 -114 1020 774 -200 40 664 -52 -933 -562 -219
992 -219 -768 -1149 -545 42 326 427 96 398 1352 1409 17 -448 542 805 -421 -1120 -542 108 28 -235
1012 -235 -319 91 682 564 -212 -426 324 71 -1134 -1102 127 20 -1028 -626 766 931 232 366 842
1031H42n7o9m70p32N4O55m73r90O73P82m32L8Q40j58o11O21L23j063m90P27j37
1052a27p00L95L51k44K82P24k84n25P82K36j124k19Q05l94r98M17O21j86P1K66
1072A49J02M04N08o31o87N63M76j037r14M44N88m24m43M31M72R2RJ22Pm3J66k96
1094E8m80L9M04j91m63O31O07l33j50O63J05n80O0L9o67j02K38p00m06Q96P9o70
1116i23O98J027p63m17J256J08j297mR32n71q71M69M58k49J04K85k9K53K85m68
1136B83k82L54j32p04j20L24k17j64L99M08l32J9P71L24r21k34P11o2j031k73
1156h79Q73j19n85L35O45J8r4L03M8L3J5l22m32J79L6o11n6M80j96j35P36K16
1178D88q19K38J016m53j206K74Q22m72q50K91O82R5r5J06K66L40l4m13k7K33l15
$$ plain form
1031 842 785 716 246 -486 -432 223 -250 -1240 -567 215 -217 -179 661 503 -108 513 836 -227 -717 10 -127
1052 -127 -827 -432 -81 -325 -43 681 397 -128 654 890 -234 -453 352 -42 -1040 -623 -2 -188 -117 149
1072 149 251 655 1163 532 -155 408 884 -153 -1067 -623 -35 -459 -902 -471 1 93 102 224 231 188 354 58
1094 58 -422 -383 21 -170 -633 -2 605 272 122 785 890 310 370 409 -258 -360 -122 -822 -1228 -332 -253 -923
1116 -923 -225 802 39 -378 878 986 -311 -315 617 46 -825 -356 102 -147 -43 242 213 466 751 283
1136 283 1 355 223 -481 -601 -277 -494 -658 -259 149 -183 -164 607 931 10 -224 487 425 -606 -879
1156 -879 -6 -125 -710 -375 270 288 194 497 545 578 593 271 -161 18 54 -557 -613 -133 -329 -464 272 488
1178 488 -331 -93 923 470 -736 -462 360 -112 -962 -671 11 106 11 117 383 723 689 276 249 482 167
1199A67p14N3L43l27l04M91M42k06J99N43j04n73L35M46p69p73L35L78l46l18
1219g02J81L58L82O4k06K9M85jp75o6M25m61l94L75L42k99K9P56J42k41J41J99
1241G63k69l43n8l25m19k06P3k8P8O9K17K67N27J92k16L3N29Op34j95N35k58n38
1264c00J72K78k19p5K98O7k20J5n4k90J26mo45l4O96j49m12M86P29k73l6O32K12
1287A000n00j55L49m3o46m02K09J72m06l97J78M60j54j75J64N23p3k34K16M27
1307E13j26m49R8O79j88p76K09P23m19p99L32N10o38n22M54L37m38j17L92L38
1327A13M3j98kO20K52n90k29P11Pq81R7O97m72p78L97N89n72o68L22N73k93n26
1349g88lO09J93m18n6O20M24k95J8N04K71m22k75L62J2q51m37N80K3j020k49Q53
$$ plain form
1199 167 -547 -494 -151 -478 -782 -291 151 -55 144 687 583 10 345 791 22 -751 -416 -38 -384 -702
1219 -702 -521 -163 219 283 77 106 591 590 -185 -251 174 -287 -681 -306 36 -263 -234 522 664 423 564 763
1241 763 494 151 93 -232 -651 -857 -784 -812 -734 -665 -448 -181 346 538 322 355 884 890 156 -39 496 238 -300
1264 -300 -128 150 -69 -144 154 221 1 16 -38 -328 -202 -206 -851 -885 -189 -338 -750 -264 465 192 156 788 1000
1287 1000 500 345 694 651 5 -397 -188 -16 -422 -819 -641 -181 -335 -510 -346 177 104 -130 86 513
1307 513 387 -62 36 715 527 -249 -40 683 264 -535 -203 307 -331 -853 -399 -62 -500 -617 -225 113
1327 113 156 -42 -44 576 828 238 9 720 727 -154 -57 640 168 -610 -213 376 -196 -864 -542 31 -262 -788
1349 -788 -791 -182 11 -407 -463 157 581 286 304 808 1079 657 382 744 756 -95 -532 48 71 -949 -1198 -345
1371c45Oo07K86N85mN8L01m8K1L94j75k84L11n4n95K17N39p57n17J083J87j240
1393f38L9J197l47j088M53N38m12k65K00L7J62J76l22J33R42k92p55O87R79r78
1413D46j015Q36O76j170r30O77M74o32m05L46N65K47r5l2N48M78k86l02J46N5
1433F27m75l27J44k46n80K43N47l43m55P83O45n84k41Q07L4r35R9N72m58p36L75
1454e04N93P7l42K5O56R06l73j294N87J431j112k092O45J343j249j340R91J009
1472d3m79k20P73O36J50l22r6N71Q9j129n49Q84O4j340m2J185J08q27M71P12j74
1493D22r3J29j48l54o3p8j49l26q4L11N23l08l27R30Q42p37p80P65O65j029r91
1514h80M87P01o12q79O08R92k11p93N24J059k49j025J89R53k91j223r6R70J88
$$ plain form
1371 -345 -339 -946 -660 -75 -79 -21 280 232 253 647 472 188 499 445 -150 67 606 -151 -668 415 602 -638
1393 -638 -599 598 251 -837 -384 154 -258 -523 -323 -286 -124 52 -270 -137 805 513 -242 445 1424 446
1413 446 -569 267 943 -227 -1157 -480 -6 -638 -1043 -697 -132 115 20 -12 536 1014 728 426 572 627
1433 627 152 -175 -31 -277 -857 -614 -67 -410 -865 -82 563 -21 -262 545 579 -356 -257 315 -143 -879 -504
1454 -504 89 166 -176 -151 505 1411 1038 -256 331 1762 650 -1442 -797 546 -703 -2043 -1052 -43
1472 -43 -522 -742 31 667 817 495 399 970 1059 -70 -619 265 329 -1011 -1053 132 240 -587 -116 596 422
1493 422 329 458 310 -44 -107 -185 -334 -660 -744 -433 90 -218 -545 385 1227 490 -290 475 1140 111 -880
1514 -880 -393 308 -304 -1183 -575 417 206 -587 -63 996 747 -278 -89 864 573 -650 -746 224 412
1533D12r97k47R73M16o14l28O28K06m39l83J43Q0j05k50K53K78%R0L09J94l19
1554C00l3L19k45n60j2K64m25l57N29K33l71J75N25O6l10J3L1j2n1n48l56O39
1576a86L42p42j11J121L59p17J5Q02k0o71n3K5l22j97j39j17J10K70N0o2M88L24
1598E69k80J7K88l14l89N2j39l56q3K12J28j5J93L32K94p2J2L8P1l02l44rp9k93
1622d69k5K31j4R9K38J60J31J08Rk41j07Q1l23m38J07J81l36R6N15P4j88M26L79
1645F94l01l18L22Ml90j98L8k05JK86k05l1N76J24n20K60N07m61m98M13M5o05
1667d62q8M21k26m8M23O3j74L71J39k95J17J81m25j74N18l73n69N05M44o27j14
1688c93O86p2m48L80J29m08M9K56l79p0N48m41m60O81M07q22j51R14j4p56K38
$$ plain form
1533 412 -585 -832 141 557 -57 -385 243 449 10 -373 -230 -150 -255 -505 -252 26 26 116 425 619 300
1554 300 267 586 341 -219 -231 33 -392 -749 -220 13 -358 -183 342 408 98 111 142 130 79 -469 -825 -186
1576 -186 156 -586 -697 424 783 66 81 883 863 192 139 164 -158 -355 -494 -611 -501 -231 -181 -243 245 569
1598 569 289 306 594 280 -109 -57 -196 -552 -635 -423 -295 -310 -117 215 509 437 449 487 558 256 -88 -97 -176 -469
1622 -469 -494 -263 -277 -178 60 220 351 459 468 227 120 201 -122 -560 -453 -272 -608 -512 3 77 -111 315 694
1645 694 393 75 397 401 11 -187 -149 -354 -353 -67 -272 -303 273 397 -123 137 644 183 -315 98 143 -462
1667 -462 -550 -129 -355 -403 20 83 -91 280 419 124 241 422 -3 -177 341 -32 -601 -96 348 -279 -393
1688 -393 293 221 -227 153 282 -126 -77 179 -200 -270 278 -163 -623 58 465 -357 -508 406 392 -364 -126
1709a26M02j14j53M7R3P7J04k89j22L47J3n90n7M55j13k90KK67J73o0m4J79K8
1732B29k76L6K50k23o99K27O56m81n40N77P91l43l01M98M05l34k34m1m0n8m44
1753c45m06J80N04k90m57N54Q91j84m97M53M69n08m16K96l31q48L33O99o32o88
1773a223J015R50n04l28O79M50l89j88m69r2L18m12j108M68J190o94r28J216J262
1792A213q70o98J044K82p77k68Q4m67j95L71k14k59L29M71J19L06r4k02N48M50
1812A173r62p19O39K75r36m30P98J98m35L8M83K38Mk77r6L10J08p35l30N15K33
1833I2n41JM98K1r7N15J10q14M7R32k26j213J40R24k54o16L61K70j00K49Qm63
1855a56J76M66o62o71P66L06r50K4J053Lo75N12M85m82n7M71n90o92O29J85q53
$$ plain form
1709 -126 276 162 9 56 149 226 330 41 -81 266 279 -311 -368 87 -26 -316 -314 -47 126 66 22 201 229
1732 229 -47 -11 239 16 -683 -456 200 -281 -821 -244 547 204 -97 401 806 472 238 197 157 99 -345
1753 -345 -751 -571 -67 -357 -814 -260 631 447 -50 403 872 364 -52 244 -87 -935 -602 97 -535 -1223
1773 -1223 -208 742 238 -90 589 1039 650 462 -7 -99 219 -193 -1301 -833 357 -337 -1265 -49 1213
1792 1213 343 -355 689 971 194 -74 10 -457 -652 -281 -495 -754 -425 46 165 471 377 175 723 1173
1812 1173 211 -508 131 406 -530 -960 -162 36 -399 -361 122 360 364 87 -9 301 409 -326 -656 -141 92
1833 92 -449 -448 50 71 -26 489 599 -215 -168 764 538 -675 -535 389 135 -481 -120 150 50 299 307 -156
1855 -156 20 486 -176 -847 -81 225 -725 -701 352 355 -320 192 677 195 138 609 19 -673 -44 141 -712
1876g12j05O66J65l1K73J46q6M59K1n83k67J93k64m83j47R6J02J38J76K06M26
1897C89J71m8J14J19l32m08j19j37l22l6Q2j24K48N56J85j16L95K69j39k52r8
1918C97l55k88j39j75l83j3N24K54o6K97M52K06k03NJ41k63n07q8pk98k08L46
1940c71J44j35M49L15r9O5L77k03n06Q9J02o36k55N16j98m73N40N44m36n7P50
1961E22Q0n73J48L44n10l74L83k0m04P5M57k11k07N14K35l89m6L50j94m13L64
1982A31R9n67J4N72j62n67L95M49m90j81N55j97o00M75L15n94J33O10k23m23O21
2003C65J17n95M7N28l98m61L37K3k92J85J80k90K84L42k76r5L14j54l26J79Q8
2024A02n52n9M42q2l05L55K65j24K40K34l29mL06l14m15K23K2n75J58N62l03m57
$$ plain form
1876 -712 -817 -151 14 -17 256 402 316 775 796 213 -54 139 -125 -608 -755 -659 -557 -419 -243 -37 389
1897 389 560 512 626 745 413 5 -114 -251 -573 -609 -527 -651 -403 153 338 222 617 886 747 495 397
1918 397 42 -246 -385 -560 -943 -956 -432 -178 -244 53 505 711 508 513 654 391 -116 -204 -211 -509 -717 -371
1940 -371 -227 -362 87 402 303 368 745 542 36 125 227 -409 -664 -148 -346 -819 -279 265 -171 -228 522
1961 522 602 29 177 521 11 -363 20 0 -404 -329 128 -83 -290 224 459 70 24 374 180 -233 131
1982 131 230 -337 -323 249 87 -480 -85 364 -126 -307 248 51 -549 -74 241 -353 -220 390 167 -256 365
2003 365 482 -113 -66 462 64 -397 -60 -37 -329 -144 36 -254 30 372 96 1 315 161 -165 14 102
2024 102 -450 -509 -67 -149 -454 -99 166 42 282 516 187 183 489 175 -240 -17 5 -570 -412 150 -153 -610
2046f10P40M46m82j38N14j68m47K50J06o44K7M14k43k39M65J02l33M60L97n51
2066F6k03O87j24p69J91M55o12j45O82j72n95M85M95m98JL81l40j41N17l07o41
2087e87N03L76o32r2O65k17l34N55J52o02J29N22m61k42N37j85n78N76M02o50
2107a63j72P53k18n38M72J08p08K65N75m92m64O45K04n61K83L62m35j82O41j72
2127B03n97K05N10l87k55M54O6k71R2L79k31j80J53M5k22J2K2k74LL12o2k52J54
2150a21M01k63j20K85J7l13N9K88k91k77K04K33k52l2J43J40J57p9j93J86J08
2171B80j94j87K05o9l14N0K53q9j90K33J42p8J14n9j76J14J23l85P3K53k11k72
2193c84M30K27n40O6N88j12m09K88J13k75k3J24j76j07J93l8j99J84J97k46o2
$$ plain form
2046 -610 130 576 94 -44 470 302 -145 105 211 -433 -406 8 -235 -474 -9 93 -240 220 617 66
2066 66 -137 550 426 -343 -152 303 -309 -454 228 56 -539 -54 441 -57 -56 325 -15 -156 361 54 -587
2087 -587 -84 292 -340 -432 233 16 -318 237 389 -213 -84 438 -23 -265 272 87 -491 85 487 -163
2107 -163 -335 418 200 -338 134 242 -466 -201 374 -118 -582 63 267 -294 -11 351 -84 -266 375 203
2127 203 -394 -189 321 -66 -321 133 199 -72 20 399 168 -12 141 186 -36 -24 -2 -276 -273 39 -23 -275 -121
2150 -121 280 17 -103 182 199 -114 -55 233 -58 -335 -131 102 -150 -182 -39 101 258 179 -14 172 280
2171 280 86 -101 104 35 -279 -229 24 -65 -255 -22 120 42 156 97 -79 35 158 -227 -154 99 -112 -384
2193 -384 46 273 -267 -201 387 275 -134 154 267 -8 -31 93 -83 -190 3 -35 -234 -50 147 -99 -161
2214a61L81p5m05K01K83l89j24K38J18k44P4K55j13o4K10K2j04kJ14k39q7K64
2236A53j26k48J88K79l82q1M34j08k31J16J05k46o3K89k15r0K37Nk19K16K73l73
2258h7n2M42j16m77L41K92m92j36M19Pl36J85J44j63N9M8j96O0K89k56l15L29
2280a1J37l58j19M48mk73R6L17r3k70J08J96k20o3K2J35J6j48kJ90R5j41j27J45
2304G6J44j70j85R2J02j16k23K24J13k98M1L48L6l21J04K32q0k26M9J25Mj78Q7
2327b0L2P9K6j27Q6K08k12k26K53M0k57r3K40m7k05L8J86M5j10K6J37Q9k15K1
2351fQ7N1j30q5M6P2p1oK7N9J19k00J05O9m9j02M7P5j75j32K13K0k19O3K91j03
2377F6j96K14o2j36J72lk35J63N0j91m0L20J0j91Q6J65j93M4J24n3j86J40Mj43
$$ plain form
2214 -161 220 145 -260 -59 224 -165 -289 -51 67 -177 -103 152 39 -25 185 207 103 101 215 -24 -111 153
2236 153 27 -221 -33 246 -136 -217 217 109 -122 -6 99 -147 -210 79 -136 -226 11 16 -203 13 286 -87
2258 -87 -139 303 187 -290 51 343 -149 -285 134 141 -195 -10 134 -29 30 78 -118 -58 231 -25 -340 -11
2280 -11 126 -232 -351 97 93 -180 -84 233 140 -130 -22 174 -46 -109 -87 48 64 -84 -86 104 199 58 -69 76
2304 76 220 50 -135 -43 59 -57 -280 -56 57 -241 -200 148 184 -137 -33 199 119 -107 -58 67 71 -107 -20
2327 -20 12 91 117 -10 76 284 72 -154 99 139 -118 -211 29 -18 -223 -185 1 46 -64 -38 99 188 -27 -6
2351 -6 81 132 2 -83 -37 35 -36 -42 -15 44 163 -37 68 137 88 -14 33 108 -67 -199 14 34 -185 -122 169 66
2377 66 -130 84 22 -114 58 55 -180 -17 33 -158 -198 122 132 -59 27 192 -1 43 167 114 -72 68 72 -71
2401g1OJ32l9j32O1L9n8J13k2q5m6J54j04j00P9Q7m2mN4RM8k3jj4O4Jj06l8N6
2430A8no4%N8L1m9j6N8p7O5n7pm7K1KJ8M9L0n8R0K6j82M3J86j7j82P7J15k20N4
2460d0J68j89m5K08k8j96J81J14k29n0K30q8j68J18K8j35L8J44j71j2K75m5k02
2483i4R3J42j46n2J57j06j25J79L8q5QR0p8l1J59j11n3J6J8j60NJ96j14q9O2K07
2509A26j84n6J72j6p3K0O8m3j1J32n7r8M0L1k6P4n5n8M1J48j13k49J73K60k35
2534A1k01J40J11l9n7J12j00m5J38k6j88P3J31l0j00j8M3M6J36j46k3J15J26l00
2558i1r4K31J45j97j57J21J83l4k01O0P4Qk1kj27oJ76J5j78p4K36K5j08m3J5K29
2584A85oj70j08J59J88k27k16J48K37j65k07J47J76j33o9k0J6N3J1o5l5L1J24
$$ plain form
2401 -71 -65 67 28 -104 -43 -4 -62 51 29 -56 -102 52 -52 -152 -73 14 -28 -32 22 31 79 56 55 41 105 106 0 -38 18
2430 18 13 -51 -51 7 38 -11 -27 31 -46 19 -38 -45 -92 -71 -69 -51 -2 28 -30 60 86 -96 -53 133 116 -66 11 126 -94 -40
2460 -40 128 -61 -106 102 74 -122 59 173 -56 -106 124 36 -132 -14 14 -121 -83 61 -110 -122 153 108 -94
2483 -94 -1 141 -5 -57 100 -6 -131 48 86 1 9 99 21 -10 149 38 -15 1 19 -141 -136 60 -54 -143 -81 126
2509 126 -58 -114 58 42 -31 -11 57 14 3 135 78 -20 20 51 25 99 44 -14 27 175 62 -187 -14 246 11
2534 11 -190 -50 61 22 -35 77 -23 -68 70 44 -144 -71 60 30 -70 -88 -45 1 137 -9 -32 83 209 -91
2558 -91 -185 46 191 -6 -163 -42 141 107 -94 -34 40 48 27 25 -102 -108 68 83 -95 -169 67 92 -16 -59 -44 185
2584 185 179 9 -99 60 248 21 -195 -47 190 25 -182 -35 141 8 -61 -81 -65 -12 -1 -66 -101 -70 54
2607E4M9j72r1K14J60k05j78J80K47j82j02r2J56J14j19k55R3K91n6k85J29J87
2629A37j65r3R6L7j13Q1L3j20O5J15j49opJ50Jp9n1l5K55m0k02m2K21Q8k34n8
2655a15J95N9m1j12K4j0M2l0j11RJ4P9p3k8J5L8k4PK7QO0Qj17Q7J06lk04M9J65
2684A24J2j92J8J00mK2o5j02m4K36o6k07N1J96o6j33Q9P3j16R6P7j38j0J36L0
2709A17k16J12N5j04n7J49J5o4lO7q9k1J36j6j49kJ27k2j74L9J99n5r4pO3n6J30
2736H0jj55k2J24K7j27oJ32k6j1K4Rp3Q5L3j09o0J15Q4j52l3J38l4j19P3k1M5
2763B0o4R1q9k9Q7M4r5qJ5j4M8pL2l5J04j4k6k2M3N0o1q2J18l4r0oN3n2RK2mm2
2795c8J6K9o4k0M6M0j01Q4M3n6K2R9r3k8P7Q3j97N9P6l1m6j6L5k5N0o6L5J7m5
$$ plain form
2607 54 103 -69 -160 54 214 9 -169 11 258 76 -26 -118 38 152 33 -222 -129 162 106 -179 -50 137
2629 137 -28 -121 -25 12 -101 -20 13 -107 -42 73 -76 -82 -89 61 62 -17 -68 -103 152 112 -90 -132 89 177 -57 -115
2655 -115 80 139 98 -14 10 0 42 12 -99 -90 -76 3 -70 -98 -83 -45 -69 -62 -35 -27 33 41 -76 11 117 114 -90 -41 124
2684 124 136 -56 -38 62 58 80 15 -87 -131 105 39 -168 -117 79 13 -120 -31 42 -74 22 99 -39 -49 87 117
2709 117 -99 13 68 -36 -93 56 71 7 4 71 -18 -39 97 81 -68 -70 57 35 -139 -100 99 44 -50 -57 6 -50 80
2736 80 79 -76 -98 26 53 -74 -80 52 26 15 39 48 -25 60 93 -16 -76 39 123 -29 -62 76 42 -77 -4 -25 20
2763 20 -44 47 -42 -71 16 60 -35 -43 -28 -42 6 -1 31 -4 100 86 60 38 81 131 70 -12 106 72 -18 -24 29 -23 -14 8 4 -38
2795 -38 -22 7 -57 -77 -31 9 -92 -8 35 -21 1 100 7 -21 56 139 -58 1 77 46 0 -16 19 -6 44 -22 13 30 -15
2824a5L4o7pQ2n2l4J5K6K9n7k4O2l3M7J8L5l2j0Q6o3r3O7P7r9m6L1K7l6M8jq2
2855f7Q1k5l3O1l2K7m0R1p9r6J47j6j05M3J15m6l6M0O5j18P6k2Jk5L0l6n5O2K6
2884C4m5J3Lm0L2K5mj26K5J02j5n8k4Q6Q0j17m9J51k9o2j5J17l9n3L0N0Qp3j9
2913a2L0L6n7m4K3R3o1q6J08J5j06l7P6L7j26J9J09L0m5m2O6Oo2o0O8R3n7j08
2941i4J23N2o1j04J16J5k3o3N8%K2k6m8K4j9qm2J16r1q6P6R5j4o9J2J34n9p7O7
2970B6N8k2j64J23Q0k2j25KJ13o2m7M2P6r1J3KQ8j39N1o9L7M5n9k1J00J8j60N0
2998e7J23Lj50O7J06m8r8R0K3m0j8l3J5R7q5l4NP0l1j4O0rr1k9O1J4p1n2R6L3
3028Co1P1M5kj15Q7N5r0k4J26o0j27R4L3k2L3J6k7j02J79o7p9k2Q1q7n7J01l7
$$ plain form
2824 -15 19 -48 -55 27 -25 -59 -44 -18 11 -46 -70 -8 -41 6 24 59 27 17 103 40 -53 14 91 -8 -54 -23 4 -32 16 15 -67
2855 -67 14 -11 -44 17 -15 12 -28 63 -16 -112 35 19 -86 -43 72 26 -10 30 95 -23 53 31 32 7 37 1 -54 8 34
2884 34 -11 2 5 -35 -3 22 18 -108 -83 19 4 -54 -78 8 88 -29 -78 73 44 -18 -33 84 45 -8 22 72 80 7 -12
2913 -12 18 54 -3 -47 -24 69 8 -78 30 45 -61 -98 -22 15 -111 -92 17 47 2 -40 26 32 -30 -90 -22 71 14 -94
2941 -94 29 81 20 -84 32 47 24 -39 19 19 41 15 -33 -9 -28 -36 -78 38 -53 -139 -63 32 18 -51 -39 95 36 -41 26
2970 26 84 62 -102 21 101 79 -46 -44 69 7 -40 2 78 -13 0 2 90 -49 2 -67 -30 15 -44 -65 35 53 -107 -57
2998 -57 66 69 -81 -14 92 44 -54 36 59 19 1 -32 -17 80 -5 -39 -34 36 5 -9 51 42 -49 -78 -17 -3 -74 -126 -30 3
3028 3 -58 13 58 56 -59 28 83 -7 -31 95 35 -92 2 35 13 46 62 35 -67 112 45 -34 -56 25 -62 -119 -18 -55
3056e5kK2N1m0o3J09M0p8N2pk0j7N2l3q3J20n1m3K1K0P7k7j6j6k1M7J2l6m5o8
3086i8N9k4j4L6pj3K4J18k8m7L1Mq4L6JK1j11N1Q4o1K4O5k5k1O2kn9qL2j19K2
3117e1Onn2N0R8p4P5J6L7j29Q3l3j9k4k6K8n8L3P8m0M1KK6M3n0j8J9n1L2r7l6
3148i6k0Q7j0p0Q8Q4q2J6Q2N4j78O0M9r1l7j3L9L0mj3MJ13kj22P3Q4q5n2K0K1
3178B9j20p6J07K2n8J6N2P7k1q1L7R9l2p9P8q1J3l7j3Q2Omo3J64L2j27LJ30j15
3207D0j17M2J01r7r1J24N0o4k2J23j9j5o4nM5k8r7n1J40J5j26RJ25N1q6L1J32
3234A46p7j20P9R1p4j49j5P9J6o4P8J28n5j39J09M7n3n9Q0l3j1n3o6L2J13p7l7
3261h4J75M0j28L4J27q1p4M1R3j89J4n5K7l9M1lM8O5p2L7L7J3m8n1N5o8k2j8L0
$$ plain form
3056 -55 -57 -35 16 -24 -87 22 62 -16 36 29 9 -8 44 11 -72 48 -3 -46 -25 -5 72 45 29 13 -8 39 51 15 -30 -98
3086 -98 -39 -63 -77 -41 -48 -61 -37 81 53 6 37 41 -43 -7 -6 15 -96 -45 39 -22 2 67 42 21 83 81 22 14 46 -73 -51
3117 -51 -45 -50 -102 -52 46 -28 47 63 100 -29 54 21 2 -22 -48 -20 -78 -45 33 -7 34 36 62 105 55 37 56 5 37 -60 -96
3148 -96 -116 -29 -39 -109 -21 63 -19 -3 79 133 -45 15 64 -27 -64 -77 -38 -8 -12 -25 -21 92 90 -32 41 125 40 -12 8 29
3178 29 -91 -167 -60 -38 -96 -80 -28 49 28 -53 -16 83 51 -28 50 -31 -18 -55 -68 14 20 16 -47 117 149 22 25 155 40
3207 40 -77 -35 66 -31 -122 2 52 -12 -34 89 70 55 -9 -14 31 3 -94 -145 -5 10 -116 -107 18 69 -17 14 146
3234 146 69 -51 28 119 45 -104 -119 -40 -24 -88 -10 118 63 -76 33 80 27 -32 48 15 4 -49 -115 -83 30 -47 -84
3261 -84 91 131 3 37 164 83 9 50 143 -46 -32 -87 -60 -99 -58 -61 -13 52 -20 17 54 67 19 -32 23 -45 -67 -85 -55
3290e5N3o3P6Q7n8j1N0K2j9n0p1P8q8J3kL6l2n8O6N0O7n7lJL7j44l9P0K0q8L7
3321g5M8qk7J06M4q6P1Qm0JJ3q7K5n2N7l0K2J5Nl4N8N1o4m4O6k3m6l9L0l8L8n
3353d0J4M5L2j1j1pM3o6k8J06r9K0q2J08nj35R4L0L5j10Q0QOqqJ8k6j8nl0L7K2
3385Ij9j2L8J6j9N5J6j05jM9n0l7m4J72p7q2N9R6Jo1j2L4lj1n3L0nrk1N0j0j5
3417b1k5N1R7r1k2L8O5j04K0l9N5m1nQ0o3j4K8nK8l1m4jO7m2kpL0j5o0L2O0J4
3449C3q3N1L1o3J3O3m5M5j8k0NN5l9j29J05J00q3j7O5J3j20l3J57rj36jJ05j6
3477B9r0qN7RJ3j1m0M0O5k6q8Q4j0n0K6K4k5l6J7L9l9jM6Jj6j3N7J3j03M5K5n0
3509a6q6R2J9k7M1n0NJ07o5p0L8N1K0j24N1J4K1j13J05Q6j22k7Q3M8j45L0O9n0
$$ plain form
3290 -55 -2 -65 11 98 40 29 79 101 82 32 -39 39 -49 -36 -38 -2 -34 -92 -26 24 91 34 31 32 69 -75 -114 -44 -24 -112 -75
3321 -75 -27 -35 -62 44 88 2 73 81 41 42 55 -32 -7 -59 -2 -32 -10 5 10 -24 34 85 21 -23 43 20 -26 -65 -35 -73 -35 -40
3353 -40 -26 19 51 40 29 22 65 -1 -29 77 -22 -2 -84 24 19 -116 -22 8 43 -67 13 21 27 19 11 29 3 -15 -20 -50 -13 9
3385 9 -10 -22 16 32 13 68 84 -21 -22 27 -23 -60 -104 68 -9 -91 -32 64 65 4 -8 26 23 12 -41 -11 -16 -25 -46 4 -6 -21
3417 -21 -46 5 102 11 -11 27 92 -12 8 -31 24 -17 -22 58 -5 -19 9 4 32 1 -43 -44 23 -19 -21 -28 2 -13 -73 -41 19 33
3449 33 -50 1 32 -31 -18 45 0 45 27 7 12 67 28 -101 4 104 21 4 69 82 -38 -71 86 77 -59 -60 45 29
3477 29 -61 -69 -12 -3 10 -1 -41 -1 64 38 -50 34 24 -26 0 24 -1 -37 -20 19 -20 -21 25 26 10 -3 54 67 -36 9 34 -16
3509 -16 -102 -10 9 -18 23 -27 -22 85 20 -50 -12 39 59 -65 -14 0 21 -92 13 99 -23 -50 33 81 -64 -34 35 -15
3537a5j9Qj4k6J22p3j0K8Ln2O1P6m7o2M0N5j11L7j6N0j10P3M1K4o1l5KJ00m9j01
3567h1Q7L1j4r3L3P8o3j9K5%mk1L4O2Nj04M7J06j13o6J33o4p3K3O4j9M0j2M4r3
3597b7O6j2j4LJ3j31K7R9j3j12O9P8p4R%jNqQ9q8Rm8QR9m9oK0k2NP2o1M5m4Qo8
3632e4R4n2o0K0J04q3o5K1N7K7l8P3%j25R1N6n2kKJ3j07P6l2n8O7O5o5l0R0lj03
3663g3R5K1o9k8P5m0o8M8J6J5j7J2P1qn7OjK2J4m8O8l4o7M7J9k2O6n6k3M6l4N
3695Al6N4j8q6R9l7m9JQ9J6o6M4j2j0L3l3n7J23m6kJJ1J7np1J36j22J5RK8n5L8
3727A0M9p3L4l3J6j1l7LK1J4L6o2J6L9n6J6kKj8L8rk5P9n8NJ5N8m1M0o0kM1k5
3760B0n4k0K6Jj2%k0j1N8O7L1j31N1O7j41J7L5J6m1N3j2J0m7Q0K7k0m3P0q7Rn0
$$ plain form
3537 -15 -34 -26 -40 -66 56 -17 -27 1 4 -48 13 89 42 -20 20 75 -36 1 -15 35 -75 -2 39 63 2 -33 -31 69 20 -81
3567 -81 6 37 23 -70 -37 41 -22 -41 -16 -16 -20 -41 -7 55 60 -44 3 109 -4 -70 63 -1 -74 -51 13 -6 34 22 66 -27
3597 -27 39 27 13 16 29 -102 -75 24 11 -101 -32 46 -28 -19 -19 -20 -15 -23 66 -22 -13 -61 -53 46 -3 -9 11 -11 -6 66 5 50 6 14 -54
3632 -54 40 -12 -72 -52 52 -31 -96 -75 -18 9 -29 44 44 -81 10 66 14 12 14 27 -80 -4 -36 -94 -27 38 -27 -57 33 30 -73
3663 -73 22 43 -26 -54 21 -19 -87 -39 -23 -8 -25 -13 58 50 -7 -1 -2 20 34 -14 54 20 -47 0 19 -3 63 7 -16 30 -4 1
3695 1 -35 19 1 -85 14 -23 -72 -71 18 34 -32 12 0 -10 23 -10 -67 56 10 8 9 20 37 32 -39 97 -25 -10 -1 27 -28 10
3727 10 59 -14 20 -13 3 -8 -45 -42 -21 -7 29 -33 -17 22 -34 -18 -20 -18 -36 2 -7 -32 47 -11 -6 9 67 26 66 6 4 45 20
3760 20 -34 -54 -28 -27 -39 -39 -59 -70 -12 55 86 -45 6 73 -68 -51 -16 0 -41 12 0 10 -37 43 70 50 7 77 -10 -1 -51
3791e1M4m9M2K0l5KPQ1n4nN4q8k5P8L8r5%N6q8O7L0M0o6l7R8m5m0O4l2O7j00L7
3823A5o3o8J69l5p2L3K6q1P6J3o6l3L3P4j3lm3O6j2l7M8lL1Pl6j1rK4p2N8J2j5
3855A3Rj2j4L2j1J9o0J9Jj6k0JL5k8K2L6l7N6j8J4m8Kl7KJ1N2l6K0O1m6KPL4J
3889F6m0n6Q5o3N4l9K8m4PL3n1j9M1J3J5l7N3m6k8KJ3k7J4J4ok8P8j4k6N7Oj7
3921C8o8l0N4N9m9m4J9M2p0J9K7mL0j6J3m9N8l4N6o9K2mn1M7Nk7LJ01p8JO5r5
3953b9n7J8N2n9J8P8n8k1P8j0KO6o4J8j5M5j8j00P5nMPl3K4KNK1J0m2m4O0o3K
3986c3O8l9K3m9l3R8l1n2kO1q9J60l4o0Kk2qJ3K0K3q5P4L0m2L2k1m8P6j6K5n8
4017a7%J6p5N5K5Lk4LL1Qm6L2K1k6qk3OOj1K7j3P3m6Oj1Ql3m8M9m6K7K0nL7k4
$$ plain form
3791 -51 -7 -56 -14 6 -29 -27 -20 61 7 2 56 -32 -57 21 59 -36 -36 20 -68 -1 29 69 3 -34 64 19 -21 43 11 78 -22 15
3823 15 -48 -116 53 18 -54 -21 5 -76 0 13 -53 -86 -53 21 8 5 -38 28 16 -21 27 24 55 62 26 15 6 30 -42 16 28 13
3855 13 22 10 -4 28 17 36 -24 -5 -4 -20 -40 -39 -4 -32 -10 26 -11 45 27 41 -7 -5 -42 -40 -29 23 -13 7 68 22 24 31 65 66
3889 66 26 -30 55 -8 46 7 35 -9 -2 31 -20 -39 2 15 30 -7 46 0 -28 -26 -13 -40 -26 -12 -18 -46 32 18 -8 49 55 38
3921 38 -30 -60 -6 53 4 -40 -21 21 -49 -30 -3 -7 23 7 20 -29 29 -5 51 -18 4 0 -51 -4 1 -26 -23 78 0 1 66 -29
3953 -29 -86 -68 -16 -75 -57 21 -37 -58 20 10 12 78 14 32 17 62 44 -56 19 14 18 25 -8 16 18 23 44 54 12 -32 28 -35 -33
3986 -33 35 -4 19 -30 -63 35 4 -48 -50 11 -78 82 48 -12 -10 -32 -40 -27 -7 16 -69 5 35 -7 25 4 -44 32 16 41 -17
4017 -17 -17 -1 -76 -21 4 7 -17 -14 17 25 -21 11 32 6 -2 -25 -19 -13 -24 3 -10 63 17 23 12 20 -13 -61 -12 -58 -31 -11 -16 21 -3
4052cK9j0Lm5L5M6n2J0OPMn3M2p4P9Qk2k9K6J9q5N3R4j04O4k9j5o2J5J23j14k
4084c6O2l9NK6l4Rj7N1j9n1J8L5j2K0ML6l5l1L3k0qK3lj3J1j6J9m8N4j6k0KK2
4117A2k1j0KK3n4L0%m4P7rK0l2%J0l6l8J16n8j6Q0k1J4j00P3m2L7O5q0l6L1k2
4148b9K5m6M1J0j5oj8l2O7jm9j3Q8l9L9jmn3M4L8o7L6o4qR3Kn1J6j2O1o8J7Pn1
4182d3K4P1o3m7O2M8p5J4N8j9l4lK9l4J4l8O1k7mnK2n3K6l4L3J9J6K0n6pO3j06
4214f8N1Q9j23lJ04k7p8Q3N7j18j8L8OPK7Pq2L8O5l3%k4L6n7L2K9r8P5Ln2P0k3
4246A3m8J0O9k3J1n3M6n5l2M6J9k1J9n3N6p2R5lj1J7k4L8r9M3M8op5L9j5j5K8
4277hK3oL0o9M0J0k0K0J4q1P7l1l4J0K1j6L2K2m4n0M5P3l0J1j7lpn4N3n7M8l2
$$ plain form
4052 -3 26 16 19 -26 9 55 3 13 19 26 30 -23 19 -55 24 32 10 -19 7 26 -59 -6 88 -16 48 19 4 -58 -43 80 -34 -36
4084 -36 26 -13 -8 18 -16 -7 -24 27 8 -43 -25 10 -2 18 22 58 23 -8 25 5 -3 20 17 4 15 -1 18 -30 24 8 -12 -10 12
4117 12 -9 -19 -17 6 -48 -18 -18 -62 15 6 26 -6 -6 4 -32 -70 46 -12 -28 52 31 45 -55 18 -24 13 78 -2 -38 -7 -29
4148 -29 -4 -50 -9 1 -14 -20 -38 -70 -3 -4 -53 -66 22 -17 22 21 17 -36 8 46 -21 15 -49 -57 36 38 -13 3 -9 52 -16 1 8 -43
4182 -43 -19 52 -11 -58 4 52 -23 -9 49 30 -4 -7 22 -12 2 -36 25 -2 -6 -11 11 -42 -16 -50 -17 2 18 38 -18 -25 38 -68
4214 -68 -17 72 -51 -54 50 23 -55 28 85 -33 -51 -13 -7 0 27 34 -48 -10 55 22 22 -2 34 -23 9 38 -60 15 18 -34 36 13
4246 13 -35 -25 44 21 32 -21 25 -30 -62 -16 3 -18 1 -52 4 -68 27 24 13 30 6 44 -55 -12 36 30 -45 -6 -21 -36 -8
4277 -8 15 9 39 -30 10 20 0 20 34 -47 30 -1 -35 -25 -4 -20 12 34 -10 -60 -15 58 28 39 22 19 12 -42 11 -46 2 -30
4309c0J4qM3o0jQ8M4j17P7mm5J0lkl1L9Rj5Qk5m7M8M6r3nJ11j05M4J8J6q6l0R6
4342DJ2r7J06J7j49J04mj8L2L1o6K4O2o3l1J0Q5j1m0K4m0k1J2K0j1l7N9L2j24
4371g8O5N5o6l2O1j0J8nn5O5mk6L8kn1K4K1LrPj4PK2l7j0k7J0L7j0L5J3o3N2n2
4405a8JJ5K6K3k0j4k7RK3m8lrN7j4K0J2l1n5N2L7m3j3M9l5m1J1mP9m2K2jj1%L2
4439C9J3k8k3q6R0M2m9j7KlL8K1j0k0n1K1m8Q0o0ON7L1l7p5J00l3k8J3K4j9rr
4471b8K4pJ7l6JK5L8m5%O5n3m6O6L1n3J4k5K0j7mM2k4l1N5jo0M8m4M9o7j1O7r
4504Ark7L9n1L0L0k3n1J9P7q1M3j4Pm9O1Kl4P8j3n8j1N9l1PN0l2l3J1N7l6n5K2
4537a5LM2kK4j1k4rl6pN6n3%K2Pj4M7K5j18N7L3k0Km2M0Nm7M3K9nn3M1n%k0Km1
$$ plain form
4309 -30 -16 -24 19 -41 -42 46 90 -27 50 46 1 11 8 6 -25 14 23 8 16 -9 -56 -8 38 -55 -60 51 -54 -10 8 24 -62 -92 4
4342 4 16 -81 25 42 -107 -3 -7 -25 7 38 -28 -4 58 -5 -36 -26 59 48 8 32 -8 -29 -17 3 -8 -45 14 46 -78
4371 -78 -13 42 -24 -56 5 -5 13 8 -47 18 14 -12 26 24 -27 -3 18 21 12 19 5 12 34 -3 -13 -40 -30 7 -3 32 45 -18 34 -18
4405 -18 -17 -2 24 47 27 13 -14 -5 18 -30 -33 -42 15 1 21 33 2 -53 -1 36 -7 -20 29 -6 -47 -36 -40 39 -3 19 18 7 7 39
4439 39 52 24 1 -85 5 47 -2 -19 -17 -20 18 39 29 9 -42 -21 -69 11 -49 -43 14 45 8 -67 33 0 -28 -15 9 -10 -19 -28
4471 -28 -4 -11 6 -30 -29 -4 34 -11 -11 54 1 -45 21 52 -1 13 -12 8 -9 -13 29 5 -26 29 28 -32 16 -28 21 -46 -57 10 1
4504 1 -8 -35 4 -47 -17 13 -10 -61 -42 35 -46 -3 -17 -10 -59 2 4 -30 48 35 -23 -34 25 -6 1 51 19 -14 -3 54 18 -37 -15
4537 -15 -12 30 28 52 41 17 8 -28 -35 21 -32 -32 -10 -3 -17 30 55 -63 -6 27 7 9 -33 7 12 -35 8 37 32 -21 20 15 15 -5 -3 -44
4573d4P0km1J4l3K2L3Lm0J8rjK7m7L2n4QN1o4M4K6K5k8PJ2oL4m2j8n8Q9l7l6K3
4607b2R3nr3O8m7L3m8L8kK2j2l4qN4l5l2K0N1Nj17J14J6o4l8M5kk0J7M5o7ON1
4639C2n2KL8Km4K4l3N6p0N2J2l3O3K7j09NL3O3m4n0M7n1K3J5j5kj0q7J30m0M8
4670C2k8l6J9J5P2m8j3K4lp4N9n0m1N6K5jK3PM7n8Plo6RO0l9n4N5J1m6O0L2o6
4703a3%J06r1k5O9l0k0o8P2n1K9L6p6Q2J9j3Jn5Q2q2QK1Lk3M0j7o5O3k6N5m5R3
4735G9r8L5K8j5k6L0K9j10J13m7J4p1M6L4j03J23K4n1o4J01o1m9K2K5Kj00P1j4
4763c3PLP8m8J8k7mJ1N5j01M1o1J06n1M1J7n6M2l0MK5K1l9M5p2M4l7k1LjQ1n4
4795Gk2K0j6N1K1p0jM0ln1K7J2m0K1K2Pl6RJ5JjjM8r0j8N7%l8K6M7o7J3Pj4K6
$$ plain form
4573 -44 26 24 -17 -3 -36 -14 19 22 -18 0 -9 -10 17 -30 2 -52 -44 7 -57 -13 13 38 10 17 29 23 57 15 -3 -61 28 -9 -45 -22
4607 -22 71 66 -27 41 -6 27 -21 17 15 37 25 -9 -17 37 2 -30 -10 41 46 -71 43 59 -5 -43 2 0 -20 -3 42 -25 -19 32
4639 32 -20 -18 20 22 -22 2 -31 25 -45 7 19 -14 49 76 -33 -28 5 68 24 -26 21 -30 -7 8 -7 -9 -19 -106 24 -16 32
4670 32 4 -32 -13 2 74 26 13 37 34 -40 19 -31 -72 -16 9 8 31 38 85 27 34 31 -35 -26 34 -5 -59 -4 7 -39 21 53 -13
4703 -13 -13 93 2 -23 46 16 -4 -72 0 -51 -22 14 -62 20 39 26 27 -28 54 -28 -20 1 4 -19 21 4 -61 2 -24 31 -14 79
4735 79 -19 16 44 29 3 33 62 -48 65 18 32 -39 7 41 -62 61 85 34 -30 71 10 -39 -17 8 10 -90 -19 -33
4763 -33 -26 -23 55 7 25 -2 -6 5 60 -41 0 -61 45 -6 35 52 -4 38 8 12 37 58 19 64 -8 36 -1 -22 -19 -20 61 7
4795 7 -15 5 -11 40 61 -9 -10 30 27 -24 3 15 -25 -4 18 25 -11 -2 13 14 13 12 60 -30 -48 9 9 -29 -3 44 -23 -10 -3 -17 9
4830Ij6j5O6mq0O0Pp4O9j3p2N1K5J3p6O7p1O1n1R6o4K5r5R8Jj4LLj2k0L9%K0O0
4864I6j02J7Nk5j3nJ9J7j0K1n1L6N4j0n6%J8j4kKJ5NJ2j9p6P2K9o1k0Q6p2M7L3
4897D8n4K6l4M6j4o4P3o2l6Q1k3MJ8k4nK3m1O3j6Lk0k1L7n0j3P5jk1K0N2n4o7
4929e1J19m9j03O0L9k1L3k3l1J2%J1PKL8m3l3Q9j25L4J00m0o3L2N7k9j2K7l6k2
4959b1K6N0n3k4L7n0N4kJ0o1M8K0o0M3P7n3r4O1k0lrok9L6k5nL2N0pjM5rq3qP6
4994D2j4o1O2L0o3J2L2p3N2J2L8r0N6K5on8J6Lr8N8M4p1P4M4nq8L1P6p5K3ql6
5026a6j7L2n5J3O3k3L0K6j3j0m0O5m1j8J4L4j03L6J7l3k4R0p2M2R0j2j09M9j9
5055dn2N3n1L1m6R0K9n4K5J2l0J3O9n4l7kK8j9l0N6o2J2Q4l1Jj4Q2q6N3mq5RN0
$$ plain form
4830 9 -7 -22 44 40 -40 20 27 -47 22 9 -63 -12 13 26 -50 17 -54 7 -44 52 -12 13 -82 16 17 3 6 9 -3 -23 16 16 36 96
4864 96 -6 11 16 -9 -22 -27 -8 9 -1 20 -31 5 59 49 -7 -7 11 -3 -5 -3 12 17 29 10 -66 6 35 -26 -46 40 -32 15 48
4897 48 -6 20 -14 32 18 -46 27 -35 -71 10 -13 -9 9 -15 -20 3 -38 25 9 12 -8 -29 8 -42 -55 20 19 -2 18 70 16 -51
4929 -51 68 19 -84 -24 15 -6 27 4 -27 -15 -15 -4 3 5 43 0 -33 56 -69 -35 65 25 -38 -6 51 22 10 37 1 -21
4959 -21 5 55 2 -22 15 -35 19 17 27 -34 14 34 -26 17 94 41 -53 8 -12 -15 -24 -30 -59 -23 -48 -53 -21 29 22 21 66 57 -26 -34 42
4994 42 28 -33 29 59 -4 8 40 -33 19 31 69 -21 35 60 54 -4 12 15 -83 -25 19 -52 22 66 61 -27 4 80 5 28 20 -16
5026 -16 -33 -1 -56 -43 20 -3 27 53 40 30 -10 55 14 -4 10 44 -59 -23 -6 -39 -63 27 -45 -3 87 75 -34 15 -4
5055 -4 -56 -3 -54 -23 -69 21 50 -4 21 33 3 16 85 31 -6 -8 20 1 -29 27 -35 -23 61 30 31 17 99 13 66 62 -23 -14 36
5088C6j00rO4Ok4NL7m8M3R2n7n8O8p6n8J6L4orN6l3KK2j7L4K6Qq0k7M5l9RP3m3
5122hn7L0R4o1QO7%o6L7k6k7j9J1l6L4M6o5J2K0j0l1M9P6r0L8j2m7k7M5L7j40
5153a18R6M6k9ON7k0l5L9j6l2K6Lm7k1M3N3l6l3N3k0oL1Jn7P1j14N1Ok9j3NM6
5185Gq4R4k3j7m0R9k2L0q9J0P9j08O3m0K9J7J1j5j2L4j6%l9K6k8Q2m2Lj1Qq5J03
5217B4J3k9J6k0Ornj1L5l2M1m0j8K0L9Pk9rL1Kk2m0PL1rk7M1m5J1L9j1lmL9n0
5252a1K0J7n2M5L0l9n1P4n9JMN3o2K9k0rK6j4J0o0P4J6K0k3rk8J4J6j7p2J20k5
5284A8r1N9L3l5j7R7j4k0p2M6MP5p8mm9O5j5N0p0q1J19m5O2n0M4p1J4M0mPm3J0
5316a6l9N0J8jp8P7l3J5M3o6N6k1Rnl3K3K3j8o2P8n2K4j8O0Rk1nQq6J12q4M0m2
$$ plain form
5088 36 -64 -73 -9 -3 -27 -22 15 -33 10 102 45 -13 55 -21 -79 -63 -29 -35 -44 12 -21 -19 3 -14 20 46 54 -26 -53 -8 -47 -38 35 -8
5122 -8 -65 -35 59 -2 6 73 73 7 44 18 -9 -28 -17 -53 -19 27 -38 -26 -6 -16 -47 2 78 -12 26 14 -33 -60 -15 22 -118
5153 -118 -22 24 -5 1 58 38 3 42 26 -6 20 23 -24 -45 -2 51 15 -18 35 15 9 40 41 -16 55 -59 -8 -2 -31 -44 -39 7
5185 7 -77 17 -6 -23 -63 36 14 44 -45 -35 44 -64 -1 -41 -12 5 16 1 -11 23 7 7 -32 -6 -34 48 6 9 -2 6 -79 24
5217 24 37 8 24 4 10 1 -4 -15 20 -12 29 -11 -29 -9 30 37 8 -1 30 32 10 -30 -23 8 -1 -28 13 -32 -21 18 7 4 0 39 -11
5252 -11 9 26 -26 19 49 10 -41 33 -26 -25 -21 32 -30 -1 -21 -30 -4 -18 -8 -68 6 22 42 19 10 -18 -4 12 -5 -77 43 18
5284 18 -73 -14 19 -16 -33 64 50 30 -42 4 8 83 5 1 -48 17 2 52 -18 -99 20 -25 37 -13 31 -40 -26 14 10 17 -26 -16
5316 -16 -55 -5 13 12 -66 11 -22 -7 36 -30 26 5 14 9 -24 -1 22 4 -58 20 -32 -8 -26 34 43 22 17 25 -61 51 -33 7 -35
5349c5L1oj2K7j7L7m0J6L2q1J4lJ6L1kN2j02N8k2k5N0l7MJ4l9K0K1lJ6k0K0m1
5381b6O6j8k8oM7J2n0J1KroK5J2m0K4LO2j10RL0l6Nk4P7j02N9l1J1L9JOjK1o4
5415b9LJ9K8k3J9%j4O0m9J4j7K3l8l3QP0l0j1N1mj03P4pj4J4j9n7N5j7j5L2M7
5447C7K2p5j9P0k6n0M8Mjj1PrnL8n8M2pL2q7J4O3l0R8p2q1K6Q1j3p5L5L5j9L3
5480D7l2ml8P2l2m0L8j2k7K0K7l8j5Mj6PN8Pl5K3j7PJ9NM8j00LL2l2p0R2K4o5
5513d0O0K8Lr0J1P4m6pL1l4l0J9J4L0k0j2L0N4j02Q1n2J5o3O6m7J1oJ5N4l7k8
5544a8J3j4J3J8j9NPK5k2ml5L6qO1l3OM0p0m8O8M2o5J0jk5n9O3L5l2m7O2LJ0O3
5578H0p4m9O0J8r3qJ44o6K8l0QlJ1J3K8q1K8j1%P1q2NK8Mk3l4M7m8O3n3LL4n9
$$ plain form
5349 -35 -4 -10 -22 5 -12 25 -15 1 33 -48 -34 -37 -21 10 8 60 -42 16 -6 -31 19 -18 -14 0 -39 -19 2 -1 15 -5 15 -26
5381 -26 40 22 -6 -12 35 47 -3 8 10 1 -5 20 32 -8 16 19 81 -29 -20 10 -26 -21 -45 32 -70 -11 -42 -31 8 9 15 14 35 -29
5415 -29 -26 -7 21 -2 17 17 3 63 14 28 11 34 -4 -37 -29 41 11 0 51 47 -56 18 11 -3 11 -8 -65 -10 -27 -42 -10 37
5447 37 59 -16 -35 35 9 -41 7 11 10 -1 6 -3 -8 30 -28 14 7 39 -48 -34 29 -1 97 25 -56 -30 51 38 -37 -2 33 14 47
5480 47 15 11 -27 45 13 -27 11 -1 -28 -8 19 -19 -34 -30 -46 -39 19 26 -9 14 -3 4 23 28 76 -24 -21 11 -21 -91 1 25 -40
5513 -40 20 48 51 -39 -28 46 0 -7 24 -10 -40 -21 -7 23 3 -9 21 75 -27 54 2 17 -46 20 -27 -16 -22 -7 47 10 -18
5544 -18 -5 -19 -6 12 -7 -2 5 30 8 4 -31 5 -3 58 25 31 71 1 -47 21 63 -2 8 7 -18 -77 -14 21 -11 -58 4 7 17 80
5578 80 6 -43 17 35 -58 -66 78 12 40 10 18 15 26 39 67 -14 14 3 3 74 -8 -3 25 29 6 -28 19 -29 34 -19 -16 18 -41
5611d1P9pJ2n2j3K3l3J5l2P6k6J8N5m6k5Jj0N2l6K9n5J8OJ4JjL1o0K7k0J6j9M2
5644C9n7l2Q0k9l8K4k9J1j2K0k4K0j4K0L4o2L3M3m1P4k9j8n9O7j4M5l7o2J31m3
5674D1l0k8L9J1p2L6M9Ko1P9k0k1j5%j3k2L7k0jM1o8k0O6j4L7o0O1n2M5J0rk8
5706@j1j6K2J0K2k6MlK4rk1j9O5k5K0Qk1m6K4N7n8k7N2n6L9nN2n7NK4rn3nK1j4
5741c2j5L8j4j2L5j8M1J2m9K7j2l9Q1p3J9O5r2K1K3l0M9M5po7L6n0NJ5J7K4n5
5772a2l1L1L7K4l3km1M2k5K2K4o5l6P9k4nJJ4K2qj2m1J8j0M2k3J3M8j6n2J5O9
5804F5n9M7k5o5O8j2jl7M1o9Q7nK5j01L9jK0M1q1K7n0l1Q3o7N5j4RJ2J4m5kJj6
5837d7lR8j7rNl6J0j5M1j4nl3m3R0j5kj8Pkk6Ol0O6N6o9m1K7MM0m4M6l3P8j15
$$ plain form
5611 -41 38 31 43 -9 -22 1 -32 -17 -49 27 1 19 74 28 3 4 -6 46 10 39 -16 2 8 22 23 22 53 -7 20 0 16 -3 39
5644 39 -18 -50 30 1 -37 -13 -42 -31 -43 -23 -47 -27 -41 -21 13 -49 -16 27 -14 60 31 13 -46 21 7 52 15 -47 84 41
5674 41 11 -17 22 33 -39 -3 46 48 -13 66 46 25 10 10 -3 -25 12 -8 -9 32 -36 -56 10 -4 33 -27 34 -18 27 37 28 0
5706 0 -11 -27 -5 5 27 1 5 2 26 17 -4 -23 42 17 37 45 24 -22 2 59 1 -26 26 -30 9 4 56 -1 4 28 19 -34 -39 -18 -32
5741 -32 -47 -9 -23 -35 0 -18 23 35 -14 13 1 -38 43 -30 -11 54 -38 -17 6 -24 25 70 63 -4 32 -18 -13 2 19 43 -12
5772 -12 -43 -12 25 49 16 14 -27 15 -10 12 36 -29 -65 14 -10 -15 -14 0 22 14 2 -39 -21 -31 11 -12 1 49 33 -19 -4 65
5804 65 6 53 28 -37 31 19 18 -19 22 -47 40 35 60 -41 -2 -3 17 58 -23 4 -46 -77 6 -61 -6 -20 -11 1 15 -30 -32 -31 -47
5837 -47 -50 48 31 22 27 -9 1 -14 27 13 8 -25 -68 22 7 5 -13 -6 -8 -34 -28 -58 8 64 -5 -46 -19 -15 25 -19 27 -6 72 -43
5871d3K0RPO3m5K6k5RJ7j9n9P7J9nl9J0m9PP3n2l9K9N1J1m7rLL2K2q3O5l6k5P5
5905E0o2N5j7l7RL4k6j4M4k9Nn7L2J1Jk0J1L0m3K6J0%K2k9J8k8O2p7K7J3K1n1
5937ij6O5J9m2J6l4j3ok0J05j9l9rj0l7L3N0n2PnL1k6O5k6m4l1N5Nm2Q1r3J15
5969G4p6l1R8m5Jj5J7l3L1m2P5j17O0M5L6p8K1oL6k3k2L2k9j7j8rO5k9k5K9nL0
6001C0m6L9pj6k7J6LJ3K5J7r1oQ7p0QP4j12Q2mo0L9l2N5l9jQjJ8k3O9l4L5o1J
6035a1L7m7K1j9joM2n0k1N0pJ2J8ql2j7P0p2N2oJ7m4N7L4j16L0O0m4nK9K8o4M
6068ik0m4J04j3l4oK8k3K3j8L5k6kj5N5m5L5k7L2k4K8n4N7o0J1j5L7pJ4N1m5l8
6100a5L8l1M0Lj2k9jJ8l2N8j7Mn5L2l4J8J0m1k4Q8k3L5mp9N0j0j4Q5m8j3L6n1
$$ plain form
5871 -43 -23 -14 -7 56 11 37 12 21 38 19 -40 37 56 51 12 22 -27 -20 53 1 -38 -9 42 53 6 -3 0 32 54 -29 36 0 -25 50
5905 50 -12 43 26 -11 -2 32 6 -8 36 7 12 -45 -13 -2 -1 -21 -10 20 -23 3 13 13 35 6 24 -4 58 -19 8 21 42 -9
5937 -9 -25 40 59 17 33 -1 -14 -20 -40 65 46 7 -2 -12 -49 -16 34 -18 -11 -16 15 -11 54 28 -16 -47 8 13 -29 52 -41 74
5969 74 -2 -33 65 20 21 6 23 -10 21 -21 54 -63 -3 42 78 0 21 15 51 28 6 38 9 -8 -26 -35 30 1 -24 5 0 30
6001 30 -16 23 16 0 -27 -11 -8 5 30 47 -44 -50 37 -33 -25 49 -63 19 15 -45 -6 -38 17 -22 -23 -15 -16 2 -21 48 14 49 -12 -11
6035 -11 26 -21 0 -19 -20 -26 16 -34 -55 -5 -12 0 18 10 -22 -39 31 -41 11 5 22 -22 35 69 -47 -17 43 -1 -6 23 51 -13 -9
6068 -9 -29 -73 31 18 -16 -22 6 -17 6 -12 23 -3 -5 -20 35 -10 25 -2 30 6 34 -20 37 -23 -12 -27 10 3 17 68 23 -15
6100 -15 23 -8 32 35 23 -6 -7 11 -21 37 20 24 -31 1 -33 -15 -5 -46 -70 18 -5 30 26 -53 -3 -13 -27 58 10 -3 33 -18
6132a8L1j0Jk4%P4q7J5pJ7k5K9M9o0j1JK2j3L8k9M7p6LL8om4N1L6l0qK2%N3j07
6166b8J2%l0R4q1N6o0NP3o9pO5Po3K7L3l6k6M3J1J7m7K5k9L5rRMnj7j2%k0O9l0
6201A6Krk5LRJ3r0J15l9l1L4j2J6n4K5OK1m0P1l6l1M6J0n0M4m8J0N6p6N3Lk5M6
6234C3K1J7o2OK8q0O0o4J1J6l1J2K4K7o4K1O8m8K2L1m8k8N4m9P7lp6M4l6JJ2L6
6266C2Mk8J3l3M4j2n6O3rj0l4%M6J5k8k0N3k0l1J1m7Q0j4o2J8O9j3o8O8r3Q4m2
6298b0M4J2l2L5pp0P0n6j7RM8J0l1n0M7J8pJ5N4j04j1P0l5K3j7k7L5P0k7K3n4
6329A8l0k2k5N0mM0m8M3n7O0l9om9L6L0rP1n0K5m4k1kM4m1M2K3K7p5L0k6K4k0
6361eL4l7J5M4p5M3k7k7L1j1O3q2qJ2O2p7Q1k0qj1j0l1J1L4m6QO4r0M1jrO6j5
$$ plain form
6132 -18 13 3 4 -20 -20 54 -33 -18 -25 -8 -33 -4 45 -15 -26 -25 -3 -16 22 -7 40 -36 -33 5 -1 -45 6 42 12 4 26 26 79 -28
6166 -28 -16 -16 -46 48 -33 23 -37 -32 41 -28 -35 30 37 -26 1 34 -2 -28 15 26 43 -4 21 -8 27 18 27 31 26 9 -3 -3 -23 46 16
6201 16 18 9 -16 -13 -4 9 -81 34 -5 -36 -2 -14 2 -52 -27 -21 0 -40 31 -5 -36 10 20 -30 14 -34 -24 32 -44 9 12 -13 33
6234 33 54 71 9 15 43 -37 23 -41 -30 -14 -45 -33 -9 18 -46 -25 43 -5 17 48 0 -28 26 -23 54 51 -25 19 -17 -16 -4 32
6266 32 36 8 21 -12 32 20 -36 27 18 8 -26 -26 20 35 7 -13 40 20 -11 0 -47 33 19 -43 -25 44 31 -37 31 -62 22 -20
6298 -20 24 36 4 39 32 -38 32 -24 -41 -32 16 26 -5 -55 -8 10 3 18 72 -32 -43 27 -8 15 -2 -29 6 76 49 72 18
6329 18 -12 -34 -59 -9 -13 27 -21 22 -35 25 -14 -20 -69 -33 -3 -12 59 9 34 -10 -31 -33 11 -30 12 35 62 -13 17 -9 15 -5
6361 -5 29 -8 7 51 -24 19 -8 -35 -4 -15 48 -34 -42 -30 32 -45 36 16 8 -3 -13 -44 -33 1 -45 -37 27 -63 -22 -23 -32 34 19
6394A9qk0M0p2J2K8J6Pj3K0J1k9MJ9N0q8k5O3j5KRr2J20l1l4N4k3J9K5p0PM5Q
6427E8o1o1M9k6J4l1L5O9n5K8J7km4K0j5J8l9K3L7J3rK0n0K8Op3J1OJ7M1n3M2
6459C3%m4P3k2m8J7M9m8P0j03J7J8j0JNMl0k7K3k5J0L0J7l8O3l3j1K2nL3j4j5
6491A2l8O2n5M4Om7m5Q3n9N0m5KJM4k8j5L5k0Jj3j2K1J6O9q9mm4L9L5K7j6n7M0
6524@J4K0k9L5m5nrK3Lk4K2k8QJ7J2J8k6l9L7l2KL6j%J0m0lL6k3K9q2R4rk3N7
6559E5j9nj3n2L5jL2j5K1k0m1%M9J5m9M9LRp8J9K2M4q3j4N5m0L0j3MJj2NK8Mk9
6594dK6K3o5j1K9m4K8K5k3jK0jRrk0L3o1O0Qm6jJ8jJ6LL3M4j13K1j9K1J0N0n0
6628Hj9j8M8o2J1j4L8kNK2m4pm7J12l3POk9pJ6JK2j7J7L7l8n6N7M7n2K1j2mK5
$$ plain form
6394 19 11 -9 31 -41 -29 -1 15 22 9 29 40 11 15 34 84 -4 -29 34 19 21 30 -62 58 27 -7 47 24 43 68 -2 5 50 58
6427 58 -3 -64 -15 -41 -27 -58 -23 46 -9 19 36 34 -10 10 -5 13 -26 -3 34 47 38 58 8 36 42 -31 -20 -14 3 44 -9 33
6459 33 33 -11 62 40 -8 9 58 10 80 -23 -6 12 2 3 8 12 -18 -45 -22 -47 -37 -7 10 -28 35 2 -9 13 8 41 27 12
6491 12 -26 36 -19 25 31 -16 -61 22 -37 13 -32 -30 -29 15 -13 -28 7 -13 -12 -25 -37 -16 0 69 -20 -24 -68 -29 6 33 17 -40 0
6524 0 14 34 5 40 -5 -10 -19 4 7 -17 5 -23 -15 2 14 32 6 -33 4 -28 -26 10 9 9 19 -21 -24 12 -11 18 -64 30 21 -2 55
6559 55 36 31 18 -34 1 0 32 17 38 18 -23 -23 26 41 -8 41 44 53 -25 -6 16 60 -23 -37 18 -22 8 -5 -1 0 -12 -7 21 25 -4
6594 -4 22 45 -20 -31 -2 -46 -18 7 -16 -17 3 2 11 2 -18 15 -46 14 22 -24 -25 -7 -8 8 11 44 88 -25 -4 -23 -2 8 58 8
6628 8 -11 -29 19 -43 -32 -46 -8 -10 -5 17 -27 -34 -81 31 -2 5 11 -18 -25 -9 -8 14 -3 14 51 13 -43 14 61 9 30 18 14 39
6662C9ol7j2K0j6j4O4J3l6o2O4Lpm9%L8J0nJ4Rj5j1rk2J08q6kj8M1j9J0J4j8m5
6696d2J7j1N7j7M0r7N2K2rJ2j3K9o6J6M7Kk3J6kJ3k0o5J9k5N7Q3j36L5L0m2J8
6727cM0k5q2N3l5Q2m5n1O8k5K3Qk0PJ6k2L7Pj6m3QM5K6n1M2r4P4Pl3J5J6m1L3
6760B1j4OM1n8J0rOm9lN3J7l0K3j1%L0j9J6plqJ9K3p2j0%J3OkL5m5N3J3l9k2L0
6796A4kRL6n2l4N8k0KJ8Mk5J5k0qN0o7J0oQJ7k9M2k0J2j4j9nnN3o5M9Kj5j4K3
6831BKk7N8oq3P2M1j6k6L8q6J5J8k6rJ08q9pmN3l1m4P6o6M0j9j3L7j7p0P7l4M7
6864A1l4k5K4M0k5J4l1J7K0l1K9k6o3J31q2K4K0K8l1M0m8j6j7L5pk6J4j1J5j8
6894b9J6m2J9P7m6j6J7k2K7j4O8r6J23n8jl6O5m1k2L4K5l7K4k0K9Qk9j1o4O8m1
$$ plain form
6662 39 33 -4 -16 4 -12 -26 38 51 15 -47 17 20 13 -36 -36 2 12 7 21 30 15 4 -5 -27 81 -5 -7 -25 16 -3 7 21 3 -42
6696 -42 -25 -36 21 4 44 -53 -1 21 12 24 11 40 -26 -10 37 39 16 32 30 43 23 -42 -23 -48 9 92 -44 -9 21 -21 -3
6727 -3 37 12 -70 -17 -52 30 -15 -66 2 -23 0 8 -12 -5 11 -11 26 33 17 -26 -18 27 53 2 44 -50 24 31 -2 13 29 -12 21
6760 21 7 13 54 -4 6 -3 3 -46 -49 4 21 -9 14 3 3 33 14 30 23 20 12 31 54 -18 -28 -28 -15 -9 -11 24 -21 32 45 6 -16 14
6796 14 12 21 57 5 -29 29 9 11 29 33 8 23 3 -5 45 -22 -12 -18 -10 7 -22 20 0 12 -2 -21 -26 -31 22 -43 6 8 -7 -21 2
6831 2 4 -23 35 29 -54 18 59 43 17 55 -31 -16 2 -24 -33 75 -14 -21 -25 28 -3 -47 29 -37 3 -16 -29 8 -9 -79 -2 -36 11
6864 11 -23 -48 -24 16 -9 5 -26 -9 11 -20 9 -17 -80 51 -31 -7 13 41 10 50 2 -14 -31 4 -3 -29 -15 -26 -11 -29
6894 -29 -13 -55 -36 41 -5 -21 -4 -26 1 -13 55 -41 82 24 23 -13 52 11 -11 23 48 11 35 15 44 52 23 12 -52 16 -25
6925b5J3Rj7J2P1p2L6l0K1l5k9mQ9mL4n1k9k5J7M9l4JjnMk5j1R3o1l1O9l6J0M2
6959D5p9L9n3L1jm1O1k7J10r9L5K7Km0J6Qp6K6Rn2L7K5l3mmL5oK1j4k5O3m5J5
6992FOk9M8p0M2J7Qk8K7K4qj7j7pK7K9l0k3L3k5k3K9Lk7M1j6Nj9k4k2K0j9k0M8
7026a1k0M4j4K6n7ML9J4j0RL6p3l8P3K9l1mkK6rK7l8rk1K6j2Rm5J9j5RL4r8O8
7060a5K8m9R3l3l4j2N7l5J1O0j06M1j9K4k6J0K5n4N2j2L1L0p9j8M8j6N4k3K0k8
7090B5n2P9k0n3l9P2On4J22q6k3rK7n0N1ok8O6m6K7j8n2P0j13P3J8N1k0Nn0L8
7121A1j2JO1l6k5omP4o2J8j0kj2J5M8n4L4j2j9nj4L1Oo4K4N6k5j6j4m6O8m1J4
7154a8J2J3pm4j3M1J9K1l5O7Kj04R4n6L3j4N9o3KL1K1p1lL3M7r7j5L5N5o9L0m0
$$ plain form
6925 -25 -12 -3 -20 -8 63 -9 27 -3 18 -17 -46 -50 39 35 69 18 -11 -36 -19 30 -4 -3 -4 -9 -5 -30 -41 52 -9 -40 29 -7 3 45
6959 45 -34 5 -48 -17 -18 -59 2 -25 85 -14 21 48 50 10 26 34 -42 -16 -7 -59 -22 3 -30 -34 -38 -3 -9 12 -2 -27 36 -9 6
6992 6 12 -17 31 -39 3 20 28 0 27 51 43 26 9 2 29 58 28 5 38 13 -10 19 22 -5 36 20 25 6 -18 -40 -20 -39 -59 -11
7026 -11 -31 13 -1 25 -32 -28 11 25 15 24 60 -13 -51 22 51 20 16 14 40 31 58 20 11 -10 16 4 13 -32 -13 -28 -19 15 -83 -15
7060 -15 13 -36 57 24 -10 -22 35 0 11 71 -35 6 -13 11 -15 -5 20 -34 18 6 37 67 -12 -30 18 2 56 33 53 25
7090 25 -27 52 32 -21 -60 12 18 -36 86 0 -23 -32 -5 -55 -4 -10 -38 28 -18 9 -9 -61 9 -104 -31 -13 38 18 23 -27 11
7121 11 -1 0 61 25 0 -6 -10 64 2 20 10 8 -4 11 59 5 39 27 8 3 -11 20 26 -38 -14 42 17 1 -13 -59 9 -32 -18
7154 -18 -6 7 0 -44 -57 -16 3 24 -11 56 58 -46 48 -8 25 11 70 7 9 40 61 -10 -13 20 67 -30 -45 -10 45 -24 6 -34
7186c4P4n1mJJ8j1l%pJ2RK3m4pN5k6K9k3kk5P6n3L1j0j5J1m3L1J4j3lL3m5M2q7
7221d7O1k1K3j4OL2m5PJ7k5J0k8M9j9J2%o4K0lMK3o7O2j6J7K9m2k2J1mm0Q7J3
7254B6J6l1jLNl1J9M6p3M7p3N7l2Rm1O7rp8P1jL5l2Ql5j6K6Kl3L6K6j8Qn3N5p
7289bRj6%M4Nn7M6Ql7ll4Q6k4l6K5l5KL0oJ5j8%M3k9l2J0k6Rjk8j8R7j9n9N7j9
7325a3k0LJ3Q6j16P1k1rJ5l6O7m4K2m7QN6k5l4J4K4MQK4p7km3M9K0M9o1pM2l8
7358a8K6l4J7k2N1j9rRm7N5Kj0jJ1k3N2l5j0K1m5J9J5M3k0Mj7J2j3rpoKJ02j09
7392a3N2L4Ko0m9MQkJ8mK2nl2PL4J2o7P7q1J1K0%qKN6L1m7l3K8J0j8j1M9n3PL2
7428C3l4N1o1J5%k2P1kl9j0nK8LPp1J6j5KK8k8L9k8Q0k4k4M4n5J7J5mn3N3n6L0
$$ plain form
7186 -34 40 -11 -15 -14 4 -7 -10 -10 -17 -5 4 27 -17 -24 31 5 34 11 9 -16 60 7 38 28 13 24 -19 12 26 13 10 43 -2 40 -47
7221 -47 14 -7 16 2 8 40 -5 2 19 -6 4 -24 25 6 18 18 -46 -26 -29 -25 -2 -69 -7 -23 -6 23 -19 -41 -30 -34 -74 13 26
7254 26 42 11 10 13 18 -13 6 52 -21 26 -47 10 -22 -13 -54 13 4 -74 -3 -4 31 -1 7 -28 -44 -18 -16 -49 -13 13 -5 3 -50 5 -2
7289 -2 7 -9 -9 35 40 -17 29 37 0 -3 -37 49 25 -11 14 -21 -19 11 5 20 2 2 45 16 -16 -6 -32 -23 -24 -52 -70 27 8 -51 6 -13
7325 -13 -33 -30 -17 69 -47 24 3 -6 9 -27 40 -4 18 -29 -21 35 10 -24 -10 14 18 26 50 -27 -29 -72 -23 -3 46 -15 -22 20 -18
7358 -18 8 -26 -9 -31 20 1 -8 1 -46 9 11 1 0 11 -12 40 5 -5 16 -29 -10 5 48 28 32 15 27 14 5 -2 -8 -6 96 -13
7392 -13 39 73 75 15 -34 -30 -22 -24 -6 -10 12 7 -25 -18 16 28 -39 38 -43 -32 -12 -12 -20 -18 38 69 22 -11 17 27 9 -2 47 -6 1 33
7428 33 -1 50 -11 4 4 -18 53 51 12 2 -3 25 28 35 -36 -20 -35 -33 -5 -33 6 -22 58 34 10 54 -1 16 31 27 -26 27 -29 1
7462Aj5l2J5P0k5JJ4j3N3r7K6JK5n6L1K5m3L9k7k2Ol2P7k2l1L5j2pJ6L8p0N1k8
7495hM1n0l9K8PNK7K8l3nk6j5J6rQ4n1jj5P3m4j3J5lJ0k0kk9J7RK0k0J2M2%l7
7530A4k3N4n3p4M9j2nM6nk4jL8k4M8k7nk2J7K0L5k4L4o1MK5k1J0m4J3l0P2j4j0
7563@M5q4k6J9L7OM1j5Np8K7M5l3k2K0k3j5Q3o3J0mJ1j4J4P0q6K9m9P1k7K1j6
7595aK8m1k1N4n4O0j5pK1k2pK6k8m7O2L1o9K2J9o3J3K8k2JM5l2N0j7l2O4p3k7
7627e4K5K2MRm0M6p5Q5k0M0o7J7J9n%k2N4l5J6j4MmN0p4Pn6N0OJ8n5N4Nm2%rM0
7663aM7m6o7O2J7J6Lj3no2MK6K0L4MpJ0ln4%K5K7J0k8mjrN8o2j8jL0k1M5n4k7
7699d5M7%l2M8j2n7rQ4n6rJ5K7M2m2J8j8M5o8K3N6n3M2m9K7l8L2k0J9kL8r3M3
$$ plain form
7462 1 -14 -46 -31 39 14 15 29 16 69 -28 -2 -1 24 -32 -1 24 -19 20 -7 -29 -23 -55 22 0 -31 4 -8 -15 1 39 -31 20 -8
7495 -8 33 -17 -56 -28 -21 -16 11 39 6 1 -25 -40 -24 -33 51 0 -1 -16 57 13 0 15 12 22 2 0 -29 -12 -3 17 -3 9 51 51 14
7530 14 -9 45 -8 -82 -33 -45 -50 -4 -9 -33 -34 4 -20 28 1 -4 -26 -9 11 46 22 56 -5 -1 24 3 13 -31 -18 -48 24 10 0
7563 0 45 -39 -65 -46 -9 -3 38 23 28 -50 -23 22 -11 -33 -13 -36 -51 32 -31 -21 -25 -14 -28 -14 56 -30 -1 -50 21 -6 15 -1
7595 -1 27 -14 -35 19 -35 25 10 3 24 2 -5 21 -7 -54 8 39 -30 -8 11 -52 -39 -11 -33 -32 13 -19 31 14 -18 46 -27 -54
7627 -54 -29 -7 -3 6 -34 12 -63 22 2 42 -25 -8 11 6 6 -16 38 3 19 5 9 5 55 -19 -12 -68 -18 -12 6 -49 5 10 -32 -32 -41 -1
7663 -1 46 0 -67 -5 12 28 31 18 13 -49 -45 -19 1 35 39 32 42 39 -15 -15 10 37 47 19 15 14 5 63 1 -17 -18 12 -9 36 -18 -45
7699 -45 2 2 -30 18 6 -51 -60 24 -32 -41 -26 1 43 1 19 1 46 -22 1 57 4 46 -3 24 -14 18 -2 17 15 53 -40 3
7731ClPM2k0o5L3Lk4n8Q3J4k9J1l0M9k3j5P5j05L6M9o1L0j6j6J3nQ5m7l6L7k7
7763a0L0k5K4mJ8l2m2M4J6K6l2j4M1p0O9k8MOn8M6J2J3k1l5M0k1oM7o9RK5K6o0
7796c1N2k8J8j0m6L6m9K8K9J8m9J0M5l4pJ5LJ8M6o6pK6rJ0l5J0Qn1K8j2M3K3o
7829B6j0n6K3L3j9l9K7N0p4RN4pqLqM4n3mM2l7j7j2J0K7rK4Pn1K1q2R7%J0nJk2
7865eN7r4N3mj1j7L3j6Rkn6L3K8J4n1j4O5J3k2l0K7J7p0RJ2J9K0m5N3po6QL8m
7899fk1P4n8l3J0K7J1kJk3j4OJ8N2k8O9r1ol1O0j9j1j8qK5k3M3L7m7Lm3N1l4L0
7933AL7k9m8N3Nk4k8L7Jj2J6M7o7L3J6m3L8l4M1q3M2M0n6J1L8k2mK3n7J1j1lO7
7966C6K2o1ML0l2OJJJ1j0kJ6j7j3LJ1k0L5j1j2j0L1n5L2L8k5K7k5M0q3KJ4j5K7
$$ plain form
7731 3 0 7 49 29 -36 -3 0 -24 -82 1 15 -14 -3 -33 16 -7 -22 53 -52 -16 33 -28 2 -14 -30 -17 -22 63 16 -20 17 -10
7763 -10 20 -5 19 15 33 1 -41 3 19 45 13 -1 40 -30 39 11 15 21 -37 9 21 34 13 -22 18 -3 -9 38 -31 -22 3 29 -31
7796 -31 21 -7 11 1 -45 -9 -58 -30 -1 17 -32 -22 23 -11 -18 -3 0 18 64 -2 -9 17 8 18 -17 -7 1 -50 -22 -34 9 32 26
7829 26 16 -40 -17 16 -3 -42 -15 35 -39 -30 24 17 9 12 4 48 -5 -9 33 -4 -21 -33 -23 4 -5 19 26 -25 -4 -86 11 11 21 16 17 -5
7865 -5 52 -42 11 7 -4 -21 12 -4 5 3 -53 -20 8 22 -29 -43 22 35 13 -17 10 27 -43 -34 -22 -3 17 -28 25 18 -48 -40 -2 -6
7899 -6 -27 47 -11 -44 -34 -7 4 2 3 -20 -34 -28 -10 42 14 83 -8 -14 -45 15 -4 -15 -33 -41 -16 -39 4 41 -6 -3 -46 5 -29 1
7933 1 38 9 -39 14 19 -5 -33 4 5 -7 9 56 -11 22 38 -5 33 -1 40 -43 -1 39 -17 -6 32 10 6 29 -28 -17 -28 -31 36
7966 36 58 -3 1 31 -1 5 6 7 18 8 6 22 5 -8 -5 6 -14 21 10 -2 -12 19 -36 -4 34 9 36 11 51 -32 -30 -16 -31 -4
8000dK0m5M1kpo6Q6J1k1n0R6q8JJ2jk6J2J2JJ1l8O7k3rK0Rk7K7j2l7kP7m3k3M2
8035B1k5l7P5J8K4p4j2O3q8M3k0O5q4L5k0j1NK9PJ3l0L1k6L0J7r4P7n5N2n0KK3
8067DJ9pk3k1M0k0O1p6K3Lo1O4J0K3l8k3N9n3k3j5J6jl2Q3p7LN3j1L3j4j4K8o
8100Gk5J9l9N8o3N0Jm2K9k2l3J04J9n8N3n8k8%L8k1kK4k4M7o8l8N2O4o3N1J3o2
8132a7M1J2m5o1J9M3l1L2L3KQr8Q0m2M3Ml2J3j4J1K1n4K4MJl5MM1l0M3K1m1j8
8165a8k0M0J8l9NJ6J1n3K8N2j2J3k4j8Qk9K2J6l3k%L7j4mr1P6
$$ plain form
8000 -4 16 -29 12 10 3 -63 23 34 13 -37 59 -29 -28 -16 -17 -43 -31 -19 -18 -7 -45 22 -1 -10 10 19 -8 19 7 -30 -32 45 2 -21 21
8035 21 -4 -41 34 52 76 2 -10 53 -35 8 -12 53 -31 4 -16 -27 -22 7 14 27 -3 28 2 32 49 -45 32 -23 29 -21 -19 4
8067 4 23 16 -7 -28 12 -8 53 -23 0 3 -58 6 16 39 1 -22 37 -16 -39 -54 -38 -39 -71 12 -65 -62 -9 -20 13 -1 -15 13 7
8100 7 -18 1 -38 20 -43 7 8 -34 -5 -27 -60 44 63 5 58 0 -28 -28 10 -11 -13 11 -13 34 -34 -72 -20 44 -19 32 45 -17
8132 -17 24 36 -9 -70 -51 -8 -39 -7 26 28 36 -62 18 -24 19 23 -9 4 -10 1 22 -32 -8 -4 -3 -38 -34 7 -23 20 41 0 -18
8165 -18 -38 2 20 -19 -14 2 13 -40 -12 40 28 41 17 -1 7 -22 0 16 -17 -19 -19 18 4 0 -91 -15
8191a5
$$ Imaginary data points
##PAGE= N=2
##DATA TABLE= (X++(I..I)), XYDATA
0@%%%%%%%%%%%%%Qj6J6j6J7k5L2m0M8n6O6p5R0j06J22j40J64j87K11k42K76l14
35a67L54l98M48n02N62o27O96p73Q58r50J050j161J281j411J555j713J888k080
53a090K292k531K798l097L440l834M293m834N485o289P307q644J0487j3214J7705
68A0274k6801P6334j68443k4921K74507j15996j67092Q4453N9669p3864O5206
79f674K9555p3789M9773R3240q7500k0248R7155n7624r9481J05306L3637j45484
91h2134M219J38587l7702q5966O4280N9110l8093j5068M239k006J7436k5581o0740
104e9419L2983M7004o3900k8783Q0905J0102n4102L8428N3395l5153j8398L2294
116C5356J366j8792j6467k4329J7339L0190m9190l7094O6638K4740o4559O760
$$ plain form
0 0 0 0 0 0 0 0 0 0 0 0 0 0 0 8 -8 8 -8 9 -16 16 -24 24 -32 34 -41 49 -57 65 -75 89 -98 113 -129 147 -167
35 -167 187 -211 237 -265 297 -330 366 -407 451 -499 551 -610 671 -740 815 -898 990 -1090
53 -1090 1202 -1329 1469 -1628 1812 -2022 2271 -2563 2922 -3367 3940 -4704 5783 -7431 10274
68 10274 -16527 59807 -108636 -133557 140950 24954 -142138 -57685 1984 -71880 -6674
79 -6674 22881 -50908 -1135 92105 4605 -15643 81512 23888 -75593 29713 63350 -82134
91 -82134 -77915 60672 22970 -62996 1284 60394 22301 7233 11472 9466 26902 1321 -59419
104 -59419 -26436 20568 -43332 -72115 8790 18892 -35210 3218 56613 21460 3062 35356
116 35356 36722 17930 1463 -22866 -5527 24663 -24527 -61621 5017 29757 -34802 -28042
128b8042N7805k3234k8771L0935L07j9530J5905j1691j8722M8068R256o6852K1109
141a3457P6987l9805n6150M9809J4374n2407J7042K1787n5612J195O0337k9334
153e234m2873N0899J9121m1607K3479L0996m5128m961M9531k3503m0797L4355
165D278J2221l5383J6708K5636k9868r09L4500j6934k0892K4611p397l1290J9975
178d744J2173l6709jL3331r205j1391K3879L820q336J8950J483k1031R974P738
192A9931k7662l031J9028j9787j7401K5631O372k0801R925J8486o903K26O502
205A0516q414K980P361k0718p112K3831p366k4433J9547J7885j9553L591K0924
218A9039j5577p757K4648q675k7725J3783J0539k1681J561J0641j7942O404L0009
$$ plain form
128 -28042 29763 6529 -22242 8693 9000 -10530 5375 -6316 -25038 23030 32286 -34566 -13457
141 -13457 63530 23725 -32425 17384 31758 -20649 -3607 18180 -37432 -36237 24100 -5234
153 -5234 -48107 2792 21913 -19694 3785 34781 -10347 -15308 34223 10720 -30077 4278
165 4278 16499 -18884 -2176 23460 -6408 -7317 27183 10249 -10643 13968 6571 -24719 -4744
178 -4744 7429 -29280 -29281 4050 -5155 -16546 7333 11153 2817 21767 23250 2219 12193 19931
192 19931 -7731 -10762 8266 -11521 -28922 -3291 3081 -17720 -7795 10691 3788 4014 10516
205 10516 2102 5082 12443 -8275 -15387 8444 1078 -23355 -3808 14077 -5476 -1885 19039
218 19039 3462 -4295 20353 11678 -16047 -2264 8275 -13406 -11845 -1204 -19146 -12742 17267
231A7267j8215k1926L5870J5540l4274J858K4954j7528j1295K0596r999k1475
243a8627J9550R876k2508J984J4679r420K075J1429j7258l874K8416p922k9845
256b1445J9104K1896k4075p444K1474n594r931J4174m278j4133J5069N153j9421
269i451O616J3262j7616P85K3020j7250k0577L0289J1035l6427r98L0998q432
282E254j9377J0912N320m698Q748k311j1461J4015R392j9475j216J6554j2354
295f97j1916J7383j246k1088J0118J7776j2140p171J1937K948M3K275j1025j443
309d246J7655p687k3108J2589J5775j9217n736K0763l713j3009J4831P174j4639
322b568K456R232r218k818N439r738j759J3946p346j2555J8111J0194j8774J402
$$ plain form
231 17267 -948 -22874 12996 28536 -5738 -3880 21074 3546 -7749 12847 2848 -18627
243 -18627 923 10799 -11709 -9725 4954 -4466 -2391 9038 -8220 -12094 16322 8400 -21445
256 -21445 -2341 19555 -4520 -11964 9510 3916 -6015 8159 3881 -10252 4817 9970 -9451
269 -9451 -2835 10427 -7189 -6404 16616 -634 -21211 9078 20113 -16314 -17312 13686 5254
282 5254 -14123 -3211 2109 -2589 6159 3848 -7613 6402 15794 -3681 -4897 11657 -697
295 -697 -12613 4770 3524 -17564 -7446 10330 -1810 -8981 2956 5904 5947 8222 -2803 -4246
309 -4246 13409 5722 -17386 -4797 10978 -8239 -13975 6788 3075 -9934 4897 12071 -2568
322 -2568 -112 9120 -98 -2916 2523 -7215 -8974 4972 -2374 -14929 3182 13376 -5398 -3996
336c996J9425p500j2636R420R34j0547K959P90q615N563O040r564L133J3390p440
351A356o296J4660n43j5482O443Q060j3430k761J0645n512n191J0686j87o501
365d053R321K894j0283N720P064j4125l451J3051p241j2156J1340M464j1564O306
379b713J0879r631j326J3066m600r175P837l11j0214N476L252j2250L420J3068
393F778q685o382J5094J724j2804N853Q062j0752l058Q008n335n721P460q37o506
408g101P299M635p151K938P470o769l471Q046l386r667M539N035o382j967M771
423a161J112Q87Q14k358L012M286n485l276O111k084p367M335L064o942J914P087
439C949m500j392P586l285n597P621p90j1427N783Q126j2748l286J5854k798j2783
$$ plain form
336 -3996 15429 7929 -4707 4713 5647 -4900 -1941 -1151 -9766 -4203 1837 -7727 -4594 8796 1356
351 1356 -4940 9720 9177 -6305 138 8198 -5232 -7993 2652 -2860 -8051 2635 2448 -4053
365 -4053 5268 8162 -2121 3599 10663 -3462 -6913 6138 -1103 -13259 -1919 2545 -9019 -2713
379 -2713 8166 -1465 -2791 10275 5675 -3500 4337 4026 -6188 -712 2540 -9710 -6290 6778
393 6778 -1907 -8289 6805 8529 -4275 1578 9640 -1112 -4170 3838 -1497 -7218 242 -595 -7101
408 -7101 198 4833 -2318 620 8090 1321 -2150 5896 2510 -7157 -2618 2417 -3965 -5932 -1161
423 -1161 -49 838 1652 -706 2306 6592 1107 -2169 3942 1858 -5509 -1174 1890 -5052 -3138 3949
439 3949 -551 -1943 5643 2358 -3239 4382 3592 -7835 -2052 6074 -6674 -9960 5894 3096 -9687
454i687J0886R265j2265k75J1403p155p221R515k355j1195P877N675j1966K488
468e010J3327p827p142J4023R79j4592N580R822j2292n381J1648k882r728Q016
482a459N139q418L518R206o952l376J0195k647j0811N885N337j0811j855R980
496B931l231p104Q073M816p562J098P848l627n374M397L71o121P91K561l832m46
512d411M800r98k193M599K187l719Q29L473k964l103K741L1m164L62K568j107
528a069q14J735O92J56J121q87j187J683n1l422K04K649j691j905K672J357k265
545a022Q09K490j385j243J673k43k102L30N35j246J46J271n90J55J840k21j305
562a08Q10Q41j496q85Q38k7r52J94R11J32j84L68P65J03p62n80J62l44j396o95
$$ plain form
454 -9687 1199 10464 -1801 -2076 9327 2172 -5049 4466 2111 -9084 -1207 4468 -7498 -5010
468 -5010 8317 490 -6652 7371 8350 -6242 -662 9160 -3132 -8513 3135 253 -9475 -1459
482 -1459 3680 -4738 -1220 7986 1034 -2342 7853 5206 -5605 280 5617 -5194 -7049 2931
496 2931 -300 -7404 669 5485 -2077 -979 6869 3242 -2132 2265 2636 -3485 -2694 -133 -3965 -4411
512 -4411 389 -609 -2802 1797 3984 265 1094 4567 1603 -1500 1241 1272 -2892 -2530 38 -1069
528 -1069 -1883 -148 544 700 1821 934 -253 1430 1379 -2043 -1839 810 -881 -2786 -114 1243 -1022
545 -1022 -213 2277 892 -351 1322 1079 -1023 -693 -158 -1404 -1258 13 -577 -422 1418 1197 -108
562 -108 702 1543 47 -838 0 -27 -979 -785 126 258 74 442 1207 1310 548 -32 130 -214 -1610 -2305
582b305N28K03p2M80R06J117R62J4j6O90n1j369o48j18j183o07K79q05k65K060
602b00N95j458J314K415j478j804J823m60k761P04J183k505j52L610l18k113L036
619A431K272k544O9K623k285k455K098q55m045J543K383l374n07M969k41l198
635b116L008K843l110r40K609j598k174J690n66k412K244J556l009Q18M208j673
651A378k840L048J424l745l63J955j766r17J961j077j396L086J314k969N67L332
667B992j377k352J326L11j995L80M33j775N89K228j245j361K792J319k575j04
683d14K216p75j822N50M09q58L81M47q77N54J759p14j372J393J091j914j228J159
701a5L7j442k6O14o2N37Q55q07O4K088j61k428N16K254j545k620J315J583j448
$$ plain form
582 -2305 -1777 -1574 -1646 -1166 -260 857 1819 1833 1817 2507 2456 1087 439 321 -862 -1469 -1190 -1995 -2260 -200
602 -200 395 -1063 251 2666 1188 -616 1207 747 -2014 -1310 -127 -2632 -2784 826 508 -1605 1431
619 1431 3703 1159 1228 3851 1566 -889 1209 354 -3691 -2148 235 -3139 -3646 1323 1082 -2116
635 -2116 892 3735 625 -315 2294 696 -1478 212 -354 -2766 -522 1034 -1975 -1157 3051 1378
651 1378 -1462 1586 3010 -735 -1098 857 -909 -1826 135 -942 -2338 748 2062 -907 -340 2992
667 2992 1615 -737 589 900 -1095 -715 -282 -2057 -1468 760 -485 -1846 946 2265 -310 -414
683 -414 1802 1027 -795 -245 164 -694 -313 134 -743 -189 1570 856 -516 877 1968 54 -1174 -15
701 -15 22 -1420 -1446 -832 -894 -357 498 -309 -245 1843 1682 -746 -230 2024 479 -2141 -826 757 -691
720f91q50J389P15n5N66k41n67J208K60k279n79J836o98k194Q90J512j119m24
738a321J756K94j076P69R27j135p32Q92k39j172L55O99l37R1P72oQ6Q85j82j094
758B32K46M40j086q22L09m65n84J028M74j293L33K328J77j863L34J618j77j123
776A06m13j5O35M00j258o63J982Q57k127k22K223l49k026L44P65q63l57M46o78
795a213L1J663J17j128N18J399p9n07k13o88K68Q07j245j740R90J486q58p96Q47
814c41N83J83L69m69o69O92O71j158q27R61O94o96m92M96Q81N52r78j159Q95J550
834A738j322k928N08K729m36k909o1L001J116j583p15J299J398M9j250j077J010
851E67J263j655j883J336J568j418j095J223Q88n02l25n29j93J234N5k357m24
$$ plain form
720 -691 -1541 -152 563 508 1074 833 266 1474 1734 -545 -1124 712 14 -2180 -1290 222 -897 -1321
738 -1321 435 729 -347 422 1349 214 -518 374 135 -1037 -682 17 -320 -229 543 537 623 1508 1326 232
758 232 478 918 -168 -990 -681 -1146 -1730 -702 -228 -1521 -1188 1140 1317 -546 -212 1406 1229 106
776 106 -307 -322 313 713 -545 -1208 774 1631 -496 -718 1505 1156 -870 -526 239 -624 -981 -535 -1213
795 -1213 -1182 481 598 -530 -12 1387 1308 801 588 -100 168 975 -270 -2010 -1020 466 -392 -1188 -341
814 -341 242 425 794 325 -344 348 1019 -139 -966 -5 689 -7 -499 -3 878 1430 452 -707 188 1738
834 1738 416 -2512 -2004 725 289 -2620 -2681 320 1436 -147 -862 437 1835 1884 634 -443 567
851 567 1830 175 -1708 -372 1196 -222 -1317 -94 794 292 -33 -562 -755 479 534 -1823 -2247
868b247K620N15k223O6J954O03k95j79l45L94P91p84j493K57L04p87Q4M11o72
887a026J32J404n5r40P54P11q88k13M81o69k70O59p25m21J749K78j951O08K444
906B062p93j910N14N86o62N8j96j512O66K197p13j802J376J916p31q87M85L3l39
925C48ko18o72M57K33p17P1R88J57n48K8Q02L02o30p13K07O29l02q04K12M73K11
947A12N09J30n54K39J002k94j267j0L63p18l26K56l97l01Q61M33m05L52O85m07
967B63o8P16k50j176n9Q07n3p54Q1M13M25L33p7n24J93Q17m35j250R5O83o20q64
989a304N55P20m55j69Q46N98j12k16k60NN20k40j354l43J151M71j104m23J057
1008e7Q33k34l95K4M04J69l20q37j18O70j68q95J39J252Q6j026L16J277j57j136
$$ plain form
868 -2247 373 888 -1335 -1269 685 1288 993 814 469 863 1654 870 -623 -366 -62 -849 -765 -354 -1026
887 -1026 -894 510 455 -485 269 980 92 -121 360 -309 -579 80 -645 -1066 683 961 -990 -382 2062
906 2062 1269 -641 -127 459 -203 -145 -341 -1853 -1187 1010 297 -1505 -129 1787 1056 169 654 687 348
925 348 346 -272 -944 -487 -254 -971 -900 88 245 -303 -275 527 829 199 -514 -307 322 20 -784 -572 -99 112
947 112 621 751 197 436 1438 1144 -123 -133 230 -488 -814 -558 -955 -1256 -395 38 -367 -15 670 263
967 263 195 911 661 -515 -574 233 180 -574 -493 -80 345 678 601 77 270 1087 652 -598 -503 180 -440 -1304
989 -1304 -749 -29 -484 -653 193 791 679 463 203 208 728 488 -866 -1209 -58 413 -691 -1114 -57
1008 -57 776 542 147 171 575 744 424 -413 -531 139 -29 -924 -785 467 553 -473 -157 1120 963 -173
1028a73n9M56k25m63k71l61L39Q16j66o22P23J100m55l89O34j30p98K79L49j003
1048d19n56R50K13p32K49P04l32kM80l51p46N18K04j050j74R17n0p37N46R75k7
1069E80k27K39J47OJ26o47p39M53M48q62p65P33Q46l92l41M54M66q7l07j25q5
1090g9p5m3k01k99K30N53o3k75M64O80l99m46N17l7p49m9K60n28j36N09j51k56
1112e73Q87M01p35L77Q32p69q61P92K10j454j12J106k78p87N32O94j35j42L21
1131C06M1m7M8l75l58L19P5n20O0N24N9k05M83L66m21k12N29J5j028m22O70O2
1153c1r31r2R89K24o86L27P86q0k75K9O1k47o3k20k96K12K58l01O5O65j8k45N10
1176F41J31p78j53Q85m89j222K71R45l05q11M63Q10J2l52J1K05J58l30n70jL61
$$ plain form
1028 -173 -232 224 -1 -464 -735 -1096 -757 59 -107 -729 -6 1094 639 250 884 754 -44 235 584 -419
1048 -419 -975 -25 188 -544 -295 409 77 75 555 204 -542 -24 180 -870 -1044 -127 -177 -914 -368 607 580
1069 580 353 592 739 745 871 224 -515 -62 386 -476 -1241 -508 338 -54 -395 59 525 438 131 6 -79
1090 -79 -154 -197 -398 -697 -467 86 23 -252 212 892 493 47 564 527 -222 -271 -11 -539 -675 -166 -317 -573
1112 -573 314 715 -20 357 1189 420 -441 351 561 -893 -1005 101 -177 -964 -432 262 127 -15 306
1131 306 347 300 348 -27 -385 -66 9 -511 -451 73 132 -73 410 776 355 143 672 687 -341 -763 -93 -31
1153 -31 -962 -1054 -65 159 -527 -200 586 506 231 260 321 74 11 -209 -505 -293 -35 -336 -271 394 376 131 641
1176 641 772 -6 -159 726 237 -985 -714 231 -74 -885 -422 388 400 48 59 264 422 92 -478 -479 -118
1197a18j91m79K73O88k7k75N89M38l02j44L83k75p69P9L16n87o90M72O87l34l48
1218f14M43M63Q0j01l42j22M02j42n86q4N54j14k80N51N23l02n3O22N2o26j49
1239A75Q9l72m80L2o2l08J20L72K15J28K66J70J70K87r8m39j98L14j43p34k33
1260g29O23L8n59L50M63j61j85M14N7l50j4Nj94Q4R9l13J01O18J17m16K82N22
1282H52l10m54M30k9p71l12L65r1n86j49M49L42j71q4M18N69j2k98K65L31q5l47
1304C22O3K66k38m90J4M74k14q13Q2O57l20q93L71O97m32n09O82M62l94j9N06
1325B74L73j9k77r3M03J98o63m18O95l2q66j5P55l33q58L86P38n80n14M23N38
1346A15j86m88J87O83K11m28j10O52K24m86j93L57J02p20l52L44P3p45k56O33
$$ plain form
1197 -118 -309 -788 -515 173 146 -129 460 898 596 452 835 560 -209 -130 186 -401 -1091 -619 68 -266 -614
1218 -614 -171 292 372 271 -71 -193 209 67 -519 -603 -49 -163 -443 108 631 329 276 898 950 324 175
1239 175 264 -108 -588 -556 -618 -926 -806 -434 -219 -91 175 345 515 802 704 265 67 381 238 -496 -729
1260 -729 -106 -68 -627 -277 186 25 -160 254 311 -39 -53 -48 -242 -158 -59 -372 -271 347 464 48 330 852
1282 852 542 88 518 489 -282 -594 -229 -320 -906 -1055 -606 -264 -435 -519 -101 468 456 158 423 754 669 322
1304 322 385 651 413 -77 -63 411 197 -616 -534 123 -197 -1090 -719 -22 -454 -963 -281 181 -213 -232 274
1325 274 647 628 351 258 661 859 196 -222 473 441 -425 -440 315 -18 -876 -490 248 -332 -846 -423 115
1346 115 -71 -559 -372 311 522 94 -16 636 860 374 181 538 640 -80 -432 -88 -15 -760 -1016 -383
1366c83L38o89l7J043J95n97K48O96j05k69QM6k54O8j99m76K36N2m89O6O11m76
1388c67n11R53M08j165k9J298j69j112M18Q38l94k99L20J48mK05k71p4O56k79
1408E70r52L30P46r83j136Q85P22j062p44J017Q22n27k76P30N62J34k17j33L01
1427G89J79m19n94L2Q5m82k66L14Q5m03K82P09j71m69O06N74p13m93N01Q8q81
1448f47j3P09j31o82N88Q01n9l82P0N07M06o38j269L32J195r63j842Q23J779q28
1468b44j220J300J340n69m68O60L82l65o09k97K12k1j006m96J067L76j045P1J429
1487D97K17q77K48Q02l07n13N9j03l15n9J62r1l8J99M17L60k40m39O37M24q72
1508A68r79O17N97r74r22P57R47n70n66P94J029l01q21M19R17m06j191J33R89
$$ plain form
1366 -383 -45 -734 -771 272 467 -130 118 814 709 440 448 494 240 308 109 -367 -131 -79 -568 -502 109 -367
1388 -367 -878 75 483 -682 -711 587 418 -694 -276 562 168 -131 189 337 333 538 267 193 849 570
1408 570 -382 -52 694 -289 -1425 -540 182 -880 -1624 -607 215 -312 -588 142 704 838 621 488 789
1427 789 968 549 -45 -13 72 -410 -676 -362 -277 -680 -398 311 140 -329 277 851 138 -355 146 234 -647
1448 -647 -660 49 -82 -764 -176 625 566 184 254 761 1167 529 -740 -408 787 -176 -2018 -1195 584 -244
1468 -244 -1464 -164 1176 607 139 799 1181 816 207 -90 122 101 -905 -1401 -334 42 -1003 -932 497
1487 497 714 -163 85 887 580 67 126 23 -292 -351 -189 -280 -318 -119 298 658 418 -21 616 1040 168
1508 168 -811 -194 403 -571 -1493 -736 211 -359 -925 -131 898 597 -224 195 1112 706 -485 -352 637
1527F37l44j111J23J088J51r04j07R68K69q46m68N32L00o45l90L94K88j44o7K93
1547A7K61P5j54J88J1l92j82K55j36m64J17M29k06j73N54K80l01J6L74j16m68
1568a5j73Q7j05l1l63p8O62L79n82j92J088K30q91k27P20k18p74j16K93j12k9
1589d47K09O6K42L97O1j48L28L0m58k60J11k95l78K9J12j98J01N03J14p6K21J55
1611D19O2j89k74n5q9j40l35J46J99l6P9M16K34m1J57R1j47j19j44l58j91R3k28
1634d50k35K19M12r9j8N54L9l10J77K76m99l61J91O3m22n6L04m5J56L47mj03M04
1657E40Q4n75n2M34l64n85L43K57n26ON54q0j77L73J16l18J39J95n37k4K57l44
1679b84k10N60o4n46M74O07n62j88O62J5n46J55K98m67p2L06k62j08M56k65l91
$$ plain form
1527 637 293 -818 -695 393 544 -360 -467 501 770 -76 -544 -12 288 -357 -747 -353 -65 -209 -276 17
1547 17 278 353 199 387 398 6 -176 79 -57 -521 -404 25 -181 -354 200 480 179 195 569 453 -15
1568 -15 -188 -101 -206 -237 -600 -678 -16 363 -219 -411 677 907 16 -211 509 291 -483 -599 -306 -418 -447
1589 -447 -238 -172 70 467 528 380 708 738 280 20 131 -164 -542 -513 -401 -599 -498 5 119 43 264 419
1611 419 481 292 18 -37 -126 -266 -601 -455 -256 -292 -213 203 437 396 553 644 497 378 234 -124 -315 -222 -450
1634 -450 -685 -466 -54 -153 -171 383 422 112 289 565 66 -295 -104 -41 -463 -519 -215 -260 -104 243 239 136 540
1657 540 624 49 -3 431 67 -518 -175 82 -444 -438 116 36 -141 232 348 30 169 364 -173 -197 60 -284
1679 -284 -494 66 2 -544 -70 537 -25 -213 449 464 -82 73 371 -96 -168 138 -124 -232 224 -41 -432
1700d32M87M44q18k60Q89N1q32J05P04k02l74K30J11k4K5r9j88K12J50m77L0N08
1722B40K2l86R9L71Q2k08j24P3n5k46j32K19j98m78L38N88k54m81O04P34m16m94
1744a02L86K76m65m46P5L9m6j73j48M01N91k1m15M63P40l78q70K17L73o38o16
1765g57L52k1n61L91Q38k82o16J038R14p95o90O13K82o67m30j53m8L86q4o56N35
1786d11J272l16j000R63J211j120j124Q51L50j133l79L73j03j01N10j8j39M73
1804A59M57jj31j63l35K47J84q54o14P85N50q64k34J006M06m93l8N13Ql21k31
1825C6k47J81R1m97l62O58L96m57q3N74M8k77K41M2p12o5P97j39j085K61J128
1846E29j40p49L53M87k06j10R0l77k3M36m32o58P64N48q46j18J121l7q46K45M96
$$ plain form
1700 -432 55 499 -319 -579 310 361 -471 -366 338 136 -238 -8 103 79 104 5 -183 29 179 -298 -268 240
1722 240 262 -124 -25 346 428 220 96 169 114 -132 -264 -45 -243 -721 -383 205 -49 -530 74 808 392 -102
1744 -102 284 560 95 -351 -276 -237 -283 -456 -604 -203 388 367 -48 415 1155 777 -93 124 497 -141 -757
1765 -757 -405 -426 -987 -596 242 -40 -656 382 1296 501 -189 424 706 39 -391 -544 -592 -206 -290 -946 -411
1786 -411 861 545 -455 508 1719 599 -525 326 676 -457 -836 -463 -566 -667 -157 -175 -314 159
1804 159 616 615 484 321 -14 233 417 -437 -1051 -266 284 -580 -814 192 598 105 67 580 588 267 36
1825 36 -211 -30 61 -436 -798 -140 256 -201 -284 290 338 61 302 344 -368 -433 364 225 -860 -599 529
1846 529 389 -360 -7 480 274 164 254 -123 -146 290 -142 -800 -36 512 -334 -452 669 632 -214 31 527
1867E27n89l57L34k53n78O02M57o21k6R52K06k66Q8P9j94O5j36o37l29M03m1l44
1889f58J29L93K70J78Q8J42J47m4m13j99m1l60m81J42J51r5K19L05K39K03N10
1910H25k1k83J1O8l49n38j37j43j59J68J98l6J55O31K43j59M8K63j30m86l61P7
1932a15k45m50O3K95q7j9N60L29r4K81K58k84k15J84l29n37N3K14l82j65P09O7
1954I1l86M45N48l81l52N33np62l1M27l96m23L66K68l38J41N02r8k52L12K88m33
1976F4j26K89o9m04K13K68m22j22O78n7o39K32N70n93l07N73m9o02L64N06n49
1997a82j24O55j16m95L88K53o23q8N29k98l58M00K70k92J15L04j89L5M04l30m07
2018a49K53p5l88J12K06m38J7N85M1l36L46J95j78j4J34l85j68K65j70l98K86
$$ plain form
1867 527 -62 -419 -85 -338 -916 -314 143 -478 -504 448 654 388 476 555 361 426 290 -347 -676 -273 -314 -658
1889 -658 -529 -136 134 312 400 542 689 645 232 33 -8 -368 -849 -707 -556 -651 -432 -127 112 315 825
1910 825 804 521 532 600 251 -287 -424 -567 -726 -558 -360 -396 -241 390 633 474 522 785 655 169 -192 -115
1932 -115 -360 -810 -747 -452 -539 -558 2 331 237 518 776 492 277 461 132 -405 -352 -138 -520 -685 24 91
1954 91 -295 150 698 317 -35 498 493 -269 -300 127 -269 -692 -326 -58 -396 -255 247 149 -103 209 497 64
1976 64 -62 227 158 -246 -33 235 -187 -309 369 312 -327 -95 475 -118 -425 148 99 -503 -139 367 -182
1997 -182 -306 349 233 -262 126 379 -244 -332 197 -101 -459 -59 211 -81 34 338 149 184 588 258 -149
2018 -149 104 29 -359 -247 -41 -479 -462 123 164 -172 174 369 191 177 311 -74 -242 23 -147 -545 -259
2039b59K03l18J77O71k17m20N32M85o76l45M96j33o23K07K06m40m9O31p3l74N06
2060A87J82m04J89L80n57m35O01O2q50K31N95l92k22Q23Mo90L69N68m80k99M24
2081B86k26k92L86j19o41M15O14n82k45P50j19n00L61L12p43L7O96m19l79N93
2101A85Mn53L42N96o62l05P82n5o40L20L36n91N6O29l29o19O70K24n65J2M39l53
2123g7l01N67p4n68J89N28l09k82L95K28m19O4L66k26k09J30O2j41j11J75r4N3
2145e4K53k3k19Q4L25k12k39J68nk99m3K96j68l03L30K09j50j11K05J03P1j43
2167G5j62J13J63k74k35L27J22k99R3L37j18j61J87Q5j14l5k6k53J04P2k72j07
2189c78M05p3k58L04K68m11o5N46n9n12K09K62l01j05J67l7j18K29J10k17J29
$$ plain form
2039 -259 -56 -374 -197 474 257 -163 369 854 178 -167 329 196 -427 -220 -14 -454 -503 128 55 -319 187
2060 187 369 -35 154 534 -23 -458 143 205 -645 -414 181 -211 -433 390 394 -296 73 641 161 -138 286
2081 286 60 -232 154 35 -606 -191 423 -159 -404 346 227 -273 88 400 -343 -306 390 -29 -408 185
2101 185 189 -364 -22 574 -88 -393 389 334 -306 14 350 -241 -185 444 115 -504 166 390 -175 -163 276 -77
2123 -77 -378 189 115 -453 -264 264 -45 -327 68 296 -123 -59 307 81 -128 2 64 -77 -188 -13 -107 -54
2145 -54 199 176 -43 41 366 154 -85 83 78 -221 -264 32 -136 -439 -109 100 -50 -161 44 147 218 75
2167 75 -87 26 189 -85 -320 7 129 -170 -77 260 142 -19 168 253 139 104 78 -175 -71 1 -271 -378
2189 -378 27 -46 -304 0 268 -143 -208 338 279 -233 -24 238 -63 -168 -1 -38 -156 73 183 -34 95
2210I5K20k58j27K64p4l77J39K73k96j84L27J83k81mL09j37j79J70N7j88k5J82
2232H9k14p3K80n4k09K47K41k47k09L72N8m03Q9J84k51j22K79o5k02J96J35l23
2254b02J41L20l33j54L82j3n27K71L56l91j84M34J51l13J26J23q3l1M3j07o8K65
2276B06j93k75K23K73l73j22M12N9m52Q7L16r7k74J07Q9j8j29R8J16K7j31O1K12
2299B22qj40j19J55N0j65j52J42Q0j18j38K49J17k64m5L54pl25M1K53j34l03M4
2322b11K38l4o2l8J33P5l8j39P5K31k11j75J84J17k58o9K46L1j82l4K75Kj88J1
2346b1J81l3j85n5J14kj25r6J11J13J4j21P6J71p1q4L6M7Oj27J3J85j54j02K10
2371A01R0k25L3K41j20j92J38k0j29M0Qj86J14J92k36q4K76O0k14J32J70j22r4
$$ plain form
2210 95 315 57 -70 194 120 -257 -118 155 -141 -325 2 185 -96 -100 209 72 -107 63 120 -68 -93 89
2232 89 -125 -198 82 28 -181 66 307 60 -149 223 281 -122 -33 151 -100 -222 57 -8 -210 -14 121 -202
2254 -202 -61 259 -74 -228 154 141 -386 -115 241 -150 -334 100 251 -62 64 187 104 73 116 9 -59 206
2276 206 13 -262 -39 234 -139 -261 151 210 -242 -155 161 64 -210 -103 -14 -32 -161 -63 53 80 -51 10 222
2299 222 214 74 -45 110 160 -5 -157 -15 65 -53 -191 58 175 -89 -134 220 213 -112 -71 182 48 -255 -211
2322 -211 27 -7 -69 -107 26 101 63 -76 -1 230 19 -156 28 145 -113 -182 64 95 -87 -121 154 156 -32 -21
2346 -21 160 127 -58 -113 1 -1 -126 -222 -111 2 16 -105 -29 142 71 -13 23 70 76 -51 -38 147 -7 -109 101
2371 101 191 -34 -1 240 120 -72 66 46 -83 -43 -35 -221 -107 85 -151 -235 41 101 -113 19 189 67 -27
2394b7J43r0j13J46pq5mJ77r6o9Q5L8j07L1k1p4M2M2r2m0Q5J5jl8N5L8j5rl3m5
2424f9J10l5j19R8K7n1J0m4J34N2j08M1j1j5k3J7l5J6OK7l1J1pk1M2Rp6l1J43
2453F7q3j36J44L2q7n4J75K9j10J81k5j95P4K06k43q8K56r8k19J49O9j32N4J62
2477A28j69j11K21N7k75J3K21j43j50J64N9j26Q5P1j8kJ15k6j11O3k9j18J03M0
2501F2p8o4J84o7j28O2J27j24r7J99k1j80oQ4K4j30J91pr6J7N5M9m6O7j26J7J49
2528A17l6k44J97J75j17k78J94J49j12n3L8rr8P6J0j74Q8O0L8j04L5K5K7O8j16
2553d4J6R6J21k04j42K20J36j82j63J62J39j07j10K7J92j21o1j1p8R5P8L1j76
2576h6j16L05J6k47RO9Q2L9j37j08K18J30k04j98K32K39k27j03J65J11j14j41
$$ plain form
2394 -27 116 26 -87 59 52 -33 -37 140 44 -25 60 98 -9 22 1 -73 -31 11 -81 -121 -36 -21 -22 -60 -5 33 18 9 -24 -69
2424 -69 41 6 -113 -15 12 -39 -29 -73 61 113 5 46 35 20 -3 14 -21 -5 1 28 -3 8 1 -20 22 31 -45 -76 67
2453 67 -16 -152 -8 24 -63 -117 58 87 -23 158 133 -62 12 218 -25 -113 143 45 -174 -25 44 -88 -34 128
2477 128 -41 -152 69 126 -149 -136 85 -58 -208 -44 15 -111 -26 45 27 25 140 114 3 66 37 -81 22 62
2501 62 -16 -80 104 37 -91 -29 98 -26 -123 76 55 -125 -131 -47 -23 -153 38 31 -65 -48 7 56 10 77 -49 -32 117
2528 117 81 -163 34 209 92 -186 8 157 45 -8 30 21 -77 -1 9 -165 -77 -17 21 -83 -48 -23 4 72 -44
2553 -44 -28 68 189 -15 -157 63 199 17 -146 16 155 48 -62 -35 157 36 -25 -36 -114 -19 59 90 -86
2576 -86 -202 103 119 -128 -119 -50 32 71 -66 -174 44 174 -30 -228 4 243 16 -87 78 189 75 -66
2598f6N8P2JNj11p2J10K6Qj02p0K27N8k22j01J14J84j27k04J29P4J33o0k40K05
2623B9K19j54k22J32K19j60j30J19m0n5O7m3j28J35R0j13r0P7J24j32n9LR2R8
2647G8l0k00OK05J49l21n1K52P7j33r8jJ58p2l2j0OO4l4k6j7j0Q2r6O1n7L5M4
2675B9n9r5jK10l9k01O0K37n5j91J27Q5r1jQ3j84N2J43o3j46O0J67m8j19M5P5
2701H0p4K3qp4n6J37nj64O1J02n0p2N8O2j5r8J00k3l7J48kj30mJ25J5j63l1K40
2729A45n5j59O1M6p3K1L2p9m8R0Q1q7j18J72k2n5Q0J8j02L3J14j14p8J20O8j51
2755f0J6K26n2j42N5K7o6m5P5l8j1%Mq4l4J24k8o2N2L1k9K9J4l5k5JJ10j49j1
2784a07J60K1j08J5P3K5n7M7j2j2k1N2p8n4O5m4m0P3pMppo3k6R7L9q4k9R2Nk7
$$ plain form
2598 -66 -8 64 65 70 -41 -113 -3 23 31 -71 -141 86 144 -78 -179 -65 119 -8 -212 -83 -9 124 64 -176 29
2623 29 248 94 -128 4 223 63 -67 52 12 -43 24 -19 -147 -12 78 -35 -125 -48 76 -56 -115 -112 -20 78
2647 78 48 -152 -146 59 208 -113 -164 88 165 32 -66 -67 91 19 -13 -23 -17 47 13 -13 -30 -40 42 -54 7 -50 -15 29
2675 29 -30 -125 -126 84 45 -156 -96 141 86 -105 22 107 16 15 98 -86 -34 109 46 -100 -40 127 79 -40 5 80
2701 80 6 29 21 -53 -109 28 23 -141 -80 22 -28 -100 -42 20 5 -93 7 -16 -53 95 93 -37 -41 84 99 -64 -95 145
2729 145 90 -69 -8 38 -35 -14 18 -61 -109 -19 62 -25 -143 29 7 -48 32 50 -52 -19 95 -19 -97 23 91 -60
2755 -60 -44 182 130 -12 43 70 4 -41 34 -4 -15 -15 -11 -95 -129 -5 -33 -95 -43 -12 -41 -12 2 -33 -58 -57 53 -96 -107
2784 -107 53 74 -34 -19 54 79 22 69 57 45 24 76 -2 -56 9 -35 -75 -2 -9 -5 -12 -19 -82 -108 -11 28 -56 -85 7 12 -15
2815a5j7Q9Ln6J6L9k2Pl4j1P0l3Jo7Op6J04j6L0k4m2J4n%rLP0p6j7O2R1o7m1N3
2849C0j0K6K8Jl4m6M7j09L5Pj6l5J48p9q0J15j3o9l0J19o8l9mJ00k3n2J3N4m7
2878c1Q0j6q2R0L3l9p8Q2j3m6M4m1m3N2L9rj18M9P4Pq4k2R7L5j45RJ28k0q7j7
2908g2P3J1lm1P9j9L0o6MQ1lq9O6J6r6k8J15J5j46K9J12p3j4j34R0J16p7k9M3
2937a0L2k4o1M6J77j50o0N8J35j01q1J09o9N2J6n9M2j4l3llrr7J28L2p0j40J85
2965B8Q9j31j37J54nop9L0J28n7l6p4K18o9r4M1R0k2q2M5K5N8j11K1L7j3o6qO7
2994D1K9j65P5J29q9j35L7J54q8p0P8Pk4qL9j4K1k6N1K0J1j14lJ51p1o5K2J0K4
3023B7j13JJ11Nq2j4O5K4j06M9O3n9p4N1kJ8oM9m4J4J16p9L6Jk3q5Q3Pm7m0J06
$$ plain form
2815 -15 -32 57 60 4 20 59 37 44 10 -1 69 36 37 -30 -24 -100 4 -12 18 -6 -48 -34 -39 -39 -48 -45 25 -51 -68 -6 85 18 -23 30
2849 30 20 46 74 75 41 -5 42 -67 -32 -25 -41 -76 72 -7 -87 28 15 -54 -84 35 -33 -72 -76 24 1 -51 -38 16 -31
2878 -31 49 33 -49 41 74 35 -43 39 26 -20 24 -17 -60 -8 31 22 -96 -47 27 34 -50 -72 25 60 -85 -76 52 32 -55 -72
2908 -72 1 12 9 -32 47 28 58 -8 -4 77 74 -15 51 67 -29 -57 58 73 -73 -44 68 -5 -19 -153 -63 53 -24 -53 -10
2937 -10 22 -2 -63 -17 160 10 -50 8 143 42 -39 70 1 53 69 10 52 38 5 2 -1 -10 -107 21 53 -17 -157 28
2965 28 117 -14 -151 3 -2 -8 -87 -57 71 14 -22 -96 122 53 -41 0 90 68 -14 31 56 114 3 24 61 48 -18 -26 41
2994 41 70 -95 -20 109 20 -115 -78 76 -12 -82 -4 3 -21 -29 10 -4 17 -9 42 62 73 -41 -44 107 36 -29 -7 3 27
3023 27 -86 -85 26 31 -51 -65 0 24 -82 -33 30 -29 -103 -52 -54 -36 -42 7 -37 -23 93 14 50 51 28 -57 26 33 -14 -54 52
3054E2l3q2J8J05n1j6N1j7p5k0O2k2m1RK5q4P2J34k8n6O5m8K8K5j9k8l6P3m9p3
3084e9P6m8L0j8K6M3nm9M3m5l6J3j6%r3N6J37j56J20j1M3jK6j9k5m3M7q9Q2l1
3114bk7m9O9L2K4j6L8jo1j4mp4J6K6P0j18j1Q4LJ1j9K1O2m4J8J4m2K2n7l4mN8
3146il9jQ8N7r5L6J09j49p4J22L9j88oM0M1j09O7J37r8J9M3j4O1nq0K9K4Pj60
3175a08O9J22j41l3J00L4K0n6M5L0p4k3J2K4j09l7J06Lj01N6M7M7J9k0qJ08k8
3202A04j87kJ14Jr9pJ64j19l6J62M3o8q9Q8k0Qn9k2pL1q3l9J01J4q0M9J53l5j44
3231f4P8O7l0j17M8Mj7j15P7O5J4q8J33M3j8p2P1qm9o7O2q3%moP4Mk0L3O3j2j14
3263d8M3J16q5r3k3P0l3n1N5J36r5K3O6l4M5Oo8m8nJn1kjq9J50L4%oJ1P8m7j4
$$ plain form
3054 52 19 -63 -45 60 9 -7 44 27 -48 -68 -6 -28 -69 -60 -35 -119 -47 87 59 3 68 20 48 73 54 26 -10 63 14 -59
3084 -59 17 -31 -1 -19 7 50 45 -4 39 -6 -42 -29 -45 -45 -138 -82 55 -101 19 8 51 50 76 57 32 -11 36 -53 29 -2
3114 -2 -29 -78 -9 23 47 31 69 68 7 -7 -11 -85 -69 -43 27 -91 -102 -18 -15 -4 -23 -2 60 16 34 48 6 28 -29 -63 -67 -9
3146 -9 -48 -49 39 96 1 37 146 -3 -77 45 84 -104 -110 -70 -29 -138 -71 66 -32 -13 30 16 77 72 -8 21 45 52 -108
3175 -108 -39 83 -58 -91 9 43 63 7 52 82 8 -15 -3 21 -88 -125 -19 -16 -117 -61 -14 33 52 32 24 132 104
3202 104 -83 -85 29 30 -69 -76 88 -31 -67 95 138 70 -19 69 49 57 -2 -24 -31 0 -83 -122 -21 -7 -87 -38 115 80 -64
3231 -64 14 81 51 -66 -18 -14 -31 -146 -69 -4 10 -78 55 98 80 8 79 71 22 -45 17 -66 -66 -70 -76 -2 2 -18 15 78 66 -48
3263 -48 -5 111 26 -67 -90 -20 -53 -104 -49 87 -8 15 81 47 92 98 30 -18 -23 -22 -73 -75 -76 -165 -15 19 19 13 24 102 55 41
3295D1o1L3o7L1o8P4j7j8OR0PLL0n9O1q2J5pL4j08j03J38J5o0J9J05m7rK7K3m3
3326Cn9N3m4n2R6k3n3J09k5nO9pJ1n4j6J13j56OL0Lr7j2O1m6P6k9L4O0j5npr1
3358g2J01o5k0j4M7o5L0P7j0PPO7l2o7M4N2r0j9J0M5n6j8j0N1PM5r0N1NM8j11
3389d5OM3l9n7O9L9q7K2Q2k9J4j9P7K2q5lL2p6O7j31J05j2n4L0L8Kk2k0LN1j5
3420Hm2K3N7j16J8P7k1rJ3j3J08l9j2q7O8Mj3k9k6N7j58N5J39n6p3k0J80r0Jj0
3450fM4m1KN5n2j9j7L5m9N5j3j9N6N0l4j1M4n0rl3R7p3o8L5M2J1p9j3K8L7n2R
3482c8Q0m6j8j6Rj5Q1j09mJ00l3k7nJ63r9l0P1L1q0l5J17j9j06L9j0jj9O7l5p6
3512f3P5o3M9L5K2p4j7J8K2o5j3J07k9n8N0O7l3j61J89on0k9P5rKj20N5J4M5j4
$$ plain form
3295 41 -20 13 -54 -23 -91 -17 -34 -52 -46 44 51 54 84 25 86 4 19 12 46 -62 -165 -27 -12 -72 -53 52 5 -4 23 46 3
3326 3 -56 -3 -47 -99 -3 -26 -79 30 5 0 69 62 73 19 3 116 -40 -34 -4 -1 -98 -110 -49 -95 -19 -48 -14 46 31 26 19 -72
3358 -72 29 -36 -56 -70 -23 -88 -58 19 9 16 23 90 58 -9 35 87 -3 -22 -12 33 -23 -41 -51 0 7 52 -38 13 18 66 -45
3389 -45 -39 4 -35 -92 -23 16 -71 -49 33 4 18 -1 76 98 13 10 42 -34 33 -98 7 -5 -59 -29 9 11 -11 -31 -28 23 8
3420 8 -34 -11 46 -70 -52 25 4 -5 8 -5 103 64 52 -35 33 37 24 -5 -31 26 -132 -77 62 6 -67 -87 93 3 4 -6
3450 -6 38 -3 -1 54 2 -17 -34 1 -48 7 -6 -25 31 81 47 36 80 30 21 -12 85 12 -56 -21 21 32 -47 -60 -32 5 -47 -38
3482 -38 42 -4 -22 -38 -29 -44 37 -72 -76 24 -9 -36 -41 122 23 -7 64 95 15 -20 97 78 -28 11 1 0 -19 48 13 -63
3512 -63 12 -51 -2 33 55 -19 -36 -18 4 -61 -74 33 4 -54 -4 63 30 -131 58 52 2 -27 48 39 41 -79 -24 -10 35 21
3542B1n3P7k7l8j8R6n0o6O6O3j12m5P3M7m9j2M9M8r4lN3M6l9j47J16N0p2l4P1
3571A7K4n8j2P2l5J3n0RJ5L4l8JL7r6j7J18l9qNO0N9q4L7nn0j8K1J1jn1k2M6M8
3604D3l4o5K2J02n0r8R2k6j5mJ9o0J4J5P3K8p5j7R0Kl7j1N6Ql1m0rmj0Km1J22
3636F1j5j38R2R3j13n5R3O3r8NN3n4m7J3N7l1KO2n4NM9Mm6L9m3m2R3j0j2m6LN5
3668C8n6L3k0N7n2J0M3m1o3M5l1K3l5l4Q8K2o0rM5LJ9k3MM3n6rk7P9kj47J77j1
3700E3o0J7K4Lo6K3L5q1M0j3L4n3Q1m4K9N7lj01N5P4o9k7KO3j16L6j6L9l8O1n1
3731a2lM2plL7m0l5OK2pn6L7j6K6j8j1L8M8p1N5j6j8j8O8p4KK2kNL9k4L7k9J3
3765C7kk8j1j8J0j1rL0n1n3J45j2m2J2R0r0k0O7K5n4k7k1L0j2j4J6N6k2Mn0Q3
$$ plain form
3542 21 -32 45 18 -20 -38 58 8 -58 8 71 -41 -86 -13 34 -15 -27 22 70 -24 -27 26 72 33 -114 2 52 -20 -54 17
3571 17 41 -17 -29 43 8 21 -29 -20 -5 29 -9 -8 29 -67 -84 34 -5 -13 -8 52 111 27 64 59 9 -9 12 23 22 -29 -51 -5 43
3604 43 9 -56 -34 68 18 -80 12 -14 -29 -33 -14 -74 -60 -45 28 56 -19 -36 54 56 19 8 64 72 41 1 -8 -12 -22 -20 -61 61
3636 61 46 -92 0 93 -20 -75 18 81 -17 -12 41 -13 -60 -47 10 -21 -19 43 -11 -6 43 47 1 40 -3 -45 48 38 26 -20 -17 38
3668 38 -18 15 -5 52 0 10 53 12 -51 -6 -37 -14 -49 -83 5 27 -33 -42 3 6 25 2 6 49 -7 -16 -43 36 34 -113 64 53
3700 53 -7 10 34 37 -29 -6 29 -52 -12 -25 9 -44 37 -7 22 79 76 -25 30 104 35 8 10 73 -43 -7 -23 16 -22 39 -12
3731 -12 -15 27 20 17 54 14 -21 -15 7 0 -56 -19 -35 -9 -27 -38 0 48 -23 32 16 -2 -20 48 -26 -24 -2 -4 1 40 16 53 24 37
3765 37 35 7 -4 -22 -12 -23 -32 -2 -53 -106 39 27 -15 -3 87 -3 -23 44 69 15 -12 -33 -3 -15 -29 -13 43 21 25 -25 58
3796E8kj5l8n8P9m6l3M1N4p0k8P5q3P0MQ2q7j6J1lm2O7L7o1K4l6J5j03J28rq9
3827g4R3oLm3M8j0q1P8Pnl3J7lm9K1Q2j8k1K7l2l8L5K3q9Q7O3n9rRj1k1O4m6m8
3861c9O4j6j3pJ4O5n5k7K5Jk7rj6R1j15J19q2K0J5q%oK7L9p3L3J1k6k5M8o1m6
3893g9M7N8l9J0K7N2r6K6JJ9Ro3L2n3P2n0j5K9k2O6k3N2j6Pq9N9ol5J6n3R5K1
3925E9r1P1K7q1OQ1m1k8pj2M2l5J7j4j1O7p2K9j8R5j13k7J21j3m8k0O4n6n0NM7
3956fk0L8O2p2L8l2L9k4m6O4l5o2O9pk4O5p7M3j2ON0n4k5M3o8N9L8q4J9K8N8l6
3988C5m0qOk0R9p2j0L7j7k4l2M3K2m4P6l2j2n4j4J14n4j7M7l4M5k3lk3J01k5o4
4019CJ8P9l3q7NO0l2m4J5J9l3JJ9o8Q0J6j0Nnj5K%qN3n3j7J3m5O8L0m6K4j1M3
$$ plain form
3796 58 56 41 3 -55 24 -22 -55 -14 40 -30 -58 17 -66 4 8 90 3 -13 -2 -5 -47 20 57 -4 20 -16 -1 -104 24 15 -74
3827 -74 19 13 16 -27 21 11 -70 8 15 10 -23 -6 -9 -58 -37 45 27 6 33 1 -37 -2 21 -68 19 82 23 14 23 12 -9 55 9 -39
3861 -39 25 9 -4 -11 3 68 13 -14 11 12 -15 -24 -40 51 -64 55 -27 -7 8 0 0 -6 21 60 -13 20 31 5 -20 28 -33 -79
3893 -79 -32 26 -13 -3 24 76 -20 6 7 26 35 -28 4 -49 23 -27 -42 -13 -35 31 8 60 44 51 -38 21 15 -20 -4 -57 38 59
3925 59 -32 39 66 -15 -9 72 31 3 -4 -16 26 -9 8 -6 -17 50 -22 7 -11 84 -29 -56 65 52 4 -16 48 -8 -58 -53 -6
3956 -6 -26 12 74 2 40 8 47 23 -23 41 6 -56 13 6 -18 47 -30 13 1 7 57 3 -22 21 -47 12 50 -34 -15 13 71 35
3988 35 -5 -13 -7 -27 72 0 -10 27 10 -14 -46 -3 19 -25 51 19 7 -47 -61 53 -1 -18 29 -5 40 17 14 -9 92 67 3
4019 3 21 100 67 -20 -15 45 13 -31 -16 3 -30 -29 -10 -78 2 18 8 13 8 -7 -5 -5 -13 40 -13 -30 -17 -62 6 36 -10 14 3 46
4053D6m5n8Q3J2l0m7L4K5j35J34k0m2J1K7k7M5n1O1m8M9L3j7q2M8j2k2K3J4%j
4083HJ4M9q6J9o3R9o2PL6m3Oj4O4m7Q7q6j0J1Jm6P7kmj0J0j3N1p8LM5pK2m6N6
4117D8l7k9jqnM8J5l2J5J4n8rR6r2M8K7l2k8L0j4%J8l8Pj9N4J0j0K0n7J9L5m9
4150a4k7K8L8m8j7N7J1l5K9J8m2ql6Q4j5j2l2j0M3Jpo9J31q6j3O3kj09O5O7n5
4181bN2Lj13L4L6J3m8QJ8k4K5Mk0K6p0N9qk3K6M6pj8pK2n9K6K2l8LKkj3N6l5N2
4216D6o9L5P0j00PNK7q4J06m6n7R0K3o0J2J2j7m4Q4K5n1K6k1j7l0N3m9m3J24m9
4246Hj0J2rM2n9j1P0l7J0n1L5lJ5k5l0L0N5n8k5R0o3k4M4L0o9J4L5L9l4p0P8K3
4278E2q5j3O2J3n6J5J4n4L5rN3k2k8k9Q2j6l0J4j4M4o5QRM2j8K5M2j20M4N5m5
$$ plain form
4053 46 1 -57 26 38 8 -39 -5 20 -115 19 -1 -43 -32 -5 -32 13 -38 23 -25 24 57 40 -42 6 -6 -28 -5 9 9 8
4083 8 22 71 -15 4 -59 40 -22 -15 21 -22 -16 -30 34 -13 74 -12 -22 -11 -10 -56 21 19 15 5 15 2 53 -25 -22 23 16 38 -8 48
4117 48 11 -18 -19 -27 -32 16 31 -1 14 28 -30 -39 57 -35 13 40 8 -20 10 -4 -4 14 -24 -17 -36 18 28 18 38 -19 0 35 -14
4150 -14 -41 -13 25 -23 -40 17 28 -7 22 40 -2 -10 -46 38 23 11 -21 -31 12 13 6 -63 68 -18 -31 32 30 -79 -14 53 -2
4181 -2 50 53 -60 -26 10 23 -25 -17 1 -23 2 6 -14 12 -58 1 -7 -30 -4 42 35 17 10 32 -27 -1 21 -17 -14 -12 -14 -27 29 -6 46
4216 46 -23 12 82 -18 -11 -6 21 -63 43 -3 -60 30 53 -7 5 17 0 -44 40 65 14 40 19 2 -28 25 -24 -67 57 8
4246 8 -2 10 1 43 -16 -27 43 6 16 -35 0 -3 12 -13 -43 -13 42 -16 -41 49 -14 -38 6 36 -33 -19 16 55 21 -49 29 52
4278 52 -33 -46 16 29 -27 -12 2 -52 -17 -26 27 5 -23 -52 30 14 -16 -2 -16 28 -37 -29 -20 22 4 29 71 -49 -5 50 5
4309Ej7N7j4n2K4k2j2N0M8j00OP7o4K4k1M7l2o0P9l0l1pK6OP5m8p0P7j9Nl1jP0
4342D5q9M1L9m1J2M0q2kR1k8n8J1N7l7p1J29m4m8mJ01o5LN6k1n4j3M4M8q5M3J9
4373C7o0Q6j4l3m2M2l9J5O1n3j1qP2l9k3l3M8j5%Jo1P4m7L3L1qJl7J3M9rL0o8
4406gQJ8l4k0L4l3L1k9K4J9j0J7J8rj1Pl8P2j07k1R9j9k6L7q1P5l5L6m0M9K6j00
4438e0M7K5k1o6K0L9l6N8K3n0k5O5Ll6K2m5%K4M4o5L1J0j8k1L2no8Q7m0j5K4J5
4470Hj4L2p0P3j5rN4m4j7P4m6m5mNK2m2Q1nrj6OL3m3Lmj5k6nJ00m1l1L8j04J08
4504C2j9O0p0k8P8n4L9n2K4k0o0R5m7l5P8j5j5J0qm6Q2%m9n2R7l6J7mL3l0M8r2
4536c9P1p4O8j9m2lL3J6l9L0P6p7OP1j31K6lJ6J2j6N8l3n6R1M3j16J8L1j8K7M
$$ plain form
4309 5 -12 45 31 -21 3 -19 -31 19 67 -33 -27 50 -14 10 -11 36 4 -56 23 -7 -38 -45 -19 -13 62 14 -56 21 2 7 -24 -25 45
4342 45 -44 -3 36 -5 7 47 -35 -37 54 26 -32 -21 36 -1 -72 57 13 -35 -39 62 -3 0 56 35 -19 -32 12 60 -25 18 37
4373 37 -23 63 49 16 -26 16 -23 -8 53 0 -11 -19 53 14 -9 -42 6 -9 -9 -8 -69 5 -42 -9 22 14 15 -22 -9 40 31 61 -7
4406 -7 1 19 -15 -35 -1 -34 -3 -32 -8 11 1 18 36 27 16 23 -15 57 -50 -71 28 9 -17 20 -61 14 -21 15 -25 24 50 -50
4438 -50 -3 22 1 -65 -45 -6 -42 16 39 -11 -36 29 32 -4 18 -27 -27 -3 41 -24 7 17 -1 -22 10 5 -63 24 -16 -31 -7 8
4470 8 -6 26 -44 29 14 5 59 15 -2 72 26 -19 -23 -18 4 -38 43 38 29 13 19 52 9 12 8 -7 -33 -38 62 21 -10 28 -76 32
4504 32 13 73 3 -25 53 -1 38 -14 10 -10 -70 25 -22 -57 21 6 -9 1 -7 -53 29 29 -20 -72 25 -11 6 2 35 5 53 -39
4536 -39 32 -42 26 7 -35 -38 -5 11 -28 2 78 1 7 78 -53 -27 -30 -14 -2 -18 40 7 -49 42 85 -31 -13 18 0 27 31
4567C1m4kO6q7j9R0J5l8LJP8j04N5o4J2J0Qj7M1l1L4q9P1L4j03J5O4k8K3jp4M4
4599fP2j04nK2J0l4P8J9J0o9K2J7k7K0L0J3r5R0m2M%M8j5j7L0j8n3NP2o2l0L0
4631A5k4j0qJ4k1j3K3M3j5M3o6J5K8p6O9ol3M2K3m6J0m3N1OJl9j4M1Nk5J6j9K0
4664GN3p2L2j7Nl6P8q9N7j8l0J5jk4PR0n2m3M1O7o0k0N0j4j6nM0mk8k2j1M6m1
4697a5O0l6J5N8j47M4O8j5m9LL4m7K4M2l1j8L7l1lj5k3J8N0j2n2J1Q7l1j02J48
4727G2p7m4P9l6J1k0Q1o5m8Q4j5o0M8M8p4m8J05j2q2L4P7q2K8J5l4LK1j9qk3K3
4758a8K8m3N2j1k1K3K0q3j2J25n6pN1o0l3M8Ml7K7M8m5jM0K4p5J8qM2o5PO8p6
4790b6L5J2Mnj9L0J5m1J2j0m4K6K4m6J7M6Np0O5J2n4LN4K1j30N1Q1j27O8K1l0
$$ plain form
4567 31 -13 -15 51 -36 -55 35 50 12 15 16 94 -10 45 -19 -7 3 11 -6 35 4 38 -51 20 54 -49 -34 30 2 25 24 -50 -6
4599 -6 66 -38 -43 -21 -11 -45 33 52 62 -7 15 32 5 25 55 68 -27 63 21 25 25 73 58 41 71 53 0 5 77 15 -15 15
4631 15 -9 -19 -27 -13 -34 -47 -24 19 4 47 -19 -4 24 -52 17 11 -22 20 43 -3 7 -36 15 21 22 -17 -31 10 15 -10 6 -13 7
4664 7 60 -12 20 3 8 -28 50 -39 18 0 -30 -15 -16 -40 -33 57 5 -38 3 70 10 -10 40 26 10 5 45 41 13 -9 -20 26 -15
4697 -15 45 9 24 82 -65 -21 47 32 -17 -14 20 -27 -3 39 8 -10 27 -4 -7 -22 -45 -27 23 11 -41 -30 57 26 -76 72
4727 72 -5 -49 30 -6 5 -15 66 1 -47 37 22 -38 10 58 -16 -64 41 29 -53 -19 58 -24 4 19 -15 -12 9 -10 -18 -41 -18
4758 -18 10 -33 19 8 -13 10 30 -53 -65 60 4 -3 48 -12 -45 3 7 -30 -3 45 0 -1 39 63 -12 6 -2 40 -25 -18 50 -26
4790 -26 9 21 25 20 1 31 46 5 17 7 -37 -11 13 -33 -16 30 35 -35 30 42 -12 -9 45 66 -64 -13 68 -59 9 30 0
4821@J0l2N4l8M1p3O6l4L5k0L4j0n3L1l5M3m2K1K5l9pJ0l7P3Kl4o1J12m2k8L6
4852Hl0P6q5J1K1j7K9L6m6Oj6L4j8J3p2L5j1N9k9NK5l6N7K2n0k2M6p5j0O3k6M
4884Gl5N7k4p0N4R7j14J5P2o1Oj3j1J3mj8j3K1K2MJ8lL8k5Jl5K3J4l6J2Nj1J5
4917B1l9L7qJ4J7qj8qN5o2o7Q1M7j20K3O8l6j11J76p0M2K1M9j26M1l9pK3l3M6
4947In7N8m3K8qO5K4o0j3K1qmJ1k8qM4o7K1RN2l7K1L6m0o6N0l3Ok3j0J7l1M7M
4981a3lP5k5p1O6J7m5J5l8N3p0kmm6Q4P6q0k2J05l9M3n5rj7lj4k4OJ3J4lM6K3
5014E3p8J1J10j19j4N8Mn1JQpMK4k1k2J31m4k2k3K0Rl3Nj3m1L5N6m5K6m5L3N0
5046F0K9k7m7M0m9p0K1K8L3o9N1K2j16P5R5n9n1R2m8j1lj0n3N1J8n8P4k5Ro9R7
$$ plain form
4821 0 10 -22 32 -6 35 -38 28 -6 29 9 43 33 -20 11 -24 19 -23 -2 23 -16 -23 -13 -50 23 25 -9 -70 42 0 -28 8
4852 8 -22 54 -31 -20 1 -16 13 49 3 9 -7 27 9 22 -50 -15 -26 33 4 9 34 -2 55 77 27 5 51 -24 -34 29 3 7
4884 7 -28 29 5 -65 -11 86 -28 -13 59 -2 4 -9 -20 -7 -11 -29 -42 -21 1 5 23 20 58 33 34 -1 22 36 0 12 17 6 21
4917 21 -18 19 11 25 42 34 16 8 63 1 -66 15 62 -58 -35 33 -3 -114 62 -8 34 55 104 -22 19 -20 -27 -4 -37 9
4947 9 -48 10 -33 -5 -13 52 76 16 3 24 16 12 23 -5 -13 31 -36 -15 -6 46 9 30 66 26 -40 10 -23 -17 -40 -50 -33 -64 -17 -13
4981 -13 -16 59 34 -37 29 46 1 16 -22 31 -39 -41 -45 -91 -7 69 -11 -33 72 33 76 21 12 -5 -8 -22 -46 -40 -27 -13 -16 30 53
5014 53 -25 -14 96 -23 -37 21 25 -26 -25 -17 -24 -20 4 -17 -39 92 48 26 3 23 32 -1 4 -9 -50 -15 41 -4 22 -23 10 60
5046 60 89 62 15 55 6 -64 -43 -15 18 -51 0 22 -94 -19 76 17 -34 58 10 -1 -4 -14 -67 -16 2 -56 18 -7 2 -67 30
5077C0KJ0Q9k1j25K6J7n9qP6m1o0Q4mo4R6K4o8k8Q9r1r7R4P0j05L3P4pn8K8R6
5108A02r2pN5j02M4J1k1o3O9k0l1Q1J8NQJ3m2nL1q7L8nL4l8JJ3l2n2R0K0p3O4
5140B7L9r7J1K5J5p4Q1m4p1M5M2k0l5J05Lp1N7no5M2op2K3M9k8k4Q0j8Kl4O4k9
5172A7K9O5j06j4j4J7m0MP3q3K1M9J4l8K2K0m0j1J8kn7K0rM6J5j5om1R7m6N9l5
5204B9l2K5K2l0k1Mpk6L7N0q8N2k6OM0J4J0n9j3L5j8K5m5J1OK3mm7N4j8n3M4J7
5237A7jn3KO9k4J1J5L2q3j9L0L3n9K2M4o4oM6j5l6P1ml0j6O1n9J3k1rj4N8K3n2
5270a8K1n2J22m9l8N8l5q9P5M2n7L0%q3Q1L8o4rOK1J6LN6q0K2j2j0P0p7J2n1N3
5302Bj9O5n4LJ7N1p9N4r0O5q4O7j0j3K2K3J6m9LJ8k3k5K2L2o7O2J6j2k0JJ6LJ0
$$ plain form
5077 30 32 42 131 110 -15 11 28 -31 -39 37 -4 -64 20 16 -48 48 72 4 -24 65 -26 -123 -29 41 -64 -31 43 36 -22 6 102
5108 102 10 3 58 -44 0 11 -10 -73 -4 -24 -55 26 44 49 57 70 28 23 54 -33 5 0 34 -4 -3 10 -22 -74 16 36 -37 27
5140 27 66 -31 -20 5 20 -54 27 -17 -88 -43 -1 -21 -56 49 52 -19 38 33 -32 10 4 -68 -45 4 -24 -48 32 14 16 -18 46 17
5172 17 46 111 5 -9 -23 -6 -46 -42 31 -52 -31 18 32 -6 16 36 -4 -15 3 1 -56 -36 -45 1 16 1 -5 -46 51 5 64 29
5204 29 -3 22 44 14 -7 -3 -10 -36 1 51 -37 15 -11 -5 35 49 59 0 -13 22 4 29 -16 -5 1 24 20 -27 27 9 -44 0 17
5237 17 16 -37 -35 34 10 21 36 68 -15 -34 -4 29 -30 -8 36 -28 -34 12 -3 -39 32 28 -2 -18 43 -16 -3 -24 -33 -47 11 34 -18
5270 -18 3 -49 73 24 -14 44 9 -80 -5 37 -20 10 10 -73 8 46 -18 -27 -21 0 16 19 75 -5 17 5 -5 65 -12 0 -51 2
5302 2 -17 48 -6 -3 14 65 -14 40 -50 15 -69 -2 -12 -25 -3 20 36 -13 -10 8 -15 -40 -18 14 -53 9 25 13 -7 -6 10 13 23
5335B3J2k2m5K5K1n0N3M8j27M9M4m1P3o4L5q0LM3oK2k1nL0m5K9m9J9O4qj7j9L1
5367B5J5k6l9j6ML1M4q5P2J4n8K1Mj0j3NL9k2m3P2k5J9l8K1j6rK7rL1j6l4k4M7
5400HMj2J2j5k3O7j6l5L7J6n4k0N2j7k0k6O3n4j0Q4l5l3N0J8l6nk0L8J4k5l8L3
5432BJ1nj4K2J3p9L2Q9n4nl3L2n8L1k0L3l0O2rm6O1j6M8n5Kp0P0m2O%L9J0m4P0
5466E3J0k9l6O1p0L8l4K4ml6kN3r4P0L4l7NJ0jl7l3LK8L7n8J9m8P1M4q7P8k2J5
5499B5l8J1j8k8O0n9N7l4N6l9j1N8l6j2L0n1N5Rq7N8qN1j01N4K1o3J3O7rmk9L3
5531C1j6q3P3k0k3K0Rl7Q7j6m7N2m1L6n2M0k7K5jrN3j21Q2J2PJ4j8j5M6%n3j2
5563dL9m2j0N7n0j9K8J7o5L6J1kK0l1j2m9R1k0K5m4N7J0o5M3k5J5j8R9n7j9L2
$$ plain form
5335 23 35 13 -32 -7 14 -36 17 65 -62 -13 31 -10 63 -1 34 -46 -43 0 -6 16 -5 -10 20 -25 4 -45 -26 38 30 13 -6 25
5367 25 40 14 -25 -41 -37 -6 38 -47 25 39 -19 2 6 -4 -17 -12 27 5 -38 34 9 28 -10 11 -5 -14 13 4 35 19 -15 -39 8
5400 8 12 0 12 -3 -26 41 25 -10 27 43 -11 -31 21 4 -16 -42 21 -33 -43 41 6 -27 23 41 5 0 -20 18 32 7 -31 2
5432 2 13 8 -6 16 29 -50 -18 71 17 12 -21 11 -47 -16 -36 -3 -33 29 20 -26 35 19 67 12 14 -56 14 -28 -22 -22 17 27 -17 53
5466 53 63 34 -2 59 -11 27 -7 17 13 -23 -25 28 -66 4 38 1 6 16 15 -22 -55 -52 -24 13 -45 -26 -74 -3 41 -46 32 10 25
5499 25 -13 -2 -20 -48 12 -47 10 -24 32 -7 -18 40 4 -8 22 -29 26 35 -52 6 -2 49 -52 2 23 -40 -27 40 31 27 -2 31
5531 31 15 -68 5 -15 -38 -18 -9 -46 41 25 -22 30 -11 25 -27 13 -14 11 10 1 54 -67 15 27 34 48 30 15 61 61 8 -4
5563 -4 35 -7 -17 40 -10 -29 -1 16 -49 -13 -2 -4 16 -15 -27 -76 15 -5 20 -24 33 43 -22 21 -4 11 -7 92 35 16 48
5594D8n9m7M6R2j27J7J2J8qK5J6o7O4j2n1M7Rp2N2mjl1Q3n0L9k1k8Rm5P0l1j9
5626b6K9oK4J7n0N1Pj8j3k9L1J5n6j5k3P9RJ0l8l0N6L2k9k0K2n4L8k5K3M6o5L6
5658B8n1Kj7JM7j1RkM9m4JKk3K2k1KmO3l9m0K0MK3k2k2j3P5J2j1n2L4n3L1m1N7
5693A6Mp3Q2l1L2q8O3k7M1j9nK6Om3K4n5N2p8M0L1JJ9N1j09LO0n9P6qm5O5k6l3
5726gk8P4%pk7J0m5M0j9kPm6M3k8J6K6mn5P4Ll2L3k7K5j9l8L6K2k5N3j5m4L4M6
5760G4n3Om3L6l3mL1J7l0l8K2m5N8J6k5N8m3J9j7j7K7N8p9j5nM4k1j2J9K2J4r8
5792e7L8M4Mk8M9K1r1J9O5q4J5j2k0J08np4L1J6mj0k7K5K4o1K9l3J8KJ1jJ8om0
5825a6K8j1P3j10J3J5Mk3O5q0N6K9Ok3l3K7On9L5K3j5j7l0K2K5l0QM2rl4N3n0
$$ plain form
5594 48 -11 -58 -12 80 -47 -30 -18 0 -8 17 33 -34 30 18 -33 14 23 -49 3 -1 -2 -33 50 0 39 18 -10 -1 -46 24 -7 -26
5626 -26 3 -3 21 38 -12 39 46 28 15 -14 17 32 -24 -39 -62 17 26 36 -2 -32 24 56 27 7 29 -25 13 -12 11 57 -8 28
5658 28 -23 -21 -38 -37 10 -1 8 6 55 11 12 14 -9 13 -8 -6 -10 53 14 -26 -6 -2 21 -1 -23 -36 39 51 40 -12 22 -31 0 -41 16
5693 16 20 -53 29 -2 30 -58 5 -22 19 0 -5 21 27 -16 8 -47 5 -73 -33 -2 -1 18 69 -40 -37 23 -36 40 32 -13 52 26 -7
5726 -7 -35 39 39 32 5 15 -30 10 -9 -11 -4 -50 -7 -35 -19 7 3 -52 22 25 -7 26 -1 24 5 -33 3 25 0 53 38 -6 28 74
5760 74 21 27 -16 20 -13 -17 14 31 1 -37 -15 -60 -2 14 -11 47 4 23 6 -11 16 74 -5 -20 -25 19 -2 -14 5 27 41 -57
5792 -57 -19 25 29 1 50 71 -20 -1 64 -20 -5 -17 -37 71 66 -8 23 39 35 25 -2 23 47 -14 15 -18 0 2 13 12 30 24 -16
5825 -16 12 1 74 -36 -23 -8 -4 -27 38 -42 14 43 49 26 -7 20 26 -33 2 25 10 -7 -37 -15 10 -20 -12 30 21 -13 40 -10
5857a0M7l4l6O4l1J4m9j2P9l7LRlK7k4J9jo2L9L8m9k6L9l7L3k4k4O0J4J2m0J7
5889A5qk5Ll1N4n6Q3m1jQl5R9n7L6n9LK2n4O2l9j1M1N1r4N2k1JK7k9K0K0On4l1
5923d3O1m8j2N3L1m6M6j8o4L5Lj8K9M6q9L0j3j7J2N3J2k5M4l0mOLk9J4l0L4k4
5955BJJ2p4Q7oo8K1O0l3K1j6jRj2J9l4M0J8or3L0P8j7j5K1o2O5J4l4l8J0J5k2
5988hm0M9o2R4K1n3RN7n8o7K6M2Ql4No6M0J8O0m7m3O9k9n7P6j4O4m4j5k2P8m3
6020A4l8J7O4j0m3j3L1J2m2k4K1M0k6j6M1n3N3l1ok6L8J3n8Q4m7K4l5OJ6jM1p0
6052b4k1N4l9K0j4N2o8j5L8Q1j23K7MK5QNk8M4ol0mM6Po8M5K6Lq2R6k1q6N5m9
6085d2J9K5m4j2K1J7j5mk1L0rJ09q9QK7k7Lk4J1R3j04N9n6Q5l2J5l4j5J5K0Ll5
$$ plain form
5857 -10 37 3 -33 31 0 14 -35 -47 32 -5 -2 7 4 31 7 26 25 -37 2 40 -9 -35 4 -33 0 -24 -48 12 26 38 -2 15
5889 15 7 -18 -15 -46 8 -48 35 -6 -7 1 -34 65 8 44 -15 -12 10 -44 18 -21 -32 9 60 -34 18 -3 -2 25 -4 16 36 42 -12 -43
5923 -43 18 -30 -42 11 42 -4 42 24 -40 -5 -2 -20 9 55 -34 -4 -17 -34 -22 31 43 18 62 32 28 34 37 8 22 -8 26 2
5955 2 3 15 -59 28 22 -46 -25 35 2 23 7 6 15 3 22 -12 28 46 40 -53 -23 55 38 23 44 -18 47 61 27 -11 -1 14 -8
5988 -8 -48 1 -61 33 54 1 10 67 9 -58 -32 10 18 -16 -11 -77 -37 -19 41 -6 -49 20 -9 -66 10 -4 60 16 1 -21 57 14
6020 14 -24 -7 57 47 4 -9 22 34 -8 -32 -11 29 3 -13 28 -25 28 -3 -9 -35 3 16 -42 42 -5 19 -16 -10 6 5 46 -24
6052 -24 -45 9 -30 -10 -24 28 -40 -55 -17 64 -59 -32 -28 -3 5 10 -18 26 20 -10 -14 32 39 -29 16 42 45 -37 59 38 -48 7 -42
6085 -42 -23 2 -42 -54 -33 -16 -31 -35 -56 -26 -35 74 -15 -7 20 -7 -4 -28 -17 76 -28 31 -25 60 28 43 9 -6 9 29 32 -3
6117cRp5Q2qL1j5K4m6l7P9m5l4O0Om5j7j2O0q8Q8L1n5j1l4J28n0K2p3J0M0o3M4
6149Cnm1M0l0K4K5m2M1j4pk3N0l3l8J12n0j7K1k0m7L9L3l1K4n8j0O1o2N7J1j7
6180dj0N2n9Kk9J8KJ2K0K4m5K7J4k8K5K2l9N3k5J8k3j2%l9O6J9n8j3L6n5L3J6
6212B0on6N4j9K7k1l7N2q2O9l9P4l2L8p1PK2K7k8jK1Ll9OkMNlL4n1M6j8L6oMl7
6248AJ3J1k9j2l5qL7J7J5m4l1M2N4j5j0M5k8o0M9K3n2N0k9qL8m0Mk0M7L6k3m7
6280iJ0J7q2R6j5K6o2K6qK1k8k6P8k7j6lNm6L8PkL7k4J6Ql5L4l0k5N6q4L6L2o5
6314d4Q0l3K0M0p6K7j2k1RL0lM5o8K4Ll2J7k7K3k3O4j5Rl0J1l1M9m7%Ljk1P5n1
6348fKnj1j1O8l0l0rO0J0n3l0RL7j8M2p5M2O7J0n1J9nk6Q2p6m2O4J0l2k3K0lL0
$$ plain form
6117 -3 6 -69 13 5 36 21 45 -1 -38 41 -4 -38 22 28 -17 -34 -46 14 -74 14 45 -10 -21 -55 73 23 45 -28 -18 22 -41 3
6149 3 -2 -43 -3 -33 -9 16 -26 15 1 -6 -29 21 -12 -50 62 12 -5 16 -4 -51 -12 21 -10 14 -44 -54 7 -55 2 13 -4
6180 -4 -14 38 -21 -19 -48 -30 -28 -16 4 28 -17 10 24 -4 21 43 4 57 32 50 27 15 15 -24 42 61 3 -10 26 -29 4 20
6212 20 14 -42 12 -7 20 -1 -38 14 -68 1 -38 36 4 42 -29 -22 0 27 -1 -2 19 22 -17 -11 -13 -9 -4 -7 27 -24 22 4 40 34 38 1
6248 1 14 25 -4 -16 -51 -59 -22 -5 10 -34 -65 -23 31 16 6 51 23 -37 12 35 -17 33 4 -4 34 -6 -2 -22 25 61 38 -9
6280 -9 1 18 -64 32 17 43 -19 7 -1 20 -8 -34 44 17 1 -2 3 -43 -5 2 0 37 13 29 37 2 36 6 -19 37 -47 -11 21 -44
6314 -44 36 3 23 63 -13 14 2 -19 -10 20 17 62 -6 18 21 -11 6 -21 2 -21 43 28 37 7 18 -13 36 -11 -11 -8 -9 -30 45 -6
6348 -6 -4 -9 -20 -31 37 7 -23 -32 28 38 -15 -45 -36 1 -17 25 -50 -8 59 69 18 37 32 6 88 12 -30 34 44 12 -11 9 6 36
6382C6o5L4L0j2k4J3j0nn3L3PO7o7L0k2L0j9L1j4m0L3k6rj6J6J4%l9K9O0m2%K9
6415B9k9QM7k8n1l0O1n5O0J5l6Ql0L1K1J6o6O5q2O3L2p4LJ4N6l5qj0Pk7J3M4m8
6448a6m2J29j0m3NK0p1M0N3n7Rm4M3o6L9j1KJ7l6K6J0J4l6K8m6L2J8j0J5NJ6l3
6480@N6l0L7m2p%j2K6j9pO5m0l2M8rnMp6O6m4N0nl0PJ3jl9O5p0j8L7j4M6l0K7
6515A7l4L0k4L7l1J4o1N3oKL6m8M6j7K6k0L7o1M5Po7M4m7K0l5R7m6J9j3o5J19
6546G4o2N9r7L6k7OL7l9RK9n5M8l9J0JO3o0OkJ2m9N5K5J9j07J8L3o6K3K6j2K1
6578eMJ2n9N9K1m2J0Qlkj5N5l6J7J7n1L6L0o2K0L5k0M3o3k6k0Q3l7J8oOro3O0
6612A5q5%J11Pn9J0K2q0Q3M5p1J1K2o9L3j2LnQOK6l4J9J4k8l2J03o0rP2n5k9K1
$$ plain form
6382 36 -29 5 35 23 -1 12 2 -3 -56 -23 -16 51 -16 14 -8 22 3 34 20 -20 13 -13 -22 -38 -22 -8 -8 -47 -18 42 0 0 29
6415 29 0 8 55 27 -24 -54 7 -48 12 27 -9 -1 -31 0 21 37 -29 36 -46 17 49 -25 -22 -8 48 13 5 -5 2 -25 -12 32 -16
6448 -16 -58 71 61 18 23 43 -28 12 65 8 17 -27 16 -50 -11 -22 -20 -3 -39 -13 -3 11 -25 3 -43 -11 7 -3 12 17 33 0
6480 0 56 26 63 21 14 14 2 28 9 2 67 27 -5 43 34 29 33 -43 23 -21 29 24 -6 1 14 13 -26 39 -31 -49 -12 -26 20 -10 17
6515 17 -17 13 -11 26 -5 9 -52 1 -5 -3 33 -15 31 14 40 20 57 -4 41 48 -19 25 -22 -2 -37 60 14 33 20 -45 74
6546 74 12 71 -26 10 -17 -11 26 -13 -4 25 -30 18 -21 -11 -10 53 -7 -1 -3 9 -40 15 40 59 -48 -30 3 -63 -40 -14 -26 -5
6578 -5 -1 11 -48 11 32 -10 0 8 5 3 -12 43 7 24 41 -10 26 56 -6 14 49 29 72 9 -17 -37 46 9 27 21 27 18 -45 15
6612 15 -70 -70 41 48 -11 -1 21 -59 24 69 -2 9 31 -38 -5 -17 -14 -19 -11 -5 21 -13 6 20 -8 -40 63 3 -6 66 11 -18 3
6645CL9n6OL4k2j6RM5j00O8L1m2Rll5J9L6k1Rjk7P5l3L9p4J8J5j7l5kJ6K0lJ2
6679A6j5j1M6J0jn5O0n2M4m7K0j5o7Q6L0q4L5m0J01m8Pj8QL9o2K6j2PO1m1M2k8
6711D2j7Kk4K1o3P6nj9q7N0K0m6N4j4j1M8l3nm0P2l6j6O4p0L2oJ6lL7n5OM2k1
6744A1l2J5M3%k0J1j8J0k4J7j7%rJ9j5m1K9J0k8J5N3r7Q4n1j5K1O4Qln9K8j7L6
6777B8m5J0O7n7M9l1O3m6p1M9j1Pj2J9p5M2L9lj7QOj12J00Pm8M1j6N5m8j9K5p
6809cJ6p4K9O6J0m4Mkjj7Q7p8L1k4j7O4nm8J5J3m3N6o5N5k0Rp3K6oP1l8Ro5N0
6843a2N2q6Q3L3j12N3Pm4K8O1m4o0j3Q2Nj15J28j0p5M8J0J5k2jn3J05qo9k3K0
6873a7M5m2MN4m6j3J5N1m4L5k7m6JN8j1l2L5Nm5O1J5r2LM2K9n1L3k8oL4ql9M5
$$ plain form
6645 3 42 -14 -8 26 4 -12 -3 42 -58 10 41 -1 8 5 -30 -11 25 4 13 12 -15 60 27 66 -8 10 25 8 -27 -29 -13 7 4 16
6679 16 1 -10 36 46 45 -10 50 -2 42 -5 15 0 -67 19 49 -35 0 -40 61 13 20 2 10 49 -13 13 1 8 69 28 70 42
6711 42 25 27 3 24 -39 37 32 13 -74 -24 -4 -50 4 -10 -21 27 -6 -11 -51 21 -15 -31 33 -37 -5 -11 5 2 39 -16 -10 32 11
6744 11 -21 -6 37 37 17 28 10 20 -4 13 -4 -4 -13 6 -9 -50 -21 -11 -39 -24 29 -68 16 -35 -50 -29 35 43 40 -19 9 -8 28
6777 28 -17 -7 60 3 52 21 84 38 -33 16 5 12 0 19 -56 -14 25 22 5 13 19 -93 7 14 -34 7 -9 46 -2 -21 4 -3
6809 -3 13 -61 -32 34 44 0 4 2 1 -16 71 -7 24 0 -17 47 42 -6 9 22 -21 35 -30 25 5 14 -59 -33 -39 32 -6 3 -62 -12
6843 -12 40 -46 37 70 -42 11 18 -26 2 63 19 -41 -54 28 33 -82 46 36 -39 9 19 34 12 11 -42 63 55 -14 -37 -17
6873 -17 28 -14 -10 44 -2 -15 0 51 7 42 15 -31 -30 28 17 -15 20 25 -20 41 56 -36 -33 9 38 -13 20 -8 -14 20 12 -27 18
6906A8j7k1K2K0m2M7l3K3J1j7%oL0k6oj0MoM0l8j4J1KL4m7rO3k2l2J04o7j7l4
6939c5M3j8kK8l4O0jj9K6qJn0J1k2N7K2m2J2m1K1k5P5n3K5m3oL7m4N1j7QN7m2
6972C2J1po4R4l6n6K2k1P9p4K3k5K5J1k6N1l3NJ6k7k4LK4j3J2Om8L1k2J5N4q3
7004d5O5r5P5K4j5k1K8m1O9l6Pm3P3k5o%k7jOJ9l3%L1K5j8m5N3Lj5J6n5K8j0M8
7038C9j01J21q4O5j8J8qK7o8Q0n3ML8k2o7MM2J4l1K7j0%l5k1J5jL1n5P2Jo7K0
$$ plain form
6906 18 1 -20 2 22 -20 27 -6 17 28 11 11 5 35 9 3 -7 -3 -9 31 -7 -21 -10 -8 26 -21 -30 33 11 -21 83 16 -1 -35
6939 -35 8 -10 -12 16 -18 42 41 22 48 40 41 -9 2 -20 37 59 17 29 -12 9 -16 59 6 31 -12 -18 19 -25 26 9 17 74 32
6972 32 43 36 -28 66 30 -26 -4 -25 54 -20 3 -22 3 14 -12 39 6 11 27 0 -24 -21 3 -10 2 8 -40 -9 -31 -16 38 -45
7004 -45 20 -75 0 24 9 -12 16 -25 44 8 15 -28 45 20 14 14 -13 -14 -8 11 -22 -22 9 34 16 -29 24 27 12 28 -27 1 -9 39
7038 39 -62 59 -25 40 22 40 32 59 -9 71 18 22 60 38 -29 -25 17 31 0 27 17 17 -18 -39 -24 -25 6 -49 23 24 -43 -23
$$ [...]
8191a7
##END NTUPLES=NMR FID
##END=
