##TITLE=1H_AM_NV51
 CDCl3
 8 sc, 
 9.6.2023
##JCAMPDX= 6.0         $$ Bruker NMR JCAMP-DX V2.0
##DATA TYPE= NMR FID
##DATA CLASS= NTUPLES
##ORIGIN= UXNMR, Bruker Analytische Messtechnik GmbH
##OWNER= root
$$ XWIN-NMR		Version 3.5
$$ Fri Jun  9 16:25:31 2023 Russian Standard Time (UT+4h)  she@DPX200
##.OBSERVE FREQUENCY= 200.13135
##.OBSERVE NUCLEUS= ^1H
##.DELAY= (6, 6)
##.ACQUISITION MODE= SIMULTANEOUS
##.ACQUISITION SCHEME= undefined
##.AVERAGES= 8
##.DIGITISER RES= 18
##SPECTROMETER/DATA SYSTEM= spect
##.PULSE SEQUENCE= zg30
##.SOLVENT NAME= CDCl3
##.SHIFT REFERENCE= (INTERNAL, CDCl3, 0, 15.7039)
##AUDIT TRAIL= $$ (NUMBER, WHEN, WHO, WHERE, WHAT)
$$ ##TITLE= Audit trail, XWIN-NMR		Version 3.5
$$ ##JCAMPDX= 5.01
$$ ##ORIGIN= Bruker BioSpin GmbH
$$ ##OWNER= she
$$ F:/spectra/data/she/nmr/H-F/1/audita.txt
$$ ##AUDIT TRAIL=  $$ (NUMBER, WHEN, WHO, WHERE, WHAT)
(   1,<2023-06-09 16:22:41.45 +0400>,<she>,<DPX200>,
      <created by zg, POWCHK disabled, PULCHK disabled
       configuration hash MD5:
       00 E9 B6 7A A2 85 ED C7 34 08 36 98 17 FE 4E 26
       data hash MD5: 16K
       75 79 4C 39 3F C4 92 FD 0B 65 7C CF F5 B9 A3 CC>)
$$ ##END=
$$ 
$$ hash MD5
$$ 9A DD DB CB 64 BD 45 2D 81 16 70 61 5C D9 A6 34
##$RELAX= 
##$RELAX= 
##$RELAX= 
##$RELAX= 
##$RELAX= 
##$RELAX= 
$$ Bruker specific parameters
$$ --------------------------
##$DU= <F:/spectra>
##$EXPNO= 1
##$NAME= <H-F>
##$PROCNO= 1
##$TYPE= <nmr>
##$USER= <she>
##$AMP= (0..31)
100 100 100 100 100 100 100 100 100 100 100 100 100 100 100 100 100 100 
100 100 100 100 100 100 100 100 100 100 100 100 100 100 
##$AQSEQ= 0
##$AQ_mod= 1
##$AUNM= <au_zg>
##$AUTOPOS= <>
##$BF1= 200.13
##$BF2= 200.13
##$BF3= 200.13
##$BF4= 200.13
##$BF5= 200.13
##$BF6= 200.13
##$BF7= 200.13
##$BF8= 200.13
##$BYTORDA= 1
##$CFDGTYP= 0
##$CFRGTYP= 5
##$CHEMSTR= <none>
##$CNST= (0..31)
1 1 145 1 1 1 1 1 1 1 1 1 1 1 1 1 1 1 1 1 1 1 1 1 1 1 1 1 1 1 1 1 
##$CPDPRG= <>
##$CPDPRG1= <>
##$CPDPRG2= <>
##$CPDPRG3= <>
##$CPDPRG4= <mlev>
##$CPDPRG5= <mlev>
##$CPDPRG6= <mlev>
##$CPDPRG7= <mlev>
##$CPDPRG8= <mlev>
##$CPDPRGB= <>
##$CPDPRGT= <>
##$D= (0..31)
0 1.2 0 0 0 0 0 0 0 0.06 0 0.03 0 0 0 0 0.0002 0 0 0 0 0 0 0 0 0 0 0 0 
0 0 0 
##$DATE= 1686313360
##$DBL= (0..7)
120 120 120 120 120 120 120 120 
##$DBP= (0..7)
150 150 150 150 150 150 150 150 
##$DBP07= 0
##$DBPNAM0= <>
##$DBPNAM1= <>
##$DBPNAM2= <>
##$DBPNAM3= <>
##$DBPNAM4= <>
##$DBPNAM5= <>
##$DBPNAM6= <>
##$DBPNAM7= <>
##$DBPOAL= (0..7)
0.5 0.5 0.5 0.5 0.5 0.5 0.5 0.5 
##$DBPOFFS= (0..7)
0 0 0 0 0 0 0 0 
##$DE= 6
##$DECBNUC= <off>
##$DECIM= 32
##$DECNUC= <off>
##$DECSTAT= 4
##$DIGMOD= 1
##$DIGTYP= 9
##$DL= (0..7)
0 120 120 120 120 120 120 120 
##$DP= (0..7)
150 150 150 150 150 150 150 150 
##$DP07= 0
##$DPNAME0= <>
##$DPNAME1= <>
##$DPNAME2= <>
##$DPNAME3= <>
##$DPNAME4= <>
##$DPNAME5= <>
##$DPNAME6= <>
##$DPNAME7= <>
##$DPOAL= (0..7)
0.5 0.5 0.5 0.5 0.5 0.5 0.5 0.5 
##$DPOFFS= (0..7)
0 0 0 0 0 0 0 0 
##$DQDMODE= 0
##$DR= 18
##$DS= 0
##$DSLIST= <SSSSSSSSSSSSSSS>
$$ [...]
##$SUBNAM2= <"">
##$SUBNAM3= <"">
##$SUBNAM4= <"">
##$SUBNAM5= <"">
##$SUBNAM6= <"">
##$SUBNAM7= <"">
##$SUBNAM8= <"">
##$SUBNAM9= <"">
##$SW= 18.05172834244
##$SWIBOX= (0..15)
0 0 2 0 0 0 0 0 0 0 0 0 0 0 0 0 
##$SW_h= 3612.71676300578
##$TD= 16384
##$TD0= 1
##$TE= 0
##$TE2= 300
##$TE3= 300
##$TEG= 300
##$TL= (0..7)
0 120 120 120 120 120 120 120 
##$TP= (0..7)
150 150 150 150 150 150 150 150 
##$TP07= 0
##$TPNAME0= <>
##$TPNAME1= <>
##$TPNAME2= <>
##$TPNAME3= <>
##$TPNAME4= <>
##$TPNAME5= <>
##$TPNAME6= <>
##$TPNAME7= <>
##$TPOAL= (0..7)
0.5 0.5 0.5 0.5 0.5 0.5 0.5 0.5 
##$TPOFFS= (0..7)
0 0 0 0 0 0 0 0 
##$TUNHIN= 0
##$TUNHOUT= 0
##$TUNXOUT= 0
##$USERA1= <user>
##$USERA2= <user>
##$USERA3= <user>
##$USERA4= <user>
##$USERA5= <user>
##$V9= 5
##$VALIST= <valist>
##$VCLIST= <CCCCCCCCCCCCCCC>
##$VD= 0
##$VDLIST= <DDDDDDDDDDDDDDD>
##$VPLIST= <PPPPPPPPPPPPPPP>
##$VTLIST= <TTTTTTTTTTTTTTT>
##$WBST= 1024
##$WBSW= 4
##$XGAIN= (0..3)
0 0 0 0 
##$XL= 0
##$YL= 0
##$YMAX_a= 132947
##$YMIN_a= -140447
##$ZGOPTNS= <>
##$ZL1= 120
##$ZL2= 120
##$ZL3= 120
##$ZL4= 120
##$ABSF1= 10
##$ABSF2= 0
##$ABSG= 5
##$ABSL= 3
##$ALPHA= 0
##$AQORDER= 0
##$ASSFAC= 0
##$ASSFACI= 0
##$ASSFACX= 0
##$ASSWID= 0
##$AUNMP= <proc_1d>
##$AZFE= 0.1
##$AZFW= 0.1
##$BCFW= 1
##$BC_mod= 2
##$BYTORDP= 1
##$COROFFS= 0
##$CY= 11.3945322036743
##$DATMOD= 1
##$DC= 2
##$DFILT= <>
##$DTYPP= 0
##$F1P= 15.7292609196834
##$F2P= 12.9074282941183
##$FCOR= 0.5
##$FTSIZE= 0
##$FT_mod= 4
##$GAMMA= 1
##$GB= 0.15
##$INTBC= 1
##$INTSCL= 1
##$ISEN= 128
##$LB= 0.24
##$LEV0= 0
##$LPBIN= 0
##$MAXI= 10000
##$MC2= 0
##$MEAN= 0
##$ME_mod= 0
##$MI= 1.114404
##$NCOEF= 0
##$NC_proc= 0
##$NLEV= 6
##$NOISF1= 3.799351
##$NOISF2= 2.8
##$NSP= 1
##$NTH_PI= 0
##$NZP= 0
##$OFFSET= 15.70392
##$PC= 1
##$PHC0= -20424.62
##$PHC1= 13.05272
##$PH_mod= 1
##$PKNL= yes
##$PPARMOD= 0
##$PSCAL= 0
##$PSIGN= 0
##$REVERSE= no
##$SF= 200.130013532006
##$SI= 16384
##$SIGF1= 3
##$SIGF2= 2
##$SINO= 400
##$SIOLD= 16384
##$SREGLST= <1H.CDCl3>
##$SSB= 0
##$STSI= 0
##$STSR= 0
##$SW_p= 3612.71676300578
##$SYMM= 0
##$S_DEV= 0
##$TDeff= 0
##$TDoff= 0
##$TI= <>
##$TILT= no
##$TM1= 0
##$TM2= 0
##$TOPLEV= 0
##$USERP1= <user>
##$USERP2= <user>
##$USERP3= <user>
##$USERP4= <user>
##$USERP5= <user>
##$WDW= 1
##$XDIM= 8192
##$YMAX_p= 0
##$YMIN_p= 0
$$ End of Bruker specific parameters
$$ ---------------------------------
##NTUPLES= NMR FID
##VAR_NAME=  TIME,          FID/REAL,        FID/IMAG
##SYMBOL=    X,             R,               I
##VAR_TYPE=  INDEPENDENT,   DEPENDENT,       DEPENDENT
##VAR_FORM=  AFFN,          ASDF,            ASDF
##VAR_DIM=   8192,          8192,            8192
##UNITS=     SECONDS,       ARBITRARY UNITS, ARBITRARY UNITS
##FACTOR=    0.0002768,     1,               1
##FIRST=     0,             0,               0
##LAST=      2.2672688,     0,               0
##MIN=       0,             -140447,         0
##MAX=       2.2672688,     132947,          0
$$ Real data points
##PAGE= N=1
##DATA TABLE= (X++(R..R)), XYDATA
$$ [...]
2160B275k977j404L004J176k975j084L036J016l176q58L090P34l118o40L222L88
2176A709l198k32L120K34l221r1L216m4l155K10L182m08l067N06L110n79l081
2193a789P05L081r06k978R44K925j060k896J162K826j293k781J384K680j507k673
2209b176J676K506j690k438J831K402j996k209J957K217k056k077K102K057k223
2224a17j873K236J836k346j767K474J605k452j588K554J453k656j286K636J207
2239A916k750j142K793R82k736r46K846P81k799o90K896N12k874l95K851L91k949
2256a313j59K805J91k879k2K909j16k942K07K880l08k825L53K864n60k843O22
2273a136K795o91k821Q68K774r00k772J068K735j181k672J287K627j416k490J472
$$ y = [2275, -702, -2106, 898, 2074, -901, -1985, 1051, 2067, -1109, -1967, 1123, 1857, -1261, -1901, 1321, 1709, -1489, -1721, 1399, 1633, -1588, -1679, 1537, 1493, -1662, -1452, 1730, 1322, -1745, -1239, 1871, 1292, -1789, -1084, 1997, 1091, -1887, -943, 1982, 922, -1974, -812, 2014, 721, -2060, -676, 2004, 497, -2176, -500, 2006, 316, -2122, -291, 2111, 115, -2094, -137, 2080, 24, -2053, 49, 2106, -117, -1990, 246, 2082, -264, -2031, 443, 2048, -404, -1992, 562, 2015, -641, -1927, 709, 1916, -834, -1976, 817, 1799, -937, -1883, 963, 1744, -1055, -1745, 1151, 1663, -1211, -1606, 1245, 1636, -1313, -1472, 1333, 1524, -1355, -1377, 1532, 1416, -1526, -1319, 1561, 1253, -1572, -1219, 1645, 1085, -1758, -1136, 1659, 968, -1853, -985, 1789, 889, -1883, -815, 1920, 739, -1933, -646, 1981, 565, -1925, -453]
2289d53K507j625k382J621K403j791k281J850K216k007k124J992K102k194j932
2304b098K265J815k289j783K354J752k460j586K538J433k520j377K572J388k669
2319f65j219K676J092k761r76K838Q74k832o90K821N76k880n28K899L89k982k50
2336a618L006Q7k997P8K911j29k980K70K962l63k909M91K886n72k838O90K820
2353A795q05k812R87K770j107k770J258K650j283k629J398K538j570k467J639
2368d08K398j781k344J863K258j909k144K023K130k188j983K216J907k252j703
2383a917K265J638k372j572K441J506k546j320K530J270k625j170K685R48k740
2398i79p68K728P09k810n77K811M51k802l28K794K26k783q2K854q1k834J30K831
$$ y = [-453, 2054, 429, -1953, -332, 2071, 280, -2001, -151, 2065, 58, -2066, -74, 2028, -166, -2098, 167, 1982, -307, -2090, 264, 2016, -444, -2030, 508, 1941, -579, -1956, 616, 2004, -665, -1884, 792, 1884, -877, -1853, 985, 1859, -973, -1663, 1158, 1734, -1146, -1674, 1225, 1614, -1368, -1618, 1388, 1475, -1522, -1444, 1467, 1338, -1642, -1372, 1590, 1227, -1682, -1191, 1695, 1123, -1715, -1025, 1795, 990, -1822, -835, 1935, 828, -1942, -684, 1966, 683, -1946, -548, 1990, 420, -2047, -408, 1990, 209, -2135, -272, 1986, 77, -2067, -44, 2086, -102, -2085, 131, 2038, -214, -1917, 348, 1986, -386, -1958, 483, 1989, -557, -1877, 653, 1923, -702, -1872, 813, 1761, -979, -1747, 981, 1690, -1120, -1697, 1114, 1565, -1237, -1565, 1229, 1455, -1328, -1410, 1444, 1363, -1471, -1341, 1490]
2416A490k49k732L87K719m78k710N98K681p57k632Q31K606j006k494J055K423
2432A732j146k454J317K337j301k377J525K175j547k081J614K022j746j896J818
2447hJ846j890j756J975J650k011j491K012J390k053j363K196J157k175j137K193
2463E35J031k231r31K272Q54k284o92K229O31k341m45K309M04k311k79K303J66
2480A220k279j05K320n1k263Q5K266j46k275L23K179l66k210N10K086n93j986
2497a285N86J993p18j985Q35J899r31j817R96J765j021j706J053J673j055j618
2513a336J163J510j137j495J283J349j260j376J337J249j369j210J449J060j466
2528b49j049J484J008j554r03J534Q62j574p28J552P26j562o62J620N99j629m91
$$ y = [1490, 1241, -1491, -1104, 1615, 1137, -1573, -975, 1706, 949, -1683, -852, 1754, 748, -1746, -691, 1732, 586, -1868, -551, 1786, 485, -1892, -367, 1808, 261, -1820, -206, 1816, 70, -1826, -8, 1838, -52, -1808, 167, 1817, -194, -1685, 327, 1717, -336, -1699, 497, 1654, -521, -1658, 535, 1566, -665, -1596, 676, 1530, -754, -1446, 783, 1414, -927, -1372, 937, 1341, -970, -1249, 1054, 1220, -1059, -1164, 1156, 1105, -1158, -1073, 1193, 1047, -1228, -905, 1274, 908, -1302, -792, 1294, 701, -1285, -699, 1294, 576, -1409, -574, 1325, 394, -1423, -427, 1338, 317, -1389, -336, 1337, 282, -1336, -173, 1337, 200, -1295, -12, 1337, 77, -1299, 38, 1287, -82, -1292, 157, 1217, -249, -1298, 186, 1194, -360, -1263, 271, 1133, -441, -1169, 383, 1109, -453, -1115, 505, 1104, -525, -1016]
2545a016J633M17j610k80J500L26j599k32J616J26j605j33J635J9j565oJ530n0
2563G06j511R2J467j60j463J94J503k70j406L23J349l38j308L83J349m56j314
2580h60M61J248m52j241N97J181n84j156N44J165o46j090N78J068o91j029P34
2597a73J009p82r16P50R40p67q97Q13Q38q25q41R01Q29q52p94Q42Q11r71p07R27
2617A35P02r31p06R55O64r63o49R78N88r79o20J061M72r80m64J021L68j023l61
2636g32J071L61j069k81J058K40j063k12J090K42j137j85J106J13j043j13J082
2653E28N9j138l2J082J4j095N2J059K2j195O1J200j70j111J88J104l06j006K84
2672d00J093l00j061L82J001l35j102M81J054n10j036M82J022n41j041O44R38
$$ y = [-1016, 617, 1034, -576, -856, 644, 970, -629, -861, 755, 881, -724, -857, 778, 797, -768, -774, 756, 706, -805, -713, 754, 594, -869, -675, 828, 558, -848, -525, 824, 486, -822, -439, 910, 454, -860, -399, 849, 397, -844, -247, 934, 350, -806, -262, 903, 257, -833, -255, 813, 122, -907, -173, 836, 54, -862, -112, 828, 61, -836, -23, 815, -10, -851, 50, 879, 27, -767, 75, 886, -85, -792, 135, 837, -94, -800, 155, 819, -144, -793, 185, 773, -206, -826, 235, 707, -273, -737, 284, 652, -371, -732, 339, 700, -369, -650, 408, 648, -415, -627, 463, 705, -432, -617, 489, 602, -441, -554, 528, 587, -551, -583, 499, 513, -582, -530, 529, 551, -644, -583, 617, 447, -664, -476, 628, 322, -684, -400, 693, 393, -668, -286, 715, 380, -722, -241, 813, 303, -733, -251, 771, 230, -811, -167, 771]
2689G71n87r51N93R14p40q09P44P74p72p73Q68P68q55p05Q56P37r46o22R48O02
2709H15r88n75J007M91r91n45J045M45j026m12J086L19j051k38J001K82j173j56
2727f64J021K22j113q4J090Q9j118M1J103p6j103J34J053j00j137K26J101k60
2745D25j083K68J069l76r93M26R90m76r76M88R53n81q50N11R15n91q50O14Q56
2764G39o78q05P05P64p07p71Q54O48q42o56R07O17q89n66Q80M88r10m19R49L09
2784F17r01l69R31L13j002j75R28J61r59n7Q87Q2q79l7Q92K4r14O5Q89kr78J56
2806c28Q86j77r00K05Q74k59q54K81Q47l48q04L44P75m39o63M36O53n21n70M64
2826i8O13n57n01N87M48n43m38N24N15n71m52O60L42o36l32O17K90n87l16O73
$$ y = [771, 184, -767, -174, 740, 0, -809, -65, 709, -63, -836, 32, 800, -55, -760, 96, 833, -113, -735, 213, 815, -173, -748, 259, 750, -241, -786, 259, 704, -322, -734, 352, 671, -380, -618, 383, 665, -508, -664, 357, 579, -534, -618, 472, 561, -557, -516, 587, 511, -592, -458, 595, 495, -642, -416, 685, 425, -658, -390, 679, 303, -690, -264, 726, 250, -726, -238, 715, 134, -716, -205, 710, 119, -731, -117, 739, 61, -744, -39, 725, 18, -753, 101, 749, -93, -749, 158, 775, -114, -680, 200, 688, -222, -641, 308, 617, -284, -653, 278, 591, -411, -586, 342, 503, -456, -513, 374, 456, -423, -460, 432, 456, -458, -393, 496, 494, -484, -328, 558, 381, -519, -314, 560, 301, -553, -272, 575, 227, -577, -233, 542, 103, -560, -124, 529, 8, -562, -98, 515, -42, -543, 44, 492, -51, -489, 35, 550, -21, -473, 187, 529, -107, -439, 178, 468, -119, -435, 238]
2846B38J56n86k43O74J01o48j7N60N0n87n0N82P2n96K0M73O0n33O1N30j20m85
2868b88R7N18r2n03K07L68j97m19K53L66k00l59J91L37k39m02L32K51k18k69K30
2889c6K74k77j89K32K60k82j73K78R7k49j34K27J84k40r8K68j6k33L6J46P8k60
2911a07P1J37l5j11p3J37J6j12OJ39j5k15R6M4P1j32O9O4k6r2M5J3K2LrN8p3R2
2939H3n2j8k0L1k9o0M8Q3j02k9L5M4kj02Q2R6j33o8J18Np3l2J24P6j57j03K68
2966A13k6j47m4K18K1j76q4K51K5k90k6L14Ml30M5K77q7k80J17L15r4m02J79L54
2990B47j98l04K08L11j74l06J15L27k22k48K23L21k74l39L87K34l25l25M31K52
3010C41m54k08L82K37m52k36N24J24m37j28M80J01m62j52O34l8n66K4N81No55
$$ y = [238, 394, -192, -435, 239, 340, -308, -325, 235, 285, -302, -352, 230, 302, -294, -274, 199, 259, -274, -213, 317, 197, -288, -191, 327, 235, -268, -61, 307, 110, -309, -56, 310, 110, -249, -58, 279, 40, -362, -30, 221, 3, -266, -36, 238, -39, -228, 4, 264, -18, -191, 87, 184, -65, -199, 28, 212, -28, -126, 142, 126, -107, -71, 75, 153, -107, -36, 101, 66, -45, -118, 19, 35, -77, -71, 68, 53, -162, -66, -22, 49, -83, -14, 50, 24, -68, -23, -10, 12, 15, 6, 64, -9, 83, 31, 13, -7, 24, -5, -65, -17, 66, -36, -65, -30, 14, 12, -90, -8, 88, -45, -113, 5, 10, -63, -95, 29, 105, -52, -155, 113, 87, -60, -104, 114, 135, -41, -125, 126, 151, -139, -165, 149, 153, -177, -132, 145, 58, -222, -105, 210, 116, -286, -107, 247, 49, -255, -47, 264, 90, -216, -101, 226, 4, -244, -21, 300, 26, -313, 74, 308, -17, -342, 89, 341, -113, -321, 61, 298, -154, -390, 134, 258, -179, -307, 173, 274, -188, -340, 294, 256, -310, -286, 295, 300, -355]
3031c55J43N16l0n99P5O37j27o43J32O94k43o26K87N98l27o34L60N79l80n60M19
3052h4N62m52n32M95N27n16n27N62M73n97m21O55L68o44l13O12K73o37k70P07
3072B41K74p78k43Q48Q9p80j09P34J76q89m3Q91k0q69P6Q49j17q06J43Q70k20
3093C17q40K54Q70l12q41L17Q33l78p91M37P90n46p35N41P10n50p58O75O45o86
3113d8n76O50O46q09n67P95N92q55m85Q46M93r21l68R70K94q97l61R70K64r79
3133c46k74J048J88j068n7R75L2j017rJ064j25j002J67J000j79j040J93J053k18
3152C85j103L42J050m16r92N21R32m35j005N38R49n70r62O70Q76o62q95P35P96
3171G54p72q07Q61P29q48o92Q08O68q72n87R07O05r95n20J016M40r37n02J049
$$ y = [-355, -212, 304, 274, -325, -250, 387, 260, -383, -251, 443, 200, -426, -139, 459, 132, -502, -142, 437, 57, -503, -84, 478, 26, -506, -11, 516, 0, -527, 35, 508, -89, -510, 145, 513, -131, -444, 168, 441, -196, -466, 241, 515, -263, -506, 342, 431, -349, -458, 276, 452, -437, -480, 411, 391, -478, -402, 447, 330, -476, -333, 537, 317, -523, -269, 601, 289, -552, -235, 598, 220, -571, -134, 656, 110, -625, -84, 626, 76, -682, -7, 638, -48, -624, 26, 672, -137, -704, 91, 683, -172, -657, 189, 682, -239, -607, 363, 657, -240, -601, 369, 633, -346, -620, 428, 616, -452, -509, 466, 498, -519, -528, 536, 411, -591, -424, 576, 397, -643, -450, 603, 385, -718, -376, 674, 258, -734, -213, 719, 284, -721, -183, 766, 196, -766, -96, 780, 118, -777, -42, 754, -18, -825, 36, 765, -83, -775, 33, 701, -171, -758, 149, 754, -241, -761, 255, 695, -242, -744, 305]
3190C05M12j108k70J059K11j015j13Q85K72j116p2J114J1j138K5J112n7j104J15
3209d72J107k21j047J75J114k92r90K78J026m51r59M28J025m59r61N36Q90n08
3227B19r56N59R06n88q30O05Q66p25p86P02Q17p75p64P73P01q34n87P90O46q84
3247a45o18R28N48r55n47R96M48q60l86R28L23r43l93J003L58j070k36J084J44
3266F07r83j68R30J71r97j10J019j0r91O8R31kj055J12J035r3j012J32J007j95
3286C96r77K69R64k83r54K81R58l00r33L13R54l62r89M40Q48m18q61M60Q78n12
3306A72q21N06P91n94p48N21Q22o01p23O83O68p04o17O79O77p52o64P93O02p26
3326c6o23P72N80p97n93Q32N31q47m38P82N08r17m60Q97M20q73m47R94L62j014
$$ y = [305, 717, -391, -661, 398, 609, -406, -519, 366, 638, -478, -550, 564, 575, -563, -538, 574, 517, -587, -472, 635, 414, -633, -458, 656, 364, -626, -348, 678, 227, -732, -304, 721, 262, -699, -163, 727, 219, -737, -178, 728, 140, -690, -85, 781, 56, -730, -28, 789, 14, -750, 23, 724, -110, -697, 93, 739, -145, -763, 165, 713, -242, -789, 207, 655, -205, -591, 337, 660, -283, -676, 327, 685, -385, -621, 463, 607, -376, -544, 386, 557, -440, -550, 469, 459, -532, -464, 467, 465, -590, -478, 557, 464, -548, -416, 591, 396, -581, -312, 652, 369, -585, -304, 654, 354, -579, -266, 688, 326, -663, -223, 625, 207, -654, -194, 684, 172, -649, -143, 648, 54, -694, -173, 649, 48, -675, 8, 676, -28, -645, 34, 711, -41, -705, 88, 690, -36, -659, 113, 693, -104, -697, 135, 666, -181, -619, 163, 671, -246, -706, 191, 611, -262, -709, 285, 647, -367]
3346c67l36J065K49r85k51R96L07j090j54R71J86j020j07J032J15j138m5J122
3364E50k8j052J7J041j6j103J29J112j97j104K17J108k64j090L17J038l08j041
3382f74L05J134m47j063M07J068m60r90M91J097o56j062O92R93o75r90P25R18
3400H13p27r53P97R20q06r47R33Q44r05q64R35Q68j037p76J032P97j093o92J102
3419B41O91j222o38J281M68j176n35J296M40j245m32J280L77j365k51J341J98
3436G49j302k46J397J61j414n4J371O5j415O7J346p2j384J26J389k56j363L24
3454e11J376l62j354M14J354n21j297N25J337o17j301P13J226p74j223P64J188
3471I37p92j160R02J123r07j155J042J086j083j077J145R92j138q78J132Q83j227
$$ y = [-367, -703, 362, 611, -374, -625, 371, 678, -412, -566, 405, 591, -429, -536, 496, 611, -527, -572, 550, 522, -530, -513, 528, 512, -591, -462, 650, 453, -651, -434, 674, 410, -680, -363, 675, 367, -674, -369, 765, 318, -745, -338, 730, 270, -720, -229, 868, 212, -850, -158, 835, 160, -830, -105, 813, 86, -867, -70, 850, 44, -903, 30, 874, -31, -895, 40, 908, -129, -905, 127, 924, -169, -861, 241, 932, -290, -928, 353, 821, -355, -890, 406, 846, -399, -831, 449, 826, -539, -790, 551, 749, -553, -799, 598, 759, -655, -709, 662, 727, -688, -621, 725, 653, -731, -605, 784, 528, -835, -511, 865, 503, -851, -437, 917, 396, -901, -376, 961, 344, -957, -244, 982, 208, -1015, -251, 937, 145, -1015, -113, 1010, 103, -1052, -10, 1076, -7, -1084, 61, 1053, -85, -963, 169, 1052, -175]
3488a75q42J358O67j315p25J415N70j309o26J356N78j457m38J374N00j488l25
3505h82J465K23j461j41J431J54j485o4J461k5j421K9J524j62j445J47J507l23
3523E32j414M11J322l61j432N48J355n98j281N70J280o19j309P75J109o85j151
3540i48P99J072q02j124R78J015r74j049R98R88r82q75R71R29j148q04J161P06
3558I11j148o42J136N84j187n71J299M66j233m77J319L34j278l06J248L09j252
3575d88k46J283J33j291r7J351M8j290K1J240j23j215J52J160j18j199K84J099
3593G04k47j144L31J049l13j131L59J094l88j126N58R77m42j076O15R12n58r10
3611g36O13Q67o17q76O63Q30o91q14Q17P11q27o45P42P01q02n85P31O45q49n72
$$ y = [-175, -1017, 341, 1008, -307, -1032, 383, 953, -356, -982, 374, 952, -505, -943, 431, 931, -557, -882, 583, 806, -655, -796, 635, 789, -696, -760, 701, 676, -745, -716, 808, 646, -799, -652, 855, 532, -882, -471, 851, 490, -942, -394, 961, 363, -918, -348, 932, 313, -996, -221, 888, 203, -948, -149, 923, 121, -1003, -25, 990, 16, -1033, -35, 953, -29, -904, 67, 996, -152, -956, 205, 911, -237, -879, 257, 841, -346, -917, 382, 848, -385, -862, 457, 791, -487, -793, 455, 764, -488, -734, 549, 682, -609, -706, 645, 693, -597, -576, 664, 541, -674, -522, 638, 520, -679, -395, 704, 457, -687, -356, 693, 380, -751, -392, 702, 314, -812, -254, 723, 281, -795, -180, 732, 174, -736, -123, 744, 127, -749, -86, 744, 53, -761, 56, 767, -60, -705, 37, 738, -64, -649, 82, 727, -122, -694]
3631f94Q23N08q69m04Q12M54r02l59Q21M34q52l82Q86K54q40k26Q70K13p77l49
3651e79Q84K17q44j63Q93P3q31j19P85J82r50k8Q28M4q17K7Q36p7p71L6Q04n3
3673C77q26J12Q37j58p25P1P94j51p43J30O99j76p39K08P45j98p18K15P24k15
3693B63p53L28O73l01p09K96P07l41o70L70O55l37p11L93O86m40n57L38P12m98
3713A04o38M83N68m56n80N10N93n78n85N95N38n35n89N33N68n74n75O54M82o35
3733a17m67O68N09o91m74P15M52p61l90Q05L37p51m00P67L59p98l18Q37L31r34
3753c21k26Q27K49q08k49Q77J14q60j86J024J17r68p7R03N8r67N0R51j02r13J01
3774d06J018k02r58J35J026k09j023K43J023k78j028L52J037m56r95M31R87m84
$$ y = [-694, 129, 637, -232, -636, 176, 630, -272, -631, 190, 624, -228, -610, 276, 530, -310, -536, 334, 547, -230, -579, 305, 522, -322, -485, 408, 481, -350, -469, 316, 498, -452, -480, 348, 392, -425, -398, 438, 361, -410, -374, 430, 377, -449, -337, 500, 342, -383, -312, 482, 331, -412, -282, 417, 241, -498, -290, 455, 257, -461, -246, 478, 263, -490, -162, 511, 210, -499, -203, 504, 163, -507, -137, 518, 181, -530, -137, 549, 109, -448, -110, 602, 104, -534, -51, 517, 61, -519, -9, 584, 6, -579, 16, 554, 19, -570, -37, 531, -43, -618, 36, 518, -117, -584, 84, 593, -98, -572, 143, 595, -166, -556, 249, 586, -165, -565, 202, 561, -237, -555, 282, 613, -321, -547, 280, 529, -279, -528, 349, 463, -397, -583, 441, 558, -410, -487, 416, 474, -493, -443, 508, 406, -507, -406, 612, 410, -548, -413, 613, 404, -619, -376, 647, 369, -659, -307, 730, 274, -721, -290, 697, 213]
3792B13r61N02J033o70q84N85R18o07r06O67R08p76q26P97Q33q61p88R24P21r29
3812a07p60R74P50j028o34J038N87j106n51J164M47j097m82J179L96j197l55J239
3830D57L15j285k65J312J47j252j06J266J11j347N4J246m5j316J84J306k53j266
3848g37K65J268l29j298M10J292m78j261M91J255n92j258O93J240p12j157P31
3865a77J092q11j063Q12J059q55r90Q86J044j016r52J051Q75j071q07J097P52
3882I26j139p12J176O44j225n14J264L94j210m93J331M28j382k41J272K26j308
3899e63k05J390P4j357J6J259Rj343P2J390j89j327K19J308k11j356L69J256l87
3918D24j233L69J307n59j193N69J230o90j133P35J117p71j061Q29R87q96r40Q93
$$ y = [213, -748, -246, 787, 117, -767, -182, 736, 129, -777, -110, 798, 22, -804, -7, 826, -35, -823, 101, 822, -107, -867, 107, 857, -171, -805, 233, 820, -286, -837, 327, 774, -323, -805, 374, 770, -427, -782, 457, 772, -513, -778, 534, 681, -571, -677, 589, 700, -647, -593, 653, 608, -708, -524, 782, 529, -737, -472, 796, 467, -831, -421, 871, 393, -868, -377, 878, 286, -972, -279, 961, 249, -908, -177, 915, 104, -959, -147, 912, 57, -933, -47, 997, -19, -971, 80, 955, -116, -923, 174, 926, -213, -925, 251, 895, -330, -844, 420, 814, -396, -889, 442, 870, -512, -753, 519, 745, -563, -768, 622, 696, -661, -645, 614, 623, -720, -648, 742, 553, -774, -555, 753, 542, -814, -445, 811, 424, -809, -440, 867, 308, -885, -316, 914, 224, -909, -174, 943, 172, -889, -60, 927, 31, -909, -16]
3936a6Q87q91q04R16P26r35p84J096O95j078o86J143N12j118m49J116M68j172
3954c74m49J184L45j149l24J267K08j193j81J143J71j255N5J157Nj284J77J139
3972F42j73j124K47J024k10j082K28J167l53j058L97J002m15j015M42J010n63
3989A66r19N41R24n74q95O47Q73o80q05P79O63p70o81P94O23p38o34Q48N13q05
4009a30n72Q96M80q97l75Q61L98r55k88Q85K85r02k54Q43K67r47j30R07J04r43
4029d67N5Q26L0q73n7R42r5q06O3Q22j45p36J36P29j16p68J82P95l67o36K94O67
4051D75k86o89L55O50l98o27M20O19m51o22M94N87n16n33M67N17m60m82M74L99
4071C93m50l38M63L24n11k83M79L09m58l20N65J72n08k00N34J72m92j64N29O6
$$ y = [-16, 871, -20, -824, 92, 818, -117, -901, 195, 890, -188, -874, 269, 781, -337, -786, 330, 798, -374, -823, 361, 706, -443, -767, 500, 708, -485, -666, 477, 648, -607, -552, 605, 610, -674, -497, 642, 469, -655, -408, 616, 406, -676, -448, 719, 366, -692, -295, 707, 292, -723, -281, 729, 166, -753, -212, 712, 138, -757, -110, 763, 83, -722, 57, 720, -50, -731, 63, 686, -52, -686, 162, 675, -130, -702, 194, 674, -223, -598, 263, 661, -294, -582, 303, 588, -314, -568, 275, 542, -405, -535, 372, 476, -467, -412, 414, 444, -429, -486, 456, 361, -445, -382, 440, 295, -441, -305, 424, 308, -460, -278, 517, 150, -486, -192, 475, 189, -500, -145, 505, 107, -520, -100, 519, 68, -554, -60, 527, 11, -522, -55, 462, 2, -480, -6, 393, -57, -395, 68, 392, -119, -402, 77, 386, -72, -392, 173, 345, -163, -363, 171, 343, -149, -313, 216, 282]
4091B82m75j30N11J20n16r7N05R2n37PM67O3n64L0N13m1m83L5M66k8m45qM66r7
4115A36m23J64L27o7l96J32M32k06l36J30L85j55l92K13L28k17l49K07L13j30
4135I6l00J81K79k40k53J66L15k37k32K39K48k68j87K03K27k25k81K60K55k48
4155bk23K75J50k48j75K67J94k88j50J80K27j96k57K80J93k66k52L12J58j89k38
4176b48L01J86k86j86K85J66k30k12K72J35k43j89L46J26l22j21K96J54l54j08
4196b32L26J17l53l1L14J9l34j3L63N5m27n0M24ql74M1L46l6l79Q4L62p8l77P5
4220a66M01r4l89Q2L99p9l59O5M07k04l10J59M21k69l23J87L59j83l73K17K81
4241B29k07l12K28L54k61l19K69K49k01l04K98L43m65k18L55L04m52j37L26J94
$$ y = [282, -193, -323, 188, 308, -208, -305, 200, 292, -245, -238, 229, 292, -272, -242, 271, 230, -253, -218, 248, 220, -225, -233, 233, 136, -287, -123, 204, 137, -259, -127, 305, 99, -237, -107, 278, 123, -269, -56, 272, 55, -294, -87, 226, 96, -204, -23, 256, 16, -237, -71, 244, 7, -225, 14, 262, -6, -193, 10, 237, 12, -269, -9, 246, -2, -225, 50, 200, -48, -223, 44, 238, -50, -200, -20, 207, 11, -246, 34, 227, -39, -291, 21, 179, -10, -248, 53, 239, -47, -233, 52, 218, -12, -224, 48, 183, -60, -249, 97, 223, -99, -220, 76, 230, -124, -232, 94, 211, -142, -173, 141, 160, -174, -187, 176, 231, -196, -246, 178, 170, -204, -163, 183, 147, -232, -148, 214, 136, -241, -166, 235, 141, -248, -166, 233, 154, -205, -140, 267, 63, -247, -88, 333, 64, -259, -72, 287, 104, -269, -52, 229, 22, -290, -62, 292, 31, -288, -19, 230, 29, -275, 23, 366, -99, -317, 38, 342, -110, -247, 79, 273]
4261B73m03j48M37J84m26j77M21J57n06j40N01J22m73j05N23M4m59j38N69J9n57
4282b82N1N14pn40LN21m4m90J19M37j25m57J25M99k12m40J76M90j73n35K21N23
4304C74k74m68K68M80k85m77K90M34l02m32L68M00l72l67M20L89m80l46M48L07
4324C75m40k86M39K64m52k52N07K03n32k29N52J56n09j29N81N5n44q5N38J37n88
4345b39r3N97Pn33j3N55j1n85J09N14p3n47Q2N42n9o05K02M88j31n60K26N53k24
4368B02n79K17N22k32m42J55N60l07n36M06M57l71m20L19M67l96m05L29M59m22
4388a7l72M22L79m37l81M78L59n30l43N58K96n30k76N28K44n48k12O25R1n45j57
4409c68N37J90o58l0N84J07n90o0N02P3n78J8O00m5n70k5O62o3o00P3O18j08o07
$$ y = [273, -130, -278, 159, 343, -83, -260, 161, 318, -188, -328, 173, 295, -178, -283, 240, 284, -175, -313, 256, 275, -282, -231, 283, 276, -264, -261, 260, 216, -274, -155, 282, 157, -300, -175, 324, 112, -328, -152, 338, 165, -370, -149, 374, 100, -368, -100, 380, 95, -382, -92, 342, 40, -392, -24, 376, 4, -363, 57, 446, -34, -380, 68, 375, -65, -351, 88, 352, -100, -352, 155, 358, -174, -403, 149, 305, -204, -333, 248, 303, -241, -326, 212, 349, -239, -332, 265, 272, -261, -274, 281, 270, -315, -206, 308, 235, -312, -230, 312, 253, -352, -150, 338, 207, -353, -127, 426, 202, -377, -160, 362, 130, -312, -157, 403, 96, -440, -34, 423, 52, -368, -49, 418, 22, -383, -54, 405, -17, -389, 33, 412, -25, -406, 72, 431, -99, -442, 116, 412, -118, -394, 134, 378, -170, -382, 243, 334, -211, -368, 169, 359, -299, -329, 255, 362, -228, -288, 214, 287, -291, -273, 327, 282, -288, -313, 349, 286, -314, -241, 377, 269, -338]
4432c38J37N70j26n98J19O22k18m88J17O10l07n04K28N54k67m95K89M81l10n13
4452d37M15M52m22m16M02M20m47l75M73L50m39m28M59L98m23m08N21L73n43l53
4472d28N40K65n52k74O41K41n91k80O11J31n38j69O42J69o35j53O69J15p05k5
4492c26O30O6p39J5O60J4o76K3O72m9o51N5O95j43o03N4P15j35o68J44P31k63
4514B21o77K86O40l16n67K61N64k72o37L78O37m07n80M36N24m04n47M53M78m67
4534Dn10N15N23n75m61N35M44o07l11N04M27o46l00O34L04o62l11P21K67p26k35
4555d66O33K48p11p9P16J03p26j56P76N7p77%P22Oo87n5Q54r3p33k7Q82j43q04
4578d60K05P01k03o83J98P60k67p48K88P51l72p24M01O76m16o17L74O47l75p14
$$ y = [-338, -201, 369, 243, -355, -236, 386, 168, -320, -203, 407, 100, -404, -176, 378, 111, -384, -95, 386, 76, -437, -22, 430, 8, -408, -6, 414, -33, -408, 65, 415, -24, -452, 7, 405, -18, -426, 95, 468, -75, -428, 112, 377, -175, -449, 192, 433, -158, -438, 173, 304, -234, -403, 239, 408, -227, -380, 289, 404, -301, -326, 304, 370, -369, -354, 306, 320, -356, -333, 339, 290, -361, -306, 389, 246, -357, -303, 412, 277, -391, -247, 484, 221, -456, -170, 470, 154, -413, -152, 412, 140, -497, -119, 518, 111, -469, -33, 491, 87, -460, -7, 471, 4, -506, 9, 532, -43, -504, 31, 475, -132, -443, 61, 488, -158, -458, 176, 480, -182, -493, 228, 495, -231, -466, 167, 415, -296, -375, 341, 444, -282, -438, 338, 395, -382, -382, 340, 346, -341, -396, 458, 365, -368, -395, 487, 344, -460, -255, 446, 243, -440, -242, 518, 251, -497, -209, 542, 170, -554, -153, 523, 107, -510, -136, 511, 136, -578]
4598e78N22O22n41n68N57N60n98n58O13N53o66n16P07M36o74m89P78L52p17l39
4618e44P59L06p19k97O98K95p50j82P28J90q14j96Q66Q6q33j08R26k4p87N9P63
4639D22p7q20J18P77j33p98K16Q12k70p36K37Q03l29p74L29P61l91o97M31O63
4659E44l78p31M90P11n57o52N81N07n12n94N71N72n50n63O41M98o93m30O36M29
4679E20p95k48P07L74p50l79P81K41o83k95Q21J71p70j30P78J12p61j03P74J7
4699C82p59KP23N9q20R2P15r0p31J20P28j07p67J89P24k64p46L78O51k84o64L15
4721a54O08l29o42M10N90m38n45M83N53n65m67N06M77n57m19N83M18n95l75N92
4741A34L15n81l06O43K76o19k65O25K60p23j61O62Q0o12j05O43O5p05KO58M9o60
$$ y = [-578, -56, 566, 25, -543, 14, 574, -24, -582, 31, 584, -82, -598, 109, 545, -129, -618, 160, 512, -205, -544, 215, 521, -198, -495, 203, 498, -252, -434, 294, 484, -330, -526, 340, 426, -407, -515, 411, 387, -400, -341, 422, 345, -475, -357, 420, 287, -511, -295, 517, 247, -489, -252, 551, 222, -552, -223, 538, 147, -550, -119, 544, 166, -565, -75, 636, 79, -573, 8, 515, 3, -591, -20, 552, 2, -561, 80, 578, -115, -545, 91, 520, -275, -523, 184, 558, -192, -571, 210, 451, -232, -527, 294, 465, -305, -435, 343, 455, -306, -409, 365, 382, -377, -375, 348, 407, -413, -321, 394, 304, -427, -307, 421, 314, -453, -264, 460, 196, -550, -172, 479, 195, -469, -154, 454, 125, -517, -107, 483, 45, -500, -17, 536, -29, -496, 10, 487, -70, -489, 94, 512, -83, -458, 134, 449, -132, -438, 205, 481, -138, -403, 222, 482, -241, -402, 260, 340, -272, -377, 266, 331, -374, -372, 286, 335, -325]
4763c25K8O52j5o44L3N66k3n93J49N28j33o26K33N35k08m97K20M83k49m63K86
4784f3M58l49l89K75L82k98l49L05L68k91m17L79L21l92k39L28K86l69k98M93
4804A41J83m05k05L89J83l88j34L71J69m23j55M48J30m96n7M21J2l43m4L71O2
4825B30l99RL98p9l25P3K37J3l55L5L35q1k76J00K90j51k74J46L09j54k74J63
4847c0J94q3k42J26K21j75k17J80J97j11j96J47J41j65j32J57J20l1k24J36Q3
4868I6j09j11J59L6r5q8J42N3o2j35J04J00j05k2OP8q3j2M8N6q1OK2N5n2n1R7
4895E2qrq1M8O9l0r1pO8L4j3r4J07k5m7L3P9j9r4lK8Q8j08p0J12M7j29PR8L7j63
4926h4j6J72P7k01k3J30K3j56j3K30m2k06N0Q3M6j57J0J41k3j22j1K12q3j68L7
$$ y = [-325, -297, 355, 340, -304, -271, 295, 272, -321, -172, 356, 223, -403, -170, 365, 157, -340, -120, 363, 114, -349, -63, 395, 46, -343, -68, 314, 16, -333, -28, 340, 49, -368, 11, 332, -60, -299, 29, 315, -54, -352, 141, 324, -81, -286, 103, 286, -102, -236, 135, 304, -119, -274, 174, 304, -192, -249, 172, 184, -159, -203, 168, 230, -169, -160, 238, 159, -166, -93, 144, 157, -198, -163, 172, 91, -185, -85, 205, 54, -220, -74, 235, 81, -193, -30, 164, 81, -161, -35, 186, 11, -206, -26, 171, 60, -136, 11, 152, -13, -145, 12, 132, 101, -123, 13, 96, -13, -124, 35, 71, -24, -112, 30, 83, 21, -114, -10, 90, -15, -37, -31, 47, -36, -48, 0, 56, -25, -19, 3, 58, 6, -45, 52, 44, 35, -46, 2, 71, 41, -50, -57, 11, 45, 32, -62, 45, 20, -27, 6, 85, 66, -28, -31, -3, 85, -23, -93, 19, 66, -63, -56, 42, 79, -84, -100, 72, 149, -52, -75, 55, 78, -78, -91, 139, 97, -109, -59, 24, 70, -87, -77, 64, 41, -81, -92, 120, 37, -131, -94]
4951i4K44o4k38J22K17j32k44J26K98j69k34J73J76j68j84J10K49j77j60R0K41
4972A82k17j50J89K17k15j51K18J37k55j25K19J48k37j48K48J63l00j36L04R3
4992A84l21o1L20M7k93j9L07Q5l87k2L18L7l63K2L78o3l82N7L75r0l86J28L38
5015B09r9l53J20L20q1l32J26K91j03l40J17L51j42l33K11L14j97l15K49K81k82
5036A2k69K32K81k41k13K45J86k74j87L04J86l42j32L38R2l06k09L57J66l74p7
5057b25L21J09l50j34M23O6l52p7M00J3l65n0L97N1l76m7M15l6l93N3L58n7l86
5080b42J45L40j74l10J06L89j37l16J78J86j20l07K14K81k21k05R1L48k35k65
5100b54K53K81k30l00K87K02k79j69K06K80l23j88K61J39k59p4K30J30j95k06
$$ y = [-94, 150, 86, -152, -30, 187, 55, -189, -63, 235, 66, -168, 5, 181, 13, -171, -61, 188, 11, -149, -59, 182, -35, -185, 4, 221, 6, -145, 73, 210, -45, -170, 49, 197, -40, -188, 60, 223, -77, -213, 91, 184, -137, -198, 122, 169, -124, -143, 164, 249, -138, -160, 158, 195, -168, -146, 232, 169, -213, -156, 219, 129, -257, -129, 209, 110, -243, -123, 197, 116, -216, -90, 201, 98, -242, -125, 226, 84, -249, -38, 276, 79, -236, 13, 294, 12, -257, -25, 256, 15, -198, 47, 233, -41, -228, 76, 262, -80, -212, 126, 218, -88, -297, 60, 226, -148, -225, 96, 205, -145, -279, 144, 210, -142, -219, 181, 194, -171, -221, 176, 227, -149, -196, 219, 183, -210, -157, 201, 144, -242, -97, 243, 69, -241, -135, 254, 117, -199, -21, 165, 45, -262, -48, 233, 12, -193, -102, 246, 11, -254, -1, 280, 50, -250, 37, 239, -40, -209, -3, 277, -46, -234, 27, 166, -93, -167, 63, 193, -2, -208]
5120b08K85J91l57j00L10J17l20r8K18J53l29o6L49L6k78m0L18m4k90j1K91j5
5142A12k72M6K61o5k47Q2K57o1k32P7J61k9k41J2L13j26k36R5J97m1j93O0K20
5165A50j63j31J16J41j02j25R8J69j25j70J46J35j27j72J18J49j39p4J05J20j97
5186g8m0J41J33j76r7J21Q6q4j36J66Q0j99QJ26Qq0m0M4J18j17p7J53k4k7j11
5211a02J73m2q0K2N2Pr2n0J19M2o5j16J30O2r3l8P9J4r3J3Q7L6p3l8J05K4j17
5238c4O0k2O2j12k9O8N1p3o1J17L7m9j03J38j4r6K9N9P2j84L4R5J2r3m5J49jj33
5266f6K7J30k4j00l6K11j07n9p0J92K5k03mJ80q1r5KJ41m4j06M1J17j1j22O7J36
5292A41p5k06J26P8k4j49N4J50l4j52N6J65j00j72J57J69j41j36R6J15j18j05
$$ y = [-208, 77, 268, -89, -189, 121, 238, -82, -180, 38, 191, -138, -204, 145, 181, -97, -137, 181, 137, -153, -164, 127, 112, -160, -114, 147, 82, -165, -83, 174, 113, -119, -42, 119, 90, -151, -139, 174, 48, -188, -93, 104, 63, -130, -70, 150, -13, -144, -28, 113, 11, -114, -16, 153, 28, -142, 4, 139, 12, -160, -42, 107, -32, -106, -1, 119, -78, -118, 23, 156, -20, -117, 4, 90, 6, -130, 36, 116, -83, -75, 51, 59, -21, -61, -17, 101, -16, -93, 60, 36, 9, -102, 71, 29, -51, -29, 23, 30, -62, -112, 7, 49, -16, -132, -2, 60, -33, -71, 8, 22, -71, -58, 29, 65, -8, -46, 59, 83, -34, 26, 4, 66, -46, -75, -7, 44, -29, -90, 27, 64, 15, -88, 50, 36, -60, -31, 28, 100, -84, -50, 45, 57, -36, -81, 68, 67, -66, -39, 91, 67, -33, -69, 142, 35, -24, -94, 98, 123, -80, -84, 96, 15, -80, -78, 63, 19, -87, -46, 71, 60, -62, 5, 141, 66, -140, -14, 64, 40, -109, -55, 95, 61, -91, -35, 130, 30, -142, 15, 184, 43, -93, 3, 118, 0, -105]
5314a05Q4Q8o6r6N2J35j37j04R7J82j67o1J18J32j85q5J48R0j81l0J34Q2j38r8
5338a11J78M8j25j32K21J1r4p8J65J8k02l7J88J09k16o1K37m1j31p7K14L0j64
5361e0l0J72q9j26L4K29n1j63J6K21j30j21PJ92o0k03J31J58q8j75J11J80j55
5384A0j16J35J63j62j86K03P0j21q7P7J80j51j23J24J27j35j37J68L1r5j63K02
5406A4J43k11l7J24J82k59p7K02J00k22j25K21R7j97l5J79L0k30l1K16N7k90L5
5429a14K07k6j60M4J80j4j86L1J71n3j76P4J77o5k36R7K06j24j67R1J73p7k05
5452a52N8K16p7k01J77J17q1k09J42J81j50k03J26K06j84j13J92P5k08j32K74
5473E4J30k46l7J31J10k11q4K18R7k43l0K22M2k69k2K36L6j37j50K49J5j95k5
$$ y = [-105, -21, 67, 1, -95, -43, 92, -45, -149, -52, 130, -37, -98, 20, 152, -33, -118, 30, 120, -61, -91, 43, 125, -13, -111, 67, 115, -10, -142, 79, 90, -4, -82, 83, 101, -101, -138, 50, 159, -57, -118, 119, 78, -53, -130, 84, 114, -50, -80, 92, 3, -123, -89, 140, 89, -74, -58, 163, 33, -88, -81, 111, 51, -152, -21, 137, 49, -126, -15, 165, 10, -106, 29, 192, 30, -156, 47, 117, -4, -91, -14, 166, 15, -108, 16, 143, 8, -129, 39, 70, -25, -188, 14, 157, -54, -91, 33, 215, -44, -121, 81, 181, -41, -166, 55, 152, -45, -80, 99, 129, -101, -132, 84, 141, -149, -114, 93, 67, -93, -49, 131, 117, -69, -38, 133, 80, -96, -22, 155, 90, -146, -49, 157, 33, -134, -43, 130, 53, -152, -94, 122, 45, -156, 21, 138, 57, -152, -10, 171, 21, -182, -56, 150, -34, -147, 45, 120, -88, -220, 54, 184, -62, -99, 32, 142, -69, -153, 65, 162, -81, -111, 111, 153, -116, -138, 98, 134, -3, -153, 96, 111, -84, -109]
5496a09J73P6k60mK82l6k49P2J98q4j51K3K63j43k53Q5K35j3k68O2L07j24k26
5519a44OL21j32k70J52K52j87j93J92J83j76j57J62K19k14k33K07J86j60k14K38
5540C8J82k68j81K92J56k14j29J31J32j84j30K34J45k44p0J97J30l53rK85N9k69
5562g0o9K47J03l39nK40O9k92l1K91L1l36K6L27j0l41O4K81q3l27R7L74j18l44
5586b15P6L05n0l64J93L29k17l05J59L66k78k68J95L44k32k79K68K67k90k90L42
5607E6K42k63l10L15K00k62k47L49J53l34k12M04K04l70j89M10J45m18j25M19
5627A67Q9m56m8M39M2m27m1M79k2m33k4M35mm56Q2M76j13m72J93M06j28m71J28
5650a59M44j23m56K50L59j81m23K46L98k88l96K57M24k87m01K38M42k98l89L35
$$ y = [-109, 64, 140, -120, -124, 158, 122, -127, -55, 143, 59, -92, -69, 194, 51, -202, -117, 118, 105, -163, -101, 206, 82, -144, -138, 183, 51, -219, -67, 185, -2, -195, -3, 180, 4, -153, 9, 228, 14, -219, -12, 174, 14, -200, 38, 220, -48, -229, 63, 219, 5, -124, 7, 139, -45, -175, 59, 204, -40, -110, 87, 217, -136, -145, 140, 199, -70, -139, 108, 211, -128, -133, 107, 176, -116, -147, 144, 175, -161, -135, 192, 182, -159, -95, 186, 103, -224, -127, 247, 129, -215, -139, 166, 116, -248, -55, 274, 57, -248, -89, 277, -1, -269, -74, 270, 38, -241, 27, 294, 4, -286, 56, 298, 35, -275, 40, 240, -22, -269, 80, 233, -101, -313, 91, 295, -75, -264, 146, 291, -127, -252, 167, 256, -200, -248, 191, 233, -194, -235, 244, 222, -211, -235, 200, 196, -260, -178, 298, 185, -287, -94, 312, 184, -287, -159, 285, 162, -294, -44, 315, 134, -289, -43, 355, 67, -329, -72, 352, 65, -336, -98, 344, 46, -343, -8]
5670hL40l24l66M10L56m22l53L95L03m35k09M45K29n24k00N33K08n19k31O06P9
5691C13n38r2N16J08n82k3N00Q3n53kN77o0n00PN33o5n58J54N41j71n32J58N39
5714C53k23n64K55N83k95m96K58N22l20m55L72M27l96m44L93M61m31l85L63M48
5734D26m36m35M38M73n65l09N15L00n28k88N60K64n80k17N19K35n92k05O30J25
5754C30n94j04O33J16o66q6O62N8o16p0O57n4o14M2O86j42n78J76N81j81o62K16
5776b10N67j94n78L16M78k38n62L55N08l10n51L22N07l74n04M18N03m34m90N06
5796C5M10n25l56M61M25n37l42N32L50n58l64N97K81n76k31O05K01o68j76O17
5816A81J83o19j15O31J16p07J7O16Pn99mN87Mo39M5O60r6o42J48N96j58o12K20
$$ y = [-8, 332, 8, -358, 52, 408, -14, -367, 28, 331, -104, -313, 132, 361, -163, -363, 170, 378, -141, -372, 234, 313, -225, -317, 199, 307, -275, -298, 202, 285, -268, -270, 307, 247, -253, -246, 287, 222, -336, -182, 359, 188, -344, -186, 353, 130, -434, -179, 404, 109, -387, -129, 393, 73, -382, -10, 417, 21, -423, -30, 431, 0, -385, -22, 426, -10, -445, -7, 466, -99, -408, 107, 407, -121, -409, 151, 415, -165, -382, 137, 372, -220, -425, 205, 330, -264, -368, 265, 381, -285, -371, 291, 349, -267, -337, 320, 266, -348, -306, 380, 238, -340, -164, 417, 236, -426, -210, 357, 163, -415, -99, 379, 141, -421, -66, 442, 132, -419, -97, 410, 36, -468, -50, 453, 19, -471, 35, 445, -80, -436, 25, 450, -87, -429, 103, 453, -105, -469, 128, 409, -167, -398, 207, 408, -260, -436, 181, 364, -255, -370, 261, 377, -330, -313, 303, 310, -289, -293, 294, 298, -341, -296, 364, 268, -374, -226, 370, 212, -400, -180]
5839a80N66k18o05K65N85l03n10K60O03l34n40L28M65l22m78L96M67l93m98M37
5859iM52n17l30M74L64m90l82M73L57m94l59N58K67n54k27N31K28m98k06N10K01
5880C49n93j02N37J46n68j48O23L6n56o1O36j0o04M2N60j01m93N2N30o4n60J14
5902b35N94j46n36J59M99j86n02K27N30k88m76K20M69j81m70K48N39l59m79L01
5922g2M38k78n10L82M25l86l29L06L62l82l38M50K48l55l13L98L19m44k29M64
5942A56K08m85k16M42K45n25j76M89J60m27j59M77P5n03o7N22J13n23j22O04n7
5963B31n12K9M47M1m96NM94l5m25K2M73o6m67R7M64j01m93J55M36j85l74P9M68
5986B87j84l74J61M33j94m36K49M28k87m35L18L45k53l90L23L21l05l00K31L27
$$ y = [-180, 386, 168, -437, -172, 413, 110, -400, -140, 463, 129, -411, -83, 382, 60, -418, -22, 445, 52, -446, -9, 443, -74, -404, 70, 434, -56, -438, 35, 392, -102, -461, 97, 364, -190, -417, 114, 342, -156, -362, 148, 349, -244, -346, 191, 337, -231, -379, 244, 280, -276, -337, 299, 289, -315, -273, 287, 186, -307, -255, 275, 211, -349, -235, 359, 213, -323, -164, 335, 149, -353, -126, 404, 116, -360, -140, 329, 148, -322, -74, 465, 106, -373, -72, 366, 88, -422, -40, 385, -1, -330, -24, 338, -44, -382, 68, 316, -39, -352, 46, 365, -79, -308, 156, 364, -121, -337, 105, 350, -175, -351, 138, 298, -129, -288, 189, 264, -239, -306, 216, 329, -194, -316, 288, 231, -281, -252, 195, 236, -260, -255, 239, 204, -221, -199, 274, 208, -259, -162, 302, 201, -292, -137, 299, 114, -260, -181, 287, 103, -271, -110, 323, 129, -307, -58, 370, 83, -352, -34, 311, 58, -332, -9, 312, 7, -293, -62, 265]
6006B65l08k71K77L60l68k95L79K77l64k89M11K99m78k16M15J78l72k18M31J93
6026C06l70k34L82J81l67j86M43J44m79r3M38J14m71n8M47J03m99o8N08j5m45
6047b19m8M63N6m85J09L86o6m43L3M54q5m38J03M62j51l98R4M75k23m27K65L62
6069B79k06l79K11L85k27l59K47L64k67m13K81L97k96k98K59L57l44k83L48K57
6089C13l88k56L39L26l96k71M72J26l04k50M01J76l97k20M67J67m92j30M94J41
6109C18m77j60M81J50m92q0M51P9m27o0M63K4m96J1M68q0m61R8M56q4m12P3M55
6132B98j08m64J21M68k10l28J08M45j91m21J92L47j72m04K51L86k51m05L02L25
6152B89k46m08L53L40k82l54L32L37l98k28L28J91l46j89M09J50l58j96L87J73
$$ y = [265, -43, -314, -37, 323, -45, -340, 39, 316, -48, -337, 74, 373, -105, -321, 94, 272, -100, -318, 113, 306, -64, -298, 84, 265, -102, -288, 155, 299, -180, -273, 165, 279, -192, -250, 197, 300, -199, -267, 241, 226, -219, -267, 196, 252, -233, -124, 262, 196, -247, -214, 240, 155, -283, -180, 282, 131, -267, -173, 302, 79, -348, -83, 279, 73, -306, -95, 290, 63, -296, -49, 315, 48, -365, -84, 313, 17, -281, -22, 335, -9, -292, 56, 313, -75, -331, 8, 334, -62, -333, 139, 265, -39, -289, 112, 288, -109, -329, 138, 305, -187, -317, 177, 318, -159, -319, 162, 312, -180, -260, 191, 270, -157, -217, 246, 270, -226, -215, 253, 173, -288, -190, 266, 182, -230, -157, 298, 190, -274, -153, 315, 105, -223, -115, 330, 139, -282, -90, 257, 85, -319, -68, 318, 67, -338, -36, 289, 43, -365, -12, 328, 46, -308, 24, 361, -37, -265, 63, 254, -92, -281, 128, 278, -80, -276, 111, 284]
6172B84m21j15L93J20m08r9L66J63m24j30M02R9m32k5M22L7m80L0M65j13l83Q8
6194a61L97m7m46Q7M13j23l59J14L92j05m48J58M47j75m02K01L14k10l59K14L77
6215B79k21m06L36K85k69k99K61L25k66k68K48K71k89k17K55K82m29j38L15J97
6235B52l27j62L54J16l69j23M08J26m33n5L53L6l62J8L58jl17j4L21jl59N6L06
6258A81r1k86R2L23j48k70R5K77m1l64J60L00j74k70J99K21j14l51J77L01k25
6279hj71J69K33k43k00J99K13k20j71K51R4j76j56K25J47k42r9K39R3k33n9J84
6301F9R3k40n4K41j3j21j21K54Pk56j8K41L7l10Q0K46m1k37J18J85n1k37J00J19
6325I1m0j85J20K08j32j86Q5J70l1j91J8J79j13j69J65R3j02j50J84J28j90j22
$$ y = [284, -137, -252, 141, 261, -147, -246, 120, 283, -141, -271, 131, 230, -202, -227, 195, 232, -248, -218, 247, 134, -249, -161, 236, 189, -257, -170, 243, 120, -239, -125, 267, 162, -286, -128, 319, 144, -258, -57, 257, 47, -312, -98, 279, 58, -348, -12, 273, 4, -295, -34, 291, 25, -243, 5, 276, -13, -230, 25, 307, -122, -260, 55, 252, -75, -237, 117, 233, -136, -259, 149, 275, -158, -213, 140, 176, -186, -168, 190, 189, -128, -142, 179, 178, -181, -125, 181, 90, -196, -104, 219, 71, -199, -104, 173, 132, -232, -72, 228, 54, -216, -17, 204, 90, -261, -84, 217, -8, -179, -10, 223, -20, -220, -21, 192, -28, -199, 52, 146, -30, -186, 39, 186, -56, -155, 84, 177, -56, -115, 69, 162, -78, -132, 109, 96, -25, -146, 108, 115, -141, -159, 82, 119, -191, -111, 135, 94, -143, -25, 160, 109, -128, -28, 91, 51, -134, -14, 194, 62, -124, -39, 131, 100, -91, -73, 106, -7, -176, -11, 82, -20, -170, 14, 142, -48, -170]
6347a70J51J15j33j12J71M3j40l3J19R2j62n2J95pj44oJ26N4j88L0J19M0j99J9
6371g2J48l8j26P4M6j8o4L6Q0K7j83L9J05M1j31l7J35n5q2L3J27p7r0O4Q0r0l0
6398e8nJ24k6q7QJ02n4n7M3O5j8j36J46Qj11L2J4O8op7j2O5k6r5J02l0J2m5M7
6427gR2n6l6j3K4K1m1N9J5p1n6N0L9no2J04m4m2L3J3K4n5J2j2J7J7n8N7J9j6j9
6458CL6k0n0QqN1j2kj0J0Lj9P8o5pp2J08L2m0lm3J8m2M6N5n5k0l3J05l7q9N1Q6
6491F3k9mp2N9Mq6L7M5J3o2M3j2m2l8P8K4Mo2K5j2P3j13J01k8m1K6%K8l7L0l3
6522a8J02k6o6N9n6Pm5R9kq3m7J09M7r6L2MO2r9jO2m1l9MQ4J1r5J9R7k1n9kM7
6554D9o4k2K0L5Mj12R4RLp0L7J39j11o5J8J31p5o5N5P9j02p3J41l7m5n7J14N7
$$ y = [-170, -19, 96, -37, -149, 22, 65, -75, -108, 11, 103, -59, -111, 84, 77, -67, -73, 53, 107, -81, -51, 68, 108, -91, -72, 76, 38, -88, -14, 32, 14, -50, -14, 66, 93, -90, -51, 54, 95, -36, -73, 62, 7, -75, -42, 85, 8, -82, -18, 62, -28, -58, -63, 61, 35, -52, -44, 58, 4, -53, -10, 55, 37, -99, 47, 55, -56, -24, -10, 58, 52, -25, -37, 28, 2, -93, 9, -21, -9, -54, -7, 85, 29, -7, -20, 4, 25, -16, 43, 58, -13, -69, -19, 20, 15, -47, 57, 13, -29, 4, 17, 41, -14, -2, -14, 3, 20, -38, 19, 38, 22, 3, 39, 19, -31, -23, -31, 20, 8, 6, -4, 6, 9, -10, 68, 3, -4, -76, 32, 64, 24, 21, -22, -4, -46, 0, 55, 0, -20, -53, 52, 15, -74, -23, 63, 34, 30, -42, 17, 21, -65, -28, 17, 30, -32, 11, -1, -43, -81, -3, 21, 25, -37, -12, -24, 49, -64, 37, 9, -32, -6, -6, 22, -15, 15, -18, 84, 58, -8, 51, -5, 2, -43, 56, 54, -29, -76, 33, 80, -16, 16, 20, 82, -17, -18, 44, 3, -36, -32, 52, 63, -32, -13, 84, 63, 4, 2, 49, -15, -37, -17, 18, 22, -90, 4, 13, 16, -54, -17, 122, 11, -54, -36, 95, 20, -45, 10, 89, -13, -86, 55, 18, -27, -84, 30, 87]
6582H7j14k4R3J6j31K5M7P0q9m0J22k5r1L0J10l4n5J7P1j7j37L8J12n7j40Q8J07
6609G9n3n4nJ63r8j14J20L8r4n6L5Q8r9j1qJ64j13l4O7Q9j20o4Q9O1r7o0J32O5
6637A10p1j40K15k6j39K0Q2Jj05pJ22K6j55J3J51q7q4M2J50o1j68P2J22q2j24
6662a23P5J31p7p0L5J41j06j31J04Q2j7j37Q1R6j07j09J83N1j27k9N0J36j31j10
6686a09J34O8j43l3J17M8p0q6J46J9j38k7J76j7j58kJ35k4j23MJ50L7j61K4J03
6711G0j1j12J0J93n6j76Q4Q8m5j38N7J37p1j77J63J16j55j33J67O7p0r6J07Q0
6735I9j26LL4L1j38L4J22k6p5k9J18J3j06m4J16L5j81L0J56j6r4j3J74k6j48j4
6761g1J47m4j35J51P5j10j34J31P3mj29L8J07r3o7J5J43j30m8J11J5q6o4J08J17
$$ y = [87, -27, -51, 42, 58, -73, -48, -1, 69, -20, -60, 62, 37, -54, -24, 86, 52, -3, 14, 85, 68, -69, -31, 81, 24, -116, -28, 79, 26, -28, -33, 130, 32, -82, 38, 76, -18, -74, -39, 49, -50, -61, -69, 95, -18, -52, 15, 104, -16, -80, 9, 70, -27, -87, 45, 110, 39, -101, 114, 88, -51, -31, 51, 52, -53, -60, 62, 88, -67, -54, 97, 10, -74, -32, 118, 57, -111, -39, 83, 1, -123, -48, 83, 6, -64, -29, 112, 6, -125, -21, 61, 44, -93, -12, 84, -23, -132, 51, 102, -25, -54, -4, 132, 1, -109, 25, 93, -50, -83, 34, 82, 12, -74, 72, 91, -47, -74, 102, 85, -73, -75, 60, 36, -87, -83, 67, 104, -57, -33, 70, 59, -53, -43, 150, 94, -82, 2, 90, 45, -93, -36, 101, 30, -147, 16, 132, -23, -156, 11, 78, 8, -88, 19, 99, -27, -24, 10, 41, -97, -63, 59, 33, -42, -71, 47, 60, -46, -90, 26, 61, -120, -90, 66, 50, -44, -57, 117, 91, -57, -71, 76, 32, -103, 48, 123, 13, -121, 10, 83, 79, -50, -12, 95, 2, -65, -50, 93, -37, -85, 26, 41, -45, -109, -1, 116]
6786A16p9p4K8Q0p4j01Q5J08j35oO5M8r4%N2L9j08lJ35m9m7j0J01n9j02Q5R4n2
6814D3j30N6P4rQn7J13p1o0L7L1k0n4k5J25q3m1K4P0l5j01J40nq1JL7lPj3R2j4
6845E6j5q3M1K6q3O0L4n1jl5R5k2k6RKJ2j07R9J3j01K9K9L4%n4K4nM7m6K9LmJ3
6878B2r9O6J7o7J16n8m3L3j0J3n4jQ0k7J3m6K0j7M5N8n1p6P7K3Lk9l6N3q0J6j9
6909e8R2j2q8N4M6r7L5M6J4q1rR6l8k3RJ6Q9j65oJ12mo1k8N2J18j40l8R9K9j24
6939f5J5J17K2j17J0P1j1o9J5N3k6j14L8J52q4p8L3J06k9j35R8O4p0o1O5J09j02
6966Gj31J09N1k1n4J2J18j62o6J37Q5j71J4J08K7j53n1K10j0j63M7Q1pl3q0J81
6992H5J4j40%J35m6j11j0J39lj46K9J66j09q9K0J14k0j51P5J61q9q8M2J34j22
$$ y = [116, 37, -37, -9, 71, -3, -104, -19, 89, -46, -52, 13, 61, -33, -33, 19, 58, -50, -53, 82, 33, -14, -24, 77, 18, -84, 1, 95, 43, -87, -31, 43, 34, 42, -15, 98, 27, -33, 4, 35, 15, -39, -64, 61, -22, -63, -39, 31, -4, -105, 35, 30, -51, -50, -13, -16, -9, -22, 70, 56, 41, -42, -1, 25, -58, 2, 36, -15, -16, -51, 44, 22, -4, 5, 7, 19, -88, 11, 24, -77, -48, -19, 15, 15, -39, -15, -20, 27, -19, 10, 13, 9, 22, -77, -11, 6, -61, 55, -3, -46, -13, -23, -10, -64, -65, 15, -12, 1, -45, -25, -42, 3, 61, 10, -66, 11, 34, 37, 8, -28, 25, -55, -39, -58, 34, 22, -66, -12, 34, -63, -28, 18, 32, -49, -58, 38, 0, -23, -14, 2, 91, -74, -80, 32, 28, -33, -61, -9, 109, -31, -69, 30, 59, -65, -50, 67, 89, -28, -18, 53, 42, -27, -12, 41, 15, -99, -61, 91, 7, -71, -38, 68, 39, -96, 2, 66, -4, -65, 0, 109, 7, -124, -15, 36, 15, -39, -27, 91, -71, -137, 0, 85, -86, -72, 36, 63, -90, -141, 69, 59, -104, -57, 24, 17, -16, -96, 85, 99, -41, -41, 94, 48, -63, -73, 66, 63, -83, -54, 112, 3, -86, -66, 48, 28, -123, -48, 113, 24, -64, -22, 112, -10]
7017a0j69J69J56j57r8Q2J50j81k3R9Q3j30l2J14P5j72n1J67K7j95PJ61M2j37
7041b3m4J30K7j75o3K27M6k03j1K03o6q8m8J70l9j45L8J39m2j47P7J59j01j41
7065a20J14J01q2j07O3J11r0j40J91O7r8j12M9J62j29j22J25J53j62p8J16M6j17
7088e9q1J77P3j73j0J36K4r5j6M7M5j05n3J32M1j34o2K01l8j75J9J50N5k41J29
7113a3J00j15p5J14J26q9j45L8J44q6j12J02J30j17j20P9J03n2j11P6J56j75j6
7136e8R3P3j48k9P7R6j45JM0K0r0O8L4M3r6l7Q6J6j11M0J16p1r4M1O0l7o8J01
7164B1Pqq9N8M6M6j03K5M7q0k4O9K8l7l0L9P9j00m3J34m6j15L3Q3K7j21k1J31
7192E6J5j40N2P8r1K1mQ5m6m8PL9m0n5M8Q5j0j61J93j6j07n2Q5L8j21MJ25j2m9
$$ y = [-10, -179, -10, 146, -11, -109, -27, 123, -58, -81, 18, 101, -29, -61, 53, 128, -44, -95, 72, 99, -96, -89, 72, 114, -23, -67, 63, 90, -85, -148, 79, 125, -78, -89, 114, 48, -40, -88, 82, 43, -102, -64, 75, 33, -114, -37, 122, 21, -120, -6, 95, 13, -94, -31, 80, -10, -150, 41, 108, 10, -102, -53, 109, -20, -142, -17, 136, -26, -104, 12, 58, -59, -140, 37, 110, -63, -73, 63, 87, -8, -24, 23, 68, -37, -90, 42, 83, -51, -113, 88, 50, -125, -106, 44, 99, -142, -13, 87, -28, -103, 11, 137, 48, -97, -59, 85, -1, -113, -11, 119, 2, -118, -39, 64, 12, -99, -23, 133, -42, -58, 35, 108, -40, -69, 8, 104, -41, -40, 0, 20, -70, -2, 32, 75, -21, -58, 28, 44, -67, -27, 89, 18, -76, -35, 25, -12, -80, 21, 28, 20, -69, -11, 35, 81, -22, 3, 50, -30, -54, 15, 43, 6, -24, 15, 94, -6, -49, 85, 39, -76, -43, 40, 67, -54, -75, 56, 71, -69, -17, 61, -30, -9, -13, 72, 26, -22, -15, 24, -16, -71, -23, 62, 52, -109, 84, 68, -39, -91, -6, 32, -89, -85, 40, 28, -21]
7221b1m6J20L2j28j2N5L2j08J9J02l6n1M4R0o1q7kO3jr0N5R6%j22K4P2k3r9J24
7250D1L5o4j11J14L4o0p9P2J38j46r0J65L3j28k7J02Rj17j7J29N1j48m6J70Rj85
7276a16J3J23N1j22k9J12O8j71%J28lq7k1J61Rj58k1J50p2j16Q5R0o0j13J00Q3
7302H4j4j57R6J00j20r0L7J76r9j42J30Q1n7j26J22J70k92kR4J12j67m0J16N4
7326F6o4j41J81M9j17r4K38K1k42N1J11J4j00m4J16O7l10O2K37K4k18K8J40l2
7350D3j87R6J61r2j11j7K47p5j87Q2J85o8j30k5J50p8p1NK14j01j88J00J88j54
7374a3j05J11J24j54q1Q5J32j36j10J30J47j61r1J38R9j50o5R5J54j70j31K35
7396H3L7j91q0K23J9j80LJ93j1j72o1K16J0j56j9J31nj11r4K25M3k34K4K10l3
$$ y = [-21, -67, 53, 85, -43, -55, 0, 32, -76, -57, 45, 9, -42, 2, 92, 31, -56, -58, 5, 4, -86, -31, 65, 65, -57, -33, 39, 16, -83, 41, 76, 12, -99, 15, 49, -11, -90, -18, 120, -26, -116, 49, 82, -46, -73, 29, 38, -79, -96, 33, 84, -64, -110, 60, 69, -116, -103, 20, 71, -51, -80, 32, 100, -71, -71, 57, 54, -33, -54, 107, 116, -42, -63, 87, 15, -101, -16, 74, 14, -99, 1, 84, 70, -87, 9, 109, -11, -101, -64, 112, 13, -129, 1, 82, 25, -101, 21, 191, -101, -103, -9, 103, -64, -104, 12, 66, 2, -139, 42, 91, -26, -120, 118, 139, -103, -52, 59, 73, -27, -71, 45, 112, -198, -136, 101, 125, -93, -65, 75, 43, -144, -48, 113, 21, -90, -107, 140, 65, -122, -40, 145, 77, -53, -78, 72, -6, -77, -72, 142, 41, -147, -47, 141, -13, -118, -7, 117, -37, -118, -33, 99, -37, -147, -17, 130, -31, -122, 16, 115, -35, -100, -5, 149, -21, -152, 83, 120, -71, -151, 72, 91, -89, -86, 107, 96, -76, -137, 79, 89, -67, -86, 45, 40, -71, -165, 60, 103, -131, -107, 103, 70]
7421G0k08L8J76l9r0j0K12n0j26%J20n6j19jK16r8j68P5J52q2j37J16J52j25j58
7446a40L7K39j66r4J54O4l9k23J80Q6p0j83J69J28j65r3J38R8j02j59J80O8j53
7469d6p7J77M0j73l5J77P4j78p7J71P3k44K1J95jj82n1K02P0k29l6J93L2k05n0
7494a59K76k5j78MJ67k3k10L9J87L9k13N6J34l1k05Q1K10p5k56R6K85j00k50R3
7518e8K41r6k71J07K10r1k14J63J84j70k08J72J93j41j46J15J71j99j34K29R8
7539A55k36j19K70R5k41p8J59J67k95r1K98O1k03j53K71O0k55m7K86P6k12l7J22
7562E3O6k37k5K64k9k26L2K17l8k12N5K40q3k19M2K29q8j97J01K67j25k18P7K11
7586A57j19j76J20K15k09j96K08J39j27k03J96J61j51k26K60J81k34j61K23J34
$$ y = [70, -138, -100, 76, 37, -53, -63, 149, 99, -27, -27, 93, 37, -82, -83, 133, 35, -133, -58, 94, 12, -125, -9, 143, 18, -140, -103, 136, -30, -124, 30, 94, 55, -168, 12, 98, 28, -155, 14, 142, -23, -116, 22, 120, 18, -141, 39, 107, -46, -123, 54, 94, -79, -114, 63, 137, -41, -118, 53, 126, -118, -97, 98, 97, -85, -136, 66, 136, -93, -129, 64, 96, -109, -159, 117, 92, -86, -82, 85, 62, -148, -109, 78, 117, -96, -40, 94, 63, -142, -61, 149, 74, -182, -86, 199, 99, -151, -58, 183, 87, -184, -77, 133, 42, -172, -9, 175, 5, -203, -31, 162, 21, -125, -10, 161, -38, -172, 57, 155, -81, -200, 70, 165, -76, -154, 5, 172, -123, -214, 84, 145, -58, -211, 60, 120, -135, -182, 104, 180, -32, -69, 53, 119, -118, -143, 121, 92, -134, -102, 115, 77, -135, -80, 160, 77, -142, -100, 129, 41, -156, -55, 212, 87, -131, -54, 157, 38, -138, -18, 197, -12, -208, 0, 139, 12, -191, 5, 166, 15, -211, 49, 230, -4, -165, 58, 192]
7606A92k30q5J45J59k69j29K69J25k78q5K63M8k28J0K74m1k49l3K89K4k99O0K26
7629A58l4k37L5K38n9j96pK53l4k96J03K24j24j79J09J91p1j92R7J78j02k18O4
7652i9K76j85j65J72J44n6k78J88K00j74j94J41J66j80j43K89M6j18j41J66J12
7673A67k18j00J99Q2j89p3K37L5k39q9K70P4k39l0J81L5k12J3J89Pj94l0K26J6
7697A18k23L3J51J1j86J8J90j18j66J16K06q9k37J57J21o2j61Q4J51p7j95J67
7719IJ53j24j54J55R8j32j17J46J27j62j86J89J03j07j58K37O6j73o5J59P4j67
7741b9j06K15l8r3j00K42K7j54k7J16j2j01j4J12K5j15j3J62k9j73J9J64k4j84
7765a30O3J97n4j83qJ57m4j00O2J29j7j78J08Q8j20m1P8N2j04k1Q2M9j00n4J41
$$ y = [192, -38, -123, 22, 181, -88, -217, 52, 177, -101, -186, 77, 125, -103, -93, 181, 140, -109, -142, 147, 171, -128, -68, 158, 124, -113, -78, 160, 101, -95, -102, 151, 117, -179, -76, 148, 24, -155, -46, 145, 74, -118, -21, 157, 55, -163, -99, 177, -8, -173, -1, 143, 87, -191, -3, 197, 23, -171, -30, 136, -44, -187, 102, 148, 30, -111, 55, 167, -51, -151, 48, 130, -59, -132, 105, 140, -99, -188, 82, 156, -83, -113, 68, 103, -109, -96, 93, 100, -94, -124, 102, 118, -105, -72, 79, 90, -96, -78, 112, -6, -172, -56, 150, 61, -176, -19, 102, 40, -121, -37, 114, 37, -158, 9, 162, 38, -116, 39, 137, 5, -112, 34, 161, -1, -187, 2, 105, -2, -160, 77, 143, -30, -95, 64, 138, -29, -135, 80, 42, -51, -151, 91, 118, -36, -63, 53, 41, -60, -74, 38, 63, -52, -65, 97, 68, -105, -86, 78, 54, -130, -67, 130, 76, -107, -115, 42, -2, -102, -40, 89, 72, -106, 2, 90, -30, -71, 7, 59, -45, -66, 16, 65, -35, -89, 52]
7790E2K2r1o2P1J25p3j08P5M4l5p2R5N3j06m3P4J1r5j6J46J7j20q5K26p3j08r
7817h5J10N5j05j7J24o8j04M0R5jj06L9J01n3j03j4J49l9o3j1P9j3Ml8Q4j2j27
7844g9k4J67j8j48J24j0Kq2R5K1j16p7J39O7j0j29R0L1j2k9K6L7q1o2K8J16k3
7871D3j05%R9k1r8M9J09j23l5J05M6o7n4m1J50r5o9K06m9m8q5J38K3r5m8J26m3
7898A8J1q1J29n2j01P9L3Lj11L6J46j01p4QJ28l0q2m5J12pl2m2J14k5j30Q7L5
7925B6J7p5j7O7j4o6L2R1o5o1L4J39j01o1J3J12n1q6k0J34n0q5O2M0l0n8R1J05
7953A23j60J3K1Q3j50k8J36P8j62j3R7L6j28j6J46J4j44L4P9J5j26mJ52l8j24
7978f6J8J37n1j00o6J73j2j32N5J46m9j23K2J03m4j37Q8J53n2k11R2K01j10j88
$$ y = [52, 74, -17, -79, -8, 117, 44, -64, 11, 55, 20, -52, 43, 96, -10, -53, 21, 32, -63, -79, 67, 84, -36, -121, 105, 32, -76, -85, 25, 80, -25, -42, 82, 14, -90, -50, 45, 44, -62, -23, 78, 25, -78, -92, 57, 18, -45, -56, 23, 10, 14, -24, 60, 48, -79, -103, 64, 46, -102, 22, 12, 14, -68, 27, 48, -68, -145, -6, 61, 51, -78, 12, 43, 31, 2, 28, 65, -16, -78, -50, 66, 43, -62, -62, 37, 16, -82, -33, 76, -47, -82, 23, 69, 2, -52, -93, 57, -38, -107, 99, 50, 2, -83, 55, 78, -17, -65, 61, 18, 29, -52, 77, 25, -76, 3, 36, 39, -72, -36, 110, 9, -65, -57, 71, 41, -41, -86, 26, 19, -13, -55, 59, 34, -96, -9, 26, 43, -32, -49, 18, 4, -62, -30, 61, -4, -65, -31, 108, 7, -54, -41, 71, 20, -66, -86, 48, -2, -87, -25, 15, -15, -73, 18, 123, -37, -24, -3, 80, -70, -98, 38, 116, -46, -59, 38, 74, -54, -70, 76, 90, -54, -20, 59, 74, -52, -56, 96, 58, -66, -48, 89, 38, -62, -128, 45, 33, -99, -44, 102, 53, -70, -48, 55, 11, -126, -38, 115, 63, -148, -56, 145, 35, -153]
8002a53J32J35q8k09J31J68q9j48J22J22j35j29J26J26j53o6J34N2r5q3J41L6
8024G7j87PJ47J02k38J3J62N2j98pK11j8j92J3J37J8j51n7K50n9j74L7J54jk11
8049a13N7J89r7j23N4J37l9j96J12J70j16k15J72J59j24k02J45J62j48j46J95
8070C3J21j77j47K16L2j45r0J47J31j90j02J93J05k63K4K06R6k39q4J95J04k43
8092g7l4K04R1k65q9K87O3k78l2J99P1k52P9J70p6k76J39K02o1j84QK68j27k55
8116b25J62K44j00k58J16K51k01j45J31J80j73j41J67J89j58k14J55K24k14j91
8136b01K15J19j82j07K10J15k44j02K09J12k53m1K08R9j89p0J99O8k63r2K80M3
8158A33k64J0K65m9k00k2K35J4k57KK73l0k49K6K31m3k27Q1K33j22j95P7K38j18
$$ y = [-153, -21, 114, 26, -183, -52, 116, 27, -121, 1, 123, -12, -141, -15, 111, -42, -108, 26, 78, -17, -100, 41, 77, -110, -103, 44, 146, -92, -79, 83, 135, -63, -70, 141, 123, -69, -56, 81, 99, -52, -109, 141, 82, -92, -55, 99, 98, -113, -56, 133, 36, -87, -33, 104, 65, -131, -19, 151, 35, -180, -8, 151, 27, -175, -30, 132, -16, -162, 33, 154, -23, -170, 46, 78, -67, -157, -10, 121, -69, -171, 22, 127, -136, -112, 94, 190, -49, -133, 62, 166, -77, -111, 93, 184, -81, -170, 117, 180, -98, -130, 69, 140, -112, -33, 137, 61, -215, -76, 126, 65, -119, -111, 157, 30, -225, -63, 181, 81, -177, -61, 190, -11, -156, -25, 155, -18, -159, 8, 197, 39, -175, -20, 204, -10, -201, 14, 133, -49, -156, 54, 169, -75, -177, 32, 144, -109, -150, 58, 157, -32, -102, 97, 165, -98, -190, 90, 133, -131, -121, 144, 95, -105, -127, 108, 122, -135, -133, 140, 110, -139, -113, 118, 75, -152, -71, 162, 40, -155, -78, 160, 42]
8182D2j92J22K23j21k79J37K44j17k22
$$ y = [42, -150, -28, 195, 74, -205, -68, 176, 59, -163]
8191a63
$$ Imaginary data points
##PAGE= N=2
##DATA TABLE= (X++(I..I)), XYDATA
0@%%%%%%%%%%%%%%qJ6j6J6j6K4l2L2m0M9n7O6p5R0j06J22j38J56j80K03k28K60
36A38k93L26l61M03m51N00n56O19o83P53q31R17j011J113j226J350j487J641j813
55i52K008k227K476k767L108l514M008m626N426o502Q033j0409J4607k4150Q3114
70F7633j1242j96838J12188J58853j00969j67154J21993J47908j21113j47208
80a35949J34664J31921j35647j27393J45600J13395j46671j06381J53621R3638
90A20798j54119q5182J58665P3507j58397o4871J61063N4192j60356m5646J61400
101F1054L5578j60588k6877J60331J6929j58855q562J57298q58j55033Q961J52225
113H1603j7555j49012K5187J45561l2757j41681M0047J37634m6860j32807N3723
$$ y = [0, 0, 0, 0, 0, 0, 0, 0, 0, 0, 0, 0, 0, 0, 0, -8, 8, -8, 8, -8, 16, -16, 16, -24, 25, -32, 34, -41, 49, -57, 65, -73, 83, -97, 106, -122, 138, -155, 171, -190, 213, -238, 262, -294, 325, -358, 395, -436, 481, -530, 583, -643, 707, -780, 861, -952, 1056, -1171, 1305, -1462, 1646, -1868, 2140, -2486, 2940, -3562, 4471, -5938, 8669, -15481, 67633, 56391, -140447, -28259, 130594, 29625, -137529, -15536, 132372, 11259, -135949, -1285, 130636, -5011, -132404, 13196, 126591, -20080, -126461, 27160, 120798, -33321, -118503, 40162, 113669, -44728, -109599, 51464, 105656, -54700, -100346, 61054, 96632, -63956, -90833, 69498, 86427, -72428, -80990, 76308, 75450, -79583, -70622, 81603, 64048, -84964, -59777, 85784, 53027, -88654, -48607, 89027, 42167, -90640, -36917]
124c6917J27946n9649j22262O5534J16695p0578j10448P5316J04217p9379r7960
135h7485Q3006R1558q6478q5301Q9058P8647r1672p2385R3492O5616r5251n9293
147g6488R6324N2877r7118m6633R7611M0710r7635l4808R7889K9238r7319k3520
159e8872R7092J8288r6275j2789R5400P638r4151k534R2563k339r1024O872Q8920
172D8789j1477q7192J5647Q4690j9900q2440K3766P9665k7661p6868L1280P3891
184E2190l4544p0468L7698O7264m0385o3536M3023O0233m5226n6361M7345N2861
196E0094m9128m9121N0774M5286n2154m1675N3178L7723n4261l4099N4729L0303
208D1649n5360k6868N5465K3256n5680j9857N5751J6479n5589j3001N5308R906
$$ y = [-36917, 91029, 31380, -90882, -25348, 91347, 20769, -89679, -14363, 89854, 10475, -87485, -4479, 87079, 601, -84700, 4358, 83005, -8667, -81052, 12440, 78056, -17195, -76488, 19836, 72713, -24405, -71038, 26573, 67283, -30352, -65160, 32729, 61967, -35352, -58872, 38220, 56508, -39767, -52556, 42844, 50482, -43669, -46203, 46360, 44021, -47003, -40131, 48789, 37312, -49880, -34233, 50457, 30557, -51883, -28117, 51548, 23887, -52981, -21701, 52190, 17646, -52822, -15124, 52140, 11755, -51781, -8758, 51475, 6249, -50112, -2767, 50094, 966, -48155, 2619, 47905, -4249, -45924, 7254, 44977, -9284, -43383, 11346, 41649, -13711, -40579, 14886, 38142, -17538, -37395, 18356, 34835, -20754, -33755, 21553, 31459]
220C1459n4686o537N4241L620n3223n26N2369k248n1272N135N0005p834m8616
233b8113J0258M7029j2859m5571J5081M3526j7390m1704J9236L9533k1172l7452
245b9598K2673L5323k4140l2876K5372L0776k6366k8285K7341K6126k7911k3603
257b5168K8492K1575k8904j9138K9116J7009k9317j4813K9170J2637k9187j0682
269a9210K8779Q619k8656o782K7925M880k7466l249K6824J599k6134P3K5207j339
283A1070k4234K829K3450m037k2183N277K1299o211k0082P244J9013q104j7706
296a2375Q725J6375r421j5254R842J3863j0292j2885J0556J1475j0839j0392J0861
309B39R108j0841p996J0747O993j0541n910J0483N038r999m149J0006L291r369
$$ y = [31459, -23227, -29764, 24477, 28097, -25126, -25652, 26717, 24469, -26803, -21668, 28337, 20503, -28113, -17855, 29174, 16315, -29256, -14175, 29351, 11961, -29743, -10507, 29026, 7854, -29598, -6925, 28398, 4258, -28618, -3246, 27530, 1164, -27121, 220, 26346, -1565, -25168, 3324, 24899, -4005, -23143, 5973, 22982, -6335, -21148, 8022, 20659, -8528, -19210, 9569, 18188, -10468, -17250, 10675, 15555, -11911, -15160, 11664, 13263, -12871, -12798, 12409, 11070, -13164, -10335, 13115, 9078, -13105, -7828, 13471, 7260, -12822, -5578, 13435, 5331, -12375, -3650, 12725, 3304, -11950, -2108, 11755, 1463, -11422, -866, 10609, -230, -10622, 239, 9347, -1494, -9490, 1257, 8250, -2291, -8201, 2282, 7320, -2679, -6828, 3178, 6469, -2900]
323b900k470R039J789q543j167Q096N17p666q6P120o53o577Q71N917j350n477
339c540J470M875j794m381J999L839k076l180K199K788k062k130K169J711j984
354i7j118J926P91j764k49J570k00j302M37J012q92q22R53M59j375k22J424j94
372C37j665M72J776q74j870J279J955j523j866K008J949k212j774K671J784k874
388d27j589L311J458l601j333L869J053m264q22M399M31m688l01M782j00n158
404b980M32N204q33n316J143N471j534n437K035N527k270n473K834N504l102n314
420d109L637N297l969n173M432M869m802m765N102M456n584m265N817L850o310
435a517l565O464L196o810k796P064K350p315j896P610J600p780r03P993N45q038
$$ y = [-2900, -5370, 3669, 5458, -3085, -4252, 3844, 4361, -3305, -3391, 3729, 3076, -3501, -2630, 3287, 1937, -3540, -2070, 2805, 1011, -3370, -1371, 2468, 392, -2788, -589, 2199, 137, -1993, 176, 1887, -97, -1215, 711, 1502, -262, -511, 1059, 859, -443, -6, 1006, 114, -708, 245, 704, -671, -893, 531, 337, -1328, -856, 920, 46, -1824, -545, 1410, -113, -1979, 29, 1978, -234, -2008, 663, 2447, -427, -2016, 1295, 2753, -848, -2181, 1688, 2741, -1523, -2345, 2054, 2485, -2203, -2504, 2278, 2178, -2980, -2548, 2656, 1823, -3493, -2350, 3121, 1587, -3850, -1815, 3712, 1442, -4031, -1197, 4307, 1205, -4109, -472, 4825, 856, -4317, 115, 4984, 182, -4583, 519, 4975, -609, -4874, 943, 4793, -1517, -5082, 1382, 4578, -2232, -5028, 2036, 4386, -2929, -4825, 2785, 4385, -3395, -4298, 3695, 4240, -3798]
451c798J35Q176n58q211J119Q193j693q181K210Q037k800q035L270P741l841p668
467e904M253P338m861p115N248O812n673o542O265O178o523n674O929N401p189
482a057m861P634M427p848l818Q087L434q378k891Q479K373q754j905Q767J202
497D891q946p56Q910J06r030M29Q927r80q883J540Q883k129q646K779Q639l249
513B485q298L848Q093m176p728M749P468n220p145N598O754o047o369O273N904
528F189o769n495O891M991p295m547P371M066p645l536P788L031p766k550P989
543B713K152p958j549Q057J180p939n77P932J94p886K72P763o80p741J103P542
559D578j661p454J930P250k530p096K857O772l213o600L562O352l861o063M229
$$ y = [-3798, -3663, 4513, 3955, -4256, -3137, 5056, 3363, -4818, -2608, 5429, 2629, -5406, -2136, 5605, 1764, -5904, -1651, 5687, 826, -6289, -1041, 5771, 98, -6444, -179, 5999, -524, -6198, 731, 6132, -1057, -5918, 1716, 6143, -1705, -5523, 2564, 5998, -2380, -5271, 3208, 5581, -3173, -5078, 3689, 4891, -4055, -4811, 4099, 4205, -4825, -4396, 4531, 3551, -5332, -3792, 5091, 2962, -5684, -2905, 5734, 2485, -5813, -1965, 6128, 1952, -5776, -1027, 6441, 1221, -5924, -326, 6428, 381, -5988, 285, 6189, -580, -6075, 816, 5807, -1488, -6035, 1336, 5402, -2243, -5779, 2009, 5040, -2726, -5276, 2713, 4865, -3093, -4642, 3415, 4595, -3344, -3921, 4011, 4205, -3681, -3409, 4354, 3674, -4067, -2964, 4578, 2917, -4537, -2607, 4643, 2113, -4983, -2126, 4646, 1433, -5167, -1605, 4747, 886, -5177, -948]
574i48N837m475n342M727N262n011m737N301M423n382m084N592L652n715l305
589d205N714K914n914k655N951K088n991j864N949J418o002j048N882P54n924
604b933k80N817P8n681L83N622n77n429R71N366j251n134J583M998j802m784J979
621a074M582k326m395K418M085k686m017K823L682l055l487L178L168l281k867
636c252L389K669l425k365L622K107l509j716L542J596l448j323L500J053l405
651i65q69L326O01l312m01L148P0l147j7K939k32k888L74K648m94k546N89K502
669A326p43k232Q74K155q19j953J045J863j068j596J072J500j093j265J119J133
685A318j136j034J013Q33j070p68R49N40q88n60Q33K98p15k61N81K50m44j75L87
$$ y = [-948, 4889, 414, -4928, -201, 5061, 50, -4687, 614, 5037, -345, -4429, 1163, 4815, -900, -4205, 1509, 4423, -1491, -4146, 1805, 3893, -2098, -3962, 1987, 3405, -2597, -3645, 2237, 2991, -2933, -3213, 2604, 2682, -2999, -2616, 3006, 2429, -3000, -2029, 3337, 2086, -3048, -1465, 3533, 1731, -3053, -1074, 3508, 1182, -3213, -795, 3290, 604, -3413, -590, 3092, 37, -3450, -272, 2896, -385, -3252, 137, 2806, -619, -2984, 638, 2745, -764, -2480, 1062, 2658, -790, -2113, 1387, 2440, -965, -1834, 1492, 2093, -1219, -1620, 1528, 1598, -1549, -1566, 1373, 1141, -1747, -1373, 1275, 781, -1765, -1176, 1326, 583, -1649, -775, 1380, 561, -1392, -347, 1516, 448, -1148, -76, 1424, 331, -934, 185, 1318, 182, -852, 161, 994, -76, -844, 105, 645, -243, -803, 30, 328, -387, -648, -67, 183, -261, -436, -49]
704d9J20j48l5J36R4M5j5r2P4K30r2k65P0L94j91n42J24O67l13q21K67Q33m97
727fq98N25R39o00j073Q05J104q49j123J102J139j048j169J360J179j416j160
744a189J638J151j808j080J990J018k169j027K315Q02k478q06K549N89k722n59
760a786K778L85k942j85L021J14l107J59L146j87l258N63L279o58l258Q81L410
777B355j000l429J232L421j511l460J798L317j989l399K125L302k507l279K660
792c64L075k884k970L019L035l384k772L536K676l648k420L940K329m065k145
807c042M334J935m408j720M636J494m770j283M844J009n078p50N051M03n121l23
823b789N195j13n220L33N249o79n199R28N286j103n273J576N246j777n207K208
$$ y = [-49, 71, -77, -112, 24, 118, 163, 148, 56, 130, 360, 268, 3, 73, 467, 276, -266, -142, 525, 212, -609, -342, 491, -6, -904, -379, 560, -40, -1113, -308, 796, -53, -1176, -74, 1065, 17, -1152, 208, 1387, -29, -1189, 449, 1600, -208, -1288, 702, 1720, -449, -1476, 839, 1641, -837, -1643, 906, 1495, -1227, -1786, 992, 1377, -1565, -1750, 1271, 1385, -1722, -1563, 1583, 1396, -1862, -1299, 1980, 1322, -1936, -1055, 2355, 1355, -2074, -842, 2579, 1068, -2392, -594, 2723, 734, -2665, -540, 2762, 255, -3024, -364, 2711, -173, -3143, -124, 2911, -473, -3245, 291, 2967, -681, -3101, 839, 3168, -897, -3042, 1292, 3227, -1181, -2901, 1735, 3229, -1541, -2824, 2020, 3029, -2049, -2799, 2252, 2655, -2466, -2789, 2406, 2293, -2927, -2594, 2655, 1976, -3223, -2295, 2991, 1888, -3385, -1809, 3437, 1660, -3547, -1339]
839a339N152k446m928K689M938l006m808L318M565l656m442L840M201m188m047
854d157M334L810m644l559M732L372n048l039N248K770n391k398N524K300n692
869a838j788N779J570n855j228N980Q85n995n54O000J99o014JO026m45o011P69
886b519N828j103n827J220N925j762n657K052N513k276n401K619N378k962n099
901d071L321M931l430m700L704M474l917m251M193L973m387l761M556L466m859
916g58l264M946K870n031k695N105K360n258k070N329J799n384j457N431J226
931C149n406p34N404N54n322k43N285R4n298K23N218n38n106P43M993j040m930
948b954J180M791j515m632J595M436j825m320K061M165k220l988K374L896k564
$$ y = [-1339, 3813, 1367, -3561, -872, 4066, 1060, -3748, -430, 4135, 479, -3963, -123, 4078, -110, -4157, 177, 3987, -657, -4216, 516, 3888, -1160, -4199, 1049, 3819, -1572, -3970, 1554, 3854, -1838, -3626, 2153, 3723, -2132, -3360, 2620, 3505, -2490, -3044, 2956, 3155, -2859, -2858, 3168, 2723, -3288, -2519, 3309, 2206, -3621, -2401, 3524, 1762, -3895, -1843, 3670, 1394, -4007, -1388, 3990, 1028, -4071, -750, 4181, 751, -3949, -245, 4229, 312, -3939, 254, 4227, -160, -3921, 635, 4101, -758, -4022, 924, 3794, -1237, -3932, 1173, 3533, -1725, -3795, 1534, 3333, -2051, -3508, 1923, 3149, -2257, -2991, 2413, 2967, -2355, -2598, 2687, 2781, -2517, -2294, 2924, 2386, -2720, -1977, 3016, 1976, -2954, -1774, 3017, 1502, -3130, -1535, 2901, 1076, -3244, -1183, 2982, 762, -3226, -852, 3044, 480]
963D80l679K764L507k815l235L018L115l116k932L304K717l340k510L333K283
978B894l464k113L474J847l517j746L459J441l446j355L448J134l369r10L360
993A137P56l199o33L268M95l088l64L135K10l021p6K943l1k808Q8K768k27k730
1011a377K86K571m08k578M81K290m62k302N13K167n92k119O85K058o44j928P64
1028e95J844o73j799Q11J674o46j540N84J586o82j468O23J376n47j448N57J263
1045I20m95j345M18J298m62j241K96J243l26j231K56J312k02j290K43J300j74
1062E20j203P0J452o8j454O7J569M4j682J2J647J4j772K7J780p5j962R1J905q4
1082H98k084R1K120j57k206J96K335l24k379L75K553m35k573O12K755p45k729
$$ y = [480, -3199, -435, 3072, 257, -2978, 40, 3155, 39, -2893, 411, 3128, -212, -2722, 611, 2894, -570, -2683, 791, 2638, -879, -2625, 834, 2275, -1171, -2526, 922, 2056, -1313, -2223, 1137, 1893, -1306, -1939, 1329, 1824, -1264, -1628, 1507, 1717, -1304, -1380, 1563, 1532, -1276, -1188, 1580, 1353, -1377, -1091, 1480, 1072, -1506, -1025, 1265, 803, -1499, -986, 1181, 589, -1530, -845, 1213, 569, -1359, -595, 1249, 576, -1223, -412, 1262, 616, -924, -340, 1246, 564, -904, -281, 1095, 548, -900, -343, 920, 425, -920, -502, 796, 334, -907, -611, 632, 306, -925, -669, 643, 441, -849, -606, 694, 520, -683, -613, 839, 771, -683, -616, 953, 997, -685, -673, 974, 988, -784, -757, 1023, 948, -1014, -923, 982, 898, -1186, -1095, 1025, 868, -1338, -1142, 1193, 869, -1510, -1135, 1418, 983, -1590, -978, 1777, 1032, -1697]
1099a697Q31K855r59k869J108K887j241k929J350L033j744l002J814K939j969
1114D07l028K127K941k306k941K500K849k629k834K914K755k951k698L234K703
1129C043l443k460L606K343l713k281L936K091m161j879M258J756m535j579M628
1144A610J350m787j259M956Q95n045p25N197M26n233j44N262Nn289L62N402n83
1161B400n384R16N362j094n402J334N493j687n382J935N285k262n252K504N140
1176C906k824n188L101M965l379m858L558M756l823m579M138M414m372m146M523
1191A92M088m778l706N065L532n276l258N474L060n664k727N770K431n956k217
1206c970O094J832o223j647O236J258o382r29O381O77o448l16O555k3o503L69
$$ y = [-1697, -866, 1989, 1030, -1839, -731, 2156, 915, -2014, -664, 2369, 625, -2377, -563, 2376, 407, -2621, -494, 2447, 141, -2800, -300, 2549, -80, -2914, 0, 2755, -196, -2894, 340, 3043, -400, -2860, 746, 3089, -624, -2905, 1031, 3122, -1039, -2918, 1340, 3096, -1439, -3018, 1610, 2960, -1827, -3086, 1870, 2765, -2280, -3005, 2192, 2618, -2615, -2759, 2503, 2508, -2781, -2419, 2983, 2400, -2984, -2068, 3294, 2200, -3202, -1868, 3625, 1938, -3444, -1509, 3776, 1514, -3738, -1234, 3906, 1082, -4106, -1005, 3960, 581, -4277, -719, 4037, 214, -4365, -227, 4187, -185, -4331, 192, 4280, -498, -4204, 861, 4393, -883, -4141, 1333, 4393, -1271, -3998, 1772, 4203, -1753, -3970, 2124, 3956, -2267, -3914, 2322, 3580, -2802, -3731, 2650, 3327, -3121, -3437, 3118, 3095, -3408, -3039]
1222c039O545o91o455J002O477j288o368J587O305j784o306K187O140k516n991
1237d195K815N774l131n709L336N532l684n371L928N146m182m930M413M681m594
1252a71m420M881M204n027l972N305L722n382l423N544L215n787k841N879K540
1267D267n992k206N924J991o154j632O163J266o156j052O192O23o175m20O211
1282B850R8o109K33O073m70n962P45N972j059n795J341N786j616n572J764N569
1298C848k155n346K304N238k618n077K826M844l095m690L223M448l419m244L564
1313c49M011l648l923L895L647l942l444M146L233m171l012M395K717m371k500
1328c316M447K291m531k005M500J814m559j588M505J316m536j230M510R87m545
$$ y = [-3039, 3506, 2815, -3640, -2638, 3839, 2551, -3817, -2230, 4075, 2291, -4015, -1828, 4312, 1796, -4195, -1380, 4394, 1263, -4446, -1110, 4422, 738, -4633, -705, 4441, 259, -4671, -258, 4423, -171, -4591, 290, 4494, -533, -4505, 800, 4522, -860, -4283, 1261, 4476, -1311, -4152, 1727, 4267, -1725, -3931, 1993, 3984, -2170, -3802, 2361, 3627, -2529, -3581, 2611, 3234, -2941, -3361, 2850, 2948, -3161, -2928, 3145, 2675, -3287, -2542, 3430, 2371, -3424, -2083, 3703, 2087, -3485, -1721, 3848, 1693, -3653, -1349, 3889, 1271, -3806, -980, 3864, 769, -3921, -698, 3750, 331, -3913, -349, 3662, 14, -3909, -14, 3633, -309, -3753, 393, 3626, -545, -3557, 838, 3555, -816, -3316, 1131, 3422, -1109, -3114, 1386, 3200, -1359, -2947, 1558, 2874, -1662, -2892, 1618, 2605, -1940]
1343a940p17M516M99m499k72M368J59m319N0M283j69m147M07M153n98m028Q05
1360a449L964r37l853J043L791j286l614J283L586j541l468J550L308j650l250
1375b523J803K975j816k937J988K772j961k732K160K574k159k380K187K361k218
1390I4k221K319K104k314j976K301J827k352j706K248J724k480j552K399J414
1405A829k422j344K383J245k316j238K383J094k364j008K433R12k315q57K403
1420H18P58k324o78K302P68k389o03K356M57k249n31K302L52k262l79K289K12
1437A199k236k94K238J74k208j35K186J08k154j08K276M1k192M9K207l3k198J61
1455i19K195j51k220K28K178k70k249L41K253m08k270L85K240n18k324O45K230
$$ y = [-1940, -2657, 1859, 2358, -2141, -2413, 1955, 2114, -2205, -2155, 2128, 1959, -2188, -1781, 2372, 1774, -2254, -1449, 2515, 1578, -2275, -1232, 2559, 1273, -2341, -1058, 2528, 987, -2481, -931, 2377, 727, -2523, -720, 2255, 439, -2498, -510, 2262, 301, -2431, -271, 2303, 144, -2236, -49, 2312, 94, -2127, 192, 2296, -18, -1994, 307, 2134, -218, -1924, 324, 2048, -432, -1984, 415, 1829, -593, -1937, 446, 1691, -625, -1863, 520, 1614, -750, -1758, 675, 1587, -728, -1585, 818, 1576, -748, -1426, 876, 1644, -745, -1348, 1008, 1465, -784, -1315, 987, 1339, -923, -1302, 987, 1199, -1037, -1331, 907, 1081, -1127, -1262, 924, 1032, -1122, -1230, 1046, 1087, -1105, -1056, 1151, 1118, -1080, -919, 1276, 1125, -1095, -867, 1311, 1041, -1208, -867, 1386, 978, -1292, -907, 1333, 815, -1509, -864, 1366]
1472A366o90k201O40K305q19k267R14K306r46k294J086K223j103k162J283K171
1488A812j328k112J347K156j519k111J551K103j664k025J690J944j808k014J962
1503a6J820j933j922K089J859k189j753K300J707k374j604K466J492k408j487
1518a953K601J353k574j324K795J188k889j040K801J051l033q50L007P10l151
1533a308n05L118M65l306k87L282J14l320N7L376j97l284K72L387m76l356O72
1550a296L392p86l274Q98L376j237l170J233L223j450l173J570L142j880l022
1565b454J940K892k076k883K216K772k371k711K584K494k629k414K884K258k863
1580c61k171L113J976l143j823L251J754l376j590L454J403l481j326L524J088
$$ y = [1366, 676, -1525, -885, 1420, 601, -1666, -752, 1554, 608, -1686, -600, 1623, 520, -1642, -359, 1812, 484, -1628, -281, 1875, 356, -1755, -204, 1899, 235, -1790, -100, 1844, 36, -1978, -16, 1804, -129, -2051, 38, 1897, -292, -2045, 255, 1962, -412, -2016, 450, 1942, -466, -1953, 648, 2001, -573, -1897, 898, 2086, -803, -1843, 958, 2009, -1024, -1874, 1133, 1843, -1308, -1813, 1305, 1770, -1536, -1823, 1459, 1573, -1747, -1690, 1686, 1489, -1795, -1523, 1864, 1388, -1968, -1296, 2096, 1310, -1964, -1066, 2310, 1073, -2097, -864, 2359, 909, -2264, -694, 2448, 568, -2454, -514, 2378, 302, -2581, -365, 2407, 36, -2675, -91, 2403, -226, -2640, 244, 2502, -361, -2532, 581, 2557, -586, -2409, 842, 2596, -780, -2370, 1084, 2487, -994, -2320, 1204, 2292]
1595B292l586r29L639O82l692n64L703L73l741j70L762l5l722K08L775m14l679
1612b098O02L688p43l626R18L603j043l628J255L553j495l318J526L315j815l197
1628b503J864L105j972l014K094K927k387k714K444K607k540k577K759K353k747
1643c01k188K918K058k952j929L064J793l139j598L229J377l249j232L283J087
1658B221l415q96L390O74l406n25L367L46l373j88L380K9l428K05L337l21l233
1675a836M64L302o54l208Q39L091r19k987J031K993j210k836J236K857j487k704
1691b028J515K560j623k513J727K358j869k254J947K184k093k068K175J947k206
1706b41j813K226J738k207j569K307J506k415j242K403J190k443j068K439R44
$$ y = [2292, -1294, -2223, 1416, 2098, -1594, -2158, 1545, 1918, -1823, -1993, 1769, 1734, -1988, -1780, 1995, 1581, -2098, -1496, 2192, 1449, -2177, -1259, 2344, 1301, -2327, -1072, 2481, 986, -2332, -806, 2509, 694, -2503, -639, 2466, 494, -2520, -426, 2501, 114, -2600, -156, 2451, -89, -2666, 93, 2446, -301, -2489, 429, 2487, -465, -2394, 670, 2463, -676, -2274, 955, 2332, -917, -2149, 1134, 2221, -1194, -2090, 1300, 1974, -1432, -1957, 1410, 1756, -1617, -1805, 1575, 1604, -1824, -1619, 1718, 1397, -1836, -1372, 1930, 1276, -1932, -1093, 1998, 1079, -1908, -877, 2116, 906, -1930, -694, 2163, 676, -2028, -513, 2047, 424, -2089, -362, 1996, 127, -2127, -180, 2004, -89, -2157, 18, 1965, -241, -2054, 172, 1910, -297, -1866, 441, 1947, -468, -1710, 693, 1883, -560, -1628, 811, 1755]
1721A755k499q23K468O68k532n78K483M48k463m00K509K11k434j53K424%k391
1738a307J19K381j85k315K99K287l57k116L90K236n58k126O07K009o15k030P61
1755e20J928q44j929R01J786r42j736R19J683r82j614R88J617j035j556J154J442
1772A260j226j295J251J320j247j254J228J258j282j145J274J120j334j047J339
1787B20R84j350j042J388Q45j343p82J309Q40j384q48J384P65j399o37J349O89
1804I88j382n84J355O63j373n14J369N36j436m40J380M28j366m85J392M62j515
1821e22l96J509K90j495l45J464K73j478k43J495J93j528j24J534J66j508j11
1838h26J574J04j675J39J631r3j636R1J653j16j691K59J588k71j701L52J692m34
$$ y = [1755, -744, -1567, 901, 1569, -963, -1541, 942, 1390, -1073, -1473, 1036, 1247, -1187, -1340, 1084, 1084, -1307, -1188, 1193, 1008, -1307, -1008, 1279, 922, -1194, -804, 1432, 874, -1252, -645, 1364, 749, -1281, -520, 1408, 564, -1365, -464, 1322, 380, -1356, -437, 1246, 264, -1350, -362, 1255, 220, -1336, -182, 1260, 34, -1261, -10, 1310, 63, -1191, 37, 1295, 13, -1132, 142, 1262, -72, -1119, 220, 1204, -146, -1188, 200, 1045, -298, -1080, 229, 1069, -315, -1163, 221, 986, -413, -1050, 299, 988, -394, -978, 377, 1040, -333, -847, 522, 1058, -378, -818, 562, 990, -376, -861, 531, 993, -522, -918, 591, 881, -614, -959, 505, 778, -700, -943, 552, 745, -783, -907, 627, 793, -715, -826, 748, 852, -823, -684, 947, 854, -782, -691, 962, 846, -845, -586, 1002, 731, -970, -618, 1074, 640]
1856F40j657L29J718n07j698N32J725o49j735P81J698q22j626Q47J741r63j663
1873a309J079J621j110j568J213J481j212j513J261J529j423j428J409J497j628
1888a01j440J721J268j717j266J797J209j877j109J931J021k044q70K082Q42k110
1904f63q15K224P02k250n99K396M36k284m47K390L29k432l07K545P4k545M4K466
1922A264r4k611K12K620m13k628O12K571o14k601Q52K491q43k573J085K497j179
1939F48k406J313K378j427k396J621K241j666k247J774K150j961k076K086J942
1954A974k133j943K306J775k399j685K464J586k569j404K626J354k749j177K844
1969H70J097k921q14K908P33k976o02L104M05l097l14L097J60l213QL256k54l202
$$ y = [640, -1017, -688, 1030, 523, -1175, -643, 1082, 433, -1302, -521, 1177, 355, -1271, -424, 1317, 354, -1309, -230, 1391, 281, -1287, -74, 1407, 195, -1318, -57, 1472, 49, -1379, 30, 1527, -101, -1541, 180, 1448, -269, -1535, 262, 1471, -406, -1515, 416, 1437, -607, -1477, 605, 1447, -663, -1478, 746, 1448, -802, -1401, 995, 1431, -853, -1300, 1090, 1419, -1013, -1320, 1225, 1299, -1246, -1202, 1264, 1170, -1441, -1229, 1391, 978, -1650, -1038, 1533, 919, -1682, -830, 1661, 818, -1755, -670, 1827, 648, -1758, -445, 1933, 506, -1890, -269, 1972, 306, -1941, -167, 1983, 22, -2054, 32, 1974, -159, -2102, 204, 1979, -420, -2105, 359, 1945, -624, -2028, 598, 1952, -797, -1974, 870, 1967, -954, -1768, 1140, 1873, -1103, -1705, 1399, 1804, -1293, -1607, 1490, 1650, -1563, -1555, 1701, 1447, -1755]
1987a755L35L146m58l208O60L160q24l102J003L093j169l046J385K955j487k912
2003b224J705K767j656k801J906K656k055k573K222K469k410k338K417K297k628
2018b46k122K700K020k887j848K896J729l025j515L043J462l155j244L280J110
2033B198l284r82L369P63l403n74L447L75l444k48L480R4l522Q4L508k69l544
2050a952M62L448o18l477P85L430r89l321J084L376j295l243J448L218j605l106
2066b355J768L055j914k933J986K858k115k747K254K707k411k538K427K395k631
2081a94k294K783K120k852k049K944J927l086j705L113J552l180j394L281J217
2096B183l351j043L423R25l408p51L429N82l449m23L519L09l537j35L466k3l481
$$ y = [-1755, -1420, 1726, 1268, -1940, -1280, 1880, 1056, -2046, -1043, 2050, 881, -2165, -780, 2175, 688, -2224, -519, 2248, 592, -2209, -303, 2353, 298, -2275, -53, 2416, 6, -2332, 85, 2382, -246, -2368, 332, 2352, -535, -2383, 513, 2242, -783, -2298, 745, 2207, -948, -2192, 1088, 2198, -1086, -2068, 1301, 2064, -1339, -1913, 1534, 1909, -1535, -1783, 1697, 1791, -1731, -1647, 1861, 1592, -1952, -1490, 1958, 1340, -2137, -1352, 2078, 1089, -2232, -1148, 2228, 933, -2310, -862, 2356, 751, -2355, -587, 2468, 554, -2379, -393, 2465, 350, -2397, -143, 2564, 153, -2385, 42, 2437, -194, -2488, 295, 2415, -437, -2486, 458, 2385, -701, -2406, 707, 2259, -921, -2315, 966, 2183, -1168, -2211, 1212, 2137, -1271, -2022, 1407, 1989, -1460, -1883, 1636, 1945, -1592, -1727, 1739, 1716, -1765]
2113a765J47L520m58l397M73L397o75l378Q43L344r77l250J144L202j215l175
2129b220J358L178j539l004J665K925j726k882J908K712k061k582K125K526k247
2144A36k507K315K319k317k307K516K104k595j995K656J928k804j695K793J643
2159B190k881j478K945J356k956j238L043J087l097q78L097P87l077p15L186M53
2175A824l209l71L202K17l193j02L114N3l205J62L123l21l037L52L140n28l047
2192a826O92K971p18k963R35K810r66k854J139K818j227k801J386K717j530k587
2208b004J523K557j621k578J829K427j994k319J952K271k027k211K152K122k209
2223a30j989K243J938k344j825K496J697k454j668K599J542k633j359K575J328
$$ y = [-1765, -1618, 1902, 1444, -1953, -1480, 1917, 1242, -2136, -1293, 2051, 1074, -2176, -1032, 2170, 955, -2220, -862, 2316, 777, -2227, -562, 2363, 637, -2245, -337, 2375, 314, -2268, -143, 2383, 136, -2371, -56, 2263, -54, -2361, 155, 2259, -336, -2331, 325, 2253, -551, -2246, 547, 2190, -691, -2169, 776, 2132, -824, -2062, 981, 2068, -1029, -1907, 1190, 1977, -1100, -1815, 1371, 1824, -1385, -1756, 1446, 1663, -1530, -1632, 1482, 1535, -1670, -1508, 1615, 1294, -1743, -1391, 1749, 1221, -1826, -1134, 1837, 1119, -1844, -909, 1901, 935, -1919, -780, 2038, 811, -1990, -604, 2113, 583, -2004, -481, 2076, 455, -2123, -294, 2133, 139, -2180, -228, 2043, 16, -2195, -43, 2079, -130, -2119, 124, 2062, -282, -2107, 389, 2086, -368, -2036, 563, 2105, -528, -1887, 688, 2016]
2238B016k705j204K717J037k671j048K855Q36k858q21K868O30k880n11K870M73
2254A604k872l41K930J76k854j15K888L3k923J72K923k52k955L34K962m79k836
2271a605N14K865p32k809Q43K716q94k783J016K688j100k636J160K662j388k497
2287a980J448K454j519k402J633K450j788k276J868K171j908k173K032K081k123
2302c2j970K189J891k284j871K386J718k476j573K461J486k513j410K577J324
2317A903k604j218K685J133k711j014K790R09k864p94K921O59k902n31K960L19
2333A641k851l02K868J34k874q1K915l9k969J87K918l11k913M17K949o38k814
2350a763O45K845p50k828R40K766r77k722J128K669j313k513J318K553j398k554
$$ y = [2016, -689, -1893, 824, 1861, -810, -1858, 997, 1833, -1025, -1846, 1022, 1652, -1228, -1739, 1131, 1604, -1268, -1609, 1321, 1497, -1357, -1472, 1416, 1449, -1474, -1302, 1621, 1369, -1586, -1252, 1710, 1231, -1605, -1091, 1774, 1042, -1767, -924, 1792, 898, -1885, -869, 1819, 719, -1917, -757, 1905, 517, -1980, -532, 1922, 403, -1999, -366, 2084, 296, -1980, -112, 2059, 151, -2022, 10, 2091, -32, -2002, 187, 2078, -206, -2077, 309, 2027, -449, -2022, 439, 1925, -588, -1998, 579, 1903, -701, -1919, 766, 1899, -812, -1826, 964, 1873, -991, -1785, 1136, 1795, -1107, -1638, 1322, 1641, -1210, -1512, 1356, 1490, -1384, -1465, 1450, 1411, -1558, -1371, 1547, 1236, -1677, -1260, 1689, 1051, -1763, -1118, 1727, 977, -1851, -911, 1855, 878, -1844, -716, 1953, 640, -1873, -555, 1998, 600, -1954]
2366a954J644K343j714k332J861K237j908k248J999K098k052j992K052J914k144
2381a96j889K372J716k456j625K539J509k558j344K583J255k576j146K665J002
2396A851k742q06K700P43k719o32K738M81k802l88K786L24k831j59K765Q8k853
2413a456P9K812k50k721L20K807m83k637N37K629o65k608P41K657r39k512J023
2430f66K453j091k469J228K307j281k345J428K207j428k211J545K085j618j987
2445a843J742J881j812j784J885J671j927j579J992J546k063j373K082J377k243
2460d48j119K176J035k224j002K261Q97k352p28K264O67k304n97K386M25k332
2476i95l69K329K80k319j89K326L6k235N4K283j94k237L32K188l26k197M71K150
$$ y = [-1954, -310, 2033, 319, -2013, -152, 2085, 177, -2071, -72, 2026, -26, -2018, 34, 1948, -196, -2085, 287, 2003, -453, -2078, 461, 1970, -588, -1932, 651, 1906, -670, -1816, 849, 1851, -891, -1697, 1003, 1746, -973, -1605, 1133, 1614, -1188, -1576, 1210, 1534, -1297, -1456, 1309, 1397, -1456, -1377, 1435, 1185, -1536, -1216, 1591, 1108, -1529, -992, 1637, 972, -1636, -895, 1762, 823, -1689, -666, 1787, 696, -1773, -545, 1762, 481, -1864, -436, 1771, 343, -1868, -323, 1762, 144, -1843, -101, 1780, -32, -1816, 69, 1740, -187, -1766, 226, 1772, -291, -1664, 418, 1795, -448, -1567, 609, 1644, -580, -1582, 679, 1576, -776, -1504, 760, 1427, -877, -1474, 912, 1337, -995, -1364, 965, 1245, -1074, -1263, 1063, 1099, -1136, -1082, 1201, 1007, -1230, -898, 1290, 964, -1233, -762, 1388]
2494A388o33k041O16J994n75k075P86J859p97j863R00J798j000j756J008J717
2510A326j098j618J112J608j205j512J279J464j307j389J378J354j432j253J459
2525A66J158j473j115J489J006j487r39J482R40j610p91J558P11j572o93J606
2541D36O38j579n94J657M28j566m23J621L14j523l11J568K32j623p8J542O0j520
2559g21m3J502oj518J08J454j16j427J16J437j93j463K27J375k03j381L65J278
2577G91l66j299M86J237n15j193M98J275n60j152N72J159o43j132O70J110p37
2594B01j093P26R92p38r57P02R54p41r28Q29Q35q12q41Q59Q35q83p75Q35Q30r42
2614a12o71Q74P38r46o59R66O17q91o66J008M86r51n02R21N58j038m93R96M82
$$ y = [1388, 755, -1286, -670, 1324, 749, -1326, -540, 1319, 522, -1341, -441, 1357, 357, -1399, -391, 1326, 228, -1390, -278, 1330, 125, -1387, -108, 1356, 49, -1340, 38, 1392, -40, -1293, 166, 1324, -149, -1264, 225, 1231, -256, -1195, 287, 1227, -383, -1174, 384, 1095, -477, -1170, 436, 1074, -505, -1099, 558, 986, -580, -1003, 618, 932, -591, -902, 666, 898, -725, -803, 739, 799, -721, -764, 738, 732, -786, -678, 776, 660, -767, -651, 786, 593, -870, -643, 732, 529, -852, -487, 791, 425, -874, -388, 849, 334, -859, -361, 914, 354, -798, -226, 933, 290, -842, -172, 938, 201, -892, -166, 826, 88, -869, -167, 787, 46, -882, -53, 782, -30, -871, -12, 823, -60, -835, 0, 830, -112, -783, 91, 829, -117, -776, 190, 807, -84, -750, 258, 744, -207, -709, 212, 770, -268, -761, 235, 717]
2633G17j014m22J030L92j045m09J091L15j102k31J049K25j029k06J156J13j077
2650d47j36J119L9j019j22J152j8j112J6J128j02j039Q0J098j57j070J34J073
2668F17j65j185K89J096l12j067L66J052l38j102M72J001m37j012N14R94n46j002
2686g65O24R32o45r02O86Q53o54r31P39Q62p89q17Q14P09p88p70R40O95r08o55
2706g70Q52O95r46o24R92N63j002m51R86N17j094l57R62L85j056l04J042K70j074
2725d14k00J077J53j112j05J132J1j066p2J137l2j159J18J104j77j049K24J111
2743F81k78j055K46J142l66j085M66R69m13r81M66R46n05r81N80R32n93r52O90
2762i1P57o15p61O50P58p49p17P76O87p90o46Q35O41q36o03Q78N38r12m49R18
$$ y = [717, -297, -719, 311, 703, -342, -751, 340, 655, -447, -678, 371, 596, -433, -639, 517, 630, -447, -583, 536, 575, -444, -566, 586, 568, -544, -528, 600, 498, -541, -461, 637, 480, -590, -456, 617, 452, -733, -444, 652, 340, -727, -361, 691, 353, -749, -277, 724, 287, -725, -211, 783, 237, -765, -141, 791, 146, -756, -70, 783, 129, -802, -63, 799, 10, -807, 7, 716, -72, -842, 98, 793, -115, -770, 82, 777, -169, -793, 199, 762, -240, -691, 295, 812, -282, -639, 323, 708, -348, -652, 390, 660, -414, -614, 463, 616, -496, -601, 531, 542, -524, -596, 541, 509, -650, -532, 572, 395, -654, -430, 681, 403, -652, -406, 736, 370, -715, -249, 720, 307, -674, -208, 738, 233, -748, -168, 764, 171, -781, -91, 666, 51, -710, -60, 698, -51, -768, 8, 695, -95, -741, 94, 735, -101, -704, 174, 712, -200, -649, 269]
2782B69L99q96l44Q79L35r48l09J006J86r78j74J012J10j074M1R36J4r45N1R22
2802D92q9r63J96Q71j45r12K15R10l20p68K71Q81m73o63L20P29l53p48L98P18
2822E67m61o99M63O58n43n29N46N30m90n97N29N01n37m62O03L66n39l00N54L09
2842D69o03l00O61K38o86j87O39J77n84k11O10J23o29m5N65O1n92m9N94l9n26
2863c14KN56n1n03P9M78j07m74J51N00j74m35K02L95k00l28J92L18j90l39K04
2884c8L71k32l25K10K34k45k32K84J96k90j97K82J54k38j25K06J45k03j13K04
2904D8J28k33n3J73P1j67p4K34Nj49m5J76m3j06o3J81qj31L9N0K3r0m8J5J01o0
2930b6Jj0L1l7K8O1l2Qm3N9q2L8M5q6L7J16j48K5K1P1p8n3K2R7r3l3O1J30j60
$$ y = [269, 668, -228, -572, 307, 642, -306, -615, 391, 577, -401, -575, 437, 547, -527, -486, 450, 464, -481, -430, 492, 403, -560, -364, 507, 362, -550, -335, 575, 255, -513, -242, 639, 166, -497, -177, 552, 199, -549, -151, 567, 106, -593, -130, 528, -15, -544, 2, 532, 42, -555, -26, 475, -62, -524, 79, 445, -94, -394, 160, 469, -134, -434, 227, 465, -221, -408, 231, 408, -176, -387, 223, 346, -283, -328, 237, 298, -294, -343, 251, 212, -314, -312, 244, 193, -310, -231, 247, 140, -334, -183, 317, 143, -292, -90, 305, 105, -223, -31, 287, 97, -242, -38, 333, 101, -224, -14, 220, -25, -257, 27, 223, -67, -264, 18, 172, -66, -191, 15, 160, -43, -156, 48, 176, -57, -110, 63, 134, -33, -107, 127, 132, -17, -62, 114, 71, -35, -98, 83, 75, -56, -17, 33, 56, -34, -82, -67, 34, -26, -25, -35, -4, -41, -13, 48, 16, 24, -19, 40, -42, -4, 41, -45, -8, 108, -40, -15, 6, 77, -1, -54, -32, 65, -28, -61, 0, 130, -30]
2959c0p7J33J12j80j42L05%j75m1J30P3j95n6K45P2k87K9K66n6k89ML89j26k56
2983a52P0K69p6l52J33L93k60k52J53L16j95l41K07L43k31l70K95L25k57k92L69
3004I5K10l42k42L87K32m78k00M35K64m63j88M48J99n24j96N67J09n05j41N30
3024A97L3m89r1O15N2o65O4N83o0n59P7N40l1o16J82N61k02n79K42O37l58n41
3046d08K55O33l67n88L69N67m24n85N05N23m91m59M77N24n82m99O12M26o46l52
3066e10O69K83o57l16P82K76p77k21P79J75q25j66Q28J70r06n6Q73jq69P3Q32
3087D36j18q20J17Q68j77q37K36Q70l19q01K77Q82l80q47M69Q26n21p88N37P57
3107F67n21p82N60P93p07p14P20O33p34n86P38N83p97m97P96N37r36m27R52L02
$$ y = [-30, -107, 26, 138, -42, -184, 121, 121, -54, -95, 35, 108, -87, -143, 102, 174, -113, -84, 182, 126, -163, -159, 230, 104, -152, -82, 187, 111, -241, -108, 285, 25, -227, -74, 242, 47, -294, -87, 256, 25, -345, -50, 275, 18, -274, 95, 305, -37, -279, 108, 340, -138, -338, 97, 361, -102, -290, 158, 357, -167, -363, 204, 313, -192, -333, 197, 230, -259, -350, 265, 317, -348, -284, 299, 239, -320, -243, 297, 266, -350, -168, 393, 191, -388, -146, 491, 133, -408, -153, 480, 113, -475, -106, 461, 37, -548, -43, 480, -11, -470, 7, 531, -51, -550, 62, 488, -158, -510, 159, 442, -215, -531, 251, 527, -250, -471, 308, 483, -342, -508, 320, 490, -416, -472, 401, 400, -469, -396, 436, 318, -502, -385, 483, 306, -531, -295, 575, 256, -545, -268, 614, 234, -613, -144, 682, 161, -627, -90, 667, 146, -636, -76, 717, 10, -704, 16, 649, -85, -671, 67, 650, -147, -644, 152, 689, -247, -674, 278, 580]
3127E80q67l71R78K60r06k53J029J59j046r8R70J29j059PJ018j5j053N3J032j14
3147D33j091K55J007k40j031L00R99l19j018L92R95m57r55M84R13n00r00O10Q26
3166G03o21q64P22Q10o95q29P76Q22q70p05Q68O44q70o35R30N38r55m82R66M16
3186F69r75m59J097L53j037l88J069K97j074j62R89K34j060j08J084Q2j102o9
3204e60J113l8j154J49J112j82j023J50J070l07r75K70J092m33r95M08J038n01
3222B34r79M96R95n04j006N60R69o55q36O74Q21o69q22O88Q67q10p32P10P35p58
3242b2p07P77O99r11n72Q90N60r27n45R67M72r48m49R70M23j033l19R24L54r54
3262c51l05R99K44r71j97J051J39j011j19J039or76m0R50N3j021j0J060j25r81
$$ y = [580, -287, -658, 320, 580, -326, -579, 450, 609, -437, -535, 435, 564, -495, -488, 530, 515, -538, -485, 547, 433, -658, -403, 604, 364, -667, -367, 632, 313, -705, -313, 682, 225, -730, -246, 667, 167, -733, -123, 703, 82, -782, -60, 750, 55, -774, 2, 824, -46, -751, 117, 761, -109, -744, 186, 724, -231, -713, 253, 669, -306, -765, 332, 685, -352, -740, 329, 626, -448, -610, 379, 613, -447, -555, 529, 611, -491, -560, 553, 515, -639, -490, 622, 440, -583, -433, 637, 330, -645, -375, 717, 284, -711, -303, 735, 234, -745, -249, 746, 242, -764, -204, 765, 110, -726, -52, 769, 100, -722, -34, 833, 23, -709, 1, 736, -22, -729, 48, 747, -164, -736, 154, 714, -213, -758, 209, 681, -267, -716, 254, 677, -356, -675, 249, 603, -351, -656, 343, 587, -384, -581, 470, 609, -402, -521, 518, 512, -464, -504, 446, 499, -522, -532, 528, 403, -578]
3282e78J49R46j42j025K31R56j81r97L17R48l47q99K80R58l89q86M33Q83m39q92
3302f74M94Q90n22q56N10Q25n17q62O14P50n82p50O40P42o38p66O76O52o56p21
3322g51Q00N85o99o63Q13N84p66o26Q86N12q31n29Q90M92q41n44Q92M33q79l84
3342f26Q74L66q89l64R99K23r40k59R59K19r74k15J067J05r70j48J106J8r84o3
3362d96J009j3r95J9J075r7j115J44J070j59j058K17J003k48j034K58J106l72
3380C14j031L07J077l22j114M52J075m66j131N50J099o08j009O39R44o06r76P21
3398h5R47q02q68P55R34q23r07Q64Q49r09r02R39Q71r71p67R87P47j084n79R73
3418A69P27j180o45J193N51j126n48J228M66j211m29J251L94j304k86J287K25
$$ y = [-578, -429, 517, 375, -650, -419, 537, 356, -641, -324, 624, 277, -622, -342, 616, 227, -659, -226, 657, 218, -674, -180, 710, 188, -668, -158, 667, 150, -712, -98, 652, 70, -680, -40, 702, 64, -702, -26, 626, -30, -751, 49, 634, -65, -728, 85, 669, -97, -723, 163, 675, -156, -685, 205, 697, -144, -688, 204, 637, -242, -626, 248, 614, -275, -639, 360, 583, -357, -616, 343, 562, -412, -627, 440, 545, -425, -573, 533, 551, -433, -496, 513, 500, -495, -476, 599, 502, -613, -469, 601, 442, -616, -399, 604, 356, -678, -420, 686, 314, -717, -410, 667, 345, -769, -317, 758, 292, -839, -289, 810, 202, -807, -168, 776, 170, -806, -85, 862, 60, -808, -53, 881, 58, -849, 15, 864, -45, -947, -8, 863, -108, -875, 112, 859, -225, -804, 169, 896, -284, -929, 264, 815, -311, -859, 369, 835, -376, -805, 446, 840, -464, -750, 537, 762]
3435G62j329k10J328K34j465m8J387M9j392k8J430j52j293J42J380k38j411L27
3453e27J401m10j320L60J403n22j275N05J333o36j276O90J229o92j229P33J201
3470I68p84j190Q87J086q98j097R55J062r44j089J065R70j052r43J115R25j250
3487b14p56J207P14j178p34J268O36j342n68J350O41j436m69J376L78j385l47
3504h59J409K99j458k88J541J06j460j01J467L0j417N3J434j03j436K00J406k31
3522E92j438L02J469m11j378M07J377m86j351N84J267n92j323P14J223o78j261
3539i83P98J194q76j124Q20J141r70r60Q80J053j092r12J113Q53j054q40J157
3556A98O99j142o90J216O47j199o29J220N00j196m27J190L89j229l43J294K61
$$ y = [762, -567, -777, 551, 785, -680, -728, 659, 708, -684, -712, 718, 566, -727, -585, 795, 557, -854, -527, 874, 464, -856, -496, 907, 385, -890, -385, 948, 312, -964, -274, 955, 263, -966, -233, 968, 184, -1006, -119, 967, 69, -1028, -73, 989, 45, -1044, 21, 991, -61, -1004, 111, 1036, -214, -970, 237, 951, -227, -961, 307, 943, -399, -967, 383, 1024, -412, -881, 495, 873, -512, -859, 550, 849, -609, -897, 644, 750, -710, -811, 656, 686, -731, -678, 756, 653, -783, -583, 823, 592, -846, -544, 925, 514, -864, -457, 920, 434, -917, -333, 934, 342, -981, -267, 956, 278, -983, -185, 1009, 133, -991, -171, 970, 0, -960, -80, 973, -119, -1031, 82, 935, -119, -959, 198, 897, -245, -935, 281, 928, -271, -900, 320, 820, -376, -803, 387, 776, -453, -796, 498, 759]
3573G59j296k17J287J52j243j55J262J35j255n5J252n2j247N9J286j26j229K23
3591d60J167k59j149K79J174l74j054K85J112m20j055M18J034m67r76N61R76o25
3609A67q89N96R21o77q83O38Q79p50p82Q10O96p08p21P25O20o61o80P62O61q43
3629a19n76Q16N52q59n06Q36N04q15n09Q93L92r28l34Q82L70q96k82Q28L06q68
3649c13k28Q45K56q46j97Q74J11q62p9Q19R1q38m0Q18M3q32l7P84M4q24P4P31
3671C94k6q07N8P98j35p43J50P66j68p22J26P45k00p09K29P29k35p14K37O98k70
3692B01o40K38O68k66o75L23O20l46o39L14P18l86o48L82O41m14o63M37O70m55
3712H0o03M62O04m81o44N26N98n85n80O00O12n59n27M90N81n55o23O50N43o68
$$ y = [759, -537, -754, 533, 685, -558, -713, 549, 684, -571, -626, 626, 574, -673, -614, 672, 546, -683, -460, 707, 448, -701, -422, 752, 378, -676, -391, 721, 301, -754, -336, 698, 231, -745, -184, 792, 167, -722, -126, 795, 118, -765, -127, 752, 2, -780, 30, 726, 18, -703, 22, 642, -19, -699, 63, 724, -119, -695, 121, 673, -186, -692, 144, 648, -167, -676, 217, 609, -319, -653, 229, 599, -297, -579, 249, 555, -313, -541, 304, 560, -286, -483, 391, 502, -360, -439, 380, 471, -367, -407, 411, 454, -378, -415, 369, 413, -411, -337, 394, 368, -439, -381, 417, 282, -461, -311, 455, 287, -435, -309, 436, 236, -473, -244, 485, 250, -464, -227, 471, 201, -439, -201, 467, 201, -474, -151, 469, 123, -516, -202, 516, 130, -518, -136, 505, 91, -572, -135, 535, 80, -523, -61, 543, 62, -582, -56, 542, -43, -623, -23, 589, 30, -497, -7, 574, 19, -604, 46, 589, -79]
3732g9m62O37M29o37m87P68M00p29n13Q23M43q01l44P59L88q57l32Q51L20q40
3752b63k99Q78K62r00j91Q78J57q94k00R93J22r64j28R54P4r74k4J017Oj059O0
3773d95J031k1j049M1J036j03j059K38J002k33r98K70J021l41j023L90J028m49
3791B86j023M89J066o24r34N61R98o72r53O92R40p30r50Q07Q35q43q08R14P09
3810G60q64p14Q99P41r59p21J099O70j147n82J111M91j121m24J174L92j159m18
3828g72J198L68j303j90J167K36j276j49J258J84j371L2J262k5j318J33J243j19
3846E58j293J96J275k70j234K72J242l39j245M54J200m68j259O26J211o58j212
3863i44P11J242q46j110Q85J039q74j044Q51J054j030q84J009Q62j057q09J057
$$ y = [-79, -541, 96, 525, -112, -599, 169, 569, -160, -673, 150, 593, -208, -552, 207, 595, -262, -594, 257, 577, -263, -562, 316, 578, -322, -513, 365, 522, -372, -572, 421, 543, -421, -549, 405, 479, -495, -519, 498, 504, -555, -495, 536, 515, -534, -493, 543, 440, -619, -381, 621, 388, -610, -340, 681, 340, -683, -293, 735, 286, -737, -248, 818, 194, -740, -179, 819, 147, -806, -114, 826, 96, -854, -47, 788, -55, -863, 51, 760, -104, -818, 81, 822, -137, -858, 241, 911, -236, -818, 293, 784, -337, -761, 413, 805, -354, -772, 426, 794, -509, -699, 468, 704, -572, -721, 537, 721, -650, -618, 644, 619, -699, -566, 677, 558, -735, -539, 736, 466, -768, -496, 746, 407, -838, -384, 816, 348, -911, -285, 926, 268, -944, -233, 1009, 163, -947, -62, 977, 103, -941, -90, 964, -66, -950, 59, 921, -136, -945, 112]
3880A12Q52j182o87J116P26j234n80J264M57j263m31J274M27j296l93J394K33
3897G89j340k09J352J16j311q8J336L2j337k7J415j00j408K11J384k95j302L27
3915d55J275l72j232M10J236n26j205N36J248o95j115O88J122p36j122P78J108
3932I43q82r73Q53R89j007q17R63P69r39p67J005P34j029o97J042O77j148n60
3950h44J130N25j161m30J168L70j214l34J182L32j244j44J160J34j148r5J197
3967E84K3j155j8J152r4j187K43J113k18j138K53J104k93j105M29J051m79r98
3985g33M74R23m51r76O01Q60o03q12N72R04p30p76O93P48o57p40P27O66p61n96
4005f67P59N78q25n47Q55M73q10m52Q21M55q79l59Q71L13q52l13R37K07q74k20
$$ y = [112, 964, -218, -905, 211, 937, -297, -877, 387, 844, -419, -850, 424, 851, -445, -838, 556, 789, -551, -760, 592, 708, -603, -691, 645, 677, -660, -687, 728, 628, -780, -569, 815, 520, -782, -455, 820, 448, -784, -374, 862, 336, -869, -333, 915, 220, -895, -207, 915, 179, -943, -165, 943, 61, -912, -59, 930, -77, -894, 69, 838, -101, -868, 137, 871, -158, -855, 187, 864, -284, -844, 286, 811, -350, -780, 388, 758, -456, -790, 392, 724, -520, -664, 496, 630, -518, -613, 584, 607, -548, -566, 586, 492, -695, -452, 661, 443, -695, -442, 662, 369, -736, -307, 744, 265, -733, -259, 664, 213, -763, -162, 698, 95, -717, -145, 759, 29, -747, -54, 694, 37, -703, 24, 690, -71, -667, 92, 670, -155, -702, 153, 626, -184, -636, 185, 640, -239, -598, 273, 586, -266, -579, 358, 565, -309, -529]
4025e29Q83J11q37r1Q42P1q38k2Q34jq54J9Q50m8q80K24P67j69q29J84P78k28
4047B37o77K26O78k83o95L46O75l34o68L68O51m06o10M33N13m36n08M24N27m96
4067c5m13M58M13m90l66N05M04n17l68M95L19n19k61M97L01n14k46N14J84n23
4087a62j46N26R0m98j43N26L6m74j02N36P3m88p3N51pm28o0M61M4m84j7N37r5
4110B03m22J1M18pn26J43L67k6m23O4M53j26l46Q2M21j30m03Q4M24j31l99J64
4132a05L69k21k77J91L03k04l06K07L21k87k12J63K79k14k77K46K54k54k06J89
4152d1K72j87k99K56J61k07j86K68J62k31k11K50K14k93k01K46K27j75k33K92
4172H4J34k66j29J99K49l07k06L31J99l24j89K84J74k99j71L20J28l50j16L47
$$ y = [-529, 354, 465, -372, -463, 379, 450, -388, -410, 424, 423, -431, -412, 438, 390, -490, -266, 501, 332, -497, -313, 465, 237, -440, -214, 464, 181, -514, -168, 507, 173, -495, -127, 524, 118, -492, -59, 454, 18, -490, -66, 461, -35, -448, 10, 423, -67, -433, 72, 476, -41, -409, 86, 405, -114, -375, 122, 423, -91, -337, 177, 361, -162, -308, 218, 308, -190, -333, 193, 229, -245, -347, 189, 262, -226, -299, 252, 245, -183, -243, 218, 262, -222, -239, 298, 203, -219, -208, 210, 203, -323, -180, 187, 161, -262, -198, 255, 129, -217, -135, 286, 156, -247, -163, 261, 130, -269, -105, 264, 43, -234, -43, 260, 56, -250, -43, 278, -9, -221, -58, 221, 7, -270, -24, 230, -24, -230, -41, 231, 44, -255, 1, 162, -45, -231, 37, 199, -32, -243, 7, 221, -72, -273, -27, 200, 25, -208, 84, 218, -48, -177, 22, 271, -36, -242, 89, 288, -36, -225, 59, 233, -66, -237, 83, 211, -139, -255, 92]
4192I2J35l01j85L70O8l25j05L39R7l47q6M14R3m76L1L05N2l15l9L78%l21J2L88
4216B74q1m28J01L68o5m02J06L90j26l95J33L62j47l52J48L68j50l61J91L39k07
4237F6l46K42L04k84k16J93L28k94l00L50K18k75l02L86K21l52k31L83K57m00
4257e2k16L44K16l82j57L81K01l96k54M13J84l93j95M97J20n00q8M89P4m98j06
4278c18N17R3n14k8N33o6m72J2N27k5n27Q2M75j22m33J02M71j82m79K48M77j96
4300A75n44K32N01k10n16K88M01k05m98K99M61l55l42K91L74k78m50L69M26m58
4320c9l25M30L23m84k61M13K86m44k65M81K55n04k51N12J97m78j67M80J61n42
4340b22q6N46N8n07j16O12Ln50k6N82J4n98J8N24pn78N7N55m3o18J67N83j81n31
$$ y = [92, 227, -74, -259, 111, 179, -146, -251, 88, 185, -162, -248, 166, 259, -217, -186, 119, 171, -144, -183, 195, 195, -126, -114, 274, 193, -235, -134, 234, 169, -233, -127, 263, 137, -258, -125, 237, 90, -262, -114, 254, 104, -257, -66, 273, 66, -280, -38, 266, -18, -234, -41, 287, -7, -307, 43, 261, -14, -316, 70, 291, -61, -292, 91, 348, -52, -268, 76, 292, -90, -247, 134, 335, -61, -315, 98, 282, -111, -306, 191, 311, -189, -277, 212, 286, -212, -318, 199, 292, -222, -250, 283, 217, -255, -243, 284, 259, -268, -186, 289, 167, -266, -164, 307, 125, -354, -106, 371, 175, -369, -137, 364, 154, -362, -74, 327, 122, -376, -77, 384, 29, -313, -22, 352, 74, -376, -7, 419, -39, -364, 66, 389, -95, -356, 57, 343, -101, -366, 115, 370, -134, -385, 127, 324, -154, -321, 159, 320, -222, -308, 238, 296, -211, -327, 285, 288, -262, -288, 294, 308, -290, -272, 252, 245, -333, -276, 279, 236, -382, -215, 368, 187, -344]
4364c44J69N68k75m69J78N68k60n54K95N52l44m94L07M56k85m99L92M23l81m09
4384d06M05M13l92m44L85M69m72l59M71K91m51l42N64K86n78k16N21K95n97k31
4404c88N67J72n88j41N16K08o15j15O00M7n01p8O07L7o18J1N41k8n17N4N43Jo34
4427c19O2O20j37n46J59N42k08m93J19N24k22n35K65N35j54o09L28M78l18m94
4447d03L62M55l30n64M20N21m23n10M13N32m87m15L60N34m02m72M29M37m75m06
4467d24M79L41m88l47O07L02n57l18N70K78n77k22M99K94o64j74N80K04n96j27
4487c40N53J51o03j36O67M2o39k3O23k5o56N7P41j11o34P8O16n7o59N8O37p9o45
4510c84J66O05j98o30K26O79k97n96L14O00l03o49L82N97m32n77L57O30m68n67
$$ y = [-344, -175, 393, 118, -351, -173, 395, 135, -419, -124, 428, 84, -410, -103, 353, 68, -431, -39, 384, 3, -406, -1, 412, 20, -424, -39, 430, -42, -401, 70, 361, -90, -432, 132, 418, -160, -376, 145, 440, -157, -388, 179, 351, -237, -378, 138, 346, -269, -384, 216, 263, -238, -316, 291, 328, -290, -279, 262, 234, -283, -229, 314, 315, -319, -257, 363, 226, -320, -161, 381, 173, -320, -201, 323, 101, -434, -169, 366, 212, -397, -69, 409, 91, -403, -41, 414, 84, -480, -60, 461, 38, -472, -59, 473, -14, -429, -69, 465, 63, -409, 20, 457, -18, -424, 55, 396, -92, -439, 168, 470, -87, -405, 165, 443, -134, -356, 143, 437, -227, -401, 179, 383, -213, -340, 213, 364, -239, -375, 292, 334, -305, -328, 295, 270, -386, -329, 412, 301, -333, -255, 361, 304, -355, -297, 340, 261, -384, -218, 387, 189, -441, -215, 464, 167, -429, -115, 485, 182, -467, -85, 512, 80, -497, -140, 490, 22, -545]
4530e45M94N17m12n50M87N02n21m87O15L83n82m01N76L79n73l37O07L32o38l31
4550d85O05L27o36k90P09J97o82k28P73J25o91j71Q02Q7p83m1P44K7p81M2P76
4571D26q3p47J34O66o3p99J74P54j92p70K25P69k69p26K65P48l40o49K59O84l18
4592A48p26M07P59m64o74N09N75m66o27N30N03m83n30N89N36n88n60O87M75o75
4612g5l74N75M27p82k68P16K85p07l41Q35K32p90k66Q12J72q36l7P21J37q22p7
4633d63Q82Jq30l6Q62l1q05M8Q09o6q89J86Q25j73q17K66P27k04p99K77P31k89
4655B12q10M01Q28m63p11M80O46m78p20N89N53m87o33N73O00o61n32N99O06p22
4675a30m67P13M18o87l93P03L81p09l14O96K77p50k14P63J80p34k17P95J44q27
$$ y = [-545, -51, 466, 54, -496, -9, 493, -28, -515, 100, 483, -99, -500, 76, 455, -118, -455, 152, 484, -154, -485, 120, 447, -189, -479, 230, 427, -255, -483, 290, 415, -276, -447, 355, 442, -341, -382, 362, 389, -392, -350, 426, 343, -404, -270, 396, 333, -466, -292, 462, 270, -500, -275, 494, 225, -501, -236, 512, 172, -477, -218, 466, 148, -578, -171, 588, 124, -550, -41, 534, 68, -559, -29, 474, -9, -539, 50, 586, -2, -562, 125, 600, -75, -449, 126, 553, -229, -497, 219, 504, -203, -544, 291, 523, -267, -533, 279, 451, -385, -422, 299, 436, -386, -463, 419, 420, -410, -446, 416, 385, -420, -372, 437, 371, -518, -332, 493, 320, -497, -231, 496, 292, -507, -230, 501, 212, -598, -197, 631, 168, -543, -63, 583, 105, -615, -26, 527, 40, -593, -20, 580, -81, -613, -14, 592, -130, -597, 116, 534, -153, -546, 157, 538, -171, -485, 211, 488, -262, -476, 287, 467, -267, -484, 311, 455, -372]
4695c72n0P47O8p67n3Q24K4p93N7P53j03q05J72Q15k10p56J82P22k39o87K48P62
4717E39l55p21L92N86l59n99M01O19l96o41N35N11m87m83M28N29n37m12N10M33
4737D93n67l98N88L22n89l35O75L14o95k55P17J60o70k32O90J78o55r0O21J23
4757C95o42p5O25L7o45OO16k8o18N1N91m7o29R6O39j72n08J47M91j39n26J69N30
4780C64k51n14K52N50l09m46L00M35l50m23L70L22k99l40K93M45m62k88M07K53
4800C09m47k73M74K67m12k71M23J88l53j95M10K03m21j87M62R4m07p6L76R3m38
4821a81n7M24K7l21n1L66k7l45K3L34l0l37L1K68l6k88R0L00j22k38J50J52q3
4844D9k70J78K29j29k47J66J70n7k32J08J15n7j32J00J02o5j54J63J57j77j31
$$ y = [-372, -422, 325, 393, -374, -427, 397, 421, -372, -315, 438, 335, -470, -298, 517, 307, -449, -267, 455, 216, -471, -223, 539, 184, -537, -145, 441, 82, -517, -116, 503, 107, -534, 1, 512, 25, -458, -30, 499, -38, -450, 60, 493, -74, -472, 116, 438, -151, -486, 189, 503, -192, -447, 270, 430, -240, -472, 218, 396, -259, -349, 272, 395, -247, -322, 303, 340, -305, -299, 317, 289, -329, -278, 313, 266, -363, -267, 372, 200, -308, -161, 330, 191, -335, -166, 364, 113, -401, -149, 401, 92, -354, -54, 381, 31, -392, -22, 300, 1, -339, -46, 399, -63, -351, 56, 309, -138, -411, 63, 330, -82, -353, 70, 258, -95, -290, 120, 323, -98, -285, 177, 271, -136, -212, 164, 257, -181, -238, 186, 213, -108, -159, 207, 180, -165, -142, 192, 162, -175, -144, 124, 88, -200, -110, 190, 68, -170, -20, 132, 49, -221, -43, 186, 57, -190, -24, 146, 89, -143, -35, 80, 23, -109, -9, 93, 28, -126, 37, 194, 17, -114]
4865a14J15M3j24k4J29Q2j66o5J47O7j28o6Q3J25j88RQ3M8n3j00P7Q6j19%M2J10
4891I9j40K0k7P4o4l5N6L9l2pO6J7j01QN3j5L1p1j5M6J15j47k1J22J0j55QO2Q0
4920G6j29L4Q0M0j47l5J27Q5j34r6J52qq7l7J54k4j64kJ89J1k05RK21n9j73O3
4946e9J54j8k33Q1K10k7j60K4K12r3j85N6J78j30j90J04K29o8k94J93J93j20k38
4969a81J67K02k11j93K20J64k24j10J61K24l07j55L10J75l35p7K31J17l29n0L06
4990A05P4l13n3L19M3l03r7L97J3l47%K98Q2l98K6L60l8l50k0L60j6l95P1M29
5014B47j03l37O9K96l8m12J50L97j68l42J41L80k07l43K25L64k75k68K31K52k32
5035B7l20L06K45k94j97K67K13k52k84L09K74l25k33L05K26l53j53L60Q3k94j57
$$ y = [-114, 1, 44, -80, -104, 25, 107, -59, -124, 23, 90, -38, -104, -21, 104, -84, -75, 8, 56, 3, -97, -20, 66, -53, -53, -11, 99, -41, -21, -48, 26, -38, -73, -17, 22, -10, -17, 49, 66, -35, -27, 26, 11, 42, -29, -44, 2, 117, -30, -51, 71, 81, -74, -66, -4, 76, -53, -19, 61, 101, -46, -81, 46, 131, -3, -99, 53, 45, -42, -79, 75, 51, -113, -115, 74, 85, -120, -111, 110, 51, -122, -59, 95, 77, -156, -75, 135, 108, -52, -28, 184, 91, -94, -38, 140, 10, -180, -76, 153, 85, -209, -16, 177, 57, -181, -14, 188, -23, -216, 4, 168, -56, -166, -5, 219, -88, -243, 67, 242, -93, -170, 61, 178, -151, -201, 105, 179, -134, -187, 132, 175, -128, -225, 172, 185, -162, -162, 136, 218, -180, -154, 206, 168, -182, -202, 158, 142, -253, -182, 247, 144, -193, -124, 172, 134, -278, -128, 269, 101, -241, -100, 280, 73, -270, -45, 319, 44, -224, 7, 259, 27, -293, 13, 258, -36, -233, 34, 247, -5, -289, 20, 294, -31, -264, 41, 267, -86, -239, 121, 204, -90, -247]
5056b47L50J60l91j16M10N6l89m7L40R0m17j5L82Nl64lM01m0l40ML93q7l19O6
5080a18L13p5k85P0L29j34l30J07L52j52l11J95K69j69k81J54K86j69l32K79J57
5101A55j84j95K52K20k71k44K78J90j66k96K62K37k72j88L14J34k81j49K62Q3
5121A41j96j18L08M3l03l6K53R8k70p6K58J4k77k5K85O5l23L7K53Ml03O7K30j3
5145A16l10R0K73q9k50O6K86j39j98J13J67q3j96J37J77j31j94J41J81j14j03
5166f0O0J17q8j55J07J34q9j74J47J41j43j01J08Q1j16j25J78O8j35q3J20J48
$$ y = [-247, 103, 263, -128, -244, 166, 222, -167, -214, 126, 216, -201, -216, 166, 171, -193, -196, 205, 165, -175, -171, 222, 135, -184, -118, 195, 120, -165, -95, 234, 100, -230, -123, 229, 77, -234, -39, 230, 61, -220, -66, 220, 51, -281, -2, 155, -29, -224, 28, 248, -23, -267, 11, 201, 35, -261, 1, 238, -34, -222, 92, 226, -55, -204, 58, 141, -55, -173, 135, 178, -125, -161, 92, 190, -80, -156, 102, 116, -161, -186, 99, 164, -159, -122, 131, 135, -168, -101, 129, 116, -194, -104, 169, 80, -170, -104, 182, 43, -155, -42, 125, 42, -154, -17, 160, 29, -165, -24, 157, 43, -60, 0, 117, 29, -126, -19, 115, 26, -148, -1, 140, -3, -104, 4, 85, -31, -156, 22, 90, -45, -128, -8, 140]
$$ [...]
8191b2
##END NTUPLES=NMR FID
##END=
