##TITLE=1H_AM_NV50.2
 CDCl3
 8 sc, 
 8.6.2023
##JCAMPDX= 6.0         $$ Bruker NMR JCAMP-DX V2.0
##DATA TYPE= NMR FID
##DATA CLASS= NTUPLES
##ORIGIN= UXNMR, Bruker Analytische Messtechnik GmbH
##OWNER= root
$$ XWIN-NMR		Version 3.5
$$ Thu Jun  8 15:39:14 2023 Russian Standard Time (UT+4h)  she@DPX200
##.OBSERVE FREQUENCY= 200.13135
##.OBSERVE NUCLEUS= ^1H
##.DELAY= (6, 6)
##.ACQUISITION MODE= SIMULTANEOUS
##.ACQUISITION SCHEME= undefined
##.AVERAGES= 8
##.DIGITISER RES= 18
##SPECTROMETER/DATA SYSTEM= spect
##.PULSE SEQUENCE= zg30
##.SOLVENT NAME= CDCl3
##.SHIFT REFERENCE= (INTERNAL, CDCl3, 0, 15.7039)
##AUDIT TRAIL= $$ (NUMBER, WHEN, WHO, WHERE, WHAT)
$$ ##TITLE= Audit trail, XWIN-NMR		Version 3.5
$$ ##JCAMPDX= 5.01
$$ ##ORIGIN= Bruker BioSpin GmbH
$$ ##OWNER= she
$$ F:/spectra/data/she/nmr/H-F/1/audita.txt
$$ ##AUDIT TRAIL=  $$ (NUMBER, WHEN, WHO, WHERE, WHAT)
(   1,<2023-06-08 15:37:48.29 +0400>,<she>,<DPX200>,
      <created by zg, POWCHK disabled, PULCHK disabled
       configuration hash MD5:
       00 E9 B6 7A A2 85 ED C7 34 08 36 98 17 FE 4E 26
       data hash MD5: 16K
       46 2C F7 E7 97 30 83 25 16 BC DB 96 F6 A9 C7 4A>)
$$ ##END=
$$ 
$$ hash MD5
$$ 40 A1 56 4D DD F8 58 CD 38 43 8B EE 85 41 96 70
##$RELAX= 
##$RELAX= 
##$RELAX= 
##$RELAX= 
##$RELAX= 
##$RELAX= 
$$ Bruker specific parameters
$$ --------------------------
##$DU= <F:/spectra>
##$EXPNO= 1
##$NAME= <H-F>
##$PROCNO= 1
##$TYPE= <nmr>
##$USER= <she>
##$AMP= (0..31)
100 100 100 100 100 100 100 100 100 100 100 100 100 100 100 100 100 100 
100 100 100 100 100 100 100 100 100 100 100 100 100 100 
##$AQSEQ= 0
##$AQ_mod= 1
##$AUNM= <au_zg>
##$AUTOPOS= <>
##$BF1= 200.13
##$BF2= 200.13
##$BF3= 200.13
##$BF4= 200.13
##$BF5= 200.13
##$BF6= 200.13
##$BF7= 200.13
##$BF8= 200.13
##$BYTORDA= 1
##$CFDGTYP= 0
##$CFRGTYP= 5
##$CHEMSTR= <none>
##$CNST= (0..31)
1 1 145 1 1 1 1 1 1 1 1 1 1 1 1 1 1 1 1 1 1 1 1 1 1 1 1 1 1 1 1 1 
##$CPDPRG= <>
##$CPDPRG1= <>
##$CPDPRG2= <>
##$CPDPRG3= <>
##$CPDPRG4= <mlev>
##$CPDPRG5= <mlev>
##$CPDPRG6= <mlev>
##$CPDPRG7= <mlev>
##$CPDPRG8= <mlev>
##$CPDPRGB= <>
##$CPDPRGT= <>
##$D= (0..31)
0 1.2 0 0 0 0 0 0 0 0.06 0 0.03 0 0 0 0 0.0002 0 0 0 0 0 0 0 0 0 0 0 0 
0 0 0 
##$DATE= 1686224267
##$DBL= (0..7)
120 120 120 120 120 120 120 120 
##$DBP= (0..7)
150 150 150 150 150 150 150 150 
##$DBP07= 0
##$DBPNAM0= <>
##$DBPNAM1= <>
##$DBPNAM2= <>
##$DBPNAM3= <>
##$DBPNAM4= <>
##$DBPNAM5= <>
##$DBPNAM6= <>
##$DBPNAM7= <>
##$DBPOAL= (0..7)
0.5 0.5 0.5 0.5 0.5 0.5 0.5 0.5 
##$DBPOFFS= (0..7)
0 0 0 0 0 0 0 0 
##$DE= 6
##$DECBNUC= <off>
##$DECIM= 32
##$DECNUC= <off>
##$DECSTAT= 4
##$DIGMOD= 1
##$DIGTYP= 9
##$DL= (0..7)
0 120 120 120 120 120 120 120 
##$DP= (0..7)
150 150 150 150 150 150 150 150 
##$DP07= 0
##$DPNAME0= <>
##$DPNAME1= <>
##$DPNAME2= <>
##$DPNAME3= <>
##$DPNAME4= <>
##$DPNAME5= <>
##$DPNAME6= <>
##$DPNAME7= <>
##$DPOAL= (0..7)
0.5 0.5 0.5 0.5 0.5 0.5 0.5 0.5 
##$DPOFFS= (0..7)
0 0 0 0 0 0 0 0 
##$DQDMODE= 0
##$DR= 18
##$DS= 0
##$DSLIST= <SSSSSSSSSSSSSSS>
$$ [...]
##$SUBNAM2= <"">
##$SUBNAM3= <"">
##$SUBNAM4= <"">
##$SUBNAM5= <"">
##$SUBNAM6= <"">
##$SUBNAM7= <"">
##$SUBNAM8= <"">
##$SUBNAM9= <"">
##$SW= 18.05172834244
##$SWIBOX= (0..15)
0 0 2 0 0 0 0 0 0 0 0 0 0 0 0 0 
##$SW_h= 3612.71676300578
##$TD= 16384
##$TD0= 1
##$TE= 0
##$TE2= 300
##$TE3= 300
##$TEG= 300
##$TL= (0..7)
0 120 120 120 120 120 120 120 
##$TP= (0..7)
150 150 150 150 150 150 150 150 
##$TP07= 0
##$TPNAME0= <>
##$TPNAME1= <>
##$TPNAME2= <>
##$TPNAME3= <>
##$TPNAME4= <>
##$TPNAME5= <>
##$TPNAME6= <>
##$TPNAME7= <>
##$TPOAL= (0..7)
0.5 0.5 0.5 0.5 0.5 0.5 0.5 0.5 
##$TPOFFS= (0..7)
0 0 0 0 0 0 0 0 
##$TUNHIN= 0
##$TUNHOUT= 0
##$TUNXOUT= 0
##$USERA1= <user>
##$USERA2= <user>
##$USERA3= <user>
##$USERA4= <user>
##$USERA5= <user>
##$V9= 5
##$VALIST= <valist>
##$VCLIST= <CCCCCCCCCCCCCCC>
##$VD= 0
##$VDLIST= <DDDDDDDDDDDDDDD>
##$VPLIST= <PPPPPPPPPPPPPPP>
##$VTLIST= <TTTTTTTTTTTTTTT>
##$WBST= 1024
##$WBSW= 4
##$XGAIN= (0..3)
0 0 0 0 
##$XL= 0
##$YL= 0
##$YMAX_a= 586198
##$YMIN_a= -617314
##$ZGOPTNS= <>
##$ZL1= 120
##$ZL2= 120
##$ZL3= 120
##$ZL4= 120
##$ABSF1= 10
##$ABSF2= 0
##$ABSG= 5
##$ABSL= 3
##$ALPHA= 0
##$AQORDER= 0
##$ASSFAC= 0
##$ASSFACI= 0
##$ASSFACX= 0
##$ASSWID= 0
##$AUNMP= <proc_1d>
##$AZFE= 0.1
##$AZFW= 0.1
##$BCFW= 1
##$BC_mod= 2
##$BYTORDP= 1
##$COROFFS= 0
##$CY= 11.3945322036743
##$DATMOD= 1
##$DC= 2
##$DFILT= <>
##$DTYPP= 0
##$F1P= 15.7292609196834
##$F2P= 12.9074282941183
##$FCOR= 0.5
##$FTSIZE= 0
##$FT_mod= 4
##$GAMMA= 1
##$GB= 0.15
##$INTBC= 1
##$INTSCL= 1
##$ISEN= 128
##$LB= 0.24
##$LEV0= 0
##$LPBIN= 0
##$MAXI= 10000
##$MC2= 0
##$MEAN= 0
##$ME_mod= 0
##$MI= 1.114404
##$NCOEF= 0
##$NC_proc= 0
##$NLEV= 6
##$NOISF1= 3.799351
##$NOISF2= 2.8
##$NSP= 1
##$NTH_PI= 0
##$NZP= 0
##$OFFSET= 15.70392
##$PC= 1
##$PHC0= -20424.39
##$PHC1= 11.45272
##$PH_mod= 1
##$PKNL= yes
##$PPARMOD= 0
##$PSCAL= 0
##$PSIGN= 0
##$REVERSE= no
##$SF= 200.130013532006
##$SI= 16384
##$SIGF1= 3
##$SIGF2= 2
##$SINO= 400
##$SIOLD= 16384
##$SREGLST= <1H.CDCl3>
##$SSB= 0
##$STSI= 0
##$STSR= 0
##$SW_p= 3612.71676300578
##$SYMM= 0
##$S_DEV= 0
##$TDeff= 0
##$TDoff= 0
##$TI= <>
##$TILT= no
##$TM1= 0
##$TM2= 0
##$TOPLEV= 0
##$USERP1= <user>
##$USERP2= <user>
##$USERP3= <user>
##$USERP4= <user>
##$USERP5= <user>
##$WDW= 1
##$XDIM= 8192
##$YMAX_p= 0
##$YMIN_p= 0
$$ End of Bruker specific parameters
$$ ---------------------------------
##NTUPLES= NMR FID
##VAR_NAME=  TIME,          FID/REAL,        FID/IMAG
##SYMBOL=    X,             R,               I
##VAR_TYPE=  INDEPENDENT,   DEPENDENT,       DEPENDENT
##VAR_FORM=  AFFN,          ASDF,            ASDF
##VAR_DIM=   8192,          8192,            8192
##UNITS=     SECONDS,       ARBITRARY UNITS, ARBITRARY UNITS
##FACTOR=    0.0002768,     1,               1
##FIRST=     0,             0,               0
##LAST=      2.2672688,     0,               0
##MIN=       0,             -617314,         0
##MAX=       2.2672688,     586198,          0
$$ Real data points
##PAGE= N=1
##DATA TABLE= (X++(R..R)), XYDATA
0 0 0 0 0 0 0 0 0 0 0 0 0 0 0 -8 8 -8 8 -8 16 -16 17 -24 27 -33 40 -46 54 -65 75 -87 101 -115 132 -152 171
35 171 -194 220 -248 279 -311 347 -387 433 -481 533 -588 651 -722 795 -876 963 -1061 1169
53 1169 -1286 1416 -1558 1717 -1898 2101 -2328 2587 -2885 3227 -3627 4077 -4558 4959 -4745
68 -4745 889 43844 586198 -212272 -465053 554341 41542 -537772 324967 277182 -494929
79 -494929 89026 372646 -327238 -115144 354584 -129535 -207372 222763 41150 -181874
89 -181874 56073 99712 -53899 -68157 39608 88653 -78074 -98710 171987 17471 -232620
100 -232620 149966 173290 -305918 31180 324786 -280279 -152167 416720 -149399 -337501
110 -337501 401727 56171 -455244 271656 263446 -457546 68593 398737 -348644 -134809
120 -134809 425816 -172555 -276875 351519 11531 -324481 209921 147809 -275780 53403
130 53403 196431 -161530 -58529 153683 -38984 -87736 57607 36758 -38849 -36510 39534
141 39534 50564 -85124 -23825 134950 -66606 -124122 173782 17603 -217198 141811 138542
152 138542 -258457 41719 247514 -224160 -92471 300781 -123681 -213842 280581 10415
162 10415 -285155 195354 138488 -287754 70779 223921 -223331 -55106 242917 -115972
172 -115972 -141872 195895 -6069 -165897 110064 68382 -131539 23244 88857 -64349
182 -64349 -33590 59712 4631 -44266 353 47217 -8782 -60464 44730 55386 -93010 -3667
194 -3667 116734 -78895 -77425 145596 -21030 -145148 128126 60012 -180456 68434 136729
205 136729 -170531 -16539 184119 -116032 -101520 185691 -32403 -158580 140585 53644
215 53644 -169560 65757 113740 -135282 -11977 131328 -73250 -67862 107307 -7147 -86831
226 -86831 56260 40513 -67486 416 54432 -22297 -37686 32317 26094 -43075 -12917 55168
238 55168 -14988 -58638 52200 33439 -83564 18158 81292 -76430 -34575 108247 -38246
249 -38246 -86949 102374 18956 -118835 64023 76210 -117245 5564 113322 -82324 -53580
260 -53580 117417 -26911 -94013 88258 30022 -103531 38120 70209 -81114 -14686 81953
271 81953 -37297 -52086 63698 10062 -62490 24864 42889 -44730 -16919 50020 -8321 -44391
283 -44391 30881 30433 -47036 -5293 54524 -24890 -42974 54101 12974 -66316 28822 51506
295 51506 -64968 -11873 75381 -38510 -52646 74481 3434 -78580 48458 45861 -79778
306 -79778 6698 73741 -55981 -35774 77740 -15926 -64306 57383 25523 -69905 20901
317 20901 53782 -52189 -17673 60096 -19143 -44197 44044 15931 -49912 13491 39380 -34617
329 -34617 -18754 43120 -5868 -39848 26917 24178 -41872 -1849 43544 -24389 -31338 44305
341 44305 5364 -49876 25997 35778 -49878 -4520 55151 -30971 -35629 56117 36 -56162
353 -56162 38032 31922 -58631 7549 53390 -42590 -24522 57310 -13754 -46869 42716 16941
365 16941 -51844 15823 38275 -38919 -12823 43116 -14043 -32234 31040 12389 -35878 7978
377 7978 30216 -23388 -16557 32743 -288 -32813 19278 24105 -33764 -4899 39509 -18873 -29838
390 -29838 39244 6152 -45505 23419 31478 -46101 -2036 48132 -31319 -28365 50328 -6305
402 -6305 -46672 37240 20606 -50470 13304 39732 -38578 -12266 44315 -16459 -29914 34221
414 34221 6722 -34151 14801 22573 -25214 -6087 26054 -7213 -20483 16328 12561 -22618
426 -22618 -2719 25372 -10814 -22797 24720 9739 -34419 10850 30012 -32731 -10619 42349
438 42349 -18488 -32106 42345 3959 -46620 29286 27850 -48635 6447 44514 -36411 -17657
450 -17657 47652 -15134 -33994 37437 6226 -38104 19723 20718 -31043 1451 24925 -16623
462 -16623 -11466 18519 -620 -14062 4401 9549 -5078 -10031 8090 10539 -16409 -4019 24003
475 24003 -11166 -20683 29019 3183 -34968 23575 21989 -42084 8268 39852 -38309 -13611
487 -13611 50321 -22712 -35060 47877 105 -47552 33423 21012 -47420 13607 33824 -37400
499 -37400 -4672 36970 -22242 -17414 31270 -6295 -21760 19055 5023 -16168 6000 6502 -4549
512 -4549 -425 -1506 4898 2934 -12669 6775 13234 -20830 370 25884 -22477 -12795 36644
525 36644 -15465 -29952 40604 772 -45435 33546 21928 -52163 16346 40290 -47001 -4701
537 -4701 50026 -32803 -23409 49841 -14513 -35989 41217 3514 -40094 26683 16795 -35302 11505
550 11505 21530 -24940 1561 18127 -15479 -735 11648 -11285 2168 7101 -12591 6726
562 6726 6866 -17596 9978 11681 -24665 8962 21784 -30035 650 33956 -28629 -13832 42446
575 42446 -18725 -29189 43183 -3624 -40534 36481 12533 -46202 24142 27145 -45134 7936
587 7936 37296 -36323 -8233 39499 -22522 -19064 33808 -9602 -22151 24947 -1684 -19878
599 -19878 17660 1265 -15913 13553 887 -12309 12865 -1762 -11141 16148 -4222 -15119
611 -15119 21536 -2138 -23819 24312 6432 -32997 20643 18941 -37889 10663 30911 -36768
623 -36768 -2898 39849 -29826 -17752 43972 -17213 -31220 41070 -957 -39347 30968 14110
635 14110 -39627 17114 23600 -33398 4632 26642 -24448 -3949 25033 -15841 -8347 20372
647 20372 -9306 -8565 14776 -6891 -5568 11617 -8758 -2657 13194 -12597 -3419 18558 -14501
660 -14501 -8786 24505 -12143 -17351 28204 -5253 -26485 27767 5678 -33949 21818 18588 -36635
673 -36635 10350 29802 -32820 -3874 35507 -23125 -16619 34675 -10658 -24641 28439 1093
685 1093 -26900 19020 9427 -24205 9473 12642 -18041 3052 11089 -11786 1446 7269 -8670
698 -8670 3904 4458 -9940 7377 5000 -14444 8944 9381 -19386 6873 16845 -22111 299
711 299 24910 -20388 -10053 30145 -13283 -21255 29945 -2116 -29393 23880 10247 -32005 13692
724 13692 20386 -28685 1889 25716 -20855 -8483 25231 -10766 -14785 19964 -1491 -15471
736 -15471 12559 3892 -11873 6212 4395 -6792 3068 1148 -3163 4128 -3069 -2672 8328 -5563
750 -5563 -6259 13203 -4219 -12843 15777 1433 -19795 13852 10177 -23751 7188 19371 -22586
763 -22586 -2684 25488 -16185 -13033 26422 -6240 -20826 21754 4376 -23744 13170 12758 -21090
776 -21090 3611 16608 -14596 -4062 15384 -7199 -7943 10578 -1470 -7386 4982 980 -3564
789 -3564 1295 -325 901 925 -4242 3236 4035 -8386 1957 9298 -10089 -2763 14419 -8003 -9406
804 -9406 16946 -2167 -16047 15111 5737 -20011 9101 13461 -19656 657 18641 -14750 -7795
817 -7795 19772 -7025 -13992 16350 1068 -16216 9923 7323 -14216 2920 10055 -9087 -2164
830 -2164 8842 -3281 -3970 4910 527 -2541 397 1046 1228 -2148 -1437 4998 -1403 -5928 6855
845 6855 2380 -10261 5077 7891 -12378 -46 13192 -10531 -6935 15888 -4908 -13126 14720
858 14720 2595 -16762 9785 9802 -16712 2639 14577 -12841 -4700 15636 -6321 -9688 12981
871 12981 365 -11366 7741 4826 -9658 2259 6098 -5965 -1419 4600 -1849 -2236 1428 782
885 782 -306 -1977 567 3301 -3563 -2463 6626 -2107 -6792 7933 2047 -10408 6174 7435 -11942
900 -11942 1611 12137 -10578 -4636 14683 -6093 -10672 13964 388 -14329 9818 6835 -14517
913 -14517 3656 10829 -11423 -2249 11625 -6616 -6159 9714 -1625 -7304 6167 1899 -5744
926 -5744 2389 2749 -2567 -9 815 512 590 -2537 1395 3559 -4850 -492 7155 -5040 -4462 9682
942 9682 -2764 -9005 10027 1752 -12911 7763 7478 -14461 2718 12735 -12552 -3774 15198
955 15198 -7613 -9267 14258 -1577 -12397 10887 3912 -12819 6204 7648 -10849 1314 8975
968 8975 -7241 -2353 7667 -3345 -3476 4677 -1164 -2104 2087 -1282 199 1284 -3240 1740 2426
983 2426 -5662 1862 5203 -7548 76 8945 -7742 -3843 12197 -5294 -8827 13096 -572 -12949
997 -12949 10938 4982 -14770 6696 9814 -14115 1459 12817 -11338 -3769 13558 -7044 -7619
1010 -7619 11944 -2538 -9162 8944 701 -8505 6021 2014 -6984 4333 1999 -5906 3995 1609
1024 1609 -5534 4544 1424 -6436 5448 2385 -8427 5750 4933 -10797 4188 8558 -11851
1037 -11851 525 12138 -10745 -4129 14366 -7690 -8776 14693 -3310 -12616 13126 1808
1049 1808 -14763 9597 6668 -14547 4916 9877 -12138 628 10848 -8828 -2292 10144 -6022
1062 -6022 -3671 8733 -3947 -4031 7287 -2952 -3727 6482 -3059 -3360 6855 -3763 -4240 8415
1076 8415 -3761 -6685 10025 -1915 -9885 10370 1571 -12702 8883 5914 -14355 5877 10367
1089 10367 -14416 1297 13948 -12198 -3950 15676 -8158 -8590 15005 -3388 -11400 12494 729
1102 729 -12430 9274 3828 -12098 6163 5803 -10967 3488 6716 -9324 1722 6776 -8111
1115 -8111 911 6956 -7708 394 7755 -7767 -687 9073 -7447 -2595 10595 -6481 -5058 11680
1129 11680 -4592 -8041 12094 -1718 -10999 11045 2058 -13185 8446 6072 -13698 4767 9273
1142 9273 -12519 873 11152 -10165 -2738 11725 -7180 -5326 11068 -4144 -6781 9646 -1681
1155 -1681 -7149 8152 -194 -7113 7115 572 -7250 6604 1207 -7918 6347 2365 -9037 5764
1169 5764 4119 -10140 4591 6520 -10881 2333 9191 -10634 -852 11550 -9000 -4379 12678
1182 12678 -6087 -7754 12543 -2406 -10229 10920 1420 -11527 8293 4701 -11544 5126 6997
1195 6997 -10315 2032 8209 -8536 -442 8344 -6748 -2193 7908 -5162 -3186 7417 -4054
1208 -4054 -3789 7159 -3236 -4369 7251 -2517 -5361 7618 -1463 -6629 7737 267 -8237 7350
1222 7350 2527 -9590 5972 5133 -10277 3614 7659 -10020 580 9572 -8431 -2607 10373
1235 10373 -6069 -5425 10091 -3256 -7379 8788 -425 -8245 6926 1831 -8229 4959 3469
1248 3469 -7547 3286 4329 -6703 2028 4822 -5966 982 5164 -5514 228 5639 -5210
1261 -5210 -797 6276 -4866 -2075 6945 -4229 -3676 7507 -2954 -5499 7542 -1080 -7183 6957
1275 6957 1260 -8430 5574 3696 -8767 3516 5843 -8245 1124 7429 -6841 -1413 8021 -4953
1289 -4953 -3422 7645 -2752 -4735 6555 -841 -5343 5165 459 -5252 3876 1258 -4940 3001
1303 3001 1680 -4672 2493 1954 -4599 2305 2424 -4912 1952 3434 -5241 1246 4774 -5279 -150
1318 -150 6071 -4748 -1965 6981 -3478 -4082 7230 -1615 -5827 6508 673 -7054 4907 2855
1332 2855 -7217 2768 4505 -6579 704 5433 -5305 -934 5599 -3791 -2231 5370 -2228 -2964
1346 -2964 4576 -1046 -3049 3839 -474 -2949 3484 -156 -3158 3431 151 -3617 3346 877 -4132
1361 -4132 2929 1657 -4716 2430 2710 -5311 1359 4159 -5262 -257 5519 -4303 -2240 6059 -2658
1376 -2658 -3846 5718 -794 -4872 4808 1014 -5348 3526 2624 -5150 1782 3629 -4254 285 3647
1391 3647 -3174 -528 3169 -2426 -796 2888 -2248 -950 2904 -2092 -1184 3028 -1943 -1530 3415
1406 3415 -1829 -2093 4015 -1453 -3299 4545 -138 -4590 4073 1703 -5275 2817 3301 -5344 1309
1421 1309 4483 -4929 -374 5377 -4030 -2324 5770 -2277 -3987 5078 -282 -4652 3596 1103 -4416
1436 -4416 2461 1836 -4028 1571 2451 -3542 735 2796 -2752 -43 2543 -2172 44 2110 -2116
1451 -2116 172 2426 -2590 -223 3351 -2660 -1245 3878 -2027 -2294 3893 -1349 -3130 3961 -545
1466 -545 -4101 3795 997 -5032 2806 2782 -4921 1131 3752 -3979 -197 3913 -3077 -826 3955 -2466
1482 -2466 -1611 4116 -1638 -2447 3674 -611 -2796 2979 -114 -2689 2748 -229 -3034 2987 346
1497 346 -3844 2838 1557 -4413 2009 2639 -4371 1037 3357 -4205 309 4272 -4018 -932 5331
1512 5331 -3174 -2641 5648 -1551 -4050 4891 24 -4607 3872 1173 -4804 2886 2157 -4910 1751
1527 1751 3221 -4486 321 3718 -3481 -722 3422 -2612 -972 3214 -2252 -1122 3404 -1946 -1662
1542 -1662 3682 -1428 -2261 3552 -907 -2589 3649 -539 -3341 3809 252 -4308 3517 1681 -5165
1557 -5165 2499 3059 -5181 1029 4089 -4808 -195 4815 -4167 -1520 5459 -3108 -2950 5592 -1563
1572 -1563 -4058 4970 -50 -4586 4081 1138 -4698 3205 1977 -4793 2290 2880 -4599 1229 3548
1587 3548 -4170 155 3835 -3631 -592 3951 -3286 -1315 4310 -2806 -2282 4683 -1926 -3232 4621
1602 4621 -835 -4033 4350 371 -4690 3792 1659 -5225 2924 3035 -5233 1580 4123 -4749 71
1617 71 4723 -3893 -1247 4752 -2917 -2170 4610 -1991 -2927 4268 -1028 -3414 3896 -293 -3658 3411
1633 3411 362 -3793 3098 994 -4057 2781 1804 -4335 2259 2790 -4503 1379 3609 -4510 251
1648 251 4423 -4050 -1020 5080 -3374 -2390 5371 -2152 -3716 5151 -721 -4641 4440 804 -5220
1663 -5220 3379 2133 -5230 2255 3254 -4777 955 3964 -4080 -204 4240 -3237 -1061 4212 -2493
1678 -2493 -1681 4051 -1837 -2194 3855 -1298 -2689 3772 -758 -3284 3652 -153 -3796 3392 723
1693 723 -4418 2932 1813 -4700 2090 3062 -4726 934 3982 -4297 -289 4664 -3451 -1574 4919
1708 4919 -2399 -2664 4738 -1170 -3484 4246 -154 -3966 3480 848 -4151 2650 1606 -4162 1817
1723 1817 2246 -3964 1095 2790 -3732 409 3261 -3411 -314 3644 -2931 -1012 4034 -2350 -1834
1738 -1834 4216 -1664 -2612 4222 -758 -3405 3933 224 -4076 3273 1296 -4418 2413 2349 -4516 1402
1754 1402 3189 -4192 177 3771 -3511 -934 3977 -2604 -1802 3953 -1640 -2460 3679 -768 -2750
1769 -2750 3257 4 -3001 2781 642 -3127 2340 1107 -3250 1886 1639 -3367 1316 2181 -3349
1784 -3349 635 2788 -3267 -116 3293 -2930 -957 3683 -2286 -1912 3848 -1400 -2626 3714 -412
1799 -412 -3267 3278 563 -3639 2615 1508 -3780 1766 2253 -3618 925 2819 -3167 -13 3123
1814 3123 -2709 -786 3233 -2097 -1487 3161 -1434 -2077 3083 -795 -2366 2764 -202 -2593 2538
1829 2538 385 -2907 2222 1148 -3148 1659 1831 -3050 987 2401 -2961 228 2908 -2576 -594
1844 -594 3194 -2097 -1506 3309 -1360 -2191 2990 -428 -2615 2506 292 -2783 1996 864 -2783 1519
1860 1519 1378 -2792 927 1876 -2513 410 2106 -2188 -6 2289 -1913 -317 2490 -1684 -907 2689
1876 2689 -1275 -1543 2543 -700 -2027 2383 -127 -2377 2214 327 -2683 1822 1049 -2924 1252
1891 1252 1895 -2890 478 2439 -2402 -283 2715 -1972 -892 2901 -1507 -1626 2922 -642 -2283
1906 -2283 2568 258 -2526 1833 849 -2388 1257 1099 -2325 853 1440 -2276 355 1739 -1940 -240
1922 -240 1915 -1477 -500 1825 -1239 -591 1866 -1042 -888 2120 -715 -1450 2107 -86 -1793 1739
1938 1739 411 -1893 1352 644 -1969 1153 984 -2149 682 1574 -2086 -19 1938 -1615 -640 1903
1954 1903 -1145 -856 1809 -913 -1151 1917 -440 -1541 1845 115 -1680 1405 530 -1669 1128 666
1970 666 -1655 1053 812 -1862 749 1261 -1957 263 1700 -1830 -321 1857 -1517 -667 2110 -1329
1986 -1329 -1204 2359 -770 -1921 2271 197 -2312 1693 994 -2234 983 1394 -1979 472 1663 -1706
2002 -1706 -36 1935 -1351 -672 1834 -826 -1017 1500 -417 -960 1119 -352 -865 1159 -335 -1079
2018 -1079 1253 -70 -1264 1058 193 -1245 1005 388 -1407 1051 671 -1697 919 1276 -1874 364
2034 364 1805 -1677 -285 1942 -1271 -768 1987 -987 -1198 2052 -593 -1776 1960 161 -2141 1358
2050 1358 797 -2057 780 1130 -1797 478 1293 -1602 212 1529 -1559 -164 1803 -1169 -596 1793
2066 1793 -827 -741 1673 -622 -1032 1782 -461 -1535 1754 25 -1970 1467 682 -2117 901 1183
2082 1183 -2000 494 1476 -1882 34 1808 -1593 -466 1956 -1077 -880 1867 -525 -1113 1610 -254
2098 -254 -1204 1409 -40 -1259 1298 213 -1398 1031 477 -1473 821 677 -1499 610 850 -1573
2114 -1573 414 1178 -1636 68 1520 -1501 -339 1812 -1163 -784 1879 -813 -1141 1976 -379 -1598
2130 -1598 1851 150 -2014 1497 800 -2070 958 1230 -1909 475 1489 -1807 -29 1611 -1523
2145 -1523 -498 1770 -1182 -827 1702 -775 -1037 1512 -405 -1124 1535 -189 -1290 1447 96 -1463
2161 -1463 1287 467 -1647 1039 860 -1671 687 1101 -1636 314 1319 -1624 -72 1562 -1364 -547
2177 -547 1693 -1008 -954 1744 -624 -1155 1600 -291 -1383 1502 102 -1541 1365 569 -1668 987
2193 987 873 -1636 653 1179 -1522 336 1333 -1484 -80 1505 -1292 -395 1607 -1120 -737 1672
2209 1672 -765 -1001 1723 -483 -1300 1650 -114 -1652 1520 397 -1760 1260 771 -1859 848 1253
2225 1253 -1776 427 1586 -1578 -37 1721 -1298 -549 1760 -963 -1009 1635 -586 -1201 1413 -254
2241 -254 -1338 1328 48 -1450 1130 378 -1466 916 657 -1522 757 957 -1529 434 1237 -1477
2257 -1477 122 1530 -1289 -218 1686 -1124 -647 1731 -884 -981 1705 -491 -1313 1546 -93 -1647
2273 -1647 1391 332 -1774 1015 718 -1794 672 1108 -1628 340 1352 -1469 -47 1468 -1131
2288 -1131 -442 1560 -885 -706 1620 -678 -970 1470 -346 -1234 1361 -43 -1416 1125 315 -1537
2304 -1537 1007 667 -1737 688 1030 -1637 301 1358 -1506 -134 1582 -1164 -561 1669 -835 -849
2320 -849 1645 -470 -1108 1537 -117 -1262 1323 242 -1414 968 409 -1397 775 655 -1400 559
2336 559 868 -1435 266 1095 -1335 -78 1262 -1106 -292 1340 -950 -587 1420 -664 -863 1492
2352 1492 -322 -1079 1319 63 -1317 1156 435 -1358 884 716 -1473 546 1014 -1426 186 1294
2368 1294 -1286 -241 1417 -1034 -634 1429 -747 -841 1414 -463 -1040 1383 -51 -1261 1212 337
2384 337 -1320 922 593 -1270 648 806 -1295 402 1077 -1183 14 1210 -1064 -402 1343 -722
2400 -722 -734 1244 -425 -883 1120 -206 -997 959 101 -1156 777 394 -1106 561 641 -942 364
2417 364 654 -900 191 781 -887 108 926 -855 -214 1085 -642 -482 1085 -444 -642 1019 -354
2434 -354 -875 991 -39 -1035 905 235 -1152 671 549 -1027 423 681 -1046 261 907 -996 -21
2451 -21 1126 -846 -291 1201 -602 -606 1151 -284 -731 981 -117 -926 866 59 -1080 711 417
2468 417 -1116 436 677 -1057 206 731 -915 16 910 -766 -179 1059 -575 -453 1149 -247 -723
2485 -723 913 9 -757 754 131 -800 630 225 -869 506 415 -825 246 495 -778 60 424 -708
2503 -708 89 506 -633 9 682 -607 -75 760 -553 -335 921 -416 -522 894 -185 -680 901
2520 901 -13 -871 819 294 -1078 596 558 -1072 320 741 -902 61 870 -799 -227 936 -680
2537 -680 -462 1070 -445 -699 988 -161 -851 920 150 -854 703 304 -901 596 500 -949 327
2554 327 656 -833 86 764 -735 -101 768 -640 -197 786 -643 -434 869 -422 -610 840 -210
2571 -210 -686 773 45 -751 645 180 -836 593 451 -957 347 607 -817 204 713 -672 -24
2588 -24 702 -638 -162 743 -557 -365 778 -500 -533 838 -240 -663 737 -81 -780 680 149 -873
2606 -873 652 367 -988 546 589 -906 323 803 -827 48 842 -703 -123 960 -590 -377 963
2623 963 -460 -677 945 -165 -791 856 53 -877 707 288 -908 469 471 -917 274 612 -777
2640 -777 120 727 -646 -83 739 -470 -208 769 -381 -319 780 -328 -402 740 -200 -576 688 -110
2658 -110 -668 591 11 -761 512 195 -861 524 402 -838 302 580 -810 121 749 -799 -43
2675 -43 841 -597 -278 919 -487 -513 918 -259 -616 815 -69 -792 697 144 -825 553 339 -863
2693 -863 377 446 -803 221 610 -777 15 671 -625 -143 714 -492 -247 797 -360 -358 818 -323
2711 -323 -501 776 -135 -644 771 67 -778 602 270 -815 495 461 -891 248 580 -804 -42 675
2729 675 -650 -159 791 -511 -268 746 -385 -403 766 -267 -541 714 -88 -595 688 63 -635 634
2747 634 230 -737 562 351 -846 369 505 -809 197 638 -733 -6 705 -641 -226 797 -481
2764 -481 -460 820 -351 -573 819 -95 -724 715 171 -827 631 338 -791 392 486 -808 223 592
2782 592 -708 67 736 -575 -168 711 -543 -300 658 -358 -353 614 -242 -466 674 -120 -606 610 -26
2801 -26 -655 551 207 -780 425 356 -754 268 480 -718 129 695 -647 -88 719 -531 -291 693
2819 693 -321 -414 656 -224 -509 602 -101 -663 554 87 -676 477 207 -671 394 410 -643 224
2837 224 495 -701 123 684 -609 -48 800 -504 -203 740 -428 -360 758 -251 -538 734 -88 -692
2855 -692 611 54 -771 472 370 -812 279 485 -725 125 607 -612 -96 697 -496 -206 751 -351
2873 -351 -377 666 -131 -403 592 1 -460 519 2 -508 482 172 -638 312 310 -626 195 394 -546 124 425
2894 425 -505 21 542 -427 -97 620 -381 -303 630 -155 -418 572 -61 -450 552 10 -523 430 171 -598
2914 -598 407 274 -664 177 405 -581 63 508 -543 -58 505 -404 -183 556 -264 -340 630 -130 -492 575
2934 575 -42 -442 491 95 -515 348 213 -564 235 367 -569 98 461 -525 -12 526 -369 -167 535 -342
2954 -342 -231 524 -231 -384 513 -17 -469 444 170 -451 330 220 -388 227 202 -406 172 256 -409 111 344
2975 344 -399 -14 352 -330 -104 349 -338 -125 423 -279 -231 482 -136 -354 457 -74 -408 383 71 -480
2995 -480 338 144 -542 334 300 -572 181 414 -488 51 551 -418 -100 529 -283 -219 591 -206 -352 520 -59
3016 -59 -429 407 51 -484 330 165 -481 215 227 -373 149 293 -391 92 392 -390 -45 413 -287 -65 476
3037 476 -216 -157 473 -159 -322 436 -34 -430 392 60 -516 303 155 -413 196 179 -459 84 262 -409 47
3058 47 311 -392 -39 383 -256 -107 356 -223 -135 446 -156 -261 432 -130 -290 412 16 -379 298 53 -397
3079 -397 250 225 -470 216 259 -471 118 359 -464 -15 443 -376 -165 525 -225 -297 495 -140 -384 435 25
3100 25 -414 391 123 -475 248 236 -417 104 263 -322 14 316 -344 -109 310 -224 -80 375 -224 -161 335
3121 335 -123 -202 296 -63 -269 346 -70 -367 354 52 -397 313 172 -403 243 246 -386 127 273 -374 -6
3142 -6 327 -340 -49 386 -315 -84 309 -209 -227 401 -129 -334 369 23 -281 231 128 -297 233 139 -335
3163 -335 217 166 -303 170 253 -336 19 279 -272 -48 308 -262 -101 391 -199 -203 400 -106 -283 374 -4
3184 -4 -305 395 91 -366 278 228 -364 100 298 -336 58 334 -241 -54 301 -211 -108 242 -170 -146 246
3205 246 -151 -131 197 -107 -156 265 -121 -302 243 -28 -275 232 5 -296 238 149 -313 149 231 -320 115
3226 115 259 -291 4 381 -204 -94 362 -211 -170 362 -113 -266 346 35 -246 239 72 -351 250 82
3246 82 -323 88 158 -279 37 232 -223 31 247 -166 -56 252 -203 -23 319 -157 -69 329 -139 -159 277
3267 277 -57 -220 353 0 -339 203 85 -363 165 197 -384 72 245 -285 -72 270 -229 -117 308 -137
3287 -137 -111 276 -122 -180 284 -65 -183 261 1 -167 197 -43 -248 180 35 -209 183 58 -254 141 188
3308 188 -246 67 238 -245 15 242 -247 -17 331 -193 -80 341 -112 -192 350 -59 -232 253 44 -332
3328 -332 206 146 -322 169 211 -300 85 250 -261 -9 267 -224 -124 248 -167 -123 228 -55 -136 210 -38
3349 -38 -202 238 0 -198 182 35 -241 237 105 -231 123 150 -265 123 133 -245 -11 240 -237 -59 256
3370 256 -166 -124 277 -151 -161 209 -106 -218 210 29 -199 171 52 -172 126 105 -222 154 126 -251 126
3391 126 154 -213 21 195 -187 -36 192 -107 -13 198 -115 -109 191 -93 -166 219 -104 -217 254 45 -238 168
3413 168 54 -313 167 117 -269 61 185 -269 -49 289 -99 -112 273 -78 -160 228 -89 -82 197 49 -192 89
3435 89 30 -193 114 123 -191 28 62 -143 30 58 -174 44 101 -204 58 123 -164 5 191 -146 -81 153 -79
3458 -79 -78 174 -80 -171 220 -36 -199 199 60 -192 143 68 -222 128 111 -201 37 175 -197 -7 194 -231
3480 -231 -25 241 -138 -127 155 -36 -95 193 -38 -87 210 7 -194 150 51 -174 95 51 -212 59 90 -178
3502 -178 33 143 -198 -1 174 -202 -62 276 -168 -137 214 -47 -179 136 -10 -153 185 70 -148 118
3522 118 65 -200 137 54 -132 30 117 -88 -17 47 -126 26 127 -90 -79 157 -94 -60 114 -58 -90 127 -13
3545 -13 -58 145 -7 -161 152 49 -133 160 66 -156 102 70 -156 73 207 -209 10 153 -139 -30 309
3566 309 -151 -117 229 -85 -139 209 39 -119 126 97 -206 125 97 -189 80 74 -115 67 167 -124 -48 177
3588 177 -117 6 135 -119 -38 179 -70 -105 105 -107 -150 164 -60 -123 187 -13 -109 139 20 -105 145 10
3610 10 -168 96 126 -165 58 162 -84 19 155 -58 -59 165 -34 -82 146 -57 -112 162 -41 -77 69 7 -131
3633 -131 61 86 -138 72 67 -148 7 42 -159 40 112 -162 28 101 -119 -37 162 -46 -88 160 -33 -116 136
3656 136 -8 -162 103 65 -122 68 53 -134 -33 105 -139 -20 70 -55 -36 97 -86 14 96 -45 -15 94
3678 94 -15 -40 129 -39 -76 116 -8 -133 99 62 -95 48 31 -152 97 43 -96 88 44 -102 26 71 -118
3701 -118 -47 93 -82 -72 155 -71 -99 177 -10 -107 158 -53 -135 83 83 -115 60 96 -99 -24 60 -74 -49 73
3725 73 -123 44 114 -127 -1 76 -78 -37 147 -79 -66 127 -99 -103 123 -2 -86 93 21 -139 57 87 -153
3748 -153 25 68 -88 -27 94 -89 -26 153 -81 2 68 -86 -52 68 -63 -124 54 72 -82 36 -16 -91 46
3771 46 0 -66 -13 3 -88 54 100 -73 67 86 -61 47 36 -144 23 53 -66 11 125 -10 -14 112 -33 -99 105
3796 105 11 -109 66 -19 -113 20 64 -65 20 88 -68 37 78 -30 -21 92 -73 -38 75 -108 -16 83 -56 -28
3820 -28 106 -24 -1 129 32 -32 125 32 -124 87 20 -91 65 97 -62 12 60 -78 26 99 -53 20 55 -63
3844 -63 -50 44 -40 -75 147 -14 -57 97 -59 -40 108 15 -24 63 39 -74 37 39 -44 12 -6 -101 -2 30 -86 34
3870 34 105 -114 -22 87 6 -10 104 -97 -56 105 42 -33 160 5 -115 70 16 -144 75 31 -92 19 127
3893 127 -74 -21 106 -70 -2 80 -71 -77 69 -19 -5 35 -11 -81 112 40 -26 46 -55 -113 128 15 -91 63 38
3918 38 -61 11 85 -36 -5 20 -50 -48 71 -77 -5 6 -66 -54 -1 -9 -23 53 36 -19 19 24 -23 77 8 -22 29 16 3 58
3948 58 28 -53 7 79 -32 33 67 -11 7 60 -67 -36 48 -30 -15 17 -7 -18 91 19 -78 58 42 -55 43 8 2 84 92
3977 92 -55 -40 79 -73 -47 76 -15 -8 71 -5 -59 86 48 -37 56 -7 -16 27 36 -33 68 7 -43 36 46 -25 0 33 -18
4006 -18 76 24 -42 13 28 -56 -25 70 -45 -70 68 -34 2 63 31 -32 72 -53 -50 -5 -1 -49 17 -16 -107 52 58 -64
4034 -64 15 76 -3 44 70 -45 24 58 -43 47 31 -27 -64 123 6 -36 61 4 -43 62 -18 -77 20 43 -40 41 34 -24
4062 -24 -4 19 -93 3 8 -51 -35 40 -48 -17 2 33 -51 16 -25 -30 34 -1 2 59 -27 -4 28 3 -71 75 47 -46 24 33 -37
4093 -37 -7 26 -36 17 10 9 1 1 -64 23 46 -35 9 8 -45 -48 44 38 -71 56 -40 3 59 28 -24 35 94 -20 10 23 -27 -33 17
4126 17 -39 -55 36 -35 -35 17 2 7 56 -76 -7 49 13 -43 -2 23 -63 27 -12 -91 36 -31 -9 1 -50 -12 19 46 -68 22
4156 22 7 -21 -7 62 -13 24 38 -53 -27 61 -9 -19 2 -27 -36 33 -5 -31 37 32 -15 -54 40 -21 44 54 15 -27 -31 -36 -46 20
4188 20 5 -11 -26 5 15 31 2 6 9 16 -35 -2 -13 -62 47 41 -32 1 26 -40 64 35 8 -24 47 -43 -3 35 -22 -14 -18 54
4220 54 -48 -15 30 -62 4 -4 2 18 41 -64 30 25 -31 39 -1 -29 16 19 21 -10 13 -40 32 33 -25 -17 37 1 -17 -19 -46 -1 5 13
4254 13 -36 31 4 -48 14 36 -19 44 48 -64 25 49 -77 22 60 -23 -49 24 9 -23 17 -6 -30 -9 -32 -17 -11 -14 -32 0 7
4285 7 -9 -3 64 -72 24 11 -10 -17 24 -8 -6 17 12 -49 4 63 29 3 11 59 51 41 5 47 -14 42 41 -12 -45 11 2 23 10 23
4319 23 -10 57 16 25 -59 17 20 -12 -21 5 5 36 -22 -38 -3 -41 52 45 27 -54 39 -3 -25 -30 -8 27 6 -18 -37 40 47 -29 -17 27
4353 27 -57 14 -13 15 -10 71 -12 -21 30 8 -36 0 -15 -87 24 7 -40 64 29 -36 24 45 -24 31 52 -62 1 19 -20
4382 -20 -63 50 -29 6 3 58 18 44 -23 -11 56 -41 -5 -2 14 -15 15 2 7 32 67 -75 -28 -4 -74 -28 32 -24 -33 -12 -9 -24
4414 -24 0 -34 -22 55 -6 -83 -2 -27 1 8 -6 64 39 -18 -34 31 29 -8 24 24 -36 27 -14 -56 67 83 -38 -45 63 24 -30
4445 -30 19 -40 11 45 -18 -101 6 -44 18 22 -6 -53 10 36 -3 18 68 19 51 52 6 24 49 -72 -4 -2 8 -6 41 -43 -14
4476 -14 -50 4 14 61 -22 16 45 -6 -52 -3 -38 -77 36 10 0 19 12 -35 -1 64 8 36 27 16 56 78 -30 -13 -16 15 -6
4507 -6 66 -38 -27 2 -9 -29 52 -18 -78 -4 32 -43 48 52 -18 -1 -15 -21 -34 77 3 25 22 -26 17 66 -24 -38 -21 -65 4
4538 4 15 13 -17 27 -26 -53 16 -51 -46 -12 18 -30 40 -10 -56 -23 19 -13 1 35 34 -12 77 -11 18 -19 8 -13 34 -21 -20 28 0
4571 0 -13 12 12 -74 48 16 -53 -11 3 -86 23 -3 -50 20 64 -14 -14 4 -115 -10 51 -7 -10 39 42 -14 12 -29 -14 30 50
4602 50 6 16 -18 -15 35 8 -40 30 39 -39 -40 49 11 -47 55 12 31 -3 -31 4 26 -1 -21 35 -15 3 41 -16 -18 42 38 5
4634 5 -5 -56 23 -51 -35 6 -26 67 42 -20 37 -67 23 19 -24 9 14 25 -30 78 -17 80 47 -33 6 -13 20 16 -18 21 -13
4665 -13 -30 32 -15 13 13 -80 3 21 -34 19 28 4 -33 29 -13 -90 70 -5 -60 30 -6 -26 20 -48 22 30 36 -33 16 14 -43 -14
4697 -14 19 -99 -12 3 -37 -28 40 -18 -53 18 -29 -36 8 29 -99 -9 -5 -40 -14 -13 -93 50 5 -8 5 -8 -22 -6 26 24 24 13
4729 13 -17 -40 20 7 -63 34 -41 -84 105 10 -83 88 48 0 14 -34 -32 44 34 -11 3 17 -59 -10 72 -16 -41 36 -4 -13
4759 -13 -50 -18 -101 -14 -10 29 -14 -2 -83 31 -28 -43 42 10 -33 -9 34 4 67 38 -54 -6 21 -48 -9 20 -51 -48 20 -38 -12
4790 -12 16 -11 -35 -11 -17 -69 12 29 -31 57 22 -36 29 -63 -90 -73 16 -39 -20 35 -37 6 13 -9 -78 79 -10 -25 43 31 14
4821 14 59 -15 -16 53 25 26 22 29 -70 46 -20 -104 7 -23 -7 11 48 -22 12 -12 -43 -5 34 -31 -51 4 -42 -73 65 -23 -62
4852 -62 45 -12 -19 -25 59 -11 -9 40 -21 31 28 -34 17 19 -41 4 66 -13 -58 73 -44 -45 18 36 -10 23 1 -77 41 -22 -97
4883 -97 61 4 -17 9 -17 -38 18 -15 -62 -26 0 32 41 11 -23 -50 21 1 -59 14 -39 -28 35 -14 -26 96 -32 -8 80
4912 80 -5 -41 -26 -2 -55 63 -1 -66 47 58 -23 -24 48 -14 -31 57 -29 -70 31 -22 -66 -3 -24 -47 -25 -5 1 64 36 -59
4942 -59 16 -26 -37 -15 28 -6 15 44 -17 15 33 10 3 28 -28 -60 69 36 -35 24 7 -14 -51 42 34 18 -47 -42 -10 47 -40
4973 -40 12 13 -50 -13 -28 -11 -34 50 -62 4 77 -34 5 -14 -18 -13 22 -6 -8 43 -35 -21 20 -27 -29 -23 -10 -83 9 -16 -47 47
5005 47 19 -75 -33 43 -40 15 36 -56 -35 31 -51 -132 35 -22 -53 42 -66 -29 -1 45 -22 47 14 -9 -57 50 1 -11 -18
5034 -18 19 40 -22 42 0 23 -16 -22 4 -25 20 32 60 -20 18 -5 -64 -9 -13 -30 32 42 -10 1 -26 -27 26 66 -49 -11 11
5065 11 -62 2 7 -39 -31 -62 9 -32 5 25 3 27 -13 -24 22 5 5 34 3 -71 33 3 -29 -43 43 -63 -34 13 -38 3 -9
5096 -9 -25 -60 86 -48 -66 43 -10 -33 47 -51 -36 24 11 -40 6 6 -31 12 37 7 -12 -22 -95 -15 11 -67 -12 -26 -29 -37 28
5127 28 -57 -38 9 -17 -52 4 22 -61 -7 -84 -39 22 10 30 37 26 -25 -15 8 -30 -18 61 -56 -9 42 13 -39 -14 -41 -90
5157 -90 -3 -51 -83 55 -14 -87 -10 -48 -8 -45 23 -16 30 48 -26 -42 25 1 11 35 16 -31 8 26 -49 -27 -56 -80 -8 23
5187 23 -73 -25 3 -59 35 2 -60 30 -14 -63 3 -35 -54 15 2 15 8 6 -40 10 -3 -23 19 20 -21 -57 60 -4 -67 47 73
5218 73 -4 -21 52 -55 5 40 -23 -11 -20 1 84 26 -7 69 0 1 23 49 -56 -62 85 -78 -5 17 22 25 57 50 -32 21 2
5249 2 -32 5 5 -25 -12 -22 -21 20 85 27 -16 22 -52 -15 21 -58 -16 61 9 5 56 -55 -49 -15 25 -67 23 29 -41 -6 -62 -59 -22
5282 -22 -30 -49 -19 2 -68 -24 -8 -119 -53 26 -27 16 12 7 -30 58 -17 -43 85 -29 -21 65 36 -82 60 -21 -36 29 28 -79
5312 -79 -39 -3 -10 63 33 -58 -30 59 31 -42 -5 -35 -15 55 -27 -13 47 19 -1 -53 13 -88 46 45 -31 60 -16 -32 0 45
5342 45 -64 -36 91 -24 -13 58 53 5 2 -14 -24 11 -26 -5 -5 56 -49 -14 18 -47 39 -49 -60 -17 27 -9 -11 -23 -52 -9
5372 -9 20 -41 -8 39 -44 21 34 -31 -5 50 18 -42 40 28 -35 32 -17 -76 39 -8 -17 41 34 -41 -22 -16 -44 -17 83 -66 -4
5403 -4 79 -40 -8 -39 -48 -35 22 -29 -54 16 -19 2 46 20 -86 -16 34 -20 68 76 -27 22 18 -56 -11 72 0 31 25 6 5 22
5435 22 -16 -6 0 -17 7 11 -28 -44 48 -8 -92 22 4 -30 6 -34 -51 -20 10 -69 -41 51 -65 -27 47 -11 4 93 0 20
5465 20 67 -82 20 44 -8 -15 31 -44 -41 9 3 -13 1 53 -6 -50 9 -68 34 42 -63 29 75 -21 26 32 30 -55 29 14 2
5496 2 -34 -35 -2 21 -16 -48 54 -32 15 -32 58 -5 25 2 -37 -14 54 -54 -9 -7 -14 28 1 -16 19 -5 -45 30 13 18 -42 14
5528 14 -8 -55 15 4 -39 -4 85 -39 5 53 8 -23 54 -78 -26 11 -16 -49 54 -32 -40 13 5 -47 0 33 -56 49 27
5557 27 -13 64 -15 -30 54 15 -55 51 44 -49 -15 -18 -40 19 48 -2 -1 23 14 -50 86 -37 -61 24 -15 -62 -29 -73 -39 -1 23
5588 23 32 36 36 -53 -8 26 -61 99 65 -1 -46 14 20 7 -5 -1 -21 -57 -32 44 47 10 -74 53 16 -84 65 -52 -24 13 51
5619 51 10 -50 4 -88 -19 -8 -53 -29 59 -22 -58 61 -19 -8 50 27 -29 -9 32 -56 -28 -7 -75 -9 -46 -37 -14 -8 16 -8 -17
5650 -17 -7 -15 29 -36 -7 -6 -18 48 9 -29 5 48 41 45 44 1 -29 34 -36 -76 -49 -6 -69 5 -17 -47 30 18 -2 -13 41 -52 6
5683 6 45 56 -36 47 11 -30 7 40 -48 15 13 -90 37 -9 -14 55 -1 -18 17 -43 -20 21 -2 -34 -6 51 -89 -24 40 -83
5713 -83 -40 48 -7 -44 14 -80 -72 42 32 -42 1 -17 -52 2 60 -13 37 14 -67 -8 44 -20 24 79 -15 -15 83 -20 -7 2 -27
5744 -27 -40 14 23 -75 61 -24 -48 -29 55 -22 -13 30 -33 42 14 -23 -29 -17 -75 15 86 5 -51 75 -62 -42 55 -2 4 70 9
5775 9 -19 27 -34 13 18 7 10 24 8 8 0 22 -51 19 -40 22 68 72 -50 -10 82 -30 -11 53 20 35 14 55 -46 38 -21 -47
5807 -47 63 46 -3 -33 0 -42 15 64 -63 51 5 6 -29 39 -50 -43 -24 30 -21 33 12 6 86 -49 -20 -82 1 -2 30 -32
5837 -32 -60 41 30 -46 22 -51 -1 -27 -14 -62 6 29 -55 35 27 -19 -35 24 -27 -41 33 -57 26 72 23 -62 51 35 -73
5866 -73 -14 47 -42 -6 24 -60 44 6 -54 -31 -4 -21 -35 37 20 6 29 -43 -39 16 -16 -26 45 -12 -59 35 -59 -40 -7 39
5896 39 3 5 -3 -103 6 74 -35 -11 46 -83 -31 -7 20 -36 -3 -15 -50 17 -69 -41 83 14 -71 10 -6 -35 26 3 -13
5925 -13 -2 11 -22 6 -18 -65 42 -32 -91 37 37 -58 11 -26 -11 -38 60 -34 -6 53 -2 -34 26 3 -3 47 47 -8 39 29 -46
5956 -46 33 58 -37 -1 35 16 -83 56 29 -68 -10 -13 -26 -27 52 16 59 -29 -83 -24 45 -18 37 -17 -61 -38 5 -2 -3 39 -58 35
5988 35 62 -27 36 64 -34 -25 22 -60 -7 42 -12 -12 17 4 10 0 29 -49 53 63 -38 -17 -5 -9 -43 -37 -39 -58 31 -15 -21 -32 -46
6021 -46 -48 22 38 -36 39 -54 -18 -18 14 -66 21 -14 -27 -7 -1 -52 61 -3 -57 28 -12 -4 9 -19 -14 45 8 48 -59 22 26 -59
6053 -59 -16 -21 -1 67 40 -32 13 -24 -29 8 -13 -66 19 -18 35 -25 66 -58 -11 10 -26 -10 -16 -19 -65 2 -82 33 12 -49 43
6084 43 4 69 -28 8 -2 -6 29 3 -22 -27 11 -84 14 7 -59 -9 26 12 -3 43 -59 1 -5 -43 -53 19 -30 -43 50 3 17 -1
6116 -1 46 -38 -1 20 -26 39 -36 -43 -55 8 -59 -13 40 -14 3 1 -56 22 13 64 -57 -18 6 -4 40 -51 -40 10 8 -57 -2 -21
6148 -21 -18 16 28 -43 -64 0 -3 -30 1 -7 16 -19 7 12 -6 -60 11 18 -44 23 39 48 -35 28 15 -19 -22 41 57 -17 -11 -18 -17 -5 -18
6183 -18 19 -39 -2 13 -6 -7 3 32 21 4 -22 -4 6 22 -6 -16 -7 14 -58 -35 -3 -21 12 62 -74 4 5 -23 34 31 -17 -3
6215 -3 17 -5 -46 17 -24 5 55 -28 -9 26 5 -10 4 -56 3 -38 -30 4 -18 19 8 59 -4 -84 8 9 -31 -1 70 -15 10 35
6247 35 -24 -52 51 19 6 54 0 -9 86 -17 -24 47 -20 -2 -12 36 -86 -37 -8 18 -35 10 31 71 20 -11 -29 15 -54 -23
6277 -23 1 -54 -43 52 38 -55 31 -6 -7 -6 29 5 -2 18 11 10 -4 43 -15 -2 7 12 41 8 -26 -1 24 -72 52 4 25 28 -33 -48
6311 -48 4 -49 -43 15 -75 -27 40 22 -26 29 -4 -103 -19 32 -29 -1 -6 22 -76 -28 -25 -18 44 23 -14 50 -7 -7 31 51 -16 36 51
6344 51 -6 34 50 -52 34 42 -30 24 25 -2 -16 2 -6 -24 4 -43 -37 -11 -11 -76 -40 25 13 -36 -35 11 28 41 -10 -22 18 -19 -26
6377 -26 -8 -15 -31 49 10 -4 47 -10 -14 72 -9 -25 88 19 8 6 -6 -11 38 15 -15 23 50 -31 -10 7 -60 2 35 28 26 2 -25
6410 -25 -12 20 3 -14 -7 -42 -28 20 -30 -11 41 8 -39 -6 16 14 20 29 16 26 13 -57 -16 7 -94 19 77 11 -6 -47 0
6441 0 40 2 -39 -3 21 4 -24 0 -33 -19 70 -11 7 -29 39 -37 21 36 -19 -31 -7 -14 -14 -32 8 -21 5 33 -32 72 0
6472 0 28 -17 -4 -12 -19 -30 -38 3 18 20 -5 -38 -11 73 -49 12 -30 8 -64 15 25 -52 -42 -45 -6 -2 20 25 16 39 -13 -10 58 -43
6506 -43 14 -15 57 -49 30 -10 -17 10 29 -7 20 41 -16 5 70 -35 -7 7 -21 6 6 9 -13 41 -1 22 2 21 -21 84
6536 84 36 -12 19 -34 -30 12 -13 -17 13 17 -92 5 -11 -21 -27 38 30 45 15 -27 -23 -39 45 -16 41 -2 8 9 20 -19 -34 -7 7
6569 7 29 13 -10 20 34 6 -9 12 0 -3 36 -3 -8 -3 -7 -29 -1 11 -58 -20 -61 -48 48 23 -62 64 26 -13 -7 0 -50 21 31
6602 31 -31 11 86 27 -8 -39 32 -35 -28 -45 -61 24 2 -51 -3 -14 -21 -3 -21 -10 9 19 -42 32 39 -81 26 24 -16 -61 -8
6633 -8 32 2 44 17 42 -27 4 14 15 -68 -27 -19 -2 -73 24 55 -24 4 -54 -7 23 -8 -33 23 17 -25 -34 -21 18 28 -3 45 -41
6666 -41 5 27 20 -24 -28 -49 -61 -6 6 -29 22 -19 -28 22 -13 -7 46 -40 -7 3 25 41 10 -41 -48 37 33 -2 -14 8 -25 15 -5
6699 -5 -21 26 6 20 -46 15 -24 18 -8 -7 18 6 46 -20 9 -56 35 -30 -29 20 50 -37 24 4 -12 -50 42 2 21 61 -17 11
6731 11 33 35 8 -31 13 -7 -13 26 9 -7 8 -41 8 45 -28 -12 38 -5 -29 -6 -8 -29 8 19 -38 34 -24 -29 14 -8 -73 2
6763 2 6 19 -25 -29 9 -27 -12 6 -9 -12 -15 35 11 -20 3 0 -1 39 -24 17 -36 20 -2 30 21 30 -26 -36 12 -2 35 18 3 -32 4
6798 4 -54 -46 18 -51 -1 -38 6 18 -37 4 -12 -2 -50 32 24 37 10 44 19 68 16 17 -9 34 -18 -49 42 -16 -18 27 23 -1 54
6831 54 12 -3 -36 25 -22 -45 -12 76 -39 -10 9 -47 4 -40 -11 24 -24 -42 -26 3 -12 -10 15 18 -32 -50 4 23 25 23 11 -26
6863 -26 3 -11 62 -78 -4 -17 -14 -7 40 26 -60 -20 25 -29 68 18 -40 20 -12 8 12 -38 -19 4 -42 6 10 11 13 -54 -12 21 -40
6896 -40 -6 -48 -5 12 -24 -37 13 20 -39 21 65 43 24 11 53 14 58 -20 -16 45 18 -15 13 -20 10 29 -30 -34 34 -22 -27 -38
6928 -38 10 17 -20 -53 -15 -56 16 -19 -23 -7 0 -39 -14 7 26 42 36 59 -22 11 5 6 12 29 21 -19 38 -4 0 21 26 14 15 -12 -15 -69
6964 -69 -6 36 9 -30 29 -1 -28 -62 -44 -25 39 11 -74 11 26 -40 12 16 -16 45 48 -11 -8 19 -17 13 4 -24 -39 -25 7 18
6996 18 9 -36 39 43 9 -47 62 14 -1 14 -67 -34 9 -18 -70 12 -55 -9 -8 -8 -28 -3 -55 -45 14 -4 20 38 -5 -58 12 0
7028 0 6 27 37 37 -11 32 -4 -11 25 -11 -26 14 -13 -40 53 19 -20 15 6 -9 -53 0 -18 -13 9 -3 4 -17 -13 -21 36 22 6 -11 5
7063 5 -19 24 6 -39 56 -4 -57 -70 -34 34 30 13 11 -45 20 24 52 68 1 -22 31 5 5 -22 -9 -29 15 -30 50 -7 -13 -26 -21 23
7097 23 42 46 7 -2 27 -30 42 -10 -15 -41 5 22 46 -9 -15 -51 -38 28 -19 0 36 15 -13 -21 -27 33 38 7 1 -20 -22 -8 3 -37 -47
7132 -47 44 -16 -56 -47 37 -24 -14 55 16 -50 19 18 47 -14 46 -36 -15 -19 -23 8 56 3 39 -18 -7 3 7 22 8 54 -27 -3 42
7165 42 22 6 16 -27 -36 -17 -11 32 21 -52 -28 5 16 -47 47 46 11 -27 42 -1 -26 26 15 -11 36 -117 -17 -36 8 50 2
7196 2 0 -64 41 -38 5 -18 1 6 -6 25 -38 18 -9 -41 29 -13 -1 -17 22 -2 31 -13 -25 -46 13 -21 -34 -1 -40 -28 2
7227 2 -28 -49 18 -62 -21 -27 -5 24 -17 3 -32 -2 24 -20 -7 -29 -29 -1 28 33 -15 19 -19 -39 -6 11 23 4 51 -14 -11 -22 -60
7260 -60 22 -65 23 -26 21 -12 -7 28 30 52 -28 -66 -29 -40 37 32 -15 7 -6 50 -20 3 9 -26 5 -8 -25 -4 37 28 -43 46 -49
7293 -49 -6 47 35 -30 -11 13 -70 14 5 -62 14 51 -21 4 -2 4 -64 17 5 -65 -2 16 -21 -17 52 40 -12 -55 3 -25 14 -15
7325 -15 3 -55 30 -45 18 -19 26 -24 33 2 -21 43 -18 25 3 24 31 -18 -14 -20 -22 26 10 -31 4 -20 -33 26 -3 -16 -18 13 2
7358 2 -12 29 -22 31 -8 -4 14 -13 26 -35 10 -32 -2 -21 -25 26 -15 -35 -15 -18 33 28 34 7 13 43 -29 -10 -39 -43 -4 -48 -2 61
7392 61 -22 -2 36 -18 3 -8 24 -55 28 -16 10 -18 55 8 -6 -8 -80 3 38 13 60 -44 17 3 -6 4 -77 17 5 11 5 73
7424 73 -19 -1 -33 -24 29 0 13 41 -43 11 18 -3 -11 16 -40 21 -37 33 4 -3 0 0 -17 5 -78 -7 -13 32 36 22 -1 19 -9 -63
7458 -63 26 54 3 23 2 -4 -5 -19 -6 4 0 -17 70 5 -20 7 -40 -10 0 -1 -34 -33 5 11 -18 -29 -5 -8 3 36 -57 -11 -64 2
7492 2 -22 -15 11 -16 -5 -12 0 -56 15 -3 -17 23 45 11 -56 -54 -10 71 -3 14 -23 -18 42 58 53 2 29 9 58 20 -34 10 35
7525 35 12 -66 58 25 -19 45 -33 -10 76 37 -39 36 20 13 -35 60 37 -14 -9 -25 35 -13 6 10 -35 46 -7 -14 6 41 -21 79
7557 79 26 28 46 39 -42 36 -8 0 -3 -12 -67 7 11 -54 31 -21 -4 8 -1 -8 -45 -9 -27 -66 1 -27 -12 -10 -9 -17 -13 -71 -63 -2 -4 -60 28
7594 28 -2 6 6 9 -9 21 -15 -28 51 1 -14 10 14 -65 6 33 26 30 -13 23 -8 -10 5 34 25 -49 -34 19 -28 5 34 26 -29 26 2
7629 2 -7 65 -1 -16 9 3 -2 2 34 54 13 13 3 -16 -6 16 16 43 18 -4 47 -25 6 -18 -52 1 50 -18 -47 -17 24 -4 29 8
7663 8 2 -4 -85 -43 45 27 -69 -14 -36 7 -5 21 -36 -16 50 3 -11 -8 30 -6 50 -22 3 2 18 1 -21 -21 -25 -47 8 -25 23 -51
7697 -51 14 34 27 42 42 28 47 38 -27 -13 -22 -28 -10 29 -23 -10 -64 -15 8 -41 9 -12 -1 -36 57 -52 -8 62 22 3 31 24 -58
7730 -58 49 -14 -6 26 52 2 1 14 -40 2 7 -49 70 -43 -25 8 -46 -10 -44 -11 -22 6 -17 35 -14 29 -29 -2 -18 8
7760 8 32 0 21 39 51 12 28 -37 -25 -11 77 -26 31 13 65 -14 -24 37 -29 51 37 9 -11 1 -5 64 22 12 11 -8 11
7791 11 -15 -33 -43 -26 -35 -15 4 68 5 81 15 11 7 15 18 -15 7 -20 -14 22 12 19 -13 -32 0 18 40 -16 29 -12 -14 2 36 -34
7825 -34 -34 26 65 25 -2 11 26 26 -27 22 -3 18 -7 33 -23 -44 -8 19 -13 -46 -12 -47 7 -11 -12 23 17 25 -34 49 -1 -27 68
7858 68 46 -1 48 20 29 -26 0 73 7 -8 14 16 71 -84 -16 22 -17 21 -57 -22 10 16 1 -7 -61 -37 16 8 27 -16 -76 -14
7890 -14 -31 -37 16 6 25 1 -43 -55 -13 -55 38 -41 13 -11 4 -14 -26 -11 -42 -102 19 2 -39 53 -12 -23 -5 13 -18 24
7920 24 33 -47 -4 -18 71 16 6 -66 -12 20 -25 7 10 18 -39 8 -14 2 6 -31 23 -6 0 -25 5 70 29 -4 -24 1 -16 20 -4
7953 -4 -35 -9 -6 54 -18 0 25 11 -19 -32 43 -11 -42 -17 -34 -41 -5 -18 -2 -31 -36 -32 17 46 35 42 -2 -19 23 13 12 13 35 10
7987 10 -28 27 34 1 18 -48 15 -26 2 -52 23 27 -26 49 14 10 4 -18 -46 36 -1 -7 -8 -10 -41 3 2 22 6 -20 19 -20 -24 -22 -66
8022 -66 -28 -45 -2 22 -27 -24 29 7 20 53 37 -19 -36 4 55 41 37 -78 -84 3 4 -43 5 14 -33 -36 -6 69 -46 -23 -25 54 -19
8055 -19 -19 7 -8 18 31 11 -15 -4 -10 -6 -4 -22 -59 -16 -5 -11 53 52 1 -27 44 -5 0 30 -10 2 55 51 23 8 -15 -22 35 -5 -15
8090 -15 27 13 16 9 37 -14 -52 -12 -26 -50 -1 -46 -33 30 47 -14 -27 -13 -29 10 7 33 21 46 -18 32 -17 15 -21 -8 -22 30
8122 30 5 52 25 39 -33 8 -7 -29 -36 -5 1 2 -71 2 7 8 -28 -26 3 18 -10 -25 -65 -62 29 -56 -1 10 68 -26 -45 25 -27 -11
8156 -11 4 40 15 24 11 -8 -16 2 9 17 0 -13 29 -38 5 18 0 -39 -50 76 38 -13 -52 23 -61 26 -21 70 30 -11 -11 33
8188 33 31 -70 0
8191@
$$ Imaginary data points
##PAGE= N=2
##DATA TABLE= (X++(I..I)), XYDATA
0 0 0 0 0 0 0 0 0 8 -8 8 -8 10 -16 24 -24 32 -40 48 -58 72 -83 101 -121 145 -166 194 -227 260 -300 343
30 343 -393 447 -511 576 -648 731 -821 920 -1027 1143 -1274 1416 -1571 1739 -1920 2122
46 2122 -2343 2583 -2843 3131 -3448 3803 -4194 4627 -5110 5659 -6287 7006 -7841 8828
60 8828 -10016 11477 -13321 15726 -19017 23796 -31380 45229 -78357 311676 48463 -617314
72 -617314 450193 242313 -567337 143111 445230 -457501 -81765 453706 -225502 -259151
82 -259151 374192 -26282 -289014 191787 122890 -218908 23307 134916 -60905 -78240
92 -78240 45238 72502 -47458 -102191 124820 71235 -210373 59655 224162 -237931 -84046
103 -84046 338096 -158854 -262111 371982 7312 -406347 292407 214994 -460276 114301
113 114301 385937 -392447 -104479 459122 -227861 -284794 416722 -25921 -375615 285944
123 285944 148638 -362825 114297 248156 -263904 -40899 250515 -122477 -127144 170364
133 170364 904 -122444 57459 57047 -48686 -30943 33939 45490 -58097 -45466 113205
144 113205 -15365 -141404 122303 81331 -209208 60208 193500 -212392 -56553 271967
154 271967 -140143 -184796 281410 -15249 -276889 217322 120894 -303802 101070 227323
164 227323 -259997 -33395 274698 -160221 -146383 251349 -37023 -203751 170341 67545
174 67545 -193348 67196 120568 -131677 -18392 114600 -51551 -60173 65305 14439 -51334
185 -51334 -787 42910 -2057 -53939 23473 62804 -68952 -35066 111246 -35716 -105497
196 -105497 118339 33767 -155551 78091 112161 -164429 3212 171013 -127408 -83013
206 -83013 190074 -53692 -153607 161571 35704 -184850 93453 112047 -167039 8479
216 8479 150336 -109664 -64868 142364 -35765 -104255 97794 29095 -102257 36836 65164
227 65164 -65683 -17285 63204 -13139 -45067 28275 31591 -36978 -20653 49244 854 -59530
239 -59530 32828 49873 -70704 -10522 87542 -48895 -63459 97389 -977 -105133 73791
250 73791 56992 -118235 23415 104443 -96563 -37393 123522 -46839 -88322 107287 13717
261 13717 -112140 62539 65270 -102177 5919 91855 -64192 -43422 86665 -13429 -69837
272 -69837 54024 30878 -66608 8633 53689 -37409 -30571 48540 3630 -48591 19909 38469
284 38469 -39869 -18883 52693 -9191 -51105 40769 30397 -62790 7749 62958 -48523 -33759
296 -33759 74569 -13184 -67858 59874 30197 -81264 23625 65897 -68436 -21065 81239
307 81239 -33870 -58284 70876 9740 -75557 39101 46823 -67835 -1876 65031 -39306
318 -39306 -37035 59545 -1398 -54223 34094 31238 -48959 -191 46737 -25127 -29557 40755 6678
331 6678 -42874 17106 33283 -35622 -13889 44265 -11666 -39606 35395 19293 -49823 9989
343 9989 45001 -40081 -21947 55226 -13780 -48396 45858 19187 -59386 20170 46986 -51079
355 -51079 -12595 59830 -26297 -40815 53434 5660 -54793 30629 33577 -50080 87 47441
367 47441 -29409 -26514 43102 -1476 -39529 23662 22470 -35387 -2209 33772 -16756 -24356 28863
380 28863 8307 -33991 9922 29776 -27220 -15347 38502 -6486 -36344 30566 19735 -44434
392 -44434 9006 41255 -36362 -17984 50151 -15238 -40758 43305 11657 -51854 23016 35452
404 35452 -47069 -3940 47541 -28316 -27529 43958 -3125 -39299 27212 18647 -36248 5088 29469
417 29469 -21214 -14087 26907 -825 -23446 12540 17144 -19508 -7720 24702 -3497 -24948
429 -24948 17957 17536 -30828 -268 34058 -22715 -22362 39402 -3860 -40176 31798 19394 -47813
442 -47813 12972 39698 -41694 -11543 49780 -23033 -32985 45273 1143 -43284 28912 21298
454 21298 -40198 8294 31244 -27403 -9075 29895 -10359 -18424 19037 4587 -16741 3223
466 3223 11106 -4984 -9595 5650 10418 -12190 -8813 20633 -2881 -24386 20485 13624 -34253
479 -34253 10004 31195 -34649 -7953 44448 -24232 -28956 47832 -4217 -45722 38127 19104
491 19104 -51158 18410 36816 -43673 -3461 43616 -28200 -20410 40029 -10547 -29098 29024
503 29024 4761 -28599 14320 13120 -19463 1745 11343 -6672 -2288 1636 1650 3612 -8789 904
517 904 14845 -13785 -7902 25587 -10967 -21545 31730 -108 -36295 29698 17443 -46503 17008
530 17008 36589 -46263 -3583 49803 -34421 -24644 52361 -15628 -39876 44829 4248 -46528
542 -46528 30557 20830 -44181 13428 30501 -33987 -1583 30866 -20557 -9590 24045 -10272
554 -10272 -9529 15825 -6752 -5047 11251 -8865 -841 11709 -13726 639 16770 -19005 -2833
567 -2833 25666 -20912 -12729 34694 -15418 -26795 38350 -2164 -39203 33446 14282 -45482
579 -45482 21845 29222 -44790 6552 40228 -37563 -9966 45077 -24218 -24211 41581 -8322 -31450
592 -31450 31206 4252 -30579 19547 10215 -25148 11332 10982 -19422 7428 8992 -15260 7118
605 7118 6023 -14357 10021 4634 -17955 13943 8200 -25059 14028 17592 -30995 7340 29018
618 29018 -31356 -4772 37829 -25401 -18711 41840 -14449 -31560 40068 291 -41048 31632
630 31632 16182 -44004 17381 28660 -38868 1981 34040 -28177 -9850 32765 -16675 -16160
642 -16160 27485 -7234 -17805 20642 -1142 -15679 14297 500 -11447 11219 -1733 -8454
654 -8454 12914 -5036 -9956 17482 -5506 -15867 21132 -1386 -23551 21501 6898 -30241
666 -30241 17457 17765 -33673 8361 28682 -31771 -4672 36142 -23360 -18224 37252 -10442 -27960
679 -27960 31823 3118 -31891 21865 13876 -30047 10505 19483 -23828 790 19850 -15755
691 -15755 -4723 15968 -9109 -4997 10851 -6531 -2023 7777 -8386 975 8820 -12254 1478
704 1478 13556 -15367 -2000 20273 -15273 -9374 25914 -10620 -19117 27589 -1270 -27919 23487
717 23487 10692 -32155 14209 21589 -30325 2016 28354 -23268 -9882 29337 -12991 -18513
729 -18513 24879 -2000 -21685 16917 6432 -19394 8246 10016 -13617 2044 8661 -7629
741 -7629 73 4531 -4098 2288 669 -4237 6515 -658 -8184 10154 1849 -14329 10468 8219
755 8219 -19356 6096 16404 -20302 -2174 23339 -16019 -12218 25908 -7320 -21089 22912
767 22912 3421 -25679 15211 13466 -24628 5095 19613 -18522 -4341 20552 -10014 -10603 16508
780 16508 -2090 -12274 9996 3053 -9602 4062 4080 -4782 718 1462 -743 1097 -2943 456
794 456 4609 -6254 -1908 9493 -6269 -6952 13217 -2450 -13023 13358 4329 -17759 9318
807 9318 12061 -18844 1853 18260 -15309 -6789 20889 -8144 -14094 18757 324 -18086 12626
820 12626 7733 -17776 4877 12247 -13383 -2094 12836 -6917 -6304 9610 -1199 -6692 4515
833 4515 1878 -3927 369 1559 389 -1174 -1514 3804 709 -5670 4285 4925 -8968 1173 10020
848 10020 -9082 -4537 13774 -5387 -11015 14089 1182 -15767 10362 8381 -17190 3654 14066
861 14066 -14566 -4012 16669 -8481 -10291 15404 -1005 -13495 10669 5279 -12949 4450
873 4450 8598 -9397 -835 8473 -4576 -3537 5846 -493 -3317 2068 1241 -841 -1284 -71 2638
888 2638 -1987 -3524 5086 337 -7497 5021 4878 -9873 1884 9695 -9647 -3369 13043 -6383
902 -6383 -9152 13660 -606 -13570 10970 6217 -15033 5302 11537 -13054 -1516 13621 -8262
915 -8262 -6870 12348 -2625 -9512 8885 2006 -9307 4386 4544 -6727 457 4294 -3047 -1222
929 -1222 1695 -165 238 -1449 92 3547 -2942 -2439 6655 -1894 -6353 7953 1347 -10053 6767
944 6767 6129 -12335 3078 11158 -11962 -2742 14654 -8257 -9072 14784 -2310 -13414 11723
957 11723 3932 -14602 6808 8630 -12927 1436 11022 -9378 -3142 10848 -4775 -5811 8313
970 8313 -724 -5659 4807 1041 -3569 2282 328 -1198 1854 -1932 -56 3362 -4020 -747 5931
985 5931 -5076 -3326 8826 -4169 -7388 10620 -670 -11585 9702 4567 -14160 6142 9904
998 9904 -13932 973 13539 -11213 -4316 14863 -6875 -8814 13701 -1889 -11403 10625 2599
1011 2599 -11508 6520 5190 -9740 3100 5587 -7508 1391 4764 -6049 1081 4102 -5662
1024 -5662 1495 4073 -6256 2033 5116 -7665 1618 7622 -8895 -526 10810 -8407 -4503 13306
1038 13306 -5802 -8855 13769 -1699 -12632 12208 3011 -14986 8880 7787 -15330 4176
1050 4176 11534 -13352 -925 13173 -9606 -5002 12525 -5486 -7072 10554 -2332 -7498 8357
1063 8357 -316 -7049 6590 598 -6093 5631 481 -5615 5763 68 -6355 6775 492 -8529
1077 -8529 7484 2818 -11109 6504 6408 -12740 3677 10168 -12803 -326 13399 -11097 -5109
1090 -5109 15397 -7389 -9875 15234 -2269 -13208 12864 2898 -14271 8999 6741 -13567 5021
1103 5021 8971 -11787 1570 9947 -9490 -1080 9750 -7301 -2648 8942 -5750 -3357 8370
1116 8370 -5113 -3898 8584 -4630 -4949 9317 -3763 -6718 9953 -2020 -8764 10128 481
1129 481 -10876 9226 3766 -12594 7084 7413 -13192 3620 10725 -11999 -613 12626 -9479
1142 -9479 -4549 12966 -6252 -7595 11974 -2762 -9522 10024 405 -9970 7680 2597 -9429
1155 -9429 5541 3772 -8611 4234 4289 -8071 3512 4957 -8091 2912 5962 -8422 1889
1168 1889 7537 -8706 150 9373 -8461 -2451 11156 -7129 -5659 12057 -4525 -8825 11837
1181 11837 -1028 -11338 10125 2823 -12584 7260 6284 -12427 3868 8849 -10879 428 10216
1194 10216 -8514 -2520 10357 -5896 -4512 9500 -3491 -5628 8229 -1746 -6143 7142 -560
1207 -560 -6281 6316 204 -6591 5829 961 -7211 5491 2145 -8039 4964 3830 -8923 3793
1221 3793 5980 -9323 1903 8205 -8815 -835 9955 -7357 -3754 10854 -4827 -6520 10508
1234 10508 -1814 -8597 8994 1198 -9516 6662 3656 -9382 4100 5400 -8497 1669 6272
1247 6272 -7155 -184 6466 -5758 -1389 6322 -4567 -2130 6237 -3623 -2739 6377 -2941 -3533 6555
1262 6555 -2068 -4564 6720 -1045 -5864 6555 530 -7185 5794 2526 -8153 4366 4563 -8555
1276 -8555 2268 6466 -8004 -223 7883 -6520 -2601 8448 -4430 -4772 8171 -1966 -6200
1289 -6200 7038 292 -6784 5280 2119 -6503 3538 3216 -5747 2100 3653 -4903 1109 3749
1303 3749 -4350 465 3712 -4061 73 3924 -4130 -455 4503 -4041 -1440 5513 -3653 -2818 6224
1318 6224 -2519 -4504 6424 -805 -5957 5948 1442 -7015 4586 3691 -7284 2480 5461 -6569
1332 -6569 58 6465 -5234 -1982 6558 -3440 -3542 6013 -1797 -4351 4928 -224 -4683 3704 795
1347 795 -4331 2763 1289 -3944 2274 1567 -3743 2062 1962 -3798 1801 2585 -4054 1274 3358 -4146
1363 -4146 440 4246 -4136 -793 5253 -3554 -2534 5838 -2242 -4364 5616 -337 -5532 4477 1554
1378 1554 -5867 2997 3108 -5608 1343 4318 -4781 -398 4782 -3296 -1662 4470 -1886 -2158 3663
1393 3663 -1031 -2060 3153 -822 -2090 3012 -593 -2323 2866 -420 -2707 2887 -236 -3239 3188
1408 3188 345 -4180 3148 1704 -5074 2269 3417 -5133 576 4726 -4439 -1026 5427 -3356 -2590
1423 -2590 5773 -1902 -4135 5408 93 -5203 4016 1995 -5341 2180 3072 -4458 718 3340 -3695
1438 -3695 -177 3461 -2976 -1045 3406 -2061 -1571 2907 -1268 -1497 2449 -1205 -1104 2734 -1496 -1420
1454 -1420 3388 -1178 -2452 3685 -325 -3328 3316 570 -3912 2914 1409 -4491 2367 2761 -4884
1469 -4884 951 4100 -4311 -966 4586 -2939 -2202 4268 -1704 -2641 3873 -906 -3077 3652 -6
1484 -6 -3548 3105 1029 -3524 2171 1514 -3134 1780 1558 -3164 1814 2065 -3773 1301 3013 -4020
1500 -4020 169 3815 -3626 -1022 4174 -2987 -1908 4570 -2410 -2982 5059 -1233 -4436 4775 663
1515 663 -5313 3586 2298 -5125 2175 3254 -4734 1111 3947 -4263 -123 4548 -3477 -1566 4499
1530 4499 -2145 -2411 3829 -1209 -2496 3247 -789 -2537 3064 -533 -2958 3059 136 -3363 2771
1545 2771 771 -3513 2537 1293 -3832 2414 2091 -4458 1801 3413 -4715 456 4625 -4134 -1022
1560 -1022 5140 -3196 -2402 5247 -2225 -3519 5239 -959 -4743 4693 704 -5380 3517 2164 -5384
1575 -5384 2273 3151 -4923 1288 3705 -4432 250 4320 -3844 -768 4624 -2934 -1750 4490 -2090
1590 -2090 -2379 4300 -1441 -2903 4228 -876 -3702 4071 117 -4490 3531 1198 -4902 2720 2354
1605 2354 -5106 1850 3460 -4983 649 4534 -4430 -722 5232 -3456 -2214 5275 -2136 -3165 4932
1620 4932 -887 -3721 4282 51 -4146 3507 1026 -4292 2680 1699 -4235 1977 2121 -4144 1398
1635 1398 2629 -4174 899 3224 -4062 187 3907 -3746 -816 4512 -3203 -1847 4990 -2349 -2958
1650 -2958 5131 -1251 -4061 4851 272 -4968 4041 1663 -5370 2838 2958 -5317 1427 3957 -4771
1665 -4771 1 4566 -3958 -1343 4710 -2835 -2298 4537 -1795 -2891 4157 -846 -3213 3715 -67
1680 -67 -3433 3306 569 -3660 2924 1085 -3889 2530 1822 -4186 1944 2609 -4308 1179 3436 -4225
1696 -4225 58 4223 -3796 -1203 4747 -2993 -2394 4943 -1766 -3451 4593 -463 -4129 3987 837
1711 837 -4515 3066 1884 -4467 2080 2688 -4120 1071 3205 -3706 110 3560 -3272 -658 3731
1726 3731 -2771 -1401 3803 -2197 -2065 3830 -1542 -2723 3754 -813 -3255 3629 41 -3815 3240
1741 3240 1044 -4189 2659 2043 -4361 1751 3086 -4214 754 3840 -3768 -481 4278 -3012 -1626
1756 -1626 4358 -2104 -2643 4153 -1054 -3265 3592 -18 -3600 2911 834 -3660 2208 1465 -3544
1771 -3544 1561 1990 -3342 982 2413 -3050 416 2807 -2853 -160 3157 -2498 -849 3472 -2132
1786 -2132 -1593 3698 -1502 -2434 3611 -676 -3126 3347 266 -3650 2776 1189 -3931 2010 2115 -3824
1802 -3824 1136 2833 -3598 158 3323 -2911 -735 3574 -2188 -1420 3606 -1444 -2024 3344 -752
1817 -752 -2541 2960 35 -2845 2483 610 -3006 1937 1158 -3053 1484 1630 -3118 951 2167 -3022
1833 -3022 295 2697 -2719 -436 3062 -2119 -1177 3296 -1498 -1855 3351 -747 -2514 3002 122
1848 122 -3044 2456 1015 -3126 1654 1560 -2962 940 1987 -2825 295 2329 -2470 -320 2470 -1999
1864 -1999 -880 2506 -1451 -1182 2439 -1098 -1397 2481 -712 -1824 2494 -131 -2272 2223 612
1879 612 -2506 1761 1123 -2567 1280 1522 -2706 804 2039 -2678 80 2649 -2329 -839 2858 -1658
1895 -1658 -1526 2765 -956 -1976 2706 -351 -2477 2359 554 -2784 1822 1405 -2749 1012 1888 -2318
1911 -2318 373 1997 -1959 -89 2113 -1648 -546 2233 -1255 -1102 2154 -762 -1421 1802 -440
1926 -440 -1450 1696 -288 -1602 1640 114 -1949 1572 703 -2118 1061 1233 -1980 581 1482 -1776
1942 -1776 297 1784 -1763 -156 2171 -1507 -888 2177 -869 -1359 1939 -375 -1540 1648 -131
1957 -131 -1665 1546 277 -1991 1318 828 -2009 729 1201 -1670 326 1310 -1528 276 1525 -1546
1973 -1546 26 1910 -1424 -557 2089 -1088 -1042 2045 -688 -1435 1990 -394 -1875 1959 193 -2362
1989 -2362 1630 1046 -2588 770 1784 -2234 30 1944 -1698 -500 2021 -1237 -930 2042 -658
2004 -658 -1324 1837 -42 -1482 1336 398 -1293 973 347 -1128 889 361 -1309 815 520 -1446
2020 -1446 627 761 -1435 358 933 -1428 306 1102 -1546 100 1663 -1523 -490 2016 -1040 -1096
2036 -1096 1999 -559 -1418 1860 -140 -1710 1711 385 -2105 1401 1028 -2219 716 1569 -1905 53
2052 53 1706 -1483 -348 1649 -1285 -580 1774 -971 -1012 1724 -563 -1286 1637 -147 -1383 1430
2068 1430 56 -1481 1383 434 -1795 1242 944 -2055 815 1448 -1928 162 1835 -1676 -449 1858
2084 1858 -1329 -855 1965 -949 -1286 1940 -383 -1596 1561 169 -1686 1196 536 -1504 911 724
2100 724 -1439 834 901 -1461 544 1080 -1358 179 1298 -1283 17 1271 -1247 -305 1487 -1212
2116 -1212 -598 1715 -956 -1094 1800 -473 -1531 1715 -88 -1715 1481 422 -1935 1253 1038 -2084
2132 -2084 760 1508 -1923 153 1909 -1551 -301 1963 -1203 -731 1857 -805 -1151 1809 -383 -1450
2148 -1450 1547 -23 -1538 1271 254 -1523 1007 501 -1659 828 802 -1671 603 1161 -1660 311
2164 311 1403 -1410 -43 1553 -1226 -399 1785 -1013 -788 1784 -662 -1185 1772 -223 -1412 1459
2180 1459 131 -1579 1263 429 -1728 921 802 -1773 612 1207 -1696 253 1459 -1483 -143 1662
2196 1662 -1169 -490 1658 -986 -768 1757 -661 -1036 1620 -358 -1297 1530 -6 -1555 1350 263
2212 263 -1689 1043 575 -1825 847 1006 -1829 468 1408 -1692 17 1614 -1378 -472 1878 -1104
2228 -1104 -885 1869 -634 -1218 1684 -165 -1459 1489 279 -1546 1143 573 -1646 825 802 -1587
2244 -1587 552 978 -1566 256 1196 -1405 -26 1384 -1315 -349 1498 -1020 -633 1611 -753 -951
2260 -951 1627 -455 -1248 1621 -44 -1453 1495 331 -1631 1149 752 -1702 847 1084 -1662 396
2276 396 1362 -1559 -59 1558 -1327 -482 1611 -1068 -881 1587 -629 -1132 1514 -308 -1292 1363
2292 1363 56 -1395 1228 345 -1460 975 736 -1582 714 971 -1551 409 1238 -1463 27 1496
2308 1496 -1338 -421 1676 -1041 -830 1686 -610 -1228 1521 -199 -1439 1284 135 -1507 1069 548
2324 548 -1501 811 857 -1421 501 1095 -1299 207 1110 -1198 -26 1280 -1089 -339 1328 -878
2340 -878 -646 1349 -638 -963 1361 -397 -1136 1275 -51 -1294 1140 326 -1444 888 669 -1521
2356 -1521 593 991 -1348 290 1232 -1191 -59 1413 -1097 -474 1608 -791 -812 1546 -414 -1067
2372 -1067 1350 -96 -1313 1164 149 -1432 944 496 -1511 636 869 -1395 261 1084 -1223 -16
2388 -16 1212 -1064 -216 1281 -834 -530 1416 -542 -835 1377 -165 -1102 1152 160 -1175 879 377
2405 377 -1206 570 611 -1131 309 826 -1046 47 915 -908 -195 888 -729 -328 904 -670 -387
2422 -387 998 -475 -603 1064 -266 -804 897 44 -905 756 244 -1037 660 413 -1108 601 749
2439 749 -1135 165 869 -1041 -139 938 -873 -259 1044 -726 -494 1123 -511 -842 1150 -151
2455 -151 -1042 915 148 -1065 759 486 -1033 562 573 -1050 360 807 -987 -1 957 -899 -305
2472 -305 913 -680 -544 952 -455 -682 940 -229 -833 903 119 -955 693 371 -948 539
2488 539 550 -804 350 625 -822 183 698 -726 -38 733 -601 -172 684 -401 -270 559 -431 -313
2506 -313 660 -376 -547 761 -294 -680 736 -37 -773 666 193 -895 611 367 -970 442 701
2523 701 -1033 174 884 -850 -133 1032 -657 -346 1081 -498 -652 1038 -333 -842 923 -61 -979
2540 -979 757 285 -1088 549 483 -1004 316 665 -939 51 771 -847 -97 919 -653 -262 928
2557 928 -499 -428 879 -319 -491 806 -189 -707 779 35 -815 677 209 -923 510 417 -831 299
2575 299 492 -825 171 673 -749 -55 802 -591 -242 913 -473 -340 842 -318 -480 796 -219
2592 -219 -591 826 -48 -745 739 137 -882 544 329 -899 446 437 -926 254 671 -855 79 815
2610 815 -762 -156 903 -582 -453 957 -343 -563 976 -175 -719 959 19 -782 801 226 -913
2627 -913 594 455 -1032 354 650 -927 144 746 -761 -129 792 -655 -373 775 -413 -505 748
2644 748 -268 -569 746 -111 -571 719 0 -627 621 154 -729 582 250 -764 477 392 -777 317
2662 317 595 -778 101 726 -790 -86 798 -669 -294 829 -509 -497 864 -298 -631 838 -103 -760
2680 -760 724 128 -847 605 357 -845 461 516 -808 262 666 -741 69 750 -692 -210 829
2697 829 -527 -326 812 -409 -447 756 -200 -498 727 -67 -637 634 102 -771 575 255 -772 482
2715 482 457 -844 291 587 -825 112 765 -754 -126 786 -601 -338 813 -360 -433 743 -229 -520
2733 -520 725 -77 -665 557 94 -726 525 250 -691 451 402 -693 361 552 -692 151 607 -641
2751 -641 -16 712 -590 -169 789 -435 -355 815 -328 -517 794 -156 -718 731 -34 -819 536 212
2769 212 -887 437 504 -928 278 571 -790 39 733 -623 -153 868 -441 -290 773 -356 -406
2786 -406 751 -166 -492 653 -4 -553 635 71 -617 535 219 -624 452 296 -811 304 492 -735
2804 -735 183 592 -700 -59 711 -554 -228 790 -418 -399 801 -227 -544 712 9 -626 624 131
2822 131 -666 488 240 -682 319 399 -693 286 441 -729 52 612 -628 -56 672 -483 -230 702
2840 702 -401 -394 710 -264 -540 702 -14 -601 642 127 -728 576 264 -733 380 387 -760 233 554
2859 554 -721 -15 667 -565 -237 661 -458 -400 718 -258 -489 664 -94 -572 574 103 -558 398
2877 398 292 -548 323 326 -547 241 379 -504 189 456 -537 15 548 -459 -218 536 -413 -328 619 -312 -391
2898 -391 629 -160 -555 488 43 -526 424 120 -521 336 261 -574 264 324 -553 144 553 -499 -13 596
2918 596 -443 -197 589 -285 -290 591 -225 -366 591 -86 -490 499 86 -645 375 223 -544 200 230 -550
2938 -550 200 384 -579 97 563 -464 -115 560 -348 -271 561 -231 -334 578 -58 -479 472 14 -528 436
2958 436 181 -564 295 357 -487 98 359 -331 41 310 -375 -53 361 -297 -96 490 -284 -171 419 -129
2978 -129 -221 432 -158 -295 413 -111 -312 387 47 -482 353 146 -450 262 212 -453 146 328 -459 64 423
2999 423 -475 -19 524 -373 -178 572 -250 -279 565 -77 -421 494 68 -481 444 163 -525 262 321 -534 88
3020 88 409 -413 32 395 -420 -121 340 -366 -153 459 -220 -218 457 -160 -314 419 -45 -368 427 26 -469
3041 -469 355 140 -444 336 295 -493 150 363 -403 57 383 -306 -40 420 -333 -171 360 -247 -218 411 -150
3062 -150 -283 379 -114 -344 281 45 -365 273 72 -407 242 181 -385 201 288 -398 92 329 -381 -6 384
3083 384 -355 -87 407 -321 -237 545 -209 -319 470 -42 -413 384 24 -487 279 201 -523 205 321 -407 103
3104 103 404 -325 -108 402 -286 -187 404 -186 -190 383 -138 -243 328 -66 -240 300 -35 -346 240 -9 -376
3125 -376 241 84 -404 220 228 -381 107 269 -382 34 370 -288 -18 359 -234 -131 407 -194 -180 407 -137
3146 -137 -233 399 -72 -268 326 13 -352 251 131 -405 134 182 -396 92 262 -309 18 278 -307 -73 361
3167 361 -204 -113 373 -183 -147 390 -118 -228 352 -65 -291 310 70 -362 281 163 -423 168 252 -415 91
3188 91 259 -301 -99 372 -310 -155 314 -164 -153 322 -151 -244 299 -80 -208 210 2 -251 239 90 -199
3209 -199 173 69 -241 166 143 -272 145 189 -338 80 289 -274 -10 296 -280 -84 302 -246 -179 315 -112
3230 -112 -216 366 -6 -258 278 81 -328 249 138 -353 106 176 -357 87 225 -289 -11 272 -277 -82
3250 -82 297 -200 -114 227 -167 -149 222 -106 -155 248 -40 -185 271 27 -202 266 111 -260 241 163 -292 147
3272 147 247 -274 24 324 -286 -62 303 -193 -161 283 -100 -264 251 -88 -254 202 -5 -232 231 1
3292 1 -278 142 82 -199 87 94 -203 74 118 -232 96 213 -199 32 239 -222 -44 301 -218 -160 327 -158
3314 -158 -153 336 -109 -203 302 -6 -307 256 77 -316 196 200 -328 117 236 -274 -20 279 -265 -10 328 -189
3336 -189 -108 335 -127 -247 260 32 -164 215 -4 -246 154 50 -205 173 80 -232 126 162 -219 119 159
3357 159 -275 27 199 -176 -10 242 -218 -59 333 -88 -144 296 -69 -185 239 -16 -261 149 39 -290
3377 -290 138 80 -204 38 123 -251 11 128 -211 10 191 -193 -69 261 -151 -40 260 -57 -114 233 -33
3398 -33 -181 239 -50 -116 204 26 -157 239 59 -231 136 178 -268 120 165 -291 7 223 -252 -12 285
3419 285 -196 -173 298 -73 -277 257 67 -301 115 17 -202 125 104 -159 69 139 -180 -6 143 -131 39
3440 39 119 -93 -4 64 -153 -42 180 -94 -79 139 -64 -131 189 -63 -129 111 -24 -90 186 13 -206 132 83
3463 83 -161 116 139 -140 14 173 -188 33 222 -150 -43 214 -147 -128 181 -45 -148 186 8 -212 182
3484 182 59 -159 138 61 -164 136 129 -152 168 78 -211 59 139 -172 -33 139 -162 -35 208 -175 -104 214
3506 214 -102 -209 221 -52 -213 153 39 -214 79 117 -204 120 98 -151 53 192 -118 -5 106 -104 -34
3527 -34 109 -90 -22 168 -101 -43 223 -28 -101 125 9 -75 105 -37 -163 87 -51 -154 89 10 -172 86
3549 86 55 -246 47 121 -136 5 191 -191 -56 255 -152 -101 182 -74 -128 180 -67 -159 259 15 -200 138
3571 138 107 -182 73 117 -153 7 151 -143 -3 190 -93 -42 207 -96 -47 142 -40 -93 74 -28 -75 139
3593 139 -10 -148 92 62 -119 117 86 -90 110 31 -134 85 35 -121 48 86 -163 -13 165 -95 -58 141
3615 141 -85 -107 112 -9 -100 161 -14 -88 163 24 -110 130 25 -113 40 59 -132 -41 97 -104 -18 75
3637 75 -141 -40 152 -93 -76 147 -124 -34 122 -107 -193 157 -53 -132 144 52 -115 100 61 -150 109 169 -132
3660 -132 76 114 -111 37 121 -19 -59 155 12 -102 130 -40 -108 57 -64 -84 109 -18 -125 53 17 -100
3682 -100 39 60 -74 60 63 -143 33 33 -103 23 118 -80 3 125 -54 -80 82 -114 -50 153 -72 -147 76
3705 76 11 -114 123 77 -132 88 78 -134 6 56 -71 38 53 -40 20 75 -48 8 99 -9 -36 24 -95 -53 87
3730 87 -89 -94 94 24 -84 84 16 -80 73 47 -168 74 111 -90 10 96 -123 -44 169 -20 -38 103 -12 -93
3754 -93 70 3 -58 70 59 -58 57 37 -87 6 19 -63 30 -10 -90 16 28 -135 2 38 -106 11 88 -96 -20
3779 -20 86 -101 5 119 -33 -9 158 -2 -102 95 16 -47 134 39 -95 125 15 -109 45 53 -142 5
3801 5 127 -157 -21 144 -41 -72 58 -25 -54 66 -52 -99 88 -33 -51 130 -7 -1 130 1 -96 65 53 -35
3825 -35 29 34 -101 -23 81 -89 -7 74 -63 -54 100 -70 -14 76 -37 -78 35 -27 -39 48 0 -104 -23 30 -53 -27 -49
3852 -49 16 30 7 -63 52 69 -48 -24 61 -50 -64 70 -50 -17 167 -15 -56 57 -6 -61 120 -37 -89 57 -69
3877 -69 -77 99 70 -73 73 45 -113 30 102 -92 -24 145 -71 34 49 -34 -44 84 -23 -94 51 2 -51 34 -41
3902 -41 -53 66 13 -34 -2 42 -104 43 110 -23 34 21 -26 10 106 -21 -46 82 -5 21 63 -33 -31 93 -23 -70 97
3929 97 -11 -86 28 -26 -42 32 -19 -117 49 11 -46 82 35 -79 -34 11 -34 35 95 -9 29 52 -48 -7 45 -32 10
3956 10 78 -18 -52 -15 -12 -48 88 6 -48 94 83 -82 53 53 -125 5 83 -92 -30 108 -39 -24 71 -20 -57 41 -8
3983 -8 -37 41 -5 -23 24 2 -32 46 47 -80 62 -36 -97 4 33 -48 92 29 -55 -6 67 -6 -14 72 -1 -19 33 28 -49 25
4013 25 23 2 55 16 -31 27 -18 -28 48 -60 -76 39 9 -68 32 12 -53 -6 36 -45 4 44 -60 -36 27 18 -50 71 -51
4042 -51 -30 36 80 39 34 35 -28 32 69 -22 29 27 -97 16 27 -117 -49 39 -25 -38 25 -44 -57 36 -29 -59 14 -13 -49 -25
4072 -25 1 -21 17 -9 -49 -3 8 19 23 56 -68 25 79 -44 28 75 -30 0 90 -75 -14 25 17 -15 41 21 -12 5 -23
4101 -23 -20 49 -3 -26 25 13 -91 23 29 -89 8 44 -44 26 23 -79 -27 43 -61 -61 63 39 -72 35 25 -56 -23 35
4129 35 -58 60 -22 -46 70 11 -8 -3 11 -67 -27 74 -23 -24 82 -45 -2 40 0 27 67 -15 4 24 5 -83 44 7
4157 7 -47 1 38 -25 14 -28 -39 30 -47 9 44 -6 -4 -18 39 13 10 77 52 -35 47 -27 -88 43 -38 11 59 -3 -66 12 -23
4188 -23 -60 42 35 -38 -21 6 -92 11 -40 -14 -7 -69 -12 -12 10 -106 -8 71 -77 -62 74 -4 1 52 -17 8 39 40 -42 46
4218 46 3 16 48 38 -14 9 27 -30 21 -3 -36 -3 23 -58 12 77 0 -31 80 -41 5 -60 -7 26 15 8 -73 9 40 -28
4248 -28 21 38 -1 3 -9 -14 60 -16 -27 1 13 -42 -11 -27 -15 -34 19 -8 -32 12 -41 -72 -26 -12 -16 18 45 -50 7 19 -76 18
4280 18 -5 -79 42 -11 -24 11 18 -55 30 29 -12 8 64 -45 -10 36 -21 -15 43 67 -51 29 -33 13 15 24 -39 6 35 0 -1 5
4312 5 -23 15 20 -68 32 21 17 -40 -1 -4 -25 -33 -59 -19 -15 -47 -52 1 7 10 -61 8 -57 1 71 -8 51 14 -31 66 45 -72 -18 27
4346 27 -38 -6 12 -24 16 27 -42 -3 37 21 3 9 22 -41 73 17 10 21 -75 -25 7 17 -47 -34 38 -26 29 -28 -28 20 25 -53
4378 -53 -27 53 4 -15 1 -4 -26 39 -26 68 40 -8 0 10 -34 -28 -17 -15 9 55 15 -20 29 59 -51 -13 39 0 -56 37 -18 -16
4410 -16 44 1 11 6 -24 -46 10 -13 -3 -25 -5 33 -13 28 16 -24 8 -23 -21 -1 -21 47 5 17 37 85 -7 16 56 33 -4
4441 -4 45 12 -26 48 -15 -1 57 -23 -4 -3 39 -51 -23 -7 -15 18 -10 -19 -30 19 -20 -12 37 12 3 -6 -31 6 35 -23 31 -8 7 12
4475 12 42 -1 68 38 18 28 29 14 -11 8 52 3 16 18 -63 46 35 -12 -15 -58 66 -29 11 -38 -23 -6 -20 6 10 -5 -25
4506 -25 112 57 -48 41 -34 -36 23 27 8 24 13 -57 71 31 -85 11 48 1 -5 4 -21 -21 37 -7 36 10 -5 -29 38 19 -10
4537 -10 -53 23 -41 -36 23 -11 -20 67 -24 -41 46 -98 7 -22 -47 -15 -9 8 -8 47 33 -43 77 -29 -9 -9 -50 11 47 58
4567 58 -47 -8 -29 -28 55 19 -9 9 14 -18 24 33 -80 -9 -6 -40 -30 30 47 -11 -19 -42 -27 32 11 -32 39 -11 -63 19 -10 -52
4599 -52 27 30 -36 16 1 -28 -46 8 35 22 41 -1 -60 38 -6 -2 -83 -29 -60 18 -16 -12 13 26 11 9 2 -34 -5 50 -39 -1 -8
4632 -8 -69 38 23 -27 17 1 -32 -56 7 -10 -39 19 -35 -30 -30 29 -28 14 -30 17 74 32 -23 41 51 -75 -11 102 -28 15
4662 15 16 -30 6 65 22 19 44 -33 -14 -4 68 -4 -7 -3 -46 26 5 -41 8 -37 -45 30 -13 -38 15 -18 -41 -24 92 -7 17 67
4694 67 -7 30 3 5 -13 68 -5 -29 31 28 -2 -23 23 -50 -71 -5 -23 32 -21 -64 -9 31 -16 -18 -1 -22 8 55 32 -4 31 -19
4726 -19 -8 12 51 -35 0 -19 -37 17 11 -54 45 22 -31 -8 63 -19 57 -14 4 8 11 -55 63 -10 -127 -54 45 28 4 58 13
4757 13 -56 43 34 -47 2 -15 -37 -10 22 -51 -27 67 -33 18 62 -46 -44 42 -18 -6 51 44 -23 38 -31 48 65 -9 -91 39
4787 39 0 -12 77 26 -45 35 34 6 9 14 5 74 18 6 -19 -7 -34 5 -19 -47 -2 40 -44 -8 16 13 -5 35 -32 -50 3 -2 -23
4820 -23 33 -20 -37 56 33 -9 31 39 16 -11 106 -49 27 48 -34 10 32 -29 -37 12 19 -41 6 -54 -37 39 2 -17 0 33 -62
4851 -62 9 20 -71 -4 34 18 75 4 -12 5 15 16 -29 75 -58 -18 85 10 3 43 -14 1 62 73 9 78 -1 -45 -1 19
4881 19 -64 7 44 -61 51 -4 -37 -8 27 -42 -22 34 -22 -5 71 26 -86 5 32 24 49 13 -63 1 -23 -88 41 21 -77
4910 -77 -15 7 -39 23 31 -20 19 58 -26 37 42 -36 10 34 6 -49 29 -11 12 69 11 -27 60 17 -58 -42 -12 -39 -10 -10 -51 -6
4942 -6 29 -48 16 58 -72 -11 -16 -40 -43 6 36 -21 5 30 -38 -19 23 38 63 72 -17 29 -29 -34 41 40 -40 45 8 -77 -3 27 -14
4975 -14 -6 29 -74 -20 9 -59 6 44 27 -41 71 34 -70 52 37 -34 -14 -5 -47 -12 -8 -15 1 22 -42 -4 26 2 17 53
5005 53 -56 -5 11 -10 -15 29 52 16 47 -39 -23 54 32 -47 12 24 -44 23 35 -14 35 -11 20 33 28 -18 -19 23 14 -4 37 -1
5037 -1 -42 -42 3 -34 9 7 -37 32 1 -64 25 56 -92 29 -1 12 -47 -10 1 -5 -3 -35 18 46 -42 -48 1 -48 -71 28 1 -79
5069 -79 43 13 -24 10 -11 -42 -6 15 6 -13 44 -37 23 64 -23 -5 -24 43 6 43 -8 -11 69 9 -13 70 41 6 11 29 -43
5100 -43 3 -18 -83 29 -1 -81 -28 27 -41 -34 -3 -16 -24 32 -17 -69 47 -42 33 27 6 -1 40 -29 13 37 25 -25 -1 4 20 -53
5132 -53 12 -24 77 22 -7 -3 -1 -44 3 9 -36 -47 15 -23 -34 57 -66 -21 20 -81 27 10 16 -39 -45 17 -68 53 -47 -110
5162 -110 24 33 -3 42 -21 -109 1 51 -22 -48 47 47 26 42 28 19 15 -10 -2 46 -9 -47 20 -14 -23 23 -8 -32 36 -9 -38 -26
5194 -26 -39 -31 -23 2 -30 -44 58 -62 -55 33 -27 -28 18 22 -50 40 22 -52 91 -33 2 1 67 -14 0 19 -62 -18 28 -5 15
5225 15 18 -19 30 0 -25 -26 -2 -3 -13 21 -33 -32 39 -27 -6 3 21 -64 10 -35 -2 -52 64 -66 28 66 -38 38 -18 -29 -24 -10
5257 -10 45 13 -4 -2 -10 14 -9 -14 -18 -27 -21 9 -15 -42 1 18 -41 -3 9 -10 -21 -41 18 -74 -17 -18 -11 -44 25 -54 46 -1 -55 5
5291 5 -87 -70 63 -41 -10 63 -29 -7 6 45 -21 49 6 -45 47 -6 15 -11 49 -12 69 62 -1 -13 31 53 -23 26 -25 -19 25
5322 25 31 -96 40 11 -81 1 12 -34 2 50 -30 65 55 -10 -29 -44 -19 15 36 -2 -81 8 -4 -1 44 -25 -11 46 16 -53
5352 -53 37 23 23 17 38 -102 -35 10 -29 -15 65 -53 -39 39 -18 31 -16 -44 -36 52 -33 35 39 -20 -7 45 -32 -10 39 78 -95
5383 -95 -1 45 -47 -2 59 -30 43 48 -79 65 29 -26 -57 56 -31 -73 35 -24 -27 14 -17 -9 -28 -5 -24 26 10 -45 28 29
5413 29 -18 43 38 -17 -12 26 -57 -31 28 -13 26 40 -43 -5 -20 -16 -71 66 -15 -16 -8 -14 -54 9 16 -64 17 3 9 19 14 -69 4 32
5447 32 -5 -20 49 -77 7 52 1 -62 -3 44 -57 -2 2 -28 21 37 -62 4 -14 -50 -47 -21 47 -21 39 -70 22 28 16 -5
5477 -5 54 -30 47 -10 -26 7 27 11 -61 17 -10 -58 0 12 -63 -16 -22 -73 -17 -2 -14 -7 -23 6 -65 62 -6 13 49 -29 24
5508 24 11 -3 -4 -5 -60 -3 -2 7 -25 27 13 9 12 0 4 -5 5 -1 25 27 15 23 24 -7 53 4 -59 -43 35 -30 -19 58 8 -15 68 52
5544 52 3 64 -30 -64 28 5 -82 79 -29 -5 -7 -5 -59 -16 39 -46 17 4 -11 -2 3 -63 6 62 -30 15 43 -23 -30 36 2 -71
5576 -71 -17 -76 -31 -15 -53 -55 -39 -8 -65 -27 91 -59 -33 22 -22 -21 1 -78 -44 46 38 1 0 21 17 -11 31 1 24 16 -29 2
5608 2 18 -26 49 51 -28 -10 5 -37 18 57 -80 4 2 -78 2 10 -84 28 47 -2 -50 -4 7 -7 25 18 -34 -4 46 -28 38 30
5640 30 -24 1 55 -36 67 52 25 -78 18 36 -24 32 15 11 18 -13 -2 4 -15 -40 4 -11 -69 55 -37 2 -25 25 -38 -52
5670 -52 47 22 -12 34 -61 -5 -2 -10 -25 34 27 -67 42 -16 -74 3 -6 11 21 8 -19 76 -15 -25 27 1 -13 1 15 -23 7 22
5702 22 -15 -3 10 -24 -12 31 -38 -39 28 14 -5 17 -17 -114 59 -28 -21 -15 15 -49 -48 57 -38 -12 30 -41 -26 69 5 -50 30
5733 30 15 -32 42 -4 -35 20 60 -42 -29 34 -6 15 21 -60 45 43 37 18 -18 -11 -6 -9 8 12 -38 -47 -33 23 1 45 41 -56 -41 111
5767 111 -11 -6 8 -36 -25 22 10 -63 -9 6 -13 -19 -5 -10 29 -2 -36 -5 -15 23 39 11 -91 11 71 -11 30 40 9 30
5797 30 17 -8 -25 12 21 -53 44 54 -38 20 15 -83 22 5 -3 -6 29 -30 28 70 0 -84 91 29 -9 43 44 9 -3 40 -42 19
5829 19 47 -57 -26 49 -22 38 7 -54 12 -18 -30 7 -52 -26 -18 -29 -74 9 -26 -4 29 29 -2 -65 13 29 -35 56 29 -80
5859 -80 0 14 -20 -22 20 46 31 37 -35 -28 -41 -1 15 9 -9 -53 22 43 -42 50 5 -43 49 -5 -19 -9 15 -72 32 24 -27 -53
5891 -53 10 -8 35 51 -3 -50 48 -11 -22 98 -37 -10 100 -12 -52 50 -41 -23 34 -5 -50 5 19 -27 -21 36 37 -27 11
5920 11 -35 44 -2 -11 -42 52 -52 -46 -6 0 -55 35 -19 -28 31 24 -59 12 -15 -45 -9 8 -33 26 4 -61 53 72 -47 -4 61
5951 61 -70 27 28 12 -79 74 -27 -42 45 -39 -13 33 59 5 47 13 -51 25 40 -43 -20 25 -43 -11 8 -12 2 -17 -33
5980 -33 -21 8 -20 24 6 28 -1 51 -34 -43 38 -57 38 61 1 -48 -12 16 -41 37 -39 5 8 -6 -26 -8 25 -17 -12 37 -27 -86
6012 -86 52 -31 -4 9 -27 -42 -53 16 -13 1 5 -27 -1 7 -30 14 -13 -46 -24 -49 -59 4 -43 -71 -29 9 26 -31 27 -19 -22
6043 -22 0 -30 -24 48 -34 -62 -28 16 34 38 22 -46 -30 -24 -2 -9 29 -83 -55 23 -34 -14 17 36 3 1 56 -76 -20 -8 4 55
6075 55 0 13 -28 -36 -13 11 45 40 29 29 33 47 63 -27 -7 23 -15 11 53 -5 -68 40 -18 -8 -12 -78 -10 -1 3 -48 19 -39 -79
6108 -79 19 33 -26 -56 40 22 -44 4 -45 49 -2 -24 23 14 2 33 16 -60 43 37 -8 -12 -8 -8 -45 -16 2 -23 -30 15 -9 -12 -36
6141 -36 -44 -20 29 -56 0 -30 -6 -2 3 -61 4 -10 32 -32 17 32 -9 36 -51 -13 -15 7 -30 -19 -36 -55 13 50 -19 26 21 17 -7
6174 -7 38 -33 3 42 12 67 8 -41 -72 26 -41 -42 29 -33 10 15 -5 -44 -17 -27 -90 -6 -13 -54 34 7 -11 14 -26 -30 -12 -6 15
6207 15 -48 -10 -5 -44 27 18 12 -22 -6 -15 73 -15 -26 54 -2 15 -14 16 -45 43 11 -25 -11 22 -51 -28 24 -79 -47 53 -26
6238 -26 -30 24 16 -15 -20 -36 -26 1 -25 -24 -5 19 -28 -26 -15 -10 42 13 -40 -21 13 -41 57 10 -8 -8 31 -39 9 -4 -48 -72 27 -37
6272 -37 9 15 -53 -53 24 29 -68 -22 -46 -74 -13 47 -55 -41 24 -9 8 -7 14 -34 28 -51 -16 28 53 -36 5 -20 2 3 15 -21
6304 -21 -10 -7 -15 21 22 -46 -4 33 -34 57 -23 -17 -69 -14 -17 -48 32 -1 -24 -8 -68 -13 4 -16 -17 8 -45 -80 53 27 -44 34 37
6337 37 2 -23 9 -66 15 14 -7 -19 7 -24 -14 93 10 -19 25 14 -16 14 -13 -20 50 11 7 29 1 -20 -11 -59 10 -30 44 -17
6369 -17 -16 8 -47 -2 -39 -36 4 27 -15 32 11 -4 6 40 9 -48 41 -7 17 -11 15 -56 12 59 -22 15 -18 -17 -28 60 -28 -21
6401 -21 -22 -25 -3 4 -31 46 -37 -44 -35 23 -22 -4 67 19 -23 -14 10 -21 -31 20 -11 17 9 -60 -28 49 -12 9 26 2 -51 33 -23 -11
6435 -11 73 16 -45 -77 -22 -65 -4 17 -51 -8 16 -17 31 31 8 -28 29 -80 17 -45 -16 -6 5 2 -1 -36 -11 -17 31 -60 -3 -30
6467 -30 -30 -13 11 31 -32 39 -22 14 -1 31 -12 -16 9 -2 6 34 -31 -4 54 19 -5 11 -17 -32 -25 -63 -40 -8 -41 -36 -41 -35 -9 38
6501 38 -20 -49 65 21 13 33 54 -6 5 96 -3 -11 65 -9 5 14 -20 17 17 -15 -31 80 18 -19 17 -24 -29 39 19 -15 -14 59
6533 59 -41 3 34 -80 35 75 16 -92 1 -3 -19 -38 -6 -6 6 -56 -6 -33 15 -42 -23 43 -42 -33 6 -3 21 45 -17 -6
6563 -6 21 24 -24 -5 1 10 5 -21 -14 -24 -45 27 26 -19 -56 7 11 -53 -7 16 -24 11 -53 -70 -17 28 -28 -9 -21 -38 -35 10 14 19 12 1
6599 1 7 20 -37 -39 56 -1 -15 -3 16 -64 -24 20 -37 28 7 -34 -1 58 -32 -53 8 -40 -44 62 -2 -38 -17 -34 12 -75 0 33
6631 33 -4 -9 -2 9 8 -23 -18 55 -19 8 -16 -46 60 33 -7 -22 -65 -8 -19 -10 -6 10 13 -55 -33 37 -22 -36 23 -7 4 11 51 -22
6665 -22 -15 -38 -81 1 -19 -109 -23 26 -36 -34 11 -51 -22 8 33 7 39 -34 32 22 -5 4 -5 5 -11 -22 7 11 31 -9 -3 15 6 8
6699 8 -29 24 -25 16 50 -27 15 34 -54 13 12 -13 -24 14 -12 -26 -15 7 -56 -32 22 24 -22 -35 62 -31 15 -8 29 28 27 23 -44
6732 -44 -9 -19 51 -34 -7 50 -29 8 -3 30 24 20 6 -60 24 -20 -45 17 29 -10 -6 -7 -29 -15 -28 -28 -27 1 -17 -22 33 -61 12 4
6766 4 -11 -2 -16 -15 1 7 -31 -33 12 40 -12 27 -66 -13 -30 -2 5 11 -27 -3 -22 -39 -19 -58 -24 -48 -27 4 44 -67 -61 -23 -44 4
6800 4 -22 6 -22 24 -32 -13 47 -39 2 34 -15 16 -1 -32 53 59 -27 -2 18 -6 50 39 -1 53 22 -24 31 -47 -27 -83 8
6831 8 36 -105 29 16 -47 -2 0 -6 -35 38 -22 -32 16 -25 -36 -42 -103 46 -12 13 -19 20 18 -70 7 3 35 6 6 7 13 -1 8 43
6865 43 -53 39 -2 -34 -22 -14 12 -31 85 -4 -15 -47 34 -42 13 6 -74 32 -8 8 -16 -10 -20 -19 -8 -38 39 20 -2 -7 -10 29
6897 29 -1 45 12 -42 33 48 -58 28 81 -20 12 -25 -3 -4 44 -63 -32 32 -3 -8 9 38 -7 11 38 -28 -39 -32 -39 -34 -1
6928 -1 -29 -34 -15 -63 -18 6 -78 -29 44 -15 -10 43 69 -9 -2 -7 -1 40 4 -4 24 -74 5 -9 30 -28 -22 5 -4 -14 17 -14 -20 -10 -38
6963 -38 -9 -12 -30 -41 30 2 -41 14 -40 -1 -45 6 8 2 -20 -42 3 32 27 -22 -12 -81 47 11 -36 -37 13 -48 -15 38 44 17 18
6996 18 8 -18 48 9 13 -5 7 -21 16 33 5 -37 4 -66 21 -31 8 20 -25 -26 30 30 -44 -65 -29 16 -26 -26 0 12 -80 5
7028 5 -37 -2 -18 21 -48 -34 -11 54 25 -46 0 21 20 27 -20 -20 -6 8 19 27 11 -55 -10 76 26 -51 24 -53 -18 6 35 -23 -33
7061 -33 -38 -26 -37 6 -29 13 28 -54 -21 25 -7 7 10 -17 37 -14 -4 -41 0 24 -20 28 14 -37 50 -29 0 38 -23 -1 -26
7092 -26 42 8 -56 40 -48 3 -7 -51 -14 -14 -69 -37 -35 -5 -56 -8 -22 -44 24 -35 -51 -17 -14 -3 53 -38 -8 -6 4 -8 35 -19
7124 -19 -31 4 -6 -14 8 -28 41 -19 46 -32 0 25 -64 -37 -39 -15 -39 -18 -9 -22 -3 10 -50 -40 -43 -8 -58 -23 7 11 49 27 9
7157 9 -17 -4 -28 10 39 -32 10 28 -26 36 -32 -38 -28 24 -14 -28 26 -34 -9 -11 -45 -26 -25 -6 -57 24 37 -20 -9 -23 -17 21 -81
7190 -81 -9 16 -43 -29 -50 -18 -24 -2 3 -19 22 -14 -47 46 -10 7 -10 -12 52 -45 -39 -13 51 13 -7 -26 8 -10 -14 8 -33 1 41
7223 41 -19 -34 18 29 -26 -2 21 -60 -50 9 -49 -37 -23 7 5 4 -28 -21 -32 -6 -36 6 -59 -24 1 25 -26 9 -22 -10 36 34
7255 34 12 10 25 11 19 -30 -32 1 -43 -25 44 34 1 -31 13 5 19 19 -46 -50 -36 -59 -39 41 20 -21 -23 11 19 -32 15 -34 35 -44
7289 -44 -2 -8 44 -28 -47 19 -17 -38 8 -21 19 -27 -17 53 -44 12 -41 11 -32 -52 -70 33 -9 -5 -2 -18 -28 40 -72 -2 12
7320 12 -9 -60 -11 -11 -30 -26 -6 -51 55 12 -25 47 16 21 36 10 64 24 3 -26 -3 51 8 -4 40 15 -24 47 -38 -1 -11
7351 -11 -24 15 -24 -38 7 -14 -43 -66 41 15 -14 -19 -6 -40 15 6 -9 8 1 -22 17 24 -50 -8 -8 25 11 -20 -30 -17 -14 9 3
7384 3 -19 -29 -28 0 12 -16 -37 -12 7 22 -56 53 -1 -30 -24 -28 38 -9 -21 41 4 0 -42 -23 -26 35 -41 50 48 -34 18 42 5
7417 5 0 -4 17 -10 -36 -38 -44 -14 31 -3 -34 -20 0 7 0 21 37 -19 -24 -33 29 24 49 31 -64 -22 0 -102 17 28 16 -13 -14 -66 -7
7452 -7 -47 -71 -47 48 -25 26 11 -41 -7 51 -6 -13 -29 -2 -18 11 -40 13 7 -38 12 -20 -1 -35 -24 30 36 21 -6 -11 43 -18 -48
7485 -48 23 5 31 -52 -18 21 -17 0 -84 -28 -7 -36 -55 28 42 -13 -31 1 -78 24 -16 6 7 -17 -28 -28 60 0 -5 -53 9
7516 9 -2 -29 4 8 46 -3 -29 -27 24 33 -48 -1 -6 -30 16 -18 -59 4 -64 0 -18 19 -39 12 -38 16 -13 -20 -48 -28 13 -44 -59
7549 -59 -21 28 -43 -7 44 27 -44 15 20 0 -4 -30 9 -10 -13 13 24 -30 -22 34 23 74 7 -30 1 18 -16 0 -40 -34 -14 13 -31
7582 -31 14 6 10 -2 -1 -23 -14 5 40 9 18 8 30 41 -3 -58 -7 -17 9 -16 -20 -19 28 -47 -47 19 30 6 -13 -12 -16 38 6 -51 5
7617 5 -5 -2 5 -22 -40 14 4 -22 -20 -16 -30 -8 -20 -1 15 -17 11 -1 1 18 -43 8 23 -3 25 -8 -15 37 22 -21 -18 -14 73 -24 -10
7652 -10 -4 2 -6 41 -54 -37 -12 4 -28 -11 -28 26 16 -11 -46 23 -7 -14 47 -15 -16 -19 -11 -51 -7 -32 -9 -20 39 11 -14 32 4 -13
7686 -13 12 15 -19 75 -9 -16 57 19 24 3 -22 -1 15 -30 -30 28 38 23 -17 -43 -53 -15 -35 -47 58 -14 16 -14 0 -32 18 45
7718 45 -18 -13 -15 38 4 -6 -15 -12 9 -24 22 60 20 1 24 -28 28 -5 36 -16 -19 -15 -26 -36 23 22 31 -10 25 14 -33 -87 -32 14
7752 14 -20 18 38 -72 -9 9 -42 -13 -22 -41 -20 32 -30 -5 24 -38 -12 11 -26 -56 39 8 38 14 31 10 39 -31 -21 -40
7782 -40 -24 16 -19 -14 19 -10 -6 10 9 -49 -63 -69 22 -25 -53 3 -70 -35 -4 -6 -9 3 20 22 22 -32 1 -25 9 -21 -1 75 -22 24
7816 24 38 17 -13 -36 39 -6 -32 27 -81 -16 -5 -3 27 -32 -2 -61 15 37 -40 -46 -14 23 8 39 -14 -24 -20 -93 68 9 -23
7847 -23 4 22 -53 22 22 -40 -26 19 -43 -65 -6 16 -5 -7 6 -3 28 -12 -9 4 21 6 -34 2 -59 -6 84 -44 -76 -28 -8 -37
7879 -37 10 -11 -46 37 24 8 -20 -43 -19 -48 -29 -37 -7 -51 -5 -12 -16 28 3 7 11 2 25 -29 59 15 -38 9 6 -24 23 16 45 12
7913 12 -3 5 44 92 -18 -26 -27 -7 -8 15 -71 28 -18 -69 10 -81 18 11 26 -10 6 -19 -78 -39 6 7 -27 3 -33 -20 10 -4 -19
7946 -19 -16 15 32 -8 -5 -52 -4 28 -4 7 15 4 -22 16 -9 -44 39 36 7 -52 -40 1 41 -20 -3 -46 -48 -2 -67 10 -8 -34 -19
7979 -19 11 20 27 -29 -20 23 -28 17 -75 -35 -49 -13 -25 22 56 -50 -33 -16 47 -30 -12 0 -58 -11 40 31 -11 -55 -23 -19 -53 -17
8011 -17 -28 66 -27 -22 10 -45 1 19 -42 -56 -9 -14 -37 -9 -10 20 -52 37 15 30 13 86 -13 -25 12 23 22 -6 -33 -31 -28 16 6
8044 6 -20 1 -22 -31 -56 -37 -73 -7 -12 22 -37 -2 12 -57 3 -18 26 -18 -78 -27 -17 18 -4 17 14 67 0 19 -28 70 27 35 -22
8077 -22 -1 -57 7 25 -37 -17 15 -6 -20 9 -16 -79 -54 -3 -12 33 25 -34 -8 20 -44 16 22 -18 -39 10 19 -34 -37 42 -30 -9 -87
8110 -87 -28 -46 20 -16 -4 -16 -19 -23 10 1 31 5 -39 29 -4 0 -41 32 -43 29 77 -12 -14 20 41 48 -6 -22 -4 -61 35 -6 24
8143 24 -33 -87 59 50 -36 -16 -37 -5 -35 19 37 -31 3 -36 13 19 8 32 45 52 27 20 33 20 -15 -30 -22 1 18 53 -36 -57
8175 -57 -35 -29 -41 -39 4 -9 -47 -27 -5 -11 -9 42 0 -2 -31 1
8191A
##END NTUPLES=NMR FID
##END=
