##TITLE=1H_AM_NV50
 CDCl3
 8 sc, 
 7.6.2023
##JCAMPDX= 6.0         $$ Bruker NMR JCAMP-DX V2.0
##DATA TYPE= NMR FID
##DATA CLASS= NTUPLES
##ORIGIN= UXNMR, Bruker Analytische Messtechnik GmbH
##OWNER= root
$$ XWIN-NMR		Version 3.5
$$ Wed Jun  7 16:29:52 2023 Russian Standard Time (UT+4h)  she@DPX200
##.OBSERVE FREQUENCY= 200.13135
##.OBSERVE NUCLEUS= ^1H
##.DELAY= (6, 6)
##.ACQUISITION MODE= SIMULTANEOUS
##.ACQUISITION SCHEME= undefined
##.AVERAGES= 8
##.DIGITISER RES= 18
##SPECTROMETER/DATA SYSTEM= spect
##.PULSE SEQUENCE= zg30
##.SOLVENT NAME= CDCl3
##.SHIFT REFERENCE= (INTERNAL, CDCl3, 0, 15.7039)
##AUDIT TRAIL= $$ (NUMBER, WHEN, WHO, WHERE, WHAT)
$$ ##TITLE= Audit trail, XWIN-NMR		Version 3.5
$$ ##JCAMPDX= 5.01
$$ ##ORIGIN= Bruker BioSpin GmbH
$$ ##OWNER= she
$$ F:/spectra/data/she/nmr/H-F/1/audita.txt
$$ ##AUDIT TRAIL=  $$ (NUMBER, WHEN, WHO, WHERE, WHAT)
(   1,<2023-06-07 16:28:47.31 +0400>,<she>,<DPX200>,
      <created by zg, POWCHK disabled, PULCHK disabled
       configuration hash MD5:
       00 E9 B6 7A A2 85 ED C7 34 08 36 98 17 FE 4E 26
       data hash MD5: 16K
       94 2F 16 0A 06 A7 FC BC F3 1E AD 2B A9 73 6D 78>)
$$ ##END=
$$ 
$$ hash MD5
$$ A2 19 4C 3E B1 21 F6 55 D4 6F 3C FF DA A4 97 02
##$RELAX= 
##$RELAX= 
##$RELAX= 
##$RELAX= 
##$RELAX= 
##$RELAX= 
$$ Bruker specific parameters
$$ --------------------------
##$DU= <F:/spectra>
##$EXPNO= 1
##$NAME= <H-F>
##$PROCNO= 1
##$TYPE= <nmr>
##$USER= <she>
##$AMP= (0..31)
100 100 100 100 100 100 100 100 100 100 100 100 100 100 100 100 100 100 
100 100 100 100 100 100 100 100 100 100 100 100 100 100 
##$AQSEQ= 0
##$AQ_mod= 1
##$AUNM= <au_zg>
##$AUTOPOS= <>
##$BF1= 200.13
##$BF2= 200.13
##$BF3= 200.13
##$BF4= 200.13
##$BF5= 200.13
##$BF6= 200.13
##$BF7= 200.13
##$BF8= 200.13
##$BYTORDA= 1
##$CFDGTYP= 0
##$CFRGTYP= 5
##$CHEMSTR= <none>
##$CNST= (0..31)
1 1 145 1 1 1 1 1 1 1 1 1 1 1 1 1 1 1 1 1 1 1 1 1 1 1 1 1 1 1 1 1 
##$CPDPRG= <>
##$CPDPRG1= <>
##$CPDPRG2= <>
##$CPDPRG3= <>
##$CPDPRG4= <mlev>
##$CPDPRG5= <mlev>
##$CPDPRG6= <mlev>
##$CPDPRG7= <mlev>
##$CPDPRG8= <mlev>
##$CPDPRGB= <>
##$CPDPRGT= <>
##$D= (0..31)
0 1.2 0 0 0 0 0 0 0 0.06 0 0.03 0 0 0 0 0.0002 0 0 0 0 0 0 0 0 0 0 0 0 
0 0 0 
##$DATE= 1686140926
##$DBL= (0..7)
120 120 120 120 120 120 120 120 
##$DBP= (0..7)
150 150 150 150 150 150 150 150 
##$DBP07= 0
##$DBPNAM0= <>
##$DBPNAM1= <>
##$DBPNAM2= <>
##$DBPNAM3= <>
##$DBPNAM4= <>
##$DBPNAM5= <>
##$DBPNAM6= <>
##$DBPNAM7= <>
##$DBPOAL= (0..7)
0.5 0.5 0.5 0.5 0.5 0.5 0.5 0.5 
##$DBPOFFS= (0..7)
0 0 0 0 0 0 0 0 
##$DE= 6
##$DECBNUC= <off>
##$DECIM= 32
##$DECNUC= <off>
##$DECSTAT= 4
##$DIGMOD= 1
##$DIGTYP= 9
##$DL= (0..7)
0 120 120 120 120 120 120 120 
##$DP= (0..7)
150 150 150 150 150 150 150 150 
##$DP07= 0
##$DPNAME0= <>
##$DPNAME1= <>
##$DPNAME2= <>
##$DPNAME3= <>
##$DPNAME4= <>
##$DPNAME5= <>
##$DPNAME6= <>
##$DPNAME7= <>
##$DPOAL= (0..7)
0.5 0.5 0.5 0.5 0.5 0.5 0.5 0.5 
##$DPOFFS= (0..7)
0 0 0 0 0 0 0 0 
##$DQDMODE= 0
##$DR= 18
##$DS= 0
##$DSLIST= <SSSSSSSSSSSSSSS>
$$ [...]
##$SUBNAM2= <"">
##$SUBNAM3= <"">
##$SUBNAM4= <"">
##$SUBNAM5= <"">
##$SUBNAM6= <"">
##$SUBNAM7= <"">
##$SUBNAM8= <"">
##$SUBNAM9= <"">
##$SW= 18.05172834244
##$SWIBOX= (0..15)
0 0 2 0 0 0 0 0 0 0 0 0 0 0 0 0 
##$SW_h= 3612.71676300578
##$TD= 16384
##$TD0= 1
##$TE= 0
##$TE2= 300
##$TE3= 300
##$TEG= 300
##$TL= (0..7)
0 120 120 120 120 120 120 120 
##$TP= (0..7)
150 150 150 150 150 150 150 150 
##$TP07= 0
##$TPNAME0= <>
##$TPNAME1= <>
##$TPNAME2= <>
##$TPNAME3= <>
##$TPNAME4= <>
##$TPNAME5= <>
##$TPNAME6= <>
##$TPNAME7= <>
##$TPOAL= (0..7)
0.5 0.5 0.5 0.5 0.5 0.5 0.5 0.5 
##$TPOFFS= (0..7)
0 0 0 0 0 0 0 0 
##$TUNHIN= 0
##$TUNHOUT= 0
##$TUNXOUT= 0
##$USERA1= <user>
##$USERA2= <user>
##$USERA3= <user>
##$USERA4= <user>
##$USERA5= <user>
##$V9= 5
##$VALIST= <valist>
##$VCLIST= <CCCCCCCCCCCCCCC>
##$VD= 0
##$VDLIST= <DDDDDDDDDDDDDDD>
##$VPLIST= <PPPPPPPPPPPPPPP>
##$VTLIST= <TTTTTTTTTTTTTTT>
##$WBST= 1024
##$WBSW= 4
##$XGAIN= (0..3)
0 0 0 0 
##$XL= 0
##$YL= 0
##$YMAX_a= 45945
##$YMIN_a= -49457
##$ZGOPTNS= <>
##$ZL1= 120
##$ZL2= 120
##$ZL3= 120
##$ZL4= 120
##$ABSF1= 10
##$ABSF2= 0
##$ABSG= 5
##$ABSL= 3
##$ALPHA= 0
##$AQORDER= 0
##$ASSFAC= 0
##$ASSFACI= 0
##$ASSFACX= 0
##$ASSWID= 0
##$AUNMP= <proc_1d>
##$AZFE= 0.1
##$AZFW= 0.1
##$BCFW= 1
##$BC_mod= 2
##$BYTORDP= 1
##$COROFFS= 0
##$CY= 11.3945322036743
##$DATMOD= 1
##$DC= 2
##$DFILT= <>
##$DTYPP= 0
##$F1P= 15.7292609196834
##$F2P= 12.9074282941183
##$FCOR= 0.5
##$FTSIZE= 0
##$FT_mod= 4
##$GAMMA= 1
##$GB= 0.15
##$INTBC= 1
##$INTSCL= 1
##$ISEN= 128
##$LB= 0.24
##$LEV0= 0
##$LPBIN= 0
##$MAXI= 10000
##$MC2= 0
##$MEAN= 0
##$ME_mod= 0
##$MI= 1.114404
##$NCOEF= 0
##$NC_proc= 0
##$NLEV= 6
##$NOISF1= 3.799351
##$NOISF2= 2.8
##$NSP= 1
##$NTH_PI= 0
##$NZP= 0
##$OFFSET= 15.70392
##$PC= 1
##$PHC0= -20066.45
##$PHC1= 14.85272
##$PH_mod= 1
##$PKNL= yes
##$PPARMOD= 0
##$PSCAL= 0
##$PSIGN= 0
##$REVERSE= no
##$SF= 200.130013532006
##$SI= 16384
##$SIGF1= 3
##$SIGF2= 2
##$SINO= 400
##$SIOLD= 16384
##$SREGLST= <1H.CDCl3>
##$SSB= 0
##$STSI= 0
##$STSR= 0
##$SW_p= 3612.71676300578
##$SYMM= 0
##$S_DEV= 0
##$TDeff= 0
##$TDoff= 0
##$TI= <>
##$TILT= no
##$TM1= 0
##$TM2= 0
##$TOPLEV= 0
##$USERP1= <user>
##$USERP2= <user>
##$USERP3= <user>
##$USERP4= <user>
##$USERP5= <user>
##$WDW= 1
##$XDIM= 8192
##$YMAX_p= 0
##$YMIN_p= 0
$$ End of Bruker specific parameters
$$ ---------------------------------
##NTUPLES= NMR FID
##VAR_NAME=  TIME,          FID/REAL,        FID/IMAG
##SYMBOL=    X,             R,               I
##VAR_TYPE=  INDEPENDENT,   DEPENDENT,       DEPENDENT
##VAR_FORM=  AFFN,          ASDF,            ASDF
##VAR_DIM=   8192,          8192,            8192
##UNITS=     SECONDS,       ARBITRARY UNITS, ARBITRARY UNITS
##FACTOR=    0.0002768,     1,               1
##FIRST=     0,             0,               0
##LAST=      2.2672688,     0,               0
##MIN=       0,             -49457,          0
##MAX=       2.2672688,     45945,           0
$$ Real data points
##PAGE= N=1
##DATA TABLE= (X++(R..R)), XYDATA
$$ [...]
619g97K398k534N4J931k209K32K678k700j305M168j052l882L441K047m162N36
635a156L336k195j130K428r56j003K029j196j499K842l62l103K208J807l269k
651a221K724j629j306K008o35j094J754p30j417K319J6k620J733J977k847l07
667a275K979j159j892K124K77j758J064N05j400Q66P65j867M68J691j752q39J989
684G86l67j704J157O65j281K98O00p59M53N07j132M34J275j209o50J903k94j642
702i60J231Q72j452K01R79q78j44Q68p16m22J121n11j097J172L74j525L50J154
720F17r05n68R37r0n62M62M8k47N22r9l98N93K20q49L66O54o44j79O64k73l67
741i8N07j10n33M43N7p60M40L87q16q8Q07l66o09P01K19p19K56M66l17j45L53
$$ y = [-797, 1601, -933, -879, 1052, -1157, -925, 1753, -947, -2252, 1916, 864, -3018, 423, 2470, -1692, -1156, 2180, -15, -1145, 1283, 327, -676, 1353, 157, -1342, 1500, 1138, -1965, 243, 2050, -1219, -1221, 1503, -126, -1432, 576, -59, -1153, 601, -129, -1546, 773, 789, -1831, -98, 1879, -968, -1275, 1704, 545, -1347, 777, 1054, -704, 360, 865, -535, 331, 1096, -771, -303, 1388, -364, -1203, 786, 419, -1285, -128, 537, -744, -446, 154, -605, -152, 355, -777, -343, 932, -277, -927, 976, 682, -960, 271, 1143, -309, -108, 871, -7, -151, 717, 1, -421, 700, 189, -908, 264, 638, -887, -537, 617, -288, -856, 81, -9, -571, -109, -61, -308, 214, 115, -283, 310, 530, -319, 47, 701, 57, -122, 542, 269, -98, 409, 299, -234, 209, 266, -494, -54, 333, -483, -571, 236, -130, -739, -38, 181, -538, -282, 184, -133, -278, 75]
762G5mj49K80m7r2K58M2k45J74k8q3n3L2p5n4Nj97J16J15k60j3K20j17m12L72
787a40O1l54Q3L87k27n5L80Rk75K81J69k20J1K18j20j51J99K0k08M0J39j47p8
810B2k0j1r7n2NmJj41J18%j24J07J85j40kK85r7k36L45J30l22J14L74k00k13L13
836C40L1l43J71N1k60NN0j67JJ52j91j01J73o5j50J79k0m6N8K7p6L21j33k11L98
861A94J92m84J38N25l79l38N56o9m89L23K08m78J16K08m72P8M14m54k55N94k14
882h6m73M08L06n55J45K62j61J14R3k82L44L18n37MP75m59n57Q01O9p72L43M28
904E28o64j1M99n50n6N92m94n13Q54m4r50O53O23r91M2P68l51m00N93k9k85M83
926B97j49k56M97J18p65M61N66r15q9Q82n18n49P22q5o26N83o3p68P12K53j141
$$ y = [75, 71, -78, 202, 155, 63, 321, 363, 118, 292, 264, 181, 128, 160, 85, 31, 36, -161, -45, 70, -190, -203, 17, -100, -512, -140, -79, -433, -350, 37, -190, -245, 135, 144, -131, 150, 319, 99, 110, 328, 208, 57, 256, 276, 68, 108, 247, 100, 22, 2, -9, -106, -158, -153, -157, -156, -297, -179, -179, -303, -196, -11, -151, -153, 132, 35, -201, 144, 274, -48, 66, 440, 240, 27, 340, 371, 28, 199, 250, -10, -5, 45, -122, -121, 31, -160, -261, -88, -153, -303, -124, -144, -190, -132, -105, -181, 140, 7, -204, 194, 386, -98, 40, 565, 186, -152, 404, 335, -154, 169, 377, -101, 15, 223, -249, -171, 243, -211, -466, 128, -86, -559, -151, 155, -400, -255, 7, -154, -40, 53, -229, 115, 433, -104, -100, 675, 216, -341, 460, 529, -243, 100, 528, -136, -147, 352, -198, -254, 338, -156, -669, 185, 141, -809, -156, 467, -524, -482, 286, -65, -465, 128, 99, -186, 297, 148, -108, 389, 507, -258, 203, 769, -146, -235, 647, 129, -420, 302, 217, -409, 174, 111, -657, 55, 308, -833]
947h33L94J135j045o12J472k06j256J076M98j114M76O38q59K13P81q67j45J145
965H91p73o97J287k11j201P76O03j185K58P46r51L4Q32r37j97J355p62j004J619
984D83O5j588Q94J059j411O3J337q42m50J140n81o89J258k71j225J181M70j593
1002g00L62J356j244m87J210m67p20Q94k30o21R07j06j064J036N55j488M23J313
1020I29j032o52J494l17j010R89J65j034P79L87j184N33R28j359j87J440o91j159
1038i81J292K44j334M93P34q51k0P02o67J6Q11p21l67J283l35j101J099M68j210
1057d45L45Q97q48j53Q74n97l54R98n98q33J264l9j409Q40Q69j494qJ341q37o42
1077h29J106k28p68Q61J8q18P77L61j042M65R22j088q4J166n73o77R22n1p64O78
$$ y = [-833, -439, 696, -349, -961, 511, 305, -951, 125, 623, -491, -15, 623, -236, -23, 758, -109, -254, 891, 118, -579, 708, 497, -704, 72, 675, -510, -252, 494, -457, -423, 409, -528, -725, 630, -132, -1136, 483, 548, -1040, -146, 913, -498, -435, 902, 60, -390, 750, 169, -520, 738, 467, -758, 423, 893, -700, -338, 1018, -226, -713, 497, 30, -690, 204, -26, -647, 260, 154, -910, 126, 681, -807, -384, 929, -103, -755, 739, 422, -588, 401, 566, -468, 311, 698, -486, 47, 975, -384, -571, 869, 178, -981, 311, 555, -779, -286, 448, -403, -423, 279, -388, -372, 439, -282, -649, 634, 299, -802, 297, 765, -445, -100, 797, -51, -204, 670, 73, -281, 717, 119, -714, 550, 511, -898, -58, 811, -683, -691, 650, -187, -829, 277, 49, -719, 142, 160, -658, 119, 480, -562, -97, 825, -263, -347, 819, 246, -431, 491, 440, -324, 354]
1097C54N2q59O34L11j081L63R46j052l74J184l84r15Q53K51r18M79N07p82K41
1116a90O80p05j45R84m73o06Q73O6q56M54N04o41mM96n02j01N33n00j27N36l50
1137g4m38O67k8o47L85M38p34Q9O68l99k92O28j50l55N13N4n77M06L61o54Q9O43
1159E93n14k70N11o4m81K37J79l94J45R9k71R8J97l56PM21l74r1M17r6l05L77
1181F5J13l32J62L12l81R2L63l52j50N08j65l35L31O2m48R5K84l31j30K89j44
1202i2j78K01J9k54J47J61k52J07J49j02k0K47j35l5J83j24L3J23j2j16J84j8
1224B16k01J16J17k51j3J89j94j94K55p4j90J73N5k67N1K10j60o1K54k8j26R9
1246b4R8q1N3J29r5J4N8k3j1M7J1n7K7j39k8Q8o2j53J54Ok01O6P4k01R2K02j57
$$ y = [354, 406, -453, 181, 492, -589, -226, 720, -332, -706, 478, 94, -821, 32, 283, -635, -156, 351, -431, -190, 490, -215, -360, 624, 151, -455, 418, 484, -372, 82, 586, -55, -59, 437, -65, -166, 367, -133, -260, 276, -74, -512, 155, 127, -520, -135, 303, -431, -342, 326, -73, -365, 263, 113, -242, 271, 325, -252, 154, 515, -139, -50, 593, 79, -191, 320, 256, -225, 12, 191, -203, -58, 41, -230, -132, 65, -291, -284, 137, -237, -328, 89, -7, -312, 65, 178, -154, 8, 320, -61, 31, 394, 42, -108, 400, 235, -100, 231, 293, -155, -60, 224, -107, -237, 52, -92, -270, -69, -50, -304, -157, 4, -248, -141, 8, -94, -114, 133, -2, -37, 146, 22, 55, 178, 166, 50, 234, 216, 15, 131, 248, -3, -16, 173, -21, -215, 40, -34, -224, -51, 4, -263, -212, -2, -162, -223, 31, 3, -123, -24, 74, -7, 46, 175, 80, 94, 152, 129, 118, 165, 176, 119, 146, 7, -21, 67, 5, -148, 6, 12, -189, -123, -49, -250, -158, 44, -113]
1273a13l4J46N7k21J86J44j83j5J57k9l5J51k9j81J20Q4j76K7O5p3q1Mj5L4k7
1298c7q7j2J9o3J9J26r2j32K13Q1j85N7J51j06M0K57j40p7J46l6l9M7M9j19n9
1323B1K11j39j60J91p7j51N8mp2j0j4n5J04K7j59J31J17j46O9J28j04L6J68j36
1347C4n4K67j07j34J50J30l02K9L13l45j06K62J4k99N0J61k23R0k2r0N4Q1j50
1370a97lK68p3j64J99J03k61J61J84k08J04N7j36J35O8k27k8L52k55l10L54J11
1392B34m57J43J82k09j10J94p1j38K30m9k60L46L5l91K94L28l64p8M75j64k13
1413d3K44k4j21J27n6j32K50q5l58K28K39m63o4M42j72l70K95Q1l28K66L8l02
1435c08L22J17m88J98N24m54k39O26j4m78K34L64m45M6K09j85M7J02l04Q2L42
$$ y = [-113, -147, -1, 56, -165, 21, 165, -18, -33, 124, 95, 60, 211, 182, 1, 121, 205, 29, 56, 121, 48, -33, -29, -44, -10, -37, -124, -136, -117, -180, -161, -35, -127, -259, -46, 35, -150, -93, 58, -48, -8, 249, 109, 32, 178, 142, 103, 150, 199, 80, 21, 232, 93, -67, 124, 47, -104, -46, -50, -122, -132, -146, -201, -97, -70, -229, -98, 19, -127, -58, 70, -34, 2, 170, 34, -20, 247, 140, 6, 156, 286, -16, 13, 326, -19, -125, 137, 151, -148, -98, 63, -160, -70, -92, -182, -128, -47, -197, -200, 68, -5, -169, 30, 133, -128, 33, 217, 9, 113, 170, 34, 169, 237, 10, -18, 334, 79, -231, 123, 234, -223, -80, 102, -107, -217, -23, -94, -232, -2, -51, -311, 35, 70, -321, -27, 301, -63, -141, 334, 170, -43, 201, 177, 56, 183, 127, -5, 245, 160, -198, 30, 269, -194, -258, 184, 12, -358, -63, 18, -310, -44, -6, -308, 14, 131, -357, -159, 365, -89, -328, 298, 284, -194, 40, 404, -41, 5, 214, 29, 76, 178, -126, -44, 298]
1456B98m22k47N54p3n55L34K24l66P4K27k09K9K22k95M9M44k66l57O15N0n65J98
1478c7N16m11j63L80j03k57J90p0j29K44j02l41L15J82n31K8N60l42l78M06N5
1499A2k27J11Q3j35K79j04k79L77K44n62Q5N76k90m68N29J28n17J04L21l05j9
1520e7K03k84N4K36l34k10O17j75n89M92K80m58m1M33j62j61K87j71k6L87l18
1541Cj47M92j36m83M21K60n28K2M05k60j99K82j31k10L07j39k70L76k5m61K22
1562a99L90m17j42N59j32l05L15Q6j87R7O6j11J60Q9l00P1K83k99j21L47o8l40
1584a58K16R3k79R0L7j52P6N8k38P8L42k54k71M51Om23K71K06j94k5L20j79p9
1607hK21j30j04K50p6k47J67J10k44L1K26k10j49J70J6j74J32n5j08J94p9k08
$$ y = [298, -124, -371, 183, 110, -445, -111, 113, -253, -179, 48, -161, -132, 90, -205, -156, 288, 22, -335, 280, 330, -235, -37, 479, 68, -95, 285, 182, -75, 115, 45, -84, 160, 58, -283, 32, 214, -317, -289, 271, -71, -449, -43, 12, -215, -104, -21, -156, 123, 19, -260, 117, 361, -201, -116, 460, 170, -298, 231, 359, -158, -54, 267, -38, -57, 146, -138, -84, 152, -182, -392, 225, 50, -539, -47, 233, -225, -266, 167, 5, -156, 131, -40, -66, 321, 3, -144, 348, 212, -271, 150, 410, -118, -96, 309, 49, -150, 132, 1, -209, 98, -41, -311, 65, 40, -421, -199, 191, -226, -368, 191, 59, -246, 69, 155, -32, 65, 131, 20, 180, 269, -31, 40, 323, 24, -97, 250, 182, -158, 58, 151, -128, -38, -1, -153, -77, -19, -257, -179, 163, -91, -362, 89, 95, -328, -57, 149, -45, -70, 250, 71, -8, 213, 83, -21, 229, 153, -94, 73, 183, -61, -30, 196, -14, -163, 7, 23, -151, -19, -74, -182, 12, -67, -275]
1629b75K39J15k14O1K37j48p0K45k2k08K21P3k70Q9J27k28MK47j62j67K28j10
1651A2j82J90Oj77j8J82j33m3J59r5K5Q1k4j06J87j3p3J27L3j03L7J13j25m3K06
1676B23j60o1J48r1j02M7R1k11l3J55j63k9K13p4j25N4J23p6JN0KMJ15j05L8Q4
1702A18k4j8O5l7k9O9m0j31J61l8j63J10j8j04nR1n8j05J23pj36M6R6j23L2J14
1728a1q4K8R9J4n5O4N1r3Q5rk9L9j8L9o7rk3Mom5m5K1k6n0L6P9j61N9N1m7j1J43
1760B3q1oJ30j5j05O2J42j35O4O5k9j20J66q2n6J0L2o8K8j7l3n6M0m7NmKl8J19
1789dj21N4O9lm5J18J4j55J04J27j72M5J40o9r1M5J3n7J5Q3k15R0R3k28L5P4k1
1816f2p4J01m0q2M0O7l4QO6m4M2J06j46P2J31o6m0P9J6j61J24R6k02P8qj22j0
$$ y = [-275, -36, 79, -135, -74, 163, 15, -55, 190, 168, -40, 181, 254, -16, 73, 200, -28, -24, 223, 61, -106, 122, 12, -170, 20, 26, -151, -169, 13, -120, -163, -4, -99, -74, 7, -17, -123, 64, 51, -22, 105, 138, 35, 72, 185, 60, 17, 223, 63, 2, 150, 59, -43, 4, 95, -116, -149, 6, -157, -186, 27, -47, -172, -118, 5, -71, -70, -20, -18, -14, 101, -4, 34, 118, 94, 76, 141, 104, 75, 144, 104, -27, 134, 96, -67, 43, 25, -79, -84, 7, -51, -156, -33, -40, -176, -130, -34, -157, -125, -11, -95, -67, 32, 46, -9, 55, 106, 13, 98, 89, 60, 99, 81, 120, 53, 44, 21, 25, 19, -26, -71, -50, -76, -126, -90, -11, -172, -113, -62, -109, -120, 23, -58, -64, 66, 51, -54, 8, 150, 15, 79, 144, 115, -5, 161, 79, 23, 33, 65, -3, 25, 8, -25, -81, -41, -88, -83, -87, -85, -123, -4, -125, -71, -2, -5, -50, 68, 82, -73, 31, 158, -14, 31, 171, 102, 11, 56, 69, 12, 27, 110, -105, -15, 78, -150, -115, -41, -62, -136, -35, -75, -157, -117, -50, -84, -76, -10, -54, -12, 94, -52, 20, 151, 85, 45, 124, 140, -21, 103, 199, -3, 75, 67, -55, -65]
1843f5J53k04jJ19n5k16K11J40k22K4J74j44p1J71r1MJ30n7m8K25p4j34J18J34
1867B21k46k4J94m8j29J42q1j58K17j67j19L22o9l69K59J61l34n5M12j45j98K15
1889AM5j72J64J7j01J50N9k46J51L19m37m2L46j24k49J92O8j57P1J0k26K06o6
1912b1k13J49K59m24p9M33m4l19K06J41k57J15J78j92J29J51l13P6L36k82j99
1933a70M16o8l64J92K11k58j10K72j60q6J22j52K8K30k55j75M34k0m47K25L56
1954B21l51k5L48q4j79J63lj11K46q6k91L41R5m55Q0M37l32k28L54jl59J50J20
1977E0k16P0N5k06J74K13l93J3N77m04k38M52Q2m45K11K49k55N5J57k39J28K21
1999C11l89q6N00j99m07M38R1n40J01L40k86q9K69j82J2K07j44j81M22n9m69L80
$$ y = [-65, 88, -116, -117, 2, -53, -269, -58, 82, -140, -116, 58, -86, -157, 14, -77, -73, 57, 0, -48, 177, 103, -31, 87, 221, -25, -49, 145, 97, -32, 110, 29, -129, 88, -79, -198, 124, 55, -314, -55, 106, -228, -283, 129, -16, -214, 1, 46, -126, 38, 55, -46, 104, 163, -83, 68, 387, -50, -92, 254, 130, -119, 73, 141, -16, 55, 65, -161, 45, -21, -234, -85, 174, -250, -329, 104, 60, -259, -53, 88, -169, -54, 124, -68, 61, 212, -101, -25, 311, 29, -170, 246, 178, -186, 6, 217, -41, -151, 121, -39, -125, -3, -155, -127, 103, -152, -327, 107, 87, -360, -135, 221, -130, -155, 193, 109, -70, 93, 90, -21, 225, 139, -152, 189, 284, -171, -91, 346, 14, -214, 140, 139, -220, -70, 50, -166, -96, -41, -247, -73, 140, -253, -240, 337, -67, -305, 147, 229, -216, -5, 244, -11, 44, 201, -38, 90, 311, -78, -164, 336, 137, -270, 168, 259, -281, -180, 160, -126, -215, 54, -128, -116, 91, -53, -234, 188, 129, -340, 40]
2021D0K40m45L9L81j76k32L28o0j15K07j64j79M05j22m28L55J64m60O8L08j71
2042a7l11M05p8k12J93K7j82K52N4m21K90K49l21q6L62n5k67J87J52k50N9J02
2064A32j74J44N9k91J00J81k76r0L47r3k86J87K01l04O1J31j25N9J05k05N2K39
2086A54j76j99M61Pm62K45K69k86j06K89j07j41K57k03o7J61l3k62J59J24l06
2107b22J06K55k07j83L49j20j12J41m0p5J39N5j90J77J35k95J24L02k89j37K98
2128B11l0k33J32M0k45J65Kj57J05R3k05k9K43j35j69K02L8j52Q3R3j15N8O1o3
2152gL5J28j03m4J28m5j11J62N7k50M4J14j42N7j2k8m9P0k8j11J06L4j58O0R0
2177cr1K7J05m9n0J00Om5M5J0rL7Mj13P8M9p0l7J37j46o3P7N4j30N1l9p3O3K9
$$ y = [40, 280, -165, -126, 255, 79, -153, 175, 115, 0, 207, 43, -136, 269, 147, -281, 74, 238, -222, -154, 154, -17, -328, 77, -1, -213, -20, 7, -175, 77, 131, -290, 0, 249, -72, -158, 204, 149, -118, 69, 221, -29, 30, 132, -42, 102, 161, -130, -30, 151, -125, -215, 132, 39, -247, -60, 141, -163, -102, 29, -96, -37, 68, -137, -85, 154, -22, -221, 240, 247, -215, 30, 299, 13, -93, 196, 89, -52, 205, 2, -65, 96, 63, -199, -40, 84, -222, -116, 139, -68, -251, 98, -22, -134, 7, -33, -108, 31, 86, -104, 73, 208, -87, 37, 339, 50, -87, 211, 181, -52, 80, 120, -125, 40, 42, -115, -10, 83, -122, -151, 92, -43, -212, -10, 28, -124, -41, 52, -63, -5, 56, -7, 28, 156, 53, 9, 137, 92, -19, 143, 200, -50, -6, 108, -34, 23, 11, -17, -66, 4, -24, -135, -29, 5, -153, -93, -3, -94, -67, 38, -11, -61, 39, 45, 0, 45, 55, 46, 83, 87, -26, 52, 101, 31, -6, 131, -15, -78, -1, 53, -77, -26, -65, -138, -75, -46]
2206d6m2j4J34o9r5J35K9j18J32L7m2j6J17j19kL9N0q7K2Jk1M5o3o3PP3j27M5
2234e8J6j2k0J8L4j03J25p5n8J29K2n7R4N1j04m2J59k6n9J03o3n4J50p5r2O2P5
2261A40j96J06o5j4m3P5lj29J33o6k8JK0o5J34n1OJ3L2PL0L7k7l7P6j1p0O2Q8
2290A55j43k8Q8j9k2l9L1r3P5n5l1M8Qp2N0Q8j00QN9n4L5RM9o8P3M0p0N1J8p7
2320A4N9L2q7OM1n3p7J05jj41P6K0m3o5N2K2p7J51r5o5J51m6n7P5J39j11k2J02
2348A05j08J5P4q3P8N1o5p8J45j35QK0J0j23P1Q6k32O8Q4m7m4J40q6j22J55M0
2374B7j76J00J84j41KQ9j8j08J52k1j24J23M7j38R1Mj86K3J62j02o7J58j21j10
2398a50Q2Mo2Q5J1p1N8J02j39N4J07q9j10K82Nk53J24J09j57J01M6j56K4J17j74
$$ y = [-46, -88, -102, 32, -37, -132, 3, 32, -86, 46, 83, 41, 25, 142, 23, 21, 60, 110, 23, 45, 46, 25, 70, 7, -56, -49, 24, -103, -58, -42, -54, -74, -56, -22, -125, 0, -75, -133, -4, 18, -39, 55, 106, 2, -40, 119, 93, 34, 137, 74, 20, 170, 95, 3, 65, 140, -56, 50, -15, -29, -72, 3, 0, -129, 4, -62, -90, -89, -69, -134, 0, -51, -45, -32, 0, 7, 37, 74, 47, 10, 86, 75, 5, 67, 155, 12, -16, 72, 53, 31, -8, 23, -70, 5, -50, -81, -33, -25, -97, -47, 41, -59, -51, 8, -46, -11, -2, 47, -21, 52, 92, 22, 73, 91, 14, 73, 105, 18, 24, 65, 12, -65, 40, 39, -102, -26, -6, -49, -114, -62, -40, -117, 34, -61, -126, 25, -21, -78, -3, 136, 25, 3, 105, -3, 12, 86, 3, 81, 132, 67, -11, 134, -1, 7, 27, 37, -86, -15, 71, -161, -93, -9, -56, -100, 40, -46, -168, -13, 27, -149, -49, 135, -6, -4, 85, 67, -41, 111, 90, -34, 89, 136, -2, 89, 93, -93, -70, 92, -10, -77, 81, -40, -150, -68, -64, -126, -41, -30, -101, -43, 59, -80, -26, 81, -8, -118, 164, 169, -84, 40, 149, -8, 93, 139, -17, 7, 124, -50]
2423e0QJ50j74q7J57N3j77J10L6r9l9J29o7J6M7r5N9J24Rk12K04Q1k57R1J63k29
2449d9j5K21j17r1J89j43q4J37Lk37J63J15k55N0K40k34k5J60l1j20J21mp6J50
2473F8J7j67J26J35k53J16J39j40j32K16j02p9J03J3j20J5J22j98R7J00k03j6
2495a43K54j70j60K03P3k21Q5J42j22K7J32r8o7J89r1j1J38m1k05J44N6j36M4
2518B2P3j66L9N8j22M5R0q0j74K07k6j31J12O5j55M2J49j00J4J07m6j06J68l9
2542D6n8N1P9o9l7J78j42r0J52p5j44J25j7r6Q7j1j15J07O6p3j6P6j06o2J62j5
2568Cn9J14m0j05J05P2j16N1O1j02J8R6n2r1J24l3o4L6J0j17K2Q6r7l1J23r9k2
2595a07M8J01j31J03l1n9P0O1n3pR1k9k9J3k4k9J02l9q4J27o0j12O4O1r4n3O9
$$ y = [-50, -42, 108, -66, -153, 4, 57, -120, -10, 26, -73, -112, 17, -50, -34, 13, -82, -23, 101, 110, -102, 102, 183, -74, 17, 180, -49, -64, 157, 40, -51, 138, -5, -89, 48, 51, -186, -23, 92, -163, -113, 127, -107, -132, 28, -3, -123, -2, -6, -82, 68, 85, -82, 44, 179, -74, 42, 181, 41, -91, 125, 23, -56, 47, 60, -60, -45, 77, -121, -24, 76, -127, -143, 111, -59, -219, -16, 57, -164, -79, 63, -59, -32, 100, 2, -65, 124, 33, 22, 160, 119, -86, 58, 114, -22, 22, 95, -71, -32, 26, -96, -51, 39, -41, -215, -8, -34, -165, -53, 12, -143, -101, 48, -52, -38, 69, 23, -83, 85, 46, -12, 39, 118, 49, 12, 190, 48, -42, 110, 35, -109, 16, -1, -97, -10, -21, -136, -29, 37, -36, -52, 24, -82, -144, 18, 3, -56, 58, 18, -87, 18, 90, -26, 25, 86, -16, 2, 98, 46, -45, 79, 46, -18, 18, 28, -89, -67, 19, -78, -109, 14, -85, -107, -59, 42, -89, 14, -17, -76, -6, 55, 2, -5, 86, 57, 28, 41, 17, -12, 90, 51, -33, 94, 34, -78, -14, 47, -47, -100, -31]
2622c1q0n1J60n3l3Q6pn1Q3m6p0P0P2p4M8Q0n6k1O0n3OK7MMq0M0p8O2L6r2m4P6
2654fK3r1N2q0J3L7O2n3o4J85j02k9L5Nj0J8N9mQN0j22P7K9o8kM3j0n4O5o7p0
2685g1J34j8q4l9Q6n8MK1k3Q4j7j8l0RR5m1n3P2rJ3Jj3l8M8j7OK8l9Rl4K6n6j6
2718c8K5m6M9j2Om6R6j27P4j6J8K3pN4qm3M0J1l7L8l3j4J7Q7o9j06R4m3Nk0J9
2749ij2PJ9o8l6P3kk4K3J3jMO9m4qL1L4L1m8j6LM6Km8j6L1j6K5m4l0J9J1q6O3
2783dl4m1JJJ2OJ9K9k2N7ql2P2m4OmO%J4l7L7OM1k1o5N0q4l8Q8j7m7O6mn9J9L6
2819Em6j8N7m7J9L7j8l8P1L6p1PJJ6J1K9j8O0m3nr8O7m1N7j4j7m3O1pk8n6P4m5
2852d5k1N7l1J3K4M9m0l4J06m3K8K1o1J4l5M4j8l3K7n3J0K1J4j6N9j30J8Nk3N1
$$ y = [-31, -111, -162, -2, -55, -88, -2, -9, -60, 23, -23, -93, -23, 49, -25, 23, 103, 47, 26, 86, 33, 39, 66, 70, 74, -6, 34, -44, 18, 54, -38, -82, -6, 17, -74, -22, -102, -89, -52, 10, -43, -107, 78, -24, -53, -18, -13, -23, -5, 54, 50, 58, 108, -14, 63, 92, 24, 22, 65, 55, 1, 66, -1, -71, 63, 45, -39, -78, 8, -50, -46, -25, -48, 36, 19, 1, -29, -20, 75, 34, -19, 53, 44, 57, 58, 45, 7, 55, 38, 44, 72, 33, 42, 8, 34, -22, -38, -13, -59, -10, -22, -16, -62, 34, -93, -19, -35, -17, 6, -1, 53, 45, 2, 42, 53, 16, 54, 21, 7, 24, 111, 42, -64, 30, -13, -8, -28, -9, -21, -14, 5, -63, -99, -26, -28, -52, -29, -16, -17, -13, 56, 12, 4, 35, 69, 100, 52, 36, 39, 85, 87, 39, 23, 54, 38, 63, 19, -11, 8, 19, -67, -4, -38, -79, -78, -77, -65, -59, -40, -11, -33, 24, 16, -16, 56, 12, 18, 14, 20, 20, 34, -3, 34, 40, 81, 60, -5, 45, -39, -77, 11, -6, -53, 13, 9, -50, -31, 5, -41, -59, -2, -49, -30, 7, -11, -49, 22, 58, -13, -6, -5, 11, 22, 51, 33, 93, 50, 45, -53, 14, -27, 30, 16, -1, -44, 17, 10, -18, -74, 0, -45, -66, -9, -40, -27, -3, 46, 6, -28, 78, 35, 63, 84, 23, 37, 2, 46, 28, -5, 22, -31, -21, 0, 14, -2, 57, -73, -55, -50, -73, -22]
2882b2l5K2l0J7qK7PM0k0m8J10l7k4J06m7nj1j5J09m5Mj16K0Qk7m0M1M3n3KMj9
2914d2k4j2l9N3Q2j36J17k9jJ0N9k2L0%j8J5O8o9l7N5Jm6K8K3jn0L0l9q2N0M7
2945B1j4om9R5r6Mk8N2k3QK3M1j8j2RL6l8J4K7k6M6o0oK2J7k6j0M3q3K5j4j5l
2978d4M6l0rK7K1K2L5q7l5Q3J5lk6LM9j07J28lm1l5j9J5j8P9j12lR7l8q2L6L9
3009Cp7RN9l6m4J08n4M9l4O2m6QM0o3P5j8jM3n8Rm5J06l5l3k7L0o9R0k4j07P9
3040al5Mk8J6l9lJ22m4l9L5Pj2K9j8qnQ7n2J7L0J9n2K5jm2N6o3M3k3n5K7m1O2
3073A8j6m8M3j13K0R0M2p1N5K3o5k2R5k6m4M6k2M5Nko8k4P0m2qM2kkpQk5L4qk3
3107bk2jJ7j2l3l1M9L5k5j2R6rkrj3Rj9Jqm4J6L3p6R0n3J7K2k0n5N8l4JJ8J3J8
$$ y = [-22, -57, -35, -65, -48, -56, -29, -22, 18, -2, -50, 60, 23, -1, 105, 58, 53, 42, 27, 136, 91, 95, -21, -1, 7, -20, -60, -19, 24, -29, -27, -23, -42, -66, -78, -117, -64, 18, -118, -1, -30, -31, -21, 38, 16, 46, 46, 28, 43, 111, 42, 5, 60, 61, 15, 43, 66, 65, 15, 45, 6, -76, -26, 21, 7, 1, -48, 47, -49, -45, -73, -21, -44, -36, -13, 28, 10, -2, 7, 43, 5, 19, 46, 20, 66, 6, 0, 22, 39, 13, 3, 46, -37, -12, -26, -41, -44, 2, -28, -37, -10, 11, 33, 68, -19, -54, 29, 44, 41, 15, 18, 67, -40, 88, 85, 44, 9, -10, 5, -13, 66, -46, -49, 48, 10, -72, -36, 3, -74, -65, -6, -42, -86, 22, -32, 17, -17, 45, -1, 7, 47, -16, 59, 41, 40, 83, 25, 34, -11, 95, 60, 27, 0, 30, -39, 51, 27, -80, -1, -36, -32, -60, -44, -83, -86, 36, -8, -47, -12, -5, -17, 12, -6, -14, -19, 68, 16, 33, 63, 82, 30, 55, 54, 12, 68, 5, 48, 25, -30, -3, -44, 18, 2, -46, -3, -116, -96, -6, 36, -35, 20, 43, -22, -44, 51, 25, -19, 27, 5, 50, 55, 53, -15, -39, 31, -11, -19, 23, 21, 19, 12, 20, -5, 29, 21, -2, -24, -25, -8, -20, -53, -84, -35, 0, -25, -37, 59, 50, 48, 39, 26, 35, 16, 17, 9, -35, -19, 14, -62, 28, -25, -8, 14, -6, -61, -3, -37, -36, -18, -5, 13]
3142A3n2J8L3m5jpJO4OnKJkJk4kK4K2l9rN0jn0M6l5k9l2K0n0MJ28m2n3l2Q7n1
3178d1P3m8l2j8Q0j5L3KM0n2KJ2J9o5O1o2O7j5p1N3OlJ0k8jo0M6m1pJ1P9r3O1
3211CK8q7J2K4R0o1k3L9J8m2P2k1j1m3J8m0L7N0j60Q9N1n4nJ6p2P0L8q7R1l5m1
3242c6n0J04l2ON4L5p0PL9o5J9j4k2P8Nj8k6O4r3JRj5l9K3nL3k1j8rj0M5%MJ8
3276Arl5L0M7o4L0N1l2l0P9k6o3Q0q6J2O1qk9j5L2l5k4L3k6j4N3j03J28j9l2m2
3307e5j9R5q8R0l8nlJ23p4n0P2m5M9N1n8m0Q2k4j34O1J69j89l4J29p8l4K3k2m
3336e0m2Q4K1j9L5r2M2O4j02K5Q8n5Lk7O8j8Q3p2o3N6J3j28Q4Q4q1m9R4o3p5R6
3366Dj6m8M6M8n2k3L9m7P6N6o2q2J09Qj00K8J18q8nO3r7M8K1n8k0R4j29MJ31m7
$$ y = [13, -39, -21, 12, -33, -34, -41, -40, 24, 30, 25, 27, 28, 26, 27, 3, 1, 25, 47, 8, -1, 49, 48, -2, 44, 9, -20, -52, -32, -82, -78, 50, 8, -45, -77, 10, -41, 32, -16, -48, -66, 14, -1, 32, 34, 74, 22, 24, 36, 55, -10, 51, -11, 56, 41, -30, 23, 29, 26, 36, 8, 7, -53, -7, -48, -55, -44, 35, -58, 3, 31, -56, -44, -20, 70, 9, -14, 25, 43, 1, 73, 52, 41, -2, 16, -24, 13, 63, -97, -8, 43, -11, -16, 0, -72, -2, 36, -51, 40, 5, -36, -86, 18, -14, -8, 46, 81, 11, 18, 57, -8, 11, -3, -25, 53, 58, 40, 14, 78, -15, -14, -5, -20, -59, -36, -41, -8, -29, -47, -56, -66, -21, -21, -17, 1, -8, -43, -13, 34, -30, 0, 51, 19, -11, 68, 42, -21, 59, -27, -15, 46, 38, 9, -6, 26, -9, -33, 0, -26, -40, 13, -90, 38, 19, -13, -55, -74, 21, -67, 23, -15, -20, -23, 100, 26, -24, 48, 3, 52, 103, 45, 5, 87, 63, -71, -10, 159, -30, -64, 65, -13, -47, -24, -46, -50, -92, -8, 13, -6, 29, -63, -21, 43, -59, -34, 54, -1, 2, -25, 43, 25, 108, 36, -27, 29, 42, -86, -2, 82, 1, -48, 46, -17, -92, 4, -12, -60, -14, 34, -18, -41, -2, -49, 27, 83, 21, -61, 48, 56, -44, -16, 102, 14, 9, 72, -25, 23, 44, -14, -34, 60, -69, -65, 66, 19]
3396A9j19O9N7j49P2P7k9kk1J8rO4qj46J40O5j11m4J47m6k6N0m1%k2Mj7O2r1k5
3426f2R9J7j01j7J22j26j8R8m2l0L4k7J4J9O3j39J13R5j92J28N9p1j19J64lj20
3452d2J1P0m6j8J1N5n2K2n1kM1M8j44J13Qj27N9P3q6L4O9j03M5J01j46K8J41q9
3480B3n0L6J30j60j8P4j9l1P1r6LQ1o2j27J74j9p4L2M0j1p2J36q9QM7m7k4R6m8
3509Dk1L0M4j03M4J73j69J1J00q5n9L5O7j04J9np2Q4O1j13m2J56o6r5J53l0p1
3536e4Q1N7j09J04k6p4N7jk0l4J12o4l1M9N1r9K7k8n5J1P7o8NM5j0j27J36K1r5
3565f2N3N2p3k8O9l3k4J06l6p2N9L4n5O6J4q6P9j7o9K8L4n2j0N9j02K3N6J6q8
3594e9L2N2j12K7P5n6k7J08J7q0J1Q5j75J21O7j33K4L9J7l8Q7pq5J7Jo0N4M1j19
$$ y = [19, -100, -31, 26, -123, -51, 26, -3, -5, -26, -8, -17, 47, 39, -107, 33, 98, -13, -57, 90, 44, 18, 68, 27, 27, 5, 9, -8, 54, -37, -62, 37, 54, -47, -64, 58, -68, -86, 12, -30, -60, -26, -53, -39, -20, 43, -96, 17, 112, -80, 48, 107, 36, -83, 81, 78, -42, -31, 39, -7, -25, -14, 41, -11, 11, -40, -42, -1, 47, -97, 16, 24, -103, -44, 29, -57, -23, 46, -57, -12, 89, -57, -29, 112, 23, -27, 9, 139, -21, -39, 35, 16, -15, 56, -40, -37, 44, -18, -145, 29, 10, -64, -32, 8, -3, -75, 61, -28, -20, 27, -20, -44, 52, 4, -17, 13, 57, -46, -2, 171, 2, 13, 113, 28, -31, 4, 71, -33, -14, -19, -91, -7, 54, -59, -101, 55, -11, -106, 47, 17, -54, 27, 84, -25, 79, 53, -21, 36, 35, 15, -19, 93, 29, -2, 47, 98, -1, 26, -2, -57, -46, 31, -37, -32, 13, 3, -124, 12, 33, -62, -9, 43, -30, -58, 11, -22, -46, 60, 24, -48, 11, 45, -10, 56, 70, -16, 63, 46, -23, 5, 39, -13, -23, 36, -66, -43, 13, 29, -59, -27, 25, -87, -60, 15, -41, -68, 40, 57, -23, -12, 73, -102, 19, 86, -47, -23, 16, 33, -5, 82, 75, -10, 7, 8, -52, 2, 43, -76]
3623g6Q4K2Mj18O3pj3P6j3j9L3pm1rP3j03Q0M4p7J2L8Kn2M4j8m1Nj5j1QM6n9M8
3656CQo3K4M5j5JJ1k4k1K2L4nm4O6k7J6K0m1M6m2N9o4M9l0p2O6j1q2rR9k5o1Q1
3689A4Qr8N3j6j5l1J09q4N0N6l6KK4k2j5qR5m8nM7m3j1M7n8m4J23o9q7J20l5q5
3720f2R4Jo2L3L7r2m8J06qr9J64k7p7R7r7j2L3Q7p3L5k0m8N3N0or4O5j7o8N5O
3751Fm9OJ5k4L1k0jpQ8q5K2O7l8j02J41N3j10J9R0p8j6M5K7m5n2OJ7m5P2j00J15
3782D8Kj44L3J22p6J8j6k1l2R6j6%k5Q8q7N7J0o0oQ0j1n5MN1p4L1M3n7pj4j5%
3814c3O4l4n2Q6j6q8R8Nq1M2K1l4QJL1pP2o6p6J49l8j15P8P5r7L5MJ0o7M9j1o1
3846d8M0pj9L2J1r0L4P8q4kJ22j23K6O3M4j00K8lk7N6L0j42J10L1q5J0R1j7j16
$$ y = [-76, 8, 30, 34, -84, -21, -28, -41, 35, 22, 3, 36, 29, -12, -21, 52, -51, 29, 73, -4, 8, 46, 48, -4, 40, 22, -19, -14, -29, -40, -32, 14, -45, 3, 11, -52, -28, 17, 2, 3, 14, -10, -31, -9, 25, 20, -24, 42, 15, 31, 51, 10, 56, 14, 73, 9, 58, 28, -44, 22, 11, -71, -80, 19, -6, -67, 14, 22, -76, -23, -39, -54, -85, 24, -60, -10, 46, 10, 12, 36, 14, -1, -9, 86, 38, 33, 80, 37, 26, 73, 15, -29, 94, 25, -62, 58, 23, -62, 32, 33, -29, 4, 41, -51, -99, 7, -1, -100, 64, 37, -40, 57, -40, -52, -19, 68, -5, 30, 10, -38, 15, 65, 59, -35, 30, 13, -55, 0, 6, -43, -37, -22, -46, -15, -35, -36, -43, 45, -40, -18, 49, 11, -91, 50, 103, -7, 12, 102, 24, 8, 53, 80, 35, -17, -11, 6, -39, 33, -67, 48, 50, -94, -61, 61, -15, 3, -13, -34, -66, 30, 14, 14, -11, 77, -10, 47, 57, -3, -9, 71, 60, 5, 9, 60, -14, 17, 60, 3, -4, -18, -33, -33, 31, -3, -55, 31, 15, -73, 25, 30, -51, -9, 12, -22, -14, -13, 18, 11, 83, 17, -59, 90, 52, -63, 15, 90, -7, 28, 32, 42, -25, 24, 13, -48, -8, -15, -34, -2, 9, -81, -47, 31, -53, -55, 67, -56, -30, 33, 77, -23, 5, 2, -25, 31, 61, -81, 29, 60, -25, -15, 76, 59, -57]
3875e7J05jr5O1j2o0L1O4j00m7J72n1l7Q4m1q3K8M5o2J4Q0Nn4P4k0m0L4k3q4O7
3905cO4j67J39O2j34OP9l5J5k2m5k3P4l1m6N2J16j46m6K27j45J4P8p8o3J40l1
3932E1j04P1K1q5P5L1p0j8J16p1o0RO3j32Q6J6l9N5J5j17Q3P0j35j2O5jk6L3M2
3961C2o4%R7n7LN5j07%J38n2j42J52J8p5J4K7q9J0L6o5Q3k4k2o1J12r6K5J40q1
3990Gr5J09O7j07m3J76j38L8O6m2r3J22pr6N4K9p6K5L6pm5O5m9J2ll2Ql3P2n4
4020c4O1J9p8J8P2n0j6M3o5n1Q3K6rRO6j14l2J08j34N3N4k9r6J45L2j25l9J10
4048B7Po4P0l8l6J06k0n1O8J8j13O4L6j10O9oPn7M7l4kJ1k9k5Q3m8q8P5K2j00
4078a11N3O8n1k1Q6l1j5M9km5N3J6k1l6M2m5JP1ok0n8L6l2P3m0p3N1L5n8k3J26
$$ y = [-57, 48, 47, -48, 13, 1, -59, -28, 36, -64, -111, 61, 10, -27, 57, 16, -67, -39, 6, -56, -42, 38, 43, -11, 63, 43, 3, 37, 14, -70, -3, 61, -106, 33, 95, -39, -33, 46, 11, 26, 4, -41, -64, 10, -21, -67, -15, 101, -45, -91, 136, -9, 5, 83, 5, -58, 82, 51, -53, 18, 39, -46, 29, 60, -10, -28, 88, 17, -43, -34, 29, -103, -17, -1, -40, 15, 30, -87, -4, 66, -69, -81, -16, -17, -43, -10, 32, -32, -32, 65, 8, 11, 66, -41, -41, 97, 45, -97, 55, 73, -2, 12, 39, -50, -40, -4, -69, 14, -10, -32, -93, 19, -77, -52, 88, 7, -88, 21, 88, -19, -62, 114, -24, 14, 80, 38, -55, 67, 60, -36, 18, 47, -29, -4, 32, 25, -20, 45, -4, 8, 5, -27, -19, -52, 20, -34, 27, 46, -32, -14, 58, 8, -8, 35, -30, -81, 2, 28, 19, 28, 94, -20, -52, 56, -78, -25, 29, 0, -96, 49, 81, -44, -83, 27, 34, -30, 40, 2, -34, 72, 52, 1, 69, 87, -26, 38, 74, -36, 33, 27, 34, -23, 24, -10, -12, -1, -30, -55, 28, -20, -108, -33, -11, -111, -58, 10, -41, -62, 24, -7, -22, 27, 25, -20, 33, 49, 28, -8, 34, -11, -10, 61, 55, 35, -23, 13, -19, 54, 14, -59, -8, 27, -31, -54, 72]
4109G2o3q9J20p4kNQ1j12Q8M0p2J6N3jj01J13k8n9M9Q2j51L9M5n6o2J51j00k1
4137c7L2K1p2K8M4o2M6k1j5L6M0j03J4O7oJ3k4j%m9N3k2L9J2n5K7M4j6k4N6n3
4168A2j25J31rk9K8K5n0J6J9n5K5L2K5n4P0k4j04Q3j5n4N5O5o8o7R0m5J5M7J7
4197E6j23P5K4q8J9L1j8M0j2J7j1K0n3m7J23o3k9J8O7J1l1L5m0QJ1j3k8N2l0k9
4227hM4Ol6pP7j04L6Nlo2Q7o1l0M0k5n3O0J0%K6M2r0l4R1J1k1J3Mk3j5N5n7M6
4260B4J5p3N5Pk9LLmn7K1j3k3M6J3jm6J02o4J6J7l9K8L8k9n3L3K1k1l0N9l2L2
4292A9Q2j11l0J8M9m2K1qL4j5j7k2M5L9p2J2rpm8Q0J1l6nM7m2m3R4p0L9P1j35
4323e1j6J32o2n8O4j5l0k6L1KM0j4Rn0R0k8lM6k2n9L7ko2L1O2m9%K7M3o0K9m0
$$ y = [72, 9, -80, 40, -34, -36, -31, 50, -62, 26, 66, -6, 10, 63, 62, -39, 74, 46, -13, 36, 118, -33, 6, 51, -5, -67, 84, -16, -37, -5, 16, -56, -28, 16, -46, 0, -21, -36, 0, 40, -63, -49, 18, 12, 25, 1, 0, 0, -49, 4, -18, 21, 33, -22, 5, 49, 33, 9, 65, 12, -113, 18, 9, -20, 8, 33, -17, -1, 18, -37, -12, 20, 45, -9, 61, 37, -67, 16, 1, -53, 2, 67, -1, -68, 22, -23, -8, 39, 56, -67, 8, 32, -56, -37, -6, -24, 16, 4, 21, 10, 30, -23, -70, 53, -10, -39, -21, 46, 57, 26, 61, 21, 29, 40, 27, -1, 51, 21, -8, 36, 42, 6, -1, 76, -28, 8, 13, 10, -52, 35, -26, -56, -16, -41, -94, -34, -24, -24, 2, 44, -46, -80, 11, 22, 1, 14, 18, -5, -20, 35, -22, 24, 39, -34, 21, 28, -1, 2, 5, 1, -56, -35, -48, -71, -25, -12, -13, -59, 43, -21, -5, 12, -27, 1, 39, 10, -43, -10, 11, -10, -40, 19, -13, 19, 101, -10, -40, -22, 27, -15, 6, -2, 32, 17, 0, -22, 23, 62, -10, 2, -7, -14, -62, 18, 29, -7, -12, 35, -7, -50, 44, -26, 13, 84, -51, -67, 65, 3, -55, 9, -6, -36, -62, -31, -29, 11, -3, 6, -44, 46, 18, 15, 61, 39, -20, 17, 15, -47, -16, 46, -3, -3, 24, 67, 7, 36, -4]
4355dn7R1N1j19O5qo3j8J43r6n7O6J5p0N2ko4N6M5p4K1Q6r6M1K2K4p2Q4jl1jm2
4387a3Kj0K8K2p0O9rnk3O6j33R1J3n1QO5j12K9O4r1J2M3Lm6R4mj27R8L8p5j3M9
4419A2NnJ0k3k6J13m3r0P7J1p7k7J04m7l1J04p9k9N6j9J3N5k9n5O5K6j03l3J43
4448G8o0J0P3k6j15J9M7p5K9Q2j03J3L9m6K2%J5lj2ll9L1P4q8M2L5n5k5J00n1
4478Hk5P0j8n5N5M5r8K6K0n6lJ00j13kJ01q2m0N2nl4mJ42j38JM8m5j4J04j8l1
4508iJ5jK6M1n6l2N0j7O3l8m1n6K4M0J1o3M7M1m9n7J11q1l0J01p6M6m6N8l1KO6
4539E9q1N5j9oK0J5p1m2J55j01k9O6l8J1l3J14o5k0M1j0j9N9k4n6K7L8r1O7J1
4568C3m6K5K8j4p3M7k1m1P9n5O3n4Q3o8lqL2j2L5m1l1N3j4QNL4n9J5rJ3j9Q6k3
$$ y = [-4, -61, 30, 81, -38, 27, 19, -44, -62, 81, -15, -72, -6, 9, -61, -9, -11, -75, -19, 26, -48, -27, 59, -37, 4, 26, 50, -22, 62, 61, 30, 29, -13, -11, -21, 7, 29, -41, 28, 19, 14, -9, 57, -76, 15, 28, -23, -15, 50, -62, -33, 31, -60, -48, -5, -2, -48, 46, 42, -85, 13, 51, -24, -37, 12, 17, 12, 22, -1, -27, 86, 43, -47, 30, 41, -36, -63, 41, -6, -37, 67, -12, -41, 15, -4, 9, 64, 35, -20, 45, 71, -32, -65, 78, 18, 28, 101, 75, -40, -21, 26, -49, -20, 62, -41, -28, 11, -35, -13, -13, 2, -1, -13, -16, -55, -24, 50, -38, 4, 39, -16, -41, 59, 8, -17, 53, 35, -20, 35, 80, -18, 8, 28, -28, -31, 69, -44, -46, 55, -27, -67, -15, -20, -54, -58, 84, -54, -53, -5, -50, -64, 40, 22, -9, 6, 5, 31, 72, 16, -16, 34, 17, 80, 42, 1, -55, -31, 9, 20, -43, 4, 45, -4, -61, 50, -31, -61, 40, -36, 10, -36, 22, -9, -7, 59, -22, 33, 14, 8, 28, 43, -28, -70, 85, -16, -45, 21, -17, -6, -39, 75, 10, -10, 31, 21, 2, 61, 37, -19, 8, 46, -45, 22, 33, -13, 12, 40, 26, -47, 0, -21, -62, 17, -38, 25, -29, 54, -14, -17, -25, 7, -5, 30, -11, -42, 11, -3, 5, 10, 44, -15, 0, -9, 4, -15, 71, 48]
4601D8m7L5j3m4M0op9L9P3lm1M3m5J8k0M0l6m0P6l7k5J6p8J8N7j4o1J05k9M4J7
4632E1m0k5RJ3r4M5L0MN7Rl0J2K9k9n2M7n9k2J30q1n2M5Ml6M0Mok9OMm0L0L7M2
4666E3n4J9l6j0O7k9J1L7Qn2J4K5m7qRL1l1N1m7m1L1m9K1K8L8m9K7K4q4J24l1
4697E0m0j1l8P3m5M5M8j08l4Q0M2p9j9N0jJ3k6j0K0l5J4Qm5%O4Jq3K6M1L6n0o
4729a9M1j1M0m1RJ3Mm6j4J7N4l2m9N8m6P9pm8L1k7k4J8r4O6P9k4j1l2l3N3jkj4
4762a3K9K2ql0L2nk0K7m9O9j15Q2po6P4J2mqk2m6P2j3l7JQJ2l7J9N1p4Ok4O5R
4796A2L6o3P3m4L2PK3r4j2PR0l9j4L9pK8k0k5l4L4M7p4k5Q3p4qN2k4K0j5Nm1K2
4829cK3m6K2k3M2J4l9l1L7Q5qr2K5lj3J6J6k1L4j8m0j0J07j01k1N2l2K0O6J5p4
$$ y = [48, 1, 36, 23, -21, 19, 13, -66, -27, 46, 43, 2, 45, 0, 18, -2, 38, 2, -38, 38, 1, -24, -8, -86, -68, -11, -25, -86, 19, -10, 34, 51, 11, -14, -5, 8, -86, -41, -11, -7, 50, 59, 29, 41, 70, 41, -11, 36, -23, -45, 85, 4, -48, -3, 1, -35, 5, 9, 3, -26, -20, -16, -56, -26, 11, 53, -1, 18, -18, -28, 39, 10, 21, 58, 66, 14, 28, 53, 6, -2, 7, 38, 7, 58, 11, -30, 1, -48, -27, 1, 39, -10, 17, 41, -43, 81, 50, 10, -1, -39, 34, -11, 34, 82, -26, -60, 20, 62, -17, -36, 14, 13, 26, 0, -10, 10, -25, -11, -3, -48, -48, 16, 17, -66, -40, 1, 37, -13, -19, 22, 11, 51, 10, 19, 32, 36, -10, -24, -7, 47, 15, -34, 24, -22, 57, 50, 2, 33, 6, -18, 0, -94, -28, 51, 27, 16, -16, -49, 4, 3, 1, -13, 16, 38, 30, 0, 32, 27, 7, 34, -15, 54, -61, 21, 14, -52, 22, 34, 30, 22, 0, -46, 26, 13, -24, -23, -15, -3, -40, -21, 30, -44, -38, -62, 3, 12, 48, -15, 58, 14, 46, 53, 76, -18, -30, -23, 67, 28, 14, 53, 46, 74, 54, 29, -5, 29, 76, 2, -23, 60, -14, -22, 30, 6, 26, 11, 16, -25, -3, 20, -26, -4, -27, 15, 29, -10, -41, -4, 81, 73, -19, 6, 3, -10, 6, 22, 1, 35, 17, -23, -33, 74, -27, -48, 4, -28, -8, 58, 73, -1]
4860ak2QM8JL1o2J3M1p8L9K8m2kj8mk2L1j1O8r2L4m5L8Rj6J5NJ8q7N1M5p1JJ01
4894E2m7K6Pm7j4O0m1k4M1%j9J8O0K0j63Q9l0k8L4Nk7M4L9m8K0j8Pk2Rn4P1K7
4926D7k0k0m9M8K1K4o4LL8Rm2l1P9o4K6KK1m7k1P4k1kJ5kPJ9lm8J3L3l6L7lr2
4960d9O1k1M4l6km2j6Q6l1l2M1O4k3r1P3l7kK0o%pK8p3R3m9L2k2N2l6L4N4p2j6
4993A9k5J2pN2p2P0j6k8n2Q8m3%J1L6o4k4J03k3n3O7l3j8j7J5k2n3R9pL9m2k2
5024a0L8k7M2l2j9M3o5K7M2k5k3PJM5k2o0k6L9N3n2N2m7nN8o6M7r1N5O7m7jj9
5056b1K0JK7k1p9J30mj4k3j1K2o5Q3n1ON2j7l7Jo6M8M6j5l4M9k2l6M6K1k8j4N3
5088D7j3l9J5J7o1rN8Pj2N2m2k0j8L2m3M7k3k1O5j6m7L4np8N2L5J1k8K2k0QL7
$$ y = [-1, -23, -15, 33, 34, 65, 3, 16, 57, -21, 18, 46, 4, 2, -16, -20, -42, -11, -22, 46, -46, -12, -57, -19, -10, -26, -11, -6, 12, -75, -24, 21, -50, -49, 52, 5, 31, 38, -9, -23, 37, -4, -28, 13, 13, -6, 12, 72, 92, -71, 18, -12, -40, -6, -1, -28, 16, 55, 7, 27, 9, 16, -6, 3, -51, 20, 47, 27, 7, -42, 6, 27, 51, -13, -10, 28, 37, -5, -36, 43, -21, 5, 7, 28, -19, -40, 34, 13, 11, 26, 24, 31, 50, 47, -1, 12, 45, 9, 46, 43, -49, 12, -9, 35, -1, -3, -45, -61, 25, -6, -38, 3, 67, 44, -47, 26, -11, -13, 7, 1, 1, -6, 22, -51, 42, -7, 25, 3, 55, 19, 53, 107, 35, 19, -6, 6, -1, 51, -21, 49, 33, 5, -47, 41, -2, -2, 9, 45, -19, -43, 60, 37, -16, 51, 18, 0, -17, -2, -24, -77, 22, 15, 54, 12, -10, 28, 1, 43, 11, -8, 35, -30, -3, 39, 14, -9, -2, -1, 44, 22, -38, -64, -25, 28, -24, 28, -19, -24, 34, -32, 15, -76, -21, 46, -1, -2, -21, -1, 0, 27, 6, -73, 57, 53, 39, 16, 5, 27, -38, 45, -6, 0, 52, 35, -2, -1, -67, -19, 27, 12, -22, 27, 5, -31, 15, 36, 8, -6, 47, 34, -5, 10, 27, -34, -43, 15, 22, 10, 62, 20, 0, -18, 14, -29, 18, -5, -26, 39, 23, -24, 10, 5, -73, -21, 14, 25, -3, 19, -1, 7, 44]
5120D4p2P4p9N5jlk9J0N3o9L9l9K9LN3k4o1n2J8M7m9N4O1q4k1j1Q3j7K4Jm6j6
5152b5O2m9N0p1N0M0J9p0o3Q7K6l8Pl4MrK8J5m4l3J8M1k7k4rN1K7p0Q4j1j1Nk7
5185aj4M8kn2MO3k6j9L3Rj4m4L4p1J7N8On0O1l1k0J3Jj7l1K7k0J1M3Nn0K8J8k6
5219iK4ll6K4K2q4M0O3l2n2N9Oq8N9L7K3j0K1j23R0j4J5o1J19j27L6LL8n3lK7
5250A1l6N3Om9P0k1l7O0r5N4m5K8j9j07J13K0m1J7K8j9L0k6J5M6l2m3%N3J4q5
5280c7N3J4o6J3L5L0j8j0j3oK2J1o0O3l9OK2M8l9k1K7k7l7M4j4m8L1M8k6M2n5
5311gK0j5PL6j14L6N5k0oN6o1L1qoJ3l5M3%N8p2Pl6O9r6j6O4k0j1Q4o8j3M6p0
5344d9N2K0k8l6M4M6n7j3M9m1M2pp5M0j2m3N8O1J5p0N3k5m9J6ll0K3N8N3j01j6
$$ y = [44, -28, 46, -33, 22, 21, 18, -11, -1, 52, -17, 22, -17, 12, 15, 68, 44, -17, -69, -51, -4, -53, 1, 62, -22, -43, -54, 29, 12, 36, 37, -9, -25, 37, -12, 38, -33, 17, 57, 76, 6, -57, 30, 56, 18, 25, -9, -5, -14, 14, 29, -15, -48, -30, 11, -16, -40, -49, 2, 29, -41, 43, 32, 21, 26, -1, -15, 33, 31, -21, -17, 46, 20, 1, 34, 43, 29, -15, 19, -52, -35, 23, 29, -21, 40, 9, -11, 2, 3, -14, -45, -18, -38, -27, 16, 21, -29, -1, 17, -9, 15, 12, -24, 0, 22, -62, -22, 41, 9, -43, 16, 22, -66, -7, 30, 53, 43, 64, -59, 31, 17, 32, -29, 90, -37, -1, 2, 40, -13, -16, 11, -25, 28, 34, -15, 55, 34, -3, 57, -38, 16, -29, -1, -20, -127, -14, 6, -35, -18, 10, -9, 21, -5, 10, 56, 24, -19, -19, 34, 48, -37, 16, 30, -36, -23, 12, 42, 24, 14, 1, -5, 17, 28, -32, 31, -8, -2, 20, 68, 29, 8, 35, 8, -29, 15, 1, -47, -16, 32, 6, 48, -7, 13, -2, 5, 41, -73, -37, 18, -2, -8, 48, -13, 18, 10, 4, 17, -18, 25, 25, 83, 11, 18, -18, 51, -45, -61, 3, -17, -28, 56, -12, -25, 21, -49, 3, 23, -5, -41, 3, 49, -8, -21, 28, -13, 29, 22, -53, -13, -25, -68, -10, 51, 66, -4, 49, 24, -25, -9, -12, -42, -19, 39, 92, -9, -25]
5375b5P7m5M7mo9k5R0m9j2KJ2J0k2Q3p3l1K9k0K5Rk6NN9j3q6J33Nj49P7o2J8K8
5407bK4o8N5j1K9m7Q4m4JN9K5j01M2j0m8Rplk2P2j8jm8J4j4M9J7l4K2j5K3j05
5439g3L9K8j1k3N7n6N6k3kL4k2o5J07p5QK6M4k1j3l0L5k4LL3n8L4JN1p0L5l8j3
5471b6L9K7j11N2L1k3n2K4j8L4O5q4O3k8J8K1l6Oj3N3l6j3m1Q5n9O6n9JL9LK2
5502E0j16M4L6j6N5l5Jl2L2pl1O4n7J9nmk9qM9k6k3L2ql5Q5n9KQ1l3n2K7M4l5
5535A0j8L2k7j1Q3n7J9J6K0o7K7k5l5N8L8j07L8Q4m6l8M4l4j2k0rJ6OJ1n8J2J16
5566F6q6l5P6J7m2km5L1L7J7k1m5O8n3K4j3K7p4R0oq6M4L1m8M2J3k9k3O7m3m0
5597d1O1m4N1q1M2ok3Q1l6j8J4o2N1J09j15k0K1L6k1j7O7l9QM7n9K5K2p4QK6m5
$$ y = [-25, 52, 7, 54, 50, -19, -44, 46, -3, -15, -13, -1, 9, -13, 70, -3, -34, -5, -25, 0, 9, -17, -12, 47, 34, -52, 81, 86, -63, 14, -48, -30, -2, 22, -46, 9, -2, 27, -20, 64, 20, 21, 80, 105, 4, 46, 36, -12, -3, -10, -13, -35, 37, 19, 18, -30, -16, -30, 19, 36, 2, 24, 9, 32, -73, -34, -6, -17, -40, 17, -39, 17, -6, -8, 26, 4, -61, 46, -29, -21, 5, 49, 28, 15, -15, 20, -4, -1, 32, -26, 8, 9, 60, -10, 25, -13, -26, 13, 40, -71, -19, 12, -11, -63, -39, -57, -23, 42, -42, 21, -7, 11, 32, -4, 2, -11, 42, 6, -7, -48, 37, -22, 44, -15, -14, 25, 28, 50, -66, -22, 14, -2, 53, 18, 19, -13, 19, 12, -19, 45, -12, 7, 2, -2, -31, -39, 10, -16, -39, -7, -15, -50, 35, -24, -22, 59, 26, -26, 1, 45, 10, -8, 24, -3, -14, 69, 12, 31, 47, 67, 0, 27, 2, -33, 25, 63, -44, -6, 78, 32, -6, 38, 4, -8, -28, -37, -21, -15, -4, -62, -50, 66, -20, -55, 21, 38, -4, -6, -51, -20, 17, 34, 13, -32, 36, -17, 7, -6, 21, -53, 37, 31, -55, -11, 20, -28, 14, 27, -2, -25, 42, -1, -41, 20, -24, 27, -54, -12, -18, -41, 40, 4, -14, 0, -62, -11, 98, -17, -37, -16, 20, -1, -18, 49, 10, 18, 65, 6, 31, 53, -21, -13, 13, -32]
5628c2J1O0j3J6j0M0o9J2l0K7K1L0o2m9O4J4o6K2nl5M7L2j2pJ6l1L7l0L6m7Pj0
5660a6m1P0L0j0o3J05q5j1K2N6kol2j7J6qk6k2J25p6k9L0Np0O7pk1l4L8nlK8j1
5693cm4P7k0j7jK0rJ3P5m7n5N9q2M7KL0m8J2J4k2J4qj6K8J5j9k1m3M9o7K4O1L
5726B1j7O2n9l7L7q2P0kpoK0J0l9L2N6r1M5K6q2L0L5K3o2jJ1k8J07o9k4J1Ll3
5758d0N4j1m6J4N5o0j4M6oK5M1l1m3M8%m4l2J01m2m6K5qk5jL9n7P2M4r8K6NJ7
5790HkK6l5j6rP2j4k8M6m2L4K5o2LL9l6m0Q1l0m7O7l5k3M3L1j05O2K3o9L2Jk5
5822b5J0L9o3K3M7Rj00Q0L2j9j3O2q5n2J20j1j7PJ4o2PP7n2k0q9J12j2L0j3j1
5852B5o6NM2L1j9o0mR8n1k2M3n9J3j6K0%J4N4o7O0k3K2k5J3j3l9L8k0n5P2M8q8
$$ y = [-32, -21, 39, 26, 42, 32, 72, 3, 15, -15, 12, 33, 63, 1, -48, 16, 30, -36, -14, -19, -54, -7, 25, 13, 6, 22, -9, 28, -2, 34, -13, -6, -16, -57, 13, 43, 33, -30, 75, -10, -21, 1, 57, 55, 49, 17, 0, 16, 8, -18, -40, 85, 9, -20, 10, 15, -55, 12, 5, -16, -50, -12, -17, -20, 8, -3, -47, 30, 10, -7, -8, 12, 3, 16, 91, 44, -11, 48, -34, 13, 15, 45, -3, 9, 23, 1, 15, 7, -9, 19, 34, 15, -6, -49, 0, -67, -43, 18, 21, 4, 66, 7, -30, 7, -75, -5, -7, -14, -20, 0, 10, -29, 3, 59, -32, 13, 39, -43, -13, 22, 45, -17, -18, -7, -35, 72, 3, -21, -10, -7, -40, 14, 3, -43, -29, 26, -34, -48, -2, -8, 17, 58, 27, -16, 32, 32, -12, -44, 57, 15, -31, -6, -14, -39, -40, -1, -58, 14, 58, -40, -14, -9, 8, 6, 32, -3, -19, -28, 44, 30, 2, 48, 6, 40, 65, 3, 6, 45, 9, -31, 50, 20, -27, 40, 5, -18, 25, 56, -49, 13, 36, -33, -1, 0, -25, -15, 24, -39, -16, 31, 40, -60, 20, 52, 33, 20, 82, -3, -55, 65, 54, 37, 44, 58, -4, 3, 80, 28, 8, -81, 31, 19, 49, 36, 25, -41, -36, 6, 37, 18, -42, -46, 52, 1, -21, 22, -37, -24, -40, -20, -20, -6, 48, -19, 41, 18, 40, 15, 28, 15, -24, 14, -6, -61, 11, 59, -29]
5884b9K7NM3l7Mk1j8L8m6L0j3N8r9R9l9J2n3J30j04k8N4k4n9J17k4k6lK6o1pJ29
5915H1j09K9L1lj5K2j1p9P0jon4J7R0n0qJ9L7m6Rk0K2m2K2m4L5J0j0ojl7Q8m4
5948dJ8k8J4%j5M5o1L8N7l6k0L4l7n3L6R4q5j8LP2j06R2l7QJ9kn6M5m0PO9p6K8
5981Ek4M0Qn0Q1o4j3M4n1kM5j9l3M0k1j6L6l3K1j9K9mN1m3JL3k4Kp9P1Lm6K0K8
6015A7kl0P1m0pJl0J0M9k8m2mQ8n8jN2k6n0N9Nq0N9N5j12J4O5j04M2M5n9K6J0
6047eKM1q7Q7j9k2L2l1M4L4p2M9m7L4m9M9m2lQ2p0m7MR9l0k5l2K0KM9n7j6K1j0
6080a5k1K9K4j7j2Nj8RN7k5l3O7o6rlK9Lm7O3k7J5J6mn9J8K9o0L2N8n4J4M4q2
6113d0j3L9L5l5K7M5r9L6qj1J2O4l%k6Jp4N4N2Rp4N0k7jj9M8k0Mk3K4N6q5MJ6
$$ y = [-29, -2, 3, 46, 9, 13, -8, -26, 12, -34, -4, -17, 41, -58, 41, 2, 14, -39, 91, -13, -41, 13, -11, -70, 47, 23, -3, -6, 20, -41, -48, 81, -28, 1, 32, 29, 14, 36, 25, -54, 16, 15, 9, -45, -28, 62, 12, 4, 23, 60, 14, 23, 3, 25, -17, 5, -39, -4, 6, -4, -10, -11, -48, 40, -4, 14, -14, 0, 0, -15, 30, -31, 7, 64, 28, 8, 42, 5, -48, -12, 82, -3, -21, -18, 54, -52, 40, 3, 11, 30, 28, -28, 17, -23, -16, 53, -23, 5, -19, 21, 29, -21, 60, -4, -17, 27, -24, -26, 19, 0, -33, 7, -14, -30, 6, -27, -6, -25, 4, 0, 51, 8, 9, 42, 18, 20, -59, 12, 15, -31, -11, 17, 15, -15, 56, 16, 9, 10, -20, -10, 39, 11, -31, -35, 53, -5, -6, 46, 20, -30, 29, 34, -46, 13, 68, -44, -30, 35, -69, -27, 18, -41, -15, -5, -3, 38, -49, 38, 19, -3, 29, -2, 42, 76, 4, 53, 6, 40, -9, 40, -2, -5, 77, 7, -40, -36, 63, 33, 8, -24, -4, -2, 47, -10, -26, -5, -15, -36, -7, 17, 0, -12, -7, -25, -16, 41, 16, -17, 50, -16, -25, -28, 1, 4, -43, 20, -7, 8, 24, 20, -39, -21, 8, -52, -20, 38, -16, -2, 42, -40, -53, -14, 21, -14, 13, 58, -41, -5, -13, -24, -12, 52, 49, 49, 23, 24, -50, 4, 56, 65, -9, 41, 14, 13, -6, 42, 22, 26, 3, 27, 83, -2, 2, 18]
6147A8pk9N4k4qn8N7koN0k1l9O9n8jl0O7o1K8M4q7K7L4m1N9j4k6M2o3R1p5P4m4
6180B0m5k7J01q2K6P3o9K9%K6L1l9Nmo4K0j4LJ4j8L1l9j5L4qNj00R2L2l3jK6J3
6213B3p3P8l1k9L3L8pJlo2L0l9N4lL5k5J4J9K0j25L9P1j0o9J5lK5%lp5L5Qn4N5
6247a8L7j8rK0l5M6k5J3l2M1q7P9kk1QP5o0m1O8mm4n2L6K1k2j7M3lO3q9N0o3J08
6280F6j19L4qQ0p8M2M2r4L2J1j9m4L9knN3j6L9kr1M9j1L1o6K0P6n3K4Jll2J6K7
6313C9n4J7O2r1L6K4l4j3L7m0KL9qk6N1o1K4L7oj00N5L2j7Mk1L0n4N0M0K9p9n2
6345d8RK5J04j42J27p7O7r3N3jRQm3K6j6K5n3k2N8l9K0K7Jn0N4p1K8PNn1K8k7
6377e2k0R9r9N4J5N9l0l8N9p2Jj2M5o4JQ1m1RrpK0P6Or0jN4o7NL7K9o4J4oJ8m9
$$ y = [18, 11, -18, 36, 12, 4, -54, 3, 1, -5, 45, 24, -15, 54, -4, -5, -35, 32, -29, -1, 43, -44, -17, 17, -24, 35, 21, -5, 37, -26, 65, -10, 64, 20, -25, -52, 49, -33, -7, 66, -3, 26, 26, 52, 83, 44, 49, 45, -19, 1, -13, -10, 4, -14, 17, -22, -37, -3, -11, -6, -106, -14, 18, -15, -16, 10, 23, -50, 28, -3, -32, 1, 39, 32, 33, 30, -32, -2, -41, 13, 10, 45, 20, 34, 53, 73, -52, -13, 58, 48, -21, -6, -9, 16, 16, 13, -62, -27, -19, -73, -18, 19, 1, -8, 12, -23, 23, -2, 11, -21, 20, -67, 12, 10, -11, -3, 72, 12, -29, 39, 35, -9, -61, -25, -4, -26, -43, 0, -3, 60, -29, 21, -42, 66, -53, -19, -27, 53, -25, 17, 59, -35, -3, 8, -11, -55, -16, -18, -23, 30, 14, 53, 51, -40, 9, -2, 29, -37, -17, 59, 6, 30, 31, 28, -4, 12, 39, -15, 2, 64, -27, 9, 33, -1, -14, 23, -17, -15, 24, 16, -10, 41, -20, 4, 41, 35, -65, -10, 22, 5, 9, -12, 18, -36, 14, 54, 83, 4, -48, -39, -14, 90, -52, 75, -2, 65, -28, 25, 24, 33, 41, -2, 24, 8, 33, -20, -42, 16, -23, -3, 24, 25, -25, 29, -42, -14, -7, -2, -53, -25, -52, -72, 27, -72, -18, -3, 56, 26, -12, 47, -25, -24, -36, 9, -55, -54, 27, -14, -5, -14, -21, -1, 75, 81, -9, -10, 44, -23, -18, 19, 48, -16, -2, -8, 10, -39]
6412c9N3p2K3L5l2PN9p0M4Qp3J0K0K6oO8q3M8k3kn1Q5k7J4k7j0M2k4kpj2k2J15
6445G5r9K2K0k5P5k4n4PL9m6j9p3J10l0NRKl1M6Jl2jK3j3L5l1p5O8N5o3k3J28
6477H1r4j5O8nn1J4oK2j2M0o1K5k7K6j3jlj6jO3qn0kL3K9n8J5NN0j3m4j2kj1N
6512b9L0k9K1M4n7j1L7K7m2L6N7j04J6O4o6L9j2J3jp6n0R3n0P5l1K8kl7MM6j4
6543A9%on5j2O9j4k1K8kn7R2m2J2o1N5n9Q2J7p9L1Lrk4M6m5R7p8N6K1l8Ll5L6
6576C0m9J2J8Po0OJ2qRL5nL1k2jj8j2Nj3K3N0n5k2K1P5j02N1N9p7k8N0kq8J27
6609E9k7j4K5k6k5NJ3l9L4KK0k6L9l0k5J1qJ0O0r8%N7rqm2P4m1J1K4Pn4J3mo9
6643h1J22om8K6P1n4l6K1M7n0L6l2L5p1%P1j17N3k1OK7Mn6O7M8r7qN4l8k6Q0j6
$$ y = [-39, 14, -58, -35, 0, -32, -25, 34, -36, 8, 16, -57, -47, -27, -1, -7, 61, -22, 26, 3, 1, -50, 35, 8, 22, -5, -15, 27, 3, 1, -6, -18, -40, 75, -24, -2, 18, -7, 68, 44, -10, -3, 36, -10, -29, -102, 8, -22, -17, -8, -6, -37, 9, 10, -22, -23, 0, -13, 22, -9, -84, -16, 39, -24, -47, 81, -13, -28, 40, 35, -16, -2, -8, 14, 2, 42, -19, 6, -21, 5, -8, -9, -12, -28, -29, 34, 26, -24, -26, 7, 36, -22, -7, -2, 48, 35, -9, -21, -23, -34, -29, 1, -28, -7, 37, -20, -31, 6, 33, -9, 27, 84, -20, -4, 60, -6, 33, 21, 34, 33, -43, -93, 0, -50, 25, -6, 22, 20, -17, -13, 33, 19, 19, 13, -42, -54, 15, 1, -20, 8, 6, -51, 41, -1, 11, -50, 5, -54, 28, 45, -34, -3, 0, -9, -33, 13, -32, 65, -13, 43, 64, 26, 29, -6, 30, -19, -7, 11, 18, -42, -36, -24, -32, -23, 12, 7, 38, 16, 15, -3, -15, -10, -23, 0, 50, -5, -27, -6, 69, -33, 18, 77, 0, -28, 22, 20, -68, 59, 32, 18, 43, 17, -8, -3, 10, -29, 5, 7, 27, 1, 40, 10, -15, -4, -12, -2, 58, -40, -40, 17, 8, 0, -42, 32, -9, 2, 26, 33, -21, -8, -12, -81, 41, 35, -13, 13, 84, 30, -6, 15, 62, 12, 48, 16, 51, -20, -20, 51, -66, -13, -34, -28, -1, 3, -53, 14, 62, -35, -43, 11, -27, -53, 27, 11]
6675A1j08P4J5j0P8k9j5j1k5P6n1%pn9P0l8J3J9L5n0rM4Ln1L6O8j05M3P7j42%
6706d8R2l0%pJ3j5k2OL7L9n6K1QJ6j00J5R6j49Q4J4k0k0L4K9m7Kj0M3kj6l2P1
6738D6o5M9k8RK6o6M0j0Nk2L7l9RL7o6L2N4q7LJ4K5k2%N5m5N8o9ON8j6oO8o2j3
6772A5l2K4L8m0LK0j2l5L3j5j9Rm0L4K6j6NKj4L1K5o9kNJ1J2OO4p4l4Q1o8M8J2
6806C4Jl9OP6o0q2J08kn0LL2n3P4p2J3qL1l2k3N4j7k9O2k2p3O8P1j9l0%j8j2j5
6839b3M0KPl2k8Om2K2O0N1j21J3O6J2j1m5L9j5L6n8J4j6Q0r9L1J5k0jM6j4M4n1
6871HJ2j00R4ml8N8k7p0M4M7l6k7J4N4o5K6KM5k4lk9J7K7L0r6K7K7m0P4j1k0k4
6903hP7k0m8P1l3pk4J5k3N0n8njL3n3RL3p5L8L6o7QN9j8J9M3n5n3O2M4k6m4O0
$$ y = [11, -97, -23, -8, -18, 60, 31, 16, 5, -20, 56, 5, 5, -2, -61, 9, -29, -16, 3, 38, -12, -21, 23, 26, -25, 11, 79, -26, 17, 94, -48, -48, 44, 14, 14, 7, 20, 5, -17, -11, 26, 65, 9, 30, 38, 54, -46, -31, 65, -84, 0, 14, -6, -26, 8, 37, -10, -8, -18, 25, 23, 7, -25, 46, -19, 30, 2, 11, 37, -29, 11, 1, 6, -16, 21, -18, -9, 28, -38, -6, 48, -39, -36, -22, 3, -19, -19, 36, -9, 49, -20, -14, 44, 28, 22, 90, 28, 15, -17, 7, 45, 5, 8, 28, 16, -19, 14, -1, -20, -11, -51, -17, 9, -7, -2, 0, -14, 17, 42, -27, -29, -24, -13, -1, 5, 69, -5, -39, 42, -26, 22, 34, 35, -4, 2, 78, 18, -64, 44, 42, -8, -5, 27, -26, 48, -24, -11, -19, 12, -20, -43, 11, -6, -35, 27, 5, -68, 0, 71, 52, 22, 22, 4, -8, -23, 17, 19, 26, -6, -34, -28, -70, -48, 12, 63, -58, -45, 21, 33, 22, -23, 16, 1, 37, -21, -7, -23, 57, -42, -11, 4, -16, -17, 29, 15, 59, 8, 20, -80, 14, 10, -28, 30, 3, -67, -23, 24, -12, -39, -25, 29, -36, -10, -8, 37, 13, 10, -19, -2, 25, 55, -41, -14, 13, -27, 47, 36, 16, -8, 69, 49, 1, 72, 39, 32, 8, 23, 0, 50, -8, -13, -14, 19, -34, -25, 8, -67, -29, 7, -60, -52, 7, -11, 8, 51, -4, -57, 5, 49, 23, -21, 39]
6936C9m6jJ6n3j2M4K%J4k9N0mJ1q0M9Ln6L4K4J7n9O1Qm6M8l6j1K1Lq9L4L3Jk0
6970c0K6jPNK9r6R6ml4rO7l2o1K5L3m3L6K4o2J0jK6L2j6k9l8R2j3j4QMj7o0J00
7004F0o5r1J06n1K5M1J1k3Km4Pk4J03j02j3J02o6l4O6mL0J4k2p5Q1j8j7K4M1p6
7034a2nO6p1k4J01k9p9J03K0j01l1Q1k6J1ln2J8O3l2qJ2j2LQM4o3O0Pj17L6M1
7065Ik0k4O0m1O0m2K4m9M8%j00J07m7N0jmK6q3L3j5Rk4P6p8K8rLj0nL1p1J09l0
7098B0p3L0L3k8J8n2l8R1M4j9o6R4k6m8J4N7q7Q7r1mL6J8m9l1J15Qn6k8O3j00
7128f8N0L1Nl2O6l7Qm0Q1p8j3J6j9L6M2p3jK3M6o8L3L2q5P9l1J1rJ2Rp0R2o9K1
7161@K0j8p1J09J3k9J3k7K5l1k2nj2j4L4N0J1p9j9R0qql7NL5k4Lm3L6On0M9N1
$$ y = [39, -7, -8, 8, -45, -57, -13, -11, -11, 3, -26, 24, 20, 31, -49, 0, 3, -53, -19, 5, 22, -37, 24, 32, -14, 34, -2, -13, 8, 11, -78, -44, -11, -10, -30, -4, -5, 2, 7, 36, -60, 36, 32, -2, -11, 56, 24, -37, -12, 21, -22, 14, 38, -24, -14, -15, 11, 43, 27, -2, -40, 52, 39, 25, 33, 37, 20, -40, 60, -5, -96, 10, -41, -16, 25, 36, 13, 15, -29, -22, -46, 57, -45, -58, 44, -22, -56, 10, 6, 36, 50, 28, -47, 34, 16, -1, 23, 64, -12, -17, 49, -22, -46, 55, 26, -53, 50, 70, -31, -62, 19, -7, 4, 1, -51, -33, 30, -2, -10, 2, -10, -7, 1, 45, -18, 42, 49, -68, -32, 9, -11, -35, 25, -16, 44, 2, 26, -23, 25, 25, -75, 32, -15, 35, 34, 30, 56, -27, 6, -9, 0, -24, 52, -26, 2, -7, -4, -14, -19, 12, -59, 50, 20, -53, -23, 10, -18, 0, -52, -90, 1, 45, 26, -40, 54, 28, -20, -6, 51, -36, 51, -40, -44, -8, 10, -39, -70, 45, 53, -3, -31, 32, -68, -18, 13, 18, -14, 52, 15, 23, -17, 64, -14, -27, -11, -30, 6, 48, -25, -26, -3, 43, -25, 8, 40, -45, 34, 3, 14, 5, 17, 26, -44, 48, -21, 0, 20, 2, -69, 40, 53, 24, 37, 10, 35, 4, -18, -23, -35, -49, -15, 35, 46, -33, -52, 38, 30, 22, -15, -10, 25, 1, 4, -39, -3, 3, -47, 2, 53]
7194E3o4k7M2rO1j0m7km4J08n5m9J09qo5M8m5kJ0J9k0m2N8j2l3k2M0j4M3j4q2
7225g5P4l4J3%O7p2M4J4n1RmN2n2M3Kl9J5J2l6K1J0M8n2j0L4m3O7l6k2M6o4l6
7257e5O9k9j7M4J6Kn8j2N2J4m7R0j03P2n3J0lL9p4L3Jm0P1k0Rk1K6lk2QM7n2M
7290bK5J5m7J4N7n6qL1k7j1M5l0K8j8m0m2M1J9j7L4M8q7L1qJ0N2k7p1LN6m5mK2
7323iL4%m9o%K6rO7o3NJ6QM7q0J9%k6K4Pk2M1l7l0J8oP3k1rLL6q1M3K4j00P9k2
7359@j6oJj1m5J18k2nm1L2K0r2J13n2k0M4j9J6%J6m6O7n2J5kJ1m8M5k3jP0p6K8
7392A9k9L4j2l1K4rM0n0k8L3k1Q4j9m7l3R4r4N1OJ2j0Nn6K6P5q7NN4Ll7J3Mj02
7425h3O1L3qK8J1k4l6O0k0l5n8R7j25N4J03pj01K1O7p8K6L6p7P7%m4K1N2j04M8
$$ y = [53, -11, -38, 4, -5, 56, 46, -1, -3, -47, 61, 6, -43, 66, 58, -7, 41, -4, -6, 4, 23, 3, -39, 19, 7, -26, -48, -8, -22, 21, 7, -75, -1, -35, -22, -22, 45, -27, 17, 31, -20, -11, -15, 37, -15, 28, 30, -9, 6, 18, -18, 3, 13, 61, 9, -1, 33, -10, 57, 21, -1, 45, -19, -55, 14, -15, -32, 12, 28, 30, -28, -40, 12, 26, -21, 69, -34, 38, -15, -5, -8, 31, -43, -10, -9, -49, 22, 2, 11, -10, 16, 13, -9, -1, 46, -6, -2, 23, 38, -9, 5, 62, 6, -2, 29, 2, -9, 36, 6, 34, 16, -24, -66, -25, -6, -23, 11, 59, -28, 3, -5, 5, 57, 30, -41, -38, 18, -27, -31, -9, 25, 25, -24, -30, -30, -4, -13, 54, -9, -4, 12, 20, 67, -13, 6, 6, -20, 4, 11, -11, 30, -7, -37, -19, -25, 48, 27, 18, 21, 57, -24, 19, 43, -57, 22, 0, -16, -22, -21, -32, -77, 41, 19, 14, -27, 5, 25, -67, 46, -6, -26, 18, -1, 15, 15, 31, -15, 52, 0, 15, 13, 24, -24, 21, -2, -3, 67, -9, 19, -10, 24, 12, -19, 5, -4, 36, -14, -42, -9, -30, 54, 35, -12, -45, 49, -45, 6, 12, 24, 14, 19, -37, -11, 64, -23, -18, 36, 39, 2, 15, 19, -83, -22, 11, 3, 31, 42, 18, -18, 42, 22, -13, -71, 26, -99, -45, 58, 51, -50, -29, 38, -40, -14, 22, -55, 22, 22, -22, -1, 51, -53, -5]
7455eL3k3RJ9n9M3L1l2m3P3k0k2LrO0m8L7Jj11N7N4l7Kl5L1n5O8k7lK0o2l5J24
7488C9J4q9O3ll0Rk2k6N0O5n5JL3n4l2P1Lo2O4k2Kl6J4L5J2m1K7qk7O5q6k9O7
7521A2j16P5j8lN7J0rl8J5k7K7l1J5Q3r8L9oK2L8k3l6N2oj0kj0K6J8m0j0Lk6M1
7554B4l1N9o4n1J41j09J4rj2JO5l5jJ7K6k7r3J19m5rK6K1j04P7M7p1K3k2N5o5
7584c3Q0m3k1L0J1k0lnm7J4L8K6j3J2m4QN9Jm4J2J7q1L1J6j9J6Pk0M0Pl6k1P3
7617D8k5p9L1J2qM4l4MOJ9m1P1j0ll8P9q6k1K9L9j01L1Q3k8n3O1k3j2M8j1p1L5
7649dN3q2L1%k5n2J11l6m6L5Lm8M4Q8m4j4k8N3r1P0l7M5qK7l7L4k6k8L8n2O0J0
7681D4m6J8n8mL0JK4J1p3pN7l5ON1l0k0Nl2M5MQm2M1M0l7j1K4l4j1O9j5j00O7
$$ y = [-5, 28, 5, 14, 33, -26, 17, 48, 16, -27, 46, 26, 4, 7, -2, 58, 10, 47, 48, -63, -6, 48, 11, 13, -22, 9, -46, 22, -5, -8, 12, -50, -85, 39, 53, -36, 27, 24, -6, 3, -19, -45, 5, 70, 15, 16, 49, -5, -37, 34, 37, -25, 39, 17, 19, -17, -3, 32, 44, 3, 30, 22, -5, 60, -26, -55, 12, -104, -29, -47, -50, 7, 17, 8, -30, -15, -42, -15, -46, -31, 52, -46, -7, -13, 9, 47, 24, -12, 40, 34, 24, 22, 12, 38, 56, 16, 6, 9, -17, 24, -7, 52, -12, -63, 78, -31, -17, -26, -38, -37, 28, -7, -8, 9, 35, 8, -85, 34, -11, -20, 6, 27, -77, 0, 47, -24, -1, -23, 32, -33, 47, 4, -17, 13, 24, 4, 1, -4, -51, -37, 1, 27, 14, 26, -18, -10, 49, 50, 6, 18, 35, -46, -15, 1, -18, -2, 5, -15, 25, 32, -4, -25, 48, 23, -56, -25, -13, -21, 23, -11, -7, -1, 18, -23, 48, 38, 35, -3, 76, -10, -31, -2, 37, -64, -33, 50, 22, -31, 30, 7, -5, 43, 32, -39, -4, 49, -33, -2, -2, -27, -79, 32, -4, -50, -15, -12, -60, -16, 72, 28, 14, -14, 39, -52, 18, -19, 26, 18, 45, 8, 42, 16, -12, 26, -26, 34, 44, -2, 16, -42, -46, -16, -15, 9, 20, -53, -60, -3, -38, -32, 19, -11, -31, -26, -58, -13, -9, -1, -43, -2, 38, 1, -10, 14, -20, -31, 38, 23, -77, -10]
7714a0OJ6J2pj4n8N6l4KL1j5l7O7k5J4p1Q0m6M9l4K1lJ4j0l4ol0L5N5k6o1N7K2
7747A6q8L1L7n1J1P3o2L4oj4K3K5pl1L5J6p3J8k7N9k6K6nk4nL3k2L7Ql7m5L4M5
7780C8n4K6j8m0J5L1j0M8n1j8J9M5o1L1MQq2O4qM6Pj8k4l6P3kPl9l2O4JMq8O6
7814A6j5m3M5J3p9M9J4j8j0L9l9K2L5n8NK7Pn5k9J21m1qK0m5j4N5oj5J2m6N3O6
7846G8n3k1K8k7NJj1K7j3Mk0r1R2k2Nj7K8J4k6mL9j2K3J2m7J9J5J8k9J8j00J01
7878C4m7oj8N4Lk4j6M4J4k3L5L3p2Pm4L8kM3o5J3P5p4N6n5m1L1rk6PK1Q5j14Q7
7911D4k5j2k2mj8K2O5pp1P1n7j2P4Jp9M2L2o6mP0m7nK3M0j6n3L0K7n8L3Po2K9
7944hqPNK0l5O3j1k2L7r6J4N6Ko6L3Ol8J4N2J3r9O0m0J6K1j5M8j2qO9p1nk5K0
$$ y = [-10, -4, 12, 24, 17, 3, -55, 1, -33, -31, 0, -15, -52, 15, -10, 4, -67, 13, -33, 16, -18, 3, 0, 14, 4, -30, -36, -66, -31, 24, -2, -63, -6, 16, -72, -41, -4, -55, -44, 29, -33, 1, -5, -19, 4, 29, 22, -9, 26, 42, -31, -13, -40, 19, -7, 19, 14, -10, -15, 18, -4, 33, 41, 4, -41, -7, 38, -16, 10, -8, -48, -33, -2, -12, 36, -15, -33, -14, 31, -30, 1, 5, 13, -69, -5, -13, 33, 40, 22, -2, -38, 35, 33, 40, 1, -31, 33, 34, 38, -50, 16, 1, -42, 3, 16, -63, -14, 0, -18, -28, 11, -28, -6, 29, -29, -24, 3, 10, -45, -74, 47, 6, -2, 18, -27, -41, 14, 8, -7, 5, -41, 12, 78, 25, 4, 32, 5, 10, 11, 0, 27, 14, 18, -2, -93, -1, -23, -18, -35, -7, 7, -19, -23, 16, 4, 27, 39, -8, 11, 26, 44, 15, 33, -67, 34, -13, -19, -37, 17, 20, -4, -20, 24, 38, 15, 50, 83, 11, 18, -26, 12, 10, 53, -12, 1, 76, 2, 58, 3, -38, -7, -16, -42, -35, -14, 71, -43, 44, 19, 7, -15, -19, -37, -15, 50, 43, -28, 43, -14, -26, 48, 49, -30, 12, 44, -22, -26, 44, -3, -8, 15, 55, 39, -14, 16, 43, -15, 18, 25, -37, -8, -16, -9, -4, 16, -19, 44, 33, 11, 48, -48, -34, 22, 24, -42, -9, -3, -41, -27, 25, 38, -61, -1, -41, -25, -4, -19, 29, 17, 9, 78, 7, 2, -23, -3]
7978cN0m5J8K1k9l5mJ8l0Q0l1m8J1l5J17r8M0L3o8l9J30o8J4L6J3l4Mm1K3P2m4
8009B8m9O2l5k6L3k0L7l7K2%J6L0k8jMMr2N0Qr1J07Pl9JK0k5JK3L6k7L8r3K7P7
8043F8m1o9L9L8l7l6K8KkM8k3j5K1jn3pR6q9N1jKk1J5j2j5oQ9q4K5M3k8k1P2q3
8077gk3L8l1p9O2M2j9k6M1l3LJ6J4%M2Nk7n3O1K6q5O1l2K2j9m5Q6o1Q3p9L5K8
8109D6o6K1L9%n3N1m6P0q2j2k3L3M9nrk0K3m6N9%k1K2j8m0N3l0j1M1p9R0m4K4
8141A6q2P8j2j9k8P0J7o5J7K0n0M8jl2J9N2q3j6R6q9R6j2p2M8J3L0r9l4J33r7
8171c8M5L5n6qK8Pj3JL6q2L5K9l9KL7j9OJ8J3j5
$$ y = [-3, 47, 2, 20, 41, 12, -23, -27, -9, -39, 41, 10, -38, -27, -62, 55, -43, -3, 30, -38, -77, 53, -15, -1, 35, 48, 14, 18, -23, 0, 72, 28, -21, 41, 6, -20, 13, -7, 30, -7, 15, 15, 31, 61, 33, 32, 36, 40, -52, -2, 6, -85, 22, 29, -10, -9, 11, -14, -13, 10, 46, 19, 57, -36, -9, 68, 27, -42, -3, 35, -2, -38, -10, -8, -10, 38, 15, 0, 21, 20, -33, -40, 56, -33, 18, 17, 19, -2, 13, 1, -14, -20, 69, -15, 10, 53, 25, 4, 76, -7, -30, 8, -23, -102, -40, 2, -17, -43, -2, -35, -32, -16, -2, -2, 40, 45, 18, -35, 26, 52, -33, 28, -4, 18, -1, -46, 40, -21, 62, -17, 18, 46, -20, 1, 40, 40, -13, 38, -8, 62, -20, -32, -55, -22, 27, 22, 13, -7, 16, -30, 29, 29, 8, 30, 12, -28, 25, -5, -16, 25, -54, 36, -8, 16, -66, 12, 0, -19, -47, 23, 40, -25, -8, 12, -38, 10, 9, -23, -4, 48, -35, -51, 45, -44, 52, 40, -32, 16, 29, 59, -40, -74, 59, -38, 7, 42, -14, -22, 6, 13, 0, 1, 37, -45, -10, 19, -20, -18, 19, 0, 6, 24, 37, 22]
8191B2
$$ Imaginary data points
##PAGE= N=2
##DATA TABLE= (X++(I..I)), XYDATA
0@%%%%%%%%%%%%%%%%%JrJ6j6J6j6J6k4L2l2L9m7M9n7O6p4Q8r8J07j22J38j54J71
40I0j89K12k35K60k90L20l53L88m29M76n24N72o29O96p69Q50r41J048j171J315
60F97j489J698j957K294k748L392m377O103r962L2914j3541o2481O6992J2879
74C0414n3103J1249K9823k6366Q188P821k7545K1045K8677n2724l469O3002k7283
87I729n3017N1724K3515n3404N304L6580k1014o881J5414j5121O342K1750l2622
100a1701q351M7557j6475m5245L9128K5915m7923q87L9196j7432j8200J9791m016
113A357p394J5278j3577j1521L0482m759l4816K4709K5439l6520o723L5650j0378
126G227k2502J7830M782j2317Q220j782r902J7105N63k4769J4579K0873k7169
$$ y = [0, 0, 0, 0, 0, 0, 0, 0, 0, 0, 0, 0, 0, 0, 0, 0, 0, 0, 1, -8, 8, -8, 8, -8, 8, -16, 16, -16, 23, -24, 25, -32, 34, -40, 48, -50, 57, -65, 73, -81, 90, -99, 113, -122, 138, -152, 168, -185, 203, -226, 250, -274, 298, -331, 365, -404, 446, -495, 553, -618, 697, -792, 906, -1051, 1243, -1505, 1887, -2490, 3613, -6349, 26565, 13024, -49457, 17535, 30414, -22689, -11440, 18383, -7983, 205, 8026, -19519, 1526, 30203, -22521, -25990, 37012, 9729, -43288, 8436, 31951, -21453, -16149, 20431, -583, -7464, 7950, -7171, -829, 20921, -11701, -20052, 27505, 11030, -34215, 4913, 30828, -17095, -17982, 21214, 3782, -14418, 5373, 1357, -6037, 9241, -4336, -15857, 14625, 9866, -24950, -241, 25198, -11322, -18045, 17605, 7227, -15275, 2555, 7337, -4980, 3240, 1458, -8444, 8661, 9224, -15545, -966, 19907, -7262]
139g262q480K9883o870k2747J6126Q519j5570M540N958j0082P393N829j7141N456
153d448J8292j7381j0633K3999j309k1170J1739J1995j4681l61R664o795J87O233
167E331r459Q47J2749j0706q781J7077j39j7145Q790J0415j2857j485R823n454
181i94k502O620n401j700R814n763p880J2141J925j3610N503J0006r901l415R781
196D624k626n195N333p06l547M803j206n526N823K069q233K319O755o047k922
211d282O524j133m222L499L53k794K824n0l584L605K013n527J414N457m193k825
227b921N556k69m618K718K001l417O61J966k598L79K283k499q38L175j314k608
243b343K529Q40k774O71J769j339k47J191o60J43J017j103j15J738r00j321J858
$$ y = [-7262, -15742, 14141, 7271, -15476, 650, 9169, -6401, -1861, 4097, -5985, 1408, 7237, -9904, -4448, 13844, -3537, -14170, 9829, 8520, -12650, -911, 11084, -3597, -3958, 5706, -1089, -902, 5331, -4128, -3281, 9468, -1238, -10019, 7058, 6919, -10226, -1436, 8979, -3878, -5363, 4460, -994, -3496, 3124, -2277, -3977, 5837, 74, -7806, 4335, 6260, -7350, -1847, 8159, -1742, -5157, 4624, 1998, -3197, 2136, 1430, -2117, 2686, 1480, -4046, 1777, 3846, -4387, -2068, 4687, -1360, -4282, 2242, 1109, -3113, 386, 739, -2055, 769, 719, -2865, 740, 2753, -2774, -1360, 4097, -96, -2921, 2635, 2366, -2252, 466, 2467, -950, -289, 1677, -921, -542, 1741, -758, -1596, 1579, 265, -2343, 186, 1026, -1748, -1077, 692, -647, -894, 297, -363, -220, 797, -306, -421, 1317, 417, -904, 954]
260I54L66k062Q80J375j555j60J317q90q56J256m37j150R87L23j417L34J168r59
278e26o08J263n4q90N32M48l54o4L19J10rK7P9K69o6j57J60Q1l38Q7J11m16q2
301g8L40l38l15L86L3n72R9M43m47l83O17J41n91K46N18k30j82M57L09m57J27
322A23M17j94k48L62M1l55Q3K90l03k24K86j5m10q6L31k50m98L61K53n87J7N88
344a8k51m17N62J92n13K16O74n07j85Q30r6o43N93L89o92j1M87k52l57K95j57
365A39j44J59l67o5M33m60m02O44m2p04M81L83p58L43O55q84K36J124j025n02
385g56J859m53j689J623R76k093J98J845j288r49J547l99j063J145l27j171J425
402D30Mk041J259J417k269q7K259j194j122J728k72r62J465m83j183K183j21k674
$$ y = [954, 1320, -742, 138, 1513, -42, -202, 1115, 225, -631, 625, 188, -962, 25, 348, -1069, -735, 433, -526, -1134, 129, 75, -815, -283, 165, -189, -253, 66, 176, 167, 194, 273, 542, 476, 319, 479, 560, 222, 309, 420, 4, -78, 262, -76, -391, -5, 28, -544, -445, -2, -449, -832, -215, -74, -665, -419, 99, -131, -313, 144, 453, -4, 123, 540, 346, 98, 460, 501, 146, 229, 519, 216, -8, 278, 263, -147, -233, 98, -152, -650, -289, -36, -623, -606, -18, -269, -686, -124, 68, -445, -229, 445, -62, -247, 583, 487, -156, 437, 826, 134, 123, 610, 358, 1, 296, 139, -5, 154, -213, -278, 155, -305, -707, -63, -105, -809, -328, 55, -703, -360, 295, -589, -353, 771, -254, -756, 1103, 650, -1039, 584, 1560, -533, -335, 1510, 222, -727, 820, 421, -642, 503, 176, -995, 430, 434, -1607, -348, 1069, -1200, -1287, 972, -222, -1344, 384, 112, -850, 615, 132, -1051, 1132, 1011, -1663]
420a663K080K038l487j63L709j895k487K916L06k640J494P46k166J273R78k807
436a768R50K691l054j232M035q89l338K623J590k747N01J615j456O11R89k161
452a040R86K557l173j144M423j121m157L136K231m114J17L073k106p65K095j721
468g23n63K966k135k470M418K93n063K441M000m195j523M478q56k728K242J92
484G74j429J940p88k231L333P95m921J851M370m447k159N178r47l942K830R77
500A184k826J831N17l243K903K090n404J037N829m362l685O475K41n786K989K999
516B789l805N13K352k842R78K710m262j08N448l511m134N910P96o086K349L682
532B779m033k83K827k399J99K745l489o11N467k965m398N903J640o682K020N090
$$ y = [-1663, 417, 2455, -1032, -1195, 2514, 619, -1868, 1048, 1354, -1286, 208, 954, -1212, 61, 1039, -1768, -818, 1873, -1181, -2413, 1622, 733, -2605, 18, 1608, -1139, -638, 977, -479, 132, 1121, -1040, -54, 2503, -670, -1814, 2609, 1488, -2669, 467, 2698, -1416, -1299, 1774, -332, -1097, 998, -723, -1286, 1680, -455, -2925, 1493, 1786, -3277, -836, 3164, -1031, -2554, 1924, 1068, -1660, 582, 774, -655, 1285, 497, -1734, 1599, 2394, -2527, -676, 3694, -753, -2912, 2266, 1319, -2623, 207, 1184, -1642, 189, 706, -2537, 366, 2456, -2948, -1911, 3918, -444, -4129, 2346, 2587, -3199, -210, 2789, -1016, -503, 1849, -993, -15, 2695, -1567, -1675, 3773, 262, -3872, 2038, 2834, -3252, -903, 2779, -1254, -1537, 1290, -1109, -910, 1835, -1654, -2265, 3202, 237, -4161, 1742, 3382, -3300, -1280, 3810]
548C810m254j707M181j430j773K888j634j698L976j254m426M189K404n925N40
563b113N307l269k909L910l2k515J803j05j630K713l96l644L370K525n252K05
579b032N508k819l609M381Q15l749J519J548k459J124J207l117J320L138m042
594a267j364N170j437m540L576K281m195K32K923j811n46J802j576N4K541k371
610e28j467M186p61m100L151K358m132J05L410k056j288K449j274j129K539j416
626D7k289L537J35m276K334L065m025p26L972j462k336K556R3j853J799m7j881
643a357K133P39l042J343K597k901q83L155j021k187K005K51j701J207K06j757
659a213J484Q17k688Q17K440k430j228L113m84k435J791J096j957N46J162j263
$$ y = [3810, -444, -2151, 2030, 600, -1173, 1715, 81, -1617, 2359, 1105, -3321, 868, 3272, -2653, -2113, 3194, -75, -2984, 926, 894, -1621, 182, 77, -1553, 1160, 764, -2880, 490, 3015, -2237, -2032, 3476, 657, -2952, 1429, 2244, -1505, 14, 1562, -897, 227, 1434, -1683, -363, 2775, -1267, -2631, 2539, 1102, -3438, 138, 2419, -1776, -1544, 1379, -432, -978, 824, -752, -698, 1843, -528, -1995, 2191, 1430, -2670, 481, 2839, -1293, -1188, 2222, 166, -1122, 1327, 53, -1076, 1463, 47, -2242, 1295, 1430, -2846, -512, 2553, -1472, -2198, 1774, 312, -2024, 532, 625, -1228, 571, 524, -1357, 776, 1515, -1527, -184, 2413, -488, -1371, 1784, 763, -1424, 581, 832, -869, 338, 544, -1213, 271, 1088, -1600, -783, 1657, -773, -2001, 1112, 628, -1807, -16, 1080, -877, -331, 831, -432]
675d32L29J209j462j61J912j116j327J972K62k062P58J245j376j52Q63o39j62
692c39P12q94j76J329q73j029J621K21j797Q49J273j334k66J375m92p25J083k05
710C33p66J012Q2j148Q62O71j370o0J261o39r53R20J80q15K02K94l60J78R9n51
730e68L70M11p75J03P74m42m13Q39l4m70M54K46n91K83L63o99K91N64o80l24Q63
751E65k34q16N66L81p70j29O26l57l76M64q4k41K65M3k00K55J30k45J03K27j66
772GPJ64pJ0J60j34KJ62k48j08K64q1l82J66K21m18q9L78j77l13L03O1l80J65
796b67K34k80ML52q0j81K24J85j48M4K12p4r5O1N9r3l2O0j2Kj52L4P4k42j4Q1
822d4j10j87K75l1l55K58K31l19j04M98j23k94L11J61j96K8L06j54k6J64r2j3
$$ y = [-432, -103, 1106, -356, -517, 1395, 279, -1048, 924, 1186, -876, -118, 1127, -249, -401, 462, -177, -339, 373, -521, -697, 632, -241, -1270, 351, 572, -1225, -376, 897, -437, -703, 672, 180, -545, 538, 333, -433, 579, 661, -487, 375, 1046, -324, -384, 877, 238, -715, 205, 385, -430, -228, 66, -294, -116, -17, -568, -198, 213, -562, -459, 315, -127, -540, 299, 265, -205, 249, 495, -96, 187, 550, -149, 142, 706, 26, -298, 565, 331, -485, 81, 462, -308, -437, 189, -168, -544, -80, -164, -405, -140, -97, -297, -42, 88, -157, -54, 173, 7, 14, 178, 171, 181, 341, 207, 209, 371, 123, 15, 279, 198, -184, -18, 203, -215, -304, 74, -103, -416, -113, -52, -432, -267, -33, -313, -309, 43, -37, -218, 6, 191, 43, 87, 299, 225, 130, 191, 250, 157, 125, 185, 173, 175, 23, 57, 131, -111, -125, -44, -154, -341, -66, -97, -452, -194, 37, -282, -386, 112, -11, -305, 6, 167, -29, -1, 305, 151, 125, 289, 197, 184]
844A84J48j76j30J57m7k58J12J7j50K5O0j93J79m0k93K36K27n12M1O13k52m03
866d55O08J91o03L14L88m41P2L72l44j14M86k50m95O59r6o11K92L93n77JK82k40
888a68j28K04k59O1L47l82j02O87j78o63O66L77p61J77O84n14j31N88k94l38O12
909D85k06o02P08K10j095L23Q37r12k83Q95l39o63N18J78m28J95J59m66N05J97
929B16o51K43P79p27l27J075k16p93P18J93o85L47L39p22K93N82j050JJ156p57
949A4q97J225J07j329N68Q96j131m5R40o42k31R77n98m42J180l42j008J164L84
968G90j377N61R87j069j98J069o70l55Q72n89n85J178l22j351J254N46j754M27
986e86J487j263n97J527n31r14J171o8r88J051K72j263P76R19j432k0J505q15
$$ y = [184, 332, 156, 26, 183, 136, -122, -10, 7, -143, -118, -58, -251, -72, -112, -405, -169, 58, -454, -413, 200, -52, -455, 153, 344, -259, 55, 443, 2, 74, 446, 102, -12, 474, 224, -271, 388, 292, -319, -27, 366, -211, -210, 72, -168, -296, -92, -351, -290, 57, -325, -427, 260, 82, -581, 85, 462, -299, -122, 562, 48, -83, 505, 211, -127, 485, 279, -323, 385, 595, -500, -177, 660, -252, -535, 360, 21, -642, -124, 54, -374, -179, -20, -486, 19, 216, -435, -192, 587, -140, -467, 608, 392, -401, 317, 510, -175, 172, 511, -211, 82, 664, -386, -385, 771, 14, -883, 342, 449, -880, -312, 584, -547, -592, 348, -294, -525, 452, -146, -588, 592, 250, -758, 406, 790, -587, -26, 961, -108, -306, 763, 93, -262, 610, 21, -564, 614, 292, -1059, 195, 741, -1013, -586, 901, -362, -959, 568, 37, -877, 294, 226, -762, 289, 561, -702, 74, 993, -439, -459, 1046, 231]
1004B31q90J228%r77O62K06q58N32L09j126O12P94j359r1J482q76r67J423Q0j297
1024h82P63O05j006L83P36r83J69J129r96n02J404k37j358R98P98j443J25J058
1042G61p80l65P91m54m12P89l97p26J017l4j114P08Q29j219K4J145o31m96J024
1061D60l01o09Q90j09q68R10M94j395M28J203j293m31J439m62j073R71K18j084
1079f12N48M52r40L17O73j043K6J158q02o39J272j46r93Q46L55q53M41M44p63
1098b59K32O91q10o8J008o89p25J157j8j121O27N98j074Q0Q35p42j66P40m94m52
1118f50R05j38q38Q23L16r26K82Q06o93j03N95k40k76M73j21l18M74j07n25M66
1138B05K42p72K09N19o16j98P16k93m87N07Pn55L89L19o00K08N14n29n9O24k05
$$ y = [231, -659, 569, 569, -408, 254, 460, -398, 134, 443, -683, -71, 723, -636, -727, 755, -121, -1088, 335, 415, -882, -119, 486, -520, -137, 599, -384, -215, 914, -82, -584, 820, 583, -775, 223, 1021, -422, -297, 761, -19, -384, 407, -47, -459, 330, -67, -793, 224, 190, -924, -216, 613, -606, -582, 563, -68, -564, 460, 159, -450, 440, 331, -537, 373, 867, -528, -100, 1103, -190, -621, 818, 356, -717, 254, 472, -612, -64, 388, -552, -235, 438, -605, -579, 579, -223, -862, 410, 264, -729, 117, 472, -381, 60, 504, -259, -27, 664, -146, -214, 794, 105, -620, 537, 519, -602, 25, 623, -451, -371, 464, -278, -444, 296, -198, -650, 255, 117, -721, 102, 418, -508, -226, 580, -113, -216, 379, 139, -137, 336, 215, -103, 371, 264, -261, 205, 447, -325, -116, 403, -213, -411, 305, 12, -475, 32, 39, -516, -127, 192, -408, -200, 314, -215, -274, 350, 145]
1159A45n07O07J47n15J77L72m10J1L61l42r0L00k58j31L62j82l45L23M1l88J31
1180a91K65l91R0L01k74l6L54j47k66L94J64m86L01L07m06L2M27l38k22M54j04
1201B28l25K21N1k47L3J74k34k2J98j94j33J47pj36J71L0j48J58M9n5J04M1j45
1224d1Q0J68j83pK73j31k14K87J2l03J49J35k95K6J71j55j60J99m0j72L2O8l5
1247a36k2J04o2kJ11j4mO3jj3J16Kq4P7m4oO0l8o6NJ75k37n5J58j02j17J37jk13
1276b09LJ79j30q3J68N1r5M8Q1j3mJ14n5MJ47p8m8M6P0m9p6L0qJ0o8j19J03k9
1304a0j42J03N7j91LJ58j62m5J80n3j03J79L7j54J08J72j72M0K02j13o4J40K6
1327A96r0nO8q0m6J5m4M2J7j77K2J18k58M7J16J9k20J83k9j01J73M9j66J62K11
$$ y = [145, -362, 245, 392, -123, 54, 426, 16, 27, 388, 46, -44, 256, -2, -133, 229, 47, -298, 25, 66, -322, -191, 74, -317, -227, 74, -200, -236, 118, -29, -295, 99, 263, -223, 78, 385, -21, 11, 438, 100, -122, 332, 228, -97, 124, 175, -72, -39, 135, -99, -121, 77, -117, -250, -103, -110, -246, -75, -45, -193, -35, 14, -41, 63, 104, -41, 39, 207, 24, 17, 290, 159, -55, 232, 244, -59, 90, 225, -70, -44, 127, -28, -188, 11, -29, -201, -169, -101, -136, -158, -54, -116, -118, -7, -21, -25, 38, 37, 24, 140, 142, 58, 135, 91, 85, 145, 107, 41, 46, 221, -16, -71, 87, -15, -132, 5, 4, -209, -206, -27, -157, -240, -72, -21, -116, -68, 13, 0, -4, 110, 55, 59, 206, 128, 80, 126, 196, 147, 71, 101, 93, 103, 35, -84, 19, -10, -152, -49, 8, -183, -180, -22, -184, -229, -49, -102, -205, -26, 11, -143, -35, 137, -35, 5, 207, 94, 30, 170, 196, 106, 101, 169, 89, 43, 58, 14, 56, 73, -104, -82, 36, -222, -175, -59, -40, -260, -77, -106, -207, -34, 15, -151, 11, 222]
1352B22k92O4K61j53k15L11R5k51j2K49k03o1J91j56p5J32j77q3K03p1k29J19
1374a31P3j89RK40j18J5P8n6N2J62j32o7L44j12l28L28J99m10j6M03k60j65K41
1397A60l9j87J12l3k15K49Ll69O3L81l04k07M83n5l36K40J29j77Q0J04j85K56
1419A53M0l45K38L48l96k36O22j91m24K85J33l24O9J20k70Q5K12l77j5N42l72
1440a03l41N52R6o00J88M79m34k1K97q2LJ61k49J12L09k44k59M14O3n20J38L87
1462C46l79j41L21r0j71J31j52j68M25j98m04N11J76o51J76N60l25k85M16J71
1482B69l86J51J56j42J62j9k80K24K92m95j18N58j94m49K99J77m01J8K10j87N7
1503i8Q3k77J39L73m13j84O37j75n06M41L51n60O2M82k35j96L22j80q3L16j93
$$ y = [222, -70, -6, 255, 102, -113, 198, 293, 42, 30, 279, 76, 15, 206, 50, -25, 107, -70, -153, 50, -21, -250, -131, -58, -247, -238, 2, -116, -101, -23, -79, -27, 135, 3, -64, 280, 168, -160, 168, 367, -43, -59, 344, 84, -81, 160, 121, -66, 46, 13, -202, 47, 50, -319, -256, 125, -179, -386, 97, 42, -294, -54, 75, -102, -22, 82, -103, 153, 193, -152, 86, 434, 38, -198, 424, 233, -191, 94, 227, -97, -28, 92, -178, -93, 119, -258, -273, 269, -103, -444, 108, 204, -396, -208, 271, -163, -184, 113, 31, 34, 195, -54, 58, 367, 123, -136, 278, 341, -179, -41, 346, -33, -174, 147, 57, -114, 17, -135, -303, 122, -76, -480, 31, 207, -444, -268, 292, -33, -318, 98, 269, -117, 34, 190, 48, 210, 191, -89, 135, 427, -68, -186, 372, 178, -271, 28, 205, -196, -178, 32, -155, -98, -15, -292, -153, 220, -193, -377, 260, 85, -421, 20, 371, -189, -127, 355, 120, -76, 246, 66, -17, 299, 106]
1524A06l45M76N3o03K06M43m86j84M54j10l12J73M0j09K21j37j41L52J15m91K31
1545d8M14m83j39M96j3l69L15K0k62K33M4l83L09J37m91O2M71l75l67N33K9m99
1567c66K26J62k27M6J73j77J18J76k47k4M54k45k26L94Ll86J99K77l03j5J96j82
1589B6L8O8j96%K62k17l23L93Q3m09O3L01k58j11K89l1j19J28P1k30J66J08j74
1612g2Q2J87j79m9K60o0j97J72Q3k27O1L0j45J12K3k25O4J76k77j9K28n8j84K08
1636fK7k11J23J59k09R3J60j12p5J98n0k08K78Nk15J25J21j80p5J91j25o9R0o9
1660c4n1M4j3j22P2P8k01J26L2q6J8J89j15m2K27o1j32J43R8j90J22R1j41j4J16
1685A54o9j47J66r1o9Q3K6j64k5R9r5j3J06p1o3R6J6q1J49j01O2R5J3r0P7M6j08
$$ y = [106, -239, 237, 290, -313, -107, 336, -150, -334, 120, 10, -302, -129, -89, -198, 23, -114, -255, 97, 212, -279, -48, 366, -117, -256, 240, 227, -142, 173, 193, -69, 164, 208, -175, 134, 271, -220, -158, 313, -62, -429, 104, 133, -366, -140, 22, -205, -159, 14, -163, -45, 131, -116, -140, 314, 69, -157, 237, 240, -146, 53, 330, 27, 12, 208, 26, 64, 132, -64, -64, 198, -19, -342, 51, 134, -275, -212, 89, -169, -280, 9, -22, -141, -13, 58, -172, -6, 102, -72, 10, 197, 18, -31, 229, 169, -28, 144, 227, 0, 61, 91, -54, 58, 81, -144, -80, 96, -181, -200, 28, -30, -214, -6, 21, -190, -67, 92, -117, -24, 136, 24, -51, 147, 97, -111, 167, 172, -43, 82, 203, 23, -52, 139, 14, -55, 35, -34, -85, -41, -54, -176, -104, -26, -227, -101, -69, -155, -137, 52, -63, -105, 122, 61, -71, 72, 170, -20, 102, 193, 52, 38, 154, 85, -62, 104, 13, -56, 27, 53, -111, -136, -37, -132, -145, -39, -110, -173, -77, -61, -142, 7, -94, -32, 63, 76, -14, 63, 109, 1]
1712AN7J38q8p4J72j15o4J3K3j30K7Q8j30j22J82q3p1J30k6j15J16N4r9M1P7L
1738El9Q2ko7P9M9m1RR3j15L8qol7pp0K6M5p4o7J02n4j08O8Nl4JQ3m9n9J47m2
1770d7n1J50k8lL8J8l9J4Q6r6L2M1o9l6J1pp3J07p5n5N2Pq8QN3r9K1J61j18OJ01
1801B2m5j13J24J14j02Q7L2j19J6J75p5o1R3q3n7P8L6j68K1O0j11k2L0m7j1J04
1827b2j10PJ38l6q9O7J19j46P1J10j30N9J02n5j4J09p5r8J91n9k08J19J12k70
1851a08J2J51j04j28J23o7l2O5j0p4J75l4j38J10J79k30mK05pj39J58K4j09J32
1875A50k3j38J46O8k96Q5K17l00j86M18o0k73J45J19k64J32R0k25J16J34k55N7
1897a43K89j61j93L43J8l16J81J37j13pJ16j28P5O6k97P7L07l32j69L93jm20J80
$$ y = [1, 58, 196, 108, 34, 206, 91, 27, 40, 63, -67, -40, 48, -82, -204, -22, -105, -176, -46, -72, -187, -71, -17, -116, -75, 2, 5, -34, 48, 46, -21, 58, 107, 66, 75, 168, 53, 91, 83, 77, 40, 33, -37, -11, 34, -40, -107, -5, -59, -167, -99, -94, -128, -127, -44, -93, -152, -5, -47, -98, 52, 24, 21, 59, 77, 38, 52, 138, 42, 74, 115, 46, 10, 21, 14, -59, 48, -27, -82, -30, -23, -111, -103, -50, -149, -128, 33, -85, -79, 22, -23, -136, -12, 102, 0, 87, 119, 0, 16, 191, 116, 55, 148, 65, 8, 86, 122, -46, -25, 35, -76, -98, -68, -115, -126, -22, -132, -125, 13, -23, -112, -45, 74, -72, -1, 109, -21, 38, 140, 85, 71, 180, 105, 7, 198, 139, -69, 50, 162, -108, -96, 55, -49, -177, -54, -121, -153, -88, -98, -172, 3, -31, -169, -59, 120, -110, -114, 91, 84, -55, 103, 127, 18, 150, 127, -11, 135, 203, -93, -8, 209, -91, -277, 141, 81, -192, -47, 72, -192, -60, 30, -195, -79, 55, -200, -143, 146, -15, -208, 135, 153, -163, 18, 155, 42, 35, 151, 23, 98, 164, -133, -56, 251, -81, -250, 143, 142, -278, -98]
1920i8K79l42o2L08k05jJ69j28p0K98j52k59L57J67m70J44L85k70j80L44m9k03
1942c8J71r9l5J90j51k92L52P7m70J09L63k85k08L62Rl03K01J6o9O5R1k38K38
1965E6K17m42N0M99k10m28L75J81l81P1K36j86k8Q7j93P9J97l64j06M79j84m39
1987d34L87K33m34L3L15j49j01K26j57K4K70k75p9M93j98m34L73L32m95p0M80
2008C40k32k40K54n8k32K38j13k01L78o9m50L06K91m24p2M56j21k65K45jj62K05
2030G3p8j18L11rl56K83K52m28j02M26j23l23K54J31k98J09J07k75J19J58l47
2051b34P7L53l37j72M53m8l41J80K98k58k1J77j00k6J43j88KL36k36k13L39K4
2073B08l78J48K50k67j05K51k09m4J52j25p6K48o3k70K62J48l87J50L10k60j11
$$ y = [-98, 181, -161, -223, 85, -120, -121, 48, -80, -150, 148, -4, -263, 94, 261, -209, -65, 320, 50, -130, 214, 165, -38, 133, 34, -1, 189, 38, -254, 98, 175, -295, -186, 177, -108, -316, 46, 55, -248, -47, -31, -100, -35, 56, -182, 56, 273, -169, -119, 380, 170, -258, 117, 298, -83, -12, 224, 38, 10, 97, -96, -17, 180, -184, -290, 189, 5, -434, -47, 186, -248, -215, 100, -49, -150, 76, -81, -57, 213, -62, -141, 352, 154, -280, 93, 425, -70, -140, 340, 108, -132, 122, 64, -168, 70, -43, -244, 134, 65, -385, -79, 212, -212, -284, 172, 51, -214, 31, 30, -132, 73, -5, -123, 188, 179, -177, 106, 358, -70, -172, 254, 131, -192, 62, 193, -105, 4, 111, -164, -45, 113, -234, -157, 196, -141, -313, 140, 92, -249, -69, 229, -29, -50, 127, 27, 1, 144, -44, -42, 294, 58, -155, 184, 208, -170, -22, 228, -39, -144, 107, -102, -146, 6, -119, -195, 53, -10, -280, -18, 130, -257, -107, 203, -57, -168]
2094a68L59p2j89K29Pj72J08M1j55M4J55k46lK24j58j71K19Pj92R6L0j90J50M1
2118fk00J17J68k31M2K34j15k20K71O3k14J10J07j20Q5M4j83P8J67j58r3K23p7
2141I2k32J97J1k14Q6J08j08j14J27l0m0J47n6m8P7O2k76K43J23j82kJ50k5j11
2165a5J43m3j18J18j8n8M7L9j66Q0N6j85j6J47%j34J29n0l4N5Lp2O1Q6j02L6J01
2192I0p7m8J32p3n5J66j1r0K5N9j27KK2l5m7J01l0j66J67j8q0j8O7m9pO5Lk7P
2221e2L4k2P3L3o1P7N0q4rP7l7l7lk4J6N0j36QN6p1n4P8M1j21m7R2j6p6J75n6
2251d6l4N9M5k7L7KnlQ6o0k0M1K1m9K7j4p5K8L9r7pM8p1K0l9J9p3R9jk0M9l0j09
2284a60M8J53j30N5R4Lm1P1Lj16O9Mr9J02k2k2j7MkJ2j3l8k8L2jj04N9MNk3Q0
$$ y = [-168, 191, 119, -70, 159, 166, -6, 102, 143, -12, 32, 187, -59, -62, 162, 4, -167, 52, 59, -133, -37, -7, -197, -47, -6, -206, -89, 79, -152, -110, 124, 9, -211, 60, 123, -91, 19, 126, 6, 91, 135, -48, 30, 197, 39, -54, 169, 92, -140, 57, 68, -146, -60, 48, -60, -174, -47, -77, -117, 30, -26, -74, 3, 65, -211, 32, 155, -27, -29, 121, 96, -15, 128, 85, -33, 85, 67, 9, 56, 95, -71, 9, 65, -120, -136, 11, 11, -123, 6, -44, -78, -23, -20, -92, -31, 55, -47, -11, 90, 13, -35, 97, 24, -31, 135, 124, 34, 59, 118, -9, -7, 15, -20, -67, 34, 4, -162, 5, -13, -93, -111, -44, -93, -100, -35, -32, -59, -52, -18, -40, 33, 66, 5, 82, 132, 48, 39, 116, 79, 42, 39, 15, 31, 81, -55, -47, 9, -62, -116, -38, 3, -118, -165, -73, -89, -165, 10, -46, -80, -21, 24, -3, 34, 36, 31, 28, 114, 54, 34, 75, 96, 47, 74, 60, -15, 13, 52, -45, -52, -4, -75, -55, -94, -75, -148, -49, -50, -70, -21, -51, -160, -112, 41, -89, -34, 60, 63, 22, 93, 96, -20, 49, 53, -46, 56, 34, 12, -5, -1, -3, 9, -4, -42, -70, -38, -39, -143, -84, -80, -75, -98, -18]
2315a8j8JN3q4N1P2p8kJ30m8j08J39L8j48J1J06j28O4K2o0o3M8K1j23J24L6j28
2342i0K9K6r7M7P9m1o1J13J0l2J01n1n2J23K9j69J05R1j00p1J42r0n3R9q7m8J00
2369E2m7j95R4J47k16L0J53j02n2J87j05l9P9L8j30J61L5j31J24N3j43n1K45j52
2393C5j01J69qj47J23J4j65M1N3j23P7R2j45q3J67l8j15J61J0j78P9J60q6k3J53
2418A22j05l3J16l2j18J88n5j56J34M9j82Q8R5j14j16K15j00j12J57n4j40J52
2440an5q4J48J25k63J4K40j69r2K21Kj48J06K9p0J42J3k27P0J55j54j33K88j70
2464a3p3J47l8j49R0O3j11L1N0j58R7K26k92J3K37j22k30K80P0j66R0M3q9R5K5
2489A16j49K0K13j91j40K46k6k70J67J10k49J08Q7j04q2J24m7p3J14k6p2J62Q
$$ y = [-18, -36, -35, 18, -66, -15, 57, -21, -23, 107, 59, -49, 90, 128, -20, -9, 97, -31, 33, 55, -5, -68, -20, 1, -122, 2, 38, -90, -61, -35, -132, -85, -6, -47, -108, 5, 15, -17, 84, 33, -19, 104, 133, -36, 69, 160, 60, -11, 131, 41, -12, 87, 0, -48, 52, 5, -190, -96, 51, -165, -135, 18, -84, -136, 51, -54, -93, -14, 24, -106, 55, 90, -41, 83, 136, -7, -58, 187, 35, -66, 103, 95, -52, 71, 85, -80, -39, 14, -109, -32, 60, -85, -168, -1, -39, -154, 7, 17, -161, -82, 78, -8, -31, 122, 17, -16, 100, 68, -50, 138, 83, -73, 61, 110, -72, 16, 111, -3, -119, 96, -4, -116, 41, -13, -153, -1, -56, -140, 8, 133, -130, -116, 124, -45, -137, 84, 86, -62, 44, 73, 3, 145, 158, -69, 1, 156, 2, -131, 157, -13, -86, 61, 23, -126, -36, 27, -84, -53, -3, -161, -64, 162, -130, -117, 120, -2, -232, 48, 118, -48, 42, 85, -4, 91, 116, -33, -13, 200, 9, -131, 115, 89, -181, -14, 96, -153, -45, 42, -62, -144, -20, -67, -140, -26, -52, -124, 38, 46]
2512D6j69J30J92k10l9K11r6j11J67p0q4J66o3p8R1j1k31R8K28k76r0K27m7j16
2536a35P5M5j33J16P7j70J22N2j47M4J49p4o1J39%j27R1Q6j32J06k0m5n9R9j61
2561f3L5J23j42o4J51Kk47J74J06j56L8O3r2k0J33n5o3J03j9p0J11N6j52L8J56
2586A46j23k5P9Qj68J28n6n4P3k7m2N5Lj48J10O5j10k2R5J1q3J17%p0R6k3o0J19
2614I4N0j12l9R1q1l3J10Kj43R2j0r0L9J3l7J1N4r5oL7K4j02R0J5n3RM5%MJ19
2644I8j49J36pj3l1M9l9n7P6Jp4O8l9l0lL1q3K5N6n2j00R6N6r4j1R0p1o8J29r
2674a9K7L9Op4M8J8k8l3L1Jl8J5J3jO6l9n1N2j3k3k1K9j16R4j1l5k0R5n1L2L6
2705B9m2Mj3Q0j00Q1K1Mm2M7j02P9J6l3l1J6k8qqK2n0L9Lm4N3L3p3p1P6K3k2Q0
$$ y = [46, -123, 7, 199, -11, -50, 161, 65, -46, 121, 51, -33, 133, 70, -8, 83, 72, -159, -61, 167, -109, -199, 28, -19, -135, -60, -15, -148, -32, 45, -125, -3, 49, -98, -54, 95, 21, -40, 99, 99, -28, 63, 149, 17, 123, 103, 58, -1, 98, -63, -28, 95, -47, -111, 40, 42, -205, -31, 75, -81, -43, 20, -72, -92, 41, -14, -77, 26, 7, -63, 48, 104, -48, -10, 146, 23, -2, 77, 85, -83, 45, -11, -65, 8, -19, -61, -6, -3, -151, -41, 24, -86, -108, -13, -2, -85, 32, 32, -38, 58, 35, -25, 94, 144, 32, -7, 84, 3, -30, 80, 82, -61, 31, 21, -69, -30, -17, -54, -43, 11, -84, -90, -53, -29, -131, -41, -26, -79, -70, -25, -25, -21, 98, -51, 85, 78, 65, 34, 83, 44, -13, 63, 64, -10, 58, 19, -11, -14, 17, -66, -41, 15, -37, -137, -41, 15, -79, -90, 0, -71, -139, -10, -19, 8, 47, 53, -21, 27, 45, 17, -16, 15, 16, -22, -7, 6, 5, 71, 32, -19, 33, 20, -3, -24, 5, -111, -17, -28, -63, -83, 12, -39, -7, 29, -13, -9, -22, 58, -42, 39, 60, 64, 22, 69, -33, 46, 62, 29, -2, 14, -14, -22, -30, -8, -58, -19, -16, -60, -7, 26, -47, -118, -42, -19, -41, 39]
2737C9p7nR4Jp6J4O5k5m1K4O1K9n4m0N3j11M7L8k0p8M4p1L2jo7O3l0Q4Rk8l8k1
2769h6P4nL8O7p9m5J00j1j6L1o8J3O4Pp5Kl8N9n1L7Ml6l6M6m8L4j3j9l8M2mN1
2801Am7LJ4P5o2j1J07J4q1J7J7MJ3pmn5Qm6J6K2J6l7j1jl3K5k3N5k9K2OK0j5m1
2835d8N3j8K0m1O8J2m6J9Q2q4L7n5Ol3J00l5m4Lnjl0O0m2K1m3K6rJpM8j3rOL0
2869B9j1k5l7J05kk7L1o4J6J3l3J2NqK7nop6K0ml6NM9om8J2K1K0K9k4L1j05J44
2902E2k0l5P9mk6K6K2m8prj4M5q3J3L4j3q6NN1r3N7N4m4k3J2l8LJ54p8k1L5M3
2934D3o7l7R6Ol1Q2j4p0L6K7k2k0m2J5k5K7n8M2%p3M1M3l5o5J35q8nJ14n4o0L4
2965b5K8l4M7N8p9lO0K5m8Kl0j9L2j1L6q2K9QN3p7j12J12K8o1M8k6K2l3L6jO7
$$ y = [39, -38, -43, 51, 52, -24, -10, 55, 30, -11, 13, 74, 103, 49, 9, 62, -49, -2, 36, 16, -62, -18, -89, -57, -58, -125, -62, -92, -8, 1, -27, -65, -86, -12, -17, 21, 88, 9, -36, 64, 53, 37, 68, 0, 13, 77, 84, 9, 11, -27, 32, -19, 18, 22, -14, -50, -4, -52, -18, -31, -50, -88, -46, -50, 1, -46, -43, -29, 46, -16, -27, 80, 94, 13, 30, 47, 51, 64, 57, 53, -2, 6, -40, -24, -2, 14, -23, -34, -35, -68, -43, -66, -11, -40, -18, -12, 8, -7, -48, 5, -13, 7, -34, 34, 46, 0, 19, 101, 17, 54, -1, 5, -28, 72, 37, -7, -4, -9, -10, -40, 20, -22, -1, -44, -18, -27, -26, -33, 15, 2, -7, -1, 29, 18, -7, -44, 61, 59, 32, 63, -1, 15, 28, -5, 7, 12, 4, 31, 26, 20, -56, -36, -40, -76, -71, -22, -28, -76, -64, -43, -23, 6, -18, 13, -92, 52, 32, -3, 76, 72, 46, 72, 94, 46, 39, 30, 16, 61, -22, -9, 25, 12, -74, -69, -18, -111, -54, 0, -44, -67, -55, -93, -90, 64, -14, -35, 0, 43, -24, -61, 35, 41, 10, 92, 78, 8, 44, 71, 49, 29, -13, 2, -23, 4, -54, -12, -12, -85, -44, -1, -36, -101, 34, -54, -59, 55, 1, -59, -25, 3, -31, 16, 74, -5, -8, 52, 77, 29, 31, 1, -18, 14, 3, 39, -43, -14, -6, 47, -30, -142, -30, -2, -63, -15, -41, -19, -52, -16, -17, 50]
2996E0n5K2n1M5R5p4k0L6L7q1l3Q6n8kM5j1k2k5J0kn3L4P1j03K0J8mj3jL9Jm4
3028d3N3k5qNPL6j5M6k0J8K7n4m1P6j4m7k0M1J2o5k5J9m6L5M4p2M1K2j7l4J07
3059D3j6l6M1n5P1ml7rL5M6m0k2N6l5k9L5l5N7m7Qp9N3L2o0p2R4l6m8Q4Mk7k2
3091e0O9r5P9J5MpL3j1Ll5L9k4QM1p6M1l5QK5J5o0kK0k7l4J00m6m5O9n8m0L6K5
3124a5LPL9n7j1O9n5O9l1j8k7K9oM5l4k5L4k3m0N1n1m3R3n1J5K5m5jL3J6q4J28
3156C9j04O0J9j8LK1M4n2k6J24q4M6m5oj11J36l2m8J9M7m7J2N0r0O8j07N2m7O1
3185a6Ml1J21j37K3Q5k7K7nm0Ok1O9o4N2L1m0m4K1N1p4lP6k7p6Qkp7J22j0l8N
3217c1Rn4L6lJP1ll1K0K2m4P3m7K1k9N7l0j6J4K5l7j8orl1Q0o2m7Q4q0JL2J0k2
$$ y = [50, -5, 17, -34, 11, 106, 32, 12, 48, 85, 4, -29, 57, -1, -3, 42, 31, 9, -16, -6, -8, -61, -27, 44, -59, -39, -21, -25, -38, -39, 0, 1, -43, 10, -15, -23, -18, -11, 25, 10, 56, 36, 54, 81, 27, -14, 62, 48, 1, -19, 22, 34, -31, -56, -37, -83, -48, -4, -76, -35, -13, -30, -64, 43, 27, -9, 32, -23, 48, 44, 7, -2, 33, 79, 39, 17, 73, 38, 9, 44, 9, 66, 19, 27, -52, 1, 33, -27, -99, -5, -41, -89, -5, -1, -28, -50, 19, -76, 3, 18, 22, 15, 48, 37, 40, 5, 44, 20, 28, 69, -7, 34, -1, 7, 32, 47, -13, -15, 5, -22, -56, 44, -2, -47, 22, -36, -76, -40, -15, -12, -5, 34, -23, -34, 35, -20, 49, 18, 0, -27, 2, -4, 41, 7, -18, 16, -7, -47, 4, -47, -90, 3, -48, -33, -8, -53, -54, -21, -5, -89, 39, -65, -5, 14, -4, -1, 20, 64, 12, -14, 110, 26, 72, 27, 21, -90, 46, 14, -34, -15, 32, -15, -3, 47, -43, 25, -82, -30, -77, -16, -12, -43, 78, -59, -36, 49, 22, 49, 44, 4, 10, -11, 58, -6, 46, 77, 37, -7, 14, 65, -9, -12, 64, 37, -39, -31, -33, -110, 12, 2, -36, -31, -22, -76, -40, -43, -42, 29, 26, -5, 15, 37, -7, 66, 19, 40, 11, 68, 38, 22, 36, 61, 24, 6, 0, -9, -40, 40, -22, -69, 15, -65, -64, -32, -22, -44]
3251d4nO4n5L8J9rj5L6j3l0K7O3q7J2R8n6o0O9k8k0N3j07K4K5mk1n2R8n9K3mk6
3283d6%P0K1o6O6m1n3J25k6m9K1P7n4Npl3j6J5M3o9K7l0QK9Lm3L1Kn8l8J3K7j7
3316f3M7n9L0J16n3Kp8J44o3kN1j1n7N8lr1P6%l5j4L7o6K3Qo6J9N7l5JOM5q7J4
3349d9R0m9kN2j03L2R6q5Q2Q9j07j19J28O7j48j1R9n1j9M8j31M7O5k6q2J64j12
3376c5j1J01K5j70M4M7k8J7N5o4QM8q8O4J02l0j29Q2K0j53J29L4r8mN1l1m0P8
3404B4q6l1R0Lj05P5R0j48k2J49J2j07P0N3n7j2J14j17P0m2l5N6L6n7l6J02k9
3431F0j48Q7J6K5p3nNm1M8j06O4J26r4q4J71Kj58J37N6j06j0J03Lj21P7J1J4L1
3459I0k1n4N5l0r1P1O0q4m0Q4n9q3J30p2k3M9j4l3P0K1j29Q1J01r8j2M8K0l%N
$$ y = [-44, -49, 15, -40, -2, 17, 8, -7, 29, 16, -14, 13, 76, -11, 1, 99, 43, -17, 52, 24, 4, 57, -50, -26, -1, -5, -26, -78, 20, -39, -16, -20, -46, -46, 24, 45, -21, 45, 4, -49, 76, 50, 1, 22, 99, 45, 50, 43, 10, -6, 9, 52, -17, 10, -20, -12, 17, 20, -23, 8, 10, -48, -86, -73, -46, -63, -16, -75, -45, 71, 18, 20, -58, 86, 23, 21, 72, 61, 4, 62, 59, -32, 44, 44, 9, -5, 32, -34, -11, -3, -69, -50, 7, -28, -27, -21, 24, -63, -49, 41, -8, -10, 42, -61, -29, 67, -18, 64, 153, 46, -73, 55, 122, -26, -37, 62, 11, -8, 40, -91, -44, 21, -5, -87, 77, -35, -46, 55, 80, -90, -46, 1, -27, -10, 45, -19, -11, 37, -51, 13, 115, 85, -44, 38, 58, -95, 34, 68, -30, -34, 17, -14, -54, 24, -62, -93, -3, 0, -105, -30, 60, -88, -110, 39, 51, -56, 14, 67, 10, -2, 112, -5, 65, 23, -12, 44, 80, 23, -13, 89, 60, -88, -1, 15, 40, -33, -38, -33, -74, -26, -132, -68, 58, -36, -120, 51, 53, -105, 32, 88, -18, -28, 75, 78, -43, 34, 45, 59, 90, 69, 15, 70, 40, -51, 20, 80, -4, -44, 40, -19, -102, 28, -44, -67, -18, -32, -65, 5, 26, -103, -22, 79, -19, -31, 17, 37, 34, 34, 39]
3489C9j7LJ5o5M5Q2j19k5J15r8q8R7L3j23Q9M4q9Q6Lq0pR7q1rO2or3J28Qq0N6
3520B2P6j72O8O7l8p1Q9o3n7J50n6q4J10p9n6L2O5m8j7O1nPjm0M6O9o7m5Q9J2
3550F4j11J9J12n4q1J21m3j9Q1o5j05J36o1n4k3J05n4J4L7n0r5J39l2n7M2N1o1
3577d4K7kK1qL2N4j47J62m1j08R3o3l3J20K7j17JR1q0QO5m7j05J18Jq7N2L0o2
3606d2j2P8n7M0J3j8N2L3j6q0J6Nl6N5K3q8N3K1j0j2K7o4k1j4K1J5L8Nn5J5N3
3637C8q3k6J41m6n7J7L3o0O6Q4j04mN7k8m5N6%oq8Q1o6J1J14j05j3K8p5Q3K9m3
3667a1K4J4p4mQ9n0J0L0L6o9J1L3J4o1J01r3l4J11J6j17Q8n0k5nM5j8n2P4q8M8
3697gM3j9o7L3J7n0j9Q8o4L3Q5q3K1M4%p5O9Nj01J26K4j52P5O7r3nM5m0r6J02
$$ y = [39, 22, 25, 40, -25, 20, 102, -17, -42, 73, -25, -113, -16, 17, -106, -17, 27, -62, 24, 27, -53, -60, 37, -44, -53, 9, 3, -90, 38, 46, -34, 22, 98, -74, -6, 61, 23, -48, 41, -22, -79, 71, 15, -69, 41, -38, -94, -62, 3, -45, -62, -1, -6, 1, 0, -40, 6, 75, 8, -37, 52, 64, -47, -28, 84, 30, -51, 70, 27, 8, 89, 24, -81, 55, -6, -60, -83, 22, -32, -18, 19, -31, -126, 13, -19, -76, -34, 17, -44, -17, -19, 2, -6, 26, 80, -67, 95, 54, -54, 39, -24, -57, 63, 90, -27, -26, 65, -15, -7, 58, 11, -94, 24, 25, -62, -10, 20, -42, -54, 24, -33, 7, 20, 2, 54, 87, 71, -9, 7, 12, -24, 31, 54, -34, 19, 40, 30, 18, 45, -19, -40, -54, -33, -18, 20, 25, -30, -15, 38, -45, -71, 70, 24, -33, -16, 17, -43, 23, 107, 3, -1, 56, 28, -17, 39, 39, 33, -55, 26, -40, -29, 85, -20, -33, -5, -80, 3, 32, -11, 13, 27, -47, -51, 38, -12, -2, 28, 64, -5, 6, 39, 53, -8, 93, 0, -34, 77, 93, -24, 64, 14, -11, -16, 29, 11, -41, 33, -55, -7, 36, 17, -50, -17, 0, -50, -69, 19, -45, -12, 73, -10, 11, 55, 55, -20, 49, 54, -47, 79, 103, -49, 26, 93, 0, -5, 40, 0, -96, 6]
3727Fl2n4M9Q7j15lJ01l2o5P5l8rJ9L2n0P4Rj03N8O2j20J44k3o6k6O7r0J9P3j0
3757C9p7j7P9n6O3jl8l0Q6j10k1J20j6o8J8P8o7j4J19r8l5N6P5r3M1l4l3O9J4
3786D9j05Q1j1j33P6L4k9mP0r9L4Q4j04j6J17J1j28K2J43j17oN6k9j5Q9kq1J0
3814cN4j10N3P1j23L8N5l2l9P3p5OQ9j21rJ02k8p2J39K3j41L6O4p5K4N6n0J0M7
3843F2K1j38J03l8l1L4O0p0l1N0l5J0RK1j04M3O8o6k2j8m2J10K1r4L4O0l8l6Q6
3872B9J2n7K8N6j16Q5Kr6J0J39j55J5J39o0j40J06L7j36J20mm5m3L1L9j9P4q9
3899c8J2N5k6l0J3K4lk4J33r8m5M1J7n4M7m7qO6j8j07O2J14j06l9Q2l7q2J30n
3928B9o5J6L9n0M3J7o7O4J5m8KR5p3p2R4N5j06K8M4j33N4P4j60O9J07j37k2J08
$$ y = [6, -26, -80, -31, 56, -59, -62, 39, 7, -58, 17, -21, -30, -11, 21, -29, 45, 54, -49, 9, 71, -49, 95, 72, 6, -20, 47, -43, -24, 49, 39, -38, -55, 24, -32, 31, 30, -8, -38, 48, -62, -83, 37, 21, -47, -29, 49, -18, -32, 87, -11, -46, 10, 85, -8, 33, -1, -34, 35, 49, -56, 25, 14, -119, -43, -9, -38, -42, 28, -71, -37, 47, -57, -73, 44, 55, -73, -51, 92, -25, -31, 25, -4, -19, 70, 68, -13, -3, 51, -59, -6, 65, -58, -20, 35, 3, -36, 37, -38, -32, 57, -64, -73, 29, 1, -71, 68, 91, -50, -14, 50, -25, -1, 55, 5, 15, 62, 83, -55, 48, 10, -21, 13, 73, 3, -28, 22, -13, -3, 6, 27, -77, -34, 34, -32, -54, -72, -114, -4, 17, -77, -43, 17, -21, -57, 29, 41, -16, 12, 68, -48, 37, 39, -57, -47, 92, -63, -48, 91, 31, -109, -3, 34, -102, 18, 14, -31, -74, -43, -4, -23, 51, -38, -26, 29, 3, -27, -14, 10, 7, -17, 116, 18, -27, 14, 31, -23, 24, -23, -31, 35, 17, -90, -28, 86, -20, -59, 23, -14, -96, 34, 29, -36, -20, 19, -31, 12, 29, -38, 26, 41, -7, -5, 90, 17, -55, 39, 94, -12, 16, 60, -73, -19, 55, -105, -36, 71, -66, -88, 20]
3956B0j1j27J30N8j33OR1q5J2P1km2R4m9n8N0K1p0O2M5o2o1R3q4MN8l0k9N0n3
3986c1m8J31l9l3mN5r1L0P7o0n2R6k6q4J45lj38R8K7j3k8J7k1n7R8J4q2K0L0j04
4016g6K9O7n2m7O9n1L0K4l7J5K6N9r0N5Rm1N4n8j8j5J53j07QM3k0r3R5J6j09P4
4046A2N0p8q4J65l1n0L7kr1L3O6p8K9P7n5K1J0mk3J7%n2J8Nm1O1Pm5kP3q6N3L1
4079D3l8n4O7Jo4J8N6j06N3K2L8l1J1j8q9J11m4j0N9M0m1j7K4l2M3k9j9L3nn0
4109b8k2J05k0j10N7M6p7OK0j2k0M7l4L3j4M4q4J34o7n1Q7J7p1K7L7k5k7L4l0
4138BRj8O5mj22O3K2m3L2J0p8M8m0L2M4K6q1j7O9m8pR2j30J06m0L9qm9N4o5N1
4169A4L8j24N1R0j08K9L0J7J2j7k8n3M4K9n2K4J9q4P3L6pl6O6r3N9O3p2M3o9r
$$ y = [20, 9, -118, 12, 70, -63, -57, 34, -51, -39, 32, 30, -12, 82, 33, -25, 25, 46, -24, 38, 83, 21, -40, 53, -31, -27, 31, 1, -28, 22, -31, -79, 52, 13, -20, -24, 31, -60, -30, 47, -13, -65, 31, 5, -79, 66, 63, -75, 23, 50, 37, 9, 26, 5, -52, 46, 60, -22, -2, 28, -76, -47, 20, -32, -79, -10, -61, -31, -7, -44, -29, -3, 56, -34, 21, 30, -11, 43, -15, -33, -48, 105, -2, 6, 49, 29, -64, 31, 47, -62, 12, 62, -16, -100, 65, 34, -16, 21, 19, -72, -39, 27, -51, -22, 55, 0, 21, 31, 27, 4, 21, 21, -31, -13, -8, -49, 12, 19, -26, -28, 45, -41, 12, 43, 5, -49, 18, 19, -45, -27, 29, -77, -24, -2, 36, 5, 16, -2, -91, 20, -24, -34, 25, 65, 24, 7, 31, -1, 42, 13, -6, 27, 22, -28, -50, 55, 35, -75, -18, 28, -49, -43, -23, -35, -55, -8, -42, -9, -23, 21, -63, 71, 4, -47, 40, 57, -14, 13, 50, 25, -2, 32, 2, 11, -7, 58, 54, -68, -5, 17, -26, 6, 16, -62, -14, -54, -22, 22, 48, -33, -50, 19, -29, -36, 56, -74, 32, -8, 31, 23, -26, 28, -37, 14, 52, -72, -21, 69, -39, -10, 20, 37, 49, 32, 4, -49, -5, 24, -28, -4, 15, -69, 4, 40, 33, -3, 63, -30, 29, 92, 20, 63, -6, -15]
4199a5nl2J29r7lM3l8J3M3n8o6J05j6l8NK6l7kK3pK8M9p0K7J1m7L3j3Q0m4%k9
4231bL6k2l7O3j3M1p2j14R7M4p9M2J6n0LP8n7n2J02om3K6J8o3O3J7l7n2L0J6J3
4262FL8m5l1J8J20j17N9j0r8N1L3Jm8M4k7n3M4k0l7P9J6l3j9P1o8L9Q1q5kN0l7
4293B0r8P2Ok9M8L3o6j2L8l4LN2m7k8J7lp2J10J0n4P4K3j40N9N9q6KM9nm0N1J5
4325B7l1J8L5p4M8Mqo7Q2k2n4O3j2n3L7K4m7OL7l3KkLj0N9m8k1N0O2n9J2Ln1Q0
4359F0J7j04K8K0K3l1N9m2o6N5Rj05O3J0pJ8m1M7q4P1m7K9RJ3l0k3J13o1j1P2
4389F4j02Q7Pj9k6K0L2p6K7J0l7J8N3l4q9N2m8jJ05n6k1K8K1o1O8K5n5n5L8L3
4419HJ0nm9K3M1l7n2J07J2q4j6M0rpN6j9m3O4j3q1O2Qp7M4J0k9M3J8j7%K3K6o2
$$ y = [-15, -20, -52, 77, -20, -23, 20, -18, -5, 38, -20, -86, 19, 3, -35, -30, -4, -41, -43, -20, -27, 1, 50, -20, 7, 18, -29, 4, -9, 71, 27, 27, -2, 34, 12, -25, 38, 25, 66, -6, -120, -23, 21, -58, -16, 0, -50, -47, 31, -26, -78, 24, 18, -25, 1, 19, -44, 19, 36, -1, -53, -23, -7, 6, 44, -1, -32, -14, 106, -11, 48, 38, -60, -9, 24, 25, -23, 21, -6, -59, -15, -35, -72, 7, 23, -10, -29, 42, -26, 13, 94, 9, 7, 57, 20, -78, -6, 0, -29, 19, 52, -14, -26, 12, -22, -19, 33, -14, -42, -25, -28, -100, 10, 20, -34, 40, 63, -77, -18, 41, -45, -43, 6, 1, -39, 12, 27, -4, 14, 49, -25, 23, 27, 19, -48, 34, 12, -42, 21, 9, -44, -7, 17, -30, -24, 13, -20, -18, -20, -17, -27, 32, -16, -37, 13, 75, 16, 28, 31, -20, 60, 77, -27, 1, 21, 44, 13, 72, 30, -36, 19, 28, -77, -14, -4, -11, 7, -34, 13, -71, 0, -47, -18, -9, 4, -26, -49, 64, 3, -8, 64, -38, 49, 56, 37, 11, 31, 63, -13, 14, 24, -13, 5, 58, 24, -65, -13, -61, -62, 43, -13, -34, -6, 15, -46, 22, 47, -8, -63, -25, 8, 18, 13, -36, -13, 28, -9, -61, 46, 58, -26, -42, -2, -11, -18, 38, 19, -24, 40, 27, -54, 8, 16, -61, -17, -7, -36, 7, 25, 8, 8, 31, 57, -5]
4452el8J10o9J4J1k0KrK1m9O8k0rKJ9o9L0M2l0k2P1p3Kqk0n7J41l8p0N8O6m9K8
4485C0kn0K4M6j1q1P1n0MRN4j33K6R9n1J6omm1N5J5k0lj5l9O2l9M7n8M1j2M3l2
4518eL5k1j4J0k2N1M7p2l3R2r1J7j2J0o7P8k0o5N2L0L3p2K7rL7Lm3K8j4J8Qm5
4550b9ON1J2Kp7J9M6n0L0k3L4j7k8J08j23L7J5lk0M3%j11J03N4j21M2k6k9P5K8
4580D8n0o7N0l4N8J1j2n3N6Rm3L0J0l1J6k5K3l3O7n8P4J7r7M3pJ2Km7M3l3J5J0
4612DM1n6M7L6p4L1j5O5n9l2K7m7N5n7L6J2k1o9J20j35O4j2N0m5k9J50n2o3O7
4641C9ln0L4n1k1N2N2o0K5M7no6L6n5M0j9J9Qo3P0o6K2M2o2J5k8L8OOj2LQJ1l6
4675b4K4jj3L3L6m0J6K2q2L8j1O3m6qJ1k0mK6m6QP0p2l0M0K3m4jM3o2j7O3o2L8
$$ y = [-5, -43, 67, -2, 12, 23, 3, 5, -4, 17, -32, 36, 16, 7, 9, 28, -41, -11, 31, 1, -21, 50, -23, -21, -29, -49, -106, 35, -3, -73, -15, 51, 2, 30, 28, -22, 2, 48, 37, -44, 27, -23, -19, -10, 44, -89, -63, 36, -15, 1, -5, -9, -50, 5, 20, 0, -3, -18, -57, 5, -34, 13, -45, -4, -16, 27, -5, 30, 9, -5, 5, -17, 34, 81, 9, -24, 68, -23, -6, -18, -8, -75, 3, -17, -82, -30, 0, 33, -39, -12, -21, 16, 19, -24, 4, -10, 8, 16, -29, -23, 28, 40, 42, -35, -16, 30, -20, 10, -13, 21, 4, -24, 84, -39, -2, 13, 10, -10, 33, 33, -78, 25, 79, -42, 0, -26, -55, 20, 48, -2, -69, -19, -53, 5, 16, 4, -49, 7, 16, -27, 3, 13, -18, -2, -27, -4, -37, 30, -28, 46, 63, -34, 9, 2, 14, 16, -31, 12, -21, -6, 4, 45, -11, 36, 72, -2, 29, 14, 79, 20, -12, 15, -32, 23, -34, 2, 14, -7, -76, 44, -91, -27, -39, 11, -34, -63, 87, 35, -28, 39, 36, -14, 20, -31, -52, 0, 52, -8, 17, 64, 59, -7, 29, -26, 14, -5, 14, 22, -41, 29, -37, -15, 27, -35, -20, -48, -10, -4, 2, -10, -7, 1, 12, -24, 0, -1, -14, 19, 55, 15, 31, 53, -29, 9, -2, 61, 15, 7, 18, -2, -6, 20, -26, -18, 52, -20, -50, -10, 13, -31, -32, 11, -51, -68, -5, -67, -29]
4708b9N7m6oK0J4J2l5jMN0pr7R5M6n6l2mM3l2J8m1l3J03m7r2P4P3q9J07m5j9Q
4740A3P1j0m2j7L2r0N2M9q5M2M5j09M1Q0l6m7NlK3n1O1j7q7J25q8J8J5j8M7j3
4770Fnl0L5n0O7j7N3q2K7M1K4o6K7k6l3Q7m4kk7N0j2k7L5m8N1o7K2o3L2M4nK0
4802A7k3k7L6O1m6oj8L1n5RL4jL4Kj05N2Q4j19N6j2oL6j5km9L0Ok6L6M0o7L4n
4835A6q8N1O4j1n2N6np4M5j5M0r0Q2j7p4J02n4j1L7L9n4j6K6pJJ5j1kL6k4m7J01
4867E9Jo8K0l0j4M2Qp7P8n2O4n0j3LK7L5k1j4O9o9l2N5k0l1L0j1N4p8M2l0J7K0
4899A4nj4LK9m2M5oj9pN9om5klJ9m1M6j1l3J02j38K5L2K5k8o6N7r0J00L6p2pO5
4932B2M8k4k6p4M9OP0j02MP7o6M5Kk0jMJ7p7N9J0ojj9N5m2L1p5L0j0J5l6K5Ll2
$$ y = [-29, 28, -18, -24, -4, 10, 22, -13, -14, -10, 40, 33, -64, 31, 77, 21, -11, -15, 28, -4, 14, -27, -60, 43, -4, -96, -22, 51, -38, 69, 24, 5, 13, 84, 74, 32, 15, 47, -43, 9, 58, -27, 15, 60, -49, -8, 72, 36, -11, -6, -9, 14, -37, 24, 7, -80, 45, -43, -25, -10, -28, 19, 6, 1, -29, 6, -44, 23, 6, 59, -23, 4, 45, 69, 3, 30, 4, -29, 58, 14, 12, -15, 35, 23, -4, 31, -17, 34, -33, -11, -74, -42, 2, -3, 17, -6, -33, 3, 64, 18, 12, -6, 25, -30, -21, 13, 12, 46, 48, -57, -5, 79, -40, 16, 4, -2, 34, 19, 17, -32, -2, 4, -22, 14, 54, -13, 21, 16, -72, -21, 43, 32, -20, 36, 31, -43, 2, -13, 27, -63, 19, 2, -72, 30, -24, -35, 2, 41, -13, -29, -3, -10, -9, 6, -5, -7, 29, 5, -42, 59, 60, -8, 12, -18, -32, 10, 18, -59, 19, -33, 31, -19, -32, -29, -2, 33, 12, -2, 67, -2, -34, 21, 1, -30, 0, -11, 43, -35, 7, -23, -6, 14, 9, -5, -2, 27, -15, 30, 24, 5, -2, 57, 51, 6, 4, 1, 20, -21, 25, 14, -19, 83, -55, -30, 2, 27, -1, -67, -10, -100, 0, 36, -36, -43, 22, 70, 46, 20, -54, -5, 1, 71, -31, -27, 50, -16, 29, 31, 11, 10, 14, 31, -46, 13, 23, 17, 16, -3, 52, 10, 41, -34, -4, -14, 1, -35, -10, -7, -39]
4966c9R1k6l7kM6q4M8N2o2LK5l6N7k1Nk0%L0l6l0Q3o5OmJ6m1O0l1lM2l8nK2K2
5000B8K2o2L2p1J3M9m3L2l7Q6r3Q7k1k0J9Mm6n1J14m5k2KP3j14L2Q0m1MMj8M5
5031D2k4L3p3L8k6K0%J6nrL1m5L3jQo3R3j04q5R8MOK7k8j0K6Pjm3J4l5J5J3RK
5066a7J7K9l8l0Q2p9jL1O7Kk7J6l7LJk2j3N8k6nJ4j6n3pN3k6M7KMn6J57j04p4
5099d8Q4k2QL9m6l0J4NJ8o6K7K2jK6k3q8Q4m2P8k3OJj7K9l2L4K4m2k5M5jj5K4
5132D7qo1R5o4M3o3L6l3k4M2J2j5m5j8L7LK1l1J7P8j54J08m8J8M3J6Om4K1j3n7
5163c5J6M2N3l3lm8M3j6J5j4j4K0o7m2P3K0j3K9j32P2K0pL5L6o1j9k0J04o2N9
5193E1n6rL7k7j8O7Ro5NO7oj44R9j6m5N7k7L5n1L8ql3L1k7O6m9L7Lo2M0jk0JM4
$$ y = [-39, 52, 26, -11, -13, 33, -51, -3, 49, -13, -10, 15, -21, 36, 15, 20, 0, 0, 30, -6, -36, 47, -18, -12, -16, 0, -41, 19, -12, -15, 27, -11, -16, 6, 28, 50, -12, 20, -51, -38, 11, -32, 0, -37, 49, -44, 43, 22, 2, 21, 25, -21, -72, 42, -3, -25, -23, 50, -64, -32, 48, 7, 11, 15, -3, 42, 18, 51, -22, 16, -10, 10, 10, 26, 21, 12, 43, -2, 31, 30, 38, -25, 68, -36, -121, -23, -19, -13, 14, -14, -24, 2, 9, 8, -35, -21, -56, -41, -28, -19, -17, 0, 29, -9, -39, 43, -36, -37, -6, 61, 63, 36, 52, 15, 18, 19, -3, -16, 42, 16, 11, 25, 9, -44, -51, 2, -24, 23, 25, 29, -27, 130, 26, -48, 36, 14, 22, 61, 15, -15, -1, 4, 22, -44, -17, 5, 4, 30, 7, -81, 3, -39, 39, 16, 22, 23, 6, 35, 3, 37, 61, 19, -6, 39, 38, 23, 47, 39, -22, 73, 9, 52, -11, 25, -8, -32, 10, 22, 7, -38, -56, -19, -16, 5, -26, -9, 69, -85, 23, -25, -7, 36, 52, 58, 14, 35, 22, -35, -19, 23, 76, 43, 40, -8, 35, 19, 34, 20, 6, 26, -41, -83, -10, 10, -3, 26, -106, -34, -14, -21, 14, 50, -11, -30, -50, 54, -8, 51, -5, -14, 23, -4, -22, 45, 54, -11, -6, 61, 55, -89, 10, -6, -51, 6, -21, 14, -37, 1, -7, -40, -9, -36, 30, -19, 18, 21, -41, -1, -2, -22, -21, 23]
5227B3o6R7m5j2K2k1L9m1rP5q2L3j2K2N6p7n1J06n3l3O1m2l8M0kj9O3rk9PO0J1
5259G4q9J7j3o0L7M5j6jO1j3m3qL6r3M1Jo9J07k8ql8M2J9K3k0n4qJ30j8r6O8o8
5291d2J1K5J3L0m6P5n9l6O4m3J3M1k6K5l4k3nRRk0pL6p5J1P1Jj01J8N9J6L4n5
5323a1k1O3jqp1R5m4l5N2K7k8p6N8j9K3J8nn0N2M9j17K7L4l5k5Q0q0j1O7N5n7
5354Fo2L1J2%L8o7j4O8k8k9N8n3N0K6p0L3N6p3N8k3j1l6j8N8lm6N9k0m0J10n6
5385A4m4j2M9mK9J7n2%l8M5k1N5l2jM1Jq3P8J2n5qL9o1j0K7J1K7Pm6K9rL7n5J2
5419aJ0j3mO1l6n4O8o9L6O5j6l9k5R1j07k3N6j7L0J7k5m3L4Mp6O1%m8J01j3m3
5450a8J8M3j8p1N4M4n7N9n6KNj5n9M0l1Q8o0M5jl6N1N3p3lo5N0M5n7k3K7J8M1
$$ y = [23, -43, 54, 9, -3, 19, -2, 37, -4, -13, 62, -20, 13, 1, 23, 79, 2, -49, 57, 4, -29, 32, -10, -48, -8, -10, -29, 34, 25, -4, 3, 63, 74, -15, 2, -11, -71, -34, 11, -5, -6, 55, 42, -1, -9, 27, -66, -25, -24, -93, 14, -14, -22, -60, -18, 1, 24, 4, -50, -58, 72, 54, -42, 26, -42, -31, -6, 7, 37, -9, 66, 7, -29, 35, -8, 5, 46, 20, 45, 11, -12, -17, -8, 1, -19, -26, 10, -65, -54, 17, 18, -83, -65, -6, 10, 44, -11, -32, 31, 30, 22, -49, 46, 2, -33, 19, 46, 18, -58, 0, -19, 4, 22, 17, -33, 19, 68, -49, -22, 12, -23, -48, 32, -48, -59, 8, 63, 6, -56, -25, -13, -13, 25, -42, -56, 12, -16, -45, 13, -40, 10, 36, -34, -1, 55, -18, 40, 17, 6, -30, -48, 10, 7, -39, 20, 0, -40, 70, 14, -30, -42, 7, 3, 32, 49, -3, -3, -41, 4, -17, 38, 6, 5, 46, 47, -36, 42, 54, -1, -9, 30, -31, -41, -14, -3, 24, 31, -15, 14, 5, 42, -13, -1, 9, -4, -8, 53, 17, -37, 31, -38, -2, 63, 47, 8, -17, 74, -33, -56, 0, -17, 13, 30, 5, -38, -4, 0, -76, -15, -15, -63, 38, 25, -18, 0, 43, 25, -46, 8, 52, -5, 54, -2, 0, 5, -10, -69, -29, -60, 28, -32, 13, 12, -24, 27, 80, 7, 4, -61, -11, 34, -23, -46, -19, -1, 40]
5482D0k8J0J0j03J09J9j8n3L8J0oL2p9k4Q8k3Jk4Q0j22L9K3n9L0k5O0J0k7J3q7
5512f6Q9K8n5k5R5p0J8O5q1k9L3jNlL3rl7J4l5J5P7p0OK1l2l4pR3m2k2L9m0N4
5545B7rln1N6K0%K6l7o8N2Or0Q6nK4o0MpqP1l4j3k2J7n9R3rj1J6m5LN6J5m5j4
5580a8kL3k1L1J8k1k3J4K3Mpj4o9J10K1n9J5k4k3K8k9rl4P9l1n3L3L6m1K1K8k6
5612a0K5k4n1M5L2jj5P7p6m0J9L6n8L6K8n0PQ7o9L0k7k3K3L1K5p0M0k7JPl3Q5
5644F0j19J32r6N2l9NK4j3M3j11P5qkm0M4o7O4l1K5rL0Rm8L5L9j36J14J9l4j9
5674bL4J7m4jQ1m6jl4m4K0M9j9l7M0j4j3M6o1P8q6L4l1M2l1J1k3L9K0k7MN7p4
5706a6N6q2M3K9k4k2L3J4m1N2n6Q9q4L1%l7N5k1m7N6k7l2l3O9Qp1K0LK5M0j7l7
$$ y = [40, 12, 22, 32, -71, 38, 57, 39, -14, 24, 34, 28, 60, -19, -43, 45, 22, 23, -1, 79, -43, -4, 19, -40, -10, -35, 25, 35, 8, 21, -66, 23, 51, -4, -29, 66, -4, 14, 79, -2, -31, 2, 1, 6, 3, 36, 27, -10, 4, -31, -16, 61, -9, -3, 18, -14, -48, -55, 38, -4, -26, 13, -27, 27, 18, 15, -36, 20, 40, 40, 66, 29, -39, 13, 19, -71, 15, 10, 34, -26, -22, -29, -37, 34, 0, -13, -35, -18, -77, 16, 7, -4, 12, -33, -30, 26, 41, -4, -18, -20, 13, -8, 23, 41, 20, -3, 11, 34, 38, 31, 17, -52, 58, 79, 20, 35, 11, -12, 16, -13, -22, -56, 23, -8, -61, -28, 8, -33, -12, 16, -10, 15, -9, -60, -15, 17, 16, 1, 78, 2, -38, -19, 17, -41, -5, 23, -27, -20, 67, -2, 28, 1, -22, 1, 32, 57, -13, 27, 0, 1, 8, -25, 60, -59, 73, -23, 29, -10, -5, 19, 6, 49, -62, 13, 5, 3, -37, 7, -60, 4, -27, -2, -11, 19, 28, -20, 15, 54, -82, 32, 51, 17, -2, 32, 49, 5, 4, 85, 39, 38, 4, -40, -20, 29, 10, -27, 13, -1, -14, 32, -29, 49, -37, -3, -34, 8, -23, -12, -35, 4, 24, -3, 1, 58, -16, 40, -42, 1, 30, 6, -16, 17, 31, -10, 42, -14, 75, -9, 22, 22, -15, 40, 19, -28, 28, 1, -31, -64, 5, 13, -58, -38, -35, -10, 30, 13, -24]
5738b4M3l9N1K0L1j42N9K3j5n7J02L8q6J0J8Nj0N2j05L9Om1N6l5L7l8RP0q7k4
5768c4R1j33P0J18j01l4P0Jo6K6J1q0P0kj9KL1j03Q7L6r6Q5%m6k1JJ17j10M3J
5798A5k8m5M6L1j5L5l3l9L1O1p8L6Jjj0llJ5K7q0LL9k1jK8K2p0O0J0n4KoL3j8
5832a0L8k5r9J58l7j3J9k5J6j8PJ8l4K0m0R9n6k3m9J13o2N%rNn8Q2L4j56J19j0
5863Io9Q6o5j9Q9nl2K0M4k6q0N2Lj5P5mo0RlLJ6Mk5J4J8j3m0K0K1l0M5n1k7L7
5897AJk2oO4o0M0k8M9m4J9J1r1RO6%J0K7k3o1P2j9q3Q5j2j8k9M7p1J20p7Kj2Q7
5930E4o7llK6J4n0K9Jk2O6p8K4L2N3p3LRl3M3l3J2k7L9l0p4N6J3k2L0j7m6J13
5962C9q4L3OJ6m2P9J6j5o5P7j7j00P5j5k8N0L8m6LJ7o2KRL9n2J8pl7R6Lo6oK5
$$ y = [-24, 19, -20, 31, 51, 82, -60, -1, 22, 7, -50, 52, 90, 4, 14, 32, 37, 27, 79, -26, 13, 19, -22, 34, -1, 36, -2, 7, 77, -10, -34, 57, -76, -6, 112, 11, -23, 47, 48, -18, 8, 19, -61, 9, 7, -12, -10, 21, -82, 5, 41, -55, 30, 30, -16, -37, -36, 81, -29, 14, 15, -13, -58, -12, 19, 4, 39, 6, -33, -2, 59, -19, 17, 18, 17, 7, 4, 1, 16, 43, -37, -34, 5, -16, -17, 11, 33, -37, 23, 33, -21, -19, -25, 8, -10, 28, 3, -96, 62, 25, 12, 31, 6, 22, 4, 11, 29, -5, 15, -25, 74, 18, -5, -54, 59, -3, 2, 2, -7, -2, -60, 22, 56, -100, 19, 9, -60, 26, -39, -58, 31, 26, -6, 14, 58, 32, -48, 4, 7, -8, 67, 63, 3, 12, 9, 12, 28, 32, 7, 21, 39, 26, -14, 6, 27, -3, 42, -9, -36, 1, 2, -20, -26, 38, -22, 18, -10, 39, -5, 14, 25, -66, -57, 9, 9, 19, 46, 23, -38, 34, 15, -68, 17, 5, -13, -42, 5, -66, 54, -23, -21, -33, 54, -13, -16, -19, 7, 21, -29, 0, 1, -21, 45, -33, -9, 23, 76, 3, 6, 15, -18, 25, -8, 4, -23, 16, -14, -88, -32, -19, -41, -11, -28, -74, 39, -45, -12, -6, 10, -32, 47, 63, 48, -17, 60, 43, -57, 18, 3, -25, 25, 63, 17, 20, 37, -25, -23, -14, 25, -27, -9, -16, -53, 43, 46, -20, -26, -1]
5995arl2P8k2p6R3J4r7R0N7j03J6J2o0R3m2PoK4l6k0L5J0M3Ll7n8j9K7NN0j0l3
6028dj4L8K2q7P1J6j5J0l6rl0M8J6n5QJ6jKL6ok3P5p5lJ6J7p3N9k1m2QK3K1l5
6062b7O7n4L9k5M6q4L7k6M3j8K5M7q1Lj2J7J4l4K0j5ql2N5L4r7O9l1O5o5M3K0
6093C5j6k2l5M5N5o2k5L4km6P8jo5M8Jl0k6P8o0MmO3o6M8j7p3N4l7j9J8J6P0j18
6126g7O0lJ6O3o2j0M0Jo3J4L8%l0M7p9L6J34r1o9L5kL3J5Nr0M2k5pK8j5%k9L0
6159a5j3Q1j9oJ0k3k5j4j3O6k4l8K7K7K7j2n0LrM0L1o4j7L3N7n5l1OQ5n5o1N8
6191GN8r7O1L0nj04R9m5Jj0P2o3K1Jk7k3M4K6l3Qn4M3l4k2j1j2Q9n6k1J05o8j1
6223c1J0M0l3P8l1n2K4K9J1n3M2j7m0P1J1m4K0j8m2M4O5p7K0l4l8j5L7Kn8O6J1
$$ y = [-1, -10, -42, 36, 14, -62, 31, 45, -52, 38, 95, -8, 8, 20, -40, 53, 11, 18, 12, 36, 0, -20, 15, 25, 68, 71, 34, -24, -43, -16, -11, 39, 29, -4, -18, 20, 42, -45, 26, 42, 27, 37, 1, -8, -38, 10, 26, -29, -21, -5, -6, -4, 32, 26, 3, 78, 3, 0, 16, 33, -40, 19, -2, -44, -36, -13, 8, -27, 40, -14, 25, 0, 46, -38, -1, -27, 16, -2, 23, 70, -11, -8, -20, -3, 11, -23, -3, -18, -26, -58, -3, 31, -66, 3, -28, 37, -28, 15, 35, 19, -3, -38, 7, 62, 0, -25, 9, 7, -39, 39, 38, -27, 21, 22, -8, -34, 44, -16, -12, -16, 47, -19, 29, 12, -61, -7, -44, -63, -45, -29, 41, -77, -17, -20, -4, 59, -3, -13, 27, 28, -35, -21, 17, 17, -13, 34, -45, -9, 125, 34, -35, 0, -2, 31, 46, 51, -39, 3, -22, -29, -1, -16, -16, -45, -15, -28, 53, 34, 28, 38, 15, -10, -24, -37, 29, 5, -33, -6, 21, 48, 36, -14, -11, -20, 20, 51, -13, -30, 3, 60, 5, -26, -20, 65, 10, -51, 7, 65, -32, 29, 59, 54, -50, 49, 4, 5, -5, 67, 4, 25, 26, -1, -24, 20, 46, 13, 21, -33, 10, -24, -46, -57, -69, 20, -36, -57, 48, -20, -31, -21, 19, -14, 64, 33, -19, 5, 34, 45, -8, 34, 17, -23, 48, 59, 15, 35, 17, -25, 19, 84, 7, 27, -7, -45, -60, -23, -21, -79, -13, -2]
6254boj6J7lP3p9Pm8R5m3N9k9K6m2J8%k7M7o9M1k9L0Jj2m9O7Jpn7m9J00m4K5l4
6288c8O0q8M7K8l6j5N8k8nJ8K1j8qM0o1L4mKL6j5%MJ7k3q4P4nK9m5J4Pj6K1kj9
6323@O3q2OK0Qk9M2mnql9O0n8k4J19q0nKj5N0k3oMO4j30N4J0M9n6L2k2%j6M4k7
6358bk6K9J8Jpjk5L8Qm9K3N9r7mQ5n5LJ2l5K0j8J6K4J3n9J0k1Q3n7ML2n1P1NJ8
6393F5j28P3j0j2J5L8n6j0M1K1n4O2m2QK1J6j09O1J7koJ6m4JN0l9J9k9N9o4R7
6424G5p6J8k4j0QrR2l9q6O0Qo7R0n9L2J0k9J6k0P2p2OJ4L3m5N0o5J5M3l6k3K6
6456Hjl1M7k2l5oM7m0K3k6olKO4n3O3m8QJ4J5J4m3P3o0rK0rN1q5L7k2ML5J6rj4
6492A9N5p5j1J9K8jp2J2l3L3L2m8M4j9m0L9%j8K1M7l5K0k1M8p3J05o2n9Q3K0n4
$$ y = [-2, -8, -24, -7, -10, 63, -16, -9, -57, 38, -5, 54, 25, 51, 9, 27, 27, 0, 47, -22, 19, -10, 20, 21, 9, -40, 27, 28, 21, -36, -85, 15, -29, -4, -38, 22, -66, -19, 9, -27, -42, 16, -12, -17, 1, 22, 4, -4, 36, -25, 9, 5, 7, 43, 28, 28, 32, 49, 26, -58, 16, 11, 40, -5, 9, 16, 0, 21, 19, 0, 63, -19, -13, 7, 15, -14, 28, 24, 19, 11, -28, 32, -26, -50, 69, -11, -16, -14, -29, 21, -2, -8, -4, 60, -70, -16, -6, 43, -13, 19, -3, -3, -19, 25, -2, -28, 1, 19, 20, 13, 12, -13, 25, 33, -16, 7, 66, -31, -35, 50, -5, -2, 10, -25, -5, -23, -7, 17, 30, -29, -19, -40, 43, -14, -10, 22, -29, 42, 47, 65, -63, 10, 0, -12, 3, 41, -15, -25, 16, 37, -17, 45, 3, 11, 32, 48, -61, 0, 17, 15, 9, 25, -19, -18, 32, -7, 12, -17, 42, -22, 75, -1, 17, -7, -17, -9, -18, 74, 35, -51, 9, 17, -50, 40, -19, 13, 23, -6, 10, -10, 62, -10, -4, 10, 43, -2, 48, -17, -2, 41, 5, -18, 8, 7, -24, 23, 1, -34, -40, 7, -33, -10, -36, -42, -45, -43, 21, -32, 31, -17, -9, 5, 20, 34, -9, 64, 4, -5, 15, 6, 57, -28, 9, -13, -9, 26, 42, 33, 19, 74, -1, -12, 7, 35, 34, -38, -26, -59, -26, 6, -42, 2, -17, -57, -18, -18, -36, -15, 32, -3, 17, -4, 44, -29, 76, 14, -45, 38, 58, 4]
6523Dm7J33o9j2L5k2j9NJ3j5K1k6l0K0oRM3Ol6m3N1J8n8M4rK5j5k6j8k7J2LJ4
6556b2O7k9q2J27l0k1L4l0n1J0L9n8J6L2K2o9MN1kj5O6q1LM7j2n3P5j3n2M6qk5
6588a4P9n5l0N4j9l2J9k7oJ3P1p4N2L7o9qrP0o8J6L9k5m3R5p4NnO5r5J1K3J6J8
6621C0l6K1j6n9Q2k3J4Jm7QN0Jp8O7m1L0LJ1n3N0Nq7Q0m3Lk4K3k6R9m8oJ1j4K6
6655A4j8M5m0J1L0q1N3l9OQJ2l6k2M0K1J3o2L0k7NL3P7j78J15l0o8P4m9M8k3K8
6686a0O1o6L9k8m8Q8l7Rl5J8JqqM8l8M9qj2n1j2O9k6J6m7J3K9n2M1j9L9m8J7M1
6719B5l8MK0r7N1O3Qk8N0k2r7N4PM4r1Q0m8N7om0MK4Ml7O4n0j4J3Nn5N8J9k6l8
6753c3N8l0m1L8m5J7P6j4q1N0o2J19j06M5nJ5k9K5P6q1j2n6N0P1k9l3M6k4K9k5
$$ y = [4, -43, 90, 21, 9, 44, 22, 3, 8, 21, 6, 27, 1, -29, -9, -15, -6, 37, 43, 7, -36, 15, 33, -25, 19, 10, 35, 20, -6, -24, -51, -39, -36, -22, 45, 16, -66, 61, 31, 10, 44, 14, -37, -27, 12, -46, -30, 2, 24, -45, -41, 10, 8, -7, 59, -22, -19, 28, 16, -37, 38, 25, -27, 19, 11, -14, 65, 10, -20, 34, 15, -17, 2, -25, -31, -18, 53, -21, 31, 68, -1, -9, -18, 52, -16, 0, 39, 14, -29, 66, -8, -3, -8, 57, -38, -27, -4, 12, 30, -6, 15, -1, -60, 22, -1, 13, 14, -33, -25, 25, 26, -52, 15, -26, 4, 7, 18, -35, 15, 20, -67, 13, -30, -27, -51, -28, -54, 45, -3, -9, 2, -12, 14, -4, 41, 1, 12, 42, -39, 14, -25, -19, -11, 1, -35, -57, -17, 4, 17, -45, -15, -42, -37, -4, 73, -105, 10, -20, -88, -14, -63, -15, -38, -10, 51, -15, 24, -4, -52, 36, -1, 8, -27, -9, -8, -16, -24, 24, -14, 35, 27, 15, -36, -48, 21, -5, 11, -36, -23, 6, -46, -5, -24, 15, -33, -16, 25, -13, -9, 11, -86, -35, 28, 36, 8, 58, 36, -61, -7, 0, 44, -47, 33, -15, 42, 36, -4, 0, 24, 28, -9, 55, 5, -9, 4, 9, -46, 12, 31, 5, -33, 25, -5, -46, -8, -53, -36, 40, 26, -55, -5, -67, 52, -54, -9, -14, 1, -28, -3, 73, -8, -20, -76, -26, 45, 16, -17, 29, 5, 34, 9]
6783IJ5j6K7m3oN1nm1L1K5Jq4L7m4K9l0%K3jN4m2L4j8l2M1oQp0L8M4m4O7k4kl3
6818gJ3J4m9J0j4P8l7ll5P9l2m6L6K9l3J9m8N1l2M1l2%N6r1k8N1O7n2k1N4l6L3
6850C5q8N0Pl1O5r0M6J6Kl1O7o0K2N1q6O5K2n8J2k9qJML3l0L0k4j03J25L8p4l9
6882f0P5k8KjM0j0m0L8l1p6P7k8J7K1K1l4L0m4j4O8k0j9NL3m0qO7o5k6J07o2k5
6914c0M1l4M8m1M3l6k0R8n1m4M5J0j0k6L8p8N3K7q7N8K5K0n3n2M0o2Q0J0L1K3
6944F6j7o5rM4L2o5L8J9n5J9M1o8L5Kn4J8J7olL7ol5O5k9k8J2nk2l3P1m6J6k5
6977c9N2j9K7m4O2q7L9Oj4K9J4k4Pjk2KM3k7K7Jj1m0L3J9Lnj4k1J1m1KL9k4L3
7011A6m1L7l9LK4k0m2P9mj0Kn0O3l5N3j6q1O3J2n0J8M6l9K6No4Q6L2n2LJ4n1q
$$ y = [9, 24, 8, 35, -8, -14, 37, 32, -9, 22, 47, 48, -36, 1, -43, -14, -44, -44, -21, -22, 32, -10, 24, 6, -26, 15, 9, 17, -53, -15, 29, -15, 52, 28, 26, -7, 6, 20, -29, -19, -33, 45, 8, 5, -30, 49, 17, -29, 7, 36, 3, 22, -26, 25, -7, 34, 2, 2, 58, -33, -61, -10, 57, 5, -16, 38, 2, 35, -53, -3, 4, -27, 38, -52, -6, 10, 12, -19, 48, -12, 10, 61, -25, 40, 62, 4, 16, -13, -21, -20, -16, 17, -13, 17, -7, -110, 15, 53, -21, -60, 15, -13, -11, -12, 28, 18, -22, 16, -15, -91, -14, -42, -25, -4, 17, -17, 13, -31, -45, 23, 3, -16, -11, 22, -18, -26, 41, -24, -50, 57, -5, -30, 11, -23, 25, -16, 27, -9, -29, 69, 18, -26, 19, 29, 19, -7, 31, -47, 6, 33, -54, 4, 29, 49, -4, -56, -16, -78, 2, 12, 43, 66, 49, -16, -25, 19, 51, -14, 24, 43, -12, 7, 48, -20, 15, 17, -37, -19, -2, -8, -11, 26, 20, -15, 50, 21, -7, 5, 0, -22, -55, 16, -30, -14, -39, 13, -6, 21, -23, 39, -48, -9, -3, -17, 12, 26, 2, 9, 8, -14, -12, 31, 4, 31, 32, 21, -19, 14, 33, 36, 31, 17, -4, 7, -34, -32, 7, -17, 16, -25, 12, -27, -24, 0, -20, -62, 17, 13, 3, 5, -45, 18, -17, 36, 20, -61, 2, 14, -36, -18, 28, -11, 15, 20, -44, 42, 74, 22, 25, 39, -12, -20]
7044b0J3qJ9L4k0j4J8K1k8K8o8L4j2K1k4%K0Om4K5R0j36P6k2l5PL2k2k1O5l2j0
7076gN2l9k2R7m9m3L1j5K5l5nN3l8k7M9L5ql9l4N3r0PL9l1k8O6j1m0M6j9k3K9
7108b1J8j9k3L4l2J5K2O9o1K3mJ5j05P4L7j44J31l8l2P2l1Lj3jK6k0N4l8l0JO1
7139D3j07N3L7j7JK7j8m7L1m2n0P6L3r1K1Q7n2J8M2l6J5K0m8L6j6K9l4j3j1jO3
7170D9r3P1JOj9k6mO3p8L1M3o3J4j4L7r3J03Rr5P1Pl2KK2j2NL1Kk2l0L5kK4Nm9
7205alJ07q4K1J2q5M1k3nkM6j7m3MN7l5lJ5j7oJ9lK2q1P0l9K3L5o2N4k1M8l4j4
7239dK5l8J0K1J8rqm6Q1oj06K3O8lp9P2k8PM0m1J9q2R4n8Lkj6N7K0k7RJ0m1J4
7273crk9j9L7p2Q0K0J5Ln0Pok6O8j4l8L2K6m8Nj2O1j4k9J8j1O5m4jK0kp6L9M2
$$ y = [-20, -7, -15, 4, 38, 18, 4, 22, 43, 15, 43, -25, 9, -3, 18, -6, -6, 14, 20, -24, 1, 91, -45, 31, 9, -26, -19, 13, -9, -30, 35, 3, -7, 45, 6, -16, 81, 32, -11, 20, 5, 30, -5, -10, 43, 5, -22, 27, 62, 54, 15, -19, 34, -56, -49, -10, -41, -69, -3, -14, -54, -8, -27, -50, -21, -3, -22, -45, -11, -43, -28, -6, 63, 2, 25, 21, 36, -69, 5, 42, -102, 29, -9, -41, 31, 0, 3, -10, -11, 15, -5, 49, 11, -19, -18, 43, -64, -11, 26, 9, 10, 37, 19, -28, 3, -39, -89, -13, 20, -71, -50, 37, -15, 3, 45, 9, 24, 44, -4, 32, 16, 45, 11, -2, -13, -14, 49, -44, 27, 28, 34, 15, -11, -15, 48, -30, 1, 44, -19, -5, -19, 18, -75, 28, 37, -58, 13, 20, -12, -10, 12, 0, 5, 36, 38, 16, -14, 21, 19, 43, 48, -1, -4, 103, 19, 40, 52, -33, 8, -15, -20, -22, 24, 7, -36, -32, 25, -10, -13, 2, -15, -21, -2, -5, 17, -64, 6, -33, -10, 25, -37, 17, -4, 44, 10, -4, 21, -17, -7, 14, 32, 23, 15, -31, 50, 44, -62, -39, 29, 26, -53, 19, -9, -2, 38, -3, 16, -66, 28, -30, -27, -29, -45, 12, 32, 5, 14, 24, -17, -3, -12, -41, -60, -23, -95, -15, 5, 20, 23, -27, -20, -26, -52, 16, 2, -36, -4, 22, -26, -21, -33, 28, 14, -15, 3, -8, 57, 13, 12, 32, 30, -46, -7, 35]
7307C5n5M6q1J8O8L4n5m5M0J0j1O1k6m6N2o4M7l5L7m7J7k2Nk8%N0J0JN1r6K0K6
7339A7m8OL1Q4j40Q7l7k9K0rqM2K7j6n3N0r5M3J29r4j7l2J5m2J37p0j9k6M1K9
7369B3j04P8n1J9N0l6J9MJ0n6N7j1J4n9K8K2l7J1M6m1K4nKj5PJ7l1L4n6J5O2l8
$$ y = [35, -20, 26, -55, -37, 31, 65, 10, -35, 5, 15, 4, 65, 39, -7, 45, -19, 28, -7, 30, -17, 0, -22, -17, -45, -45, 5, 15, 16, 67, -29, -9, 17, -31, -25, 6, 90, -50, 37, 0, -29, -9, -18, -26, 16, 43, 27, -26, 24, -71, -28, 101, 7, -10, -42, -27, -69, 68, -2, -21, -47, -6, 23, -81, -3, -54, -35, 15, -21, -2, 2, 12, -44, 13, 2, 16, -43, -15, 7, -30, -19, 27, -14, 10, 5, 7, -8, -1, 16, -15, 19, -37, -22, 40, 2]
$$ [...]
8191G
##END NTUPLES=NMR FID
##END=
