##TITLE=1H_AM_NV49
 
 8 sc, 
 6.6.2023
##JCAMPDX= 6.0         $$ Bruker NMR JCAMP-DX V2.0
##DATA TYPE= NMR FID
##DATA CLASS= NTUPLES
##ORIGIN= UXNMR, Bruker Analytische Messtechnik GmbH
##OWNER= root
$$ XWIN-NMR		Version 3.5
$$ Tue Jun  6 16:09:30 2023 Russian Standard Time (UT+4h)  she@DPX200
##.OBSERVE FREQUENCY= 200.13135
##.OBSERVE NUCLEUS= ^1H
##.DELAY= (6, 6)
##.ACQUISITION MODE= SIMULTANEOUS
##.ACQUISITION SCHEME= undefined
##.AVERAGES= 8
##.DIGITISER RES= 18
##SPECTROMETER/DATA SYSTEM= spect
##.PULSE SEQUENCE= zg30
##.SOLVENT NAME= D2O
##.SHIFT REFERENCE= (INTERNAL, D2O, 0, 15.7039)
##AUDIT TRAIL= $$ (NUMBER, WHEN, WHO, WHERE, WHAT)
$$ ##TITLE= Audit trail, XWIN-NMR		Version 3.5
$$ ##JCAMPDX= 5.01
$$ ##ORIGIN= Bruker BioSpin GmbH
$$ ##OWNER= she
$$ F:/spectra/data/she/nmr/H-F/1/audita.txt
$$ ##AUDIT TRAIL=  $$ (NUMBER, WHEN, WHO, WHERE, WHAT)
(   1,<2023-06-06 16:07:58.48 +0400>,<she>,<DPX200>,
      <created by zg, POWCHK disabled, PULCHK disabled
       configuration hash MD5:
       00 E9 B6 7A A2 85 ED C7 34 08 36 98 17 FE 4E 26
       data hash MD5: 16K
       11 D3 C8 E5 9D AB 9E A7 F2 27 77 0B 08 01 A4 33>)
$$ ##END=
$$ 
$$ hash MD5
$$ 08 05 B7 B8 95 EF 6A B4 D3 3D 5A DE E1 00 D2 C7
##$RELAX= 
##$RELAX= 
##$RELAX= 
##$RELAX= 
##$RELAX= 
##$RELAX= 
$$ Bruker specific parameters
$$ --------------------------
##$DU= <F:/spectra>
##$EXPNO= 1
##$NAME= <H-F>
##$PROCNO= 1
##$TYPE= <nmr>
##$USER= <she>
##$AMP= (0..31)
100 100 100 100 100 100 100 100 100 100 100 100 100 100 100 100 100 100 
100 100 100 100 100 100 100 100 100 100 100 100 100 100 
##$AQSEQ= 0
##$AQ_mod= 1
##$AUNM= <au_zg>
##$AUTOPOS= <>
##$BF1= 200.13
##$BF2= 200.13
##$BF3= 200.13
##$BF4= 200.13
##$BF5= 200.13
##$BF6= 200.13
##$BF7= 200.13
##$BF8= 200.13
##$BYTORDA= 1
##$CFDGTYP= 0
##$CFRGTYP= 5
##$CHEMSTR= <none>
##$CNST= (0..31)
1 1 145 1 1 1 1 1 1 1 1 1 1 1 1 1 1 1 1 1 1 1 1 1 1 1 1 1 1 1 1 1 
##$CPDPRG= <>
##$CPDPRG1= <>
##$CPDPRG2= <>
##$CPDPRG3= <>
##$CPDPRG4= <mlev>
##$CPDPRG5= <mlev>
##$CPDPRG6= <mlev>
##$CPDPRG7= <mlev>
##$CPDPRG8= <mlev>
##$CPDPRGB= <>
##$CPDPRGT= <>
##$D= (0..31)
0 1.2 0 0 0 0 0 0 0 0.06 0 0.03 0 0 0 0 0.0002 0 0 0 0 0 0 0 0 0 0 0 0 
0 0 0 
##$DATE= 1686053277
##$DBL= (0..7)
120 120 120 120 120 120 120 120 
##$DBP= (0..7)
150 150 150 150 150 150 150 150 
##$DBP07= 0
##$DBPNAM0= <>
##$DBPNAM1= <>
##$DBPNAM2= <>
##$DBPNAM3= <>
##$DBPNAM4= <>
##$DBPNAM5= <>
##$DBPNAM6= <>
##$DBPNAM7= <>
##$DBPOAL= (0..7)
0.5 0.5 0.5 0.5 0.5 0.5 0.5 0.5 
##$DBPOFFS= (0..7)
0 0 0 0 0 0 0 0 
##$DE= 6
##$DECBNUC= <off>
##$DECIM= 32
##$DECNUC= <off>
##$DECSTAT= 4
##$DIGMOD= 1
##$DIGTYP= 9
##$DL= (0..7)
0 120 120 120 120 120 120 120 
##$DP= (0..7)
150 150 150 150 150 150 150 150 
##$DP07= 0
##$DPNAME0= <>
##$DPNAME1= <>
##$DPNAME2= <>
##$DPNAME3= <>
##$DPNAME4= <>
##$DPNAME5= <>
##$DPNAME6= <>
##$DPNAME7= <>
##$DPOAL= (0..7)
0.5 0.5 0.5 0.5 0.5 0.5 0.5 0.5 
##$DPOFFS= (0..7)
0 0 0 0 0 0 0 0 
##$DQDMODE= 0
##$DR= 18
##$DS= 0
##$DSLIST= <SSSSSSSSSSSSSSS>
##$DSPFIRM= 0
$$ [...]
##$SUBNAM2= <"">
##$SUBNAM3= <"">
##$SUBNAM4= <"">
##$SUBNAM5= <"">
##$SUBNAM6= <"">
##$SUBNAM7= <"">
##$SUBNAM8= <"">
##$SUBNAM9= <"">
##$SW= 18.05172834244
##$SWIBOX= (0..15)
0 0 2 0 0 0 0 0 0 0 0 0 0 0 0 0 
##$SW_h= 3612.71676300578
##$TD= 16384
##$TD0= 1
##$TE= 0
##$TE2= 300
##$TE3= 300
##$TEG= 300
##$TL= (0..7)
0 120 120 120 120 120 120 120 
##$TP= (0..7)
150 150 150 150 150 150 150 150 
##$TP07= 0
##$TPNAME0= <>
##$TPNAME1= <>
##$TPNAME2= <>
##$TPNAME3= <>
##$TPNAME4= <>
##$TPNAME5= <>
##$TPNAME6= <>
##$TPNAME7= <>
##$TPOAL= (0..7)
0.5 0.5 0.5 0.5 0.5 0.5 0.5 0.5 
##$TPOFFS= (0..7)
0 0 0 0 0 0 0 0 
##$TUNHIN= 0
##$TUNHOUT= 0
##$TUNXOUT= 0
##$USERA1= <user>
##$USERA2= <user>
##$USERA3= <user>
##$USERA4= <user>
##$USERA5= <user>
##$V9= 5
##$VALIST= <valist>
##$VCLIST= <CCCCCCCCCCCCCCC>
##$VD= 0
##$VDLIST= <DDDDDDDDDDDDDDD>
##$VPLIST= <PPPPPPPPPPPPPPP>
##$VTLIST= <TTTTTTTTTTTTTTT>
##$WBST= 1024
##$WBSW= 4
##$XGAIN= (0..3)
0 0 0 0 
##$XL= 0
##$YL= 0
##$YMAX_a= 214082
##$YMIN_a= -246861
##$ZGOPTNS= <>
##$ZL1= 120
##$ZL2= 120
##$ZL3= 120
##$ZL4= 120
##$ABSF1= 10
##$ABSF2= 0
##$ABSG= 5
##$ABSL= 3
##$ALPHA= 0
##$AQORDER= 0
##$ASSFAC= 0
##$ASSFACI= 0
##$ASSFACX= 0
##$ASSWID= 0
##$AUNMP= <proc_1d>
##$AZFE= 0.1
##$AZFW= 0.1
##$BCFW= 1
##$BC_mod= 2
##$BYTORDP= 1
##$COROFFS= 0
##$CY= 11.3945322036743
##$DATMOD= 1
##$DC= 2
##$DFILT= <>
##$DTYPP= 0
##$F1P= 15.7292609196834
##$F2P= 12.9074282941183
##$FCOR= 0.5
##$FTSIZE= 0
##$FT_mod= 4
##$GAMMA= 1
##$GB= 0.15
##$INTBC= 1
##$INTSCL= 1
##$ISEN= 128
##$LB= 0.24
##$LEV0= 0
##$LPBIN= 0
##$MAXI= 10000
##$MC2= 0
##$MEAN= 0
##$ME_mod= 0
##$MI= 1.114404
##$NCOEF= 0
##$NC_proc= 0
##$NLEV= 6
##$NOISF1= 3.799351
##$NOISF2= 2.8
##$NSP= 1
##$NTH_PI= 0
##$NZP= 0
##$OFFSET= 15.70392
##$PC= 1
##$PHC0= -19980.62
##$PHC1= 7.05272
##$PH_mod= 1
##$PKNL= yes
##$PPARMOD= 0
##$PSCAL= 0
##$PSIGN= 0
##$REVERSE= no
##$SF= 200.130013532006
##$SI= 16384
##$SIGF1= 3
##$SIGF2= 2
##$SINO= 400
##$SIOLD= 16384
##$SREGLST= <1H.CDCl3>
##$SSB= 0
##$STSI= 0
##$STSR= 0
##$SW_p= 3612.71676300578
##$SYMM= 0
##$S_DEV= 0
##$TDeff= 0
##$TDoff= 0
##$TI= <>
##$TILT= no
##$TM1= 0
##$TM2= 0
##$TOPLEV= 0
##$USERP1= <user>
##$USERP2= <user>
##$USERP3= <user>
##$USERP4= <user>
##$USERP5= <user>
##$WDW= 1
##$XDIM= 8192
##$YMAX_p= 0
##$YMIN_p= 0
$$ End of Bruker specific parameters
$$ ---------------------------------
##NTUPLES= NMR FID
##VAR_NAME=  TIME,          FID/REAL,        FID/IMAG
##SYMBOL=    X,             R,               I
##VAR_TYPE=  INDEPENDENT,   DEPENDENT,       DEPENDENT
##VAR_FORM=  AFFN,          ASDF,            ASDF
##VAR_DIM=   8192,          8192,            8192
##UNITS=     SECONDS,       ARBITRARY UNITS, ARBITRARY UNITS
##FACTOR=    0.0002768,     1,               1
##FIRST=     0,             0,               0
##LAST=      2.2672688,     0,               0
##MIN=       0,             -246861,         0
##MAX=       2.2672688,     214082,          0
$$ Real data points
##PAGE= N=1
##DATA TABLE= (X++(R..R)), XYDATA
$$ [...]
$$ plain form
868 6993 5175 3509 1571 -373 -2065 -4041 -5770 -7243 -9103 -10406 -11556 -13015 -13708 -14515 -15320 -15368
884 -15368 -15727 -15749 -15215 -15037 -14270 -13295 -12513 -11114 -9837 -8496 -6734 -5227 -3519 -1692 -90 1787 3539
901 3539 5043 6820 8301 9573 11048 12009 12902 13876 14195 14652 15003 14672 14663 14281 13435 12955 11853 10676
919 10676 9668 8065 6677 5206 3412 1959 174 -1541 -3047 -4783 -6158 -7603 -9071 -10063 -11289
934 -11289 -12225 -12751 -13599 -13897 -13932 -14257 -13867 -13446 -13197 -12165 -11358 -10561 -9002 -7927 -6674 -4814 -3646 -2055
952 -2055 -181 1032 2831 4416 5568 7268 8463 9494 10773 11464 12233 12872 13099 13450 13379 13252 13021
969 13021 12356 11888 11022 9943 9108 7711 6372 5224 3515 2154 789 -1042 -2335 -3736 -5370 -6426
985 -6426 -7753 -9084 -9793 -10886 -11670 -11981 -12720 -12813 -12761 -12955 -12363 -12042 -11571 -10484 -9899 -8772 -7452 -6567 -4945
$$ packed form
868F993j818j666j938j944j692j976j729j473j860j303j150j459o93q07q05m8
884a5368l59k2N34J78P67R75P82J399J277J341J762J507J708J827J602J877J752
901C539J504J777J481J272J475R61Q93R74L19M57L51l31rl82q46m80j102j177
919A0676j008j603j388j471j794j453j785j715j506j736j375j445j468r92j226
934a1289r36n26q48k98l5l25L90M21K49J032Q07P97J559J075J253J860J168J591
952b055J874J213J799J585J152J700J195J031J279O91P69O39K27L51p1j27k31
969A3021o65m68q66j079q35j397j339j148j709j361j365j831j293j401j634j056
985f426j327j331p09j093p84l11p39r3N2j94N92L21M71J087N85J127J320Q85J622
$$ plain form
1004 -4945 -3667 -2470 -663 494 1989 3611 4568 6118 7356 8152 9479 10179 10742 11618 11755 12045 12340
1021 12340 11964 11914 11601 10807 10400 9464 8407 7619 6193 5027 3902 2246 1166 -293 -1909 -2848 -4453
1038 -4453 -5659 -6492 -8051 -8729 -9451 -10654 -10698 -11313 -11860 -11424 -11802 -11575 -10817 -10835 -9920 -9001 -8540 -7152 -6160
1057 -6160 -5244 -3667 -2661 -1426 153 1170 2595 3886 4820 6193 7093 7936 9014 9415 10125 10681 10611
1074 10611 11133 11017 10626 10810 10008 9451 9142 7779 7157 6296 4705 4027 2713 1185 442 -1178 -2440
1091 -2440 -3269 -4776 -5660 -6520 -7759 -8277 -9023 -9775 -9903 -10393 -10530 -10345 -10476 -10018 -9569 -9296 -8339 -7712 -7006
1110 -7006 -5726 -5031 -3895 -2562 -1797 -371 881 1737 3225 4115 5019 6297 6882 7722 8549 8836 9462
1127 9462 9745 9778 10005 9795 9589 9293 8716 8207 7472 6617 5836 4757 3782 2818 1576 573 -517 -1792
$$ packed form
1004d945J278J197J807J157J495J622R57J550J238P96J327P00N63Q76J37K90K95
1021A2340l76n0l13p94m07r36j057p88j426j166j125j656j080j459j616r39j605
1038d453j206q33j559o78p22j203m4o15n47M36l78K27P58j8R15R19M61J388R92
1057f160R16J577J006J235J579J017J425J291R34J373R00Q43J078M01P10N56p0
1074A0611N22j16l91J84q02n57l09j363o22q61j591o78j314j528p43j620j262
1091b440q29j507q84q60j239n18p46p52j28m90j37J85j31M58M49K73R57O27P06
1110g006J280O95J136J333P65J426J252Q56J488Q90R04J278N85Q40Q27K87O26
1127I462K83L3K27k10k06k96n77n09p35q55p81j079r75r64j242j003j090j275
$$ plain form
1145 -1792 -2690 -3738 -4822 -5518 -6492 -7313 -7726 -8487 -8886 -9029 -9438 -9338 -9262 -9219 -8729 -8403 -7898 -7157 -6554 -5680
1165 -5680 -4809 -3898 -2869 -1947 -790 251 1232 2439 3298 4212 5251 5847 6714 7426 7733 8370 8701 8720
1183 8720 9034 8906 8651 8615 8059 7536 7150 6249 5559 4820 3726 2974 1989 881 65 -1086 -2044 -2876 -3977
1202 -3977 -4618 -5423 -6318 -6682 -7403 -7836 -7946 -8460 -8375 -8295 -8436 -7919 -7689 -7406 -6575 -6182 -5509 -4504 -3945 -2978
1222 -2978 -1949 -1272 -119 856 1624 2751 3506 4227 5153 5662 6337 6948 7186 7714 7870 7888 8161 7815 7696
1241 7696 7574 6844 6612 6047 5109 4752 3807 2876 2377 1189 339 -323 -1548 -2233 -2973 -4022 -4503 -5189 -5967
1260 -5967 -6269 -6795 -7220 -7271 -7560 -7595 -7401 -7408 -7063 -6678 -6364 -5708 -5193 -4554 -3723 -3117 -2206 -1365 -620 422 1150
1281 1150 1972 2938 3474 4268 4990 5345 6052 6427 6616 7084 7129 7129 7238 6967 6740 6526 5991 5528 5048 4318 3701
$$ packed form
1145a792q98j048j084o96r74q21m13p61l99j43m09J00P6M3M90L26N05P41O03Q74
1165e680Q71R11J029R22J157J041R81J207Q59R14J039N96Q67P12L07O37L31J9
1183H720L14j28k55l6n56n23l86r01o90p39j094p52r85j108q16j151r58q32j101
1202c977o41q05q95l64p21m33j10n14Q5Q0j41N17K30K83Q31L93O73J005N59R67
1222b978J029O77J153R75P68J127P55P21R26N09O75O11K38N28J56J8K73l46j19
1241G696j22p30k32n65r38l57r45r31m99j188q50o62j225o85p40j049m81o86p78
1260e967l02n26m25n1k89l5J94pL45L85L14O56N15O39Q31O06R11Q41P45J042P28
1281A150Q22R66N36P94P22L55P07L75J89M68M5%J09k71k27k14n35m63m80p30o17
$$ plain form
1302 3701 3023 2172 1475 670 -226 -945 -1783 -2561 -3250 -3974 -4528 -5117 -5637 -5989 -6391 -6597 -6724 -6874 -6765 -6662
1322 -6662 -6517 -6133 -5817 -5405 -4815 -4283 -3676 -2941 -2252 -1565 -695 54 769 1641 2278 2952 3722 4152 4726 5291
1342 5291 5579 5988 6270 6351 6515 6490 6362 6244 5960 5612 5213 4735 4182 3597 3002 2320 1618 922 139 -600
1362 -600 -1294 -2030 -2729 -3317 -3943 -4477 -4856 -5379 -5697 -5841 -6173 -6156 -6113 -6231 -5911 -5713 -5554 -4986 -4642 -4190 -3487
1383 -3487 -3042 -2368 -1632 -1043 -268 442 1088 1816 2439 3042 3630 4092 4557 4992 5298 5589 5783 5861 5956 5851
1403 5851 5710 5571 5218 4904 4540 3959 3552 2983 2315 1810 1077 408 -172 -964 -1560 -2165 -2846 -3325 -3843 -4309
1423 -4309 -4654 -5005 -5274 -5439 -5554 -5614 -5588 -5466 -5331 -5088 -4746 -4409 -3969 -3479 -2988 -2428 -1810 -1206 -586 111
1443 111 700 1326 1987 2483 3031 3599 3910 4351 4734 4899 5199 5326 5321 5369 5277 5077 4900 4606 4224 3846 3450
$$ packed form
1302C701o78q51o97q05q96p19q38p78o89p24n54n89n20l52m02k06j27j50J09J03
1322f662J45L84L16M12N90N32O07P35O89O87Q70P49P15Q72O37O74P70M30N74N65
1342E291K88M09K82Q1J64k5j28j18k84l48l99m78n53n85n95o82p02o96p83p39
1362f00o94p36o99n88o26n34l79n23l18j44l32J7M3j18L20J98J59N68L44M52P03
1383c487M45O74P36N89P75P10O46P28O23O03N88M62M65M35L06K91J94P8R5j05
1403E851j41j39l53l14l64n81m07n69o68n05p33o69n80p92n96o05o81m79n18m66
1423d309l45l51k69j65j15o0K6J22J35K43L42L37M40M90M91N60O18O04O20O97
1443A11N89O26O61M96N48N68L11M41L83J65L00J27nM8r2k00j77k94l82l78l96
$$ plain form
1464 3450 2887 2406 1902 1224 699 83 -607 -1115 -1738 -2342 -2781 -3304 -3755 -4060 -4410 -4673 -4859 -4996 -5112 -5070
1484 -5070 -5024 -4940 -4683 -4450 -4174 -3737 -3389 -2921 -2392 -1906 -1345 -765 -182 377 982 1536 2001 2568 3024 3414
1504 3414 3859 4112 4355 4662 4750 4846 4905 4799 4703 4573 4305 4015 3735 3331 2896 2510 1967 1448 973 339 -196
1525 -196 -710 -1322 -1786 -2283 -2778 -3161 -3558 -3878 -4127 -4335 -4490 -4623 -4619 -4629 -4581 -4386 -4230 -3981 -3629 -3358 -2935
1546 -2935 -2460 -2064 -1557 -994 -532 20 588 1023 1566 2095 2440 2932 3339 3562 3940 4113 4225 4463 4421 4417 4433
1567 4433 4225 4091 3878 3586 3282 2926 2539 2096 1649 1181 634 164 -347 -910 -1332 -1822 -2314 -2642 -3022 -3419
1587 -3419 -3633 -3871 -4090 -4139 -4261 -4309 -4186 -4162 -4015 -3736 -3596 -3262 -2891 -2602 -2120 -1705 -1275 -734 -327 211 690
1608 690 1125 1630 2018 2440 2851 3105 3467 3698 3819 4024 4038 4061 4112 3970 3846 3738 3443 3194 2939 2532 2172
$$ packed form
1464C450n63m81n04o78n25o16o90n08o23o04m39n23m51l05l50k63j86j37j16M2
1484e070M6Q4K57K33K76M37L48M68N29M86N61N80N83N59O05N54M65N67M56L90
1504C414M45K53K43L07Q8R6N9j06r6j30k68k90k80m04m35l86n43n19m75o34n35
1525a96n14o12m64m97m95l83l97l20k49k08j55j33Mj0M8J95J56K49L52K71M23
1546b935M75L96N07N63M62N52N68M35N43N29L45M92M07K23L78J73J12K38m2mJ6
1567D433k08j34k13k92l04l56l87m43m47m68n47m70n11n63m22m90m92l28l80l97
1587c419k14k38k19m9j22m8J23K4J47K79J40L34L71K89M82M15M30N41M07N38M79
1608F90M35N05L88M22M11K54L62K31J21K05J4K3N1j42j24j08k95k49k55m07l60
$$ plain form
1629 2172 1803 1289 886 441 -109 -543 -1003 -1489 -1865 -2279 -2661 -2959 -3250 -3502 -3716 -3817 -3942 -3995 -3925 -3951 -3804
1650 -3804 -3591 -3486 -3136 -2826 -2590 -2103 -1779 -1403 -867 -517 -36 468 833 1304 1723 2072 2488 2785 3071 3345
1670 3345 3488 3702 3779 3795 3866 3745 3646 3570 3277 3086 2868 2415 2197 1811 1272 1044 491 11 -235 -895 -1245
1691 -1245 -1519 -2121 -2288 -2618 -3056 -3100 -3408 -3603 -3557 -3793 -3712 -3632 -3697 -3404 -3285 -3126 -2711 -2568 -2208 -1748 -1557
1712 -1557 -1022 -589 -324 295 616 940 1567 1746 2107 2638 2660 3055 3337 3260 3603 3616 3492 3718 3467 3347 3345
1733 3345 2922 2816 2562 2098 1948 1465 1045 791 184 -112 -478 -1061 -1233 -1697 -2127 -2215 -2697 -2931 -2961 -3376
1753 -3376 -3384 -3376 -3664 -3440 -3401 -3482 -3082 -3040 -2868 -2382 -2307 -1903 -1440 -1299 -742 -362 -86 495 770 1154 1652 1819
1775 1819 2249 2546 2690 3055 3116 3231 3436 3333 3420 3415 3190 3194 2981 2690 2597 2211 1893 1666 1174 865 548 16
$$ packed form
1629B172l69n14m03m45n50m34m60m86l76m14l82k98k91k52k14j01j25n3P0k6J47
1650c804K13J05L50L10K36M87L24L76N36L50M81N04L65M71M19L49M16K97K86K74
1670C345J43K14P7J6P1j21r9p6k93j91k18m53k18l86n39k28n53m80k46o60l50
1691a245k74o02j67l30m38m4l08j95M6k36Q1Q0o5K93J19J59M15J43L60M60J91
1712a557N35M33K65O19L21L24O27J79L61N31K2L95K82p7L43J3j24K26k51j20k
1733C345m23j06k54m64j50m83m20k54o07k96l66n83j72m64m30q8m82k34l0m15
1753c376qQk88K24L9q1M00M2J72M86P5M04M63J41N57L80K76N81K75L84M98J67
1775A819M30K97J44L65O1J15K05j03Q7nk25Mk13k91r3l86l18k27m92l09l17n32
$$ plain form
1797 16 -265 -649 -1123 -1347 -1743 -2087 -2287 -2628 -2810 -2969 -3204 -3210 -3316 -3342 -3245 -3265 -3060 -2909 -2782 -2427 -2258 -1966
1819 -1966 -1533 -1326 -896 -498 -246 271 608 919 1380 1653 1942 2295 2479 2714 2919 3000 3149 3193 3204 3214 3114
1840 3114 3041 2891 2658 2519 2209 1900 1699 1256 949 674 133 -100 -443 -962 -1110 -1527 -1905 -2017 -2409 -2627
1860 -2627 -2699 -2993 -3009 -3059 -3188 -3061 -3069 -2979 -2765 -2687 -2421 -2164 -1998 -1597 -1333 -1046 -592 -351 44 482 698 1123
1882 1123 1479 1647 2067 2249 2384 2752 2755 2878 3091 2934 3039 3046 2786 2840 2634 2347 2288 1913 1637 1437 974 744
1904 744 408 -48 -249 -666 -1021 -1234 -1633 -1866 -2061 -2408 -2495 -2665 -2882 -2819 -2951 -2994 -2817 -2879 -2728 -2484 -2465 -2145
1926 -2145 -1884 -1771 -1321 -1080 -849 -350 -145 205 631 828 1211 1519 1704 2039 2215 2384 2604 2660 2769 2831
1946 2831 2800 2844 2750 2643 2567 2329 2155 1979 1636 1427 1166 776 534 199 -190 -398 -783 -1121 -1288 -1675 -1898
$$ packed form
1797A6k81l84m74k24l96l44k00l41j82j59k35oj06k6R7k0K05J51J27L55J69K92
1819a966M33K07M30L98K52N17L37L11M61K73K89L53J84K35K05Q1J49M4J1J0j00
1840C114p3j50k33j39l10l09k01m43l07k75n41k33l43n19j48m17l78j12l92k18
1860b627p2k94j6n0j29J27qR0K14P8K66K57J66M01K64K87M54K41L95M38K16M25
1882A123L56J68M20J82J35L68LJ23K13j57J05Pk60N4k06k87n9l75k76k00m63k30
1904G44l36m56k01m17l55k13l99k33j95l47q7j70k17O3j32m3J77o2J51K44J9L20
1926b145K61J13M50K41K31M99K05L50M26J97L83L08J85L35J76J69K20N6J09O2
1946B831l1M4r4j07p6k38j74j76l43k09k61l90k42l35l89k08l85l38j67l87k23
$$ plain form
1967 -1898 -2042 -2349 -2453 -2554 -2726 -2692 -2756 -2764 -2651 -2604 -2459 -2291 -2136 -1897 -1687 -1440 -1128 -865 -536 -230 62
1988 62 406 706 984 1302 1529 1764 2018 2150 2315 2492 2525 2614 2675 2604 2625 2539 2381 2305 2080 1866 1674 1380 1142
2011 1142 861 552 270 -47 -340 -650 -954 -1188 -1472 -1708 -1897 -2130 -2261 -2384 -2510 -2526 -2551 -2581 -2497 -2442 -2364 -2168
2033 -2168 -2040 -1873 -1605 -1395 -1164 -846 -612 -308 27 268 592 879 1111 1390 1592 1810 1993 2131 2289 2345
2053 2345 2431 2485 2432 2460 2397 2225 2175 1983 1764 1629 1345 1078 899 564 274 72 -281 -536 -759 -1080 -1290 -1489
2075 -1489 -1755 -1891 -2046 -2200 -2255 -2342 -2380 -2361 -2352 -2278 -2205 -2085 -1923 -1809 -1572 -1362 -1172 -867 -649 -389 -59 146
2097 146 434 735 914 1190 1428 1566 1796 1936 2023 2172 2234 2246 2299 2252 2202 2158 2007 1879 1743 1532 1358 1130
2119 1130 888 675 395 175 -98 -386 -582 -865 -1087 -1254 -1529 -1656 -1794 -1996 -2013 -2105 -2202 -2135 -2169 -2148 -2020 -1976
$$ packed form
1967a898j44l07j04j01j72L4o4qJ13M7J45J68J55K39K10K47L12K63L29L06K92
1988F2L44L00K78L18K27K35K54J32J65J77L3Q9O1p1K1q6j58p6k25k14j92k94k38
2011A142k81l09k82l17k93l10l04k34k84k36j89k33j31j23j26j6k5l0Q4N5P8J96
2033b168J28J67K68K10K31L18K34L04L35K41L24K87K32K79K02K18J83J38J58N6
2053B345Q6N4n3K8o3j72n0j92k19j35k84k67j79l35k90k02l53k55k23l21k10j99
2075a489k66j36j55j54n5q7l8J9RP4P3J20J62J14K37K10J90L05K18K60L30K05
2097A46K88L01J79K76K38J38K30J40Q7J49O2J2N3m7n0m4j51j28j36k11j74k28
2119A130k42k13k80k20k73k88j96k83k22j67k75j27j38k02j7r2r7O7l4K1J28M4
$$ plain form
2141 -1976 -1854 -1674 -1554 -1358 -1131 -949 -700 -436 -230 40 287 510 768 961 1178 1363 1521 1693 1801 1923
2161 1923 2001 2017 2098 2082 2017 2018 1880 1769 1681 1478 1320 1159 910 731 496 244 37 -201 -441 -667 -863 -1084
2183 -1084 -1273 -1427 -1590 -1716 -1801 -1906 -1944 -1950 -1988 -1967 -1899 -1850 -1748 -1597 -1503 -1318 -1130 -989 -738 -517 -337 -60 142
2206 142 339 607 771 968 1183 1293 1490 1592 1693 1819 1837 1891 1891 1854 1850 1754 1665 1586 1397 1286 1131 908 754
2229 754 547 288 134 -99 -346 -494 -735 -945 -1056 -1263 -1412 -1484 -1649 -1706 -1732 -1823 -1794 -1797 -1788 -1686 -1636 -1511 -1390
2252 -1390 -1264 -1066 -940 -749 -520 -377 -119 88 252 503 665 811 1045 1163 1286 1461 1513 1601 1702 1685 1726
2273 1726 1756 1668 1643 1580 1420 1375 1238 1057 948 745 551 410 170 -14 -197 -418 -584 -781 -952 -1093 -1234
2294 -1234 -1350 -1447 -1533 -1582 -1637 -1651 -1633 -1625 -1591 -1494 -1437 -1331 -1164 -1075 -904 -702 -584 -362 -158 -44 207 369 499 748
$$ packed form
2141a976J22J80J20J96K27J82K49K64K06K70K47K23K58J93K17J85J58J72J08J22
2161A923P8J6Q1j6o5Jj38j11q8k03j58j61k49j79k35k52k07k38k40k26j96k21
2183a084j89j54j63j26q5j05l8ol8K1O8M9J02J51R4J85J88J41K51K21J80K77K02
2206A42J97K68J64J97K15J10J97J02J01J26J8N4%l7mr6q9p9j89j11j55k23j54
2229G54k07k59j54k33k47j48k41k10j11k07j49p2j65n7k6r1K9lRJ02N0J25J21
2252a390J26J98J26J91K29J43K58K07J64K51J62J46K34J18J23J75N2Q8J01j7M1
2273A726L0q8k5o3j60m5j37j81j09k03j94j41k40j84j83k21j66j97j71j41j41
2294a234j16r7q6m9n5j4J8QL4R7N7J06J67Q9J71K02J18K22K04J14K51J62J30K49
$$ plain form
2318 748 847 995 1200 1239 1385 1484 1499 1572 1610 1571 1587 1532 1458 1389 1283 1169 1043 885 753 577 369 231 21 -173
2342 -173 -308 -545 -691 -822 -1037 -1080 -1225 -1369 -1358 -1480 -1543 -1469 -1575 -1520 -1441 -1478 -1336 -1240 -1198 -1006 -900 -774 -552
2365 -552 -438 -262 -50 80 267 442 581 770 903 1021 1178 1243 1349 1431 1419 1507 1491 1436 1487 1357 1296 1265 1063
2388 1063 988 891 666 578 396 169 99 -124 -310 -409 -634 -775 -882 -1034 -1128 -1226 -1330 -1363 -1416 -1457 -1445 -1461 -1430 -1382
2412 -1382 -1326 -1224 -1138 -1028 -860 -764 -606 -408 -299 -99 71 194 412 556 677 878 960 1070 1199 1248 1327 1384
2434 1384 1389 1405 1396 1354 1302 1239 1154 1051 961 827 698 573 407 256 116 -77 -228 -368 -535 -674 -791 -928 -1031
2457 -1031 -1113 -1215 -1275 -1308 -1374 -1365 -1373 -1372 -1315 -1267 -1181 -1076 -979 -860 -747 -594 -449 -302 -127 3 157 349 455 606
2481 606 775 839 978 1086 1129 1226 1271 1272 1327 1303 1267 1256 1188 1108 1056 947 840 742 585 461 323 145 48 -128 -275
$$ packed form
2318G48R9J48K05L9J46R9J5P3L8l9J6n5p4o9j06j14j26j58j32j76k08j38k10j94
2342a73j35k37j46j31k15m3j45j44J1j22o3P4j06N5P9l7J42R6M2J92J06J26K22
2365e52J14J76K12J30J87J75J39J89J33J18J57O5J06Q2j2Q8j6n5N1j30o1l1k02
2388A063p5r7k25q8j82k27p0k23j86r9k25j41j07j52r4r8j04l3n3m1J2j6L1M8
2412a382N6J02Q6J10J68R6J58J98J09K00J70J23K18J44J21K01Q2J10J29M9P9N7
2434A384NJ6rm2n2o3q5j03r0j34j29j25j66j51j40j93j51j40j67j39j17j37j03
2457a031q2j02o0l3o6RqJN7M8Q6J05R7J19J13J53J45J47J75J30J54J92J06J51
2481F06J69O4J39J08M3R7M5JN5k4l6j1o8q0n2j09j07r8j57j24j38j78r7j76j47
$$ plain form
2506 -275 -402 -568 -668 -802 -923 -966 -1094 -1163 -1165 -1274 -1256 -1254 -1293 -1197 -1173 -1149 -1005 -941 -853 -685 -610 -461 -287 -198 -33
2531 -33 122 220 386 524 621 783 863 950 1065 1091 1159 1203 1188 1237 1203 1172 1177 1075 1020 962 818 760 637 466 399 215
2557 215 71 -29 -213 -323 -426 -605 -674 -795 -932 -965 -1047 -1132 -1128 -1177 -1204 -1155 -1174 -1127 -1044 -1005 -895 -805 -714 -580 -481
2582 -481 -346 -199 -96 64 179 300 475 539 685 811 847 968 1023 1040 1142 1144 1121 1163 1125 1084 1082 959 892 827 684
2607 684 615 498 340 242 104 -45 -162 -305 -411 -529 -649 -741 -843 -940 -967 -1069 -1083 -1099 -1154 -1093 -1092 -1098 -986 -964 -887
2632 -887 -750 -717 -589 -458 -387 -227 -102 -13 165 262 368 520 605 699 817 862 951 989 1019 1072 1072 1070 1066 1002 998 934 849
2659 849 804 670 579 515 334 252 158 -40 -103 -247 -401 -436 -588 -695 -743 -869 -903 -949 -1030 -1019 -1055 -1064 -1017 -1019 -964 -892 -864
2686 -864 -759 -672 -604 -443 -374 -262 -107 -57 97 233 275 457 549 583 756 778 820 952 903 966 1024 938 1000 974 899
$$ packed form
2506b75j27j66j00j34j21m3j28o9kj09J8Kl9R6K4K4J44O4Q8J68P5J49J74Q9J65
2531c3J55R8J66J38R7J62Q0Q7J15K6O8M4j5M9l4l1Nj02n5n8j44n8j23j71o7j84
2557B15j44j00j84j10j03j79o9j21j37l3q2q5Mm9k7M9j9M7Q3L9J10R0R1J34R9
2582d81J35J47J03J60J15J21J75O4J46J26L6J21N5J7J02Kk3M2l8m1kj23o7o5j43
2607F84o9j17j58r8j38j49j17j43j06j18j20r2j02r7k7j02j4j6n5O1JoJ12K2P7
2632h87J37L3J28J31P1J60J25Q9J78R7J06J52Q5R4J18M5Q9L8L0N3%kmo4mo4q5
2659H49m5j34r1o4j81q2r4j98o3j44j54l5j52j07m8j26l4m6q1J1l6rM7kN5P2K8
2686h64J05Q7O8J61O9J12J55N0J54J36M2J82R2L4J73K2M2J32m9O3N8q6O2k6p5
$$ plain form
2711 899 918 807 735 692 555 481 380 234 170 29 -97 -155 -315 -394 -474 -618 -660 -741 -849 -836 -922 -977 -912 -996 -978
2736 -978 -889 -952 -838 -775 -774 -617 -571 -500 -333 -295 -171 -26 17 174 269 345 495 533 633 731 750 839 878 885 942 932 903
2763 903 950 877 843 829 704 677 602 448 408 289 145 101 -43 -142 -206 -363 -425 -513 -635 -663 -752 -815 -815 -882 -880 -881 -913 -858
2791 -858 -848 -818 -728 -709 -622 -527 -484 -345 -273 -188 -53 15 113 248 304 404 519 552 652 723 749 821 848 851 885 861 860 839
2819 839 788 774 677 624 565 444 381 284 156 119 -25 -113 -167 -319 -365 -437 -556 -583 -651 -740 -725 -795 -842 -797 -826 -814 -765
2846 -765 -773 -715 -660 -625 -518 -473 -403 -282 -235 -114 -22 35 175 248 307 443 466 548 641 623 717 752 716 809 773 735 801 706
2874 706 689 674 557 530 461 343 308 201 108 68 -55 -133 -197 -327 -348 -431 -525 -531 -641 -678 -660 -753 -732 -723 -781 -693 -690 -708
2902 -708 -604 -604 -554 -424 -424 -314 -205 -200 -57 13 68 213 251 312 433 435 517 593 591 669 680 687 723 701 689 689 625 610 578 477
$$ packed form
2711H99J9j11p2m3j37p4j01j46o4j41j26n8j60p9q0j44m2q1j08J3q6n5O5q4J8
2736i78Q9o3J14O3JJ57M6P1J67L8J24J45M3J57R5P6J50L8J00R8J9Q9L9PN7j0k9
2763I03M7p3l4j4j25k7p5j54m0j19j44m4j44r9o4j57o2q8j22k8q9o3%o7Kjl2N5
2791h58J0L0R0J9Q7R5M3J39P2Q5J35O8R8J35N6J00J15L3J00P1K6P2K7LL4k4jk1
2819H39n1j4r7n3n9j21o3r7j28l7j44q8n4j52m6p2j19k7o8q9J5p0m7M5k9J2M9
2846g65qN8N5L5J07M5P0J21M7J21R2N7J40P3N9J36K3Q2R3j8R4L5l6R3l6l8O6r5
2874G06j7j5j17k7o9j18l5j07r3m0j23p8o4j30k1q3r4oj10l7J8r3K1Rn8Q8Lj8
2902g08J04%N0J30%J10J09NJ43P0N5J45L8O1J21KQ2P6kP8J1PL6k2j2%o4j5l2j01
$$ plain form
2932 477 465 378 286 269 139 74 42 -101 -137 -194 -334 -337 -440 -533 -510 -612 -649 -634 -699 -693 -668 -691 -649 -630 -622 -556 -529 -473 -391
2961 -391 -344 -241 -181 -110 -17 56 132 212 266 349 423 448 526 569 578 643 653 643 702 664 641 641 580 561 506 426 379 320 245 179
2991 179 101 30 -46 -113 -191 -261 -311 -398 -458 -485 -548 -600 -617 -639 -653 -653 -657 -641 -612 -593 -557 -498 -449 -390 -331 -269 -178 -119 -40 29 107
3022 107 169 226 308 360 409 479 505 534 589 598 614 627 613 612 585 542 535 473 416 381 304 256 199 114 61 -3 -90 -149 -219 -280 -342
3053 -342 -393 -439 -494 -521 -540 -563 -580 -584 -595 -582 -554 -557 -505 -468 -440 -359 -322 -276 -172 -140 -78 15 53 126 198 232 304 367 383 440
3083 440 478 490 533 556 550 552 546 532 514 480 440 410 356 308 255 201 145 72 22 -50 -115 -153 -217 -287 -315 -381 -416 -439 -494 -501 -516 -540
3115 -540 -526 -523 -525 -489 -468 -445 -399 -362 -316 -265 -201 -163 -88 -38 19 80 129 191 237 290 324 372 423 443 463 494 494 509 508 477 474 455
3147 455 405 395 350 289 255 202 134 99 38 -24 -61 -125 -187 -235 -282 -329 -352 -398 -411 -443 -470 -468 -472 -470 -467 -464 -436 -417 -390 -349 -312 -270
$$ packed form
2932D77j2q7r2j7j30o5l2j43l6n7j40lj03r3K3j02l7J5o5OK5k3M2J9QO6K7N6Q2
2961c91M7J03O0P1R3P3P6Q0N4Q3P4K5P8M3RO5J0j0N9l8k3%o1j9n5q0m7n9p5o6
2991A79p8p1p6o7p8p0n0q7o0k7o3n2j7k2j4%mJ6K9J9L6N9M9N9N9O2R1N9P9O9P8
3022A07O2N7Q2N2M9P0K6K9N5RJ6J3j4jk7m3po2n7l5p7m8n7q5n3o4q7n9p0o1o2
3053c42n1m6n5k7j9k3j7mj1J3K8lN2L7K8Q1L7M6J04L2O2R3L8P3P2L4P2O3J6N7
3083D40L8J2M3K3oKoj4j8l4m0l0n4m8n3n4n6p3n0p2o5l8o4p0k8o6l5k3n5pj5k4
3115e40J4LkL6K1K3M6L7M6N1O4L8P5N0N7O1M9O2M6N3L4M8N1K0K0L1%J5jl1lj9
3147D55n0j0m5o1l4n3o8l5o1o2l7o4o2m8m7m7k3m6j3l2k7KmKLLK8J9K7M1L7M2
$$ plain form
3179 -270 -216 -183 -111 -71 0 52 90 149 190 240 283 322 347 392 412 420 432 456 430 432 413 386 365 339 305 277 232 182 151 93 34
3210 34 1 -52 -102 -156 -184 -239 -265 -291 -337 -345 -372 -402 -405 -421 -429 -411 -398 -401 -371 -330 -314 -280 -248 -207 -161 -108 -67 -20 29 54 115 158
3242 158 193 232 270 289 322 337 335 372 366 358 371 347 326 318 288 262 243 202 176 139 92 47 13 -17 -69 -102 -139 -184 -200 -233 -283 -289
3274 -289 -319 -329 -338 -361 -364 -353 -345 -342 -316 -309 -272 -245 -215 -177 -130 -109 -59 -28 -1 50 80 109 151 191 210 243 264 288 300 306 316 315 320 305
3308 305 306 293 262 253 223 198 168 149 104 68 29 -9 -49 -74 -116 -152 -167 -213 -240 -250 -282 -291 -285 -329 -302 -308 -313 -281 -287 -267 -232 -225 -207 -158
3342 -158 -129 -103 -51 -40 -3 48 62 113 140 159 204 223 255 268 263 298 290 286 295 261 277 273 229 221 198 151 155 113 66 61 -7 -36 -39 -115
3376 -115 -108 -139 -199 -193 -212 -250 -241 -282 -290 -270 -295 -284 -285 -289 -256 -244 -231 -197 -186 -140 -108 -96 -45 -27 3 54 64 95 150 135 191 211 199
3409 199 244 245 234 258 235 235 246 205 203 201 158 160 135 100 91 56 26 11 -20 -43 -81 -122 -111 -150 -161 -177 -220 -223 -222 -247 -233 -245 -265 -227
$$ packed form
3179b70N4L3P2M0P1N2L8N9M1N0M3L9K5M5K0QJ2K4k6Kj9k7k1k6l4k8m5n0l1n8n9
3210C4l3n3n0n4k8n5k6k6m6qk7l0lj6qJ8J3lL0M1J6L4L2M1M6N3M1M7M9K5O1M3
3242A58L5L9L8J9L3J5kL7oqJ3k4k1ql0k6j9m1k6l7m7m5l4l0n2l3l7m5j6l3n0o
3274b89l0j0rk3lJ1QLK6PL7K7L0L8M7K1N0L1K7N1L0K9M2M0J9L3K1K4J2OJ0jNj5
3308C05Jj3l1rl0k5l0j9m5l6l9l8m0k5m2l6j5m6k7j0l2rOm4K7onL2oK0L5PJ8M9
3342a58K9K6N2J1L7N1J4N1K7J9M5J9L2J3nL5qmRl4J6mm4qk3m7Mm2m7no8k9lp6
3376a15Pl1o0Oj9l8Rm1qK0k5J1jmL3J2J3L4J1M6L2J2N1J8L0N1J0L1N5j5N6K0j2
3409A99M5Jj1K4k3%J1m1kkm3Kk5l5rl5l0j5l1k3l8m1J1l9j1j6m3lJk5J4j2k0L8
$$ plain form
3443 -227 -239 -229 -192 -201 -167 -129 -130 -91 -60 -51 -23 13 22 58 81 98 120 145 160 165 178 190 191 200 196 190 201 175 167 174 134 133 129 90 90 65 42
3480 42 27 1 -25 -47 -82 -85 -122 -143 -151 -180 -186 -189 -205 -202 -214 -205 -199 -216 -182 -161 -163 -140 -105 -112 -60 -46 -51 7 4 27 65 52 76 110 103 128
3516 128 154 146 171 164 173 188 172 183 195 170 188 155 140 153 118 94 93 32 31 17 -33 -31 -69 -99 -94 -132 -137 -137 -184 -172 -168 -214 -181 -188 -195 -163
3552 -163 -170 -158 -125 -143 -107 -79 -86 -53 -47 -29 6 2 49 66 69 99 96 118 159 139 157 200 162 179 197 163 181 177 140 168 137 113 114 80
3586 80 64 47 1 2 -33 -54 -55 -76 -103 -102 -137 -133 -144 -167 -153 -177 -179 -155 -174 -157 -138 -165 -128 -109 -119 -83 -67 -64 -38 -37 -11 16 29 48
3620 48 73 69 105 113 115 127 145 143 157 155 162 164 143 153 132 135 124 92 91 71 33 40 16 -19 -16 -40 -56 -60 -92 -95 -108 -126 -120 -138 -144 -156 -155 -147 -142
3659 -142 -141 -134 -126 -133 -114 -104 -85 -74 -56 -41 -18 -16 17 8 28 55 67 83 107 92 118 129 106 142 136 133 132 133 119 130 109 106 95 76 72 48
3695 48 37 16 -6 -11 -37 -55 -58 -85 -87 -91 -128 -118 -122 -152 -144 -138 -149 -132 -151 -150 -116 -117 -108 -90 -93 -54 -55 -57 -24 -14 2 27 41 58 76 90 109
$$ packed form
3443b27j2J0L7rL4L8jL9L1RK8L6RL6K3J7K2K5J5NJ3J2JRmoJ1k6qPm0jml9%k5k3
3480D2j5k6k6k2l5ll7k1qk9olj6Lj2ROj7L4K1kK3L5pN2J4nN8lK3L8j3K4L4pK5
3516A28K6qK5pRJ5j6J1J2k5J8l3j5J3l5k4jo1jj4n0Kl8l0Nl8n%m7J2Mm6L3ppL2
3552a63pJ2L3j8L6K8pL3OJ8L5mM7J7LL0lK2M1k0J8M3l8J7J8l4J8ml7K8l1k4Jl4
3586H0j6j7m6Jl5k1jk1k7Jl5Mj1k3J4k4kK4j9J7J9k7L7J9j0L6J6LK6JK6K7J3J9
3620D8K5mL6QKJ2J8kJ4kPKk1J0k1Lj1l2jk0l8Pk4l5Lk4j6ml2lj3j8Oj8oj2JQN
3659a42JPQpJ9J0J9J1J8J5K3KL3rK0K7J2J6K4j5K6J1k3L6oljJj4J1k1lj1j9mk4
3695D8j1k1k2nk6j8lk7kml7J0ml0QOj1J7j9JL4jRJ8lL9jkL3J0J6K5J4J7J8J4J9
$$ plain form
3732 109 106 127 137 136 149 149 138 137 142 128 148 124 110 95 72 68 54 37 20 3 -19 -22 -42 -74 -69 -87 -106 -108 -126 -142 -147 -140 -138 -144 -137 -138 -134 -114
3770 -114 -126 -113 -92 -86 -73 -52 -50 -19 6 2 25 51 53 79 100 87 119 122 123 135 132 135 131 122 127 118 111 101 84 72 58 50 35 25 -3 -8 -31
3807 -31 -42 -49 -76 -76 -90 -99 -94 -114 -116 -116 -117 -133 -122 -119 -113 -104 -96 -89 -77 -80 -70 -48 -35 -16 -11 4 25 30 46 53 55 76 74 91 88 96 106 93 110 107 82
3848 82 81 95 70 71 59 52 44 35 16 12 -6 -15 -18 -27 -39 -45 -58 -68 -87 -95 -97 -101 -95 -100 -112 -97 -108 -98 -84 -97 -83 -65 -68 -42 -44 -40 -17 -11 -7 14
3888 14 26 28 46 48 49 61 68 73 70 86 76 79 87 86 74 82 78 62 67 48 41 28 15 15 7 -9 -9 -23 -34 -33 -46 -62 -55 -81 -73 -78 -109 -94 -88 -97 -82
3929 -82 -83 -84 -72 -66 -63 -51 -51 -39 -33 -20 -14 -4 -1 17 37 39 66 55 68 67 69 83 76 73 85 77 99 82 70 74 61 54 36 37 37 15 6 -4 -4 -20
3969 -20 -38 -44 -60 -57 -55 -71 -87 -77 -92 -87 -87 -80 -85 -77 -74 -65 -57 -56 -48 -42 -33 -25 -14 1 -2 14 26 23 48 48 40 71 71 53 73 70 59 70 63 57 75 47
4011 47 60 64 27 37 30 -3 6 -3 -18 -18 -32 -32 -41 -49 -47 -68 -71 -59 -73 -71 -72 -74 -66 -64 -64 -47 -46 -48 -24 -30 -31 -18 -15 -6 6 15 26 22 27 51 47 54 71 59
$$ packed form
3732A09lK1J0jJ3%j1jNj4K0k4j4j5k3mj4j7j7j7k2lk0l2Nj8j9kj8j6nPKoPjMK0
3770a14j2J3K1OJ3K1KL1K5mK3K6KK6K1j3L2LJJ2lLmrNrpj0j7j2j4qj5j0k8nk3
3807c1j1pk7%j4rNk0k%jj6J1LORQPJ2lJ0K2J3J9NJ5K1NJ6PKK1kJ7lQJ0j3J7lk5
3848H2jJ4k5Jj2pqrj9mj8rlrj2oj3j0j9qkmOnj2J5j1J0J4j3J4J8lK6kMK3OMK1
3888A4J2KJ8KJJ2PNlJ6j0LQjj2Qmj6Nj9pj3j3%qj6%j4j1Jj3j6Pk6Qnl1J5OrJ5
3929h2jjJ2OLJ2%J2OJ3OJ0LJ8K0KK7j1J3jKJ4plJ2qK2j7j2Mj3pj8J%k2rj0%j6
3969b0j8oj6LKj6j6J0j5N%PnQLRQJQORQJ1J5lJ6J2lK5%qL1%j8K0lj1J1poJ8k8
4011D7J3Ml7J0pl3Rrj5%j4%rqKk1lJ2j4KjkQK%J7JkK4ojJ3LRJ2RJ1mNK4mPJ7j2
$$ plain form
4055 59 57 61 59 62 62 59 52 48 45 38 39 37 22 6 10 -5 -19 -9 -37 -29 -29 -48 -46 -46 -67 -57 -57 -64 -53 -66 -54 -54 -54 -54 -38 -39 -44 -33 -40 -15 -13 -15 -3 6
4099 6 12 15 19 31 27 35 42 39 56 53 48 42 50 61 56 53 49 38 39 33 30 11 6 14 1 -5 -11 -21 -10 -9 -31 -30 -33 -37 -44 -38 -56 -43 -46 -59 -41 -46 -61 -36 -26
4144 -26 -40 -35 -36 -22 1 -5 1 3 2 8 16 32 24 27 39 36 35 43 43 47 36 38 26 38 20 26 26 16 24 11 -12 -1 -15 -19 -18 -28 -23 -23 -38 -25 -32 -37 -32
4187 -32 -29 -35 -37 -43 -20 -38 -31 -37 -19 -23 -17 -14 -7 3 -11 10 18 11 30 28 29 30 23 34 36 31 35 33 33 31 19 11 14 17 5 1 -11 -6 -13 -7 -12 -18 -34 -27 -36 -28 -32 -33
4235 -33 -29 -26 -38 -26 -29 -33 -15 -29 -23 -13 -15 3 3 -8 1 8 9 24 26 25 33 30 39 30 28 32 34 26 28 25 24 19 21 19 13 5 5 1 -8 -11 -13 -14 -22 -26 -15 -30 -28 -25 -36
4284 -36 -33 -32 -30 -34 -25 -28 -35 -17 -32 -17 -12 -2 -4 -8 -1 3 0 16 22 23 30 22 35 26 25 36 43 31 30 23 30 27 29 35 23 17 21 10 7 12 -5 -13 -11 -17 -11 -20 -24 -20 -25
4333 -25 -36 -28 -31 -47 -36 -45 -47 -38 -53 -42 -51 -35 -28 -26 -20 -9 -21 -12 -5 -3 2 -7 20 25 15 19 41 31 43 30 33 54 46 46 53 53 47 46 31 45 40 38 29
4376 29 24 21 -2 -18 2 -14 -28 -22 -42 -35 -34 -48 -50 -54 -73 -43 -62 -67 -67 -57 -58 -51 -48 -56 -36 -51 -33 -33 -34 -7 -18 -6 8 2 29 25 22 45 42 62
$$ packed form
4055E9kMkL%lpmlpJkj5j6Mj5j4J0k8Q%j9K%k1J0%pJ1j3J2%%%J6jnJ1pK5KkJ2R
4099FOLMJ2mQPlJ7lnoQJ1nlmj1Jolj9nQj3ooj0J1Jk2JlmpOj8J3lj3J8nj5K5J0
4144b6j4NjJ4K3oOKjOQJ6qLJ2ljQ%Mj1Kj2J2j8O%j0Qj3k3J1j4mJj0N%j5J3pnN
4187c2LokoK3j8PoJ8mOLPJ0j4K1QpJ9kJJpJ1KnMk%kj2qLLj2mj2NpOnoj6PrQmj
4235c3MLj2J2lmJ8j4OJ0kJ8%j1RPJJ5KjQlRrkMKqKljnKkoq%mrlkjqmJ1j5KLj1
4284c6LJKmRlpJ8j5J5NJ0kmPMlJ6OJPqJ3rjJ1Pj2jpPlKOj2oMj1lNj7qKoOrmMn
4333b5j1Qlj6J1rkRj5J1rJ6PKOJ1j2RPKNrK7Nj0MK2j0J2j3LK1q%P%ojj5J4nkr
4376B9nlk3j6K0j6j4Ok0PJj4kmj9L0j9n%J0jPLqK0j5J8%jK7j1J2J4oK7mlK3lK0
$$ plain form
4416 62 64 59 67 79 73 71 68 61 75 61 56 45 34 40 23 16 9 7 -10 -23 -23 -35 -34 -37 -62 -61 -62 -69 -77 -84 -69 -83 -67 -70 -69 -69 -68 -59 -51 -58 -36 -32 -29 -18 5
4461 5 3 8 30 31 40 51 60 49 61 76 68 68 74 84 70 91 65 70 56 61 49 30 24 32 6 1 -1 -13 -14 -35 -32 -36 -57 -60 -64 -68 -73 -71 -81 -82 -81 -74 -72 -69
4505 -69 -76 -58 -56 -50 -44 -39 -33 -17 2 7 1 15 33 36 49 60 55 71 66 69 75 68 70 76 79 84 76 59 67 51 44 48 25 27 22 13 0 -14 -22 -24 -51 -46 -55 -70 -63
4550 -63 -68 -82 -65 -78 -81 -85 -87 -81 -69 -88 -65 -63 -62 -45 -38 -43 -18 -16 -5 19 12 27 43 44 65 70 68 84 84 91 93 91 105 94 91 89 84 86 77 60 51 60 25
4593 25 29 24 -4 -12 -26 -39 -34 -47 -66 -72 -86 -88 -96 -96 -84 -99 -103 -98 -103 -85 -93 -84 -66 -61 -50 -33 -35 -16 -5 0 24 30 45 52 62 73 78 96 90 94 103
4634 103 110 110 99 109 104 93 86 82 82 55 54 46 29 10 7 -21 -13 -32 -49 -58 -69 -81 -97 -91 -108 -104 -110 -100 -105 -108 -104 -111 -103 -88 -78 -75 -60 -59 -48 -25
4674 -25 -24 -8 13 26 36 41 58 60 72 81 79 89 115 94 99 117 99 101 92 85 85 85 77 63 37 24 23 13 7 -13 -28 -39 -51 -60 -76 -77 -88 -99
4712 -99 -103 -102 -114 -110 -115 -122 -115 -106 -100 -92 -103 -79 -58 -62 -53 -38 -20 -5 -7 3 29 41 46 69 71 80 99 94 99 116 108 124 110 99 110 104 99 89 75 66 59
$$ packed form
4416F2KnQJ2oklpJ4j4nj1j1Oj7ppkj7j3%j2Jlk5JjpqpJ5j4J6lJ%JRQpK2MLJ1K3
4461EkNK2JRJ1Rj1J2J5q%OJ0j4K1k6Nj4Nj2j9oQk6nkj2jk1Lmk1lmmnKj0jJPKL
4505f9pJ8KOONOJ6J9NoJ4J8LJ3J1nJ6nLOpKOLNqj7Qj6pMk3Knrj3j4qkk7Nrj5P
4550f3nj4J7j3lmkOJ2j9K3KJJ7PnK5KJ1K4pJ5J6JK1NkJ6%PKkJ4j1lknKrj7rRl5
4593B5Mnk8qj4j3Nj3j9oj4kq%J2j5mNnJ8qRJ8NJ1J7kJ9J1NK4OJ5PJ0J1NJ8oMR
4634A03P%j1J0nj1pm%k7jqj7j9lk8Qj9j7rj1j2j6Oj7MoJ0nlMpQJ5J0LJ5JJ1K3
4674b5JJ6K1J3J0NJ7KJ2RkJ0K6k1NJ8j8Krp%%qj4k6j3jj0ok0j5j1j2rj6jj1j1
4712i9mJj2MnpPROQj1K4K1mRJ5J8J5kJ0K6J2NK3KRJ9nNJ7qJ6j4j1J1onj0j4rp
$$ plain form
4753 59 46 33 15 9 1 -13 -23 -33 -63 -62 -79 -87 -90 -106 -122 -105 -120 -118 -122 -117 -121 -115 -107 -97 -81 -88 -60 -59 -43 -36 -23 0 13 15 37 57 67 73
4791 73 88 100 113 119 121 123 125 124 118 116 117 107 107 99 83 71 63 30 27 23 -14 -34 -55 -58 -58 -85 -85 -103 -114 -116 -115 -138 -135 -127 -130 -129 -126 -124 -107 -123 -109 -73
4833 -73 -69 -64 -45 -20 -12 7 17 44 48 65 77 85 101 116 106 122 134 138 123 136 121 115 109 97 75 84 68 46 43 22 10 7 -17 -28 -51 -67
4869 -67 -76 -85 -97 -112 -118 -122 -129 -132 -142 -136 -140 -126 -124 -113 -94 -103 -78 -67 -53 -33 -24 -18 0 14 45 39 61 72 83 102 96 112 111 110 115 127 125 118 115 113 103
4910 103 87 79 70 58 48 23 20 2 -21 -23 -44 -48 -67 -71 -81 -92 -106 -107 -122 -120 -120 -121 -121 -127 -125 -105 -102 -100 -84 -79 -79 -61 -46 -34 -9 -6 13 17 43
4949 43 54 60 84 91 98 97 111 114 117 114 124 125 112 115 102 88 82 82 61 57 35 22 18 1 -12 -35 -49 -44 -66 -84 -89 -101 -113 -123 -119 -142 -127 -139
4987 -139 -123 -128 -121 -126 -107 -108 -97 -84 -68 -51 -35 -31 -15 6 26 32 44 57 68 79 87 98 110 109 119 117 110 113 114 103 98 96 98 72 68 51 44 37 11
5026 11 2 3 -19 -37 -57 -63 -84 -95 -95 -102 -119 -120 -125 -122 -123 -126 -124 -116 -106 -96 -96 -82 -75 -69 -53 -35 -29 -5 9 25 47 44 61 69 82 93 99 104 106 117 104
$$ packed form
4753E9j3j3j8oqj4j0j0l0Jj7qlj6j6J7j5KmNmOQJ0J6pK8JJ6PJ3K3J3KK2K0J0O
4791G3J5J2J3OKKKjokJj0%qj6j2ql3lml7k0k1l%k7%j8j1kJk3LQlJLKJ7j6J4L6
4833g3MNJ9K5QJ9J0K7MJ7J2QJ6J5j0J6J2Mj5J3j5ooj2k2Rj6k2lk1j2lk4j1k3j6
4869f7rrj2j5omplj0OmJ4KJ1J9rK5J1J4K0ROJ8J4L1oK2J1J1J9oJ6jjNJ2kplkj0
4910A03j6qrj2j0k5lj8k3kk1mj9mj0j1j4jj5K%j%oKK0LKJ6N%J8J5J2K5LJ9MK6
4949D3J1OK4PPjJ4LLlJ0Jj3Lj3j4o%k1mk2j3mj7j3k3j4Nk2j8nj2j2j0Mk3J5j2
4987a39J6nPnJ9jJ1J3J6J7J6MJ6K1K0OJ2J3J1J1QJ1J2jJ0kpLJj1nkKk6mj7ppk6
5026A1rJk2j8k0ok1j1%pj7jnLjlKQJ0J0%J4POJ6J8OK4J4J6K2lJ7QJ3J1ONKJ1j3
$$ plain form
5067 104 113 112 113 118 95 89 80 76 70 66 47 22 21 0 -11 -21 -42 -59 -64 -76 -82 -91 -95 -112 -111 -121 -113 -125 -111 -112 -101 -98 -97 -91 -89 -72 -67 -44 -32 -23 -8
5108 -8 7 13 37 31 40 68 66 84 89 95 106 105 108 104 120 102 97 106 98 81 79 74 68 47 41 32 11 -4 -15 -25 -45 -50 -67 -65 -79 -86 -99 -91 -106 -109 -120 -119
5150 -119 -117 -108 -102 -104 -87 -87 -84 -68 -68 -52 -40 -19 -12 1 31 26 46 57 66 92 87 98 89 106 119 119 117 113 113 115 100 98 89 86 79 57 49 36 18 9 1 -13
5192 -13 -33 -40 -67 -71 -88 -87 -100 -119 -124 -127 -135 -134 -132 -129 -129 -122 -120 -95 -89 -74 -63 -51 -31 -13 -8 17 16 41 53 66 72 84 98 101 120 122 128 123 113 119 126
5233 126 106 114 106 99 91 71 64 51 29 21 -6 -9 -17 -37 -53 -65 -80 -89 -99 -112 -118 -141 -126 -145 -140 -131 -125 -126 -111 -106 -100 -85 -75 -66 -49 -33 -22 -6
5271 -6 0 21 36 45 65 78 85 99 104 115 110 114 125 126 128 116 118 113 100 88 79 80 66 59 29 24 11 -4 -20 -42 -45 -74 -74 -92 -88 -98 -111 -120 -126 -118 -131
5312 -131 -120 -123 -118 -120 -113 -108 -87 -84 -76 -63 -57 -42 -17 -9 6 9 29 37 66 73 83 78 109 95 115 113 122 117 121 114 113 112 100 98 82 71 62 57 36 31 11 -6
5354 -6 -13 -36 -38 -61 -76 -73 -92 -102 -101 -114 -121 -119 -129 -125 -130 -128 -122 -111 -108 -96 -91 -77 -78 -49 -44 -22 -9 -2 24 38 51 60 84 100 102 113 109 123 125 121 127
$$ packed form
5067A04RjJNk3ormomj9k5jk1j1j0k1j7nj2ormj7Jj0Qj2J4jJ1LJOKJ7NK3J2RJ5
5108hJ5OK4oRK8kJ8NOJ1jLmJ6j8nRqj7knok1ork1j5j1j0k0nj7Kj4pj3Qj5lj1J
5150a19KROkJ7%LJ6%J6J2K1PJ3L0nK0J1RK6nJ1rJ7J3%km%Kj5krlpk2qj3j8rqj4
5192a3k0pk7mj7Jj3j9nlqJKL%PKK5OJ5J1J2K0J8NK5jK5J2J3OJ2J4LJ9KOnj0OP
5233A26k0Qqpqk0pj3k2qk7lqk0j6j2j5rj0j3ok3J5j9NROjJ5NOJ5J0RJ7J6J1J6
5271fOK1J5RK0J3PJ4NJ1nMJ1JKj2Knj3j2rJj4pl0nj3j5j6k2lk9%j8Mj0j3roQj3
5312a31J1lNkPNK1LQJ3OJ5K5QJ5LK0QK9PJ0nL1j4K0kRnMpjjj2kj6j1rnk1nk0j7
5354fpk3kk3j5Lj9j0Jj3pKj0MnKOJ1LJ2NJ4jK9NK2J3PK6J4J3RK4J6KJ1mJ4KmO
$$ plain form
5395 127 135 111 126 119 98 99 78 65 61 38 18 -1 -4 -7 -37 -47 -53 -76 -89 -101 -102 -119 -117 -123 -133 -126 -131 -129 -136 -127 -104 -109 -106 -89 -79 -62 -44 -34
5433 -34 -20 -3 10 19 44 50 65 77 87 102 101 105 113 115 117 121 120 113 104 112 101 82 81 65 52 43 25 12 -4 -22 -38 -51 -70 -71 -86 -101 -99 -112
5471 -112 -115 -121 -133 -126 -126 -128 -123 -116 -118 -101 -92 -86 -65 -57 -45 -35 -32 -10 15 23 34 42 65 70 88 95 96 98 111 119 114 115 126 121 104 102 92 90 73 63 58 40
5513 40 29 17 2 -12 -28 -45 -46 -60 -71 -89 -93 -108 -128 -105 -123 -117 -125 -123 -113 -110 -109 -104 -86 -83 -71 -71 -62 -47 -29 -11 -9 8 18 36 64 65 82
5550 82 83 93 100 101 116 110 112 108 113 109 101 100 97 77 73 57 61 40 28 12 -4 -23 -28 -38 -57 -52 -79 -91 -96 -105 -113 -121 -126 -127 -132 -125 -118 -123 -112 -99 -101 -83 -71
5593 -71 -63 -45 -33 -24 -9 7 22 29 44 65 74 86 100 110 101 112 111 119 123 116 109 100 97 93 82 77 65 54 36 26 3 7 -13 -30 -42 -52 -74 -80
5631 -80 -93 -100 -115 -116 -118 -119 -117 -113 -115 -117 -107 -101 -105 -84 -86 -66 -57 -51 -40 -19 -1 19 31 38 53 41 69 85 78 89 98 102 109 102 102 108 117 103 94 83 79 67
5673 67 59 52 37 21 18 -3 -3 -16 -51 -46 -46 -60 -80 -88 -83 -92 -96 -96 -105 -103 -96 -105 -101 -110 -99 -93 -81 -80 -69 -59 -36 -43 -13 2 7 18 27 51 51 64 73 74 71
$$ packed form
5395A27Qk4J5pk1Jk1j3mk3k0j9lll0j0ok3j3j2jj7Koj0PnKpRK3nLJ7J0J7J8J0
5433c4J4J7J3RK5OJ5J2J0J5jMQKKMjprQj1j9jj6j3rj8j3j6j8j6j3j9jj5j5Kj3
5471a12loj2P%kNPkJ7ROK1QJ2J0LK2K5QJ1QK3NJ8PJKJ3QnJJ1nj7kj0kj7j0nj8
5513D0j1j2j5j4j6j7jj4j1j8mj5k0K3j8OqKJ0LJNJ8LJ2%RJ5J8J8KJ7J0J8K8JJ7
5550H2JJ0PJJ5oKmNmqjlk0mj6Mk1j2j6j6j9nj0j9Nk7j2nrqqnjnPPnJ1J3kJ8J2
5593g1QJ8J2RJ5J6J5PJ5K1RJ2J4J0rJ1jQMpprlmj1nj2j1j8j0k3Mk0j7j2j0k2o
5631h0j3pj5jkjKMkkJ0OmK1kK0ROJ1K1J8K0J2PJ5j2K8J6pJ1RMPp%ORj4rj1mj2
5673F7qpj5j6lk1%j3l5N%j4k0qNrm%rKPrMrJ1OJ2JJ1J0K3pL0J5NJ1RK4%J3RJl
$$ plain form
5716 71 86 97 99 109 106 106 93 90 89 92 72 65 54 53 33 26 11 10 -8 -24 -33 -35 -48 -52 -70 -82 -80 -86 -88 -103 -110 -106 -100 -96 -104 -106 -103 -85 -83 -69 -63 -54 -44
5759 -44 -28 -31 -4 2 27 29 35 52 62 66 81 82 105 96 99 100 102 93 95 101 92 79 82 79 60 48 36 20 6 9 -7 -32 -40 -49 -49 -74 -75 -84 -86 -93 -106 -103 -121
5802 -121 -113 -104 -101 -105 -86 -87 -77 -78 -63 -46 -37 -32 -9 -18 16 23 36 45 64 69 79 90 93 101 100 95 93 105 109 94 108 89 80 83 71 55 49 31 12 9 2
5843 2 -7 -21 -33 -55 -59 -64 -87 -84 -85 -98 -100 -105 -102 -105 -100 -97 -97 -88 -81 -81 -64 -59 -43 -31 -30 -23 -6 6 10 21 46 39 63 70 79 84 91 93 104 99 96 99 92 95 97 86
5889 86 80 77 60 56 51 37 19 11 1 -14 -16 -43 -45 -46 -65 -73 -78 -81 -88 -86 -93 -95 -93 -100 -108 -94 -86 -93 -74 -68 -66 -55 -28 -31 -14 0 -2 19 29 47 47 62 69
5932 69 77 81 97 97 97 99 102 107 101 100 92 92 82 72 66 58 55 27 18 12 -9 -15 -36 -39 -55 -56 -80 -84 -92 -91 -92 -100 -99 -106 -110 -111 -99 -96 -98 -79 -83 -84 -58 -53 -45 -30 -11
5979 -11 -4 11 26 35 48 63 73 85 83 99 104 111 109 110 106 110 112 93 96 87 79 66 62 45 40 25 16 -1 -8 -17 -42 -47 -66 -74 -88 -87 -94 -98 -107 -107 -105 -100 -96 -111
6023 -111 -106 -91 -84 -78 -59 -61 -52 -32 -19 -21 1 9 25 30 46 50 70 76 99 82 90 89 98 90 101 95 92 96 80 81 81 68 60 51 36 18 9 -4 -17 -20 -27 -46
$$ packed form
5716G1J5J1KJ0l%j3ljLk0pj1jk0pj5jj8j6rkj3mj8j2Kokj5pMOMqkLJ8KJ4ORJ0
5759d4J6lK7OK5KOJ7J0MJ5JK3rLJKrKOrj3Llj9j2j2j6j4Lj6k5qr%k5jrkpj3Lj8
5802a21QRLmJ9jJ0jJ5J7RNK3rL4PJ3RJ9NJ0J1LQjnkJ2Mj5J4j9rLj2j6oj8j9lp
5843Brj4j2k2mnk3Ljj3knLlNL%RP%J7NJ6J2JPJ7J2MJ1K5pK4PRNPKJ1nlLpLKj1
5889H6olj7mnj4j8qj0j5kk7kjj9qnlpKpkKpqJ4QpJ9OKJ1K7lJ7J4kK1J0J8%J5P
5932F9QMJ6%%KLNojq%j0j0oqlk8rok1ok1lj6jk4mqJjqJpmjJ2LkJ9mjK6NQJ5J9
5979a1PJ5J5RJ3J5J0J2kJ6NPkJmMKj9Lrqj3mj7nj5rj7prk5nj9qj4Jpmr%KNMj5
6023a11NJ5POJ9kRK0J3kK2QJ6NJ6MK0OK3j7QjRqJ1olMj6J%j3qrj5j8rj3j3lpj9
$$ plain form
6065 -46 -61 -62 -70 -69 -80 -77 -85 -96 -102 -106 -97 -98 -99 -94 -84 -78 -74 -58 -55 -45 -31 -9 -12 -9 7 23 25 45 57 65 65 74 81 88 86 100 98 93 95 96 91 84 80 71 67 59 45
6112 45 49 30 17 3 -12 -13 -31 -54 -50 -57 -63 -66 -86 -93 -93 -104 -94 -103 -103 -90 -92 -84 -84 -75 -69 -58 -36 -35 -35 -13 -9 7 23 26 31 41 55 64 72 90 80
6153 80 92 96 99 97 103 97 95 86 88 75 71 66 47 48 20 17 1 -4 -20 -34 -40 -43 -53 -70 -73 -84 -93 -87 -100 -104 -96 -99 -104 -104 -90 -82 -82 -69 -58 -59 -35 -28 -18 -15
6197 -15 9 24 30 39 45 74 73 81 87 111 96 93 93 107 103 90 98 90 78 66 60 62 53 32 34 23 7 -3 -6 -25 -29 -36 -51 -67 -69 -70 -80 -79 -90 -95 -88 -89
6239 -89 -87 -92 -78 -77 -82 -70 -45 -53 -37 -36 -20 -16 -5 9 22 35 43 63 65 65 77 74 87 95 90 95 91 93 89 96 71 74 62 59 48 48 28 25 17 16 -3 -11 -20
6282 -20 -22 -50 -46 -61 -61 -73 -69 -79 -85 -93 -78 -87 -83 -73 -76 -73 -76 -71 -62 -51 -44 -22 -22 -23 -2 9 22 30 33 49 56 56 68 77 83 76 86 85 91 83 93 90 81 74 77
6327 77 59 57 46 35 30 22 15 -7 -18 -22 -41 -45 -43 -49 -69 -81 -78 -83 -80 -87 -91 -96 -84 -82 -80 -76 -78 -60 -62 -40 -42 -30 -15 -14 7 7 23 42 41 58 63 66 78
6370 78 86 89 103 96 94 99 103 89 87 78 77 79 63 56 38 29 13 7 -2 -19 -20 -29 -27 -53 -62 -54 -70 -83 -81 -81 -87 -93 -95 -97 -93 -94 -79 -65 -67 -62 -52 -39 -36 -27 -7 5
$$ packed form
6065d6j5jqJj1Lqj1omRjjNJ0OMJ6LJ0J4K2lLJ6J6KK0J2Q%RPPkJ4knKJnpmrmqj4
6112D5Mj9j3j4j5jj8k3Mpolk0p%j1J0r%J3kQ%ROJ1K2J%K2MJ6J6LNJ0J4RQJ8j0
6153H0J2MLkOokrKj3mnj9Jk8lj6nj6j4olj0j7lj1rOj3mQln%J4Q%J3J1jK4PJ0L
6197a5K4J5OROK9jQOK4j5l%J4mj3Qqj2j2oKrk1Kj1j6j0lj9mpj5j6kjj0Jj1nPj
6239h9KnJ4JnJ2K5qJ6JJ6MJ1J4J3J3QK0K%J2lJ3QnNmKmPk5Lj2lj1%k0lqjj9qr
6282b0kk8Mj5%j2Mj0oqJ5rMJ0lLlNRJ1PK2%jK1J1J3QLJ6P%J2ROpJ0jOqJ0lrpL
6327G7j8kj1j1nqpk2j1mj9mKok0j2LnLpmnJ2KKMkJ8kK2kJ2J5JK1%J6J9jJ7NLJ2
6370G8QLJ4pkNMj4krjKj6pj8rj6orj7jrKk6rQj6j3K%ookkMjJ5J4kNJ0J3LRK0J2
$$ plain form
6416 5 16 33 38 36 40 58 67 81 71 79 89 81 81 93 93 93 84 86 76 70 75 57 47 49 32 29 21 1 -4 -21 -38 -33 -40 -52 -70 -67 -74 -85 -83 -95 -94 -89 -86
6459 -86 -87 -82 -74 -71 -56 -60 -48 -45 -43 -23 -12 0 9 24 24 42 48 50 73 78 84 81 82 97 100 96 89 77 94 86 82 65 64 61 40 42 36 27 10 -3 -9 -27 -29 -45
6503 -45 -55 -60 -67 -84 -85 -94 -91 -98 -91 -100 -95 -90 -91 -75 -91 -66 -66 -54 -40 -36 -33 -6 -8 4 18 22 41 56 49 81 80 95 99 100 97 103 111 103 103 99 92 92 81 72 60
6548 60 51 39 22 27 -3 -12 -20 -36 -47 -53 -64 -72 -82 -88 -85 -94 -110 -94 -103 -96 -99 -96 -99 -85 -80 -70 -65 -40 -36 -28 -10 9 9 29 35 52 59 70 79 93 97 92
6590 92 93 99 105 111 105 95 103 92 83 69 66 44 35 26 17 0 -2 -25 -26 -36 -55 -66 -64 -75 -86 -78 -78 -97 -90 -105 -103 -107 -84 -93 -87 -76 -78 -62 -53 -37 -29 -29 -18
6633 -18 6 11 30 41 43 53 62 69 76 86 88 88 93 98 88 91 89 90 84 76 67 63 57 46 36 27 20 -4 -9 -9 -24 -42 -59 -60 -75 -82 -85 -91 -85 -95 -93 -103 -98 -99 -99
6678 -99 -86 -72 -89 -72 -73 -61 -46 -30 -22 -11 -7 19 23 38 46 57 57 73 75 78 94 93 87 101 94 103 94 91 90 78 72 68 62 58 54 37 8 6 -7 -21 -30
6719 -30 -47 -55 -63 -66 -80 -87 -86 -99 -105 -101 -102 -96 -105 -93 -95 -77 -67 -73 -62 -44 -37 -26 -17 11 9 25 40 45 56 56 71 80 86 87 97 101 100 105 102 101 94 91 83 78 65
$$ packed form
6416EJ1J7NkMJ8RJ4j0QJ0q%J2%%rKj0oNj8j0Kj7lqk0nj7j7Npj2j8Lpj1Kj2JNL
6459h6jNQLJ5mJ2LKK0J1J2RJ5%J8OKK3NOlJJ5Lmpj2J7qmj7jlk1Korj7j3oj8kj6
6503d5j0npj7jrLpPrNNjJ6j6K5%J2J4MLK7kJ2J4MJ9J5pL2jJ5MJlOQq%mp%j1rj2
6548F0rj2j7Nl0rqj6j1oj1qj0oLrj6J6rPlLlJ4NJ0NK5MQJ8J9%K0OJ7PJ1RJ4Mn
6590I2JOOOoj0Qj1rj4lk2rrrj7kk3jj0j9j1Kj1j1Q%j9Pj5KmK3rOJ1kJ6RJ6Q%J1
6633a8K4NJ9J1KJ0RPPJ0K%NNj0LkJoqrmoj1j0rpk4n%j5j8j7jj5ploOj0Kj0Nj%
6678i9J3J4j7J7jJ2J5J6QJ1MK6MJ5QJ1%J6KLJ6joJ4pRrljj2omommj7k9kj3j4r
6719c0j7qqlj4pJj3oMjOrJ2kJ8J0oJ1J8PJ1RK8kJ6J5NJ1%J5ROJJ0MjNljplqnj3
$$ plain form
6764 65 56 41 29 14 2 -3 -20 -30 -47 -53 -66 -76 -73 -88 -100 -111 -93 -111 -116 -102 -101 -105 -101 -95 -82 -74 -66 -52 -39 -30 -20 -6 4 13 26 33 50
6801 50 62 71 75 84 85 83 94 87 99 99 95 95 94 79 82 72 59 39 40 22 9 12 2 -20 -25 -41 -45 -59 -59 -65 -77 -79 -95 -89 -99 -96 -90 -100 -97 -81 -84 -79
6843 -79 -74 -69 -41 -43 -40 -31 -7 -5 -11 11 39 43 43 50 67 74 77 78 88 81 84 88 75 85 79 85 72 71 53 53 45 40 28 12 0 -1 -10 -35 -32 -51 -52 -55 -82 -70
6887 -70 -84 -94 -97 -100 -95 -90 -99 -95 -88 -76 -67 -75 -73 -55 -44 -32 -18 -18 2 10 28 36 50 46 60 62 70 83 94 98 91 95 95 99 97 91 81 77 75 52 56 48 29 27
6931 27 0 -11 -14 -20 -27 -49 -61 -68 -77 -82 -89 -94 -98 -102 -92 -109 -99 -105 -95 -94 -83 -69 -60 -54 -56 -36 -26 -16 15 14 20 30 52 51 69 71 73 79 90 90 91 89
6973 89 91 96 88 91 84 81 71 59 53 33 22 17 10 1 -11 -30 -35 -47 -64 -53 -75 -77 -77 -94 -97 -101 -102 -96 -95 -91 -88 -86 -78 -66 -65 -49 -50 -38 -36 -18 4 12 23
7016 23 28 46 54 55 68 60 82 76 82 98 94 92 90 82 78 89 78 56 61 50 36 33 22 9 19 -8 -20 -21 -20 -47 -51 -63 -58 -74 -84 -82 -98 -85 -89 -101
7056 -101 -87 -88 -86 -82 -77 -74 -65 -45 -34 -46 -24 -25 -2 12 20 25 41 51 52 50 72 80 84 86 85 86 93 83 92 86 77 72 77 58 45 46 40 25 10 7 -9 -21
$$ packed form
6764F5rj5j2j5j2nj7j0j7oj3j0Lj5j2j1J8j8nJ4JmMOJ3QQJ4J3RJ0J4J0RJ3PJ7
6801E0J2RMRJkJ1pJ2%m%jj5Lj0j3k0Jj8j3Lj0k2nj6mj4%oj2kj6Oj0LOj0LJ6lN
6843g9NNK8kLRK4KoK2K8M%PJ7PLJJ0pLMj3J0oOj3jj8%qnj2j6j2jrk5Lj9jlk7J2
6887g0j4j0llNNrMPJ2RqKJ8J1J2J4%K0QJ8QJ4mJ4KQJ3J1MpM%Mkoj0mkk3Mqj9k
6931B7k7j1lopk2j2prnpnmmJ0j7J0oJ0JJ1J4ROkK0J0J0L1jOJ0K2jJ8KKOJ1%Jk
6973H9KNqLplj0j2ok0j1nprj2j9nj2j7J1k2k%j7lmjOJMLKQJ2JJ6jJ2KJ8K2QJ1
7016B3NJ8QJJ3qK2oOJ6mkkqmJ1j1k2Nj1j4lj1j3J0k7j2jJk7mj2Nj6j0Kj6J3mj2
7056a01J4jKMNLRK0J1j2K2jK3J4QNJ6J0JkK2QMKjJPj0RornNj9j3Joj5j5lj6j2
$$ plain form
7098 -21 -35 -40 -60 -58 -57 -77 -83 -89 -107 -99 -99 -96 -93 -96 -86 -93 -81 -78 -71 -63 -49 -34 -25 -15 -3 -4 12 26 45 49 59 62 68 74 85 97 104 95 104 101 91 94 81
7141 81 74 70 75 59 47 37 21 5 10 -18 -26 -25 -41 -50 -57 -74 -83 -90 -96 -82 -103 -104 -96 -90 -90 -84 -79 -83 -66 -77 -58 -47 -46 -24 -14 5 13 23 30 51 47
7182 47 60 67 74 81 90 89 93 96 99 100 89 87 91 77 63 58 49 29 27 17 6 3 -11 -27 -28 -42 -51 -58 -75 -72 -69 -83 -98 -99 -94 -92 -94 -93 -79 -81 -66 -66 -56 -49
7226 -49 -46 -38 -28 -16 -4 16 25 40 37 52 61 70 62 80 82 78 91 95 85 75 83 81 83 65 63 51 47 46 35 27 14 12 -8 -19 -33 -43 -44 -50 -65 -62 -72
7267 -72 -77 -85 -89 -86 -93 -90 -86 -85 -91 -81 -86 -55 -58 -50 -41 -26 -20 -8 2 5 18 35 44 42 55 69 85 81 86 88 97 93 98 88 93 93 76 70 59 66 58 46 31 20
7311 20 4 5 -14 -15 -34 -47 -53 -62 -67 -83 -79 -86 -91 -95 -101 -96 -96 -91 -79 -87 -85 -69 -62 -51 -36 -40 -33 -5 5 16 28 34 35 53 69 69 75 94 89 90 100 105 98
7354 98 97 94 79 69 65 65 64 50 40 18 19 9 -10 -8 -25 -27 -39 -64 -62 -77 -75 -77 -95 -89 -92 -89 -88 -85 -76 -81 -71 -67 -61 -52 -43 -41 -24 -11 -1 1 24 17 23
7397 23 35 40 49 60 57 65 79 81 78 81 79 77 83 76 69 66 52 49 29 34 21 15 7 -3 -6 -19 -38 -37 -51 -57 -59 -72 -78 -81 -68 -85 -82 -84 -82 -81 -77 -65 -74 -65 -55
$$ packed form
7098b1j4nk0KJk0ooj8Q%LLlJ0pJ2LPQJ4J5RJ0J2jJ6J4J9MJ0LOOJ1J2PrRlj0Lj3
7141H1pmNj6j2j0j6j6Nk8qJj6rpj7rpoJ4k1jQO%ONmJ7j1J9J1JK2J0J9QJ0PK1m
7182D7J3PPPRjMLLJj1kMj4j4nrk0kj0j1lj4j6jj4rpj7LLj4j5jNKkJJ4kJ5%J0P
7226d9LQJ0J2J2K0RJ5lJ5RRqJ8KmJ3Mj0j0QkKj8kj2mjj1qj3kk0j1j4j0joj5Lj0
7267g2nqmLpLMJoJ0nL1lQRJ5OJ2J0LJ3J7RkJ3J4J6mNKRmNj0N%j7oj1Pqj2j5j1
7311B0j6Jj9jj9j3ornj6MpnmoN%NJ2qKJ6PJ1J5mPK8J0J1J2OJJ8J6%OJ9nJJ0Np
7354I8jlj5j0m%jj4j0k2Jj0j9Kj7kj2k5Kj5Kkj8OlLJLRnJ0MORRKJ7J3J0KK3pO
7397B3J2NRJ1lQJ4KlLkkOpplj4lk0Nj3oqj0lj3j9Jj4okj3olJ3j7LkKJMJ2rRJ0
$$ plain form
7442 -55 -37 -43 -32 -31 -26 -7 -7 9 18 36 33 49 52 64 62 74 72 78 75 81 71 77 81 79 57 52 54 48 33 34 14 20 8 -14 -22 -24 -37 -44 -45 -52 -63 -70 -74 -86
7486 -86 -83 -89 -84 -88 -82 -88 -86 -82 -61 -56 -63 -58 -33 -23 -18 -16 -4 13 16 22 41 33 47 44 58 60 71 69 78 80 73 73 72 69 71 68 59 43 46 34 24 4 3 -9 -21
7531 -21 -31 -43 -47 -43 -62 -63 -72 -72 -84 -93 -83 -98 -98 -86 -83 -74 -67 -73 -59 -42 -40 -42 -33 -9 -4 6 14 19 33 42 55 55 56 64 75 67 81 81 74 72 75 61 59 53
7575 53 62 53 38 35 29 13 2 -10 -15 -22 -29 -34 -44 -61 -70 -65 -76 -74 -77 -81 -79 -74 -84 -74 -66 -80 -66 -58 -54 -44 -33 -34 -38 -17 -13 3 11 18 17 36 41 29 46
7618 46 63 57 60 63 60 72 63 64 60 52 50 50 45 42 34 32 26 7 1 -1 -1 -15 -21 -38 -40 -39 -54 -56 -68 -68 -68 -78 -63 -74 -70 -66 -77 -69 -65 -59 -48 -45 -43 -33 -26 -27 -12
7665 -12 -8 7 15 14 23 37 50 46 65 50 65 58 67 68 71 74 67 60 63 54 48 47 35 32 26 11 12 -1 -5 -17 -22 -35 -37 -49 -46 -60 -73 -68 -83 -73 -87 -80 -83
7708 -83 -81 -81 -75 -79 -59 -50 -49 -32 -37 -18 -13 -2 -3 11 19 39 48 45 43 59 59 67 69 74 72 71 72 71 69 57 56 50 44 30 29 26 12 2 -8 -20 -21 -40 -51 -49 -57
7753 -57 -55 -58 -72 -79 -76 -77 -82 -76 -79 -80 -75 -66 -61 -46 -41 -47 -25 -24 -20 -16 1 11 11 25 32 38 37 45 62 53 61 61 64 73 74 71 68 60 57 56 43 39 43 29 17 16 11 -7 -7
$$ packed form
7442e5J8oJ1JNJ9%J6RJ8lJ6LJ2kJ2kOlOj0OMkk2nKoj5Jk0Oj2k2qkj3pjpj1pmj2
7486h6LoNmOoKMK1NpNK5J0NKJ2J7LOJ9qJ4lJ4KJ1kRKp%jlKlrj6Lj2j0k0jj2j2
7531b1j0j2mMj9jr%j2rJ0j5%J2LRPoJ4J7KkRK4NJ0QNJ4RJ3%JQJ1qJ4%pkLj4ko
7575E3Rrj5loj6j1j2nppnj0j7rNj1KlmKNj0J0Qj4J4QMJ0J1jmK1MJ6QPjJ9Nj2J7
7618D6J7oLLlJ2rJmqk%nlqkoj9ok%j4oj7kJj5kj2%%j0J5j1MMj1QMOJ1LKJ0PjJ5
7665a2MJ5QjRJ4J3mJ9j5J5pRJLLppLrojj2loj5Jj3mj2nj3kj2Lj4j3Nj5J0j4Pl
7708h3K%OmK0RJJ7nJ9NJ1jJ4QK0RlkJ6%QKNkjJjkj2jooj4jlj4j0j0j2jj9j1Kq
7753e7Klj4pLjnOljNRNJ5NoK2JMMJ7J0%J4POjQJ7rQ%LRJllqljj3mMj4j2jnj8%
$$ plain form
7802 -7 -11 -21 -28 -37 -49 -45 -53 -56 -64 -60 -62 -60 -69 -72 -67 -54 -58 -56 -43 -37 -39 -39 -16 -10 -4 -10 -4 15 19 23 35 38 51 48 54 54 56 56 69 65 57 65 61 54 65 62 39 32 24 27
7852 27 12 10 10 -2 -10 -17 -33 -31 -29 -39 -53 -51 -52 -61 -63 -75 -76 -75 -77 -60 -66 -70 -57 -56 -52 -50 -27 -19 -18 -15 -3 8 7 28 26 49 46 51 60 61 67 61 59 63 62 70 65
7899 65 57 53 48 40 35 31 14 15 18 9 -6 -25 -19 -31 -39 -48 -46 -57 -61 -77 -77 -59 -78 -79 -81 -65 -68 -61 -66 -51 -41 -38 -34 -33 -19 -10 -12 4 20 32 25 45 47 50
7943 50 60 67 63 71 65 67 74 59 70 69 54 55 48 46 34 27 17 11 6 -5 -9 -20 -21 -41 -45 -47 -52 -58 -67 -74 -71 -66 -78 -64 -73 -69 -58 -60 -48 -50 -42 -38 -31 -16 -24 -9
7989 -9 9 6 13 18 32 20 29 47 47 45 47 55 64 70 58 69 52 43 48 35 46 30 38 32 11 6 6 -6 -5 -14 -17 -34 -32 -45 -41 -47 -60 -60 -54 -60 -56 -56 -62 -61 -60 -59
8035 -59 -54 -45 -47 -29 -25 -21 -27 -17 -5 2 5 12 21 22 29 39 40 37 38 54 55 51 54 58 54 59 63 57 44 39 36 29 24 14 10 2 -1 -13 -13 -15 -31 -27 -44 -56 -51 -60 -57 -55 -63
8084 -63 -66 -63 -62 -67 -59 -57 -62 -42 -39 -42 -32 -23 -15 -10 -13 5 14 9 23 27 43 47 49 57 43 56 65 63 57 73 69 64 51 48 40 35 33 20 16 9 6 -15 -8 -24 -18 -33 -49
8131 -49 -41 -54 -42 -56 -60 -69 -62 -51 -61 -55 -56 -58 -46 -45 -39 -48 -22 -15 -7 -4 5 0 11 29 31 32 42 53 40 48 52 54 68 52 48 64 62 50 35 38 38 36 22
$$ packed form
7802gmj0prj2MqlqMkKrlNJ3mKJ3Ok%K3OOoOJ9MMJ2LJ3lO%K%J3mqQmpJ1lk3pqL
7852B7j5k%j2qpj6KKj0j4Kjrkj2jJkJ7omJ3JMKK3QJLJ2J1jK1kK3lNRJOokMjQn
7899F5qmnqnmj7JLrj5j9Oj2qrKj1mj6%J8j9jkJ6lPnJ5J0LMJJ4RkJ6J6J2pK0KL
7943E0J0PmQoKPj5J1jj5Jpkj2pj0onj1mj1jk0mknorpLNj2J4rMJ1kJ2kQMPJ5qJ5
7989iJ8lPNJ4j2RJ8%kKQROj2J1j7rNj3J1j6Qok1n%j2Jrlj7Kj3Moj3%OoM%oJJJ
8035e9NRkJ8MMoJ0J2PLPRJPJ0JlJJ6JmLMmNMoj3nlpnj0mqlj2%kj6Mj7j2NrLKq
8084f3lLJnQKnK0LlJ0RQNlJ8RnJ4MJ6MKQj4J3RkoJ6mnj3lqnkj3mplk1Pj6Oj5j6
8131d9Qj3J2j4mrPJ1j0OjkJ2JOrK6PQLRnJ1J8KJJ0J1j3QMKJ4j6mJ6kj2j5L%kj4
$$ plain form
8174 22 18 22 16 6 -2 -4 -16 -14 -25 -38 -38 -43 -44 -54 -50 -52 -54
$$ packed form
8174B2mMoj0qkj2Kj1j3%njj0Mkk
8191e4
$$ Imaginary data points
##PAGE= N=2
##DATA TABLE= (X++(I..I)), XYDATA
$$ plain form
0 0 0 0 0 0 0 0 0 0 0 0 0 0 0 0 0 0 0 0 0 0 0 0 0 -2 0 -7 4 -8 8 -8 8 -8 12 -12 16 -16 20 -20 23 -28 28 -31 36 -38 44
45 44 -48 55 -57 65 -71 79 -85 96 -106 117 -128 142 -158 175 -196 222 -251 288 -333 394 -478
66 -478 598 -807 1246 -4634 9487 21081 55207 86415 92700 129385 146394 154384 182215 189060
80 189060 194649 211735 207956 211123 214082 203825 201003 192064 176883 167642 148859 131594 115150
93 115150 91496 72842 51052 26650 7741 -17097 -38001 -57114 -80791 -95912 -114360 -132543
105 -132543 -140834 -157278 -166201 -168555 -180438 -178505 -176401 -181241 -169052 -163973 -159931 -140427 -133003 -119979
119 -119979 -96945 -87427 -67146 -44309 -32933 -8884 10890 23453 47444 62387 74883 95251
131 95251 104612 115467 129532 133397 140918 147222 146185 148780 147230 142041 138453 130418 121719 111779
$$ packed form
0@%%%%%%%%%%%%%%%%%%%%%%%kKpJ1j2J6j6J6j6K0k4K8l2L6m0M3n1N6n9O7p4Q2
45D4r2J03j12J22j36J50j64J81k02K23k45K70l00L33l71M18m73N39o21P27q72
66d78J076j405K053n880J4121J1594L4126L1208O285L6685J7009P990K7831O845
80A89060N589J7086l779L167K959j0257k822q939j5181r241j8783j7265j6444
93A15150k3654j8654k1790k4402j8909k4838k0904j9113k3677j5121j8448j8183
105a32543q291j6444q923k354j1883J933K104m840J2189N079M042J9504P424J3024
119a19979K3034R518K0281K2837J1376K4049J9774J2563K3991J4943J2496K0368
131I5251R361J0855J4065L865P521O304j037K595j550n189l588q035q699r940
$$ plain form
145 111779 99455 87560 72494 58503 43678 25940 12267 -4610 -21891 -34056 -51489 -65321
157 -65321 -75361 -90977 -99302 -106762 -118099 -120200 -124661 -129930 -126152 -127236 -125831 -117238 -114763 -107058
171 -107058 -95121 -89225 -76429 -62800 -54079 -38123 -24428 -13718 2994 15335 26807 42003
183 42003 52192 62878 74639 82182 90333 97542 102113 106133 108684 109738 108653 107094 104082 98066
197 98066 93211 85914 76165 68801 57783 46048 36935 23394 11434 1418 -12764 -23426 -33361
210 -33361 -46438 -54586 -63276 -73523 -78275 -84751 -90967 -91976 -95547 -97008 -94430 -94762 -91393 -85921 -82780
225 -82780 -75209 -67662 -61182 -50708 -41882 -32730 -21050 -11640 -1118 10088 19356 29653 39313 47575
239 47575 56033 63353 69574 75041 79629 82791 84747 86206 85714 84170 82397 78248 73600 68869 61628
$$ packed form
145A11779j2324j1895j5066j3991j4825j7738j3673j6877j7281j2165j7433j3832
157f5321j0040j5616q325p460j1337k101m461n269L778j084J405Q593K475P705
171a07058J1937N896J2796J3629Q721J5956J3695J0710J6712J2341J1472J5196
183D2003J0189J0686J1761P543Q151P209M571M020K551J054j085j559l012o016
197I8066m855p297r749p364j1018j1735r113j3541j1960j0016j4182j0662r935
210c3361j3077q148q690j0247m752o476o216j009l571j461K578l32L369N472L141
225h2780P571P547O480J0474Q826R152J1680R410J0522J1206R268J0297R660Q262
239D7575Q458P320O221N467M588L162J956J459m92j544j773m149m648m731p241
$$ plain form
254 61628 54616 47565 38061 29703 21203 10483 2016 -7004 -17640 -25130 -33907 -43079 -48600 -56254
268 -56254 -62668 -65788 -71420 -74296 -74916 -77796 -76950 -75143 -74841 -70652 -66543 -63143 -56336 -50156 -44306 -35650
284 -35650 -28062 -20700 -11137 -3092 4677 14139 21637 28958 37307 43336 49329 55595 59580 63426 67004
299 67004 68505 69643 70315 69085 67366 65327 61366 57150 52800 46482 40494 34357 26400 19516 12178
314 12178 3650 -3312 -10995 -19028 -25406 -32421 -39047 -44071 -49471 -54038 -57050 -60262 -62356 -62935 -63726
329 -63726 -63150 -61233 -59702 -56415 -52330 -48622 -42996 -37398 -31896 -24724 -18328 -11641 -3953 2516 9510
344 9510 16720 22719 29103 35106 39881 44813 49055 51984 54924 56985 57574 58333 57945 56172 54758 51952
360 51952 48127 44788 39926 34592 29705 23471 17203 11372 4583 -1956 -7861 -14502 -20636 -25786 -31616
$$ packed form
254F1628p012p051r504q358q500j0720q467r020j0636p490q777r172n521p654
268e6254o414l120n632k876o20k880Q46J807L02M189M109L400O807O180N850Q656
284c5650P588P362R563Q045P769R462P498P321Q349O029N993O266L985L846L578
299F7004J501J138O72j230j719k039l961m216m350o318n988o137p957o884p338
314A2178q528o962p683q033o378p015o626n024n400m567l012l212k094n79p91
329f3726N76J917J531L287M085L708N626N598N502P172O396O687P688O469O994
344I510P210N999O384O003M775M932M242K929K940K061N89P59l88j773j414k806
360E1952l825l339m862n334m887o234o268n831o789o539n905o641o134n150n830
$$ plain form
375 -31616 -36531 -40226 -44730 -47675 -49630 -52342 -52944 -53071 -53640 -51891 -50243 -48521 -44745 -41424 -37715 -32446
391 -32446 -27790 -22682 -16483 -11013 -5308 1163 6619 12237 18377 23204 28137 33186 36762 40450 43839
406 43839 45780 47718 49110 49201 49102 48506 46644 44591 42252 38520 34953 31185 25945 21453 16544 10452
422 10452 5652 95 -5918 -10517 -16121 -21319 -25295 -30133 -33874 -36833 -40228 -42240 -43827 -45361 -45532
437 -45532 -45498 -45090 -43439 -41748 -39457 -36191 -33106 -29225 -24769 -20686 -15658 -10676 -6037 -523 4268 9042
453 9042 14325 18492 22951 27211 30426 33933 36621 38686 40632 41592 42258 42292 41627 40730 38868 36864 34396
470 34396 30994 27919 24064 19643 15818 11026 6142 2042 -3089 -7790 -11718 -16631 -20631 -23815 -28037
485 -28037 -30709 -32909 -35945 -36971 -38041 -39461 -38756 -38648 -38240 -36012 -34680 -32437 -29105 -26558 -22908 -18896
$$ packed form
375c1616m915l695m504k945j955k712o02j27n69J749J648J722L776L321L709N269
391c2446M656N108O199N470N705O471N456N618O140M827M933N049L576L688L389
406D3839J941J938J392R1r9n96j862k053k339l732l567l768n240m492m909o092
422A0452m800n557o013m599n604n198l976m838l741k959l395k012j587j534j71
437d5532L4M08J651J691K291L266L085L881M456M083N028M982M639N514M791M774
453I042N283M167M459M260L215L507K688K065J946R60O66L4o65q97j862k004k468
470C4396l402l075l855m421l825m792m884m100n131m701l928m913m000l184m222
485b8037k672k200l036j026j070j420P05J08M08K228J332K243L332K547L650M012
$$ plain form
501 -18896 -15326 -10949 -6614 -2492 1969 6239 10373 14428 18331 21823 25048 28084 30477 32561 34336
516 34336 35369 36064 36377 35922 35183 34143 32190 30189 27933 24701 21780 18522 14353 10979 6964 2520
532 2520 -957 -5209 -9321 -12589 -16584 -19871 -22598 -25716 -27897 -29830 -31595 -32582 -33414 -33679 -33453 -32903
548 -32903 -31763 -30342 -28455 -26139 -23606 -20705 -17504 -14177 -10646 -6931 -3272 480 4262 7795 11402
563 11402 14824 17902 20910 23486 25745 27773 29220 30387 31117 31433 31343 30712 29953 28521 26768 25029
579 25029 22302 19797 17175 13505 10596 7297 3273 316 -3344 -7113 -9907 -13369 -16524 -18858 -21653
594 -21653 -23846 -25457 -27244 -28314 -28963 -29542 -29404 -28968 -28264 -26958 -25511 -23596 -21319 -19041 -16142 -13315
610 -13315 -10375 -6880 -3952 -579 2960 5690 9241 12226 14661 17903 19904 21841 24253 25093 26376
$$ packed form
501a8896L570M377M335M122M461M270M134M055L903L492L225L036K393K084J775
516C4336J033O95L13m55p39j040j953k001k256l232k921l258m169l374m015m444
532B520l477m252m112l268l995l287k727l118k181j933j765r87q32k65K26N50
548c2903J140J421J887K316K533K901L201L327L531L715L659L752L782L533L607
563A1402L422L078L008K576K259K028J447J167P30L16r0o31p59j432j753j739
579B5029k727k505k622l670k909l299m024k957l660l769k794l462l155k334k795
594b1653k193j611j787j070o49n79J38M36P04J306J447J915K277K278K899K827
610a3315K940L495K928L373L539K730L551K985K435L242K001J937K412Q40J283
$$ plain form
625 26376 27550 27243 27722 27482 26231 25736 24203 22200 20704 18129 15568 13268 9993 7137 4288 793
641 793 -1983 -5042 -8346 -10729 -13704 -16327 -18155 -20664 -22208 -23438 -25072 -25363 -25953 -26320 -25530 -25397 -24330
658 -24330 -22704 -21733 -19448 -17332 -15497 -12393 -10034 -7470 -4071 -1665 1281 4527 6845 9782 12539
673 12539 14515 17039 18971 20366 22151 23017 23745 24554 24268 24334 23960 22681 22086 20455 18498 17202 14498
690 14498 12224 10211 6886 4611 2033 -1342 -3424 -6278 -9196 -10988 -13717 -15829 -17220 -19380 -20529
705 -20529 -21330 -22636 -22759 -22850 -23100 -22254 -21595 -20812 -19106 -17783 -16047 -13768 -11885 -9436 -6945 -4633 -1839
722 -1839 548 3156 5840 7930 10575 12694 14361 16667 17868 19060 20598 20810 21428 21975 21287 21219 20691
739 20691 19255 18463 16994 14960 13499 11316 8901 6975 4376 1907 -232 -2935 -5206 -7286 -9745
$$ packed form
625B6376J174l07M79k40j251m95j533k003j496k575k561k300l275k856k849l495
641G93k776l059l304k383k975k623j828k509j544j230j634k91n90l67P90J33J067
658b4330J626R71K285K116J835L104K359K564L399K406K946L246K318K937K757
673A2539J976K524J932J395J785Q66P28Q09k86O6l74j279n95j631j957j296k704
690A4498k274k013l325k275k578l375k082k854k918j792k729k112j391k160j149
705b0529q01j306j23r1k50Q46O59P83J706J323J736K279J883K449K491K312K794
722a839K387K608K684K090K645K119J667K306J201J192J538K12O18N47o88o8n28
739B0691j436p92j469k034j461k183k415j926k599k469k139k703k271k080k459
$$ plain form
754 -9745 -11581 -13436 -15301 -16550 -17960 -18934 -19554 -20235 -20263 -20261 -19989 -19181 -18526 -17324 -15895 -14572 -12633 -10804
772 -10804 -8904 -6518 -4485 -2243 220 2334 4609 6896 8804 10859 12711 14169 15693 16925 17734
787 17734 18600 19024 19145 19265 18841 18293 17618 16432 15298 13826 12133 10501 8419 6461 4438 2143 174
804 174 -2037 -4258 -6063 -8172 -10030 -11584 -13267 -14579 -15669 -16706 -17423 -17847 -18126 -18139 -17780 -17345 -16660
821 -16660 -15565 -14509 -13180 -11545 -10026 -8212 -6213 -4360 -2351 -205 1717 3705 5786 7479 9260
836 9260 11083 12264 13668 14915 15469 16407 16901 16848 17182 16860 16249 15882 14832 13743 12679 11116 9597
853 9597 7979 6134 4287 2468 541 -1450 -3251 -5063 -6896 -8480 -10056 -11541 -12687 -13790 -14777
868 -14777 -15352 -15830 -16209 -16086 -15957 -15692 -14843 -14217 -13303 -11880 -10863 -9347 -7585 -6266 -4299 -2505 -970
$$ packed form
754i745j836j855j865j249j410r74o20o81k8KK72Q08O55J202J429J323J939J829
772a0804J900K386K033K242K463K114K275K287J908K055J852J458J524J232Q09
787A7734Q66M24J21J20m24n48o75j186j134j472j693j632k082j958k023k295j969
804A74k211k221j805k109j858j554j683j312j090j037p17m24k79j3L59M35O85
821a6660J095J056J329J635J519J814J999J853K009K146J922J988K081J693J781
836I260J823J181J404J247N54R38M94n3L34l22o11l67j050j089j064j563j519
853I597j618j845j847j819j927j991j801j812j833j584j576j485j146j103r87
868a4777n75m78l79J23J29K65Q49O26R14J423J017J516J762J319J967J794J535
$$ plain form
885 -970 1188 2824 4458 6392 7743 9307 10764 11743 12942 13778 14325 14985 15153 15212 15216 14734 14280 13644 12566
904 12566 11651 10415 8890 7635 5963 4196 2817 872 -843 -2322 -4272 -5675 -7115 -8811 -9834
919 -9834 -11110 -12226 -12836 -13704 -14101 -14325 -14548 -14277 -14093 -13599 -12822 -12180 -11043 -9920 -8843 -7215 -5891 -4426
937 -4426 -2581 -1232 469 2334 3597 5260 6870 7885 9420 10569 11216 12415 12927 13195 13913 13728
953 13728 13632 13692 12902 12453 11816 10574 9758 8511 7066 5859 4248 2838 1326 -328 -1720 -3371 -4751
970 -4751 -6034 -7563 -8579 -9703 -10847 -11373 -12180 -12764 -12807 -13185 -13125 -12685 -12610 -11916 -11097 -10539 -9320 -8215 -7233
989 -7233 -5601 -4412 -3049 -1301 -111 1531 3123 4209 5863 7006 8032 9421 10043 10931 11727 11882
1005 11882 12515 12597 12369 12554 11945 11451 11056 9899 9162 8218 6745 5802 4417 2920 1859 221 -1207
$$ packed form
885i70K158J636J634J934J351J564J457R79J199Q36N47O60J68N9Mm82m54o36j078
904A2566r15j236j525j255j672j767j379j945j715j479j950j403j440j696j023
919i834j276j116o10q68l97k24k23K71J84M94P77O42J137J123J077J628J324J465
937d426J845J349J701J865J263J663J610J015J535J149O47J199N12K68P18j85
953A3728r6O0p90m49o37j242q16j247j445j207j611j410j512j654j392j651j380
970d751j283j529j016j124j144n26q07n84m3l78O0M40P5O94Q19N58J219J105R82
989g233J632J189J363J748J190J642J592J086J654J143J026J389O22Q88P96J55
1005A1882O33Q2k28J85o09m94l95j157p37r44j473r43j385j497j061j638j428
$$ plain form
1022 -1207 -2369 -3977 -5105 -6246 -7637 -8422 -9442 -10370 -10716 -11487 -11759 -11752 -12145 -11677 -11432 -11267 -10222 -9834
1040 -9834 -9017 -7610 -7055 -5626 -4189 -3438 -1643 -390 619 2519 3438 4578 6176 6796 7943 9041
1056 9041 9395 10315 10808 10889 11420 11296 11122 11115 10461 10072 9479 8435 7815 6668 5500 4643 3131 2068 972
1075 972 -740 -1624 -2940 -4424 -5040 -6462 -7514 -7933 -9231 -9640 -9919 -10795 -10583 -10706 -10970 -10271 -10188 -9810
1093 -9810 -8843 -8451 -7480 -6391 -5669 -4334 -3221 -2247 -765 278 1459 2871 3681 4883 5982 6601 7736
1110 7736 8347 8780 9652 9719 9971 10357 9942 9977 9760 9004 8773 7960 7031 6462 5289 4296 3380 2085 1096 -65
1130 -65 -1334 -2330 -3520 -4503 -5431 -6446 -7156 -7891 -8559 -8913 -9396 -9606 -9582 -9737 -9508 -9143 -8959 -8276 -7650 -7130
1150 -7130 -6081 -5294 -4464 -3230 -2386 -1298 -47 817 2012 3075 3893 4939 5737 6508 7273 7782 8358
$$ packed form
1022a207j162j608j128j141j391p85j020r28l46p71k72Pl93M68K45J65J045L88
1040i834Q17J407N55J429J437P51J795J253J009J900R19J140J598O20J147J098
1056I041L54R20M93Q1N31j24j74po54l89n93j044o20j147j168q57j512j063j096
1075I72j712q84j316j484o16j422j052m19j298m09k79q76K12j23k64O99Q3L78
1093i810R67L92R71J089P22J335J113R74J482J043J181J412Q10J202J099O19J135
1110G736O11M33Q72O7K52L86m15L5k17p56k31q13r29n69j173r93r16j295r89j161
1130f5j269r96j190r83r28j015p10p35o68l54m83k10K4j55K29L65J84O83O26N20
1150g130J049P87Q30J234Q44J088J251Q64J195J063Q18J046P98P71P65N09N76
$$ plain form
1167 8358 8700 8976 9185 9070 9101 8851 8380 8115 7402 6707 6147 5105 4291 3489 2293 1422 452 -811 -1624
1186 -1624 -2663 -3776 -4437 -5375 -6224 -6680 -7458 -7885 -8138 -8606 -8598 -8639 -8695 -8286 -8146 -7710 -7049 -6694 -5826 -5056
1206 -5056 -4410 -3267 -2535 -1607 -389 284 1414 2450 3079 4171 4906 5453 6409 6799 7225 7859 7905 8133
1224 8133 8347 8065 8034 7810 7241 6967 6334 5618 5098 4125 3396 2658 1537 837 -179 -1244 -1848 -2984 -3773
1243 -3773 -4280 -5356 -5747 -6255 -7041 -7048 -7459 -7845 -7572 -7793 -7697 -7208 -7190 -6678 -6024 -5695 -4879 -4112 -3548 -2555 -1779
1264 -1779 -1031 51 805 1634 2603 3251 4053 4750 5279 5966 6363 6744 7155 7194 7416 7411 7168 7171 6736 6319 6046
1285 6046 5287 4763 4192 3273 2692 1901 924 266 -650 -1574 -2223 -3062 -3820 -4329 -5027 -5560 -5910 -6391 -6651 -6800
1305 -6800 -7000 -6956 -6874 -6763 -6433 -6142 -5711 -5179 -4653 -3970 -3316 -2632 -1807 -1107 -283 574 1253 2088 2821 3438
$$ packed form
1167H358L42K76K09j15L1k50m71k65p13o95n60j042q14q02j196q71r70j263q13
1186a624j039j113o61r38q49m56p78m27k53m68Qm1n6M09J40M36O61L55Q68P70
1206e056O46J143P32R28J218O73J130J036O29J092P35N47R56L90M26O34M6K28
1224H133K14k82l1k24n69k74o33p16n20r73p29p38j121p00j016j065o04j136p89
1243c773n07j076l91n08p86pm11l86K73k21R6M89J8N12O54L29Q16P67N64R93P76
1264a779P48J082P54Q29R69O48Q02O97N29O87L97L81M11L9K22nk43Lm35m17k73
1285F046p59n24n71r19n81p91r77o58r16r24o49q39p58n09o98n33l50m81k60j49
1305f800k00M4Q2J11L30K91M31N32N26O83O54O84Q25P00Q24Q57O79Q35P33O17
$$ plain form
1325 3438 4137 4694 5181 5682 6063 6289 6564 6689 6627 6661 6491 6143 5968 5508 4980 4598 3902 3288 2724 1909
1345 1909 1218 508 -345 -1046 -1789 -2524 -3177 -3774 -4325 -4846 -5263 -5652 -5949 -6148 -6285 -6373 -6296 -6188 -6023 -5705
1365 -5705 -5353 -4983 -4394 -3886 -3355 -2582 -2022 -1346 -462 86 865 1669 2142 2940 3549 3938 4594 4970 5277 5708
1385 5708 5835 5969 6114 6006 5938 5759 5467 5176 4761 4311 3816 3256 2677 2062 1360 716 28 -723 -1314 -2027
1405 -2027 -2675 -3168 -3792 -4208 -4567 -5060 -5255 -5499 -5741 -5693 -5775 -5729 -5471 -5346 -5019 -4608 -4249 -3729 -3224 -2691 -2073
1426 -2073 -1458 -825 -188 491 1127 1727 2365 2896 3437 3923 4299 4665 5000 5207 5354 5472 5476 5379 5320 5087 4775
1447 4775 4557 4097 3649 3270 2646 2127 1591 892 308 -301 -980 -1555 -2092 -2688 -3182 -3605 -4050 -4388 -4615 -4951
1467 -4951 -5088 -5135 -5278 -5178 -5068 -4959 -4647 -4354 -4034 -3579 -3144 -2681 -2135 -1577 -1037 -416 194 729 1353 1916
$$ packed form
1325C438O99N57M87N01L81K26K75J25o2L4j70l48j75m60n28l82o96o14n64q15
1345A909o91p10q53p01p43p35o53n97n51n21m17l89k97j99j37q8P7J08J65L18
1365e705L52L70N89N08N31P73N60O76Q84N48P79Q04M73P98O09L89O56L76L07M31
1385E708J27J34J45j08o8j79k92k91m15m50m95n60n79o15p02o44o88p51n91p13
1405b027o48m93o24m16l59m93j95k44k42M8q2M6K58J25L27M11L59N20N05N33O18
1426b073O15O33O37O79O36O00O38N31N41M86L76L66L35K07J47J18Mr7n9k33l12
1447D775k18m60m48l79o24n19n36o99n84o09o79n75n37n96m94m23m45l38k27l36
1467d951j37m7j43J00J10J09L12K93L20M55M35M63N46N58N40O21O10N35O24N63
$$ plain form
1487 1916 2376 2947 3378 3748 4133 4399 4637 4828 4932 4968 4960 4889 4697 4503 4271 3879 3572 3171 2653 2242 1688
1508 1688 1094 608 -14 -607 -1107 -1671 -2200 -2640 -3089 -3526 -3825 -4119 -4404 -4524 -4700 -4806 -4724 -4736 -4588 -4360
1528 -4360 -4172 -3850 -3512 -3156 -2702 -2249 -1762 -1254 -721 -162 336 924 1437 1901 2431 2844 3222 3632 3885 4120
1548 4120 4341 4449 4516 4594 4504 4383 4320 4021 3755 3530 3080 2745 2350 1767 1388 857 254 -167 -745 -1268 -1684
1569 -1684 -2187 -2604 -2968 -3339 -3648 -3917 -4073 -4246 -4335 -4338 -4372 -4272 -4094 -3963 -3686 -3390 -3128 -2717 -2320 -1923 -1412
1590 -1412 -946 -523 79 539 971 1545 1942 2351 2827 3068 3428 3716 3838 4056 4130 4153 4206 4086 4001 3850 3605
1611 3605 3430 3066 2740 2414 1926 1532 1096 551 146 -349 -870 -1243 -1728 -2156 -2470 -2877 -3199 -3403 -3681 -3856
1631 -3856 -3913 -4041 -4022 -3939 -3898 -3726 -3530 -3327 -2999 -2692 -2355 -1973 -1533 -1109 -698 -175 261 698 1237 1567 2001
$$ packed form
1487A916M60N71M31L70L85K66K38J91J04L6qp1j92j94k32l92l07m01n18m11n54
1508A688n94m86o22n93n00n64n29m40m49m37k99k94k85j20j76j06Q2j2J48K28
1528d360J88L22L38L56M54M53M87N08N33N59M98N88N13M64N30M13L78M10K53K35
1548D120K21J08O7P8r0j21o3k99k66k25m50l35l95n83l79n31o03m21n78n23m16
1569a684n03m17l64l71l09k69j56j73q9ll4J00J78J31K77K96K62M11L97L97N11
1590a412M66M23O02M60M32N74L97M09M76K41L60K88J22K18P4K3N3j20q5j51k45
1611C605j75l64l26l26m88l94m36n45m05m95n21l73m85m28l14m07l22k04k78j75
1631c856n7j28J9Q3M1J72J96K03L28L07L37L82M40M24M11N23M36M37N39L30M34
$$ plain form
1652 2001 2441 2664 3049 3334 3441 3727 3794 3814 3940 3841 3761 3688 3437 3271 3002 2673 2377 1958 1585 1177 700
1673 700 297 -161 -640 -996 -1476 -1877 -2145 -2610 -2882 -3061 -3472 -3518 -3630 -3876 -3698 -3772 -3784 -3437 -3470 -3225 -2834
1694 -2834 -2765 -2298 -1935 -1725 -1133 -818 -440 137 424 908 1383 1626 2130 2419 2636 3076 3154 3351 3612 3508
1714 3508 3666 3732 3483 3589 3403 3059 3091 2632 2285 2169 1550 1268 981 287 104 -357 -926 -1083 -1635 -2010
1734 -2010 -2185 -2693 -2834 -3043 -3377 -3353 -3550 -3632 -3476 -3617 -3429 -3226 -3235 -2825 -2630 -2489 -1927 -1754 -1425 -813 -673
1755 -673 -176 381 517 1108 1510 1648 2220 2411 2591 3053 3045 3243 3477 3342 3517 3474 3274 3335 3053 2843 2723
1776 2723 2283 2088 1747 1282 1061 586 166 -106 -622 -933 -1256 -1744 -1943 -2270 -2635 -2723 -2997 -3203 -3185 -3382
1796 -3382 -3385 -3271 -3350 -3148 -2992 -2909 -2577 -2388 -2133 -1727 -1479 -1079 -686 -378 104 416 811 1238 1484 1887 2182
$$ packed form
1652B001M40K23L85K85J07K86O7K0J26r9q0p3k51j66k69l29k96m19l73m08m77
1673G00m03m58m79l56m80m01k68m65k72j79m11m6j12k46J78p4j2L47l3K45L91
1694b834O9M67L63K10N92L15L78N77K87M84M75K43N04K89K17M40P8J97K61j04
1714C508J58O6k49J06j86l44L2m59l47j16o19k82k87o94j83m61n69j57n52l75
1734b010j75n08j41k09l34K4j97q2J56j41J88K03rM10J95J41N62J73L29O12J40
1755f73M97N57J36N91M02J38N72J91J80M62qJ98K34j35J75m3k00O1k82k10j20
1776B723m40j95l41m65k21m75m20k72n16l11l23m88j99l27l65q8k74k06J8j97
1796c382lJ14p9K02J56Q3L32J89K55M06K48M00L93L08M82L12L95M27K46M03K95
$$ plain form
1817 2182 2350 2722 2845 2981 3220 3175 3260 3316 3154 3147 3005 2761 2632 2346 2050 1800 1437 1096 769 360 37
1838 37 -355 -725 -1047 -1440 -1710 -2007 -2354 -2486 -2746 -2966 -2928 -3157 -3194 -3053 -3206 -3026 -2840 -2858 -2503 -2324 -2167
1859 -2167 -1704 -1531 -1210 -733 -520 -66 306 583 1036 1317 1603 1969 2146 2419 2666 2729 2968 3033 3006 3164 3026
1880 3026 2956 2960 2660 2556 2390 1979 1864 1523 1093 974 494 105 -60 -603 -869 -1109 -1607 -1750 -2041 -2379 -2422
1901 -2422 -2702 -2846 -2836 -3015 -2964 -2929 -2975 -2761 -2685 -2557 -2257 -2123 -1830 -1482 -1304 -887 -543 -314 166 451 703
1922 703 1195 1371 1647 2042 2098 2386 2626 2601 2855 2881 2831 2969 2813 2716 2688 2426 2280 2082 1769 1562 1247 938
1944 938 665 280 -13 -324 -706 -950 -1287 -1588 -1773 -2076 -2281 -2393 -2607 -2677 -2695 -2833 -2761 -2710 -2730 -2513 -2415 -2296
1966 -2296 -1974 -1839 -1568 -1216 -1013 -662 -317 -70 312 611 884 1207 1447 1715 1950 2135 2332 2455 2584 2671
$$ packed form
1817B182J68L72J23J36K39m5Q5N6j62pj42k44j29k86k96k50l63l41l27m09l23
1838C7l92l70l22l93k70k97l47j32k60k20L8k29l7J41j53J80J86j8L55J79J57
1859b167M63J73L21M77K13M54L72K77M53K81K86L66J77K73K47O3K39O5k7J58j38
1880C026p0Ml00j04j66m11j15l41m30j19m80l89j65n43k66k40m98j43k91l38m3
1901b422k80j44J0j79N1L5m6K14P6J28L00J34K93L48J78M17L44K29M80K85K52
1922G03M92J76K76L95N6K88K40k5K54K6n0J38j56r7k8k62j46j98l13k07l15l09
1944I38k73l85k93l11l82k44l37l01j85l03k05j12k14p0j8j38P2N1k0K17R8J19
1966b296L22J35K71L52K03L51L45K47L82K99K73L23K40K68K35J85J97J23J29Q7
$$ plain form
1986 2671 2662 2713 2679 2577 2508 2376 2158 2020 1786 1512 1313 998 705 452 77 -205 -462 -844 -1078 -1343 -1638
2007 -1638 -1829 -2038 -2221 -2328 -2481 -2535 -2561 -2603 -2555 -2521 -2412 -2294 -2163 -1944 -1758 -1526 -1236 -1006 -712 -389 -142
2028 -142 189 496 729 1042 1303 1488 1758 1955 2073 2284 2377 2427 2533 2507 2486 2467 2324 2234 2086 1906 1736 1483
2050 1483 1267 1002 725 500 159 -128 -363 -730 -948 -1190 -1503 -1647 -1848 -2071 -2134 -2273 -2398 -2366 -2434 -2430 -2318
2071 -2318 -2297 -2205 -2012 -1912 -1702 -1458 -1282 -999 -743 -499 -189 62 343 626 851 1140 1332 1542 1774 1879
2091 1879 2079 2184 2222 2346 2338 2298 2331 2198 2102 2032 1807 1667 1493 1229 1021 799 491 265 12 -296 -514 -785
2113 -785 -1040 -1238 -1471 -1648 -1792 -1963 -2041 -2154 -2195 -2206 -2255 -2188 -2122 -2086 -1895 -1806 -1658 -1410 -1272 -1022 -756 -586 -276
2136 -276 -33 158 482 691 887 1164 1337 1495 1710 1819 1925 2049 2086 2125 2150 2095 2064 1973 1861 1756 1590 1428
$$ packed form
1986B671rN1l4j02o9j32k18j38k34k74j99l15k93k53l75k82k57l82k34k65k95
2007a638j91k09j83j07j53n4k6m2M8L4J09J18J31K19J86K32K90K30K94L23K47
2028a42L31L07K33L13K61J85K70J97J18K11R3N0J06k6k1j9j43r0j48j80j70k53
2050A483k16k65k77k25l41k87k35l67k18k42l13j44k01k23o3j39j25L2o8MJ12
2071b318K1R2J93J00K10K44J76K83K56K44L10K51K81K83K25K89J92K10K32J05
2091A879K00J05L8J24qm0L3j33r6p0k25j40j74k64k08k22l08k26k53l08k18k71
2113g85k55j98k33j77j44j71p8j13m1j1m9O7O6L6J91Q9J48K48J38K50K66J70L10
2136b76K43J91L24K09J96K77J73J58K15J09J06J24L7L9K5n5l1r1j12j05j66j62
$$ plain form
2158 1428 1241 1037 843 583 366 141 -161 -349 -580 -856 -1012 -1235 -1434 -1526 -1722 -1818 -1884 -1983 -1990 -2016 -2019 -1972 -1904
2181 -1904 -1805 -1696 -1556 -1400 -1237 -1029 -821 -627 -379 -171 32 296 495 696 947 1114 1281 1469 1565 1698
2201 1698 1824 1835 1914 1945 1893 1910 1831 1728 1656 1506 1363 1228 1029 861 630 405 207 -51 -215 -451 -690 -830
2223 -830 -1048 -1210 -1324 -1517 -1609 -1677 -1793 -1803 -1812 -1876 -1812 -1758 -1734 -1574 -1477 -1375 -1166 -1035 -856 -611 -470 -243 -20
2246 -20 139 383 583 762 972 1101 1277 1421 1507 1655 1682 1717 1790 1732 1752 1717 1594 1556 1438 1284 1187 1018 807
2269 807 689 455 235 98 -166 -345 -494 -742 -895 -1026 -1226 -1302 -1425 -1559 -1579 -1657 -1718 -1675 -1707 -1666 -1582 -1521 -1399
2292 -1399 -1280 -1152 -981 -833 -638 -462 -287 -69 109 284 510 679 830 1016 1146 1257 1416 1455 1530 1633
2312 1633 1595 1625 1641 1538 1553 1471 1321 1289 1123 972 874 656 481 339 105 -62 -234 -450 -590 -774 -922 -1041
$$ packed form
2158A428j87k04j94k60k17k25l02j88k31k76j56k23j99r2j96r6o6r9pk6lM7O8
2181a904R9J09J40J56J63K08K08J94K48K08K03K64J99K01K51J67J67J88R6J33
2201A698J26J1P9L1n2J7p9j03p2j50j43j35j99j68k31k25j98k58j64k36k39j40
2223h30k18j62j14j93r2o8j16j0ro4O4N4K4J60R7J02K09J31J79K45J41K27K23
2246b0J59K44K00J79K10J29J76J44Q6J48K7L5P3n8K0l5j23l8j18j54r7j69k11
2269H07j18k34k20j37k64j79j49k48j53j31k00p6j23j34k0p8o1M3l2M1Q4O1J22
2292a399J19J28J71J48J95J76J75K18J78J75K26J69J51J86J30J11J59L9P5J03
2312A633l8L0J6j03J5q2j50l2j66j51r8k18j75j42k34j67j72k16j40j84j48j19
$$ plain form
2334 -1041 -1203 -1308 -1373 -1484 -1507 -1553 -1590 -1533 -1535 -1479 -1345 -1329 -1191 -1023 -973 -754 -597 -508 -233 -118 25 296 381 557
2358 557 783 848 1025 1170 1210 1368 1421 1432 1514 1502 1494 1513 1429 1389 1316 1178 1112 957 808 691 475 331 176 -65
2382 -65 -173 -366 -586 -647 -853 -1001 -1042 -1235 -1294 -1311 -1455 -1427 -1440 -1500 -1407 -1398 -1338 -1215 -1164 -1048 -904 -809 -652 -480 -346
2407 -346 -174 -5 143 312 473 643 789 902 1049 1163 1220 1328 1359 1384 1463 1401 1408 1394 1279 1254 1146 1007 950
2430 950 772 630 494 307 151 -6 -169 -327 -480 -637 -771 -882 -1003 -1117 -1198 -1274 -1338 -1346 -1388 -1405 -1373 -1350 -1301
2453 -1301 -1219 -1146 -1065 -908 -819 -694 -518 -408 -239 -54 59 243 414 539 695 826 937 1050 1139 1218 1251 1305
2475 1305 1348 1320 1344 1297 1233 1208 1088 999 929 751 647 533 327 210 76 -112 -218 -378 -556 -644 -773 -920 -993
2498 -993 -1083 -1178 -1219 -1279 -1299 -1305 -1316 -1261 -1244 -1185 -1082 -1036 -896 -790 -705 -517 -413 -287 -77 2 180 358 438 634 750
$$ packed form
2334a041j62j05o5j11k3m6l7N7kN6J34J6J38J68N0K19J57Q9K75J15J43K71Q5J76
2358E57K26O5J77J45M0J58N3J1Q2j2qJ9q4m0p3j38o6j55j49j17k16j44j55k41
2382f5j08j93k20o1k06j48m1j93n9j7j44K8j3o0R3RO0J23N1J16J44R5J57J72J34
2407c46J72J69J48J69J61J70J46J13J47J14N7J08L1K5P9o2Pj4j15k5j08j39n7
2430I50j78j42j36j87j56j57j63j58j53j57j34j11j21j14q1p6o4qm2j7L2K3M9
2453a301Q2P3Q1J57Q9J25J76J10J69J85J13J84J71J25J56J31J11J13Q9P9L3N4
2475A305M3k8K4m7o4k5j20q9p0j78j04j14k06j17j34j88j06j60j78q8j29j47p3
2498i93r0r5m1o0k0oj1N5J7N9J03M6J40J06Q5J88J04J26K10P9J78J78Q0J96J16
$$ plain form
2523 750 822 975 1040 1079 1178 1193 1223 1270 1218 1212 1191 1103 1065 981 861 787 636 511 409 229 125 -7 -178 -265 -425
2548 -425 -568 -629 -811 -883 -957 -1073 -1081 -1151 -1228 -1182 -1205 -1198 -1127 -1122 -1042 -921 -896 -772 -650 -579 -409 -275 -178 11 129 247
2574 247 419 514 637 774 830 948 1001 1062 1121 1124 1160 1169 1121 1141 1077 989 973 836 764 687 505 428 312 124 61 -91
2600 -91 -246 -316 -478 -611 -679 -801 -886 -946 -1039 -1056 -1092 -1138 -1110 -1104 -1092 -1035 -990 -910 -822 -765 -611 -541 -428 -262 -193 -37 128
2627 128 197 377 474 568 725 774 847 976 979 1035 1100 1072 1106 1108 1053 1050 1001 906 861 755 651 550 418 308 184 60
2653 60 -41 -190 -293 -405 -554 -616 -733 -845 -856 -964 -1017 -991 -1100 -1068 -1025 -1064 -979 -950 -932 -798 -745 -654 -514 -444 -316
2678 -316 -191 -87 57 173 287 418 495 622 722 766 867 923 932 1025 1011 1004 1062 966 972 952 813 818 722 577 566 435
2704 435 278 237 55 -45 -106 -295 -348 -472 -603 -625 -752 -826 -850 -949 -957 -964 -1008 -960 -972 -963 -874 -862 -785 -684 -651 -521 -411
$$ packed form
2523G50P2J53O5L9R9J5L0M7n2ok1q8l8q4j20p4j51j25j02j80j04j32j71q7j60
2548d25j43o1j82p2p4j16qp0p7M6k3PP1NQ0J21K5J24J22P1J70J34R7J89J18J18
2574B47J72R5J23J37N6J18N3O1N9LL6Rm8K0o4q8j6j37p2p7j82p7j16j88o3j52
2600i1j55p0j62j33o8j22q5o0r3j7l6m6K8OJ2N7M5Q0Q8N7J54P0J13J66O9J56J65
2627A28O9J80R7R4J57M9P3J29LN6O5k8L4Kn5lm9r5m5j06j04j01j32j10j24j24
2653F0j01j49j03j12j49o2j17j12j1j08n3K6j09L2M3l9Q5K9J8J34N3R1J40P0J28
2678c16J25J04J44J16J14J31P7J27J00M4J01N6RR3j4pN8r6Ok0j39Nr6j45j1j31
2704D35j57m1j82j00o1j89n3j24j31k2j27p4k4r9qpm4M8j2RQ9J2P7J01L3J30J10
$$ plain form
2731 -411 -353 -182 -103 -31 167 214 328 477 485 624 719 719 849 867 866 967 912 937 951 874 892 818 729 710 588 504 454
2758 454 294 227 138 -12 -69 -191 -319 -364 -516 -604 -632 -775 -800 -809 -915 -886 -897 -943 -868 -889 -863 -764 -761 -657 -573 -526 -398
2785 -398 -331 -227 -90 -30 94 203 270 403 465 540 639 679 758 808 803 863 882 854 901 857 810 805 716 662 611 503 439 355
2813 355 234 156 60 -61 -133 -247 -337 -418 -517 -567 -665 -713 -730 -823 -799 -818 -873 -799 -822 -799 -717 -714 -653 -549 -522 -404 -308 -262
2841 -262 -134 -55 18 150 222 306 410 460 551 610 650 725 755 775 835 790 817 817 756 767 698 637 623 494 429 385 221 185
2869 185 119 -41 -64 -175 -305 -324 -449 -509 -522 -642 -657 -684 -747 -731 -759 -771 -710 -753 -704 -649 -641 -544 -480 -445 -317 -270 -197
2896 -197 -62 -48 75 192 199 342 399 413 569 569 592 718 673 719 769 691 740 720 642 669 584 521 513 406 351 282 181
2923 181 134 43 -63 -98 -216 -287 -339 -440 -489 -527 -620 -598 -648 -704 -658 -720 -714 -638 -688 -628 -563 -573 -459 -418 -373 -260 -205 -136
$$ packed form
2731d11N8J71P9P2J98M7J14J49QJ39R5%J30J8jJ01n5K5J4p7J8p4q9j9j22q4n0
2758D54j60o7q9j50n7j22j28m5j52q8k8j43k5rj06K9j1m6P5k1K6R9LJ04Q4M7J28
2785c98O7J04J37O0J24J09O7J33O2P5R9M0P9N0nO0J9k8M7m4m7nq9n4n1j08o4q4
2813C55j21p8r6j21p2j14r0q1r9n0r8m8j7r3K4j9n5P4k3K3Q2LO1J04K7J18R6M6
2841b62J28P9P3J32P2Q4J04N0R1N9M0P5L0K0O0m5K7%o1J1o9o1j4j29o5m4j64l6
2869A85o6j60k3j11j30j9j25o0j3j20j5k7o3J6k8j2O1m3M9N5QR7O4L5J28M7P3
2896a97J35J4J23J17PJ43N7J4J56%K3J26m5M6N0p8M9k0p8K7q5o3qj07n5o9j01
2923A81m7r1j06l5j18p1n2j01m9l8r3K2n0n6M6o2OP6n0O0O5j0J14M1M5J13N5O9
$$ plain form
2951 -136 -26 19 98 200 239 325 394 430 510 552 586 640 645 677 688 654 672 633 582 585 505 472 436 323 290 229 119 90 -17
2980 -17 -98 -142 -237 -317 -365 -434 -492 -518 -576 -600 -620 -643 -660 -645 -650 -626 -608 -564 -533 -480 -417 -370 -286 -218 -162 -72 -10 59 145 205 261
3011 261 342 387 451 505 523 572 619 625 636 635 620 602 594 549 497 470 410 349 307 219 139 104 15 -58 -109 -215 -258 -310 -389 -418 -482
3042 -482 -533 -549 -572 -604 -611 -613 -595 -590 -581 -553 -509 -476 -406 -362 -301 -239 -173 -95 -37 23 110 155 228 310 336 394 464 480 532 571 556 589
3074 589 586 567 569 534 494 499 435 391 361 286 234 179 100 44 -25 -101 -141 -206 -273 -327 -370 -405 -449 -489 -499 -528 -540 -538 -551 -537 -512 -502
3106 -502 -457 -425 -397 -326 -295 -233 -156 -109 -52 14 64 124 209 243 299 356 379 427 454 474 498 502 503 522 509 486 459 438 409 372 332
3137 332 286 227 194 132 60 21 -55 -112 -155 -225 -270 -298 -356 -385 -408 -451 -455 -463 -489 -481 -477 -472 -436 -420 -387 -339 -309 -259 -199 -168 -113 -61
3169 -61 -32 35 83 142 183 230 277 306 350 390 402 434 448 438 466 448 454 431 401 380 358 315 282 236 180 125 82 28 -24 -70 -123
$$ packed form
2951a36J10M5P9J02L9Q6O9L6Q0M2L4N4NL2J1l4J8l9n1Lq0l3l6j13l3o1j10k9j07
2980a7q1m4r5q0m8o9n8k6n8k4k0k3j7J5nK4J8M4L1N3O3M7Q4O8N6R0O2O9Q6O0N6
3011B61Q1M5O4N4J8M9M7OJ1jj5j8qm5n2k7o0o1m2q8q0l5q9p3n1j06m3n2p9k9o4
3042d82n1j6k3l2pkJ8NRK8M4L3P0M4O1O2O6P8N8O0Q7M5P3Q2K6N8P0J6N2L9j5L3
3074E89lj9Kl5m0No4m4l0p5n2n5p9n6o9p6m0o5o7n4m3l5m4m0j0k9j2Kj3J4K5J0
3106e02M5L2K8P1L1O2P7M7N7O6N0O0Q5L4N6N7K3M8K7K0K4MJJ9j3k3k7k1k9l7m0
3137C32m6n9l3o2p2l9p6n7m3p0m5k8n8k9k3m3mqk6QMNL6J6L3M8L0N0O0L1N5N2
3169f1K9O7M8N9M1M7M7K9M4M0J2L2J4j0K8j8Ok3l0k1k2m3l3m6n6n5m3n4n2m6n3
$$ plain form
3200 -123 -164 -211 -252 -288 -312 -347 -368 -396 -397 -416 -404 -422 -407 -380 -388 -370 -319 -305 -266 -220 -193 -139 -93 -55 -2 35 85 129 174 214 262
3231 262 302 321 341 377 380 400 399 400 396 390 356 337 327 280 252 211 155 127 94 26 -3 -39 -98 -134 -170 -207 -223 -268 -293 -306 -336 -361
3263 -361 -358 -365 -362 -377 -338 -341 -314 -285 -277 -232 -199 -175 -121 -93 -56 0 35 69 118 158 195 222 257 285 303 306 323 329 337 327 339 319 308 292
3297 292 265 249 219 185 146 113 77 42 20 -36 -70 -96 -148 -168 -189 -227 -252 -262 -289 -296 -322 -322 -320 -316 -298 -300 -261 -243 -234 -186 -170 -145 -101
3330 -101 -77 -40 5 16 72 107 133 177 209 217 262 269 268 295 283 299 317 288 294 294 256 252 221 186 177 141 114 78 37 27 -33 -68 -84
3363 -84 -134 -152 -168 -223 -215 -236 -269 -255 -276 -294 -266 -268 -264 -226 -246 -219 -181 -181 -141 -115 -103 -52 -39 -6 40 47 93 117 137 175 199 212 243
3396 243 246 271 273 261 285 276 251 271 235 205 223 160 148 130 85 62 37 -19 -21 -49 -102 -94 -135 -166 -160 -202 -220 -216 -239 -241 -242 -249 -237 -242 -225
3431 -225 -213 -215 -178 -175 -156 -117 -104 -70 -40 -28 18 57 57 115 129 139 177 177 191 217 208 226 235 225 221 219 202 194 172 150 129 106 85 70
$$ packed form
3200a23m1m7m1l6k4l5k1k8jj9J2j8J5K7qJ8N1J4L9M6K7N4M6L8N3L7N0M4M5M0M8
3231B62M0J9K0L6LK0jJmol4j9j0m7k8m1n6k8l3o8k9l6n9l6l6l7j6m5k5j3l0k5
3263c61LpLj5L9lK7K9QM5L3K4N4K8L7N6L5L4M9M0L7K7L5K8J8LJ7OQj0J2k0j1j6
3297B92k7j6l0l4l9l3l6l5k2n6l4k6n2k0k1l8k5j0k7pk6%KMJ8kL9J8RM8J6K5M4
3330a01K4L7M5J1N6L5K6M4L2QM5PjK7j2J6J8k9O%l8ml1l5rl6k7l6m1j0o0l5j6
3363h4n0j8j6n5Qk1l3J4k1j8K8kML8k0K7L8%M0K6J2N1J3L3M6PM6K4K0L8K4J3L1
3396B43LK5Kj2K4rk5K0l6l0J8o3j2j8m5k3k5n6kk8n3Qm1l1Om2j8Mk3kjpJ2nJ7
3431b25J2kL7LJ9L9J3L4L0J2M6L9%N8J4J0L8%J4K6rJ8Rj0mkj7qk2k2k1k3k1j5
$$ plain form
3465 70 39 24 -18 -33 -63 -91 -100 -114 -143 -151 -174 -196 -182 -207 -206 -217 -228 -216 -231 -208 -201 -189 -166 -151 -135 -108 -89 -51 -28 -23 24 45 65
3498 65 108 99 128 153 149 168 187 160 182 190 165 186 177 148 181 144 119 127 97 87 66 37 39 -1 -15 -27 -58 -58 -83 -121 -103 -139 -173 -154
3532 -154 -195 -192 -187 -211 -192 -172 -210 -162 -153 -156 -121 -116 -98 -58 -59 -36 -3 -1 39 66 69 96 101 116 150 138 162 174 150 181 164 160 187 145 153
3567 153 155 118 137 121 70 100 66 36 44 -5 -17 -22 -65 -79 -96 -121 -116 -134 -169 -153 -179 -182 -162 -187 -171 -165 -161 -139 -137 -128 -90 -96 -73 -37 -36
3602 -36 9 3 11 54 42 73 94 92 120 137 122 152 157 151 177 169 154 175 151 146 139 116 109 100 77 64 36 19 12 -10 -36 -45 -74 -81 -100 -125 -122
3639 -122 -158 -137 -162 -169 -152 -154 -145 -122 -146 -123 -120 -107 -92 -63 -66 -50 -36 -17 4 23 40 61 73 79 96 117 121 134 134 152 153 163 159 146 154
3674 154 136 124 126 97 92 82 47 51 31 9 5 -24 -39 -63 -76 -90 -99 -117 -119 -134 -131 -139 -146 -135 -136 -144 -136 -137 -113 -118 -105 -99 -56 -64 -44 -24 -13 5
3712 5 20 35 72 75 79 108 96 123 128 127 134 141 134 148 133 139 123 115 115 93 69 70 44 47 29 -1 -15 -20 -44 -50 -59 -88 -82 -109 -114 -122 -134 -136 -121 -140
$$ packed form
3465G0l1j5m2j5l0k8rj4k9qk3k2J4k5Jj1j1J2j5K3PJ2K3J5J6K7J9L8K3NM7K1K0
3498F5M3rK9K5mJ9J9k7K2Qk5K1rk9L3l7k5Ql0j0k1k9Km0j4j2l1%k5l8J8l6l4J9
3532a54m1LNk4J9K0l8M8RlL5NJ8M0jK3L3KM0K7LK7NJ5L4j2K4J2k4L1j7mK7m2Q
3567A53Kl7J9j6n1L0l4l0Qm9j2nm3j4j7k5Nj8l5J6k6lK0k5J6OMK2KRL8oK3L6J
3602c6M5oQM3j2L1K1kK8J7j5L0NoK6qj5K1k4npk3prk3j3k8j7pk2k6rk9pj9k5L
3639a22l6K1k5pJ7kRK3k4K3LJ3J5K9lJ6J4J9K1J9J7K1J2OJ7K1MJ3%J8JJ0mj3Q
3674A54j8j2Kk9nj0l5Mk0k2mk9j5k4j3j4rj8kj5LqpJ1jqQjK4nJ3OM3qK0K0J1J8
3712EJ5J5L7LMK9j2K7NjPPpJ4j5Oj6q%k2k4Jk6Lj8l0j4nk4ork9Ok7nqj2kJ5j9
$$ plain form
3752 -140 -128 -123 -133 -113 -118 -117 -87 -77 -69 -46 -44 -24 -3 -1 23 40 43 62 75 98 102 96 112 122 128 137 135 136 134 113 116 121 101 97 90 59 66 38 26
3791 26 9 1 -15 -24 -50 -59 -75 -93 -96 -109 -119 -112 -128 -123 -132 -127 -117 -122 -104 -101 -95 -90 -75 -63 -53 -41 -18 6 6 11 24 48 44 74 76 83 102 99 110
3830 110 119 115 113 115 111 116 106 108 82 69 57 47 40 28 7 0 -7 -25 -27 -58 -62 -69 -86 -89 -93 -108 -102 -108 -104 -98 -106 -88 -99 -83 -89 -79 -68 -54 -52 -33 -22
3871 -22 -26 7 14 21 44 53 60 78 73 76 95 84 96 102 89 111 103 92 99 77 80 71 63 44 32 28 10 7 -11 -11 -23 -36 -35 -56 -55 -67 -78 -82 -89 -86 -76
3912 -76 -91 -80 -73 -84 -65 -81 -84 -54 -62 -52 -36 -37 -20 7 -11 22 22 23 37 48 58 59 69 75 83 85 85 85 85 78 80 71 62 70 60 39 43 40 22 16 23
3953 23 -7 -8 -11 -35 -39 -33 -50 -59 -59 -66 -69 -77 -81 -77 -78 -76 -79 -78 -64 -52 -53 -48 -47 -29 -24 -12 7 9 25 21 31 35 48 48 65 61 70 66 76 69 70 72 75 63 64 57
3999 57 41 62 36 34 40 -2 11 -1 -18 -16 -35 -44 -39 -57 -58 -51 -72 -78 -76 -78 -74 -62 -85 -60 -78 -58 -51 -48 -34 -30 -23 -3 -1 10 21 21 37 43 38 49
4039 49 48 46 68 65 66 77 59 64 80 53 66 49 35 43 27 25 24 10 2 1 -13 -20 -27 -32 -41 -37 -57 -73 -67 -66 -68 -63 -67 -58 -67 -52 -55 -45 -35 -42 -27 -21 -21
$$ packed form
3752a40J2Nj0K0nJL0J0QK3KK0K1KK4J7LJ9J3K3MoJ6J0ORkJkk1LNk0mpl1Pk8j2
3791B6j7qj6rk6rj6j8lj3j0Pj6NrNJ0nJ8LONJ5J2J0J2K3K4%NJ3K4mL0KPJ9lJ1
3830A10RmkKmNj0Kk6j3j2j0pj2k1ppj8kl1mpj7lmj5OoMOqJ8j1J6oJ0J1J4KJ9J1
3871b2mL3PPK3RPJ8nLJ9j1J2Oj3K2qj1Pk2Lrqj9j2mj8lj8%j2j3Jk1Jj2j1mpLJ0
3912g6j5J1Pj1J9j6lL0qJ0J6jJ7K7j8L3%JJ4J1J0JJ0OQK%%%pKrrQj0k1Mlj8oP
3953B3l0jlk4mOj7r%plqmMjKlJJ4J2jNJJ8NJ2J9KJ6mJ0MJ3%J7mRmJ0pJKLj2Jp
3999E7j6K1k6kOm2J3j2j7Kj9rNj8jPk1oKkMJ2k3K5j8K0PLJ4MPK0KJ1J1%J6OnJ1
4039D9jkK2lJJ1j8NJ6k7J3j7j4Qj6kjj4qjj4ppnrMk0j6OJkNmRrJ5lJ0J0pJ5O%
$$ plain form
4082 -21 -1 -7 4 22 11 32 36 33 36 47 53 45 62 45 54 62 52 48 57 57 46 49 33 40 30 15 4 14 5 -11 -9 -22 -32 -32 -39 -52 -53 -46 -45 -52 -61
4123 -61 -46 -40 -51 -50 -32 -29 -39 -20 -24 -20 -7 -2 -3 13 -4 8 21 9 23 29 15 37 32 30 45 38 44 44 41 43 37 29 34 28 26 13 11 5 -2 -2 -11 -18 -14 -13
4167 -13 -23 -35 -22 -31 -36 -32 -38 -23 -23 -46 -14 -27 -34 -12 -25 -20 -10 -25 -11 -11 -16 2 2 0 2 14 13 19 20 26 12 16 32 18 17 30 18 24 23 9
4207 9 23 24 15 17 -1 -8 4 -9 -22 -14 -28 -24 -17 -37 -26 -28 -29 -19 -30 -31 -27 -17 -27 -21 -17 -20 -15 -16 -6 -11 0 2 -2 0 13 6 23 17 29 33 32 34 46
4250 46 25 21 32 13 28 26 16 23 25 9 3 2 1 -2 -8 -23 -19 -19 -27 -26 -24 -39 -34 -36 -33 -34 -18 -30 -19 -19 -23 -28 -17 -19 -13 -11 -9 0 0 15 21 13 18 31 25 37
4296 37 31 47 44 37 43 37 47 41 29 30 30 26 14 7 2 8 -1 -9 -2 -21 -21 -16 -36 -18 -53 -41 -37 -38 -47 -35 -46 -43 -39 -35 -44 -37 -43 -26 -26 -20 -8 -9 9 10 14 25
4342 25 24 23 38 41 47 50 46 56 60 50 54 55 45 58 38 40 34 23 17 27 20 12 9 -2 3 -4 -17 -15 -29 -18 -28 -46 -38 -65 -50 -44 -61 -53 -48 -63 -47
4383 -47 -47 -52 -32 -43 -46 -27 -20 -13 1 -1 7 10 12 31 30 40 39 45 51 55 53 50 47 50 66 55 61 58 45 48 53 38 42 33 11 29 -1 7 4 -21 -13 -20 -46 -30
$$ packed form
4082b1K0oJ1J8j1K1MlLJ1OqJ7j7RQj0mR%j1Lj6Pj0j5j1J0rj6Kj3j0%pj3jPJpr
4123f1J5Oj1JJ8Lj0J9mMJ3NjJ6j7J2J3j2J4Oj4K2nkJ5pO%lKoqNokj3kop%rpMJ
4167a3j0j2J3rnMoJ5%k3L2j3pK2j3NJ0j5J4%nJ8%kKJ2jOJOj4MJ6j4jJ3j2Ojj4
4207IJ4JrKj8pJ2j3j3Qj4MPk0J1kjJ0j1jMJ0j0OMlNjJ0nJ1KmKJ3pJ7oJ2MjKJ2
4250D6k1mJ1j9J5kj0PKj6ojjloj5M%qJKj5NkLjJ6j2J1%mnJ1kOKKR%J5OqNJ3oJ2
4296C7oJ6lpOoJ0oj2J%mj2pnOrqPj9%Nk0J8l5J2MjrJ2j1LMMrPoJ7%OJ2jJ8JMJ1
4342B5jjJ5LOLmJ0Mj0MJj0J3k0Koj1oJ0pqlj1Npj3Kj4J1j0j8Qk7J5Oj7QNj5J6
4383d7%nK0j1lJ9PPJ4kQLKJ9jJ0jOOMkllLJ6j1Olj3LNj5Mrk2J8l0Qlk5Qpk6J6
$$ plain form
4427 -30 -53 -66 -57 -70 -59 -57 -84 -61 -65 -63 -54 -61 -48 -40 -45 -35 -23 -27 -18 -12 -6 13 9 28 45 30 48 59 51 63 68 70 80 88 77 90 70 79 79 72
4467 72 62 49 42 38 28 20 4 4 -6 -20 -14 -27 -42 -41 -48 -66 -64 -67 -87 -64 -81 -77 -75 -83 -62 -67 -74 -59 -63 -49 -32 -38 -18 -9 -2 13 17 27 41 33
4507 33 57 76 71 80 77 80 98 90 86 96 86 74 79 51 59 47 32 33 25 9 2 -18 -18 -31 -44 -48 -52 -56 -66 -77 -78 -73 -82 -83 -91 -90 -80 -75 -74 -60 -64 -65 -39
4550 -39 -52 -22 -17 -18 15 8 6 35 47 43 65 49 71 86 78 86 89 91 97 93 90 82 64 74 70 48 56 31 30 33 15 8 -7 -26 -23 -40 -57 -63 -66 -77 -76
4591 -76 -84 -88 -90 -102 -88 -92 -96 -85 -79 -89 -62 -57 -50 -36 -36 -16 -12 -2 27 12 27 43 45 54 75 77 86 86 87 101 95 106 93 84 84 84 70 73 67 54 50 48
4633 48 27 18 2 -12 -9 -39 -39 -52 -58 -67 -78 -93 -94 -97 -107 -111 -102 -103 -102 -86 -85 -84 -75 -71 -56 -46 -32 -20 -14 3 8 23 30 51 60 73 91 77 93 100
4673 100 111 105 110 110 106 110 107 105 98 90 80 76 53 45 23 20 0 -12 -20 -33 -52 -67 -80 -85 -98 -111 -99 -127 -118 -120 -120 -120 -118 -106 -102 -98 -79 -71 -73 -52 -40
4714 -40 -32 -5 1 10 30 44 47 65 66 88 104 102 120 114 117 128 117 125 114 104 99 99 82 76 64 54 47 29 16 6 -14 -24 -41 -53 -71 -80 -85 -99
$$ packed form
4427c0k3j3Rj3J1Kk7K3mKRpJ3QnJ0J2mROOJ9mJ9J7j5J8J1qJ2NKJ0Qj1J3k0R%p
4467G2j0j3pmj0qj6%j0j4Oj3j5Jpj8Klk0K3j7MKqK1npJ5mJ4J7oK0RPJ5MJ0J4q
4507C3K4J9nRlLJ8qmJ0j0j2Nk8Qj2j5Jqj6pk0%j3j3mmmj0j1jNrjqJJ0NJJ4mjK6
4550c9j3L0NjL3pkK9J2mK2j6K2J5qQLKOmlqj8J0mk2Qk5jLj8pj5j9Lj7j7olj1J
4591g6qmkj2J4mmJ1Oj0K7NPJ4%K0MJ0K9j5J5J6KRK1KR%JJ4oJ1j3r%%j4Loj3mk
4633D8k1rj6j4Ll0%j3orj1j5jlj0mRjJJ6JJRMJ5J0J4J2OJ7NJ5PK1RJ3J8j4J6P
4673A00J1oN%mMlkpqj0mk3qk2lk0j2qj3j9j5j3nj3j3J2k8Rk%%KJ2MMJ9QkK1J2
4714d0QK7ORK0J4LJ8JK2J6kJ8oLJ1j1Qj1j0n%j7oj2j0pj8j3j0k0j0j7j2j8rnj4
$$ plain form
4752 -99 -103 -112 -112 -117 -116 -124 -128 -113 -127 -107 -98 -92 -82 -67 -45 -42 -29 -31 9 16 11 39 45 66 73 91 88 104 101 114 115 120 126 120 110 101 94 98 86 72 67 56 44
4795 44 26 16 2 -9 -30 -33 -50 -67 -82 -84 -93 -99 -117 -121 -125 -124 -122 -118 -110 -109 -106 -108 -91 -81 -75 -53 -33 -26 -20 1 14 25 32 61 72 86 81 95 108
4834 108 104 124 133 131 135 120 124 107 108 103 90 85 67 55 43 45 21 3 -18 -19 -34 -56 -68 -90 -100 -104 -114 -118 -122 -131 -127 -145 -134 -130 -129 -109 -108 -101 -76
4873 -76 -70 -52 -38 -25 -12 10 14 33 48 71 74 85 97 103 111 119 129 117 126 119 130 122 104 108 99 90 81 68 50 30 32 8 -14 -31 -44 -52 -69 -86
4911 -86 -101 -109 -119 -117 -123 -126 -144 -135 -136 -143 -124 -126 -115 -103 -85 -67 -62 -57 -34 -15 -4 15 16 38 45 65 80 94 93 109 113 125 133 128 127 123 114 115 116 94 84
4952 84 81 68 57 46 24 22 0 -16 -35 -48 -50 -71 -69 -99 -104 -114 -115 -122 -123 -119 -125 -118 -117 -109 -110 -105 -94 -87 -87 -70 -57 -33 -26 -13 3 32 25 38 60 79
4992 79 80 102 92 105 103 109 116 120 133 110 110 104 96 88 82 68 49 43 27 26 3 -14 -9 -28 -44 -55 -63 -87 -95 -105 -102 -104 -107 -127 -119 -114 -119 -110 -111 -102 -93 -94 -75
5035 -75 -69 -56 -47 -31 -25 -13 -2 27 42 58 63 74 74 88 102 103 103 111 113 123 124 106 99 102 98 80 70 71 54 37 21 16 5 -13 -22 -37 -58 -63 -79
$$ packed form
4752i9mr%nJqmJ5j4K0ROJ0J5K2LJ3kM0PnK8OK1PJ8lJ6lJ3JNOoj0rpMj2j4nj1j2
4795D4j8j0j4j1k1lj7j7j5kroj8mmJKMQJLkJ7J0OK2K0POK1J3J1PK9J1J4nJ4J3
4834A08mK0RkMj5Mj7Jnj3nj8j2j2Kk4j8k1jj5k2j2k2j0mj0mmrMj8J1MJK0JPK5
4873g6OJ8J4J3J3K2MJ9J5K3LJ1J2OQQJ0j2RpJ1qj8Mrrrj3j8k0Kk4k2j7j3qj7j7
4911h6j5qj0Kolj8RjpJ9kJ1J2J8J8NNK3J9J1J9JK2PK0J5J4jJ6MJ2QnjmrJJk2j0
4952H4lj3j1j1k2kk2j6j9j3kk1Kl0nj0jpjMoPJQjNJ1P%J7J3K4PJ3J6K9pJ3K2J9
4992G9JK2j0J3kOPMJ3k3%oqqoj4j9oj6jk3j7Nj9j6j1qk4qj0Lklk0QNnRjRRjJ9
5035g5OJ3RJ6OJ2J1K9J5J6NJ1%J4J4J%QKJ0Jj8pLmj8j0Jj7j7j6nj1j8rj5k1nj6
$$ plain form
5074 -79 -86 -92 -102 -115 -130 -124 -116 -124 -127 -122 -116 -113 -93 -86 -74 -69 -64 -52 -41 -22 0 6 25 42 51 60 72 96 89 97 102 114 107 123 117 115 113 95 103 95 86 81 63
5117 63 55 51 30 22 7 -17 -23 -43 -44 -71 -74 -79 -93 -97 -112 -124 -113 -115 -115 -116 -111 -114 -111 -100 -92 -75 -64 -49 -43 -25 -17 1 -3 14 28 40 50 69 77 92
5157 92 99 106 105 115 111 115 118 113 108 104 102 91 71 74 42 41 38 14 4 -2 -28 -40 -56 -70 -71 -95 -94 -104 -103 -99 -112 -119 -120 -115 -122 -125 -114 -116 -92 -87 -76 -64 -46
5200 -46 -34 -24 -8 4 11 23 42 50 77 68 81 92 106 108 125 115 114 134 121 120 111 101 90 82 73 67 50 44 37 14 4 -12 -27 -42 -52 -74
5236 -74 -75 -78 -103 -102 -118 -114 -122 -123 -136 -129 -119 -121 -116 -99 -95 -94 -74 -63 -42 -42 -26 -2 17 30 40 61 71 85 92 99 119 120 135 133 123 120 135 116 128
5275 128 116 103 101 91 80 59 39 42 15 12 1 -25 -29 -43 -65 -73 -92 -100 -106 -112 -121 -124 -126 -128 -133 -129 -117 -113 -99 -94 -90 -77 -61 -51 -28 -21 -5 6 15
5314 15 36 45 55 74 80 102 107 108 129 119 131 129 129 114 121 128 112 113 97 81 76 64 47 33 3 -2 -13 -23 -44 -68 -81 -79 -97 -98 -107 -116 -123 -118 -120
5353 -120 -131 -126 -118 -111 -122 -109 -88 -84 -64 -61 -46 -31 -18 -4 10 22 37 63 55 77 77 87 103 106 111 118 121 133 122 122 125 118 109 99 89 72 58
$$ packed form
5074g9poj0j3j5OQqlNOLK0PJ2NNJ2J1J9K2OJ9J7RRJ2K4pQNJ2pJ6okkj8Qqrnj8
5117F3qmk1qj5k4ok0jk7lnj4mj5j2J1k%jNlLJ1QJ7J1J5OJ8QJ8mJ7J4J2J0J9QJ5
5157I2PPjJ0mMLnnmkj1k0Ll2jlk4j0ok6j2j6j4jk4Jj0JMj3pjNplJ1kK4NJ1J2J8
5200d6J2J0J6J2PJ2J9QK7rJ3J1J4KJ7j0jK0j3jrj0j1qroj7opk3j0j6j5j5j0k2
5236g4jlk5Jj6Mqjj3PJ0kNJ7MJK0J1K1%J6K4J9J3J0K1J0J4PPK0JJ5kj0lJ5j9J2
5275A28j2j3kj0j1k1k0Lk7lj1k6mj4k2qj9qoorlkknMJ2MJ4NMJ3J6J0K3PJ6J1R
5314A5K1RJ0J9OK2NJK1j0J2k%j5PPj6Jj6j6nj2j7j4l0nj1j0k1k4j3Kj8jrrpNk
5353a20j1NQPj1J3K1MK0LJ5J5J3J4J4J2J5K6qK2%J0J6LNPLJ2j1%Lprj0j0j7j4
$$ plain form
5390 58 49 42 15 0 -5 -25 -42 -50 -67 -84 -82 -93 -104 -101 -115 -115 -118 -119 -114 -128 -115 -122 -106 -98 -84 -81 -73 -61 -46 -21 -16 2 15 27 37 56 68 85
5428 85 90 101 109 114 118 120 120 132 125 117 113 109 91 93 81 69 66 43 25 21 3 -15 -27 -34 -47 -62 -75 -86 -97 -104 -117 -126 -121 -129 -130 -126 -118 -123 -116 -108 -93 -86 -72
5471 -72 -50 -52 -24 -8 -4 14 34 54 61 74 84 93 89 104 115 122 116 125 124 124 114 113 112 101 85 83 68 57 35 27 12 1 -5 -25 -52 -67 -70 -85
5509 -85 -91 -116 -116 -118 -127 -126 -124 -128 -122 -123 -124 -108 -93 -90 -79 -73 -55 -35 -20 -8 7 25 25 36 49 73 79 91 95 101 107 118 126 122 111 120 123 116 110 81 87 75
5551 75 59 57 51 34 17 -7 -15 -27 -43 -52 -63 -80 -90 -89 -108 -110 -107 -114 -106 -124 -106 -110 -120 -97 -95 -87 -67 -54 -47 -39 -22 -12 -14 12 20 34 33 54 69
5590 69 91 88 109 102 119 126 122 130 123 117 117 108 102 82 84 74 67 56 18 27 13 -1 -15 -30 -42 -48 -59 -78 -85 -90 -104 -112 -115 -104 -118 -112 -112 -108 -104 -101 -92 -86 -73
5633 -73 -56 -58 -46 -22 -9 -6 16 35 41 57 60 75 92 93 108 106 112 119 111 112 116 109 107 105 94 73 84 71 60 40 37 22 4 -3 -27 -32 -39 -61 -68 -75
5673 -75 -83 -96 -88 -113 -107 -110 -118 -112 -123 -106 -106 -97 -91 -78 -67 -55 -38 -28 -21 -5 13 28 34 54 61 75 74 86 85 103 94 103 114 107 109 106 99 108 100 97 81 64
$$ packed form
5390E8rpk7j5nk0j7qj7j7Kj1j1Lj4%ljNj4J3pJ6QJ4LQJ2J5K5NJ8J3J2J0J9J2J7
5428H5NJ1QNMK%J2pqmmj8Kj2j2lk3j8mj8j8j2pj3j5j3j1j1pj3rNqjMQnPQJ5PJ4
5471g2K2kK8J6MJ8K0K0PJ3J0RmJ5J1PoRj%j0jjj1j6kj5j1k2qj5j1ok0k7j5lj5
5509h5ok5%krJKmOjjJ6J5LJ1OJ8K0J5J2J5J8%J1J3K4OJ2MOOJ1Qmj1RLpok9Oj2
5551G5j6koj7j7k4qj2j6rj1j7j0Jj9kLpQj8J8mj0K3KQK0J3PQJ7J0kK6QJ4jK1J5
5590F9K2lK1pJ7PmQpo%rok0Kj0pj1l8Rj4j4j4j5j2oj1j9pnj4qlJ1j4O%MMLROJ3
5633g3J7kJ2K4J3LK2J9OJ6LJ5J7JJ5kOPqJMpkkj1k1J1j3j1k0lj5j8pk4npk2pp
5673g5qj3Qk5OlqOj1J7%ROJ3J1J2J7J0PJ6J8J5OK0PJ4jJ2jJ8rRJ1pKlpRqlj6j7
$$ plain form
5715 64 58 48 37 21 16 -1 -18 -17 -35 -41 -59 -65 -78 -83 -89 -101 -102 -99 -102 -107 -101 -93 -78 -87 -72 -79 -58 -49 -35 -30 -25 -6 -6 -4 19 29 36 56 58 72 81 83
5757 83 100 91 107 96 109 106 92 101 82 91 75 76 60 48 49 30 28 9 -12 -17 -22 -49 -58 -69 -66 -83 -78 -74 -98 -98 -104 -95 -87 -95 -92 -91 -86 -76 -74 -60 -47
5798 -47 -41 -33 -30 -3 3 7 26 39 50 63 71 69 87 93 104 113 102 114 117 106 105 91 85 87 71 75 63 49 23 25 0 -5 -8 -25 -30 -42 -57 -60 -73 -76
5838 -76 -89 -88 -96 -109 -100 -109 -103 -96 -103 -100 -89 -87 -78 -59 -47 -35 -22 -17 -8 11 20 35 51 55 66 84 87 106 105 109 108 104 101 101 99 99 98 93 90 66 44 46 45 23
5882 23 24 6 -6 -18 -32 -35 -44 -59 -68 -73 -87 -96 -94 -96 -116 -105 -109 -102 -98 -94 -88 -80 -83 -68 -45 -38 -21 -24 1 12 25 46 46 55 64 72 74 86 96 94 101 103 103
5925 103 110 104 92 90 94 78 78 58 58 45 31 22 9 5 -14 -32 -42 -48 -58 -69 -85 -74 -98 -92 -93 -102 -99 -104 -98 -111 -88 -85 -80 -73 -67 -56 -45 -30 -21 -8
5965 -8 -7 12 12 34 35 58 69 75 82 92 89 90 103 96 101 102 107 96 90 88 81 85 65 55 42 24 25 18 -5 -5 -25 -28 -43 -64 -64 -77 -86 -88 -92 -101 -102 -103 -103 -97 -97
6010 -97 -86 -79 -85 -74 -57 -57 -42 -29 -22 -13 -4 9 23 34 49 67 78 74 84 100 98 102 102 108 108 115 104 91 97 89 75 72 56 43 31 18 15 1 -11
$$ packed form
5715F4oj0j1j6nj7j7Jj8oj8oj3noj2jLlnOQJ5rJ5pK1RJ4NNJ9%KK3J0PK0KJ4RK
5757H3J7rJ6j1J3lj4Rj9Rj6Jj6j2Jj9kj9k1nnk7rj1Lj7NMk4%oRQqLJNJ0KJ4J3
5798d7OQLK7OMJ9J3J1J3QkJ8OJ1Rj1J2Lj1jj4oKj6Mj2j4k6Kk5nlj7nj2j5lj3l
5838g6j3Jqj3RrOPpLJ1KRJ9J2J2J3NRJ9RJ5J6MJ1J8LJ9jMjml%k%jnlk4k2Kjk2
5882B3Jj8j2j2j4lrj5rnj4rKkk0J1mPMMOQlJ5K3PJ7lK5J1J3K1%RRQKJ2J0kPK%
5925A03Poj2kMj6%k0%j3j4rj3mj9j8j0oj0j1j6J1k4OjrLnOj3K3LNPOJ1J1J5RJ3
5965hJJ9%K2JK3J1OPJ0lJJ3pNJNj1okpMk0j0j3j8Jpk3%k0lj5k1%j3rkmrjj%O%
6010i7J1PoJ1J7%J5J3PRRJ3J4J1J5J8J1mJ0J6kM%O%Pj1j3Oqj4lj6j3j2j3lj4j2
$$ plain form
6049 -11 -22 -34 -37 -52 -74 -65 -82 -88 -86 -95 -105 -110 -114 -106 -104 -106 -94 -85 -71 -66 -52 -52 -46 -26 -9 -5 12 30 29 44 53 62 77 84 88 85 99 110 102 108 96 104
6091 104 89 96 89 84 70 64 51 43 36 33 14 -3 -7 -34 -34 -39 -61 -64 -82 -84 -87 -86 -97 -97 -91 -101 -98 -94 -93 -83 -71 -59 -42 -37 -40 -22 -10 0 16 26
6131 26 35 39 54 55 59 73 75 74 88 92 103 107 104 93 85 91 84 77 74 74 51 45 44 20 9 7 -5 -16 -23 -34 -47 -61 -66 -80 -79 -81 -96 -89 -84 -94 -105 -86
6173 -86 -88 -77 -72 -76 -76 -56 -50 -39 -23 -13 8 14 17 14 43 38 52 68 81 77 84 81 101 101 88 111 92 94 91 82 74 75 58 50 35 30 14 17 -9 -12 -23
$$ packed form
6049a1j1j2lj5k2Rj7oKrj0nmQKkJ2RJ4NJ4%OK0J7MJ7J8jJ5RRJ5PMlJ4J1qOj2Q
6091A04j5Ppnj4oj3qplj9j7mk7%nk2lj8klJj1%Oj0LMJJ0J2J2J7NlJ8J2J0J6J0
6131B6RMJ5JMJ4KjJ4MJ1Mlj1qOppl%k3ojk4j1kj2j1pj1j3j4nj4Jkj5PNj0j1J9
6173h6kJ1Nm%K0OJ1J6J0K1OLlK9nJ4J6J3mPlK0%j3K3j9KlrqJj7qj5nj6Lk6lj1
$$ [...]
8191d
##END NTUPLES=NMR FID
##END=
