##TITLE=1H_AM_NV48.1
 CDCl3
 8 sc, 
 6.6.2023
##JCAMPDX= 6.0         $$ Bruker NMR JCAMP-DX V2.0
##DATA TYPE= NMR FID
##DATA CLASS= NTUPLES
##ORIGIN= UXNMR, Bruker Analytische Messtechnik GmbH
##OWNER= root
$$ XWIN-NMR		Version 3.5
$$ Tue Jun  6 15:47:32 2023 Russian Standard Time (UT+4h)  she@DPX200
##.OBSERVE FREQUENCY= 200.13135
##.OBSERVE NUCLEUS= ^1H
##.DELAY= (6, 6)
##.ACQUISITION MODE= SIMULTANEOUS
##.ACQUISITION SCHEME= undefined
##.AVERAGES= 8
##.DIGITISER RES= 18
##SPECTROMETER/DATA SYSTEM= spect
##.PULSE SEQUENCE= zg30
##.SOLVENT NAME= D2O
##.SHIFT REFERENCE= (INTERNAL, D2O, 0, 15.7039)
##AUDIT TRAIL= $$ (NUMBER, WHEN, WHO, WHERE, WHAT)
$$ ##TITLE= Audit trail, XWIN-NMR		Version 3.5
$$ ##JCAMPDX= 5.01
$$ ##ORIGIN= Bruker BioSpin GmbH
$$ ##OWNER= she
$$ F:/spectra/data/she/nmr/H-F/1/audita.txt
$$ ##AUDIT TRAIL=  $$ (NUMBER, WHEN, WHO, WHERE, WHAT)
(   1,<2023-06-06 15:46:14.78 +0400>,<she>,<DPX200>,
      <created by zg, POWCHK disabled, PULCHK disabled
       configuration hash MD5:
       00 E9 B6 7A A2 85 ED C7 34 08 36 98 17 FE 4E 26
       data hash MD5: 16K
       1E D3 77 9E 88 E9 D1 F4 46 4C 01 DE E9 1F 7D 4B>)
$$ ##END=
$$ 
$$ hash MD5
$$ 37 C1 C1 40 9F 19 A8 7E 1B F8 63 D4 EA 2F 71 A8
##$RELAX= 
##$RELAX= 
##$RELAX= 
##$RELAX= 
##$RELAX= 
##$RELAX= 
$$ Bruker specific parameters
$$ --------------------------
##$DU= <F:/spectra>
##$EXPNO= 1
##$NAME= <H-F>
##$PROCNO= 1
##$TYPE= <nmr>
##$USER= <she>
##$AMP= (0..31)
100 100 100 100 100 100 100 100 100 100 100 100 100 100 100 100 100 100 
100 100 100 100 100 100 100 100 100 100 100 100 100 100 
##$AQSEQ= 0
##$AQ_mod= 1
##$AUNM= <au_zg>
##$AUTOPOS= <>
##$BF1= 200.13
##$BF2= 200.13
##$BF3= 200.13
##$BF4= 200.13
##$BF5= 200.13
##$BF6= 200.13
##$BF7= 200.13
##$BF8= 200.13
##$BYTORDA= 1
##$CFDGTYP= 0
##$CFRGTYP= 5
##$CHEMSTR= <none>
##$CNST= (0..31)
1 1 145 1 1 1 1 1 1 1 1 1 1 1 1 1 1 1 1 1 1 1 1 1 1 1 1 1 1 1 1 1 
##$CPDPRG= <>
##$CPDPRG1= <>
##$CPDPRG2= <>
##$CPDPRG3= <>
##$CPDPRG4= <mlev>
##$CPDPRG5= <mlev>
##$CPDPRG6= <mlev>
##$CPDPRG7= <mlev>
##$CPDPRG8= <mlev>
##$CPDPRGB= <>
##$CPDPRGT= <>
##$D= (0..31)
0 1.2 0 0 0 0 0 0 0 0.06 0 0.03 0 0 0 0 0.0002 0 0 0 0 0 0 0 0 0 0 0 0 
0 0 0 
##$DATE= 1686051974
##$DBL= (0..7)
120 120 120 120 120 120 120 120 
##$DBP= (0..7)
150 150 150 150 150 150 150 150 
##$DBP07= 0
##$DBPNAM0= <>
##$DBPNAM1= <>
##$DBPNAM2= <>
##$DBPNAM3= <>
##$DBPNAM4= <>
##$DBPNAM5= <>
##$DBPNAM6= <>
##$DBPNAM7= <>
##$DBPOAL= (0..7)
0.5 0.5 0.5 0.5 0.5 0.5 0.5 0.5 
##$DBPOFFS= (0..7)
0 0 0 0 0 0 0 0 
##$DE= 6
##$DECBNUC= <off>
##$DECIM= 32
##$DECNUC= <off>
##$DECSTAT= 4
##$DIGMOD= 1
##$DIGTYP= 9
##$DL= (0..7)
0 120 120 120 120 120 120 120 
##$DP= (0..7)
150 150 150 150 150 150 150 150 
##$DP07= 0
##$DPNAME0= <>
##$DPNAME1= <>
##$DPNAME2= <>
##$DPNAME3= <>
##$DPNAME4= <>
##$DPNAME5= <>
##$DPNAME6= <>
##$DPNAME7= <>
##$DPOAL= (0..7)
0.5 0.5 0.5 0.5 0.5 0.5 0.5 0.5 
##$DPOFFS= (0..7)
0 0 0 0 0 0 0 0 
##$DQDMODE= 0
##$DR= 18
##$DS= 0
##$DSLIST= <SSSSSSSSSSSSSSS>
$$ [...]
##$SUBNAM2= <"">
##$SUBNAM3= <"">
##$SUBNAM4= <"">
##$SUBNAM5= <"">
##$SUBNAM6= <"">
##$SUBNAM7= <"">
##$SUBNAM8= <"">
##$SUBNAM9= <"">
##$SW= 18.05172834244
##$SWIBOX= (0..15)
0 0 2 0 0 0 0 0 0 0 0 0 0 0 0 0 
##$SW_h= 3612.71676300578
##$TD= 16384
##$TD0= 1
##$TE= 0
##$TE2= 300
##$TE3= 300
##$TEG= 300
##$TL= (0..7)
0 120 120 120 120 120 120 120 
##$TP= (0..7)
150 150 150 150 150 150 150 150 
##$TP07= 0
##$TPNAME0= <>
##$TPNAME1= <>
##$TPNAME2= <>
##$TPNAME3= <>
##$TPNAME4= <>
##$TPNAME5= <>
##$TPNAME6= <>
##$TPNAME7= <>
##$TPOAL= (0..7)
0.5 0.5 0.5 0.5 0.5 0.5 0.5 0.5 
##$TPOFFS= (0..7)
0 0 0 0 0 0 0 0 
##$TUNHIN= 0
##$TUNHOUT= 0
##$TUNXOUT= 0
##$USERA1= <user>
##$USERA2= <user>
##$USERA3= <user>
##$USERA4= <user>
##$USERA5= <user>
##$V9= 5
##$VALIST= <valist>
##$VCLIST= <CCCCCCCCCCCCCCC>
##$VD= 0
##$VDLIST= <DDDDDDDDDDDDDDD>
##$VPLIST= <PPPPPPPPPPPPPPP>
##$VTLIST= <TTTTTTTTTTTTTTT>
##$WBST= 1024
##$WBSW= 4
##$XGAIN= (0..3)
0 0 0 0 
##$XL= 0
##$YL= 0
##$YMAX_a= 53413
##$YMIN_a= -47591
##$ZGOPTNS= <>
##$ZL1= 120
##$ZL2= 120
##$ZL3= 120
##$ZL4= 120
##$ABSF1= 10
##$ABSF2= 0
##$ABSG= 5
##$ABSL= 3
##$ALPHA= 0
##$AQORDER= 0
##$ASSFAC= 0
##$ASSFACI= 0
##$ASSFACX= 0
##$ASSWID= 0
##$AUNMP= <proc_1d>
##$AZFE= 0.1
##$AZFW= 0.1
##$BCFW= 1
##$BC_mod= 2
##$BYTORDP= 1
##$COROFFS= 0
##$CY= 11.3945322036743
##$DATMOD= 1
##$DC= 2
##$DFILT= <>
##$DTYPP= 0
##$F1P= 15.7292609196834
##$F2P= 12.9074282941183
##$FCOR= 0.5
##$FTSIZE= 0
##$FT_mod= 4
##$GAMMA= 1
##$GB= 0.15
##$INTBC= 1
##$INTSCL= 1
##$ISEN= 128
##$LB= 0.24
##$LEV0= 0
##$LPBIN= 0
##$MAXI= 10000
##$MC2= 0
##$MEAN= 0
##$ME_mod= 0
##$MI= 1.114404
##$NCOEF= 0
##$NC_proc= 0
##$NLEV= 6
##$NOISF1= 3.799351
##$NOISF2= 2.8
##$NSP= 1
##$NTH_PI= 0
##$NZP= 0
##$OFFSET= 15.70392
##$PC= 1
##$PHC0= -19979.65
##$PHC1= 5.45272
##$PH_mod= 1
##$PKNL= yes
##$PPARMOD= 0
##$PSCAL= 0
##$PSIGN= 0
##$REVERSE= no
##$SF= 200.130013532006
##$SI= 16384
##$SIGF1= 3
##$SIGF2= 2
##$SINO= 400
##$SIOLD= 16384
##$SREGLST= <1H.CDCl3>
##$SSB= 0
##$STSI= 0
##$STSR= 0
##$SW_p= 3612.71676300578
##$SYMM= 0
##$S_DEV= 0
##$TDeff= 0
##$TDoff= 0
##$TI= <>
##$TILT= no
##$TM1= 0
##$TM2= 0
##$TOPLEV= 0
##$USERP1= <user>
##$USERP2= <user>
##$USERP3= <user>
##$USERP4= <user>
##$USERP5= <user>
##$WDW= 1
##$XDIM= 8192
##$YMAX_p= 0
##$YMIN_p= 0
$$ End of Bruker specific parameters
$$ ---------------------------------
##NTUPLES= NMR FID
##VAR_NAME=  TIME,          FID/REAL,        FID/IMAG
##SYMBOL=    X,             R,               I
##VAR_TYPE=  INDEPENDENT,   DEPENDENT,       DEPENDENT
##VAR_FORM=  AFFN,          ASDF,            ASDF
##VAR_DIM=   8192,          8192,            8192
##UNITS=     SECONDS,       ARBITRARY UNITS, ARBITRARY UNITS
##FACTOR=    0.0002768,     1,               1
##FIRST=     0,             0,               0
##LAST=      2.2672688,     0,               0
##MIN=       0,             -47591,          0
##MAX=       2.2672688,     53413,           0
$$ Real data points
##PAGE= N=1
##DATA TABLE= (X++(R..R)), XYDATA
0@%%%%%%%%%%%%%%%%%qJ6j6J6j6J6k4L2l2M0m8N0n8P1p9Q8j04J17j30J46j65J85
39I7k03K27k54K79l08L41l78M18m62N10n61O17o80P49q25R14j010J118j245J389
59G33j559J762k007K312k702L224l961N075o991J1124l4203L1898M6374r8670
73d7591L5139O3506p2063j2662P8663m5516l7334O3364q723n0831M2035J3591
85B1578m1535J3907K4725k4235l686J6423j981r477o94J0211K196k0115R165K2028
99A8510k8343p454M1447k2321l0865M9243k278n2851M2585K4440o4177K1929N0565
112D0430o0698p059O7181m1652l6639O8087j2517n6879N2156J7259o1083K5977
124e437L7518m9277j54M3057k8485j7483L5172p987k2527J9840N186j6643M462
$$ y = [0, 0, 0, 0, 0, 0, 0, 0, 0, 0, 0, 0, 0, 0, 0, 0, 0, 0, -8, 8, -8, 8, -8, 8, -16, 16, -16, 24, -24, 26, -32, 39, -40, 48, -56, 61, -69, 77, -88, 97, -106, 121, -133, 146, -162, 179, -199, 219, -243, 267, -294, 323, -357, 392, -433, 481, -529, 589, -656, 733, -826, 936, -1071, 1241, -1461, 1763, -2198, 2877, -4114, 7010, -27193, 4705, 51079, -47591, -12452, 51054, -21009, -33671, 44992, -524, -37858, 25506, 16783, -34048, 7987, 21578, -19957, -6050, 18675, -5560, -9246, 7177, 5196, -4281, -4975, 5236, 7432, -12683, -3518, 18510, -9833, -17287, 24160, 1839, -29026, 20217, 17939, -34912, 7673, 32113, -32064, -10135, 40430, -20268, -27327, 39854, -1798, -38437, 29650, 17133, -39746, 12410, 29669, -31414, -5437, 32081, -17196, -17350, 25707, -2778, -20261, 14911, 6924, -15603, 4237, 9423, -7220, -2758]
137b758Q029m421m716J377P973m281j0938J4310N353k2801J0803J9880k7997j880
151a2067L3025k3177j9001L9136r203l4502L5405R548m3195K2365K7312m2223
163a6577L640L8816l1607j5146M0786j4565k8171L3034L149l1913J8966J5627
175A6039k6557M113J9630j5688o163J5625m296r104P054L187n208j726M384K627
189C917o943n71J0432o411r136J4677k9j7626J3209J0012k2354N822K0094k1046
203e953n541K6387j3546j7218K6340j774k5265J9742J0711k6967Q589J9962k1952
216f485l553K3105j2256j2871J9659j446j6597J1688O863j4264K638J0200p716
229a035m065Q127k17o322K332N031l791m208O004K028q488K624Q440q733l680
$$ y = [-2758, 5271, 850, -3866, -2489, 5484, 1203, -9735, 4575, 9928, -12873, -2070, 17810, -10187, -12067, 20958, -2219, -21220, 17916, 8713, -25789, 9616, 19164, -24031, -1666, 25646, -16577, -12937, 25879, -5728, -20874, 19912, 5347, -22824, 10210, 13359, -18554, 412, 16039, -10518, -6405, 13225, -2463, -8626, 6999, 2703, -6401, 653, 3840, -1368, -3094, 1290, 3917, -3026, -3597, 6835, 424, -8712, 5965, 5936, -11690, 1519, 11531, -10823, -5001, 15093, -5953, -11494, 14893, 1347, -15871, 10469, 8695, -16570, 3172, 13883, -13084, -4495, 15467, -6485, -10038, 13067, 811, -12060, 7599, 6153, -10444, 1244, 8107, -6157, -3519, 6681, -1035, -5100, 3027, 2810, -3512, -1180, 3851, 60, -4148, 1856, 3884, -4604, -1980, 6460, -2273, -5953]
244e953J2678m697j0619J2864K343j5535Q594J0108j6322J039J5919j2369p425
257i375J7627m803j3996J4420L825j6481P414J0692j4168q04J3613q052p396J1992
271D508o78j0266O830N225q951M29P697m454m696O335J182o650K040N619m941
286g71l239P050m80p303M990M832q536K47Q961o284n398J0234j225r845P999M832
302F064j1414K876R683r394l382J1599m426q539R947J736j0769N336O892r485
316c276m53R261n363n349Q271j16p635M620M293o812p9O381l475m062N573Q70
332B649n852K382M501m908j818O107j696n364N017K553o864J685O202n747k773
347c926P848k286o687O769K340q531L272O457p611j431Q550m225n644P843L84
$$ y = [-5953, 6725, 2028, -8591, 4273, 6616, -8919, -325, 9783, -6539, -5500, 10419, -1950, -9375, 8252, 3449, -10547, 3873, 7698, -8783, -1369, 9323, -4845, -5649, 7964, -88, -7484, 4508, 3830, -6436, 394, 5619, -3332, -2903, 4794, 340, -4356, 1979, 3161, -3489, -1449, 4170, -771, -4010, 3040, 2560, -4743, 247, 5079, -3457, -3210, 5751, -533, -5931, 4303, 3078, -6767, 1232, 6064, -5350, -2474, 7209, -2185, -5567, 6032, 1606, -6933, 3014, 4750, -6019, -683, 6209, -3276, -3729, 5532, 169, -5180, 3091, 2975, -4660, -40, 4253, -2559, -2638, 3743, 268, -3794, 1779, 2649, -3203, -821, 3680, -1228, -3046, 3061, 1365, -3999, 1018, 3571, -3293, -1608, 4594, -1153, -3926, 3922, 1636, -5051, 1718, 4058, -4473, -1201, 5256, -2355, -3786, 4764, 539, -5105, 2738, 3122]
362C122p837M694M487p319M00O621m475l404O236n45n415L666K909m998N9M635
378B836k540l108M104Q59m615J639L855l940j787N290j369m807M540K169o274
393c148J885N344n599j767P034k953n186O585P73p145M116M298o962M90O436m752
409e51l024O489j364n158M505J894n223J406L798l399j501L753n72l096J933K061
425A951k810q31L391q04l345K847K095m544N91M717l844k547O001j437n427N370
441A374J913o940K954N035o589m46O908m450l693O894j265n726N135J864o031
456c063K361L848m608l80M171k252k050K939K0k133Q61J225p95j025R08J248j828
473e53p71L020j096l082L635R89n048K677L693n817L19O093m962k729P243k603
$$ y = [3122, -4715, -21, 4466, -2853, -2453, 4168, -307, -3711, 2525, 1980, -3435, 231, 3140, -1858, -1799, 2836, 296, -2812, 1292, 2151, -2464, -825, 3030, -910, -2697, 2593, 1224, -3583, 957, 3126, -3148, -1263, 4081, -1518, -3285, 3749, 796, -4390, 2195, 2968, -4177, -61, 4237, -2725, -2235, 4201, -551, -3575, 2914, 1550, -3608, 897, 2791, -2432, -1026, 2772, -627, -2128, 1625, 1053, -2043, -110, 1951, -859, -1690, 1701, 897, -2448, 399, 2494, -2050, -1459, 3258, -586, -3133, 2868, 1431, -3996, 1374, 3287, -3653, -699, 4336, -2253, -2699, 4209, -241, -3934, 2960, 1695, -4031, 1104, 2968, -3063, -702, 3146, -1462, -1842, 2329, 77, -1973, 966, 986, -1147, -286, 939, 144, -881, 27, 1275, -553, -1324, 1696, 600, -2482, 1153, 2142, -2906, -229, 3464, -2353, -2034, 4059, -903, -3632, 3611, 1008]
489A008n542O782N75p232M778L621p282J829N650n806j069O157l421l095N203
504B156r89l723L399O67l084J585J068j699N42K83l78P02j099Q0J952k205p18
521a461L640k291k562M929j060m800N138J203o563L920L942p226J501O333o438
536a795j484P629m302m269P438j467o026N898J222o408L638L075n593J465L750
551B771m100n6L447k616o57K562j661m03J682j553L21J371k218R08J952l241P75
568g16L288l942l49M878l784k286O068k532m478O310l69o325N403K202p240L437
584d35M589o943Q36O115n483j653O414l328l371N589j225l987M155K19l687K790
600E95Q08k970J891P25k293J667L33k065J999M3k401K542K54l294K865J168m376
$$ y = [1008, -4534, 2248, 2823, -4409, 369, 3990, -3292, -1463, 4187, -1619, -2688, 3469, 48, -3047, 2156, 1167, -2556, 843, 1510, -1574, 11, 1079, -620, -78, 205, -173, 529, -570, -490, 1462, -743, -1461, 2179, -112, -2674, 2255, 1195, -3605, 1533, 2736, -3827, 93, 4035, -3191, -1690, 4643, -1795, -3279, 4350, 48, -4221, 3217, 1750, -4276, 1622, 2844, -3564, 74, 3149, -2444, -979, 2771, -1329, -1385, 2062, -554, -1211, 1351, -310, -713, 969, -584, -263, 1108, -1110, -202, 1750, -1491, -716, 2572, -1370, -1719, 3159, -625, -2911, 3157, 625, -3853, 2457, 2088, -4237, 1166, 3368, -3872, -435, 4154, -2789, -1953, 4162, -1321, -2974, 3440, 112, -3259, 2330, 1105, -2882, 1273, 1492, -2195, 595, 1403, -1567, 324, 1049, -1244, 423, 756, -1309, 690, 733, -1668, 874, 1128, -2166, 699, 1867, -2509]
617b509K551K661n102J393M339n094l93N678m179k464O303k506m359N965l49n632
633c697M752J775n970K900L401n322R57M123m051n45L971k645j317L299j618j407
649a394K549j150j083K108j226p28K180j603p73K742j891j372L539j704k513M158
665A839p98l891M153P47n038L316K601n534J720M275n127k82N298l853k241N456
681B641k033l647M702j43m230L354J285l954J888J987l143P54K008k223K54J559
697A059j606L13J061j502O97Q91j923J030J276k588R73K132l096K82L274l106
713h33j013M220k349k604M577r29m006M084Q92m792K795K617m705J023L761l757
729a019p30M060k321j991L526q21k495K500K67k231J382P03j542O84M65q32N55
$$ y = [-2509, 42, 2703, -2399, -1006, 3333, -1761, -2154, 3524, -655, -3119, 3184, 678, -3681, 2284, 1935, -3697, 1055, 2830, -3140, -240, 3161, -2161, -1204, 2919, -1132, -1677, 2294, -351, -1668, 1631, 13, -1394, 1155, 5, -1078, 1030, -196, -924, 1256, -347, -1120, 1622, -269, -1641, 1898, 194, -2319, 1839, 1041, -2850, 1303, 2050, -2988, 328, 2929, -2605, -885, 3390, -1737, -2019, 3279, -574, -2815, 2641, 608, -3039, 1663, 1520, -2710, 644, 1929, -2025, -137, 1850, -1293, -539, 1469, -754, -500, 1059, -547, -234, 827, -675, 22, 913, -1010, 20, 1296, -1292, -319, 1813, -1283, -1001, 2273, -833, -1846, 2374, 25, -2579, 1998, 1069, -2937, 1147, 2039, -2753, 42, 2659, -2046, -1023, 2738, -1019, -1749, 2311, -10, -2001, 1525, 704, -1791, 709, 976, -1255, 127, 830, -712, -28, 437, -395, 160]
746A60r2n42J011n87q07J701o12j574K196qk542K178J082l299J495K353l459K33
764a113L433k906j283L923j703k626L642j53l418K670J271l451J313K206k797
779i92J5K470j752q84K087p15j143J332l5q75N79J14k89J76k69K58L25q99M22
798g5R11j397K8J740j487q28K366r75j890K523N6k740K034J315l092R63K433k767
816h82l74L027j841j584K898n84k308K176N68k332J122J296j831J51J421j041
832a18m45J034l22n07M25N6j50p4m3M11k33n30Q60jj139R26O44j648N66J437j759
853f10k13K108j362j206K396n25k095K097N81k564J299J583k445J83K230j775
869c18q47K267q05j506J766J25j643R68P28j255J96Q30o14k02M72m4j65p5J78
$$ y = [160, 68, -474, 537, -50, -857, 844, 232, -1342, 854, 846, -1696, 482, 1564, -1735, -240, 2113, -1346, -1113, 2320, -586, -1869, 2054, 351, -2275, 1367, 1214, -2204, 466, 1737, -1714, -401, 1805, -992, -977, 1493, -259, -1143, 944, 229, -914, 418, 383, -492, 87, 201, -88, 88, -181, 77, 402, -497, -75, 836, -561, -533, 1207, -280, -1108, 1258, 283, -1607, 916, 972, -1768, 266, 1581, -1511, -548, 1885, -882, -1256, 1771, -70, -1654, 1244, 660, -1648, 528, 1096, -1236, -114, 1182, -649, -498, 923, -118, -563, 471, 149, -358, 67, 123, -27, -101, -144, 267, 34, -496, 364, 363, -776, 150, 794, -854, -288, 1149, -610, -823, 1285, -77, -1283, 1113, 588, -1507, 590, 1171, -1393, -94, 1489, -956, -773, 1457, -318, -1165, 1102, 297, -1209, 557, 682, -961, 7, 735, -520, -324, 506, -108, -310, 162, 118, -47, -122, 56]
888E6K49n25m8Q25o07o11J264k69j288J323M45j816R22J290k014J51J987j680
906c46q22K328r17j680K164P8k167J527J002k163O23J572j708k13J696j013p68
923h07J390k95r11Q54J15o48L42J29k43J30j64J14K64o03J75P28r22j19J269r15
943a17p35J673n19j475J763K13k088J412J103k328O47J910k091l17K345j444j219
960a267K310n62j777J815L07j913J129Q54j616M42J052j142K2Q87p20p8N70n10
978a97J15L58o30L89L81r39N08P20j298L42J228j467j28J729j338p89K086q77
996A93j494K139j68k086J861O44k399J247J402k342M23J951j954l38K110j299
1012a10r49J963o45j243J568j26j279J134J50j082Q10J92r06P32J09q42Q32J8
$$ y = [56, 305, -220, -268, 557, -50, -661, 603, 334, -954, 369, 814, -1002, -80, 1210, -804, -653, 1334, -346, -1168, 1160, 243, -1437, 727, 805, -1362, 165, 1167, -996, -373, 1199, -509, -722, 974, -39, -807, 583, 288, -623, 231, 346, -302, 40, 169, -74, 56, -108, 6, 270, -333, -158, 570, -352, -471, 798, -117, -852, 821, 302, -1173, 590, 803, -1285, 127, 1230, -1098, -451, 1459, -632, -949, 1396, -48, -1267, 1043, 481, -1296, 519, 826, -1087, 42, 896, -720, -278, 774, -368, -346, 541, -179, -257, 313, -197, -82, 276, -354, 35, 416, -523, -15, 705, -593, -251, 977, -490, -618, 1111, -227, -1016, 1070, 193, -1301, 838, 670, -1416, 445, 1089, -1310, -63, 1339, -1003, -580, 1371, -583, -921, 1189, -110, -1059, 904, 259, -984, 584, 458, -821, 313, 463, -619, 191, 383, -523, 209, 318, -524, 308, 326]
1030C26j011J037J52j373J088N47j750R12J145j986M66J748j944k06K221j588
1046b16r82K402r50j672K296j64k122J858N90k257J243J152k078N79J450j705
1062e76M9J482j292k63J359r36l87J215p66m01J142p54m02J195p83n34J411p72
1080a3q54J673n65j323J802j22j811J668N20k207J292J199k333O66J825k156p7
1097h16K189j690p93K286j055j344K072m07j611J677J13j632J263M20j487R10
1113I5N65j345P40N87j279O73O37j350O49Q17j507N27J150j626K31J542j611k49
1131g54J917j373q38K118r17j427K112l01j869J851L54k122J404R43k128Q42J383
1148A195j944K57J651j613k25J703j214n84J634q51p96J480n64r05J357l93r84
$$ y = [326, -685, 352, 504, -869, 219, 766, -984, -72, 1073, -913, -447, 1301, -643, -849, 1372, -216, -1198, 1204, 254, -1418, 878, 714, -1408, 450, 1040, -1217, 26, 1178, -900, -321, 1129, -576, -527, 955, -337, -600, 759, -177, -564, 651, -115, -516, 626, -128, -530, 665, -118, -652, 759, -13, -867, 806, 241, -1082, 720, 598, -1213, 455, 975, -1232, 60, 1259, -1074, -408, 1417, -739, -816, 1373, -317, -1110, 1176, 121, -1223, 849, 442, -1169, 508, 621, -1011, 252, 672, -815, 95, 660, -685, 55, 642, -637, 36, 673, -677, -28, 789, -718, -191, 959, -667, -436, 1106, -505, -754, 1163, -210, -1048, 1070, 153, -1274, 838, 537, -1332, 519, 873, -1249, 155, 1098, -1030, -188, 1195, -749, -492, 1159, -454, -679, 1024, -190, -774, 860, 9, -787, 693, 129, -776, 581, 188, -796]
1165g96J309k57j082J286q8j261J293J41j491J218N18j767J004R93j903O01J466
1182A184j834K4J839j539n76K021j079j119J963n24j492J707K7j670J341M77j661
1199i11R24P87j516N34R77j344K58J039j161N5J073j022j14J145r55k57J241q81
1217a28m69J340p39p34J437n24j054J467k03j365J378K16j593J127O74j703P45
1234a28J099j659K78J395j397k22J551j066o10J521o42r10J376k69j080J130O2
1251D29j105Q77K56j055O87L76r85N43M62r64M38N66r92L54P03j041K09R07j029
1270c64l7J128r38l58J297p26p05J346m19j018J259k2j266J074L66j350P48P21
1288G36j310L90R37j157L5J046q99k73J067o36m63R92l85n85Q63j93o23P28o1
$$ y = [-796, 513, 256, -826, 460, 372, -889, 404, 545, -946, 272, 790, -977, 27, 1020, -883, -282, 1184, -650, -626, 1213, -326, -902, 1119, 40, -1079, 884, 360, -1132, 575, 602, -1068, 273, 750, -911, 13, 800, -716, -182, 795, -549, -291, 748, -413, -358, 715, -307, -421, 724, -231, -488, 753, -128, -597, 743, 4, -730, 707, 183, -871, 596, 393, -972, 406, 622, -971, 156, 830, -873, -128, 971, -688, -410, 985, -412, -634, 917, -149, -759, 762, 120, -790, 586, 317, -763, 367, 429, -676, 201, 457, -598, 89, 465, -520, 23, 485, -479, -41, 525, -467, -113, 590, -451, -242, 665, -364, -401, 727, -211, -569, 728, 2, -703, 643, 224, -794, 465, 443, -823, 251, 617, -733, 15, 736, -574, -184, 753, -404, -369, 677, -222, -495, 572, -64, -527, 465, 80, -505, 358, 165, -458, 270, 209]
1307B09o34O51po39O21N2o95O27J60q20N94L51r71M69O12j030K05R02r93j07J106
1328F63p92m84J200m80p95J116j24r62Q83K25j037O15M72r28L21O19q00J09O33
1347D54o32m5O13n04j29N96m41j78N98l82k37O08l37l12O47k83m32O97j85n91
1367d75P32j2p54O69K52r14N30N12r65K59P64q90n5R31o91l56R57m26n78Q75j37
1388B28p17O92J01p24M63K74o66L08L39n65K10L37m79J57L18m68J43L48n11J11
1408a01M51n54J3O02n49j47P37m84l55P99l21o02Q16p7p75O97K17q75N07M84q72
1429c89K50O54p58j9P37n97k27P40l92l59O70k09m53N93p3m68M89km53L99L8m61
1451b90L84R0n05L97J70n69L67K84o64K93M55p28J24O49o87r5Q06n67l44Q87l52
$$ y = [209, -425, 226, 219, -420, 201, 253, -442, 185, 345, -475, 119, 470, -501, -32, 580, -450, -245, 657, -336, -443, 663, -129, -613, 587, 107, -688, 428, 304, -658, 225, 450, -587, 28, 500, -428, -107, 512, -288, -179, 454, -178, -223, 390, -114, -243, 353, -88, -266, 332, -50, -287, 321, -16, -328, 319, 36, -396, 301, 116, -475, 257, 245, -509, 160, 412, -502, 28, 540, -425, -166, 598, -292, -347, 584, -107, -463, 494, 68, -510, 365, 228, -489, 203, 304, -420, 43, 317, -349, -41, 298, -267, -57, 280, -199, -42, 276, -192, -49, 299, -212, -101, 350, -204, -191, 411, -138, -285, 452, -32, -387, 412, 91, -511, 305, 228, -547, 150, 367, -508, -1, 483, -389, -139, 515, -243, -262, 475, -122, -349, 391, -1, -360, 310, 101, -352, 241, 168, -300, 189, 187, -266, 133, 171, -290, 94, 184, -321, 76, 246, -323, 44, 328, -336, -43, 412, -316, -192, 457, -230, -325, 481, -86, -430, 457, 105]
1472A05n76Q40j23p39O86J50p93M83L61p45K61M96o45Q9N32n40l6N15m46j07N27
1493B95l73j79N37l28k26N81k80l26N94j95m52O04r7n56N83P1o72N33K39p51M25
1514B7M18p94K38N86p56K0P25o51j82Q12m90l72Q03k81n40P26p1o42O06Q0o45
1535c83M49K36o33L37L13n79K43L59n68J65M00n57P3N03n71oO07n45j41P08m62
1556e2l29P87l37n24P85j44o94P24P2p90O11L08q41M29M97q34K05O49p78KP30
1577D76o39j77P63m81l24P59l27m39P06j91n40O44o3n90N83N4o27N21J99o90M65
1598H2K96p38L66M45p85K21N97p69M4P69p17j85Q90n52m22R36l56o54Q91j13q22
1619e76P75J56q68N72L73q64L82N28q01J94N92p07M9O36o27q7O86n30j97P26m40
$$ y = [105, -471, 369, 246, -493, 193, 343, -450, 33, 394, -351, -90, 406, -239, -150, 382, -158, -194, 321, -125, -232, 295, -78, -257, 280, -48, -274, 307, 27, -299, 295, 100, -352, 252, 155, -401, 182, 253, -419, 114, 353, -398, 27, 445, -349, -111, 475, -281, -261, 464, -187, -369, 443, -47, -419, 384, 103, -437, 289, 218, -424, 182, 262, -383, 66, 302, -331, 6, 319, -260, -17, 342, -226, -61, 339, -218, -145, 358, -213, -219, 388, -157, -298, 410, -52, -381, 406, 69, -455, 330, 186, -508, 216, 288, -502, 109, 417, -424, 5, 502, -332, -127, 522, -256, -254, 476, -163, -340, 423, -58, -382, 377, 50, -389, 317, 126, -414, 230, 167, -423, 160, 214, -413, 108, 307, -383, 82, 378, -360, 6, 451, -334, -113, 484, -285, -241, 528, -189, -374, 516, -36, -458, 478, 122, -532, 359, 246, -576, 199, 355, -513, 59, 432, -432, -50, 478, -323, -129, 463, -244, -195, 441, -186, -273, 413, -117, -314, 412, -28]
1640b8l20P50l45m59P61k22o08P34l8p32O83J52q21N68L59q68L82N59q65J73P18
1661E33p88n7Q36o53k87R00m43n04Q72k31o63P70j6p40O18J60p46M91K88p10L55
1682a5L84o89K57M55o65J40N45o55K9O35o02j22P59n33k83Q16m12m83Q29k20o64
1703d94P69kp76O39K24q24M75M27q28K94N55p52Q0O66o53j03P12n02k61P24l55
1724A5l76O83k24m54O16r3n34N61K2n88N06J50o47M32K69o76L46L79o81K07N00
1745D13o69N1O23o08j04P16n00k93P59l48m64P44j53o12O61M7o92N36K21o93L67
1766BL74o63K13M49n90Q4M91n22l6N35m41j42N68l77k29N77k78l33N86j81m30
1787c43N61m2n34N01R5o02M39K32o25L03L77o32J75M78n93K4N77n30j30O33m17
$$ y = [-28, -348, 402, 57, -402, 359, 137, -471, 263, 225, -507, 176, 328, -493, 75, 434, -434, -52, 507, -358, -185, 533, -255, -312, 524, -129, -416, 484, 41, -463, 409, 178, -485, 285, 269, -471, 147, 307, -439, 52, 340, -370, -15, 369, -320, -63, 392, -273, -133, 412, -243, -214, 421, -181, -303, 456, -77, -360, 456, 44, -439, 390, 170, -494, 275, 273, -503, 136, 360, -464, 11, 438, -390, -96, 459, -293, -213, 453, -200, -303, 409, -93, -354, 370, 15, -361, 322, 98, -356, 260, 167, -367, 194, 216, -372, 134, 284, -363, 69, 338, -338, 8, 387, -294, -87, 413, -256, -205, 418, -190, -294, 422, -78, -371, 388, 40, -424, 320, 167, -445, 216, 263, -429, 107, 328, -365, 2, 376, -287, -74, 375, -215, -131, 360, -162, -198, 337, -104, -246, 322, -55, -284, 293, 15, -318, 268, 87, -343, 218, 176, -358, 143, 238, -364, 75, 307, -318, -15, 362, -270, -95, 383, -210, -186, 391, -139, -269, 364, -53]
1808e3k83O64k67m26N98r5n00N23M5n40M15J61n42L20K45n06K06L25m71J01L69
1829B89m36L5M18m27m5M68l79j72N40k95k92N63j78m24N26j7n06M46J08n36L35
1850B1K54n57K34L53n20J00M36m64k9M94l88j36M91k82k44M86j82l31M57q6l66
1871b59M07km20L59R9m45K80K01m45J92K71m36J04L60m18K4M04l74p4M42l08j79
1893b17M68k20k85M72j10l79M38jm40L61J47m90K53K53m59J33L41m07K8L66l35
1914h3o9L92k82j31L75j87k02L64j33k44L52o4l05L42J0l45K78J04l73K24J75
1935A98l81J62K32l66P3L07l55J0L55l00j14M10k54j93M05j34k96L90k0l72L27
1956H4R8l86K19K01l85J35K45l30M1K65k68k2K69k19o2K62j87r5K84j68j36K97
$$ y = [-53, -336, 328, 61, -365, 233, 138, -362, 161, 206, -334, 81, 242, -300, 20, 265, -241, -35, 290, -181, -80, 289, -147, -112, 306, -121, -166, 302, -77, -249, 291, -4, -296, 267, 89, -335, 191, 174, -332, 114, 222, -314, 21, 275, -282, -48, 305, -215, -115, 321, -143, -172, 322, -66, -202, 289, 7, -237, 249, 67, -264, 193, 107, -259, 148, 146, -274, 85, 184, -261, 19, 220, -225, -33, 238, -198, -94, 266, -152, -128, 276, -98, -172, 270, -38, -217, 251, 31, -254, 218, 108, -271, 167, 166, -274, 87, 234, -256, -3, 250, -209, -76, 265, -142, -114, 252, -83, -152, 240, -42, -173, 202, 15, -187, 177, 44, -200, 152, 88, -217, 125, 135, -210, 68, 172, -201, 23, 198, -183, -21, 211, -155, -82, 225, -130, -120, 235, -65, -179, 231, -23, -216, 189, 55, -241, 149, 129, -243, 84, 182, -204, 15, 216, -169, -34, 211, -119, -78, 187, -81, -103, 166, -53, -115, 147, -40, -135, 149, -19, -155, 142]
1978A42j31j84L06p9k49L08%l07K82O1l37K18J65l70J55K52l59M9L01l06m9L47
2000B15k39j46L34j50j99L21q4k37K82rk75K43O0k90J92J17k82J27J57k49Q8J71
2022A47k36M6K05k42J2K40k31m3K70k01j00K98j63j80L40j18k51L25j9l29K93
2043F3Q9l74K26J95l78J26K67l34K4K95k55o9K97j83j18K70j26j55K69q6j90K47
2065A00m4k17K46j1k39K31M5k88K06J11l22J75J85l33J05K48l16K2L02k86n8L45
2087B07k28j56L53j51k37L63o7k96L12M3l49K52J25l49J59J91l24R4K24k83K4
2108i3K64k39m2K68j97q8K81j79j06K71j36j60K97q7k32K95j6k86K76M9l49K42
2130C3J50l66J51K31l44O0K96l11k0L26k58j15L43j80j72L19j11k06K89l8k49
$$ y = [142, 11, -173, 133, 54, -195, 113, 113, -194, 88, 149, -188, 30, 195, -175, -20, 232, -127, -78, 223, -83, -132, 215, -24, -170, 164, 14, -185, 136, 52, -185, 97, 88, -187, 56, 116, -174, 18, 135, -147, -20, 137, -112, -24, 147, -89, -43, 162, -80, -68, 172, -59, -102, 168, -33, -133, 165, 2, -178, 162, 44, -207, 118, 99, -230, 63, 152, -222, 4, 199, -179, -53, 214, -120, -96, 199, -56, -125, 172, -11, -129, 141, 15, -140, 129, 43, -147, 100, 56, -161, 85, 74, -165, 66, 111, -177, 29, 140, -182, -7, 178, -155, -50, 198, -118, -96, 206, -80, -138, 207, -21, -177, 176, 25, -212, 151, 84, -212, 100, 143, -206, 46, 171, -178, -19, 172, -152, -58, 166, -117, -93, 171, -68, -110, 158, -39, -127, 154, -25, -131, 140, 4, -156, 141, 54, -178, 117, 101, -185, 91, 140, -209, 33, 183, -183, -32, 199, -145, -85, 211, -100, -120, 206, -52, -167, 176, -4, -176, 143, 32, -174, 115, 77, -172]
2151a72K73J8k84K37N8k86J90J23l04J40J80l05P5K34k71J7K44k41k6K71k09j08
2173a46L10j69j65L23j02k34L13l9k81K89M8l32K29J44l64J49K17l17N3K62k76
2194h8j5K83k35p1K86j82j18K91j42j69K85r6k02K79l9k39K60J3k74K37P8k98
2216a56J97J17l09J35K10l22O6K51k83j6L01k50q5L18j94j61L46j28k26L00k8
2237H3k90K93M2l15K27J06k98J57J63l06J05K16k90M4K39k56JK62k26p7K86j89
2259b3j28K96j48j71K95r1k20K91k1k74K78N0l26K20J44l40J39K16l19N6K73k69
2281g2l4K94k31q1K81j58j38K72j08j82K80p6k06K57k0k47K28N1k76J86J32l07
2303a55J38J70k96R1K27k77J7K62k30n6K86k07j14K95j41j66K93q1k38K89j3k81
$$ y = [-172, 101, 119, -165, 72, 130, -156, 34, 157, -147, -7, 173, -132, -57, 177, -94, -77, 167, -74, -100, 171, -38, -146, 164, -5, -170, 153, 51, -183, 130, 91, -190, 99, 147, -185, 44, 188, -176, -27, 190, -127, -74, 188, -88, -103, 180, -55, -126, 160, -22, -140, 151, 9, -160, 125, 29, -173, 106, 67, -172, 88, 101, -173, 64, 142, -156, 41, 158, -151, -16, 194, -128, -62, 189, -94, -110, 191, -59, -144, 174, -20, -181, 165, 37, -189, 111, 83, -207, 86, 128, -187, 40, 146, -152, 5, 168, -138, -33, 183, -107, -63, 176, -80, -79, 183, -43, -120, 166, -23, -151, 145, -3, -174, 121, 30, -190, 101, 80, -194, 84, 134, -192, 28, 172, -168, -29, 187, -132, -76, 197, -72, -106, 188, -43, -124, 157, -1, -139, 133, 25, -157, 123, 47, -159, 98, 78, -169, 59, 110, -166, 20, 152, -155, -17, 153, -143, -52, 175, -102, -85, 177, -53, -109, 177, -30, -144, 151, 10, -156, 137, 56, -182, 107, 94, -187]
2325a87K44P1k97J88J31k94J08J98k76M1K26k44jK50k10m5K46j71j00K62j22j53
2347a35K60q4j93K53qk58K32O1k81J76J18k88J19J94k94N6K28k42j2K61k06p6
2369a19K64j47j27K62j00j71K48n0j97K10J7k34K07M6k33J40J16k46R7J51k39
2390a05N1J89k21%K25j76q7K60j42j42K51p0j69K12l1j85K08Pk07J77O5k28J23
2413EJ27k30Q3J47k08L2J90j99l1J93j23j00K29j06j27J99o1j40J85l0j56J74
2435E3Pj83J62N6k10J29J07k27P5J68k10MJ93j63o0K19j31q0J88q8r9J76o7j29
2459a10J69k1j45J48J8j50J17N2j74J02R2j87P1J21j71J7J60j65k5J76j20n4J68
2482H9r8q9J86q0j21J90l7j64J81Mj85J43P9k06J03J08j77M1J30j65J5J42j40
$$ y = [-187, 57, 128, -169, 19, 150, -144, -36, 162, -114, -73, 153, -91, -92, 158, -52, -97, 149, -22, -122, 140, 18, -135, 125, 41, -152, 101, 93, -165, 67, 128, -153, 23, 141, -147, -28, 166, -128, -72, 156, -86, -98, 163, -43, -119, 145, -2, -129, 133, 33, -138, 110, 60, -137, 73, 90, -144, 63, 109, -124, 16, 132, -114, -17, 134, -105, -54, 135, -86, -86, 139, -37, -124, 136, -6, -148, 103, 33, -136, 76, 45, -140, 68, 75, -132, 45, 110, -118, 5, 132, -98, -15, 132, -76, -44, 146, -53, -84, 109, -14, -114, 115, 9, -118, 81, 20, -120, 65, 35, -121, 53, 60, -123, 39, 95, -115, 14, 121, -106, -31, 137, -73, -69, 124, -39, -99, 120, -11, -91, 97, 9, -90, 86, 19, -110, 59, 38, -107, 41, 59, -91, 26, 78, -96, 6, 98, -89, -18, 103, -68, -51, 109, -56, -81, 95, -25, -79, 89, -9, -98, 88, 8, -113, 77, 40, -124, 57, 61, -124, 19, 98, -108, -5, 103, -74, -33, 97, -68, -53, 89, -51]
2505e1%J38j07m7J72j00q3J71p3j09J58m7j29J58Lj56J41L2j81J10R1j96Q3J32
2529A10j87K5J77j90j2J98j47o8K05j03j08J92n5j50J82kj60J32K2j63J21O1j75
2552i5J03O6j57O7J15j82L8J46j73K0J68j33p2K02j11r9J91n9j39J80l0j54J61
2575E3J5j69J27O7j94J00R8j96Q8J25j85J8J72j66l9J98j32p2J81p9j09J73m6
2598B8j27J48kj43J41Rj45J16M9j67J10Q4j80O0J28j89M5J48j75%J59j34m3J73
2622I3j06q7J84o9j24J86l9j36J61oj64J40O1j82J03Q7j82O8J16j63K7J37j59
2645e4j1J59j25n3J70r4q0J53n8j11J65m5j10J47j1j35J24K7j41J12N0j62R9P9
2669I5j68O4J16j71K4J52j51j9J62j35o2J97j00r9J72n0j30J50lj51J43K6j59
$$ y = [-51, -51, 87, -20, -67, 105, 5, -78, 93, 20, -89, 69, 22, -107, 51, 54, -102, 39, 71, -110, 0, 91, -105, -22, 110, -77, -52, 125, -65, -77, 121, -26, -94, 111, 8, -100, 92, 37, -113, 69, 67, -93, 39, 61, -102, 19, 80, -95, 8, 74, -83, -16, 99, -83, -45, 101, -72, -52, 116, -17, -89, 113, 2, -97, 94, 35, -104, 76, 46, -108, 53, 68, -101, 26, 93, -101, -1, 97, -99, -11, 114, -71, -53, 119, -47, -86, 112, -20, -92, 89, 10, -99, 74, 28, -99, 49, 47, -96, 45, 54, -91, 25, 74, -93, 17, 101, -79, -19, 109, -80, -35, 113, -62, -62, 97, -37, -80, 93, -13, -100, 84, 15, -109, 77, 38, -98, 63, 57, -107, 33, 94, -88, 15, 102, -80, -12, 104, -59, -32, 105, -54, -65, 94, -31, -84, 86, -8, -88, 65, 7, -104, 61, 16, -94, 53, 42, -93, 31, 58, -83, 29, 79, -83, 16, 95, -73, -9, 107, -64, -40, 112, -39, -58, 104, -31, -93, 104, 4, -95, 77, 27, -103, 47, 44, -107, 36, 62, -97]
2692i7J10N8j61Q5Q9j60N9J20j66K1J52j43k1J57j27n5J74q5r7J68o4j13J61m0
2716B5j32J52jj50J39L5j84J31O9j86Q6J21j83M0J54j68j9J79j33n9J77q9j04
2739a00J82n2j17J44k1j33J41Lj48J23M4j50J04O2j64R2Q3j67M9J24j60J8J53
2762A10j40l8J72j22o9J86q6j02J61n2j29J64%j69J56K8j78J16Q9j80O8J15j74
2785g4L4J41j57j1J58j20n2J67q2q0J61o8r5J49m2j08J37oj35J21K4j52J11N4
2809G5j57R2Q1j67L9J39j57j1J64j42m2J69j02q2J84n5j21J64k1j34J35Nj51J24
2833B9M9j43P5P7j57N5J09j56L5J16j36MJ18j15l1J45p9q5J59o0q7J52m0j25J43
2858E2%j51J34L3j60R8P4j59O1J11j54K6J23j25j1J39j08n8J52p6p6J40l6j02
$$ y = [-97, 13, 71, -90, -5, 84, -76, -17, 103, -63, -42, 110, -33, -54, 103, -24, -79, 95, 10, -87, 81, 17, -96, 65, 25, -107, 45, 44, -106, 33, 68, -116, 15, 84, -102, -16, 105, -78, -38, 116, -52, -71, 108, -25, -84, 93, 4, -100, 82, 30, -87, 57, 36, -97, 44, 47, -101, 22, 66, -84, 20, 82, -82, 10, 93, -74, -25, 99, -61, -43, 110, -30, -68, 104, -18, -87, 99, 13, -89, 72, 20, -109, 55, 55, -114, 42, 70, -108, 8, 97, -83, -15, 100, -74, -40, 101, -56, -67, 91, -29, -81, 86, 4, -76, 85, 17, -78, 71, 29, -79, 58, 52, -83, 38, 62, -90, 21, 75, -82, 10, 91, -76, -37, 102, -55, -66, 98, -44, -86, 83, -19, -101, 83, 28, -93, 71, 50, -84, 51, 56, -95, 29, 78, -65, 10, 87, -70, -15, 94, -62, -27, 89, -47, -43, 75, -40, -71, 74, -5, -90, 69, 9, -78, 74, 34, -91, 52, 52, -99, 35, 68, -92, 6, 80, -79, -18, 93, -61, -35, 88, -37, -48, 91, -17, -75, 77, 1, -75, 65, 29, -73]
2882g3J26k4r9J15Nj24Q8L7j16P8N1j29O7P0j37M2R3r4j7J19j11k5J32j05m8J48
2908F9n4j06J40j9j16J19J8j27R5N2j34N6P3j23M9R1j25J7J10j11kR9q7l6J24
2933G2p1p2J21l4q4J01mj01J03lr7Q1K4r9O4N7j22N6O5j17M0R8j14QJ14j07l7
2960e8J34p6o2J23l4r4J19j0j10R1J6r9P7K5j05O9N2j24O0P4j20J6J02j05pJ10
2986F4p1m4J28p8m3R8n1o6J13j8j01J17mj16R6L5j19O8N4j29O3Q3j21J3J18j14
3012b5k3J23q1o3J37o4o2J12k3j09J22pr6Q8J9j06P0M1j02M3O2r9K2Q1r7J4R3
3039G0j00kR4q5j4J12q4n5J35n5q4J25pj16J08Rj15Q5M5j16M7P9j24L1P8q7nJ01
3067G0q5k7R9o6l8J08n9n7R9k4q1R9or7Q0J7q0O6J9q2N5L8r1L8O9j00K5P8r4j2
$$ y = [-73, 53, 29, -70, 45, 50, -74, 14, 51, -65, 13, 64, -65, 2, 72, -65, -23, 70, -24, -41, 78, -33, -58, 74, -31, -79, 69, 15, -91, 49, 30, -86, 33, 51, -76, 19, 71, -63, -7, 66, -57, -8, 83, -42, -25, 85, -26, -28, 71, -16, -52, 72, 1, -71, 50, 16, -68, 33, 29, -72, 31, 28, -69, 12, 36, -63, 1, 58, -64, -8, 57, -60, -20, 78, -36, -28, 86, -21, -58, 76, 0, -62, 61, 27, -67, 52, 42, -68, 23, 39, -60, 17, 42, -63, 6, 58, -66, -6, 68, -52, -36, 66, -39, -46, 64, -7, -51, 77, -1, -44, 54, 3, -63, 50, 32, -69, 48, 44, -72, 24, 59, -60, 8, 62, -67, -4, 79, -42, -29, 89, -25, -48, 75, -6, -69, 68, 4, -58, 54, 31, -78, 44, 37, -59, 29, 48, -58, 12, 53, -49, -6, 56, -43, -21, 60, -37, -23, 70, -30, -32, 62, -23, -37, 75, -9, -64, 71, 16, -68, 57, 50, -66, 42, 51, -64, 21, 66, -50, -3, 76, -48, -17, 61, -26, -31, 70, -15, -42, 57, -9, -47, 61, 2, -55, 44, 20, -61, 38, 32, -65, 15, 32, -48, 18, 37, -45, 10, 48, -43, -5, 64, -36, -11, 67, -27, -39]
3097c9J10q4m9J33o6q3J29k7r5J03J0r5O1L1r6N4M2q2L4N2q0K5O7r6J4Q3q6%Q7
3126E7p1k2Q1m7m0R3l5o2Q5k2p3R2kr1Q7J6j03O7M8j02K9P6r1MR2q2k7J05p8k6
3156d2Q8l5n0Q5k9o7Q9k5o5Q1ko7N4J5q3O5L9q7M2M2p8K1O9q6RP1p5mQ1o2k9J05
3188G0n7o8J15m0q1R4J1j04O5M0r8L8M8p4K7N0p2J3O6p1PO7o1j4P0m4k8Q9n6m8
3218d6R0j9o5P2Or1O9J2p3O2K4p7M8L5r1L7N8q8J0Q9r2j9R6o7k7J00l5p4R8j7
3248B5p4O6J2p5N7K1p6N3K4p0M6L0o7K9M1p4J4O1p6QP4p0k9R3n3l8R2k5p0Q1l
3279B7q1P1J8r7O3L4p1L2N8r3K3P6r1QO7o1k3P1m1k4O2k3l7P0j8n4N7%n7N7jn3
3311c1M6J6o7M6K8o6K3N6q4K4N7q3%Q1o6k4Q5m7m2Q8l2o0Q6j0q3Q1J9r3M7M4p5
$$ y = [-39, 71, -13, -62, 71, 5, -78, 51, 24, -71, 32, 42, -53, 8, 39, -57, -3, 39, -43, -9, 43, -37, -12, 55, -41, -27, 56, -30, -30, 57, -14, -36, 45, -2, -42, 51, 16, -46, 39, 17, -56, 36, 34, -57, 30, 46, -57, 10, 58, -44, -15, 61, -30, -26, 66, -16, -43, 62, -16, -42, 46, 11, -39, 46, 17, -50, 39, 14, -51, 30, 28, -39, 15, 30, -53, 12, 51, -36, 6, 48, -30, -9, 60, -26, -17, 54, -21, -25, 56, -6, -35, 70, 13, -55, 60, 20, -61, 33, 44, -60, 5, 45, -53, -15, 33, -41, -14, 36, -36, -23, 43, -28, -21, 46, -15, -29, 41, -3, -31, 58, 2, -46, 44, 25, -40, 32, 38, -53, 16, 28, -45, 17, 41, -36, 12, 47, -44, -7, 51, -37, -27, 62, -30, -49, 47, -20, -47, 53, 18, -56, 42, 25, -49, 17, 29, -46, 11, 32, -44, 9, 33, -37, 9, 39, -28, 1, 42, -32, -18, 43, -33, -25, 49, -21, -50, 43, -10, -48, 44, 19, -51, 30, 27, -54, 17, 35, -62, 1, 35, -36, -4, 54, -39, -16, 60, -31, -23, 44, -17, -40, 31, -10, -34, 28, 5, -32, 38, 20, -34, 23, 23, -34, 23, 22, -31, 15, 31, -36, 10, 38, -28, -5, 51, -33, -9, 48, -35, -35, 46, -20, -44, 41, -6, -48, 40, 8, -52, 34, 24, -59, 22, 41, -52, -5, 39, -36]
3342c6L1N5p1J2N3n8%N1n9J3M7m3j1N5l5l2P5m9m0P0j5n6O2Lo2N0J3p8O2L1q7
3373d9M2N5q0KQ3p9pQ4n3l5Q4l8m4P6k9m1N4No2M1J7n2K8K0m8K5L1n3NM1n0K2
3405eL9o2J9M6n2j1N5m1k6P7l9m4Q6k1p0O7J5q0N4K8q1M3M7p3J9O1p8MN8m3j1
3436a9O0n1pN1l6k7O0j8m1N6rm7M8qm1M5Rn4M2Qn7M2L6o7JO2o6MO8n4k7P9m5l1
3470c4O9k2n4P4mp1P5ko9N6J8o4K5L4n4MN1n4LN3n3LM4m1j3N3l5l9P2l1k8N9p
3503A8m9M8J0p2M3M1p4M0K2o0K3M5o6K0M6m8oN8l8k6P2m3l6P5k5n7N3J4p4N3J6
3534B3n8L2K7n0PM4n3J3M0l9mM7m1kM3l5j4N4l4j3L8k2k4M2rl6N0Ko1N8J4n8K5
3567FK2n0J0N2n7RN0n2qN3l0k9N4j9m2N7k0m0M9lm7M4J6m1K7Qj9OK8m7J9J5l7
$$ y = [-36, -5, 50, -21, -9, 44, -14, -14, 37, -22, -9, 38, -5, -16, 39, 4, -28, 47, -2, -42, 28, 13, -43, 19, 22, -40, 10, 23, -55, 7, 38, -49, -7, 48, -32, -30, 53, -26, -33, 51, -2, -37, 47, 9, -35, 41, 12, -29, 25, 30, -32, 9, 26, -26, 2, 22, -26, -1, 30, -23, -18, 23, -27, -5, 34, -28, -9, 37, -15, -26, 29, -12, -38, 39, 0, -44, 42, 21, -49, 18, 33, -47, 7, 35, -46, -3, 44, -29, -10, 51, -27, -23, 35, -8, -19, 41, -10, -17, 34, -2, -29, 31, 13, -28, 28, 19, -28, 20, 12, -29, 16, 25, -29, 13, 21, -36, 6, 42, -25, -24, 38, -28, -24, 44, -10, -37, 42, -3, -34, 35, 13, -41, 33, 29, -42, 33, 31, -38, 18, 36, -28, -3, 31, -23, -19, 32, -22, -19, 34, -19, -16, 28, -13, -26, 27, -8, -47, 25, -6, -34, 25, 18, -31, 17, 27, -45, -2, 39, -35, 5, 27, -33, -10, 35, -31, -11, 35, -13, -19, 39, 1, -25, 47, 4, -32, 43, 18, -39, 14, 28, -46, 7, 23, -35, -3, 24, -26, -19, 25, -28, -15, 25, -14, -18, 29, -12, -14, 29, -6, -20, 34, 0, -13, 25, 3, -21, 21, 12, -24, 26, 28, -33, 25, 39, -19, 6, 28, -22, -12, 40, -17, -8, 42, -10, -18, 35, 5, -24, 30, 11, -31, 26, 6, -34, 15, 12, -35, 9, 25, -16, 11, 19, 0, 6, 34, -13, 6, 21, -16]
3600a6J1M0l8JM0l7rL7l1k8O0l3l0N8j9m3N7pm2L0K0l0NK5m9J9L2l9oM5m0j0L7
3633A0j5k5N3k4k1M5j7l0M4mm1M1Om7L7J7n7L9K0m6J1L8n5J0M5m4j7O1m6j5M9
3664B2k1m1N8nm4M0J5n0L4Qm4J9L4m7K2K7n4K1K4l8KL0k3nL8k4rL7l4j3M9k9k7
3697b8N7k6k7M0jm0K4K4n2L1K2n1ON1n1j6N6l7pL7j6j6L6j7k4L6rk9L9%l7K8O
3730Im7L8J9k9J6K5m2QK6m1J3L2n1QL2k7j0M2l3qL9j4l4L3Nn1N0J5n4K1L9n7J7
3763a1L7k9kK9k1j3L2l4PJ7j1mL3k7j5L0j0k7L0Nm3L4Nl9L2J2m3K9J5l5J5L0m4
3796a6J9K7l8rL3k2j7M0j9k3M2kk6K4Kk1J3Jk0K3J8m4J6K0k7NK3l6kL3k7NK0k0
3830ej0L3k5rL3k0j8L2Ol6K9j1j7K2J3l1LK0k9J6K5m1JM1k8j2L3k1oK8qj4L1j6
$$ y = [-16, -5, 35, -3, -2, 38, 1, -8, 29, -2, -30, 30, -3, -33, 25, 6, -37, 20, 13, -29, 1, 21, -9, -4, 21, -28, -9, 23, -16, -22, 23, -17, -27, 10, -5, -30, 23, -1, -22, 23, 6, -24, 20, 16, -25, 16, 22, -25, 12, 29, -28, 11, 31, -15, -4, 34, -21, -11, 34, -10, -27, 34, -12, -27, 22, 1, -40, 18, 13, -31, 9, 24, -26, 8, 16, -28, -9, 25, -22, 0, 27, -27, -6, 18, -20, -18, 12, -11, -16, 22, -2, -11, 26, -8, -21, 28, -1, -28, 29, 3, -24, 16, 15, -25, -1, 23, -29, 2, 24, -27, -21, 30, -21, -37, 19, -18, -25, 12, -4, -20, 16, -1, -25, 11, 2, -27, 12, 12, -25, 3, 9, -38, 0, 19, -10, 6, 31, -11, -3, 23, -18, -5, 27, -24, -16, 16, -11, -21, 21, -12, -20, 19, 5, -29, 4, 9, -42, 8, 23, -31, -10, 29, -28, -11, 26, -3, -5, 24, 3, -10, 22, -12, -5, 12, 1, -3, 30, 3, -12, 18, 8, -19, 11, 16, -27, 7, 12, -27, 5, 17, -26, 3, 18, -17, -2, 28, -16, 3, 30, -8, -17, 16, -6, -23, 17, -2, -25, 17, 15, -11, 13, 15, -6, 7, 8, -12, 11, 29, -15, 1, 21, -6, -1, 22, -14, -16, 17, -10, -5, 15, -5, -15, 18, -7, -16, 17, -3, -21, 11, 17, -19, 10, -1, -18, 4, 17, -14, -11, 9, -20, -4, 21, -20, -19, 22, -6, -18, 15, -6, -12, 16, 8, -6, 25, 9]
3864Ij8K8j3k1K6jk0J5Rl9K2J8m3K7J3k9J4K4l4qL9l3j3M1k2j2N1k5j8L2j3k7
3896b1L7Jm1L2Kk8J6K2l5K4J1k4RJ3k0lJ9k7%L9l5qK6j6j5L4k5NK6j7k0J4J4l3
3930b4L0Kj7KL9m8%M4k8lK7k2j5L1j2k0J9j0j2L0j6j2K9Kl4K8kk2J7ml1L2Qk4
3964a6PK3k7JL3l9KK9k0j2L3j7j5J6Jj2J9kqQJ2k4J2Ol3J9J9k7J0J6j7rK6jl0
3999a7K6j6OMj3rK6j5rJ8Lk7K0Pk2J7J1k8OJ6k7K8K0l5J1J6k7j1M0j9jK0k1qK9
4034A9j5j9L2j4j5J7%k1QQj5RK4k6PJ2k9JL3k1nJ8j6nJ9j4pK3j8qK4j0oJ5%j0
4070eK1Jk9K5jj6qK5k2KJ6j7MJ6nj7K2j1rJ6qrOJ1k3K4Jk1QRqmJ6k1lK0lJ2Ok2
4110aMQoj6K3j8mJ9Ml0J6J0j8J3MpJ2Jm5L8Qk4j0K2npJ1j3%J2jpJ8oj7QJ2k2J9
$$ y = [9, -9, 19, 6, -15, 11, 10, -10, 5, 14, -25, -3, 15, -28, -1, 12, -17, -3, 21, -13, -21, 18, -15, -28, 13, -9, -21, 30, 5, -13, 19, 6, -21, 16, 17, -24, 8, 10, -18, -2, 20, -15, 9, 20, -4, 5, 18, -2, -5, 14, -13, -13, 26, -9, -17, 9, -7, -22, 12, -13, -8, 18, 1, -19, -5, 9, -24, 6, 8, -9, -7, 32, -16, -16, 28, 0, -3, 24, 2, -13, 18, 6, -14, 5, -5, -17, 13, -3, -15, 14, 16, -18, 10, 8, -14, 3, -1, -32, 0, 8, -16, -9, 14, -13, -12, 21, -18, -16, 13, -7, -19, 14, -3, -18, -2, -1, -13, 6, 4, -4, 4, 16, -8, 4, 10, -23, -4, 15, -12, -2, 14, -3, -12, 14, 13, -17, 9, -7, -1, 3, -10, -19, 7, -8, -17, 1, 4, -23, -3, 4, -18, -1, 10, -18, -12, 4, -23, 5, 25, -10, 1, 17, -10, -21, 19, 0, -1, 19, -2, -10, 19, 4, -15, 17, 3, -12, 5, 5, -16, -8, 0, -15, -6, 18, -8, -1, 11, -18, -17, 16, -5, -10, 8, -8, -13, 6, -8, -15, 8, -10, -18, 6, -4, -10, 5, 5, -5, 16, 17, -12, 13, 12, -4, -12, 13, -9, -7, 9, -8, -4, 12, 7, -10, 12, 1, -8, 8, 0, -9, -3, 8, -15, 9, 10, -11, -3, 6, -2, -6, 10, -11, -14, 6, 3, 15, 21, -1, 3, 11, 5, -11, 12, -6, -10, 9, 13, -17, -1, 9, -9, 4, 8, 1, 13, 14, -31, 7, 15, -9, -19, 3, -2, -9, 2, -11, -11, 1, 0, -7, 11, 5, -12, -4, 8, -14, 5]
4149EJ2k2J2Oj2PJrNJ5k2J2Lj8LJ1j7nK9noJ0ok5K1kk3K5Oj6RMj0LJ5k0KJ7j8
4188cNJ0j3j0K6j3oK8k3LK1pk2K7oj8J2oj3J7qrOMj5NJ3j8KL5k9MJ9j1j6J6nl
4226aJ5lk6K0%pJ0jk5PJ4qQKqQOk6K4%j3jJ9kk0K6j3j0J4jpRkl1K1rjRKmkJ5q
4269@JJ9j4j3J7Jk2K8j5pRknK1j4KL%l%J6k3PjjkpjJ0Nj2oQj0PRnj5J7%j2K3j7
4312doJ7lk0K1K2k1j2K1k0RQj8J1Pj6JPj%J2j5mOJ3j9Q%jP%qNnmJ3kj6KQj8J7
4354BnlOkk%K2qj1J3j2kJ6mj4J9Lj0rJ4k0J7%j5JQj1OQmOKj0nPmmK0j8pJ7ooN
4398@NlPLj2J3j0k0K6Ml4K4OrPMopJ9rjJnj2J3ppJ2jqQQj2jNmL%j0M%%J6Lj7K
4444bPj0QJ1j4jNpmLOlMMj0J1kj4NOjlPj6Rjj9J1J4nj2RjrRknjJ0KkNrJ3%rJ4
$$ y = [5, 17, -5, 7, 13, 1, 8, 9, 0, 5, 20, -2, 10, 13, -5, -2, 9, -8, -13, 16, 11, 5, 15, 9, -16, 5, 3, -20, 5, 11, -5, 4, 8, -2, 1, 16, -4, -2, 15, -3, 2, 12, -1, -11, 15, 2, -4, 24, 1, 4, 25, 18, -4, 23, 17, -1, 11, 5, -8, 9, 1, -8, -2, 2, -13, -8, 5, -13, -11, 24, -5, -1, 18, 7, -9, 7, 2, -1, 14, 11, -15, 5, 5, -2, 8, 7, -18, -11, 3, -5, 3, 5, -3, 5, 11, -15, 9, 9, -4, -5, 14, 12, -8, 18, 5, -5, 9, 8, 1, 10, 8, -23, -2, -11, -12, -3, -1, -5, -7, 8, 0, 1, 20, 6, -7, 10, 11, -11, 17, 2, -5, 4, 2, -3, 18, 4, 6, 9, 9, 6, 6, 22, -1, 6, 5, 4, 2, -5, -6, 4, 9, -3, -9, -1, -11, -4, 5, 0, -15, 2, 2, -10, 13, -4, -10, 7, 4, -16, 5, 27, 6, -6, 15, -5, 4, 12, -6, 5, 12, -4, -3, 4, 3, 3, 15, 0, -4, 2, 15, -4, 4, 4, 3, 10, 10, 2, 7, 2, -2, 11, 9, -7, -5, 3, -15, 2, -3, -6, 0, -2, -4, -4, 18, 10, -1, 12, 0, -2, 14, 10, -4, 15, 18, 8, -1, 13, -7, 10, 10, -5, -4, 4, -7, -1, 7, 3, 9, 11, 1, -4, 3, -1, -5, 15, -3, -10, 7, 1, -5, 0, 5, 2, 9, 12, 0, 13, 3, -17, 9, 13, -21, 3, 9, 0, 7, 11, 5, -2, 17, 8, 7, 8, 3, -9, 4, -3, -10, 2, 1, -7, 1, 9, -3, -4, 1, -3, 0, 0, -10, -6, -6, -6, 10, 13, -4, -2, 5, -5, 3, 14, 0, -1, 4, -3, -7, -4, 2, -1, 3, 7, -3, 8, 6, -8, -3, 3, 2, -1, 6, -10, -1, -2, -21, -10, 4, -1, -13, -4, -5, -14, -5, -7, -12, -13, -3, -1, -3, 2, -7, 6, 6, -3, 11]
4491A1momRj0J1Mj3kJ0lrJ2Kj4J4j5OmJ5qNpkNRj5J6j4oKKrKJ3j2JMNjlPrQmk
4537cOk%RloQpj1K8j5lljPnpJoJ6rJJ2oj3PMoMQp%%PJLj1J2JqR%j0lRj0J1%nM
4587HllmLnQjrPj0OmQPj2mJ2j4J5qnNJjmRJlLQk1J3%lKrJ2ml%J2Kj8NOmjJkQL
4638A0k0jOqPKJj0RNJjj0QJpnJ1pMJ4KqjJ4qoOoKj2jRRlJlOkrJkJoMMPj4QMro
4690hJ4r%LOqMllRpOnK0j1kJJNoqJ2j2Rj0KLmJ8j5JmkkoJ1mKRj2KjNJ%ppNJ%R
4741Cj1JLJ0P%mLKoLrPqjQlMlNj1lmKKlKJ2roNqOlO%JkpJ0j4PlJ5j3PoLJ1qJ1
4792A1j5J2qmJ3j4LLqOjRJq%lk%LqQj1J2pJmNJMJKlJnPPj2MM%MJoJ2j0J0%rkm
4842AJ0qkNKj4J3Nj8KJ0mrPmLj0J4pNOnNlmqJ8k3OJKOPrKnmRJmQkj0Nj0J0PmJ6
$$ y = [11, 7, 1, -3, 6, -4, 7, 11, -2, -4, 6, 3, -6, 6, 8, -6, 8, -7, -1, -5, 10, 2, 7, 0, -2, 3, 12, -3, 13, -1, -7, -5, -3, -12, -10, 3, -9, -8, -4, 1, 0, -3, 4, -5, 3, -1, -3, 3, 1, 1, 10, 7, 1, 9, 2, -9, 19, 4, 1, -2, -3, 4, -1, -8, -7, -13, 3, -6, -5, 7, 1, -12, -5, -1, -7, -3, 5, -2, -2, -2, 5, 6, 9, -2, 10, 11, 3, 12, 12, 2, -1, 8, -2, 9, 9, 4, 8, 5, 2, -2, 1, -4, 4, 3, -6, 1, -9, -3, -7, 1, 8, -4, -8, 4, -10, 5, -3, -8, -3, -2, -3, -7, 2, 3, 0, 3, 11, -10, 3, 3, 0, 2, -7, 5, 1, -2, -2, 10, 12, -6, -1, 5, 1, 0, 1, -1, 7, 10, -10, -11, -5, -13, -6, -4, -3, -13, -4, 1, 2, 1, -9, -1, 0, -7, -12, -1, -8, -4, 10, 12, 4, 3, 17, 9, 3, 9, 3, 5, -7, -8, 1, 10, 7, 8, 5, 11, 9, 0, 1, -1, 0, -6, -2, 2, 9, -5, 3, 7, -2, -8, 6, -3, -3, 0, 6, -2, 2, -1, -4, 5, -2, 4, -1, 19, 8, 6, 7, 8, 13, 7, -1, 11, -1, 8, -2, 0, 3, -1, 17, 2, 3, -1, -3, -5, -11, 0, -4, -2, 7, -5, -3, -4, 1, 2, 2, -5, -12, -7, -6, -6, 3, -8, -7, -4, 6, 13, 13, 9, 12, 14, 8, 11, 2, 9, 1, 0, 8, 5, 9, 6, 11, 0, -3, -7, -5, -3, -6, -4, 8, -1, -7, -2, -10, -4, -7, -1, -1, 0, -2, -9, 1, -13, -6, -9, 6, -7, 0, -6, -3, 8, 0, 11, -4, 8, 0, -4, 9, -5, -2, 1, -7, -1, -2, 7, 8, 0, 0, -3, -5, -5, -2, -10, -2, -13, -1, -8, -7, -11, -6, -5, -1, 0, 2, -1, 0, -5, 2, 9, -3, 1, 5, 5, 9, 10, 4, 16, 6, 16, 16, 7, 5, 1, 11, 3, 1, 6, 8, -6, 7, 12, -6, -4, 6, 2, -7, 0, -4, -1, -11, 3, -4, 1, 7, 2, 7, 4, 0, -8, 10, -13, -7, -6, -4, 2, 9, 0, 2, -3, -7, 2, 3, -1, 7, 5, -5, 0, -10, 0, 7, 3, 19]
4891A9j9MJjkjj9J5Okm%mLJ6mj5KjMjNoOkKNj2RKLoNmMlqQRj0JjRj1Nk%jMj4J0
4942DnlOJPj0PpoJ1kPj5J1oOj9J4J5j4NLRk5J4Lj4P%Mqj0J8pLjKklMmoOnOj1J3
4989CJrQlJ3rQnlj0J6Nj0OrPrJ0oM%Nj0QJpRj3%NJlNKj0Mj1kJ7jqMpkJ3j0MKJ
5038EkoOmkQMoLj%kjjMj5LJ1j2nJ0nLoM%J3LqJj5J3mkJ0j7NL%lQlJ3nmJ0j4KN
5087DnlNMmPmpJ0MonOlOknpkQKopMOj0LJ2Kj7O%mJ9rnkM%JmOllQ%RqlJQ%jlmm
5143aJJKNqkMnnQJ1j8QpPlLJNrjQlKj4PJ0j0OqJ0LqOjLjJ2k2MKoNO%JqlpLjJ4
5195GoqOpJoJ2%kjpJ0N%pRoPnOrJmjJ4j0qJ1nMmRokRonLRroRj5RLo%%KNj1oJ8
5248AnJj4K3Lj0njLRpoRKpJ0jn%J0rQrk%kKJJjkJ0qpOLpRJj7PJ1j8J1nMNOrj0
$$ y = [19, 0, 4, 5, 4, 2, 1, -18, -3, 3, 1, -3, -3, -7, -4, 12, 8, -7, -5, -6, -2, -3, 2, -4, 2, 0, 2, 7, -5, 4, 6, 9, 3, 8, 4, 8, 5, -3, 5, 14, 4, 5, 4, 13, 2, 7, 5, 5, 4, 8, -6, 4, -1, -4, 2, 3, 10, 0, 7, 0, -6, 5, 3, 10, -5, 6, 0, 6, -13, 1, 16, 2, 7, 10, 19, -6, 8, 11, -3, 4, 4, 8, 0, -10, 8, 1, 4, 3, 5, 3, 0, 4, 0, -6, 0, -5, 1, -10, 3, 4, -5, 3, 0, 13, 4, 12, 7, 4, -6, 10, 15, 5, 11, 2, 9, 0, 10, 4, 8, 8, 13, 3, 11, 12, 5, 14, 1, 1, 6, 7, 4, 9, 11, 1, 5, -6, -8, 9, 8, 0, 4, -3, -5, 8, -2, 2, 4, 5, 3, -3, 3, -1, -3, 5, 9, 3, 6, 5, 5, 3, 2, 1, 5, -10, -7, 4, -8, -13, -3, -8, -5, -11, -7, -7, 6, 9, 1, 2, -13, 0, -4, -6, 4, -13, -8, -5, -5, -8, 0, -3, 10, 5, 1, 11, -3, -1, 4, -1, -4, 1, 5, 1, 8, 4, -3, 7, 11, 5, 0, 6, 3, 9, 7, 2, -5, -7, 1, 3, -3, -10, -6, 0, -10, -7, 5, 7, -10, -4, -4, -8, 11, 2, -3, -5, -1, -1, 0, -4, 2, -1, -4, 4, 4, 13, 5, 2, 3, 11, 11, 10, 7, 3, -1, 0, 1, 3, 8, 0, -2, 2, -3, -8, 0, 11, -7, 1, -6, 1, -2, 1, 2, 7, -2, -3, 5, 2, 4, -10, -3, 7, -3, 3, -5, 5, 8, 0, 6, 5, 8, 7, 19, -3, 1, 3, -3, 2, 8, 8, 9, 1, -2, -9, -6, -7, 7, 1, -7, -1, -8, -7, -13, -1, -1, -3, -4, -11, -1, 4, 4, -3, 6, 0, 7, 2, 8, -1, 0, -4, -5, 9, -1, -9, 2, -3, 1, -3, 6, 0, -2, 7, 1, -4, -1, 8, -1, -7, 2, -13, -4, -1, -7, -7, -7, -5, 0, -11, -17, 1, -4, -3, -17, 6, 9, -1, -6, -7, -4, 5, -2, -8, 1, 3, -4, 6, 5, 0, 0, 10, 1, 9, 0, -2, -2, -4, -2, -1, 0, -1, -3, 7, -1, -8, -2, 1, -6, 3, 4, -13, -6, 5, -13, -2, -7, -3, 2, 8, -1, -11]
5298a1OJ6j4QrJ2pj4K1jpjRJlMnlPj6mlK3qPj1jKlnOJ2j1kmRlMJJRj0QqKj0%N
5346akJ1omJLKLMljrOkKrNJjooJ4j0JLpJ2j2RJMoMNpKNj1OMpPknkMkJ2qjPjjk
5400DJ1j2ojoRnN%jnPLrPqNnJ2oj1Kl%J2LJ1mlPk3K0klOoMkonJ3Jnj2J0oQkj1
5449hJ2qkRmjrJ0J4j4JlKkkRj2NMQ%j4J8qjoJ5j0NmmmJ0poJ9j1j0J0nKNl%j%P
5496FnmLKJj4J3nMj5J1PlMj0NKj1PJ3lrJJLKNnKKpLjnJ5k1JNj0j0J3Rj1KJ0j1
5542h%nK1j7jRMpJoOLRoKj1NJ0j5O%LlJ0j1lQoKMllLloJ4mj0j2J6pJ2joRkokR
5591Bj2mJ6KpKKlRJrQj6J7nrKoK1j7PJ1j6NjokJjRNnj2QLrJ1JqL%j5OOqJ0pMQ
5640BKkkQn%PrJlJ%MljnJ6j8%J1rmRqM%oQk%PloJ5j0oMKjjPpmQPoJ0pnJ0mlKM
$$ y = [-11, -5, 11, -3, 5, -4, 8, 1, -13, 8, 7, 0, -1, 8, 9, 6, 10, 5, 2, 9, -7, -11, -14, 9, 1, 8, -3, -4, -2, -5, -10, -4, 8, -3, -5, -9, 0, -3, 1, 2, 3, 12, 2, 10, 2, 4, -6, -6, -1, -3, 8, 2, -2, -1, 2, 4, 7, 11, 8, 7, -2, 4, 2, 4, -5, 0, 1, 0, -6, -12, 2, -8, -7, -4, -11, 1, -11, -2, -1, 3, -3, 1, 6, -1, 1, 6, -5, 1, 5, -2, 5, 3, -2, -4, 0, -2, 10, 2, 1, 8, 7, 6, 4, 15, 3, -3, -4, -10, -1, -6, -1, -1, -2, -7, 0, 3, -6, 1, -7, -2, -7, 5, -1, -12, -10, -13, -13, -1, 2, 13, 9, 6, 13, -10, 10, 8, 5, 11, 5, 9, 7, 1, -4, 9, 10, 5, -7, 3, -3, 5, 3, -8, 4, -4, -6, 3, -1, -2, -11, -1, 13, -1, 0, -3, -1, -3, -5, 4, -8, -3, 1, 9, 9, -5, 13, 5, 4, -2, 13, 3, 8, 4, 0, -4, 6, -1, -7, 12, 1, -9, 1, -4, -2, 3, 0, 0, -1, -1, 6, 1, -3, 0, 2, 3, -11, 2, -3, 1, -14, -3, 4, 1, 5, -5, 0, 2, -9, -2, 11, 8, -1, 0, 1, 4, 6, 11, 6, 8, 10, 3, 6, 5, 0, 15, -6, -5, 0, -10, -20, -7, 2, -9, -7, 3, -8, -8, -13, 8, -9, -10, -1, 3, -4, -3, -9, -3, 0, 9, 3, 5, -6, -1, 9, -6, 0, 0, 3, 0, 10, -1, -4, 4, -2, 0, 4, 1, -2, 1, -2, -8, 6, 2, -8, -20, -4, -11, 1, 0, -6, 3, 1, -5, -7, 2, -10, -14, 2, 4, -3, -1, 1, -2, 7, 8, -1, 7, -9, 8, 3, -6, -4, -10, 11, -6, 1, 12, -4, 1, 0, -6, -8, -7, -8, 1, 6, 1, -11, -3, 0, -9, 2, 3, -5, -2, -2, -17, -11, -5, -13, -3, -10, -6, 2, 4, 2, 0, 8, 3, 3, 10, 1, 2, -1, 0, 0, 4, 1, 0, -5, 11, -7, -7, 4, -5, -9, 0, -8, -4, -4, -10, -2, -4, -4, 3, 0, -6, 9, -1, -7, -3, -1, -2, -3, 4, -3, -7, 1, 8, 2, 12, 5, 0, 10, 6, 3, 5, 9]
5694IMj9J1qkKjpPmOmJpMJ0k2K4j3QJ2k2J1KkqlJ1JjkoPlJPoPPjj0pJ2j1nJ5j
5741DJQqqJ0j1pJ4pOrj%J3j0%mJ7j6J0jpNK%mJ1nkJ2Jj0%NpmQj2PjJjjLJjoOO
5790Hj6KkJOOlj1KKoPnQJlLnPkmJ1j2J3klkKmJ2Lj1J1oj0PrNjMMj5kNLqJ3rjM
5840brkPJ3lmn%J0j7NRnMJ0kkLLj0KRk0QMnLOj1J%oJ0KqqQj0J0j3J1j3LJ7j0n
5886a2QJ0j4J5mj0J0j4PJQpRj0OLPJj2NpJ6pOjj2PmJ0k1RJj8J5Pj1qOj1RLJ6j3
5929aJ3k6JJ4KlRNj3QljPMj3%JnJ4j1RpqJ0rOMj%JqJ4j1nJ0lJpJ1k0%Nj7J7J3
5974GnnM%Lq%J3j3%J8qKj1J3%nJlj2PNnJklLJpJ1Kj0kJ9j2j7J6j2J2Kkj0J2Km
6019bO%nJ0Kj5%RpQLmkkPnJrKMknNMpkJ2j1J4j8kJ8opJ5qrJ0llNPnkkJ4k1KJL
$$ y = [9, 13, -6, 5, -3, -5, -3, -4, -11, -4, -8, -2, -6, -5, -12, -8, 2, -20, 4, -9, -1, 11, -11, 0, 2, 0, -8, -11, 0, 1, 0, -2, -8, -1, -4, -3, 4, -2, 5, 12, 11, 1, -6, 6, -5, -10, 5, 4, 5, 13, 5, -3, 7, -4, -11, 3, -4, 2, -7, -8, -8, 5, -5, -5, -9, 8, -8, 2, 1, -6, -1, 1, 1, -3, 8, 3, 1, 13, 14, 4, 4, 9, 2, -2, 6, -6, 1, 0, 1, 0, -1, 2, 3, 2, -4, 2, 8, -8, -6, -8, -7, -1, 5, 2, -9, -7, -5, -11, -4, -9, -1, 0, -3, 0, -5, 2, 0, -4, 7, -5, 8, 6, 3, 1, 3, -1, 11, 14, 3, 14, 8, -2, 5, -4, 1, 0, 4, 8, -7, -9, -4, -1, -9, 4, -5, -6, -2, -11, -13, -6, 7, 4, 0, -5, -5, 5, -12, -7, 2, -3, 1, 11, 9, 7, 10, 13, 3, 5, 14, -6, 2, 6, 1, 4, 10, -1, 0, 0, -6, 4, 6, -2, -10, -2, -12, -2, -15, -4, -17, -14, 3, -7, -12, -4, 6, -8, 7, 3, -7, 3, -11, -4, -3, 5, -2, 7, -3, 3, 6, 13, 14, 2, 7, 0, 16, 9, 15, 14, 2, 9, 5, 15, -6, 3, 4, -14, 1, 8, -3, -11, -5, -16, -7, -4, 12, -1, 12, -14, -13, 1, 3, 0, 9, 14, 1, 9, 6, 5, 12, 16, 3, 3, 4, -1, 13, 2, 11, 4, -4, 6, -3, 3, 7, 6, 6, 7, -1, 13, 2, -3, 7, 4, 5, -2, 9, -11, -11, -6, -23, -6, 7, 2, -3, 1, 1, 4, -4, -4, 9, -4, -4, 14, 6, 8, -3, 10, 10, 5, 6, 3, -9, -2, 3, -2, -1, -3, -6, -3, -2, -9, 2, 4, -6, -8, 11, -1, -18, -2, -14, -2, 0, -2, -12, 0, 2, -2, 4, 4, -1, 9, 11, -4, -4, 5, -2, 6, 9, 5, 3, 1, 8, 3, 4, -5, -3, 1, -1, -6, -1, 3, -4, -6, 6, -5, 9, -9, -11, 7, 1, -6, 9, 1, -8, 2, -1, -4, 1, 8, 3, 1, -1, 13, -8, -6, -5, -2]
6069bJ5k1N%PMnl%Oqj1J7LpjNPj4MqNoMK%rQLoqJ6nNlkOMl%RmplLlQJk%JoQkm
6124C%joJ0j0m%J4rjJ0p%moKRoKJJjjMOkJQj3J1j6J0J0j6MOLmj1lJ0JjqnMrPJ0
6173CoPj%jJjLpMj5J8pl%JlJ0%lNQk0J8Pj2j3RJlLmJ2lnqJ2j0j0J1jjJnRJrKR
6222DMnkKpKMqOM%qJ4ojJ%MnJ1knNpRqj1J2Rj1KKj8J1Oj6LMkKlJ2j1Qj0JkROn
6272DJpJ1om%lMJ0poR%pJ0Nj6LMmLLQk1J5j0oJ0Mj3KKnlL%K%lPjLj0K0mKklj0
6321fQMjNmRkq%k%kMj4J1KlLmkJ0j5J3mkRj3KJ4j8jLlLkRmNkoNJpOjJM%jj1J0
6372CknnOO%j%J5k2LmOlnj%J3oLkoQJk%JmlKLj6K6jLkklLmk%KnpJ6jj1J5j2MJ0
6424A2j0%jj0koPQjKJkO%j8J2Qj1J3pl%JJKNnPj0MOo%J1j6LKK%JPj5O%nKkkqJ3
$$ y = [-2, 13, -8, -3, -3, 4, 8, 3, 0, 0, 6, -2, -13, 4, 7, 0, -1, 4, 11, -3, 1, -7, -2, -8, -4, -2, -2, -11, -3, 0, -6, -14, 2, -3, 2, -1, -3, 3, 7, 4, 4, 13, 9, 2, -1, 2, -1, 7, 8, 6, 6, 7, 1, 9, 7, 3, 3, 2, -4, 6, -4, -8, -8, 6, -3, -4, 6, -1, -1, -5, -11, -9, 0, -6, -4, -3, -2, -3, -4, 0, 6, 4, 5, 13, 0, 11, -5, 5, 15, -1, 3, 9, 12, 8, -3, -6, 4, 5, 4, -4, -9, -5, -14, -7, 3, -3, 4, 3, 3, 2, 3, 2, 5, -2, 2, -13, 5, -2, -5, -5, -4, -7, 3, 3, 0, 5, 13, -7, 11, 18, 6, -7, 2, 3, 0, 3, -1, 11, 8, 3, -5, 7, -3, -13, -2, -3, -4, -3, -8, 1, 2, -7, -5, 4, 8, 3, 1, 3, -4, -2, 2, -6, 0, 4, 4, -4, 10, 4, 3, 4, 4, 8, 3, 14, 12, 7, 12, 5, 14, 6, -5, 7, 16, 5, 7, 9, -9, 2, 8, -8, -5, -1, -3, -1, -4, 8, -3, 5, -5, -4, -6, 3, 9, 4, 5, -2, 9, 3, -1, -1, -4, 0, 10, 3, -3, 6, 6, -1, 9, 14, -2, 1, 5, 1, 4, 7, 15, -6, 9, -1, -7, 3, 7, -6, -4, -2, -7, -10, -7, -7, -5, -5, -8, -1, -2, 1, -9, 11, 7, 9, 7, 4, -6, 2, 6, 5, 10, 6, 15, 13, 5, 5, 3, 3, 1, 5, -9, 2, 4, 1, 4, 0, -2, 8, -7, 6, 2, 0, 9, -4, -2, 12, -6, -7, -4, -7, -4, -6, 3, -1, 4, 2, -4, 1, 2, -5, 1, 0, 1, 5, 5, 4, -7, 3, 1, -4, -9, -3, 3, 3, 2, 2, 17, -5, -2, -6, 0, -3, -8, -9, -9, 4, -2, 1, -1, -7, 1, 2, 0, 0, 1, -3, -6, -4, -1, -17, 9, 8, 11, 9, 7, 4, 7, 3, 1, 1, 3, -2, -9, 7, 6, -5, 10, -2, 2, 12, 2, 2, 1, -9, -11, -17, -10, -2, -3, -1, 0, -2, 4, 4, -14, -2, 6, -5, 8, 1, -2, -2, -1, 0, 2, 7, 2, 9, -1, 3, 9, 3, 3, 14, -2, 1, 3, 5, 5, 6, 13, -2, 4, 4, -1, 1, -1, -3, -11, 2]
6474BonOLKQoqMQj4QKj7J5%LqMNjJ0rjJ2j4nJ4onlKMlQrNnmJkoMQkoJkJ1n%nK
6527en%J1JpJ0%mQ%%pLnOoLRj7LnMJ3j2PqjKJ0j0OorJ7LrqLmJ1JJOpljRj1PMr
6578aMjNkjJ0j1J5lj4OmKmjrMJ0mnJk%Nj2KP%LpNLMolJJ4j0OlmJ1k1J0mjMQPr
6628EqJ1JmKMnrOJl%PonkmQk1RN%P%j0PNMnOloJ2Oj3MjnONJkJkmo%OnPnnK%Km
6684cNpPnJMjj6J8oMqKKm%J0kj0OLJ0qJ3pKJoMLj4j1J2KmJ1jj6J2okLmMqRklJ0
6733Dj7J2j5MNLNjMklMpkNkmK3j7LJ0nLj0MojJ6j7kKrOjJPkKkLqOlQlnLjMnlJ0
6785Dj6J8j7MMMLqMoOONj0lPNj2MlqOOnklj4K2jpJOkj7OMMNrJ1KlLjj6QJ6okk
6835AlMklQQolJmMjonN%j1J3KnKMnKPk3J2MpjjJ1mKLjQOj8J2j2J%J0llKJknMK
$$ y = [2, -4, -9, -3, 0, 2, 10, 4, -4, 0, 8, -6, 2, 4, -13, 2, 2, 5, -3, 1, 6, 5, 15, 6, 5, 17, 3, -2, 12, 6, 1, -2, 0, 4, 1, 9, 0, 5, 0, -4, -3, -5, -11, -7, 1, -1, -7, -6, -8, 3, -2, -2, -7, -5, -10, -10, 1, 2, -5, 5, 5, 1, 9, 9, 9, 2, 5, 0, 6, 0, 3, 12, -5, -2, -7, -3, 10, -2, 5, -3, -4, -2, 8, -2, 4, -2, -11, 6, 9, 0, -8, -5, -9, 2, 3, 4, 10, 3, 0, -1, 8, -3, 4, 8, -1, 3, 2, 7, 5, 4, 14, 3, 18, 15, 1, 7, 3, 5, 1, 0, -9, -5, 5, 1, -4, -3, -5, -5, 0, -12, -10, -3, -3, 0, -7, -2, 1, 5, -1, -4, -3, 11, 1, 7, 4, 0, 11, -10, 0, -4, -5, -1, 7, 14, 5, -3, 8, 9, 5, 7, 11, 6, -3, 3, 4, 1, 1, 8, 2, -3, -5, -9, -1, -22, -13, -8, -8, -1, -1, -11, -4, 1, 5, 0, 6, 3, -3, 9, 15, 2, 6, 5, 0, 6, 11, 12, 10, 11, 9, 5, -1, -1, 5, 0, 7, 2, -3, -1, -1, 1, -3, 2, -5, 2, -3, -2, 2, 1, -15, 3, -3, 1, -7, -5, -3, -7, -7, 3, 1, -9, -3, 0, 10, 2, 15, 8, 10, 11, 5, 9, 12, -2, -13, -1, 1, -3, 8, 7, -9, 3, -3, -5, -2, -6, -2, -10, -1, -3, -6, 4, -13, -1, -16, -12, -7, -4, 1, 0, 4, 2, -1, 3, -4, -6, -1, -3, -7, 16, -1, 2, 12, 7, 10, 0, 4, -2, -3, 13, -4, -6, -4, -13, -7, -8, -7, 0, -2, 0, -2, 1, -7, -1, -4, 4, 1, -4, -1, -2, 2, -3, -6, 4, -12, 6, -11, -7, -3, 1, 4, -4, 0, -6, 0, 6, 11, 1, -2, 5, 10, -2, 2, -1, -9, -3, 3, -2, -4, -7, -21, 1, 0, -7, -6, 0, -2, -19, -13, -9, -5, 0, -9, 2, 4, 1, 4, 3, -13, -5, 11, 5, 3, 1, -2, 2, 0, -3, 5, 13, 7, 4, 5, 1, 5, 4, -2, -7, -2, -2, -13, 0, 2, -3, -1, 3, -2, 0, 7, -16, -4, 0, -7, -8, -9, 2, -2, 0, 3, 2, 10, 16, -2, 10, -2, -1, -1, 9, 6, 3, 5, 6, 4, -1, 3, 5]
6887ENj0Lkmj1J3koJ3n%k%JkNnJ%MpLrONnJ5oJ2j2%J0j3Qlj6J1NrJ0jlk%%oLO
6936Ckj6%jLJmJ2KnJ3j2jOpKJJ5j4jQjmQj2MknJ0MomJ5JqpKJmQj7K0j7kPj0OM
6984fJj0RoJ4nqLlKQMj5J3JJmRKrmJ0jrJ4%j1JLMj7J4MJj1KJpj%J3j5QnMmOmK
7033amJ6k2QQmMNnKLm%jJjklOklOLj4J0LlkmL%mjNOk0J3Jj2J0%qPojOLk0J4lJ3
7084Fj0jJ2LJjqRJj5PKpKKkmMnOkmpKJ3j1nQMnj0J6Klj0KJ6j0%JPj2NJlJ0pNK
7133GrNJjn%oJ3j3J3pPjr%jjj3J4Nj0kJ5j3J0l%kNKj1J0qKJ3j3OlQj5RNmjLlL
7180BJmOJppJ4j4J2MqpPj1Kjj0J9rnJ1%JjoRoKNlp%J0kJ0pJoONo%kKpOrNjOJm
7232bQmJ0j9lRKoJ0plLoRo%J0nMmkRqpLJ8qLl%lJQj5%NNlJppJ8qjOj0mQjkomJ1
$$ y = [5, 10, 0, 3, 1, -3, -14, -1, -3, -9, 4, -1, -1, -3, -3, -2, -4, 1, -4, -3, -3, 1, -6, -3, -12, -6, -1, -6, 9, 3, 15, 3, 3, 13, 0, 8, 5, -11, 0, 5, -4, 6, 5, 2, 0, 0, 0, -6, -3, 3, 1, -15, -15, -16, -13, -12, -16, -4, -2, -7, 6, -6, -7, -1, -8, -6, -5, 10, -4, -5, 3, 2, -2, 6, -6, -2, -4, -9, 1, 5, -1, -5, 10, 11, 3, -4, -2, -1, -5, 3, -14, 6, -11, -13, -6, -16, -10, -6, -5, -15, -6, -12, 2, -3, -11, -8, -11, -9, -1, 3, -12, 1, 2, 3, -1, 8, 10, 1, -3, 7, 6, -3, 11, 11, 0, 1, 4, 8, -9, 5, 9, 10, -1, 1, 2, -5, -6, -6, 7, -8, 0, -5, -1, -5, 1, -3, -1, -5, 11, -11, -3, 5, 1, 5, 10, 5, 7, 10, 6, 6, 5, 6, 5, 3, 0, 6, 4, 1, 7, 10, -4, 6, 9, 6, 4, 0, 3, 3, -1, -2, 3, 9, -11, 2, 3, -9, 1, 1, -7, 0, -6, -7, -1, 2, -18, -4, -7, 6, -4, -5, 7, 10, 11, 10, 2, 11, 12, -3, 4, 6, -1, 1, 3, 1, -3, 1, -4, 2, 0, -4, -11, -9, 4, -7, -12, -4, 0, -5, -15, 1, 3, 0, -10, -8, 8, -2, -2, -1, 6, -6, -1, 0, -3, 7, 0, 5, 7, -2, 3, 4, 3, -2, -2, -8, 5, -8, 5, -2, 5, 4, -5, -5, -6, -7, -20, -6, -1, -11, -13, 2, -11, -1, -4, -4, -6, -1, 1, -10, 0, -8, -6, 7, -6, 0, -3, 5, -10, -1, 4, 0, -1, 2, -1, 2, 3, -1, 5, 6, -1, -8, 6, -8, 4, 8, 0, -7, 0, -11, -9, -10, -20, -1, -10, -15, -4, -4, -3, -4, -10, -1, -7, -5, 0, -3, -10, -10, 0, -2, 8, 1, 2, -4, 2, 7, 1, 1, -1, 1, -6, 0, -9, -4, -5, 1, 2, -2, 6, 2, 12, -7, -10, -1, 1, -5, 5, -2, -5, -2, -8, 1, -5, -5, 5, 0, 4, 0, -2, 7, -1, -8, -5, 13, 5, 8, 5, 5, 2, 3, 11, -4, -4, 1, 6, 3, 4, -3, -10, 8, 0, -1, 5, -5, -9, -1, -2, -4, -10, -14, -3]
7285cLLm%pQrOnMoKMMkQomjLJ3j1JmOrLjM%NjqoNLJkpLmJ6j3J4j0KNokMkOmJQ
7340Hj0QnrJ2oKM%MlKk%Oj7Okj1NOKqMo%MNj6J1kRj1Qj1J0%qJ9oM%j8OJ1lQj6
7388fJ1KrQjj3R%lKJ4j5NLNpMlj0Jmk%OKroQ%JOpNj3J6kL%Jjj1J2jPj0jJ5k%n
7438EOj6PMk0K8j6JjjKNnJkLj0MoM%qJ0oKNq%J0Pj3OLnLmQlKmJPOj7J3pjpKj1
7488a6QLPj0OJj3J0%nOj2LKjJ5oKJjJKrOJ2j3%KjlmQPqOmQ%j2mQj3OJ0jolp%R
7538cmqJ4j0mQmKPOLoJ0olkQ%r%k%J1ojMoRj2jJ0lnJKlNjn%P%mopOOolMJ4qQj
7592Fl%LmJjMj6jNK0j0%%rQQqOj7PMoKj0J4j3K0j3kLoMNmnOj1O%JkRJoJ6j2%O
7641FnQj6KJ4lrmJ5%mNlmj3J1j2J5Rj5kkJ1j0PKj2Nj0NJ5j2O%Pj6OMlj0J9mlJ
$$ y = [-3, 0, 3, -1, -1, -8, 0, -9, -3, -8, -4, -10, -8, -4, 0, -2, 6, 0, -4, -5, -2, 11, 0, 1, -3, 3, -6, -3, -4, 0, 0, 5, 4, -4, -10, -5, -2, -1, -3, -10, -7, -11, 5, -8, 6, -4, -2, 3, -3, -5, -1, -3, 3, -1, 0, 8, -2, 6, 1, -8, 4, -2, 0, 4, 4, 8, 5, 7, 5, 5, 11, -6, 0, -2, -13, -8, -2, 0, -8, -4, -10, -10, -6, -1, -17, -6, -8, 1, -10, -2, -13, -3, -3, -11, 8, 2, 6, 6, -12, -6, 5, 2, 10, -6, 5, 7, -2, 6, 5, -8, 1, 1, -2, 0, 14, -1, 4, 7, 12, 5, 9, 6, -4, -3, -7, -9, -9, -3, -1, -10, -16, -8, -8, -7, -1, -8, -3, -16, 0, -2, 1, 1, 2, 1, -10, 2, 1, 8, -2, -3, 12, 10, 10, 5, 11, -5, 2, 6, -14, 14, -2, -1, -2, -3, -1, 4, -1, 0, -2, 1, -9, -5, -11, -7, -7, -15, -5, -11, -9, -4, -12, -12, -2, 5, -8, -2, 1, -4, -1, -5, 3, 0, 2, -2, -1, 6, 12, -5, 8, 1, 0, -7, -5, -16, -8, -5, 2, -8, -2, -1, -14, -4, -4, -9, -3, -15, -12, -10, -11, 4, -2, 0, 1, 0, 1, 3, -6, 0, 12, -1, -1, 1, 0, -3, -7, 1, 8, 0, 6, 2, 10, 10, -2, -6, 2, -11, -5, 5, 4, -2, -5, -12, -12, -3, -7, -15, -1, -11, -15, -7, -11, -9, -2, 4, 7, 1, 11, 5, 2, 0, 8, 8, -1, -1, -3, -3, 8, 2, 1, 5, -1, 8, -4, -5, 5, 2, -3, -2, 0, -3, 2, 1, -4, -4, 3, 3, -1, -7, -14, -8, -2, -8, -11, -7, 7, -1, 7, 6, 3, 3, 6, 2, 3, 2, 6, -10, -11, -6, 14, 4, 4, 4, -5, 3, 11, 3, 9, -8, -1, 3, -3, -1, -11, 3, -10, 10, -3, -5, -2, -8, -4, 1, -3, -8, -2, -13, -7, -7, -6, -8, 1, 2, -4, 12, 0, 0, 6, 1, 9, -7, -5, 9, 6, -3, -7, 8, 8, 4, 9, 6, 2, -11, 0, -12, 3, 12, -3, -5, -7, 4, -6, 1, 3, -9, -4, -14, -9, 6, -6, 0, 0, 7, -9, -3, 1, -2, -12, 7, 3, 0, 1]
7685ALPj3MJjRjpQjj%jrkj2J0qJ3pmOPj3QJ1k1J4kj2J9lj0N%NjnQ%nJ7j0rLlN
7733CpLLMnQonMpNJj6J3kqRnLpKlKjQLj2RnJ6kjKMmMnlnRl%pMPoLQopMKJjpQl
7790CrLnkNMlnJ7j3oJ6rKJj0RjRKQj4Nj1J0lKjMMj4LoLlNj0PkJKlmkJ5j3J0j0
7838iNOj5J4lqOkMqPJMJlRoKqJ7klmrMKNojMqJ4plnPj1OJKrPj4J1qJ1mJ0nj2m
7889a7J8Kj2J9j2JJ3n%pjJJ0ojNqJ1nMj1OKmMj0%Kjj1J4j2ORrLMKjlO%j3J0lo
7935fJ2nRljRj6NJkNqjQlJ%qRolJ1oMj0jnjJ0%lLnpjJ7rmJ6opmJ0K%OqR%JOj1
7987DkNOj7J2r%PmoMJKrKj0KJ1nj0QPMj7NJ8j3PllJMmJ0%j0LN%JjrJ1JnrRmJN
8037FkkJKkj0JKlJNqNkLOoNLj1J0j2KONrJlOQjLnjOpkJ2j3PrJ3rlLNmPopk%pP
$$ y = [1, 4, 11, -2, 2, 3, 2, 11, 10, 3, 11, 10, 9, 9, 8, -1, -3, -15, -5, -13, 0, -7, -11, -5, 2, -11, -3, 8, -13, 1, -1, -13, 6, 3, -7, -2, -2, 3, 2, -3, 5, 5, 0, 17, 7, -2, 1, -2, 3, -4, -1, 2, 6, 1, 9, 3, -2, 2, -5, 0, 1, -15, -2, -4, -12, -3, -8, -5, -12, -10, -13, -11, -12, -4, -1, -13, -4, -9, 7, 5, 4, 6, 10, 6, 10, 5, 2, -3, 6, 3, 3, -4, 0, 7, 1, 4, 12, 6, -1, 3, 5, 6, 5, -2, 6, 3, -6, -3, -8, -10, -5, -1, -4, -9, 8, -5, -11, 5, -4, -2, -1, -11, -2, -3, 6, 8, 16, 2, 7, -4, 6, 3, 5, 4, 8, 12, -2, 1, -5, -2, -5, 0, -10, -3, -5, -4, -2, -5, -9, -11, 4, -9, 1, -9, -4, 2, -13, 1, -2, -10, -4, -6, -2, -10, -3, -2, 2, 3, 0, 9, 3, 5, -3, 14, 12, 9, 5, -4, 0, 2, 7, 1, 0, 4, -4, 10, 3, 0, -5, 2, -9, -3, -2, 0, -9, -2, -16, -5, -13, -2, -6, 4, -1, -13, -17, 1, 3, -9, 10, -2, -1, 12, 7, 7, 0, -1, 0, 10, 4, 3, 8, 0, 11, 6, 10, -1, 5, 7, 3, 7, -3, -3, -1, -2, -13, 1, -11, -5, 4, -5, -2, 2, 4, 3, 0, 6, 6, -7, 3, 0, -6, 6, 1, 10, 7, 6, 15, -1, 4, 5, 3, 8, 0, -1, 7, 4, 5, 5, -3, 6, 0, -3, 8, 2, 6, -4, -5, -10, -11, -1, -1, -4, -1, -6, -13, -14, 3, -6, -10, 6, 0, -7, -11, -1, 1, 1, 7, -1, 8, 8, 9, 15, 4, 2, 7, 13, -4, 8, -1, -1, 6, 2, -4, 0, 1, 3, -6, -4, -14, -12, -1, -6, -16, -8, -1, 3, -14, -9, 9, -4, 3, 0, -3, -2, 2, -2, 8, 8, -2, 1, 6, 6, 7, 6, -3, 8, 9, 4, -5, 4, 0, 1, 6, 4, 2, 3, 5, 3, -7, -6, -4, -7, -6, -1, -9, -4, -6, -3, 3, -3, 2, 5, -6, 4, -8, -6, 0, 5, -4, -3, -6, 0, 8, 7, 10, 5, 4, 10, 3, 1, 13, 0, 7, -2, 11, 2, -1, 2, 7, 3, 10, 4, -3, -5, -5, -12, -5]
8091epJ3j0mQnNJ4JqPqpJ4j5J4mQolKJkjklpRJ0j3MpJ6j8NJ2j0MkmQj3NjqMoK
8139a3LOlJ6moNKjNjLmnL%LMjj4%Qj3PMlMloJ2mjnqLQLpJJNj0jmPKNjqQMo
$$ y = [-5, -12, 1, -9, -13, -5, -10, -5, 9, 10, 2, 9, 1, -6, 8, -7, 7, 3, 11, 5, 2, 4, 5, 3, 2, 0, -3, -10, -1, 9, -4, 0, -7, 9, -9, -4, 8, -2, 2, 0, -4, 4, -9, -4, -5, -13, -9, -15, -13, -10, -4, -7, 9, 5, -1, 4, 6, 5, 10, 9, 12, 8, 3, 6, 6, 9, 13, 12, -2, -2, 6, -7, 0, 4, 1, 5, 2, -4, 8, 4, 3, -2, -10, -7, 1, 4, -3, -2, -1, 4, -6, -7, -11, -4, -2, 3, 2, -6, 2, 6, 0]
8191@
$$ Imaginary data points
##PAGE= N=2
##DATA TABLE= (X++(I..I)), XYDATA
0@%%%%%%%%%%%%%%%%%%%%%%%%%%%%%%%%MqRj3J6j6J6j6J9k3K4k8L3l7M0m0M8n6
50b8N8o6P3p7Q6r4J00j10J19j28J38j45J49j47J33q7l4L58j466R985M4083q1427
72b8527n105Q7045n8612l9797Q0836j8942o1726N9530J3494o0823K8805L3247
84B9425m5326K422L4439k1590j3235K1512j108j2175J105Q435K495j4940J838
97f703K2891j8435j7063L6953o378l9532L7496J6453n5037K3088M2193n7213k033
110b3320O2028m4053l1247O8900j8448n5784N9128J2640o7157L5186L9233o1147
122b4041N612N2510m1162j9029M9644j6404l1488L4801L616l0484J5991J3426
134A2992j9738R60J2196n419n372K643N844j735j0049Q815R609j9428J763K3229
$$ y = [0, 0, 0, 0, 0, 0, 0, 0, 0, 0, 0, 0, 0, 0, 0, 0, 0, 0, 0, 0, 0, 0, 0, 0, 0, 0, 0, 0, 0, 0, 0, 0, 0, 4, -4, 5, -8, 8, -8, 8, -8, 11, -12, 12, -16, 17, -20, 20, -20, 28, -28, 30, -36, 37, -40, 46, -48, 52, -58, 61, -67, 71, -74, 75, -72, 61, -26, -60, 298, -1168, 8817, 52900, -28527, -33632, 53413, -5199, -44996, 35840, 16898, -44828, 14702, 28196, -32627, -3822, 29425, -15901, -13479, 20960, -630, -13865, 7647, 6539, -5636, -4531, 3904, 6399, -8541, -6703, 16188, -2247, -19310, 17643, 11265, -28267, 9229, 25682, -29355, -6267, 35926, -21287, -23320, 38708, -5345, -36592, 32308, 13860, -41924, 17204, 29844, -37313, -2127, 37106, -24041, -18429, 34081, -7081, -26110, 23534, 7130, -24358, 10443, 14059, -16425, -434, 12992, -6746, -5786, 6410, 991, -4381, -1738, 4106, 2371, -7678, 1137, 10746, -8682, -6919, 16310]
148A6310k0137j2559L2712j0717k8396L3253N868l9685K3765K3991m2256O755
160a1096L7969l4850j2716M3564j9221k8843L9064j38l6847K6044J6285l4892
172a5677R217K5025k4852n357K4515j1384j3067J6924R2j2673O609N720o304j875
186c087M431K231n293k228Q900k433j0734J0748N431j7259O568J5195j8839k686
200i055K2928j4150j4043K5414m130k3554K1337Q342k7746J1606J9300k5098r23
213i772K5154j6550j2319K4189n039j9035J7299N638j9336P421J2147j3985j722
226e910J2810n824p074Q383J586p313J459N516l061m672M758L395p357jQ991n674
242A2o632J1266k18j2510R148P123j5142L125J3788j3231m963J7291p082j2487
$$ y = [16310, -3827, -16386, 16326, 5609, -22787, 10466, 16334, -23351, 414, 24405, -17851, -11096, 26873, -7977, -20693, 22871, 3650, -25193, 13871, 13733, -23114, 2930, 19215, -15677, -6460, 18565, -6287, -11644, 12871, 1487, -11580, 5344, 5436, -7237, -628, 5092, -1212, -3087, 1344, 3575, -1718, -3946, 4954, 2521, -8213, 2535, 7966, -9293, -2725, 12470, -6369, -9055, 13873, -277, -14320, 11094, 6964, -16590, 4747, 13089, -14657, -3051, 16249, -8849, -9772, 15382, -1168, -13487, 10702, 5663, -13372, 3927, 9565, -9771, -2350, 9797, -4188, -5910, 6900, 1076, -5998, 2385, 3971, -3342, -1883, 3633, 572, -4100, 658, 4053, -3304, -3305, 5686, 12, -6620, 4646, 4428, -8082, 1066, 8189, -6953, -3828, 9960, -3271, -8234, 9057, 1975, -10512]
256a0512J6061J394j6893J0313R424j6574K030J4385j1641n960J4779m058j0989
269h241J0786L324j1733M192P995q417k308Q677k715o323N638K942o648M82O312
284C963l526m585O149J541p506K715O445p060k548R201l335p673Q698K315j0656
299e862M835P839j0289j093J1218o525o971J1169n75j0682P675N431j0980J994
313b816R344p906l798R931k709p661P267K626q382K597O194o054k203O889j839
328A480n392M721K521n942P87N360l780l313N704J13n980L467M220o208n20O904
344D142l838m793P168L25p696M743M821q106M71P958n758m199Q587j500p544O411
360A192L152q327K326O480o422k089P385k667n241N716J413o113K316M304m558
$$ y = [-10512, 5549, 6943, -9950, 363, 9787, -6787, -4757, 9628, -2013, -7973, 6806, 2748, -8241, 2545, 5869, -5864, -1672, 6323, -2094, -4402, 4275, 1560, -4763, 875, 3817, -2831, -2349, 3963, 437, -4148, 2001, 3542, -3964, -1249, 5196, -1864, -4412, 4789, 1454, -6219, 2479, 4794, -5862, -1027, 6812, -3477, -4570, 6648, 123, -6848, 4321, 3746, -6936, 739, 6170, -4810, -2816, 6528, -1378, -5176, 4755, 2046, -5615, 1652, 4278, -4104, -1507, 4687, -1367, -3570, 3319, 1480, -3912, 809, 3330, -2612, -1825, 3535, -245, -3558, 2146, 2259, -3721, -254, 3966, -2242, -2762, 4142, 304, -4489, 2679, 3004, -4692, 51, 4872, -3234, -2763, 5195, -563, -4762, 3825, 2325, -5219, 1192, 4344, -3983, -1657, 4823, -1599, -3688, 3697, 1030, -4211, 1505, 2918, -3195, -879, 3425, -1133]
375a133j407M992j403l969L470K050m496L78M416k866k988M794K81n325L044L717
391C555n682k40O169l912l842O691n70o523N053L190p296J769O092n907k007P135
407C675k821m982O002Q13o153L204L667n180j52M719k616k693L753L95l515J331
423e53K598k417j488L136P3l484J786K905l814r03M888k235l926N192P02o103
439c643L561L977o544M90O436n066k956P223k141n647O075J268o764L481M005
454C755o012L55N239l829k146M696j156l217K838R26k641N85J622q80j020P62
470a23J157j259j160K476L0l283K374K330m606P49M769m477j931O408k774m804
486d124O548J04o919N029L321p577K273N858o543r26O974m188l559O480j372m923
$$ y = [-1133, -2540, 2452, 1049, -2920, 550, 2600, -1896, -1518, 2898, 32, -2956, 1838, 2119, -3206, -162, 3555, -2127, -2367, 3802, -110, -3952, 2739, 2169, -4354, 699, 3889, -3407, -1638, 4454, -1453, -3460, 3675, 854, -4128, 1874, 2687, -3466, -262, 3405, -1775, -1927, 2792, 176, -2517, 1236, 1631, -1884, -553, 2045, -372, -1860, 1276, 1349, -2135, -349, 2556, -1258, -2161, 2727, 492, -3434, 1758, 2460, -3643, -82, 3895, -2649, -2159, 4277, -789, -3745, 3478, 1337, -4310, 1765, 3033, -3731, -250, 3755, -2257, -1902, 3337, -492, -2638, 2058, 902, -2315, 523, 1449, -1192, -607, 1015, 135, -885, -123, 1034, -225, -1385, 1091, 1121, -2162, 212, 2542, -2064, -1315, 3454, -1023, -2954, 3454, 680, -4124, 2424, 2528, -4391, 638, 3959, -3618, -1345, 4513, -2030, -2956, 4018, -170, -3729, 2751, 1379, -3544]
502c544M744J006m819K544K238l548O91K158j901q2J058o87L65k83n61J709j073
519A5j640L153o69l492L818R82n325L232L366o332J356N761n998j389P367m264
535e9m267P645j524o443O410J471p298M077L852o703J431N101n122p45N086l176
551b64j956M168j564k185K951p39j620J989p51q34J789j432l92K419k222p97L652
568B212k478k145M853j742m017N345k4n800M764K318o876L090M679o879O27O440
584D367n656k018P103l500m183O484r89n301M943J053n211L078K175m335J562
599d28K404l260P43K029k442O24J526k193R67J268k524J335J598l268J338K558
615B275l974O35L920m145p83N182l484k664N884k021m489N707kn817M616K185
$$ y = [-3544, 1200, 2206, -2613, -69, 2169, -1379, -688, 1470, -431, -513, 545, -142, 223, -60, -621, 1088, 15, -1625, 1528, 859, -2633, 1185, 2167, -3158, 74, 3440, -2892, -1536, 4225, -1773, -3162, 4205, -59, -4326, 3319, 1795, -4648, 1762, 3233, -4065, 12, 3864, -2839, -1408, 3693, -1429, -2174, 2912, -264, -2220, 1948, 384, -1801, 1150, 411, -1209, 780, 29, -805, 984, -448, -840, 1579, -643, -1440, 2212, -266, -2411, 2442, 700, -3317, 2028, 2004, -3796, 968, 3286, -3590, -500, 4179, -2700, -2073, 4367, -1289, -3307, 3796, 296, -3887, 2597, 1608, -3693, 1250, 2303, -2908, 170, 2345, -1990, -428, 1976, -1284, -541, 1488, -954, -330, 1196, -997, -30, 1238, -1286, 49, 1647, -1621, -283, 2275, -1699, -1064, 2856, -1289, -2072, 3110, -374, -3038, 2846, 825, -3664, 2043, 2041, -3776, 840, 3025]
631C025o320K802M028n849O77N086m534j241N160k827k460M425j275k852L338
646A183k70k594K401M9k047J911j27j677J976m56j734K435n45k367K979p9l381
663b343L171J041m422K654K602n013J346M212m810n07N350l728k479N682j974
678G82m079N072O9m935L713J833m866J994K924m038M20L216k828n73K821j734
694b09q89K143j127o53J558j094k27J447j490%J858j979k69K655k165j129L515
711A945j780k419L988o93l736L731R37m669K704K670m828J049M013m075q30M584
727B591k630k403M253r20l240L232N57l246J883J430k595P27J535j658Q6J082
743F84r30J18M32p10O30O9j104J230K02j842J482R28k590J129K031k963J72L108
$$ y = [3025, -3295, -493, 3535, -2314, -1637, 3449, -1085, -2326, 2834, 7, -2453, 1972, 697, -2155, 1183, 913, -1681, 720, 769, -1278, 633, 506, -1171, 805, 349, -1385, 1050, 505, -1862, 1117, 1038, -2343, 828, 1869, -2553, 101, 2703, -2310, -964, 3248, -1562, -2069, 3281, -447, -2926, 2756, 782, -3297, 1775, 1844, -3091, 622, 2455, -2411, -417, 2507, -1531, -1111, 2105, -723, -1296, 1525, -209, -1098, 1045, -82, -735, 823, -271, -498, 949, -541, -541, 1317, -662, -931, 1724, -441, -1570, 1945, 165, -2254, 1734, 1041, -2695, 1036, 1973, -2696, 8, 2678, -2150, -1101, 2912, -1163, -1993, 2591, -39, -2442, 1811, 891, -2349, 883, 1440, -1806, 77, 1507, -1088, -361, 1174, -484, -398, 684, -246, -128, 304, -406, 224, 293, -811, 419, 621, -1221, 261, 1189, -1401, -272, 1759, -1204, -1032, 2076]
761B076k664j186L736j659k564L704k21l533K899J320l824J547K513l329Q2L028
777A925k277j110K821j024j743K099oj721J175N19j206M11M77n11J35mm2L96n91
796b77k3J026r42n54J724p69j430K073l4k309J855J096k867J049K214k770k06
813a144K979k016j519L121q21k467K568N12k789J501J519k434L56J933j625n56
829h82J740o96r44J151k4p77M51K28k92%k8K57l0n57N48L40j088M39R89j367r0
850f32J684j215r37K086n74j819K025L87k420J406J450k512L79K249k015p33K517
867A326j080j614K178k9k006J402Q33j835M97J223j229k19J113n02m96O01Rl08
885a36K0J24J79l23k15P13k34q00R82K47j369Q18R85j688K21J700j563o50K146
$$ y = [2076, -588, -1774, 1962, 303, -2261, 1443, 1222, -2311, 588, 1908, -1916, -369, 2144, -1185, -1103, 1925, -352, -1462, 1359, 335, -1408, 691, 685, -1036, 139, 658, -548, -137, 340, -171, -36, -40, -82, 314, -277, -300, 726, -216, -770, 954, 185, -1245, 828, 794, -1515, 340, 1436, -1431, -382, 1832, -938, -1144, 1835, -181, -1700, 1421, 600, -1867, 701, 1213, -1576, -75, 1444, -990, -634, 1299, -326, -882, 858, 162, -782, 369, 345, -432, 19, 247, -45, -45, -73, 184, 154, -403, 145, 485, -603, -164, 825, -542, -632, 1052, -163, -1100, 986, 412, -1407, 618, 1005, -1415, -9, 1441, -1071, -692, 1557, -458, -1191, 1326, 246, -1368, 810, 781, -1225, 177, 1010, -825, -328, 895, -334, -553, 560, 58, -438, 163, 172, -136, -116, 8, 187, -136, -351, 362, 128, -672, 310, 557, -812, 6, 991, -697, -476, 1224, -339, -989, 1157]
904A157r57j528K147l5k175J660R37k340P87J695k007j83K009j294r49J852m48
921C28j312J324K19j233O76N10q20J78M14l64N9L0o6K82l50j21P24n30n15J199
941F32m02j126J385J53j727J209R33k080O28J732j995k57K280j465j198K400o14
958D88j922K027L47k208J311J116k054M90J504j517j81J436r11n21J116m57n05
975d41P33k90k61N25m33j0O06p29K9R42r74k46J397r59p73J743o21j389J859k2
995F86j963J648P39k307J093J488k321L14K074j968n23K329j320j226K216n41
1011D18j659J796J34j755J248N71j561P39P59j262M40O97r74L35N88r18M17N20
1029E33j054N22O96j350M84J095j565J67J616j595l92K047j297j106K270p35j774
$$ y = [1157, 200, -1328, 819, 784, -1391, 269, 1206, -1134, -347, 1348, -659, -842, 1167, -127, -1076, 776, 328, -984, 340, 559, -674, 2, 512, -308, -130, 284, -80, -21, 9, -57, 225, -125, -246, 478, -52, -567, 632, 230, -896, 489, 642, -1085, 124, 1057, -1023, -395, 1337, -658, -915, 1365, -100, -1298, 1102, 488, -1434, 593, 940, -1268, 43, 1159, -895, -405, 1099, -418, -599, 837, -74, -595, 521, 64, -441, 292, 2, -259, 266, -167, -177, 429, -300, -271, 671, -303, -549, 848, -111, -884, 859, 238, -1151, 708, 686, -1277, 371, 1110, -1197, -104, 1384, -937, -623, 1451, -517, -1040, 1289, -31, -1257, 959, 418, -1241, 555, 689, -1066, 182, 753, -808, -69, 690, -572, -132, 565, -409, -74, 514, -404, 13, 533, -521, 1, 697, -653, -169, 926, -639, -472, 1144, -451, -843, 1204, -93, -1199, 1071, 336, -1438]
1046a438K190J5k237J792Q15k420J146J468k241L76J857j847k77J935j286p47
1062h99J770p75r45J488m00r74J221k24r16J092k16q90J102j99j007J233j01j282
1080i22J343J92j649J283O92k008R68J306k128M15J869j960l06K281j556j022
1096a202K379q93j630K190j75j986J734M85k034J171R38j846O59J121j539L16
1112c12J131j296J36J091j162N2J107j146qJ244j188j94J500j179n42J753r85
1129Bj016J934o02j538J926l8j973J670O22k196J196J202k174N72J684j943n6
1146g28J948j549o01J996j052j024J843n66j242J584j68j346J315J16j345J087
1162B68K89j315R53L90j330Q62N55j440P73Q00j577N87J139j655K47J532j594
$$ y = [-1438, 752, 767, -1470, 322, 1137, -1283, -137, 1331, -910, -534, 1323, -524, -801, 1134, -152, -899, 871, 96, -849, 639, 239, -735, 486, 262, -654, 438, 222, -668, 434, 235, -772, 461, 360, -922, 421, 613, -1036, 247, 939, -1069, -101, 1205, -923, -508, 1361, -599, -905, 1376, -180, -1202, 1177, 284, -1346, 844, 669, -1317, 417, 902, -1132, 39, 977, -869, -210, 911, -628, -312, 819, -477, -341, 750, -412, -360, 747, -399, -407, 837, -351, -545, 955, -224, -766, 987, 2, -1014, 920, 318, -1220, 706, 668, -1305, 365, 987, -1209, -13, 1189, -985, -413, 1271, -672, -728, 1220, -329, -930, 1066, 14, -1010, 833, 267, -975, 609, 441, -905, 410, 526, -819, 268, 557, -758, 195, 585, -745, 117, 672, -768, 5, 805, -772, -185, 954, -701, -454, 1078, -516]
1179e16k36J860j322p89K028q68j330J973k82j709J672L19j896J235Q15j845P34
1196a57J164j658K52J358j368j41J393j072l83J315q03n41J266o11o66J228m87
1213H9p75J223l30r60J237j34j167J202J38j378J092M72j553Q58Q75j639M95J267
1231A012j573J9J549j319m61J691r40q86J639m63j210J450k9j348J126L43j338
1248g38P80O15j243M83P46j077K51P88r29Q8Q11q44j6Q63q13j34R43p55l06J094
1268F07o77n34J202m98q29J231j95j112J147J61j311R34N59j381O08Q76j315K22
1286c05J129j129j72J228q49m95J216n46p11J090k21q46Q92M3q69P06J86q24N10
1305C3L09p62M13L39p06L52M01p28L01M93p84K08O75q62M3Q85q13k46J073o56
$$ y = [-516, -752, 1108, -214, -1003, 1025, 157, -1173, 800, 518, -1191, 481, 800, -1096, 139, 954, -891, -157, 1007, -651, -399, 959, -409, -550, 843, -229, -612, 703, -100, -641, 625, 14, -652, 576, 89, -686, 537, 207, -753, 484, 350, -817, 385, 523, -855, 237, 709, -844, 14, 889, -750, -255, 1012, -561, -542, 1007, -312, -773, 918, -22, -908, 731, 268, -942, 508, 479, -869, 257, 600, -738, 42, 657, -586, -103, 643, -434, -183, 605, -324, -236, 575, -269, -285, 578, -235, -369, 574, -181, -487, 607, -70, -604, 598, 100, -729, 502, 307, -805, 342, 503, -808, 126, 685, -696, -88, 788, -527, -305, 824, -305, -477, 751, -98, -593, 623, 77, -634, 456, 235, -611, 281, 324, -545, 161, 347, -477, 33, 342, -420, -7, 332, -374, -22, 379, -349, -48, 445, -339, -131, 544, -318, -275, 610, -203, -449, 624, -32]
1325c2n60J145l60q68J062nj075Q57L65j151N64O55j057K40Q10q66o0Q61o35k77
1345c87Q11m33l80P10k57m14O06j61m14N65j17m49N43o4n20N46K0o14N44J42p06
1366d29M97L24q11L51N64q69J49P74p97j36R35o27m40R83l37o88Q99k2q48P04
1386A76K43q77M57M43p94K20N36o32K5N54m96m9M84l91r2M51l64r0M72l73j36
1407b33N46l62k53O48k89m26P13j77o00O93L3p76O02L01q71M11N52q61J61P37
1427E49p56j33Q32n56l72Q08l18n27P34r0o11O03R3o08M33K02n89L15K76n48K50
1448a3K73m88K05L07m97J63L85n28R2M64n59j4O07n64j75P56m56m06Q41k83o16
1469e06P97k1p87O35K67q77M37N02q11J98O34o76m5O95n25k08O59l60l12N77k44
$$ y = [-32, -592, 553, 193, -675, 387, 382, -693, 164, 529, -622, -58, 597, -460, -220, 590, -276, -336, 525, -110, -387, 424, -9, -389, 321, 64, -350, 256, 95, -319, 246, 129, -320, 223, 159, -361, 185, 205, -409, 135, 277, -429, 68, 392, -419, -68, 496, -373, -224, 550, -247, -383, 552, -75, -515, 468, 131, -557, 342, 320, -528, 176, 419, -458, -1, 442, -352, -132, 404, -228, -203, 351, -145, -194, 290, -101, -193, 258, -106, -196, 276, -97, -233, 313, -49, -302, 346, 57, -369, 344, 167, -433, 260, 293, -483, 119, 420, -451, -40, 512, -349, -188, 549, -207, -340, 492, -64, -436, 372, 54, -473, 261, 171, -440, 163, 256, -352, 81, 283, -306, 9, 285, -263, -13, 260, -228, -23, 284, -213, -50, 335, -193, -101, 363, -196, -210, 397, -167, -342, 414, -42, -448, 393, 110, -506, 291, 270, -517, 118, 385, -492, -55, 447, -364, -166, 468, -208, -253, 442, -83, -291, 368, 8, -304, 273, 29]
1490B9l44N38j52l84N21q9m29N12m0m96M77O8n81M40K03o46L72L65o99K69N26
1511D60p20R8O42o68j18P71n56l08Q10l74n00Q02j62o54P12M9p41N44K56p58L80
1532c5M00o97K10N01o08O5N16n05j9N27m68j05N50m24j78O00l62k89O73k91m32
1553c71O93j69n87O83mp29O07K05q14M85M39q37K84O17p99O1P48p02j46Q02n45
1574g9l36Q30l68m91P95j77o08P16ro83N76J43p11M72K56o95L61L54o85K77M37
1595C75o57J45N51o57K5O56o46j17P81n45l22Q57l90n39Q93k11p26Q25L1q69O79
1616A39K96r43M78N30r03K46O83p98K3P53o45j82P59n04l09P53l73l99P26k47
1636H3m92P11j29o00O85ro88O09J38p60N30L14q16L98N00q37K20O55p96J2P96
$$ y = [29, -315, 223, 71, -313, 208, 119, -310, 202, 162, -334, 143, 211, -370, 70, 273, -373, -1, 364, -335, -66, 460, -260, -162, 480, -188, -306, 465, -91, -399, 411, 37, -463, 339, 177, -477, 235, 284, -457, 87, 343, -415, -35, 365, -332, -122, 379, -229, -164, 352, -153, -172, 355, -113, -218, 332, -92, -270, 330, -32, -321, 352, 61, -371, 322, 153, -434, 249, 245, -484, 123, 328, -486, -1, 438, -399, -115, 502, -297, -236, 512, -190, -336, 466, -79, -415, 415, 47, -444, 351, 174, -434, 282, 273, -410, 166, 309, -402, 70, 326, -369, -8, 346, -339, -62, 375, -282, -137, 414, -243, -218, 438, -208, -325, 456, -89, -411, 446, 56, -483, 410, 199, -527, 298, 329, -540, 139, 435, -508, -30, 500, -403, -157, 526, -272, -249, 504, -141, -323, 436, -68, -377, 376, 3, -396, 330, 83, -409, 302, 173, -427, 258, 249, -439, 170, 308, -452, 78, 392, -424, -26, 474, -363, -143, 512, -284, -272, 524]
1657E24o98k22Q83n45m30R23l35o20Q59q6p74P48J33q40N50L56q35L61M82p47
1677c13J80N78o67M4O07n87p5O23n19j83O90m58k87P28l58m19P71k34n80P41n5
1698B27p16O74J48q21N46L65q48L66N57q16J53O78p14p5P61n90k68P87m01m26
1718d13P42k21n30O81o7o06N91O9o40M74J99o50L85L17o73K94M08o37J61N18o30
1739b28M0N99n71r8O59m85k49P14l62m10P32k18n57P07m5o77O07J62p39M44L62
1760C87p56K74N14o98R9N93n84o3O19m66j99O05l24l20N91k12l86N74j25m54N28
1781A97k8n19M86R6n87M23J99o07L11L67o24J81M71n81L2N63n18j02O14m24k62
1802c12O60l09l90O43j61n00N78J6n94M81J64o16L38L07n80J96L92n24P7M29m46
$$ y = [524, -174, -396, 487, -58, -488, 435, 100, -520, 339, 253, -521, 227, 360, -480, 70, 426, -409, -48, 434, -313, -133, 445, -222, -178, 429, -158, -233, 390, -129, -312, 378, -80, -367, 361, 3, -416, 355, 121, -459, 282, 227, -489, 185, 333, -488, 58, 423, -425, -59, 498, -318, -165, 513, -201, -276, 485, -105, -373, 414, 13, -413, 329, 108, -422, 259, 192, -414, 177, 246, -394, 80, 279, -371, 14, 331, -342, -48, 360, -277, -116, 402, -228, -188, 411, -160, -258, 401, -84, -333, 381, 19, -391, 341, 123, -434, 273, 228, -449, 158, 320, -419, 25, 387, -369, -95, 419, -279, -180, 413, -171, -234, 385, -81, -280, 325, 1, -319, 272, 60, -326, 248, 123, -331, 197, 169, -350, 136, 232, -355, 68, 267, -340, -29, 338, -286, -105, 366, -215, -183, 380, -138, -240, 374, -50, -312, 348, 39, -351, 292, 131, -369, 209, 225, -369, 112, 276, -340, -2, 305, -275, -79, 313, -211, -134, 295, -151]
1823a51k2M58l79j17M80l09k03M96k48k67M99j64l70N04n7m67M68Q1n50L86K13
1844B81n61K57L40n53J32M25m99mN03m23j52N42l16k50N16k02l37M76o7m06M31
1865A33L9m36L41J32m49K65K27m74J94K87m44J16L47m12pM03l51r2M28k82j87
1886b22M42k06k75M59j25l57M41j2m25L85R9m75L04K14m83J91L32m60M8M13m02
1907a14o5M34k95j75M22j86k48L95j08k89L70n3l12L18L0l41K76J02l70K33J74
1928A98l82J67K34l63P5L14l50j4L54k93r8L71k39j62L87j62k63L87p4l37L59
1949A09L2l98L04J44m14J94K44l86Q8L21l49j6L46k59j10L34j74j60L03j20j77
1970a44K68o5k09K53l1k34K52j0k63K43M8l01K22J22l34J54K11l48R4K75l20p
$$ y = [-151, -173, 285, -94, -211, 269, -40, -243, 253, 5, -262, 237, 73, -297, 207, 150, -317, 151, 232, -318, 68, 281, -280, -23, 317, -236, -104, 321, -178, -182, 321, -102, -254, 288, -28, -278, 238, 36, -301, 175, 108, -298, 133, 172, -264, 77, 209, -240, 25, 252, -222, -28, 259, -185, -69, 278, -134, -141, 262, -89, -181, 247, -35, -222, 220, 14, -261, 198, 73, -284, 157, 145, -280, 105, 204, -271, 33, 247, -236, -45, 287, -173, -125, 288, -114, -179, 255, -40, -215, 207, 21, -227, 168, 60, -229, 141, 88, -224, 94, 124, -217, 59, 161, -209, 24, 198, -184, -17, 217, -146, -71, 243, -107, -121, 233, -60, -158, 213, -26, -188, 199, 37, -226, 161, 87, -250, 109, 141, -257, 47, 191, -223, -29, 215, -171, -83, 238, -111, -127, 219, -40, -150, 184, 10, -150, 153, 33, -144, 124, 59, -150, 103, 72, -162, 90, 80, -183, 60, 108, -193, 29, 151, -183, -29, 182, -166, -72, 203, -117, -124]
1992a24L48k95r2L69k02k01L55q8k73L18ml00K61O5l07J95J40l10J24J87k87N6
2014f5K25k54OK38k16l6K50j84q1K66j73j11K68j34j54K82q9k06K83k2k79K77
2036I1M8l35K37J39l77J73K32l64O1L12l22l9L43k38j33L40j48k04L09p3k18K58
2058I2nk39K19L5k49J79Q3k50J58J10k69J31J54k73P7K12k82K8K79k69o0L14k09
2081c4j36L48j63k13L43q6k67L26ll20K74J07l63K06J84l60J23K46l39L1K91k73
2103g8m6L07k11j09K98j65j40K66j09j79K65n2k34K67qk48K41N1k79K18R4l24
2125a75J78J83l38R5K69l27J5L15k83o7L42k06j71L34j25k52L27l0k86K81L5l11
2147a97K39Q7l06J78J37k85J12J94k90O3K42k80J8K69k39o2K96j86j31L07j62
$$ y = [-124, 224, -71, -163, 206, 4, -197, 158, 70, -203, 115, 111, -189, 72, 137, -170, 25, 165, -145, -21, 166, -121, -65, 160, -94, -88, 150, -66, -102, 148, -36, -117, 149, -24, -135, 133, -1, -155, 127, 38, -168, 115, 93, -186, 91, 139, -196, 41, 180, -197, -24, 208, -156, -95, 217, -105, -144, 199, -39, -172, 168, 20, -184, 125, 52, -166, 92, 87, -152, 67, 102, -147, 32, 115, -135, 23, 133, -136, -5, 149, -124, -47, 165, -117, -89, 190, -79, -139, 175, -34, -170, 178, 15, -198, 145, 59, -208, 118, 115, -205, 69, 176, -187, 19, 203, -157, -34, 212, -127, -96, 195, -78, -124, 183, -28, -137, 161, -4, -144, 122, 13, -166, 99, 47, -187, 80, 72, -176, 65, 116, -163, 55, 149, -175, 3, 186, -152, -57, 212, -115, -100, 215, -68, -135, 207, 1, -170, 164, 39, -213, 114, 84, -202, 79, 114, -197, 42, 129, -177, 1, 138, -147, -35, 159, -131, -68, 174, -106, -88, 181, -58, -120, 176, -10, -141, 166, 4]
2168Dj66K90j00k14K93l5k51K53K8k90K30J05l24J66J93l39R8K54l16ML02k48
2190f3q6L32j92j51L17j27k03K97p1k26K52mk44K38L1k80K27Q8l02J68J48k96
2212a47J09K04k90M5K56k73pK91k41p0L10j99j47L21j21k22L07m6k70K79K5k97
2234a83K31J05l25J75J64l15J00K20k94K4K67k62l0K78k01q6K96j69j33K90j15
2255C7j91K77o3k28K68nk59K35N3k90K06J28l31J54J89l34R5K56l19QL00k52q4
2278a50L25j87j60L20j13k07K73l2k41K54J3k61K26O0k72J72J21k85J38J66k95
2299a35Q8K13k64lK77k34o5L04k07j18L03j47j80K92p7k16K64j8k58K47N0k78
2321a62K02J16l19J37K04l10P5K34k71qK64k26p4K79j61j19K59j00j72K57p7j85
$$ y = [4, -162, 128, 28, -186, 107, 72, -179, 74, 102, -188, 42, 147, -177, -11, 182, -157, -59, 195, -121, -117, 185, -63, -149, 183, -9, -160, 157, 30, -173, 124, 53, -173, 79, 75, -169, 69, 100, -180, 47, 135, -167, 1, 149, -147, -38, 166, -124, -79, 177, -96, -103, 188, -53, -123, 187, -12, -159, 162, 41, -181, 126, 80, -190, 89, 114, -183, 48, 153, -172, 3, 167, -148, -48, 172, -122, -98, 169, -93, -123, 155, -46, -132, 164, -5, -138, 152, 37, -154, 123, 60, -168, 100, 95, -164, 71, 124, -166, 40, 168, -163, -9, 180, -154, -59, 197, -122, -114, 186, -66, -150, 175, -12, -172, 148, 35, -172, 101, 69, -172, 82, 95, -166, 60, 120, -152, 20, 141, -144, -6, 160, -135, -47, 166, -98, -101, 176, -58, -123, 181, -26, -144, 159, 12, -168, 124, 47, -169, 95, 77, -181, 66, 116, -162, 40, 156, -163, -26, 178, -132, -57, 177, -94, -102, 162, -64, -138, 141, -20, -139, 120, 20, -152, 105, 28, -157]
2343a57K47j8k34K29N2k72J76J20k73J26J68k60N3K13k61QK48k14q0K75j50j39
2365a43K72j03j80K55n1k19K32J1k32J85O6k37J49J22k36Q5J67k41M9J95k10j3
2387g7K18j98m5K45j52j07K50j05j67K32l9j98J98K5k19J63O9k15J21J03k21Q9
2409c0J53k18M2J93j96l5K21j67p3K28j17j15K24o7j64K01j0j83J67L0j88J18
2431A4P8k01J09J02k02Q1J37k00L7J82k12lK11j57q1K17j04j26K18n1j50J57m
2454E2j57J40K1j57J14N8j62Q9R3j81P2J17j76L5J46j57j6J74j35n2J90j19q2
2477i3J82n7j43J88k6j49J57J1j78J50N5k02J18Q3j94Q3J30j89J4J81j61m2J72
2500I0j21n8J73r4q2J59m1j27J71k5j46J56Jj46J24L9j55J01P7j85Q8J15j81L9
$$ y = [-157, 90, 72, -162, 67, 119, -153, 23, 143, -130, -4, 164, -96, -43, 170, -91, -83, 165, -49, -129, 146, -4, -143, 129, 26, -154, 101, 50, -169, 63, 74, -158, 27, 93, -144, 5, 127, -109, -24, 143, -98, -49, 146, -64, -77, 141, -57, -102, 143, -9, -116, 134, 29, -138, 94, 55, -143, 55, 80, -139, 24, 93, -122, -1, 102, -119, -30, 123, -95, -53, 140, -56, -91, 130, -37, -110, 118, 1, -114, 110, 43, -121, 80, 70, -113, 54, 84, -104, 14, 92, -109, 0, 102, -100, -19, 118, -82, -45, 137, -75, -78, 133, -24, -105, 112, 8, -118, 100, 49, -101, 56, 52, -105, 35, 56, -101, 13, 71, -91, -2, 91, -90, -18, 99, -77, -42, 104, -53, -69, 105, -30, -82, 108, -11, -93, 89, 32, -111, 77, 51, -98, 59, 70, -108, 42, 97, -105, 13, 96, -98, -15, 115, -74, -60, 121, -40, -82, 90, -31, -89, 84, -10, -92, 67, 26, -101, 70, 45, -101, 55, 56, -90, 34, 73, -82, 19, 96, -89, -1, 114, -67, -28]
2524b8J56j90QJ69j45n0J88j39q2J98o4j48J95j6j85J79K1j82J30Q8j97Q6J11
2547A03j76M7J25j56J5J37j31pJ45j33m6J85j07j06K02p4j25J93n6j46J63Nj61
2570a04J30O0j93J13R2j96P9J24j82K5J62j68j5J81j44m9J99j17j12J97m3j57
2592a18J74Pj73J43L4j60J04O3j59Q0Q7j55N7J18j63K9J42j55j1J60j27n9J86
2615A04j01r4J77o0j31J80m3j37J58Qj75J46M8j87J11P3j77P7J19j80M2J52j69
2638e9%J67j32n4J87j11q4J72m9j22J61k9j35J42Nj42J21L4j59R7O1j55Q2Q8j65
2663g9N5J18j56K1J35j47j0J66j32n0J75j05r0J88p4j22J73j6j61J71J8j79J20
2686A9P2j79Q6R9j73M9J34j67J9J35j38j3J64j38m2J70r8q8J55m7j11J65k3j50
$$ y = [-28, 128, -62, -54, 115, -30, -80, 108, -31, -113, 85, 21, -127, 68, 52, -133, 46, 67, -115, 15, 103, -94, -8, 103, -73, -26, 99, -57, -42, 95, -36, -43, 102, -31, -77, 108, 1, -105, 97, 23, -102, 91, 35, -111, 52, 57, -104, 26, 86, -107, 6, 98, -98, -19, 105, -77, -52, 110, -58, -73, 108, -36, -85, 114, -3, -115, 82, 39, -118, 56, 63, -110, 33, 67, -93, 11, 74, -85, -5, 82, -73, -16, 102, -61, -32, 110, -45, -56, 104, -23, -82, 104, 3, -91, 86, 26, -105, 75, 32, -105, 53, 61, -114, 32, 80, -107, 4, 77, -100, -23, 96, -84, -42, 110, -59, -59, 108, -24, -78, 109, -2, -86, 86, 37, -85, 76, 47, -88, 54, 59, -83, 38, 72, -87, 10, 71, -84, -2, 86, -79, -24, 94, -62, -41, 94, -53, -63, 103, -29, -79, 96, -9, -99, 89, 15, -107, 66, 50, -111, 60, 78, -101, 19, 91, -88, -2, 97, -76, -27, 107, -60, -41, 94, -44, -57, 107, -31, -73, 97, -1, -89, 66, 19, -92, 73, 50, -100]
2710a00J49Nj39J25K5j62J12N9j59P2J07j80O2J29j70RJ67j52m3J88j14q7J80
2733H3n8j33J76j6j57J57J7j64J25M5j54Q1Q5j69P0J02j59L1J26j55QJ46j45k0
2757g8J78j29n8J71q3j06J74m0j34J56mj53J43M4j77J11P7j77P2J14j71L2J55
2780A17j59k0J63j28m5J72j07q1J70p6j08J64m0j32J48%j43J25L9j56J05O3j58
2803h7Q5R1j63O2J10j53QJ54j44l5J70j07p8J75p3j18J76m2j31J53Rj61J14N0
2827F5j55R2P2j55O8J11j63K8J37j37pJ37j20l8J48r8o6J47o6r1J38k8j09J33
2851D3Qj37J22K8j45J00N6j54O9R7j51M2J23j43j7J44j01n6J57q3q2J54o1r6J41
2876E8j9j21J31lj28R4M8j33O3P6j27K9R8j25K8J04j22J0J16j01l7J38q8n0J27
$$ y = [-100, 49, 54, -85, 40, 65, -97, 15, 74, -85, -13, 94, -86, -24, 105, -65, -56, 111, -41, -84, 104, -10, -97, 83, 25, -108, 68, 52, -105, 52, 69, -95, 30, 75, -79, 2, 87, -82, -12, 90, -69, -38, 88, -67, -59, 87, -58, -78, 100, -29, -87, 84, 1, -105, 69, 29, -105, 51, 47, -106, 37, 81, -96, 15, 92, -85, -13, 101, -70, -38, 117, -42, -62, 101, -27, -72, 100, -7, -88, 82, 6, -102, 62, 22, -110, 38, 38, -105, 20, 59, -97, 8, 71, -87, -2, 89, -74, -12, 98, -55, -47, 107, -37, -72, 98, -9, -87, 88, 15, -103, 73, 31, -100, 53, 62, -99, 15, 65, -90, 2, 74, -81, -13, 98, -65, -37, 100, -37, -44, 93, -27, -65, 83, -15, -81, 66, 0, -91, 47, 19, -90, 43, 51, -86, 36, 64, -81, 19, 75, -79, -10, 87, -64, -22, 101, -42, -59, 85, -16, -72, 85, 2, -80, 74, 13, -83, 58, 39, -82, 49, 46, -82, 12, 60, -73, -10, 66, -61, -32, 66, -59, -31, 73, -49, -39, 77, -24, -61, 77, -11, -61, 66]
2901F6n5q1J45l7j17J20K1j26Q9M4j41P5O6j35N0R0j18lJ11r4k2J15p8l6J13o4
2927bo3J28n6q3J23j2j07J05J9j16Q6L0j09O4O0j14L4P5j12K4R7j17J1J09r8k4
2953d8J22p7o1J24n1r3J31k1j19J13K5j22Q7M6j29O8P0j23L4Q3r9J8R8j06qJ08
2979G0r3k6J08n4o2J20m5q3J02pr4J06rr9Q5K9j09O8N8j24M6Q6j37L5J11j28l
3006d9J29j06l2J30p8p9J41l7j08J28j2j11J04K1j15R0L2j07N4P0j11L6R1j12
3030c1QQ7q4nR0p8k5R9o7m4J06n4p0J13k7r5J17oj17Q9N0j31P3O3j17L6Q7j10
3058d3rJ16p4n4J27p3m3J06n2n6J02k8p5R2lq9Q5Rq9N2M6j00M1O1j04L1P0q8K2
3087b0P5r7LQ2o9k1J10q0m0J07l4q6J20j4j05J07K2j17O6N3j11L0P7r3J5Q8r3
$$ y = [66, 11, -70, 75, 38, -79, 41, 62, -64, 25, 69, -72, 3, 69, -66, -16, 74, -44, -47, 64, -30, -52, 63, -15, -51, 62, -2, -65, 63, 7, -76, 47, 35, -72, 33, 52, -64, 22, 52, -57, 7, 67, -47, -13, 62, -50, -26, 71, -46, -35, 74, -24, -48, 74, -3, -64, 60, 9, -84, 47, 26, -93, 20, 45, -77, 10, 56, -73, -5, 65, -58, -24, 59, -40, -22, 76, -30, -38, 70, -23, -49, 59, 5, -57, 63, 18, -65, 37, 30, -64, 42, 33, -66, 19, 48, -61, 7, 65, -59, -13, 73, -64, -29, 82, -46, -49, 80, -26, -58, 72, -6, -85, 56, 19, -89, 39, 27, -84, 20, 41, -74, 16, 48, -59, -5, 65, -46, -10, 81, -31, -23, 64, -20, -25, 65, -13, -38, 61, -6, -50, 56, 2, -68, 45, 18, -77, 40, 34, -83, 6, 56, -75, -2, 61, -56, -20, 67, -43, -52, 64, -10, -64, 63, -10, -53, 53, 1, -55, 47, 19, -56, 36, 33, -56, 29, 38, -51, 1, 47, -53, -12, 49, -55, -24, 46, -42, -20, 55, -42, -39, 43, -26, -47, 63, -17, -57, 50, 16, -70, 50, 36, -69, 38, 60, -57, 9, 62, -49, -19, 58, -35, -20, 68, -25]
3114b5nQ6o7k2Q9n0l6Q1n2m0Q9l4n2P4j9o8P9pp1P3K3j06O7M1j02M0P7j19K9R5
3144F8j02kR2p3l8J14n2n0Q3k2p0Q1Kq0Q0K0r2N3L1p7L7M8q8L2N1q1K2O8p5j0
3174c0P5o7k0Q5o7k4Q1m5m6Q9k4p3R8pr3R2K3j08P0N3j14M3O5q2QP4p0j3Q4o2
3204ek8Q3n2l0P0l9l2O6k9n7Q8k5o5Q2jp9N3K7p3M2N2q4K1N5o9jQ0p9jR4p5l1
3236d2R8n0n5J02l3p6R1Mq3N3M6r8M2O2j02L4N3p0PN6o8J4M9o0lN7l5k6P6n1l0
3267c8P3l4n5Q3lp6P1J9r3P4J5q0L7N0r0K7P8r4J1P9n9k8R2o1l2Q2k9p1P7%o8
3298d3N2Qn7M5J7n8L7K1o6M3K8n9K6M3p1%O4n2qP2o2rP6n1l2P8k9n9Q3j7o9P3
3330B4Qr2P3L6q2K8N6q3J7N9o4j1O9n4k4Q2m3l7N8j4m8O4k4m2O4mn1N5oo0O9N
$$ y = [-25, -30, 56, -11, -33, 56, 6, -30, 51, -1, -41, 48, 14, -38, 36, 17, -51, 28, 21, -50, 23, 46, -60, 7, 48, -54, -14, 63, -56, -27, 68, -34, -36, 56, -17, -55, 59, 7, -43, 40, 18, -52, 29, 31, -49, 31, 51, -41, 12, 43, -34, 3, 51, -37, -5, 46, -35, -13, 55, -20, -30, 45, -22, -42, 43, -24, -48, 33, -12, -58, 31, 7, -66, 32, 25, -68, 24, 47, -61, 9, 62, -52, -9, 56, -26, -18, 56, -14, -27, 57, -5, -33, 50, -2, -32, 38, -1, -33, 33, 4, -53, 35, 10, -55, 27, 26, -53, 0, 27, -46, -4, 48, -36, -15, 40, -29, -30, 50, -29, -30, 64, -11, -42, 56, 6, -49, 53, 20, -56, 35, 39, -44, 9, 55, -43, -1, 61, -41, -7, 46, -24, -17, 39, -29, -15, 34, -26, -29, 28, -7, -33, 43, -8, -38, 35, 1, -54, 29, 26, -50, 21, 40, -53, 21, 36, -44, -7, 43, -47, -20, 58, -36, -25, 54, -5, -33, 59, -2, -34, 48, 19, -52, 25, 25, -43, 9, 17, -40, 5, 22, -36, 1, 22, -44, -1, 27, -32, -6, 37, -34, -34, 30, -22, -30, 42, -20, -29, 47, -4, -36, 42, 13, -46, 37, 20, -49, 24, 32, -60, 13, 49, -33, -5, 51, -32, -15, 44, -20, -31, 38, -16, -40, 42, -1, -38, 20, 6, -42, 22, -2, -44, 20, 16, -35, 20, 14, -46, 23, 28]
3362B8o7N3K6p0K0N1p8M1L8o2JO5o0j7P6l7n1P5k2n1P1j0n6N0K4q0M9L7p5K1N1
3393D1p1K0M9o5J1L6l7mM4m1qN2l6j7O2m4k7P3k2m3O3j6n2M8K5o8L4L9q7M6M5
3424E0q1RO7o4lN8l9l9P4k4n1P7j7n8M8On0N4Kn7N1K2o7L9K4o4L7L2n6J7M7n6
3456a2NM9m8j3P2o2j8P5m1n1P6j7n7O7op0O1K1p9N1L3q1L1N3p0J5N6n1j4N7k4
3487Hl7O8m4l1P1k4l7N1j0m5M5Qn5N2Kl7K7J7n2K5L1n4QM7n0ON3n4j5N8l0l4O3
3520C1j7n7O3Lo5N2J8p1M0M1p0K0N3p2J9M4n5QN3l8k3N4k6k3M8k7l1M7ok7L1l
3552A4l8M2lm2M0Rn4L7K6o4K9L4n4JN1m7lN4l8l1N9j2m0N7j0n3O1%m0L6Nn2K8
3585BL4n5K2L8n3NL8m3J0L0m6jM2k2j5K6k2j1M4j7k9M2ql8L5J3n7M6J6o0L7L1
$$ y = [28, -39, 14, 40, -30, -10, 41, -37, 4, 42, -20, -19, 46, -14, -31, 45, 8, -43, 32, 10, -41, 30, 20, -36, 14, 38, -42, 7, 44, -31, -10, 41, -30, -10, 39, -26, -15, 21, -16, -20, 24, -17, -25, 27, -9, -26, 36, -8, -35, 38, 16, -27, 36, 20, -32, 16, 41, -27, 7, 46, -41, 5, 50, -31, -22, 45, -19, -22, 36, -3, -42, 32, 8, -43, 34, 17, -41, 7, 13, -37, 17, 19, -38, 13, 35, -32, 7, 31, -33, 4, 36, -20, -3, 44, -12, -7, 42, -6, -19, 53, -9, -27, 48, 7, -44, 32, 15, -42, 25, 19, -51, 10, 31, -48, 3, 36, -45, -14, 39, -31, -16, 40, -11, -25, 32, 8, -29, 39, -5, -36, 35, 11, -26, 25, 15, -30, 15, 23, -32, 20, 22, -15, 12, 29, -23, 2, 33, -21, -13, 34, -16, -10, 43, -11, -26, 32, 2, -32, 31, 14, -43, 20, 23, -42, 10, 28, -43, -3, 38, -32, -12, 41, -31, -12, 32, -23, -15, 38, 0, -23, 31, 5, -18, 30, 3, -28, 19, 13, -14, 17, 14, -24, 18, 15, -27, 13, 22, -32, 5, 31, -33, -4, 30, -24, -23, 28, -19, -22, 32, -6, -37, 22, 10, -30, 27, 17, -36, 25, 25, -15, 21, 26, -26, 2, 36, -19, 3, 41, -12, -7, 31, -12, -2, 28, -18, -19, 23, 1, -14, 12, -10, -21, 23, 6, -23, 19, 11, -27, 8, 21, -36, 10, 26, -34, 3, 34]
3617C4o7L0M7m8j1N4l9j8N0l0k8M9%m0L5Nm1M3j6m0M6Mm2K3J3l7K6Ql5K0K6m1
3649b0kN5m5mM3l8j1M4k1k7M5j2l1L7Lm0L8J0n0K4J9l5K2K7m1J0M2l6qL0l2rL2
3682A9j7j7L4j7k6M0j2l0L5j3k6L7j5l0M9jl2L6Om8J9M2n4QM4l9j8O4j9m3N5k4
3714Gk6M5ml6K8Nl3L2jm0M0%l3K4J7m6K5K3m8OL0k9jL7l8lM8k8j2L7j5k5M9k0
3748A5k9L5jm6L2K0m1K1L2n9QM4m4ML9l1j7M3j9k3L5j3k2M2j0m3M2pk3L4j2k8
3780b2K3Lk9L0J8m3J9L2m3J2L1l4qL4j1k6M3k1k3M1k2j4K9jl5K2J4l8K1Rl7RL4
3813A7l3PK1k0NK0l0lL4k6jK1k2kK8j8j6L9j4k5K3Nk7K1K0l9K4J5l4KM1l3JK6
3847B7k6pK5j7k1K9j1k9L7nk9K4Rk1J9Ml1K1J5l4K3Nk9K2J2k3mL7l7J7K3k7j4
$$ y = [34, -33, -3, 44, -4, -15, 39, 0, -18, 32, 2, -26, 23, 23, -17, 18, 23, -18, 25, 9, -31, 15, 19, -23, 0, 13, -24, 2, 10, -25, -5, 21, -20, -22, 33, -12, -16, 27, -11, -22, 22, 1, -26, 19, 7, -24, 13, 16, -24, 14, 24, -26, -2, 17, -18, 4, 31, -10, 0, 42, 6, -2, 28, -4, -13, 19, 2, -15, 19, 2, -24, 16, 4, -26, 9, -4, -30, 7, -8, -38, 11, 10, -22, 14, 20, -28, -9, 33, -21, -13, 31, -8, -26, 38, 19, -24, 31, 7, -19, 26, 22, -14, 14, 19, -14, 18, 17, -23, 17, 17, -16, 8, 25, -21, 4, 27, -21, -15, 15, -14, -15, 22, -16, -19, 29, 1, -11, 26, 11, -14, 35, 15, -14, 21, 20, -26, 6, 26, -15, 6, 38, -21, -13, 31, -13, -9, 30, -1, -18, 25, 6, -17, 18, 5, -17, 25, 15, -28, 14, 7, -16, 18, 6, -22, 1, 4, -25, 5, 23, -20, -1, 31, -12, 0, 31, -3, -11, 23, 12, -14, 29, 8, -15, 26, 4, -10, 19, 18, -17, 5, 19, -19, 2, 11, -26, -17, 17, -16, -9, 12, -8, -3, 17, -13, -16, 18, -8, -9, 12, -10, -12, 16, -2, -18, 21, 7, -18, 5, 10, -17, 4, 24, -15, 9, 24, -10, -8, 33, 0, 1, 27, 1, -6, 19, 2, -19, 10, -1, -30, 7, 2, -27, -3, 6, -15, 4, 8, -23, -2, 13, -21, 2, 7, -22, 0, 12, -11, -15, 22, -15, 2, 25, -2, -16]
3880a6M7m3oL8j9j9L0ll0L8Ml2K1lk2J7J4m2K2J4l5J3L0l1lL4k5pK8j2l0L9j1
3913@k2L3pkjOj8K1Ol4K0J2l0J6K1l0KK7k5kL8l0j3K9j5k9M3k2oJ6j1k0K5kj4
3948a8K1Nl7K7J3l2J2J8k9J1K4k2LK3k1pK9k0qK8j4k2L7j4k2L4lk1J7Nl3K2Kj6
3982hJ7Nk9OK9k0oK4j0k2M0k5j4J9Nk5L2rk4K9qoK4rk3J6Lj2ONj5QLj2J3J2k7
4019hJK2j7j1K1rj7J8mj2J5J2l7K3Qk9L1nj2QPj8%K4k2jK4j6jJ4k0j3L4j4qK1
4055Ioj7K5pj7K0J3l6K5Lk8J4J3k9J1K3l1QJ3k3J0J3j3KJ2j1oJ8pk4K8mj0J8Q
4090A7l2J4J5k2J0Kj3J1OqJRpj6K8j5pK0j2qJ6pk0J2Lk1J9Nj5J8jk4J7Pk4J7J6
4127A1j3jJ5j3lJ3nqK0jl0K4Ll4L3lqPlj5J0J1k9K0J3k3kJ0pjOqj2K9j3oL1k4
$$ y = [-16, 31, -12, -18, 20, 1, -18, 12, 9, -21, 17, 21, -11, 10, 7, -15, 2, 16, -26, -4, 10, -25, -12, 18, -13, -16, 18, -7, -14, 14, 2, -28, 11, 0, -22, 11, 4, 2, 1, 7, -11, 10, 16, -18, 2, 14, -16, 0, 21, -9, -7, 20, -5, -7, 31, 1, -12, 17, 2, -27, 16, -6, -12, 4, -7, -27, -2, -4, -18, 3, 8, -29, -2, 11, -21, -9, 9, -20, -9, 15, -7, -4, 19, -2, -9, 20, 0, -8, 20, 6, -16, 21, 7, -15, 19, 16, -5, 12, 17, -16, 6, 8, -8, 9, 14, -15, -9, 20, 0, -6, 18, 8, -14, 26, 1, -13, 6, 11, -14, 18, 9, -15, 14, 6, 0, 24, 15, -8, 8, 11, -1, 5, 10, -5, 3, 6, -6, 7, 19, -8, -7, 15, -2, -13, 8, -1, -18, 0, -4, -16, -1, 11, -26, -3, 5, -24, 7, 2, -10, -2, 5, -13, -13, 11, -11, -12, 12, -4, -5, 9, -11, -24, 10, -4, -12, 9, 3, -14, 11, 4, -13, 7, 20, -16, 9, 12, -16, -2, 11, -18, -7, 16, -15, -7, 6, -17, -7, 6, -7, -5, 7, -4, -10, 8, 1, -23, 5, 1, -9, 9, 17, -15, -1, 14, -8, 2, 4, -9, 2, 8, 0, 1, 10, 3, -13, 15, 0, -7, 13, 1, -7, 9, 2, -18, -6, -3, -24, -5, 0, -15, 3, 2, -22, -5, 2, -22, -5, 11, -2, -3, 12, -1, -4, 9, 4, -4, 16, 15, -15, 9, 12, -22, 11, 8, 0, 7, 4, -11, -1, 10, -19, 1, 14, -9, -11, -1, -8, -9, -3, -11, -23, 6, -7, -13, 18, -6]
4165fj4K9j1mJ2kk0J7jj0J5Qpj0J3j6J0RJpJ2k1pJ4j4%K0j9OOjj5J5Kj5J0mj2
4203a7RJ7j4KJ2k0JK5k1rK1rmJ3ooJ7oj8K4Lj4LLlOkk1J6J1j6nK0j1MOj6rJ8q
4243dpJ5j4oJ4%oOLj3K7rj8RJ2j9J4Rj7KJ3j2nQJjJ5j7nJ3j3oK1Jj5Qlj5J6Rj9
4284hQOk2J0J1k1J4Oj0NNpqJ4rNJ1j0KK0j6rJ8rqPNj7LJ3o%J7k5JJ6j5kK6k4P
4325DJ7k0mRmqRqpJ9rj0J1PnjOpmJ3k0J1J0j3QRj3NJ0j2j0J8qlMJj9K5lk4K1m
4367Aj0PLmKjj1J0%j1J2mkNJ1o%Kj0jJjjMNrJ3Lj4MPmLnpK0nk2J4jJmPj3%Llp
4415a8J9lmPOj7J4J5k4QJ5k3J2kj2MPlLKl%%%KJNrJ9j6j1J0%j0J3JmkLj8MJ2j
4458BrJ2j8POj1LNlOJrNJ0nlJ3kk5K2rrJ0Rj1KPj3MNrO%l%qMJ3olmLnpJ7jrJ7
$$ y = [-6, -20, 9, -2, -6, 6, 4, -16, 1, 0, -10, 5, 13, 6, -4, 9, -7, 3, 12, 13, 6, 18, -3, -10, 4, -10, -10, 10, -9, -3, 3, 2, -13, 2, 4, -11, -1, -5, -17, -8, 9, -5, -3, 9, -11, -10, 15, -6, -15, 6, -3, -7, 6, 0, -6, 11, 5, -13, 11, 14, 0, 3, 6, 3, 9, 7, -14, 2, 13, -3, -8, 12, 1, 5, 11, -5, -14, 4, -4, -11, 4, -10, -16, -2, -2, -8, -2, 1, -12, 15, 6, -12, -3, 9, -10, 4, 13, -4, -2, 11, -1, -6, 2, 3, 2, 17, 0, -5, 8, -5, -11, 10, 11, -4, 4, 1, -14, 2, 11, -8, 0, 6, -16, -6, 5, -16, -2, 4, -6, -1, 4, -3, -11, 3, -6, -1, 10, 0, 2, 22, 6, -3, 15, 6, -2, 5, 10, -7, -4, 9, 3, 3, 20, -5, -4, 12, -3, -5, 21, -3, 4, 21, 1, -3, 6, 2, -6, 3, -5, -12, 7, -2, -12, -1, 6, 1, 0, 6, -1, -5, 8, -12, -1, 9, -4, 4, 13, 0, 5, 15, 3, -7, 11, 3, 0, 4, 5, -14, 11, 8, -16, 5, 1, -9, -2, 1, -3, -1, -2, -13, -3, -3, -14, -2, -6, -8, -3, 8, 2, 2, 4, -6, -7, -6, -7, -8, -4, 1, -8, 5, 8, -6, -2, 5, 1, 4, -1, -8, 12, 7, -15, -1, -2, -1, -5, 2, -11, -11, -8, -11, -18, 1, -2, -6, 1, 7, -10, 4, 19, -5, 3, 18, -5, 7, 5, -7, -3, 4, 1, 4, 6, 3, 3, 3, 3, 5, 6, 11, 2, 21, 5, -6, 4, 4, -6, 7, 8, 4, 2, 5, -13, -9, 3, 2, -7, 5, -13, -6, 0, -11, -8, -3, -6, 0, 1, -8, -3, 7, 2, -1, 12, 10, -15, 7, -2, -11, -1, 8, -3, -1, 6, -7, -3, 2, -7, -1, -1, -4, -4, -12, -8, 5, -1, -4, -8, -5, -10, -17, 0, -1, -10, 7]
4506GJk0JJ0KRnj3J0Pj6J0Mj4OJ2j0ONj3JQopJ1kk0L2j1j5OJ2qJlMn%JmJ4j1p
4549a0J0Lk%mQjlpJ4pJRLqJ7lj9ROlrKnn%n%JJ2j1J3k4OJ2nkJ1j0%J9j0njMj4
4595a3J9pJKNj0nJ2moJ7j0LNoQj3J6mJ%kJlmNMj2mJ0j1NnLmJ1j6J3qJOMmmN%k
4642@J4oqOnLlJ1o%j2MmMnJ4knl%LljnKN%qQmkkJ3qRJkrQ%NpMqJJJ4nKlKnKpJ0
4697HnlKoJ%LNmj0RnPOkj1OjkMKqJ1ojoJ3llNrJ1lRj0Qj1J2j0Rj2O%nJ0j0Pp%
4746Ap%Qkj3RnPqRlkjlPMllNmoPjPNj4nJ0OoJ%Rj4J6j0kkjLPlpQmqmO%lqPMKr
4801a3RmJ1mqONNmJ0j2kRRk2J0Kj3NLPj4J3jkmkOKoqRnJ1k4J1rpJ6j1KJ2plQP
4847Cj4PJOpJmJ3%oJ1Mj2Pj6kJ7j4KJ0lmMj6QJ1ollMpPklPJkKj5J0%jPonNlkj
$$ y = [7, 8, -12, -11, -1, 1, 10, 5, -8, 2, 9, -7, 3, 7, -7, -1, 11, 1, 7, 12, -1, 0, 8, 2, -5, 6, 4, -16, 16, 5, -10, -4, 8, 0, 1, -2, 2, -3, -3, -2, -6, 8, -3, -10, 0, 3, 1, 1, -3, 5, 4, 1, -6, 8, 1, 2, 11, 14, 6, 23, 20, 1, 10, 16, 13, 4, 6, 1, -4, -4, -9, -9, -8, 4, -7, 6, -18, -12, 0, -5, -7, 4, -6, -6, 13, 3, -2, -3, 1, -13, 6, -1, 0, 2, 7, -3, -8, 4, 0, -6, 11, 1, 4, 9, 3, 11, -2, 14, 10, 11, 11, 9, 10, 7, 3, 8, 12, 0, -4, 6, -5, 0, -5, -2, -6, 5, -11, 2, -6, -5, 1, 5, 1, -3, 2, 2, 0, 14, 8, 0, 6, 1, 4, 1, 12, 6, 6, -6, -2, -6, -2, -7, 7, 5, 0, -3, -3, 0, -3, -4, -9, -7, -2, -2, -10, -2, -6, -8, -10, 3, -5, 4, 5, 3, -6, 2, 2, 7, 0, 4, -4, -3, -2, 12, 7, 9, 6, 8, 3, 5, -2, 8, 3, 0, 2, -4, -3, -3, 0, 5, 1, -9, 0, -5, 2, 8, 6, -5, 1, 0, -2, 2, 4, -4, 7, 1, 0, -6, 7, 4, 1, 6, -3, 8, 5, 14, 4, 12, 1, 13, 3, 12, 0, 6, 6, 1, 11, 1, 8, 1, 1, -6, -6, 2, 0, -13, -4, -9, -2, -10, -1, -4, -6, -7, -10, -3, 1, -2, -5, 0, -4, -10, -3, -4, 3, 8, -6, -11, -1, 5, -1, 0, 0, 9, -5, 11, 1, -1, -3, -4, -1, 6, 3, -4, 4, 0, -8, -12, -6, -6, -9, -17, -10, -6, -4, -13, -4, -8, 3, -1, -9, -3, 2, 7, 3, 13, 1, -1, 8, 17, -5, 5, 7, -6, -1, 2, 9, -5, 8, 7, 5, 1, -1, 5, 7, 1, -7, 2, -3, 8, -16, -5, -14, -21, -5, -16, -14, -2, -9, -12, -4, 3, -11, -4, -3, 3, -4, -3, -7, 6, 6, 0, 11, 15, 3, 10, -6, -8, 9, -5, -3, 7, 4, 0, 4, -12, -4, 7, 1, -2, -5, -1, -8, -1, -3, -6, 1, 2, 0, 2, -13, -3, -3, -4, 3, -3, -8, -3, -6, -8, -9]
4896inJ9j%mLOMrKJPlnlJ1mrkoRnLrQNpLLj2QMqj1J5q%J3qOkkMjLlLpJ1Oj9QP
4949A0mjlJ2j1k%J0kjnkoPjnmlJ0LqOQjpJ%lkRlKmOnOkmJkKlJPqmKJJ0lmPj1O
5003C%J4j2j1KnR%j3J3Lj3J2pRlnJ1pNj%J1j1J%kMOJmj2L%kJ1p%mPPj2jKpJ6j4
5050cPlq%kRlNkjpMmJ5mrjJ5qjJ3qMj2LJ1j0KKlQr%jk%moJ1KOOk2mJ2kPJj1kM
5101eJ1j3J1Lj5JPj0OJ4j9J6lj0J3Kj1kMJ1kqJ0j8RLpkM%MnKrkPjpkkJ1Lm%KJ
5147bj1J9j0m%Mj1J9%Oojj4J3NOqj1RKmjRr%%pJ3Mmj5PLKqNLq%PoMKqJ3j7OJ3
5195IRmKj2j2J0mJ3pLLnnLjlrNJO%NnrJ1pkNkljmJ2NnoKnJJ2jqNoJJ5Rk1jRlk
5247COnL%LnjkQj4mMNOqlrJ6opkNjKnJ0mR%j2PQj3PJ0jnjj0J4NNj4jJ4jjmqj3
$$ y = [-9, -14, 5, 4, 4, 0, 3, 9, 13, 4, 6, 7, 14, 11, 6, 3, 14, 10, 1, -1, -7, 2, -3, 0, -9, -1, 4, -3, 0, 3, -9, -1, 3, -5, -16, -1, -9, -9, 4, -4, 2, 0, -2, 2, 1, 4, 1, 4, -3, 8, 14, -5, 3, 10, 6, 5, 2, 14, 3, 1, 1, 11, 9, 8, 3, 1, -5, 2, 1, -4, -8, -11, -1, 2, -6, 0, 8, 7, 0, 1, 1, -2, -4, 5, 2, 4, 0, 6, 1, 7, 5, 1, 2, 0, 2, -1, 0, 7, -1, -5, -3, -2, 8, 5, 1, 8, -3, 3, 3, 17, 5, -6, -4, -9, 0, 0, -13, 0, 3, -10, 2, -5, 4, 1, -4, 7, 0, 5, 4, 4, 15, 4, 5, 5, 3, 7, 13, 14, 10, -2, 1, 1, -1, 10, 3, 3, -1, 6, 13, 1, 0, 2, -5, 11, -3, 4, 1, -7, -7, -9, 0, -3, 2, 0, -1, -8, -4, -8, 7, 3, -6, -7, 8, 0, -1, 12, 4, 8, -4, -1, 10, 0, 2, 4, 1, 9, 0, 0, -1, -3, -3, -7, -13, -2, 0, 6, 12, -10, -14, -2, -4, 3, 4, -7, -9, -5, 6, -7, 4, 7, -8, -7, 0, -10, -4, 10, -9, 7, 4, -6, 7, 9, -2, -4, 0, 11, 9, 1, 11, -7, 2, 5, -2, -4, 0, 0, 4, -1, 1, -8, -10, -3, -4, -11, -13, -15, -4, -1, -5, -5, -3, -2, -13, 6, -4, -8, -8, -4, -15, 4, 4, 10, 4, 3, -11, 2, 7, 13, 5, -6, 3, 5, 1, 0, 9, 0, 0, 0, -7, 6, 10, 6, -9, -2, 1, 3, -5, 0, 3, -5, -5, 2, -4, 0, 2, -6, 7, -10, -4, 9, 18, 14, 16, 4, -8, 2, -2, 11, 4, 7, 10, 5, 0, 3, 2, -1, -10, -5, -4, 2, 2, 7, 2, -7, 4, -3, -5, 0, -2, -5, -6, -10, 2, 7, 2, -4, -2, -7, -6, 6, 5, -3, 2, -4, -3, 12, 21, 0, -1, 8, 5, 3, 9, 4, 7, 7, 10, 5, 4, 2, 10, -4, -8, -4, 1, 7, -1, -4, -13, 3, -3, -10, -12, -7, -8, -6, -11, -1, -5, 4, 4, -8, -1, 7, -6, 1, 11, 10, 5, 4, -6, 8, 13, 18, 4, 3, 17, 16, 15, 11, 3, -10]
5297a0J3j%jj%kj1MRjmnPLK%nJ2pj8J6K0j6J1j7RlmJ0j3J3o%Rj6J0okkJ8j0pR
5341Gqj0PmmJ0ljjLmPloQoKlJ2mPjmlJ4lnkJ1Jj0NoJjqJ2LqPoKpPqJ5rlMJkj0
5393gJ4j1Pojj0ORrMQJ0j8P%KP%k2J6Rk1J0nMMnMorJ2mOj6J7j8J4JjqkQLjj1M
5439eQJ4j6j0Pk%RnMj0J8qRj6lJ5qJ1kKjMqNpJ0qj%j1Mj1RlPokJ2lkNj0kJ3j0
5485dkJ2mnP%j1KJ2j2NJ3pjKoOj%MLJ%mlOj0ooNJ5j6%J1j0njJ6rPqOoPMmOok%
5535AQkLlJKj1J6j0MNkLoNj5JOJ0j3J7nj0ojjJ2pJjJ3qMj1J0mmoJ0Rj3K0k1NK
5580HLKnJ0j5pJ4kj0RooJ5j9J0K1lrjqQqPOj6RoLnjlRj3jJ2Ojm%oJ0MmKrLKOj0
5629AJ1krKJ4j4nJ6o%jqj1K1qJ%jj4J3JJOplJJQnj1O%NjMj1KMJ5j3kORkj1J%N
$$ y = [-10, 3, 2, 2, 1, 0, 0, -2, -13, -9, 0, -1, -5, -10, -3, 0, 2, 2, -3, 9, 2, -16, 0, 20, 4, 15, -2, 7, 4, 0, 10, -3, 10, 4, 4, 13, -3, 7, 1, -1, -3, 15, 5, -2, 7, -1, -11, -4, -8, -12, -2, -5, -6, -7, -4, -8, -1, -4, -10, -2, -8, -6, -9, 3, -1, 6, 5, 1, -2, 12, 9, 4, 2, 13, 14, 4, 9, 3, 4, 3, -5, 7, 10, 2, 9, 3, 5, -2, 5, -3, 12, 3, 0, 4, 5, 3, -7, 7, -4, 3, -3, -4, -14, -8, 1, -8, -4, 4, 14, -4, 3, 3, 5, 12, 12, -10, 6, 15, -6, 4, -1, 3, 7, 2, 6, 0, -9, 3, -1, 5, -11, 6, -12, 2, 3, 2, -6, -8, 0, 3, 2, -9, -5, 3, 17, 1, -9, -2, -4, -4, 5, 0, 4, -6, 12, 4, 13, -3, -6, 9, 1, 12, 10, 12, 11, 15, 7, 12, 5, 15, 7, 6, 6, -5, -1, -12, -3, -6, 1, -5, -7, 5, 2, 0, 5, -5, -7, 6, -4, -6, 6, 2, -3, 4, 4, -7, -5, 7, -5, 0, 13, 6, 5, 7, 1, 7, 6, 6, 10, 13, 14, 14, 10, 7, 13, 3, -3, -9, -4, 11, -5, -5, 6, -4, -9, -10, 6, -3, 4, -4, 2, -4, 3, 7, 3, 9, 3, 1, 1, 9, 7, 10, 7, 8, 10, -1, 15, 5, 9, 14, 12, 15, 9, 14, -1, 0, 6, 16, 3, 20, 15, 5, -1, -2, -3, 9, 2, 3, 2, 15, 7, 11, 0, 10, 6, 2, -4, 6, 15, 2, 22, 1, 6, 8, 11, 13, 8, 18, 3, -4, 10, 8, -2, 7, 1, -5, 10, -9, 1, 22, 19, 10, 9, 1, 9, 1, 8, 14, -2, 7, 1, 4, -1, -2, -5, 4, -9, -10, 2, 8, 7, 3, 3, -3, 7, 11, 7, 9, 0, 3, 5, 11, 1, 12, 10, 1, 3, 17, 3, -2, 14, 8, 8, 7, -1, -12, 9, 1, 2, 2, 1, -13, 0, 1, 2, 8, 1, -2, -1, 0, 8, 3, -8, -2, -2, 3, 2, 6, -5, -3, 1, 16, 3, 1, 7, 16, 14, 3, 4, 4, 9]
5677IlkRlj0Pmj5J1Qj5J0qqJ5m%P%nonRRojKPjmMJqLLJjPj1JLKpjQ%ljqJ4j2K
5729@nqMLkkJ5j1QrJ3qJ1llnJ5pJnkOJ0kKJj0KllkJ5rqP%j0LPmj2J6oQOj4nJ4
5777Imj4J8j4lJ7JrNk%LjJJ0j1PqOqJRKj0J0j3MJ%pPnjJOlOj5RPj6J2Kqj6J4M
5824DnkPl%J0q%LLj1LMJMjKqjnQNqjMpJ1Ok2J1%j8J4Rkj1%jMLmj1J4rJ3ojmMK
5874@rJ2J0k2J2Pj4KNkJOmj6J9qJ2prJRokPj0J4j5KrJ3JlL%qOMj0J2mrJ2Qj0N
5919Fj4kJ0J2j0KOqm%KkJ2j1j0J9oQplNmMoOj3NoLkNkpPnMlJ2jlllMJ1mnMoPp
5969cKJmRj7J3kjMppJ0%kpJ6j0JNnOrjnOPqJ2%j5MkJK1j0opJ1RK%rj1J6j0MNJ
6017Hk0J0J6j8Q%j0MkoKONj2J5j5OPMj6J3nlQqOKLj8JMLlOrJ1jLP%k1J2KPmln
$$ y = [9, 6, 4, 13, 10, 0, 7, 3, -12, -1, 7, -8, 2, -6, -14, 1, -3, -3, 4, 4, -1, -7, -12, -3, 6, 0, -1, 1, 8, 7, 3, 7, 8, 0, 3, 6, 7, 6, 13, 2, 3, 6, 8, 1, 0, 8, 8, 5, 4, -4, 10, -2, 0, -5, -13, -9, -6, -8, -10, 5, -6, 2, -7, 6, -2, 9, 6, 3, -2, 13, 6, 7, 2, 0, 6, 16, 14, 16, 17, 7, 9, 6, 3, 1, 16, 7, -1, 6, 6, -4, -1, 6, 2, -10, 6, 0, 8, 14, 0, -5, 9, 5, -9, 9, -5, -8, 9, 10, 1, 6, 4, 4, 7, 6, 7, 17, 6, 13, 5, 11, 3, 4, 13, 15, 5, 15, 2, 6, 7, 7, 0, 7, 2, 1, 2, 8, 5, 11, -4, 5, 12, -4, 8, 10, 2, -14, 0, 4, -1, -3, 4, 1, 1, 11, 3, 3, 6, 9, -2, 1, 5, 6, 10, 9, 11, 3, 2, -3, 5, 10, 2, 1, 5, -2, 9, 15, -7, 4, 4, -14, 0, 9, 7, -4, -4, -5, -1, 2, -2, -13, 1, -8, 5, -1, -2, -6, -2, 0, -9, 3, 13, -9, 3, 10, -4, -2, 3, 1, 2, 8, 4, -12, 7, -1, 11, 4, -5, -4, 5, -1, -3, 4, -6, 8, -7, -5, -14, -1, 0, -3, 0, 0, -8, -2, 2, -8, 4, 0, -9, 3, 11, 1, 6, -8, -10, 0, 12, 2, 4, 10, 2, -2, -2, 0, -2, 10, -1, -11, 8, 2, 10, 3, 0, 5, 1, 5, -1, 5, -8, -3, -9, -6, -8, -3, -5, -12, -5, -10, -6, -9, 3, 2, -1, -4, -7, -3, 8, 4, -1, 3, -3, 4, -3, -1, 0, -4, 5, -12, 1, -1, -2, 2, -5, -12, -2, -2, -4, -11, 5, -5, -4, 1, -4, 2, -7, -8, -13, -7, 0, -8, 4, 4, -11, -7, -9, -8, 13, 3, -3, -10, 1, 10, 12, 12, 3, -8, 8, -2, 2, 7, 8, -12, -2, 14, -4, 4, 4, -6, -2, -4, -10, -8, -2, 3, -9, 6, -9, -3, 4, 8, -8, 5, 0, -3, 5, -3, 3, 5, 8, -10, -9, -5, -2, -5, 1, -8, 3, 2, 5, 12, 12, -9, 3, 5, 12, 8, 5, 0]
6064@nOnPj3J0ojj2J4KjoJ4ojjmlJ2MqNKk%pOqJ3j0ONkkjQJj2Oj4J2rOLJmJKj6
6114a3J1j3J5ooMj5L2j0j4J9%j1QLjkkOjPpnJ2j7J0J2j1qRKnljNkj3J0J0j1Qn
6156AklNMkrMolPpQj2PMMOj0QlL%jmJ3lmK%Nkoj1J2NroLMmJ1j7%QMrNoMJ0rj0
6208a1MJ1j3J0%jMkj0J1%j6J7NJlk%MQj9KJ2o%j3Oj4OMkJ0qPolJJ2j2QKKj1jR
6253CnlPkj0J7qKj1MKJ1pNmlNLRj4KQmLnLqnnK0rjrM%JLlmPMj8J9JmJJ2pj1No
6304eJ1MnllRoJ1j1lLj2J3mljJ5%j6PJoJJ2j5Mq%R%qMlK%j0J4qJ3pOJLnOjOlo
6353Clj%jlJ7j6RlmO%npRrMKj4J4jkNMoj4J4lKkOjjmNmJ5j1RNojNkmkPj9QMjr
6405fRNj7J3j2J1j2OnJ5lpRk2J6k%MLj1MlJOJOkJ0j3Kjlk%PlKOqPLrj4PJ%LrK
$$ y = [0, -5, 1, -4, 3, -10, 0, -6, -7, -19, -5, -3, -4, -10, 4, -2, -3, -4, -8, -11, 1, 5, -3, 2, 4, 2, 2, -5, 1, -7, 6, -4, 2, 7, 5, 3, 2, 10, 11, -1, 5, -9, 3, -6, 0, 3, 4, 0, 1, 3, -13, -2, -15, 0, -6, -12, -8, -23, 9, -1, -15, 4, 4, -7, 1, 4, 3, 1, -1, 5, 4, 11, 4, -1, 11, -6, 4, 16, 5, -3, 6, 8, 3, 0, -1, 4, 2, -11, -1, 9, -2, 6, 1, -1, -4, 1, 5, 3, -6, -2, -8, -11, -4, -11, -3, -15, -8, -4, 0, 6, -4, 4, 1, 4, 4, 3, -1, 12, 9, 5, 7, 7, 12, 10, 4, -7, 5, 10, 1, -5, -2, 2, -2, 9, -8, -8, 0, 4, -5, 0, -6, -2, 8, -1, -11, -7, 4, -9, 1, 1, 0, 4, 2, -8, 3, 3, -13, 4, 9, 10, 7, 5, 5, 9, 17, -2, 0, 12, 6, 6, -7, -1, -15, -9, -5, -7, 3, -5, 2, -4, -7, -6, 6, -6, 2, 4, 6, -5, -6, 3, -2, -5, 2, 0, -10, 7, -1, 1, -10, -6, -4, 7, 0, 5, 1, -2, 3, 6, 15, 1, 3, 11, 7, 10, 5, 8, 0, -5, -10, 10, 1, 0, -9, -5, -5, -4, -1, -4, -8, -1, 3, -15, 4, 5, 1, 2, 14, 7, -4, 1, -5, 6, 10, 5, 2, -1, 8, 2, 13, 2, -1, 2, -10, 3, -1, -4, -5, 10, 10, -6, 1, 2, -4, -3, 9, -6, -2, -10, -10, -1, -1, -9, -5, -8, -6, -6, -16, -2, -10, 3, -4, 2, 3, 6, 1, 7, 6, 12, 9, 3, 0, -1, -1, -2, -5, 12, -4, 5, 2, -2, 4, 4, -1, -8, 1, -8, -4, -2, -16, -2, -3, -5, 0, 4, -2, -16, -2, -5, -3, -5, 1, 0, -1, -5, 0, -4, 11, 0, 9, 14, 8, 7, 12, 10, 6, 4, 11, -8, 0, 4, 3, -6, 3, 8, -9, 4, -8, 3, -9, -3, -8, 7, 4, -3, 6, -16, 0, -2, -2, 2, 5, -6, -2, -5, -4, 2, 3, 9, 7, 17, 4, 6, 5, 2, 0, 0, 7, 4, 6, 12, 4, 11, 14, 5, -9, -2, -1, -1, 2, -7, -5]
6454ePlJmNj3J3mMkMkLmJ3j7PjJ4j2oJ0Plj3MjLjrPoPOmPj5lLmKRj0J3nj3KlL
6503iK%RJl%j%KNj7K4j6J2roK0qlPmj5OJ6j2KKj3NJ6j0oONrkLpRj0LJ1j2KJ5k
6549IrlJ0j7KJ0nMqjP%MMOrjRmj1kPlPokLll%pMKLj3LRqRmj0J5KJljKmNOj6QL
6602AkPllNLm%p%J3rRpKoOpjkkKJpNN%qrJ0MJJ6omn%pJ5KpKNjj0O%J5k7J1rJ2
6654E%KkJj5J8Mlk2QKNOk2J2j0PJkjQlpOOJNqoNLMn%nJ2%KlpJ4j0k%oKMpOJjN
6706Hj0OlnOpKlKlMnLRmLqQrKOjjJNkNMo%LJ1qj6J7nj1LmNQj0lKqPONj5MjNj2
6759a0J0Jj4J2Pj0jlJ3m%mRqkMNJ4k0J2nmK1j1rOlLoLnL%LqoJ0oQj1J0nj1J4l
6804anJ0%kQnj8J0%QrNoOjKKPj5J9o%j3J6j0KNNjrojJ3qp%MnJ0j1RomMJj%%Ql
$$ y = [-5, 2, -1, 0, -4, 1, -12, 1, -3, 1, -1, 3, 1, 4, 0, 13, -4, 3, 2, 16, 4, -2, 8, 15, 12, -1, 3, 2, 5, 4, -5, 2, -4, 3, 9, 5, 12, -3, -6, -3, -7, -5, 4, -6, 7, 2, -11, -9, -12, -9, -7, -7, 2, 3, 0, 0, -1, -1, 1, 6, -11, 13, -3, 9, 0, -6, 14, 6, 3, 10, 6, -9, -3, 13, 1, 3, 5, -8, -3, 13, 3, -3, 3, 8, -1, -3, 0, -7, 2, -8, -5, 6, -6, -4, 11, 9, 0, -3, 7, -10, -8, 2, -3, 1, -7, -8, -1, -1, 3, 7, 13, 4, 3, 12, 8, -3, -5, 2, -1, 6, 0, -2, 1, -2, -5, -5, -12, -8, -6, -3, -16, -13, -4, -12, -3, -7, -17, -2, 0, 1, -2, -3, -1, -5, 0, 6, -10, -2, 1, -1, 6, 3, 0, 5, 8, 4, 4, -3, -3, 10, 1, 10, 3, 5, -1, 5, -2, -3, -5, -7, -5, -4, -11, -6, -1, -1, -9, -18, -8, -4, -3, 13, 7, 3, -2, -2, -9, 6, 8, 1, 3, 8, 7, -3, 3, 3, 18, -9, 2, -7, 5, 5, 7, 5, 6, -9, 9, 13, 10, -12, -4, -2, 3, 9, -13, -1, -11, -4, -3, -5, -6, 2, -1, -8, -2, 4, 5, 10, 2, -4, 1, 4, 8, 3, 3, -2, 10, 10, 12, 9, 2, 16, 6, 4, 4, -2, 0, 4, -3, 3, 4, 3, 8, -2, 4, 1, -4, 2, -5, -3, -6, -4, -7, -3, -8, -5, 4, 0, 3, -5, 3, -6, -4, 2, 1, 0, 1, 6, 4, 9, 13, 7, 7, 10, 21, 13, -3, 14, 9, -2, 1, -3, 2, 10, 0, -3, -1, -9, -2, 4, 9, -6, -2, -3, 2, -10, 0, 1, -13, -1, 6, -4, -5, -8, 5, 1, 1, -3, 6, -2, -4, 0, 5, 19, -1, 11, 6, 2, 23, 12, 3, 9, 6, 9, 3, 6, 1, 4, 4, 7, -1, -7, 3, -3, 5, -6, 4, -1, -12, 2, -1, -6, 4, 4, 2, 10, 5, -13, -3, -3, 5, -4, 1, -5, 1, 0, 2, 4, 11, -4, 15, 9, 9, -4, 12, 2, 4, 9, 14, 13, 4, -2, -3, 10, 2, -5, -5, -1, -6, 4, -7, 2, -4, -8, -4, -3, -4, -4, -4, 4, 1]
6854AnQjoPMrnJ2rNOkjOj1Qj0%jMnJ1nJKj3J0mpJ4mrNLlomOj%mJ2pQnkQMmjNl
6907CoJ3j0Rj0%jOrQLj6LjNpPnjKQj1J1kj5J5qJ0jJ5k4OJ3oJoklJ6pKlJ1qJ0j0
6953EPLpklpOoJjllONmLjKolPJj1J2j0KLjJJ1rpJ2j1mK2lJqjJ2j1LKjRlj3PkK
7004DqJjjKj3J1lJ0jJko%JPKoLJ3j2kOl%MqkJ3nNrJ3j1mLJMjj0OknOJNpj1R%Q
7055FOj4QlrNoJ0J%LkoJ2j2%QLllmMNo%JjKMrJ4k1J4lNo%jPj0%QkKj2jklOJ7r
7106CrJ6kKNj3RLLj0MLqJKQqPj1Lj2POmnlmoMRnKjkN%ojJ3Qj4MljMkoJ0KnM%j3
7159gLKOqK3k5J6Kj3oJ1jlRrojKMLlrNOlkRrpJ5qPMnjN%lOk%KqMJ0qj2J3jlM%
7211HLnrJ1j4MONj3LlnOnKNRj3Lj1J2qJ1JN%qJ2lJj2RnOloLPnmPknMnNKlnmjM
$$ y = [1, -4, 4, 3, -3, 4, 8, -1, -6, 6, -3, 2, 8, 6, 5, 11, 0, 8, -2, -2, -3, 1, -4, 7, 2, 3, 5, -8, 2, -2, -9, 5, 1, -8, -3, 0, -3, -9, -13, -7, -8, -8, -12, 0, -7, 1, -4, -6, 2, 6, 2, 1, 6, 3, -3, 10, 0, 9, -1, -1, -2, 4, -5, 3, 6, -10, -7, -8, -3, -10, -3, -8, -9, -7, 1, -10, 1, -1, -16, -1, -9, 1, 0, 15, -9, -3, 10, 4, 5, -1, -3, -6, 10, 3, 5, 2, 13, 5, 15, 5, 12, 15, 8, 6, 3, -4, 2, -4, -3, -4, -7, -10, -4, 1, -3, 0, -1, 1, -5, -8, -1, 0, -11, 1, -9, -7, -4, -5, -4, 7, -2, -9, 3, -8, -12, 10, 7, 8, 0, -1, 11, 0, 3, 5, 4, 13, 10, -3, 4, 2, 4, -4, -3, -4, -5, -3, -16, -5, -8, 2, 1, 2, 0, -6, -6, -5, 2, 4, -2, 1, 14, 2, 0, 6, 3, 3, 7, -1, -3, 10, 5, 10, 1, 14, 3, -1, 2, 3, 7, 6, -4, 2, 0, -5, 1, 2, 7, 0, -11, -2, -2, 6, 12, -2, 6, 3, -6, -1, -7, 3, 4, 4, 7, 5, -1, 11, -1, -1, 7, 10, 7, 4, 0, 4, 9, 3, 3, 4, 3, 5, 9, 0, 14, -7, 7, 4, 9, 3, 3, 2, 9, -1, -1, 7, 5, 7, -5, -6, -8, -11, -5, 12, 3, -6, 10, 8, 10, 15, 2, 11, 14, 17, 7, 11, 14, 6, 7, 9, 17, 9, 16, 5, 8, -4, 3, 9, 5, 0, -3, -7, -13, -9, 0, -5, -3, -4, -6, -1, -1, -7, -8, 5, 13, -1, 3, 0, -1, 3, 1, -5, 5, 7, 2, 6, 6, -7, -4, -2, 4, -4, 19, -6, 10, 12, -1, -7, 4, 3, 0, 9, 0, -6, -7, -5, -1, 2, -1, -10, -5, 1, -2, -4, 5, -4, -11, 4, -4, 3, 7, 2, 1, 6, 6, 3, 9, 7, 7, 9, 1, 5, 15, 7, -5, 8, 7, 4, 8, 8, 11, 6, -3, 8, -6, -2, 4, 9, -4, -1, -4, -9, -3, -8, -6, -1, 8, -5, -2, -13, -1, -9, 2, 3, 8, 8, 0, 12, 9, 10, -2, 7, 2, 8, 5, -1, 2, 9, 4, 0, 7, 5, 0, 4, -1, 4, 6, 3, -2, -6, -7, -3]
7263cOJj%oj1J3jOJj6J1KKlJnmJ2lMmKmKLKnOLkkkNrMMLj8J2Mj1mJjqJ8pLkML
7315FoJqNmNLJ5j6NjkoJ0j0LNj0J1pJ2j4MJj5MJ1MqjMJkmkRlmNnlJ1pkRrJ3pj
7364@J2r%kLPj0KrJJ4j3%J1Rj4Lj0NkLMnRKqljrJ0o%PKj3J0JmMRj4MLN%K%OJj3
7414DmJ2mkjpJLjjpRNJnmQprRK%QpqLNJklJ%KpoJ4npKK2lj1OJkj0J1kjj3LPMj3
7468hK4k6OOjj2J2lkLjLQpj%qJ0KmJnOojlmRoJ0KKmJ0pllKNMKj0nLJ%nRolMop
$$ y = [-3, 3, 4, 3, 3, -3, -14, -1, -2, 4, 5, -11, 0, 2, 4, 1, 2, -3, -7, 5, 2, 6, 2, 4, 0, 2, 5, 7, 2, 8, 11, 9, 7, 5, 10, 1, 5, 9, 12, -6, 6, 10, -1, -5, -4, -5, -13, 5, -2, 1, -1, 3, 6, 0, 1, -7, -2, -6, -1, 2, 17, 1, 6, 5, 3, -3, 7, -3, 0, 5, -5, 6, -1, 11, -3, 1, 2, -13, -9, 2, 6, -2, -3, 1, 2, 0, -4, -6, 3, 0, -4, 1, -4, -7, 4, -3, -5, 4, -5, 8, 1, 0, 12, 3, 3, 1, 4, 11, 1, 3, -6, -5, 9, -4, -4, 7, 16, 2, 5, -5, 0, -2, 1, 5, 0, 9, 11, 3, 0, -1, -10, 0, -6, -6, 1, 3, -10, 0, 1, -3, 1, 10, -4, 0, 3, 8, 8, 10, 10, 16, 17, 4, 0, 12, 8, 6, 5, -2, -1, 2, 1, 0, -7, 2, 7, 8, 3, -1, 7, 0, -9, 0, 2, 2, 10, 3, -5, -2, 3, 4, 2, -1, 0, 0, 2, -5, -11, 3, -2, -9, -7, 15, 12, 1, 7, 8, 6, -4, 7, 5, 4, -9, -6, 1, 5, -8, 16, -10, -4, 2, 1, -11, 1, -2, -4, -1, -2, 1, 9, 2, 1, 1, -7, 3, 5, 1, 2, -3, 3, -3, -4, -7, -11, -2, -8, 2, 4, 6, 2, 12, 5, 2, -1, 1, 6, 10, 12, 2, -3, 0, 1, 1, -4, 5, -1, -4, 0, -6, -13]
$$ [...]
8191a2
##END NTUPLES=NMR FID
##END=
