##TITLE=1H_AM_NV39.1
 CDCl3
 8 sc, 
 21.4.2023
##JCAMPDX= 6.0         $$ Bruker NMR JCAMP-DX V2.0
##DATA TYPE= NMR FID
##DATA CLASS= NTUPLES
##ORIGIN= UXNMR, Bruker Analytische Messtechnik GmbH
##OWNER= root
$$ XWIN-NMR		Version 3.5
$$ Fri Apr 21 16:23:30 2023 Russian Standard Time (UT+4h)  she@DPX200
##.OBSERVE FREQUENCY= 200.13135
##.OBSERVE NUCLEUS= ^1H
##.DELAY= (6, 6)
##.ACQUISITION MODE= SIMULTANEOUS
##.ACQUISITION SCHEME= undefined
##.AVERAGES= 8
##.DIGITISER RES= 18
##SPECTROMETER/DATA SYSTEM= spect
##.PULSE SEQUENCE= zg30
##.SOLVENT NAME= D2O
##.SHIFT REFERENCE= (INTERNAL, D2O, 0, 15.7039)
##AUDIT TRAIL= $$ (NUMBER, WHEN, WHO, WHERE, WHAT)
$$ ##TITLE= Audit trail, XWIN-NMR		Version 3.5
$$ ##JCAMPDX= 5.01
$$ ##ORIGIN= Bruker BioSpin GmbH
$$ ##OWNER= she
$$ F:/spectra/data/she/nmr/H-F/1/audita.txt
$$ ##AUDIT TRAIL=  $$ (NUMBER, WHEN, WHO, WHERE, WHAT)
(   1,<2023-04-21 16:22:13.65 +0400>,<she>,<DPX200>,
      <created by zg, POWCHK disabled, PULCHK disabled
       configuration hash MD5:
       00 E9 B6 7A A2 85 ED C7 34 08 36 98 17 FE 4E 26
       data hash MD5: 16K
       29 B4 4A 25 0D C6 BA CB E7 D9 84 47 EB 1A C7 43>)
$$ ##END=
$$ 
$$ hash MD5
$$ D0 62 C3 94 B2 D4 27 13 B2 E7 C4 E7 81 4A B5 AA
##$RELAX= 
##$RELAX= 
##$RELAX= 
##$RELAX= 
##$RELAX= 
##$RELAX= 
$$ Bruker specific parameters
$$ --------------------------
##$DU= <F:/spectra>
##$EXPNO= 1
##$NAME= <H-F>
##$PROCNO= 1
##$TYPE= <nmr>
##$USER= <she>
##$AMP= (0..31)
100 100 100 100 100 100 100 100 100 100 100 100 100 100 100 100 100 100 
100 100 100 100 100 100 100 100 100 100 100 100 100 100 
##$AQSEQ= 0
##$AQ_mod= 1
##$AUNM= <au_zg>
##$AUTOPOS= <>
##$BF1= 200.13
##$BF2= 200.13
##$BF3= 200.13
##$BF4= 200.13
##$BF5= 200.13
##$BF6= 200.13
##$BF7= 200.13
##$BF8= 200.13
##$BYTORDA= 1
##$CFDGTYP= 0
##$CFRGTYP= 5
##$CHEMSTR= <none>
##$CNST= (0..31)
1 1 145 1 1 1 1 1 1 1 1 1 1 1 1 1 1 1 1 1 1 1 1 1 1 1 1 1 1 1 1 1 
##$CPDPRG= <>
##$CPDPRG1= <>
##$CPDPRG2= <>
##$CPDPRG3= <>
##$CPDPRG4= <mlev>
##$CPDPRG5= <mlev>
##$CPDPRG6= <mlev>
##$CPDPRG7= <mlev>
##$CPDPRG8= <mlev>
##$CPDPRGB= <>
##$CPDPRGT= <>
##$D= (0..31)
0 1.2 0 0 0 0 0 0 0 0.06 0 0.03 0 0 0 0 0.0002 0 0 0 0 0 0 0 0 0 0 0 0 
0 0 0 
##$DATE= 1682079733
##$DBL= (0..7)
120 120 120 120 120 120 120 120 
##$DBP= (0..7)
150 150 150 150 150 150 150 150 
##$DBP07= 0
##$DBPNAM0= <>
##$DBPNAM1= <>
##$DBPNAM2= <>
##$DBPNAM3= <>
##$DBPNAM4= <>
##$DBPNAM5= <>
##$DBPNAM6= <>
##$DBPNAM7= <>
##$DBPOAL= (0..7)
0.5 0.5 0.5 0.5 0.5 0.5 0.5 0.5 
##$DBPOFFS= (0..7)
0 0 0 0 0 0 0 0 
##$DE= 6
##$DECBNUC= <off>
##$DECIM= 32
##$DECNUC= <off>
##$DECSTAT= 4
##$DIGMOD= 1
##$DIGTYP= 9
##$DL= (0..7)
0 120 120 120 120 120 120 120 
##$DP= (0..7)
150 150 150 150 150 150 150 150 
##$DP07= 0
##$DPNAME0= <>
##$DPNAME1= <>
##$DPNAME2= <>
##$DPNAME3= <>
##$DPNAME4= <>
##$DPNAME5= <>
##$DPNAME6= <>
##$DPNAME7= <>
##$DPOAL= (0..7)
0.5 0.5 0.5 0.5 0.5 0.5 0.5 0.5 
##$DPOFFS= (0..7)
0 0 0 0 0 0 0 0 
##$DQDMODE= 0
##$DR= 18
##$DS= 0
##$DSLIST= <SSSSSSSSSSSSSSS>
$$ [...]
##$SUBNAM2= <"">
##$SUBNAM3= <"">
##$SUBNAM4= <"">
##$SUBNAM5= <"">
##$SUBNAM6= <"">
##$SUBNAM7= <"">
##$SUBNAM8= <"">
##$SUBNAM9= <"">
##$SW= 18.05172834244
##$SWIBOX= (0..15)
0 0 2 0 0 0 0 0 0 0 0 0 0 0 0 0 
##$SW_h= 3612.71676300578
##$TD= 16384
##$TD0= 1
##$TE= 0
##$TE2= 300
##$TE3= 300
##$TEG= 300
##$TL= (0..7)
0 120 120 120 120 120 120 120 
##$TP= (0..7)
150 150 150 150 150 150 150 150 
##$TP07= 0
##$TPNAME0= <>
##$TPNAME1= <>
##$TPNAME2= <>
##$TPNAME3= <>
##$TPNAME4= <>
##$TPNAME5= <>
##$TPNAME6= <>
##$TPNAME7= <>
##$TPOAL= (0..7)
0.5 0.5 0.5 0.5 0.5 0.5 0.5 0.5 
##$TPOFFS= (0..7)
0 0 0 0 0 0 0 0 
##$TUNHIN= 0
##$TUNHOUT= 0
##$TUNXOUT= 0
##$USERA1= <user>
##$USERA2= <user>
##$USERA3= <user>
##$USERA4= <user>
##$USERA5= <user>
##$V9= 5
##$VALIST= <valist>
##$VCLIST= <CCCCCCCCCCCCCCC>
##$VD= 0
##$VDLIST= <DDDDDDDDDDDDDDD>
##$VPLIST= <PPPPPPPPPPPPPPP>
##$VTLIST= <TTTTTTTTTTTTTTT>
##$WBST= 1024
##$WBSW= 4
##$XGAIN= (0..3)
0 0 0 0 
##$XL= 0
##$YL= 0
##$YMAX_a= 69624
##$YMIN_a= -56459
##$ZGOPTNS= <>
##$ZL1= 120
##$ZL2= 120
##$ZL3= 120
##$ZL4= 120
##$ABSF1= 10
##$ABSF2= 0
##$ABSG= 5
##$ABSL= 3
##$ALPHA= 0
##$AQORDER= 0
##$ASSFAC= 0
##$ASSFACI= 0
##$ASSFACX= 0
##$ASSWID= 0
##$AUNMP= <proc_1d>
##$AZFE= 0.1
##$AZFW= 0.1
##$BCFW= 1
##$BC_mod= 2
##$BYTORDP= 1
##$COROFFS= 0
##$CY= 11.3945322036743
##$DATMOD= 1
##$DC= 2
##$DFILT= <>
##$DTYPP= 0
##$F1P= 15.7292609196834
##$F2P= 12.9074282941183
##$FCOR= 0.5
##$FTSIZE= 0
##$FT_mod= 4
##$GAMMA= 1
##$GB= 0.15
##$INTBC= 1
##$INTSCL= 1
##$ISEN= 128
##$LB= 0.24
##$LEV0= 0
##$LPBIN= 0
##$MAXI= 10000
##$MC2= 0
##$MEAN= 0
##$ME_mod= 0
##$MI= 1.114404
##$NCOEF= 0
##$NC_proc= 0
##$NLEV= 6
##$NOISF1= 3.799351
##$NOISF2= 2.8
##$NSP= 1
##$NTH_PI= 0
##$NZP= 0
##$OFFSET= 15.70392
##$PC= 1
##$PHC0= -19743.29
##$PHC1= 12.6008
##$PH_mod= 1
##$PKNL= yes
##$PPARMOD= 0
##$PSCAL= 0
##$PSIGN= 0
##$REVERSE= no
##$SF= 200.130013532006
##$SI= 16384
##$SIGF1= 3
##$SIGF2= 2
##$SINO= 400
##$SIOLD= 16384
##$SREGLST= <1H.CDCl3>
##$SSB= 0
##$STSI= 0
##$STSR= 0
##$SW_p= 3612.71676300578
##$SYMM= 0
##$S_DEV= 0
##$TDeff= 0
##$TDoff= 0
##$TI= <>
##$TILT= no
##$TM1= 0
##$TM2= 0
##$TOPLEV= 0
##$USERP1= <user>
##$USERP2= <user>
##$USERP3= <user>
##$USERP4= <user>
##$USERP5= <user>
##$WDW= 1
##$XDIM= 8192
##$YMAX_p= 0
##$YMIN_p= 0
$$ End of Bruker specific parameters
$$ ---------------------------------
##NTUPLES= NMR FID
##VAR_NAME=  TIME,          FID/REAL,        FID/IMAG
##SYMBOL=    X,             R,               I
##VAR_TYPE=  INDEPENDENT,   DEPENDENT,       DEPENDENT
##VAR_FORM=  AFFN,          ASDF,            ASDF
##VAR_DIM=   8192,          8192,            8192
##UNITS=     SECONDS,       ARBITRARY UNITS, ARBITRARY UNITS
##FACTOR=    0.0002768,     1,               1
##FIRST=     0,             0,               0
##LAST=      2.2672688,     0,               0
##MIN=       0,             -56459,          0
##MAX=       2.2672688,     69624,           0
$$ Real data points
##PAGE= N=1
##DATA TABLE= (X++(R..R)), XYDATA
0@%%%%%%%%%%%%%%%%%%%%%Qj6J6j6J6j6J6k4L2l2L2m0M8n2O0o4P2q3R1j01J13
$$ 0 0 0 0 0 0 0 0 0 0 0 0 0 0 0 0 0 0 0 0 0 0 8 -8 8 -8 8 -8 8 -16 16 -16 16 -24 24 -28 32 -32 40 -43 48 -53 60
42F0j24J36j51J66j83K04k25K48k72K98l30L65m04M47m98N57o25P05q03R26j080
$$ 60 -64 72 -79 87 -96 108 -117 131 -141 157 -173 192 -212 235 -263 294 -331 374 -429 497 -583
63e83J288j580K009k709M042p389K9628M4918j01458l874Q6109k5641n9235L8155
$$ -583 705 -875 1134 -1575 2467 -4922 24706 69624 -31834 -35708 50401 24760 -34475 3680
77C680J3122l7539J4046J5228l2889J4209L1841l4351r681N3635j1363m9649L4425
$$ 3680 16802 -20737 -6691 8537 -24352 -10143 21698 -12653 -22334 31301 19938 -29711 4714
90D714L7779m8521k2746M2643J483l4905P064J6710r082k95P620m277L550O426
$$ 4714 42493 -6028 -28774 13869 15352 -19553 -12489 4221 -4861 -5156 2464 -1813 1737 8163
104H163p300K320R258j3314q526J7227j50k1638K159J5525k671o968J08L247J0207
$$ 8163 863 3183 12441 -873 -9399 7828 7678 -13960 -11801 3724 1053 -5915 -5807 -2560 7647
119G647J127j4783L660J7222j0967j4083J5245K628j8878O464J3276j4245l764
$$ 7647 8774 -6009 -2349 14873 3906 -10177 5068 7696 -11182 -4718 8558 -5687 -9451
132i451J5702n386p331J4486k987j5325J4813J0036k2586j782K0789r033j3465
$$ -9451 6251 865 -6466 8020 5033 -10292 4521 14557 -8029 -9811 10978 1945 -11520
145a1520J4612K44j4474J3306Q857k1029K101K2628j1789j5782J7802M160j7878
$$ -11520 3092 3336 -11138 2168 11025 -10004 -7903 14725 2936 -12846 4956 9116 -8762
158h762P388J1488j5249j532J6369p922j0674J3200P57j3009Q523O591j4457K126
$$ -8762 -1374 10114 -5135 -6667 9702 1780 -8894 4306 5063 -7946 577 7168 -7289 -5163
172e163J4030r802p622J4056q10j1857R402O132j3811R44J2269p389q188Q202
$$ -5163 8867 -935 -8557 5499 4689 -7168 2234 8366 -5445 -4501 7768 379 -7809 393
186C93J215n300M481j13n109P742L919j1090J615J1564p233q835R559J881j1025
$$ 393 1608 -3692 789 676 -4433 3309 7228 -3862 -2247 9317 2084 -6751 2808 4689 -6336
201f336K241P128n474k257N514p94k75M056l616j814P841k259r810N631O296j0031
$$ -6336 -4095 3033 -2441 -4698 816 22 -253 3803 187 -1627 6214 3955 -5855 -224 6072 -3959
217c959k971R569k177o734N981L575m659J996L222l000J610J849o111M27O146
$$ -3959 -6930 2639 462 -6272 -291 3284 -1375 621 3843 843 2453 4302 -1809 -1382 4764
232D764o589o024Q933J626r770L516Q684n596k999P661o14m922L799M76n091K327
$$ 4764 -1825 -7849 1084 2710 -7060 -3544 5140 -456 -3455 4206 3592 -1330 2469 2945 -2146 181
248A81J289o029J937N063o008j345R270j886p282P294N035q877n19P453m234n164
$$ 181 1470 -4559 -2622 2441 -3567 -4912 4358 2472 -4810 2484 7519 -1358 -1877 5576 1342 -3822
264c822M591m81m387L538N71m351M438L519o683J533Q419n677o334Q778J893j0391
$$ -3822 769 288 -4099 -561 10 -4341 97 3616 -3067 -1534 6885 1208 -5126 3652 5545 -4846
280d846J460P549n136l926N531p9k963L820J48l478M191J858o224J458N656n553
$$ -4846 -3386 4163 -973 -4899 632 553 -2410 1410 1558 -1920 2271 4129 -2095 -637 5019 -534
296e34m188O816K76p119K349N024l384j540L179m11k99J858k274j122M001j493
$$ -534 -4722 2094 2370 -4749 -2400 2624 -760 -2300 879 468 169 2027 -247 -1369 2632 1139
312A139m491L430K400n050K38M871k593k648M135M48k942K088P02k911K187J552
$$ 1139 -3352 78 2478 -2572 -2334 2537 -56 -2704 1431 1879 -1063 1025 1727 -1184 1003 2555
328B555m965N10N068l597l806N448R94n442K490L944m476o45M864k397l025M161
$$ 2555 -2410 -1900 3168 -429 -4235 1213 2207 -3235 -745 3199 -1277 -1922 2942 545 -2480 1681
344A681k93m281L265K067n216J006N260l717k948N439O7m732K883K498m547M07
$$ 1681 1388 -2893 372 2439 -2777 -1771 3489 -228 -3176 2263 2330 -2402 481 2979 -1568 -1161
360a161L950l253k194M168o94l572K890J505l641J306L035l041r32L688j440k631
$$ -1161 2789 -464 -2658 1510 816 -2756 134 1639 -2002 -696 2339 -702 -1634 2054 614 -2017
376b017K993L52l346J770K027l087Q6L024j902j308L155q11k590K841R22l893
$$ -2017 976 1328 -2018 -248 1779 -1308 -1222 1802 -100 -1408 1747 936 -1654 1187 2109 -1784
392a784J149L080l237j528L821q86l254K823J498l452Q81L044k487j215L275r57
$$ -1784 -635 2445 -792 -2320 1501 615 -2639 184 1682 -1770 -889 2155 -332 -1547 1728 771
408G71k782K574J099l467O84L124k205j793L049M15k637R73J800j404o97J203
$$ 771 -2011 563 1662 -1805 -1121 2003 -202 -1995 1054 1469 -1168 -195 1605 201 -496 707
424G07k90p06L93k51m40N42m7n98M16M90k28k17N4L73L00p81m19J456jk008P22
$$ 707 417 -289 104 -147 -587 -45 -92 -690 -274 216 -12 -229 -175 198 498 -283 -702 754 753 -1255 -533
445e33K076j665j560K459N88k478P95J888j695o05J838r21j305J966j05k396J712
$$ -533 1543 -122 -1682 777 1365 -1113 -318 1570 -125 -730 1108 187 -1118 848 743 -1653 59
462E9J733l068m94L573j226l077K663J826l230p2K940j401j733K362R8k192J511
$$ 59 1792 -1276 -1770 1803 577 -2500 163 1989 -1241 -1313 1627 226 -1507 855 953 -1239 272
479B72J305k427Q2K455j629j804K524N96k898P89K503j703j513K190L79j972N25
$$ 272 1577 -850 -768 1687 58 -1746 778 1374 -1524 -735 1768 65 -1448 742 1121 -851 -326
496c26J295j287n27J274m41j214J057O89j238O4J516m59j013J153O28j351q2J237
$$ -326 969 -318 -845 429 -12 -1226 -169 520 -718 -654 862 403 -610 543 1171 -180 -262 975
514I75o16j186Q52M91j238N0J203n49p52J223M55j281K74J203r80q95J106j05
$$ 975 359 -827 25 516 -722 -672 531 -18 -770 453 908 -373 -99 1104 124 -771 335 230
532B30j331O43P91j275jJ660n97j077J638O07j639M20J412j290r99J460k00j631
$$ 230 -1101 -458 333 -942 -943 717 120 -957 681 1288 -351 69 1481 191 -808 652 452 -1179
550a179Q53J009j377j41J560m24r52J164M90j318K74R26j048o45R96k82j122P54
$$ -1179 -326 683 -694 -835 725 301 -651 513 1003 -315 -41 885 -163 -808 188 -94 -1216 -462
568d62Q05r79j5J302k17p60Q21M11q02J4N35n99l91N82k93o55N25M19o38N0Q40
$$ -462 343 -636 -651 651 434 -326 495 906 104 118 653 54 -337 245 -48 -703 -178 241 -397 -347 493
589D93j41n48M25K85n53j25L44l68l53L98O1m94J29O67j98l67N89L85n22m7N96
$$ 493 352 -196 229 514 -39 -164 180 -188 -541 -143 -82 -576 -447 220 22 -345 244 629 107 60 656
610F56k91n76M00J99p55RO72l26n41O34K76o28J57N85m83k33O24k74p32O82L50
$$ 656 365 -211 189 388 -367 -358 314 -12 -553 81 357 -271 -114 471 -12 -245 379 105 -627 55 405
631D05j037m9J209l58r79P93P47q58j79P88k05l57M66j70n38O47J84j088J98J123
$$ 405 -632 -681 528 170 -809 -16 731 -127 -306 482 277 -80 386 216 -322 325 509 -579 -381 742
651G42o84r04R61M97j019m6Q23l51m12N40n6n14M38L38o67m5O96j77n15L46L12
$$ 742 58 -846 115 612 -407 -453 370 19 -393 147 91 -423 15 353 -314 -359 337 160 -355 -9 303
672C03l13NK79k35r1M27p8n37K93M66m60m95M40L16m26l67L70K62k13k15P7K34
$$ 303 -10 -5 274 39 -52 375 297 -240 53 519 59 -436 4 320 -106 -473 -103 159 -54 -269 -192 42
694D2R4k16j84K68L23l47l49L55L21l09k50K87K09j27n8k6M1K59j24l48J22L90
$$ 42 136 -80 -264 4 327 -20 -369 -14 307 -2 -252 35 244 117 59 33 74 333 209 -139 -17 373
716C73l64l60L40J80l71j2J82j29K2K32j96j74M65P0n75Q7O03k66m49L66K68l20
$$ 373 9 -351 -11 169 -202 -214 -32 -161 -139 93 -103 -277 188 258 -317 -230 373 107 -342 24 292 -28
738b8m8K58j47k5K84j67k82L63J75n47n8N12j62n29K60L14l43q7K77q1j69L01
$$ -28 -76 182 35 10 294 127 -155 208 383 -164 -222 290 128 -401 -141 173 -170 -257 20 -61 -230 71
760G1nl33K61K63l85j07M76m6m15K13L21l12j08L21n7k34K25L3k68J16K53l89
$$ 71 66 -267 -6 257 -128 -235 241 195 -220 -7 314 2 -106 215 158 -76 149 182 -86 30 283 -106
782a06j93M97r4m85K50L56l53j93L76lk25J54P2j39J29J32k87P8L35j97k94K86
$$ -106 -299 198 104 -381 -131 225 -128 -321 55 52 -173 -19 53 -86 43 175 -112 -34 301 104 -190 96
804I6K30k78j15J82O0q8q2k7K8J18j32k25K34J33k50j54K04J14j55lK1PJ53l5
$$ 96 326 48 -67 115 175 87 5 -22 6 124 -8 -233 1 134 -116 -270 -66 48 -107 -110 -89 -82 71 36
828C6k51J62L20j91k42K34K46k11k37K18J66j30j31k0P0J19j06k09N1K71n7l55
$$ 36 -215 -53 267 76 -166 68 314 103 -134 84 250 120 -11 -31 39 158 52 -157 -106 165 108 -247
850b47j9M23l9m60M4M61p0l87J71K65j60k6J16j33L4K96k16k89L95K58m96j10
$$ -247 -266 157 118 -342 -298 163 93 -294 -123 142 -18 -44 72 -61 -27 269 53 -236 159 417 -79 -189
872a89M82j8m08J12J76j76J8J06k82OL47j74l62K69K91l23j76L25N7j85N7Lk8
$$ -189 293 275 -133 -21 155 -21 -3 103 -179 -173 174 0 -362 -93 198 -125 -301 24 81 -104 -47 -44 -72
895g2K24%l56J76L66k35l36L20K02k70j13J82qn0L4j19n6J69J7l07R6K43j30k04
$$ -72 152 152 -204 -28 338 103 -233 87 289 19 -94 88 80 30 64 -55 -111 58 75 -232 -136 107 -23 -227
919b27J51J70j45r4J09P9o2nM1K1OJ7J3j5k9J05m6r6O2O0j20n6J22m4j50R1Q7
$$ -227 -76 94 -51 -145 -36 43 -19 -24 17 38 44 61 74 59 30 135 89 -7 55 115 -5 -61 61 17 -133 -42 45
946D5j79j6J93n2j88J25J21j41j8J29l1m8J19nj14J27R7j73k8K00oj40JR9l8q8
$$ 45 -134 -150 43 -9 -197 -72 49 -92 -110 19 -12 -60 59 54 -60 67 164 -9 -37 163 157 17 18 117 79 -9
972iLlPL6p5j06J19N8j26r0J29J20j53r2J57Q1p7p5O6J25l9p3K4R6K3q8n3P5Q6
$$ -9 -6 -9 -2 34 -41 -147 -28 30 -96 -186 -57 63 -90 -182 -25 56 -21 -96 -30 95 56 -17 7 103 126 38 -15 60 146
1001A46m6j75P4J57m8k02L2J36m1j42K7P1k6k4j0k0N1O3o3r1R8J51j13j31J27
$$ 146 100 -75 -1 156 108 -94 -62 74 33 -109 -82 -11 -37 -61 -71 -91 -40 23 -40 -131 -33 118 5 -126 1
1026AJ31p7r5R0J14p5p3N7m6M9K5j63m9K45ol36N2K89q5k78J34K16j32j63J26
$$ 1 132 55 -40 50 164 89 16 73 27 76 101 -62 -111 134 128 -208 -156 133 48 -230 -96 120 -12 -175 -49
1051d9Q7o6K7J9o8Q8P7j31m0J99L7k61O0K01q4j52J22O5j47RQ4j14m8J01j7j22
$$ -49 38 -28 -1 18 -50 38 115 -16 -56 143 180 -81 -21 180 96 -56 66 131 -16 -7 77 -37 -85 16 -1 -123
1077a23N5Q5m2j11P2Q3l7n0N0L4L8l9k1L7N3J1r5K4R7Oj55J8J36j1j96J8J83p9
$$ -123 -68 17 -25 -136 -64 19 -18 -68 -18 16 54 15 -6 31 84 95 0 24 121 127 -28 -10 126 115 -81 -63 120 41
1105D1j94R6R7j10p4O9M9l4pRKJ03qj19P3J21q9r6J29J16j57n0J81l2j29P4O1
$$ 41 -153 -57 40 -70 -144 -75 -26 -60 -67 -58 -56 47 39 -80 -7 114 25 -71 58 174 17 -33 148 116 -13 61 122
1132A22n2q4M9J5n5k8kj8Npn2L4N8m9jN4K4m6JN8Jm7L1M3jm5JQ1Mm6JP1m9o0N
$$ 122 70 -14 35 50 -5 -33 -35 -53 -48 -55 -107 -73 -15 -64 -65 -11 13 -33 -32 26 27 -20 11 54 53 8 9 90 94 48 49 120 71 11 16
1167A6K0ko8pL4Jp0J7K2L7n6k6O0J7j2l2M7K5j8j9M3M5ol9N4J3n5NJ1kmn0m5L2
$$ 16 36 34 -34 -41 -7 -6 -76 -59 -37 0 -56 -82 -22 -5 -17 -49 -2 23 5 -14 29 74 68 29 83 96 41 46 57 55 51 1 -44 -12
1201a2j1m2KL0L8m5M2J3m0Llj2l9K1J7nNN2j2M4O0mm3N1L8p1q7O9n1n9k6QK2l5
$$ -12 -23 -65 -63 -33 5 -40 2 15 -25 -22 -25 -37 -76 -55 -38 -43 -38 14 2 46 106 102 59 110 148 77 -10 59 8 -51 -77 -69 -47 -82
1235h2O7L1k2M6m0K4pk0l7l5M5kj02J7J22Pm6P3J02j6n5P4Q0j21p0P%r1m2K5P
$$ -82 -15 16 -6 40 0 24 17 -3 -40 -75 -30 -32 -134 -117 5 12 -34 39 141 125 70 144 224 103 33 40 40 -51 -93 -68 -61
1266f1JJ5j2N5R9o5q4J05O2k16j8J11k7j61O6J55n9n0J23R4l2L8rNk1o8o4J8N6
$$ -61 -60 -45 -57 -2 97 32 -52 53 115 -101 -119 -8 -35 -196 -130 25 -34 -84 39 133 101 139 130 135 114 46 -18 0 56
1295E6j58n7J45O1j26j7J37Q2j59l6J48j9j14n4R7jj01j2J37L7r2J1J50L3j06
$$ 56 -102 -159 -14 47 -79 -96 41 123 -36 -72 76 57 -57 -111 -14 -15 -116 -128 9 46 -46 -35 115 148 42
1320D2k6J08mo8j08P6Q0j02j30J19J33j18j44J80R4k00m8J51J2j73pJ71jr8nJ06
$$ 42 16 124 120 52 -56 20 100 -2 -132 -13 120 2 -142 38 132 -68 -116 35 47 -126 -133 38 37 -61 -66 40
1346D0R6q6r8O9J57j22j51O2J54p2j74J29J50j17j19J48J37j44j74J45P2j96j23
$$ 40 136 50 -48 21 178 56 -95 -33 121 49 -125 4 154 37 -82 66 203 59 -115 30 102 -94 -217
1369b17J28P9q7n3J01Q3K8pOP2K4r3o1Q4o8j53M5J41j16j14K09J80k04r4K78N3
$$ -217 -89 -10 -97 -150 -49 34 62 55 61 133 157 64 3 87 19 -134 -89 52 -64 -178 31 211 7 -87 191 244
1395B44k03q3R3l1j01j40LJ00L0j23O7K55L7j71J08K27r1k80P6J67j55k39K6J83
$$ 244 41 -42 51 20 -81 -221 -218 -118 -88 -211 -144 111 148 -23 85 312 221 -59 17 184 29 -210 -184 -1
1419aK1j54jK50N3r7NJ11J1j49o1qj00n4J1pppQ6J02M1m3O5J93q1j59L3Q7j52
$$ -1 20 -134 -135 115 168 71 76 187 198 49 -12 -20 -120 -174 -163 -170 -177 -184 -98 4 45 2 67 260 179 20 53 140 -12
1448a2j48J05Q4j68m6K17J15j06o1J71J51j29k69L5K38j25l53L7L14m3k85P3L01
$$ -12 -160 -55 29 -139 -185 32 147 41 -20 151 302 173 -96 -61 177 52 -301 -264 50 7 -278 -205 96
1471I6K8j72L4J69L4j59o0J03M3j91r5J34R2j21l7J78O2j18k8Q5L1n4n8jk6m7
$$ 96 124 -48 -14 155 189 30 -30 73 116 -75 -170 -36 56 -65 -102 76 138 20 -8 77 108 54 -4 -5 -31 -78
1497g8jM1l6m7R1J12q1r8J32J25j17j22R8J12m9j47kJ61J0j49m8J88O7k43o0K21
$$ -78 -79 -38 -74 -121 -30 82 1 -97 35 160 43 -79 19 131 82 -65 -67 94 104 -45 -93 95 162 -81 -141 80
1523H0M3k41k5J99K8j87k7J64N8j37o6O4J05l8j43K2J70Nj18j1J03N2n6m0J08
$$ 80 123 -118 -143 56 84 -103 -130 34 92 -45 -111 -47 58 20 -123 -101 69 74 -44 -55 48 100 44 4 112
1548A12rn4j6O4j13m7M6J0m5K1K2l0k5P4L2p7K3Jk9K0Ro1mR1o3o2J17J23q0r6
$$ 112 103 49 33 97 -16 -63 -17 -7 -52 -31 -9 -39 -64 10 42 -35 -12 -11 -40 -20 -11 -72 -76 15 -48 -110 7 130 50 -46
1578d6J52O8j09m5Q6J2j03p3L2K0jm4j6N9M9l0n4P6K9r8mK6J4j01K2O7j6m0N2
$$ -46 106 174 65 20 106 118 15 -58 -26 -6 -7 -51 -67 -8 41 11 -43 33 62 -36 -40 -14 0 -101 -79 -12 -28 -68 -16
1607a6J8K9K0oJ2K1pol2%ko5j3Rk1J4J0K2l1K6N1jm4MJ3mm2k0O0j2l4K2J0N0O
$$ -16 2 31 51 45 57 78 71 65 33 33 31 -34 -47 -38 -59 -45 -35 -13 -44 -18 33 32 -12 -8 5 1 -41 -61 -1 -13 -47 -25 -15 35 41
1642D1OM6k7l1J3j4Kj7m1n6L2N6p1j1L5N8o8K1M4J3m4J9L1j05J3M3k0k3O7L0m7
$$ 41 47 93 66 35 48 34 36 19 -22 -78 -46 10 -61 -72 -37 21 -47 -26 18 31 -13 6 37 -68 -55 -12 -32 -55 12 42 -5
1673eM4M2rj0M4k9q2Q6k3j19k5P6n5n3N7Q3n9J2N3RrNn3MJ0l6o2M4P5o5j7J00
$$ -5 39 81 72 62 106 77 -5 81 58 -61 -86 -10 -65 -118 -61 22 -37 -25 28 37 28 33 -20 -16 -6 -42 -104 -60 15 -50 -67 33
1705C3N3m6j5J16Rn8l1J0k5r1j0J5l4k0K1KL9L5j3J2Q2n4n2K1N5j12q4P4O6j00
$$ 33 86 40 25 141 150 92 61 71 46 -45 -55 -40 -74 -94 -73 -71 -32 3 -10 2 84 30 -22 -1 54 -58 -142 -68 -2 -102
1735a02j4J16M6k4L0N8K6lm8j6k2kr0m4O6n2k5L6Q2l5qP9M3k3n6J4qj7p8RK6j3
$$ -102 -116 0 46 22 52 110 136 133 85 69 47 45 -45 -89 -23 -75 -100 -64 18 -17 -25 54 97 74 18 32 24 7 -71 -62 -36 -49
1767d9l5J6J28k4n6P4R2n8l5L6Np1k1p8J4L6m7n9J04O8q4NJ21Oj20N8K1k5m5j0
$$ -49 -84 -68 60 36 -20 54 146 88 53 89 94 23 2 -76 -62 -26 -73 -132 -28 40 -44 -39 82 88 -32 26 47 22 -23 -33
1797c3L6m0J5oLM6L1k6L3M8l0p2M4M9j11m7O0K4q8lP2l9m5K7N7mj7L4Nl0RrL7
$$ -33 3 -37 -22 -28 -25 21 52 26 59 107 77 5 49 98 -13 -60 0 24 -64 -67 5 -34 -79 -52 5 1 -16 18 23 -7 2 -7 30
1830C0Kj2o2O5K8n7l9Q0J0l9rM1M9j12K8N7k3o1o%lm5K1j4rK0pJ4J06o4k4N9Q0
$$ 30 32 20 -42 23 51 -6 -45 35 45 6 -3 38 87 -25 3 60 37 -24 -30 -30 -33 -78 -57 -71 -80 -60 -67 -53 53 -11 -35 24 104
1863A04m2o1M1j7n1l2N6Jo1J9P0LlL2RK8j3j01M4jj06j5K9Kp6L8N3PJ4N1K9L0
$$ 104 62 1 42 25 -26 -58 -2 -1 -62 -43 27 30 27 59 68 96 83 -18 26 25 -81 -96 -67 -65 -141 -103 -50 -43 -29 22 51 81
1895H1lk5KJ2p2o5N1k3m0j9O5M6k4K7O4K6m2K0k1k2l2n8l4J0Jm7K3Q7j4j6Q6Q1
$$ 81 78 53 55 67 -5 -70 -19 -42 -82 -101 -36 10 -14 13 77 103 61 81 60 38 6 -52 -86 -76 -75 -122 -99 -12 -26 -42 44 125
1927A25p0j2L2K4q9k9K3l3o0M2Kj9N0J0KO6K2l3j3L0l1r6J5K1o5m7Q7K9o3O1O8
$$ 125 55 43 75 99 10 -19 4 -29 -89 -47 -45 -64 -14 -4 -2 64 86 53 40 70 39 -57 -42 -21 -86 -133 -46 -17 -80 -19 49
1958D9m4PO1J3n2J1Ko1K3J5p6k2Q2on9O0O8p9mP0j4r3J5Q6r6qK7l3lL6L6p2O9
$$ 49 5 12 73 86 34 45 47 -14 9 24 -52 -74 8 2 -57 3 71 -8 -12 58 44 -49 -34 52 -44 -52 -25 -58 -61 -25 11 -61 8
1991HN2n5j0J05k1r8O0N3j07jQ8m1r1Q4Lp4J1O3j5k9N0l7l0L9J2p3k3R0p3k6P9
$$ 8 60 5 -5 100 79 -19 41 94 -13 -14 74 33 -58 26 29 -45 -34 29 14 -15 35 -2 -32 7 19 -54 -77 13 -60 -86 -7
2022gJ5q3L5P8m9MN2L7q4L8L1j7l3K3l6n1P0j5p0N9K3l8m1J01kr7N4K5n1n5Q2
$$ -7 8 -75 -40 38 -11 -7 45 82 -2 36 67 50 17 40 4 -47 23 8 -62 -3 20 -18 -59 42 40 -57 -3 22 -29 -84 -2
2053bj5o9R2K2r6P5K9k1k3O8j0n8M1N2j01l5Q4k9j14J04M3r9qJ25l9n7J04k9n1
$$ -2 -17 -86 6 28 -68 7 36 15 -8 60 50 -8 33 85 -16 -51 33 4 -110 -6 37 -62 -70 55 16 -41 63 34 -17
2082a7L4L7r5PR3o6p0R8L8j24K8J04n6l4P8K9j03J0P2p1l0P4m9l4K4K2n3K4M9
$$ -17 17 54 -41 -34 59 -7 -77 21 59 -65 -37 67 11 -23 55 84 -19 -9 63 -8 -38 36 -13 -47 -23 -1 -54 -30 19
2111A9n8j6R6k7n3L8M3p0NN7k0j5JL0k7K7K3l6K1O4q4j6N4l6l9MJ0j0m4L2J6k0
$$ 19 -39 -55 41 14 -39 -1 42 -28 -23 34 14 -1 0 30 3 30 53 17 38 102 18 2 56 20 -19 -15 -5 -15 -59 -27 -11 -31
2143c1j9O8l8j5J5J6k7J8J8k7OM2l6pL9K5n6J4O2k6n3L3P3j13LM9j5n9K4ml4M2
$$ -31 -50 18 -20 -35 -20 -4 -31 -13 5 -22 -16 26 -10 -17 22 47 -9 5 67 41 -12 21 94 -19 -16 33 18 -41 -17 -21 -55 -13
2175a3J3k1j1M0Oq2O3K9q7L1P1l4m8Q4K5j01J4O9j0m3N6j5m0J0M7n6L3j1n8%Q4
$$ -13 0 -21 -32 8 14 -68 -5 24 -63 -32 39 5 -43 41 66 -35 -21 48 38 -5 51 36 -4 6 53 -3 30 19 -39 -39 45
2206D5n2m6M0M6l6n0O5Nn3K6K9qm0L2K1%m0J0M1k3L3n8J7L3k1j5k0K8qj8nL9l5
$$ 45 -7 -53 -13 33 -3 -53 12 17 -36 -10 19 11 -29 3 24 24 -16 -6 35 12 45 -13 4 37 16 1 -19 9 1 -17 -22 17 -18
2239a8m0M4Mj5J6J4J9pjJ4k0K1l9J3L2j0m4L6L6k6l4L3K0n0QJ9j9l5J3Mk8J3j
$$ -18 -58 -14 -10 -25 -9 5 24 17 16 30 10 31 -8 5 37 27 -17 19 55 29 -5 28 48 -2 6 25 6 -29 -16 -12 -40 -27 -28
2272b8j7M3ql4J3M7J5o4K0N2l1rK4MJnKj1K9Nj4j5L2pn5K2Pm0jL1j8k7J3J8rk7
$$ -28 -45 -2 -10 -44 -31 16 31 -33 -13 39 8 -1 23 27 28 23 25 14 43 48 34 19 51 44 -11 11 18 -22 -23 8 -10 -37 -24 -6 -15 -42
2308d2L0jlPkJJ6j9KL8J0m6jM0L2l8k6L3mj1pJ7J5l6J9Rk3k2L7k7JJ1k3mJ6K2
$$ -42 -12 -13 -16 -9 -11 -10 6 -13 -11 27 37 -9 -10 30 62 24 -2 31 27 16 9 26 41 5 24 33 10 -12 25 -2 -1 10 -13 -17 -1 21
2344B1m7K3N4m7m4Q0l4k0RL8n0k0K9J8l1K2K2l3J9qJk%MLl9K1LJ5J0j4J1k0JO
$$ 21 -26 -3 51 4 -40 40 6 -14 -5 33 -17 -37 -8 10 -21 1 23 -10 9 1 2 0 0 4 7 -32 -11 -8 7 17 3 14 -6 -5 1
2379AKK4m7J2J8k0L0Qk4kJ3J7l2pK3j2m4L5j9nJ1J8n0L8J1k2k2O2l5j2K8M1p0
$$ 1 3 27 -20 -8 10 -10 20 28 4 2 15 32 0 -7 16 4 -40 -5 -24 -29 -18 0 -50 -12 -1 -23 -45 17 -18 -30 -2 39 -31
2412c1O4ml5rK3M1n1K9lj5jOlk0oL8n9J7J3Ml7K5J5l7J6P%j7M7J3m4KM7k1k7L2
$$ -31 33 29 -6 -15 8 49 -2 27 24 9 8 14 11 -9 -15 23 -36 -19 -6 -2 -39 -14 1 -36 -20 -13 -13 -30 17 30 -14 -12 35 14 -13 19
2448A9noMM5j6n1J9J8j5k5M8m6j1N5l4nnL0m5k3N3j1j4J1j6j6M7K4mk6M0k3l7
$$ 19 14 8 12 57 41 -10 9 27 12 -13 35 -11 -22 33 -1 -6 -11 19 -26 -49 4 -7 -21 -10 -26 -42 5 29 25 -1 39 16 -21
2481b1L4J2m5M0Rk4l4N7pj9LlpK7k1Mj3Nqj0QKj7JN3n7K5KK4k8ljJ6j4JJ0J7k2
$$ -21 13 25 -20 20 29 5 -29 28 21 2 5 2 -5 22 1 5 -8 -3 -11 -21 -13 -11 -28 -27 26 -31 -6 -4 20 -8 -11 -12 4 -10 -9 1 18 -4
2519doj6M0j8j7JmkK0j2nJ7%j8L2j3j1MMK9k6J5K0j5K0pk2mK4j2k3J5J0Kn%nj0
$$ -4 -10 -26 14 -4 -21 -20 -24 -26 -6 -18 -23 -6 -6 -24 8 -5 -16 -12 -8 21 -5 10 30 15 35 28 6 2 26 14 -9 6 16 18 13 13 8 -2
2557bk9RPJ8k4mJ2kJ6k8OK9K1l0K4j4j2qL0K7n5J2N6k9l1K8qk6J6J5m1K7Oj9l
$$ -2 -31 -22 -15 3 -21 -25 -13 -15 1 -27 -21 8 29 -1 23 9 -3 -11 19 46 -9 3 59 30 -1 27 19 -7 9 24 -17 10 16 -3 -6
2592fqOKNk6pJ1L7k7%K8pk5NRjJ4j4J4j2J9Jj1J9Lmk5L0j3k1QMK4k2j1%J1j2n
$$ -6 -14 -8 -6 -1 -27 -34 -23 14 -13 -13 15 8 -17 -12 -3 -4 10 -4 10 -2 17 18 7 26 29 25 0 30 17 -4 4 8 32 10 -1 -1 10 -2 -7
2631gK8%ll6L3Kl3J5KJJOmpJ4K1j4j6J3j9kK1k5K5J1m9K2Rj4K4pqmQkmPj0rj1
$$ -7 21 21 18 -18 15 17 -16 -1 1 2 3 9 5 -2 12 33 19 3 16 -3 -5 16 -9 16 27 -22 0 9 -5 19 12 4 0 8 6 2 9 -1 -10 -21
2671b1J8K4j0LqK3l0%K3pj3Jj2pK3j9J3j1Qk1K0l1K5qJ9LpOj2J8LK2k7K0m0K8
$$ -21 -3 21 11 14 6 29 -1 -1 22 15 2 3 -9 -16 7 -12 1 -10 -2 -23 -3 -34 -9 -17 2 5 -2 4 -8 10 13 35 8 28 -12 16
2707A6J5Pl2K7Ll5J0L9j0n3L8j1ok8J3nj0L0j1k2L6j7j3K2%Kk3J3L4m0J9Nj4J5
$$ 16 31 38 6 33 36 1 11 50 40 -13 25 14 8 -20 -7 -12 -22 8 -3 -25 11 -6 -19 3 3 5 -18 -5 29 -11 8 13 -1 14
2741A4NMJk0K9j8j2Lj8mL5k2Mk0J2p%J4Jk%K1j1qj6K6j6j4K7J6Kk6J2J1ok3J9
$$ 14 19 23 24 4 33 15 3 6 -12 -16 19 -3 1 -19 -7 -14 -14 0 1 -1 -1 20 9 1 -15 11 -5 -19 8 24 26 0 12 23 17 -6 13
2778A3onM3n6J6mL5m0QoL1m0M9j1m3ORJ6l3jM2j8Rk8M8j1k9K3j6Lk4L0n1N0ok0
$$ 13 7 2 45 -11 5 1 36 -4 4 -2 29 -11 38 27 -16 -10 -1 15 -18 -19 23 5 14 -14 34 23 -6 17 1 4 -20 10 -41 9 3 -17
2814a7OJ1o%j5L0oj3J7J0m8K4K4kk1K8k0J5oOMklOj2J2j2j5QKj9j1M5rl1j8N4
$$ -17 -11 0 -6 -6 -21 9 3 -10 7 17 -31 -7 17 15 -6 22 2 17 11 17 21 19 16 22 10 22 10 -5 3 5 -14 -25 20 11 -20 -38 16
2851A6j3n8N3Kj4J1nMnJ0k8L0PPk2NJ7PlnK0l6nJ6J0J3k4JJ8j4m4L6J0o1M2J2
$$ 16 3 -55 -2 0 -14 -3 -8 -4 -9 1 -27 3 10 17 -5 0 17 24 21 16 36 0 -5 11 21 34 10 11 29 15 -29 7 17 -44 -2 10
2887A0l0oQlL9k1%J1j4J0j8J4L2l5j8M8Oj6k5L8j4Mm3N4k9Nj3OM9l8k6j5O1l7
$$ 10 -20 -26 -18 -21 18 -3 -3 8 -6 4 -14 0 32 -3 -21 27 33 17 -8 30 16 20 -23 31 2 7 -6 0 49 11 -15 -30 31 -6
2921fl9L8J9j4nJ9j1Pm4L0J8pk5NK8Km9QM9on5L8J5%l1J5noPL2nk6p%M8j4l9K7
$$ -6 -45 -7 12 -2 -7 12 1 8 -36 -6 12 5 -20 -15 13 15 -34 -26 23 17 -38 0 15 15 -16 -1 -6 -12 -5 27 22 -4 -11 -11 37 23 -16 11
2959A1J8k2j8L3K5n7kjK3k4J2L1ql5qj8O2k5m7K4O7m8k6K1j3Lj2K6POk1lL8mj1
$$ 11 29 7 -11 22 47 -10 -12 -13 10 -14 -2 29 21 -14 -22 -40 22 -3 -50 -26 41 -7 -33 -12 -25 -22 -34 -8 -1 5 -16 -19 19 15 4
2994DK6J0l4j3K3L6l2j8L6j7rMm1M2nLj6j2J2j8OpmRnM5m0PJ1J3nJ3%mj0j5J8
$$ 4 30 40 6 -7 16 52 20 2 38 21 12 16 -25 17 12 15 -1 -13 -1 -19 -13 -20 -24 -15 -20 25 -15 -8 3 16 11 24 24 20 10 -5 13
3031A3qK2jj4RKj6JK4k7J4J7m8oJ3Ok9M8n0K2J3J1l5M8l8j4J8JNlK0k0j0J4np
$$ 13 5 27 26 12 21 23 7 8 32 5 19 36 -12 -18 -5 1 -28 20 -30 -8 5 16 -19 29 -9 -23 -5 -4 1 -2 18 -2 -12 2 -3 -10
3067a0jM5j2k1j3L5j7j0K3k7JM5l2j6K4J2nj7LMKlOrj4oQoOoJK9j9RqJ4j1j0M
$$ -10 -11 34 22 1 -12 23 6 -4 19 -8 -7 38 6 -10 14 26 21 4 7 11 13 10 16 7 -7 -13 -5 -11 -5 -11 -10 19 0 9 1 15 4 -6 -2
3106bpPk5%K2k7K2J0oJ5OJ3KOl9Pj5Nj0L3k0L0oJ0K0j5l6J2Ppl7J7Lj7KLK4j2
$$ -2 -9 -2 -27 -27 -5 -32 -10 0 -6 9 15 28 30 36 -3 4 -11 -6 -16 17 -3 27 21 31 51 36 0 12 19 12 -25 -8 -5 -22 -20 -17 7 -5
3144eK2Oj9%j5K4l1PnNJ7k6J5L3jj6J5ORl2j9J6J3j2k9NK5j6qoM0l1QJ5j6Rrj5
$$ -5 17 23 4 4 -11 13 -18 -11 -16 -11 6 -20 -5 28 27 11 26 32 41 9 -10 6 19 7 -22 -17 8 -8 -16 -22 18 -13 -5 10 -6 3 -6 -21
3182b1K0k9K9j8O1l5l4J6L8J0l0J2K4k9pL2k4k7k0K7K2k1j3N6J1m3j3NK8l8mk6
$$ -21 -1 -30 -1 -19 42 7 -27 -11 27 37 7 19 43 14 7 39 15 -12 -32 -5 17 -4 -17 39 50 7 -6 -1 27 -11 -15 -41
3214d1N3m6kJ5M5qo8N8L4k3l8K3K7m7j1K0Pm4K2K5lnLJ8J%j9J2L0m2j4OL9m6%
$$ -41 12 -34 -36 -21 24 16 -52 6 40 17 -21 2 29 -18 -29 -9 -2 -46 -24 1 -2 -7 -4 14 15 15 -4 8 38 -4 -18 -12 27 -19 -19
3249a9L2J8l5J9j1J9rOJ3rOn2QL4m3j4L1L5k8pK0mQk3M%k3k6L2l%k4L2N1jkk1
$$ -19 13 31 -4 15 4 23 14 20 33 24 30 -22 -14 20 -23 -37 -6 29 1 -6 14 10 18 -5 -1 -1 -24 -50 -18 -21 -21 -45 -13 38 37 35 14
3286A4K5j2j0jPnj6k1K2J0k2K3j6J6m5N5qlj7nKMj2k0N3k9jK4kJ4j4j0J5P%pk9
$$ 14 39 27 17 16 23 18 2 -19 3 13 -9 14 -2 14 -31 24 16 13 -4 -9 -7 -3 -15 -35 18 -11 -12 12 10 24 10 0 15 22 22 15 -14
3323a4K7k7PJ7Rk3j1L6LqmNNk7k5J7J0k2k7M7j6K0j0J3MOjLJ5l1k1K9j9J7l0N4
$$ -14 13 -14 -7 10 19 -4 -15 21 24 16 12 17 22 -5 -30 -13 -3 -25 -52 -5 -21 -1 -11 2 6 12 11 14 29 -2 -23 6 -13 4 -26 28
3359B8k5k8QM1j9mL0k3k4L8m0mK7j2J5Knj1K3nmK9k1j9lj0kj1OK3k6lM6j3l4J2
$$ 28 3 -25 -17 24 5 1 31 8 -16 22 -18 -22 5 -7 8 10 5 -6 17 12 8 37 16 -3 -6 -16 -18 -29 -23 0 -26 -29 17 4 -30 -18
3395a8K2JMm2J7J6Jk5L8m3RJ5K4J0k3olJ9j6J9r%k5J6lJ7j4J9j7K2k8pK4Mk7j1
$$ -18 4 5 9 -33 -16 0 1 -24 14 -29 -20 -5 19 29 6 0 -3 16 0 19 10 10 -15 1 -2 15 1 20 3 25 -3 -10 14 18 -9 -20
3431b0j3kK3Mk0L0ll1M2K0m1NK2Rl7mL3j3qnJ5PKqK0j8J6l4NJ7j1k1jK1loj5J4
$$ -20 -33 -35 -12 -8 -28 2 -1 -32 10 30 -11 -6 16 25 -12 -16 17 4 -4 -9 6 13 15 7 27 9 25 -9 -4 13 2 -19 -20 1 -2 -8 -23 -9
3469iJ9l4%J5qNK2j9qj1LRL3l2J7j8J3RJ7K9m2k5J7K2m7L6Nkj4nK3j5j5J8j3J3
$$ -9 10 -24 -24 -9 -17 -12 10 -9 -17 -28 -25 -16 17 -15 2 -16 -3 6 23 52 10 -15 2 24 -23 13 18 16 2 -3 20 5 -10 8 -5 8
3505Hjk0j3M1Nm4JL9jm5MN0k7k1L2nk1OL3mk6l0L0K2l3OLKJ3pLL3k0l2J3J5jo
$$ 8 7 -13 -26 15 20 -24 -23 16 15 -30 -26 24 -3 -24 8 3 -18 -12 21 17 -9 -39 -9 13 -20 -14 -11 -9 4 -3 0 33 13 -19 -6 9 8 2
3543Bj6M2j8jj7K1j6j1j1M1Pn3M9q%m2K2Rl0oj9O5mpk7M6lk8K2J0j3k2LL3Om1
$$ 2 -14 28 10 9 -8 13 -3 -14 -25 16 23 -30 19 11 11 -31 -9 0 -30 -36 -55 10 6 -1 -28 18 15 -13 9 19 6 -16 -13 20 26 -15
3579a5QK5Rm3J4mLJ1k7J9Kk6rL7l3KJ7j1K3j8J1LJ0m4L7lonMK8j3k6J5QJ6l1J9
$$ -15 -7 18 27 -16 -2 -6 -3 8 -19 0 2 -24 -33 4 -29 -27 -10 -21 2 -16 -5 -2 8 -36 1 -2 -8 -13 -9 19 6 -20 -5 3 19 -12 7
3616GJ6J7m6J3K6k7k6J7K2k1j7J6J1j4j7L7Jl1j5J1J9Jm6M2m2L3ll8O1Moj7K3
$$ 7 23 40 -6 7 33 6 -20 -3 19 -2 -19 -3 8 -6 -23 14 15 -16 -31 -20 -1 0 -46 -4 -46 -13 -16 -54 7 11 5 -12 11
3649A1j5lKJ1j3Nk7L3J3l8J8RJ4j2pQj4K0j1Opk5J6j1J5nlJ4j6nJ2pjj5K1J9m0
$$ 11 -4 -7 -5 6 -7 -2 -29 4 17 -21 -3 6 20 8 1 9 -5 15 4 10 3 -22 -6 -17 -2 -7 -10 4 -12 -17 -5 -12 -13 -28 -7 12 -28
3686b8MQOM7l8l1M8j3j2J0LJ0qRj9J9j3J6k0L6k1J5J7k0ok5K2j1j8mNj3K8K2j7
$$ -28 -24 -16 -10 37 -1 -32 16 3 -9 1 4 14 6 15 -4 15 2 18 -2 34 13 28 45 25 19 -6 16 5 -13 -17 -12 -25 3 25 8
3721Hlj6l2M8K9o0J4K0k0k5MJ7L4k9J9K0j9njK0j3Pj0O%k7L1k0lK3k1%J4J0j0
$$ 8 5 -11 -43 5 34 -26 -12 8 -12 -37 -33 -16 18 -11 8 28 9 4 3 23 10 17 7 13 13 -14 17 -3 -6 17 -4 -4 10 20 10
3756A0j6K0n2K9Npk1LL0j7RPnNj3M3mk2rnLJ8MOj8mJ2KK7m6K2qrLJ1%J1Nk1J3
$$ 10 -6 14 -38 -9 -4 -11 -32 -29 1 -16 -7 0 -5 0 -13 30 26 4 -5 -10 -7 11 15 21 3 -1 11 13 40 -6 16 8 -1 2 13 13 24 29 8 21
3796B1l9L2nlNk9JKL4ok6K7jp%k3J2rJ1pK0j3k2K8J6l1M7k2nrj0K5plk4J4L4l1
$$ 21 -18 14 9 6 11 -18 -17 -15 19 13 -13 14 13 6 6 -17 -5 -14 -3 -10 10 -3 -25 3 19 -12 35 13 8 -1 -11 14 7 4 -20 -6 28 -3
3834clJ7kj2jmJ9j7jLJ3Mk4kK9ql5J0L6k6J7j0j2Pl0M6Ok0qL2j2JJ%j7L4k1lJ2
$$ -3 -6 11 9 -3 -4 -8 11 -6 -7 -4 9 13 -11 -13 16 8 -27 -17 19 -7 10 0 -12 -5 -35 11 17 -3 -11 21 9 10 11 11 -6 28 7 4 16
3873A6J3k3PpM2m8QJ3m3PRL7k1pJ0Jj3j6K4j6J3j3J1njmOK4qj7OJ6j7NlRMk1K8
$$ 16 29 6 13 6 48 0 8 21 -22 -15 -6 31 10 3 13 14 1 -15 9 -7 6 -7 4 -1 -2 -6 0 24 16 -1 5 21 4 9 6 15 19 -2 26
3912B6l0%nK8ooMoJ5j4MMrl0pK9JL0m2K5k4kL3l0J3JokL%J7k7M1l4J2K2k5lQJ3
$$ 26 -4 -4 -9 19 13 7 11 5 20 6 10 14 5 -25 -32 -3 -2 28 -14 11 -13 -15 18 -12 1 2 -4 -6 -3 -3 14 -13 28 -6 6 28 3 0 8 21
3952B1prjJ6j8J5oJnj5RJ7k2jJ1J0j8Jj0JMMLk2RNMJj5K4mj4NJ9j2K1Kj6NJ1m
$$ 21 14 5 4 20 2 17 11 12 7 -8 1 18 -4 -5 6 16 -2 -1 -11 -10 -6 -2 1 -21 -12 -7 -3 -2 -17 7 3 -11 -6 13 1 22 24 8 13 24 20
3993B0K6m1MK0l5J2J1l0J0J0J4k5qL1roJ1k3J0J2j7j9K5j2Nk2J6J1PK8n3K6k3
$$ 20 46 5 9 29 -6 6 17 -13 -3 7 21 -4 -12 19 10 4 15 -8 2 14 -3 -22 3 -9 -4 -26 -10 1 8 36 -17 9 -14
4026a4L2jrJj5J2k3J7MJ2Pl0M6nk1%Nk3j1J2Rjpj8K1lPOj9PMMlJ0j3llK5j1k3
$$ -14 18 17 8 9 -6 6 -17 0 4 16 23 -7 39 34 13 13 18 -5 -16 -4 5 4 -3 -21 0 -3 4 10 -9 -2 2 6 3 13 0 -3 -6 19 8 -15
4066a5J8J0oJ2KJj7J8ml3K1L3k7Ok5KrK2Mqk5K1K5m3J2j1K1k0K0l5K8Jk6L4l7
$$ -15 3 13 7 19 21 22 5 23 19 -14 7 40 13 19 -6 -4 -13 9 13 5 -20 1 26 -17 -5 -16 5 -15 5 -30 -2 -1 -27 7 -30
4101c0L5qMoJ2k3J7K4J5k6mNJ1jj2J5qKj1OJ1%k1J6k7K7mj3%lNj1qKJ1J2k1NJ7
$$ -30 5 -3 1 -5 7 -16 1 25 40 14 10 15 26 25 13 28 20 22 11 17 28 28 7 23 -4 23 19 6 6 3 8 -3 -11 -9 2 14 -7 -2 15
4140A5j1ojj2K2k2LJ3j2ROJ1Rk1J2Nj3J9j0JJ0J5j4j8kl1K2kJ3k3K7PqrrL6l1
$$ 15 4 -2 -3 -15 7 -15 -12 1 -11 -2 4 15 24 3 15 20 7 26 16 17 27 42 28 10 8 -23 -1 -3 10 -13 14 21 13 4 -5 31 0
4177@LPj1jj6QJK8k0k4K2JL7l1K2j0K5l0%Pj5J2oRk2MJ5RL0o5JJ0RJ8l6mk0L2
$$ 0 3 10 -1 -2 -18 -10 -9 19 -1 -25 -3 -2 35 4 26 16 41 11 11 18 3 15 9 18 -4 0 15 24 54 -11 -10 0 9 27 -9 -13 -33 -1
4215amJ5j8%k9M1j5jJ0j5QJ9Pj0nQomRkJ1j5QmOjj9J6j3J8NL%Mk3J1rj0QRKK3
$$ -1 -5 10 -8 -8 -37 4 -11 -12 -2 -17 -9 10 17 7 2 10 4 0 9 7 18 3 11 7 13 12 -7 9 -4 14 19 22 22 26 3 14 5 -5 3 12 14 37
4257C7m2j9L8m0K5Mlj7PlM0k8j4L0k9L8j2j5kJ9l0L9j5OK7l1l0L0RK2m5KJ4mk5
$$ 37 -5 -24 14 -26 -1 3 0 -17 -10 -13 27 -1 -15 15 -14 24 12 -3 -5 14 -16 23 8 14 41 10 -20 10 19 41 -4 -2 12 8 -17
4292a7L0j4j1L3j5Oj7QJLnl3J9K4l3NJ7lj5MJ3mJ9qlJ4olKJ7k2K5k2J1ponK0k4
$$ -17 13 -1 -12 21 6 12 -5 3 4 7 2 -31 -12 12 -21 -16 1 -2 -17 -13 0 -4 15 7 4 18 12 9 11 28 6 31 9 20 13 7 2 22 -2
4331bQK9m1PLmJj2J4KJj2rkj4J8j4K9%j7JnK9k4OJ7K5l7K5k8j7K2%Ok2L9j1Oj8
$$ -2 6 35 -6 1 4 0 1 -11 3 5 6 -6 -15 -17 -31 -13 -27 2 2 -15 -14 -19 10 -14 -8 9 34 -3 22 -6 -23 -1 -1 5 -17 22 11 17 -1
4370aK4l2QMJ2k6J9k4J8QqKkj1KPoPj3nlJ5j9K4rmJ2j7kL5j9MJK2k4K1j8J8k2
$$ -1 23 -9 -1 3 15 -11 8 -16 2 10 2 4 2 -9 -7 0 -6 1 -12 -17 -20 -5 -24 0 -9 -13 -1 -18 -20 15 -4 0 1 23 -1 20 2 20 -2
4409bJ9j1%J4j6Qkk6N0k2j5oMk1PJ8j%j8JqJ9K2k7OM1n5K1J3j7j3J8joQmj3L2
$$ -2 17 6 6 20 4 12 10 -16 34 12 -3 -9 -5 -26 -19 -1 -2 -2 -20 -19 -27 -8 14 -13 -7 34 -21 0 13 -4 -17 1 0 -6 2 -2 -15 17
4447A7kjrLrJ6J7k5J1J1qk2J3nJ8j6l4J8j1K2ljk0oK7Pj8mJ9k9jJ7K1j8Mk9L6
$$ 17 15 14 5 8 -1 15 32 7 18 29 21 -1 12 7 25 9 -25 -7 -18 4 1 0 -20 -26 1 8 -10 -14 5 -24 -25 -8 13 -5 -1 -30 6
4484FJ0j2J0l3K5Oj9PJ1l0K3rJ7Rqj2oj8K6LrRLrnJ1j7Rj3PJ4k0J7J2Nm0lL3j1
$$ 6 16 4 14 -19 6 12 -7 0 11 -19 4 -5 12 21 13 1 -5 -23 3 6 -3 6 9 0 -5 6 -11 -2 -15 -8 6 -14 3 15 20 -20 -23 10 -1
4523ajM0k9qJ8k3MqJ0j0RmK0%lj3J2j5J0k4K6J3k9KPj3K7Lj8j2%k1J4MPj3J4l
$$ -1 -2 38 9 1 19 -4 0 -8 2 -8 1 -3 17 17 14 1 13 -2 8 -16 10 23 -6 -4 3 -10 17 20 2 -10 -10 -31 -17 -13 -6 -19 -5 -8
4561hJ1k2K6mMNQk2K4Ml4K4J5k2RK8m5M4m5lMK5k4RQl2K3Pj1JMk2oK8pj4KnJ6
$$ -8 3 -19 7 3 7 12 20 -2 22 26 -8 16 31 9 18 46 1 45 0 -3 1 26 2 11 19 -13 10 17 6 7 11 -11 -17 11 4 -10 -8 -13 3
4600Cj5POK5l1JjjJ9j1J1KpNok0J0J1kJ1mjK3m6L4m4K3j7K6noqRj5qL4k2J6nk3
$$ 3 -12 -5 1 26 -5 -4 -5 -6 13 2 13 15 8 13 7 -13 -3 8 6 17 13 12 35 -11 23 -21 2 -15 11 6 0 -8 1 -14 -22 12 -10 6 1 -22
4640b2L4k7J6%j4oJ9qJ5L7m7LMmK3j2KjJ0Ol7L2Pj2%j4rjK2Pk0J6kpk9J3MpJ2
$$ -22 12 -15 1 1 -13 -19 0 -8 7 44 -3 0 4 0 23 11 13 12 22 28 -9 23 30 18 18 4 -5 -6 16 23 3 19 17 10 -19 -6 -2 -9 3
4679CJ4j3j0K0Jj8oJ6qlJj5L5Rqj2k4K4PJ7kj2k1K2KJ3mj5Nk3JRPlKj5J8j1JP
$$ 3 17 4 -6 14 15 -3 -9 7 -1 -4 -3 -18 17 26 18 6 -18 6 13 30 28 16 -5 17 19 32 28 13 18 -5 -4 5 12 9 11 -4 14 3 4 11
4719A1j6j3nN0n7MK0j8J4K5rl0K6J5l8K9K7j8rrJ7lKrK3k5Pn%J3krLQl7L4k6p
$$ 11 -5 -18 -23 27 -30 -26 -6 -24 -10 15 6 -24 2 17 -21 8 35 17 8 -1 16 13 15 6 29 4 11 6 6 19 17 8 11 19 -18 16 -10 -17
4757a7J5Mkk0j0J7K2Oj8j4J2J2j2K9rMj2OJ5k6MNJ1K2j2jj5Kk1NK1k6jmJ3J2r
$$ -17 -2 2 0 -20 -30 -13 9 15 -3 -17 -5 7 -5 24 15 19 7 13 28 2 6 11 22 44 32 31 16 18 -3 2 23 -3 -4 -8 5 17 8
4794HK%lLK0m3QpJ6lj9K6k3mM5l2jL3l4LJ5kj1K0k6K2Pk3J0JPj0NqPLj0pNRom
$$ 8 10 10 7 10 30 -13 -5 -12 4 1 -18 8 -15 -19 26 -6 -7 26 -8 -5 10 8 -3 17 -9 13 20 -3 7 8 15 5 10 2 9 12 2 -5 0 9 3 -1
4836amK4j9J5qJ0Ll6J4j3J3qpJ7k4J0L2k6kOjL0j9QLK3j9k4M3j8J5k7j2mOL0j7
$$ -1 -5 19 0 15 7 17 20 -16 -2 -15 -2 -10 -17 0 -24 -14 18 -8 -10 -4 -5 25 6 14 17 40 21 -3 40 22 37 10 -2 -6 0 30 13
4873A3j4N3j5l4J1j%j2J7l3m2M4J7J0rj5rkL2jpj7J2J3j6nrL2jj9K0m4P7k0Pp
$$ 13 -1 52 37 3 14 13 13 1 18 -15 -57 -13 4 14 5 -10 -19 -21 11 10 3 -14 -2 11 -5 -10 -19 13 12 -7 13 -31 46 26 33 26
4909B6l2J6Oj9J2k3K3k9J1J8Rkj3j2J8j9Jj6LpJ1MKJ1nK0j1J4j3mKJ8j2j0qJ7
$$ 26 -6 10 16 -3 9 -14 9 -20 -9 9 18 16 3 -9 9 -10 -9 -25 -22 -29 -18 -14 -12 -1 -6 14 3 17 4 0 2 20 8 -2 -10 7
4945Gk3RJ6QpQlJ3k0j5J8J2l2K0J7o0M6k2kJ6k2J4LMmk2K1JJ9k5jJ0m8M4j1K7
$$ 7 -16 -7 9 17 10 18 15 28 8 -7 11 23 -9 11 28 -32 14 -8 -10 6 -16 -2 1 5 1 -21 0 1 20 -5 -6 4 -44 0 -11 16
4981A6k9M3J5p1K9PkK2n1K9J0m9J7J1Oj6L8Qj9J3k9L2k2J7k1Pkj2nJ2k8J7mrM6
$$ 16 -13 30 45 -26 3 10 8 30 -21 8 18 -31 -14 -3 3 -13 25 33 14 27 -2 30 8 25 4 11 9 -3 -8 4 -24 -7 -11 -20 26
5016B6j3j5NmK2qrMMj0J0Qj0J2k2M4j9J0l3J4j7j8J4OJ5l0K8m0M5ml1M1j2l2J7
$$ 26 13 -2 3 -1 21 13 4 8 12 2 12 20 10 22 0 44 25 35 2 16 -1 -19 -5 1 16 -14 14 -26 19 15 -16 25 13 -19 -2
5051bnj%k0JK2rjRJ6k1J4kK5lrj2Mk6L3k3J7oJ0j3j5K8J4k9k7L7j5qL4pj7KOj
$$ -2 -7 -8 -8 -28 -27 -5 -14 -15 -6 10 -11 3 1 26 23 14 2 6 -20 13 -10 7 1 11 -2 -17 11 25 -4 -31 6 -9 -17 17 10 -7 -5 1 0
5090@MOmk2N8o1PoK5j5j1j0RJ2oL5lj8j1K3k1J9Ll3J1nJ9k8J2K5nk5J2QJ0J9k2
$$ 0 4 10 6 -16 42 -19 -12 -18 7 -8 -19 -29 -20 -8 -14 21 18 0 -11 12 -9 10 13 -20 -9 -14 5 -23 -11 14 9 -16 -4 4 14 33 11
5127A1llkj8Pk4J1K3J0j2OjOMoLj6%j4QLNJ6mKoK7Nl2nL2Nk3j4J1ok1K5kl4L4
$$ 11 8 5 3 -15 -8 -32 -21 2 12 0 6 5 11 15 9 12 -4 -4 -18 -10 -7 -2 14 10 12 6 33 38 6 1 33 38 15 1 12 6 -15 10 8 -26 8
5168HRlok7K1Lj8j5K0KKj3K1l2LJ5%LJ1nK0k3JJ2r%j1MK8jMrk8K5rL7rl8NJ8J0
$$ 8 17 14 8 -19 2 5 -13 -28 -8 -6 -4 -17 4 -28 -25 -10 -10 -7 4 -1 19 -4 -3 9 0 0 -11 -7 21 20 24 15 -13 12 3 40 31 -7 -2 16 26
5209B6j4j9J5LNnj0lk2L4j1l2L0%J0l4K7Mj4J9k9J5QJ8%k5L6k5nJ6JolmjrJ1o
$$ 26 12 -7 8 11 16 11 1 -2 -24 10 -1 -33 -3 -3 7 -27 0 4 -10 9 -20 -5 3 21 21 -4 32 7 2 18 19 13 10 6 5 -4 7 1
5247AM7o5K1j1J8k4NLJ9j5oJ1j8L7j9J3k7RqK1k5kJ4j8%%L1Kl4N3lm0L0qPk6L7
$$ 1 48 -17 4 -7 11 -13 -8 -5 14 -1 -7 4 -14 23 4 17 -10 -1 -9 12 -13 -15 -1 -19 -19 -19 12 14 -20 33 30 -10 20 12 19 -7 30
5284C0J2n0J6K6k4jJ1mrKmm2M6j0Qk0K1pJ6l1NK6kj3JmJlMrJ9j0J6j0mK1l4K3
$$ 30 42 -8 8 34 10 9 20 16 7 9 5 -37 9 -1 7 -13 8 1 17 -14 -9 17 15 2 3 -1 0 -3 1 -8 11 1 17 7 3 24 -10 13
5322A3j7J5J5j9PQNj4Rj5J9J1l0kqj4J9k0K2j9J5%J8k9Rljk1JK7j9K1LJ%J0l4
$$ 13 -4 11 26 7 14 22 27 13 22 7 26 37 7 5 -3 -17 2 -18 4 -15 0 0 18 -11 -2 -5 -6 -27 -26 1 -18 3 6 7 7 17 -17
5359a7PJ2MrJ7k3kK0K2k9J3mnj2L0k4MJk9L7j4J2jj3k0K6k1K8nj7Pj0k1L2RlR
$$ -17 -10 2 6 -3 14 -9 -11 9 31 2 15 11 6 -6 24 0 4 5 -24 13 -1 11 10 -3 -23 3 -18 10 5 -12 -5 -15 -36 -4 5 2 11
5396A1j3QOj0MJ1k2K0oK1j6j0kK7j0J2Jj9j2OMj0jPqPJ2Ll1jMKRk1J4j1mK9J2
$$ 11 -2 6 12 2 6 17 -5 15 9 30 14 4 2 29 19 31 32 13 1 7 11 1 0 7 -1 6 18 21 -10 -11 -7 -5 4 -17 -3 -14 -18 11 23
5435B3Jrj8QnJ6j0jJ8k7NPJ9qj3nj9M6k0k8L0pk3%J0j9M3j0j5K9l9mJ1J5nnRk2
$$ 23 24 15 -3 5 0 16 6 5 23 -4 1 8 27 19 6 1 -18 28 8 -20 10 3 -20 -20 -10 -29 14 4 -11 18 -21 -25 -14 1 -4 -9 0 -22
5473b2mL0k2J8J0k5J1J1J0Mm6K7pK1lj0LJ0lK0m7qJ8qj3M7j1Jj6Ok9J6K5k9J0
$$ -22 -26 4 -18 0 10 -15 -4 7 17 21 -25 2 -5 16 13 3 6 16 13 33 -14 -22 -4 -12 -25 22 11 12 -4 2 -27 -11 14 -15 -5
5508eMk2J1%J6j6mJ9QrjJ9j0j8J9Lljj2%J7J1j6j6mL9j5j5J2Mno%J6j9K0lJ4k0
$$ -5 -1 -23 -12 -12 4 -12 -16 3 11 2 1 20 10 -8 11 14 11 10 -2 -2 15 26 10 -6 -10 29 14 -1 11 15 10 4 4 20 1 21 18 32 12
5547A2J4l5nqN0k6J4poj6OK9l7K6j6j3lJ1L5k5LQJ3j5K0pj0J7l0K2j3qK1nj7O
$$ 12 26 -9 -14 -22 28 2 16 9 3 -13 -7 22 -15 11 -5 -18 -21 -10 25 0 3 11 24 9 29 22 12 29 -1 21 8 0 21 16 -1 5
5583EMj8K8j4Ok4J7pk3K0K9m5L2j2j7J7j7L8m7L0NmQlj0J7rnmQK0kk8J6Lll9O0
$$ 5 9 -9 19 5 11 -13 4 -3 -26 -6 23 -22 10 -2 -19 -2 -19 19 -28 2 7 3 11 8 -2 15 6 1 -3 5 25 23 -5 11 14 11 -28 32
5621C2qj3j9K3pJ1j7pKKj3J9j6PJ0j5J2kj5nKJ0J7Ojk1lK5nNrojQRj6K0j8J9j
$$ 32 24 11 -8 15 8 19 2 -5 -3 -1 -14 5 -11 -4 6 -9 3 1 -14 -19 -17 -7 10 16 15 -6 -9 16 11 16 7 1 0 8 17 1 21 3 22 21
5661B1%qj%k2J4j4J1Mpj5nK9rJmJ3kj6M8j5k7oJ2njLMQnJ0l3M2J4j9j2K8l4PJ0
$$ 21 21 13 12 12 -10 4 -10 1 5 -2 -17 -22 7 -2 -1 -5 8 6 -10 38 23 -4 -10 2 -3 -4 -1 3 11 6 16 -17 25 39 20 8 36 2 9 19
5701A9j8j1K0k0JK8J1k5J1nmLj5Nnj0J7k3J1JQj8LkjK2j4NKJ6j1K3k9RJ8k5Pj4
$$ 19 1 -10 10 -10 -9 19 30 5 16 11 7 10 -5 0 -5 -15 2 -21 -10 -9 -1 -19 -16 -18 -19 3 -11 -6 -4 12 1 24 -5 4 22 -3 4 -10
5739a0LJ2K2k0J9Mj3j3K9k5J5l2LJ6j8Qj7j1J9rJlOK4oJ0k6J6k5K8J2oOj7rL0
$$ -10 -7 5 27 7 26 30 17 4 33 8 23 -9 -6 10 -8 0 -17 -28 -9 -18 -17 -20 -14 10 4 14 -12 4 -21 7 19 13 19 2 -7 23
5775B3l4L5j1J5j8KMJ3k4K0j3oOmj0M8n0QJ1j4J4rj6J1rJ4j6MQl5K3k6M5J0J0
$$ 23 -11 24 13 28 10 12 16 29 5 25 12 6 12 8 -2 46 -4 4 15 1 15 6 -10 1 -8 6 -10 -6 2 -33 -10 -36 9 19 29
5810B9j2j3MPpnQoK2k4L3J1m2L1m1J4JoRJ1j3j2j6K2k2J9Ol0L3k3oK3j7mK8np
$$ 29 17 4 8 15 8 3 11 5 27 3 36 47 5 36 -5 9 10 4 13 24 11 -1 -17 5 -17 2 8 -22 11 -12 -18 5 -12 -16 12 7 0
5847@mjoL2k5K4k6J7pK6l9jL3mNk9PORolmK8k2J4j7j4j4J6j8M3jk3K5k6QQj8R
$$ 0 -4 -5 -11 21 -4 20 -6 11 4 30 -9 -10 23 19 24 -5 2 8 17 11 8 4 32 10 24 7 -7 -21 -5 -23 20 19 -4 21 -5 3 11 -7 2
5886Bj6J0pJ0kK5j5Ql4L5j2K5j6lJ6j8J3j9J0%j9L1m1J8k0N1k4J0l4K4pj5J5m
$$ 2 -14 -4 -11 -1 -3 22 7 15 -19 16 4 29 13 10 26 8 21 2 12 12 -7 24 -17 1 -19 32 8 18 -16 8 1 -14 1 -3
5920cL2n5M0k6rPJ6Nj1KJ0j8L2k1J1nJrpJ5jj2pNK3Kj3L5n0K8j7J8j2%Pkj9J7
$$ -3 29 -26 14 -12 -21 -14 2 7 -4 -2 8 -10 22 1 12 7 8 -1 -8 7 6 -6 -13 -8 15 17 4 39 -11 17 0 18 6 6 13 11 -8 9
5958Ik1lK8j0oJ2j9K6k1oJ2L2k8J5j4qkJ9J2k5PkJ1l7lL2K3k4K0jk9J7k4K4j1
$$ 9 -12 -15 13 3 -3 9 -10 16 -5 -11 1 33 5 20 6 -2 -4 15 27 2 9 7 18 -19 -22 10 33 9 29 28 -1 16 -8 16 5
5993ELj2K3pj4j4j9M2j1%k5K1qJ8J1k3OJ3j8mM1ok4qJ7J6k0J6Lj4pLLJ0mQJ3q
$$ 5 8 -4 19 12 -2 -16 -35 7 -4 -4 -29 -8 -16 2 13 -10 -4 9 -9 -13 28 22 -2 -10 7 23 3 19 22 8 1 4 7 17 13 21 34 26
6031B6npq%j0kK4j5nJ1mj4j4K1rJ4NJ3jj7okmmqJ5PJ5%lj5J9oPkrj0L0k5Nl0K9
$$ 26 21 14 6 6 -4 -6 18 3 -2 9 5 -9 -23 -2 -11 3 8 21 20 3 -3 -5 -9 -13 -21 -6 1 16 16 13 -2 17 11 18 16 7 -3 27 2 7 -23 6
6073FLnMj4J0K5l0Rj5MK2l6K4J4k9J4k0KOJ9j9%J5M%k1qK4J2mj7Kj6N5l9kK3j2
$$ 6 9 4 8 -6 4 29 -1 8 -7 -3 19 -17 7 21 -8 6 -14 -12 -6 13 -6 -6 9 13 13 -8 -16 8 20 16 -1 1 -15 40 1 -1 22 10
6111A0j6RmJ6jLl1K5NnQpJ0j3jJ2kk9J9o%Mk6J0J5k5j3L0MNJ3J7l1J6l6J1j7o
$$ 10 -6 3 -1 15 14 17 -14 11 16 11 19 12 22 9 8 20 18 -11 8 2 2 6 -20 -10 5 -20 -33 -3 1 6 19 36 5 21 -15 -4 -21 -27
6149b7K9J2j6J7rJ1jJ6l1K6rLlk6J6qJ1j6kJ8j3oj6K5QLmqj2NJ1J6l4jjJ5K0k8
$$ -27 2 14 -2 15 6 17 16 32 1 27 18 21 18 -8 8 0 11 -5 -7 11 -2 -8 -24 1 9 12 8 0 -12 -7 4 20 -14 -15 -16 -1 19 -9
6187iM1l1J2nLpNlMJ5l0K3J2qpOJ3l3M2k1k8k6L1klJnJ8j6j2jJ7J2mQj3JJ1j9
$$ -9 32 1 13 8 11 4 9 6 10 25 -5 18 30 22 15 21 34 1 43 22 -6 -32 -1 -3 -6 -5 -10 8 -8 -20 -21 -4 8 4 12 -1 0 11 -8
6226hJ5K0m3K1K2j6LQj2j1J5RNjJ1j4j3kKqoJ2K6k9mL1l4j2RqKK4k6jLKJ6k0j
$$ -8 7 27 -16 5 27 11 14 22 10 -1 14 23 28 27 38 24 11 9 11 3 -3 9 35 6 2 33 -1 -13 -4 -12 -10 14 -12 -13 -10 -8 8 -12 -13
6265a3K4kk8M5l6L4j5j3KK5J1Mk4J8j5j3K3J1k3k0RRQll3M3lk1pk1M4j5%k6oM5
$$ -13 11 9 -19 26 -10 24 9 -4 -2 23 34 38 14 32 17 4 27 38 15 -5 4 13 21 18 -15 28 25 4 -3 -24 20 5 5 -21 -27 18
6301A8kl8K9mj4Rk2L2K5k9Kk2J7M4l6PLmMPl0JLMnJRPJj2J4k3J0k0L5m3J7rnL4
$$ 18 16 -22 7 3 -11 -2 -24 8 33 4 6 -16 1 45 9 16 19 15 19 26 -4 -3 0 4 -1 0 9 16 17 5 19 -4 6 -14 21 -22 -5 -14 -19 15
6341A5j7Knl0L3k3L3k5J0J3NrLk5K0K1k8kKL6j5j9M8j1j2JLj9QPk4LJ5m5M2lN
$$ 15 -2 0 -5 -35 -2 -25 8 -17 -7 6 11 2 5 -20 0 21 -7 -9 -7 29 14 -5 43 32 20 21 24 5 13 20 -4 -1 14 -31 11 8 13
6378A3Pk1k8L7k4K3%J0l2M5j8m1KL5jK%J2k5K7qj4jK2Rl2rK0njK9k2J6l2J8k0
$$ 13 20 -1 -29 8 -16 7 7 17 -15 30 12 -29 -27 8 7 9 9 21 -4 23 15 1 0 22 31 -1 -10 10 5 4 33 11 27 -5 13 -7
6414gJ2MRj6l2K6oJ7j8ORPOl0J3kLj9L4j4K1l0K4RQj7J0k6K0NRk6J4J5j6MK3l0
$$ -7 5 9 18 2 -30 -4 -10 7 -11 -5 4 11 17 -13 0 -2 1 -18 16 2 23 -7 17 26 34 17 27 1 21 26 35 9 23 38 22 26 49 19
6452A9KrJ5m2KRj3K2j1QqOoj1%MJ8k7L2K0n7L6lOkk4J8qPK0oj7J7rK2k6J0J0p
$$ 19 21 12 27 -15 -13 -4 -17 5 -6 2 -6 0 -6 -17 -17 -13 5 -22 10 30 -27 9 6 12 10 -14 4 -4 3 23 17 0 17 8 30 4 14 24 17
6491A7pmpLK6pnk2nlK2j7j4K0QjopPj1oJ7NnK4k3PJ2k5K0Okj1J2nj9J5K5j5J9
$$ 17 10 6 -1 2 28 21 16 -6 -11 -14 8 -9 -23 -3 5 4 -2 -9 -2 -13 -19 -2 3 -2 22 -1 6 18 -7 13 19 17 6 18 13 -6 9 34 19 38
6531C8m2K0Jj4J3OLJj3J8j2qqPmpQj9L3m7M8l9K3LMk7J8lj0L7j4k6K4J2j8KJ9
$$ 38 -4 16 17 3 16 22 25 26 13 31 19 11 3 10 6 -1 7 -12 21 -26 22 -17 6 9 13 -14 4 1 -9 28 14 -12 12 24 6 8 27
6568B7kl3lKL1oJ1j9j5J8kj0JJ5RMj9l7M5J0pqOj2j5LM3n7J2QJ8jj9PQjj3j7M6
$$ 27 25 -8 -11 -9 22 16 27 8 -7 11 9 -1 0 15 24 28 9 -28 17 27 20 12 18 6 -9 -6 37 -20 -8 0 18 17 -2 5 13 12 -1 -18 28
6607B8m2K5nL2j3nJ0k4m%pKM6l6j%j8J0J8l0K0j3K6Ok0j8j5J8j0K4J6k3lK1j0
$$ 28 -14 11 6 38 25 20 30 6 2 2 -5 -3 43 7 6 6 -12 -2 16 -14 6 -7 19 25 5 -13 -28 -10 -20 4 20 -3 -6 15 5
6642ENkj9L1j6J5j4olM4m5K7Rj1j0j6K4LJ%j2oj1J4Nk9M0j8l3PMJ2J7j4Oj1L4
$$ 5 10 8 -11 20 4 19 5 -1 -4 40 -5 22 31 20 10 -6 18 21 22 22 10 4 -7 7 12 -17 23 5 -28 -21 -17 -5 12 -2 4 -7 27
6679B7kl8L5l5J2NK0j4Kk6PL1j9rK6k7K2Jk9L6j0Lk6K6ONj3%j2Mk8J4J4j5J0o
$$ 27 25 -13 22 -13 -1 4 24 10 12 -14 -7 24 5 -4 22 -5 17 18 -11 25 15 18 -8 18 24 29 16 16 4 8 -20 -6 8 -7 3 -3
6715cKl4L7%J6j1Mq%J1m8N2J4l4k3J0PK2kKnJ9k5J3N%qOk9K3k7J5JLKPk4J1k0
$$ -3 -1 -35 2 2 18 7 11 3 3 14 -34 18 32 -2 -25 -15 -8 14 12 14 9 28 3 16 21 21 13 19 -10 13 -14 1 2 5 7 14 -10 1 -19
6754a9lL4j4j5NK6j6J7l3L2j1J5k3k1K0pK4j6L8k3%oLK4j0l6L7qj1J0K0j3oj4
$$ -19 -22 12 -2 -17 -12 14 -2 15 -18 14 3 18 -5 -26 -6 -13 11 -5 33 10 10 4 7 31 21 -15 22 14 3 13 33 20 14 0
6788@pK7l1MJ2l5L1pPjNk1J1K0j8j3K3rqK6k3LOnL5j8LrJ0j0j1J8j0LK4l5J3k0
$$ 0 -7 20 -11 -7 5 -30 1 -6 1 0 5 -16 -5 15 -3 -16 7 -2 -10 16 -7 -4 2 -3 32 14 17 8 18 8 -3 15 5 8 32 -3 10 -10
6826a0J0J2l8M8l4PJ1J5j5j6pJ1Llj4J7llnK4j2J5Rj9Q%lJJ7nJ6k5J9pl5L7km1
$$ -10 0 12 -26 22 -12 -5 6 21 6 -10 -17 -6 -3 -6 -20 -3 -6 -9 -14 10 -2 13 22 3 11 11 8 9 26 21 37 12 31 24 -11 26 24 -17
6864a7L1MJ3k2Rk2J8K7k1j6J9qk7J4Rj9L2j2j8Qj9lK6Plk0mJ4L1k3J0pJ8j3mr
$$ -17 14 18 31 9 18 -4 14 41 20 4 23 15 -12 2 11 -8 24 12 -6 2 -17 -20 6 13 10 -10 -14 0 31 8 18 11 29 16 12 3
6900CK6k4j4K0%j0RJ7k1OMl2K9oj7j1K2J0J6l5Lj7M6k0KqmJ4m8N0Pnj9K2j0K4
$$ 3 29 5 -9 11 11 1 10 27 6 12 16 -16 13 7 -10 -21 1 11 27 -8 -5 -22 24 4 6 -2 -6 8 -40 10 17 12 -7 15 5 29
6936B9m3J4lMK6Kl0J1JpopK0Pk2J1pJ7k1k%Rj6Oll4N6j7Nj2J5j1j2JK8pk4L6j2
$$ 29 -14 0 -3 1 27 29 -1 10 11 4 -2 -9 11 18 -4 7 0 17 -4 -6 -6 3 -13 -7 -10 -44 12 -5 0 -12 3 -8 -20 -19 9 2 -22 14 2
6975BmJ3J1J3l6RPl5L2rJ3j3pj7J7J1qnJ6LMljJ1k1lkK0m3J6K3k3J7J1k9PK3j8
$$ 2 -2 11 22 35 -1 8 15 -20 12 3 16 3 -4 -21 -4 7 -1 -6 10 13 17 14 13 24 3 0 -2 18 -25 -9 14 -9 8 19 -10 -3 20 2
7013BK5k5K6l5K9k3oJ8jjNKj1pmK3j0J1k5K2Nlk4J5NJ5k9K6k6KJ0on7L5MJ2J4
$$ 2 27 2 28 -7 22 -1 -7 11 10 9 14 16 5 -2 -6 17 7 18 -7 15 20 17 -7 8 13 28 -1 25 -1 1 11 5 -52 -17 -13 -1 13
7050A3l6L4j1J1Kqj4K1j8oL6pk0MK3Jj0L5j3k3L1n7K6j3LK5j8k1K3jj1K8j6j0
$$ 13 -23 11 0 11 13 5 -9 12 -6 -12 24 17 -3 1 24 25 15 50 37 14 45 -12 14 1 4 29 11 -10 13 12 1 29 13 3
7084CpJ2k5J6JqJ4oQMj7J0J6ok5L0pmlkJ3j4L5l4KJ8j0k1K8k6RnL5o%Mk3k4J7
$$ 3 -4 8 -17 -1 0 -8 6 0 8 12 -5 5 21 15 -10 20 13 9 6 4 17 3 38 4 6 24 14 -7 21 -5 4 -1 34 28 28 32 9 -15 2
7123Bj3J2K3k6K8k7Rj2pJ9j2J6Jj5LJ5k4J3J0pRl9K6J3j5MJ9l0L5oj8J5k7QOr
$$ 2 -11 1 24 -2 26 -1 8 -4 -11 8 -4 12 13 -2 1 16 -8 5 15 8 17 -22 4 17 2 6 25 -5 30 24 6 21 -6 2 8 -1
7159aJ9k5J8QqnK6k6M%Jj1K0j0k0jJ1k1K4oj4K5lnJ6j1j4L8k8kK5nj1%njJ0J5
$$ -1 18 -7 11 19 11 6 32 6 10 10 11 0 20 10 -10 -11 0 -21 3 -3 -17 8 5 0 16 5 -9 29 1 -1 24 19 8 8 3 2 12 27
7197B7k4Oj%LoK3j3J7j5rJk1N0j7k0ORk8kLJ2j3K3LjNj6MnPrRomK3%l5L3Jl3M1
$$ 27 3 9 8 8 11 5 28 15 32 17 8 9 -12 38 21 1 7 16 -12 -14 -11 1 -12 11 14 13 18 2 6 1 8 -1 8 2 -2 21 21 -14 19 20 -13 28
7239B8j7K3l4mK9k6K3k3K1Kn2K7OOrJ9j2J9k6M2l6j0J3K5l6RoJ2lRqL9o0K4qP
$$ 28 11 34 0 -4 25 -1 22 -1 20 22 -30 -3 3 9 0 19 7 26 0 42 6 -4 9 34 -2 7 1 13 10 19 11 50 -10 14 6 13
7275A3j4j0K8QJ7k0mj4K1k4K6k4qJ2j1j5L6m5K5j1QMQrj5J5J1k3J4J9Pk8M1m4
$$ 13 -1 -11 17 25 42 22 18 4 25 1 27 3 -5 7 -4 -19 17 -28 -3 -14 -6 -2 6 -3 -18 -3 8 -15 -1 18 25 -3 38 -6
7309fRlOpJ0j0NMjjJ5k3J5KNj8K%kK6l9J9j1mlqK7qQj5JNLj7oM6l1J7Kj9JpK3
$$ -6 3 0 6 -1 9 -1 4 8 7 6 21 -2 13 15 20 2 4 4 2 28 -11 8 -3 -7 -10 -18 9 1 9 -6 -5 0 3 -14 -20 26 -5 12 14 -5 -4 -11 12
7352A2NJk6J4k7N4j1nk6L2k2J8Omkj6JqL4j0l6J9J4nllj3J3j5j3K5J4qjk7K3K
$$ 12 17 18 -8 6 -21 33 22 17 -9 23 1 19 25 21 19 3 4 -4 30 20 -16 3 17 12 9 6 -7 6 -9 -22 3 17 9 8 -19 4 6
7389FNoj7J1K5Nk9K6k1PMJ8Kl4K0jk2L1j0nlk3L5j1kj9K3k7OJ2pj0LkJ4J4jk5
$$ 6 11 5 -12 -1 24 29 0 26 5 12 16 34 36 2 22 21 -1 30 20 15 12 -11 24 13 11 -8 15 -12 -6 6 -1 -11 -8 -10 4 18 17 -8
7427hL1j1nQl3M8k6J9JJ4j5j7J5m8M9MmJ5l3L9%k1nJj9pj3J5J2OqJ3k6k0L6pj
$$ -8 23 12 7 15 -18 30 4 23 24 38 23 6 21 -27 22 26 22 37 4 43 43 22 17 18 -1 -8 -21 -6 6 12 4 17 -9 -29 7 0 -1
7464amjK2j6J9%%qJ1j7j9J5RJ9j2Mk6M2k2mj9JJ0J%M1l0J3j3lLqk3K7jRk8OJ8
$$ -1 -5 -6 16 0 19 19 19 11 22 5 -14 1 10 29 17 21 -5 37 15 11 -8 -7 3 4 4 45 15 28 15 12 15 7 -16 11 10 19 -9 -3 15
7503A5l2N4k8k8J0J3J7j2k5K0oJ0Kj9OK2onmK7j3rJ7qj5K8l8M0Km3J4J2k5K3j2
$$ 15 -17 37 9 -19 -9 4 21 9 -16 4 -2 8 10 -9 -3 19 13 8 4 31 18 9 26 18 3 31 -7 33 35 -8 6 18 -7 16 4
7538Dk1Nj1J4JNk5K4KNRMmKJ8l8K3qjNJ4j2J3nPk4J5mknK6l2k1L3J1mJLj3Qk4
$$ 4 -17 -12 -23 -9 -8 -3 -28 -4 -2 3 12 16 12 14 32 -6 17 9 8 13 27 15 28 23 30 6 21 17 15 10 36 4 -17 16 27 23 24 27 14 22 -2
7579bL1l7PoJ1nQk0J2NPk7J6KJ0orLnQJ6j8MmK4nk8J4OL3l1kj7K0Rk1J3Jk0J5
$$ -2 29 -8 -1 -7 4 -1 7 -13 -1 4 11 -16 0 2 12 6 -3 0 -5 3 19 1 5 1 25 20 -8 6 12 45 14 12 -5 15 24 3 16 17 -3 12
7619A2rj1kK6krpj4RK2j2j0J3jk0L1j1j4RQk2K0j1KK5k9L3k9LjRMmK1j9K6oj7
$$ 12 3 -8 -10 16 14 5 -2 -16 -7 15 3 -7 6 5 -15 16 5 -9 0 8 -14 6 -5 -3 22 -7 26 -3 0 -1 8 12 8 29 10 36 30 13
7657A3pK5m2J9k0J4j%Nj2K2k2pK7j0j6JJ5lj2RL3j5j2LJKjKrlLK3k8J9mk3M6r
$$ 13 6 31 -11 8 -12 2 1 1 6 -6 16 -6 -13 14 4 -12 -11 4 1 -11 -2 31 16 4 7 8 10 9 11 2 -1 2 25 -3 16 12 -11 35 26
7696B6j1J7l4L0l9QL1l8K7mk5J9j2kK2k3rK3Mj2okJ2rK1m8M6%Kmk3QkJMJ6Oj1
$$ 26 15 32 -2 28 -11 -3 28 -10 17 13 -12 7 -5 -7 15 -8 -17 6 10 -2 -8 -10 2 -7 14 -34 12 12 14 10 -13 -5 -7 -6 -2 14 20 9
7734I%K5qj3Qk4PqQj2J6j2K9j5k1J2mM3n5J4lK0l9j5K9NJ4j7K4j3mJJ7Rk2QKn
$$ 9 9 34 26 13 21 -3 4 -4 4 -8 8 -4 25 10 -11 1 -3 40 -15 -1 -4 16 -23 -38 -9 -4 10 -7 17 4 0 1 18 27 5 13 15 10
7772A0j5OM9l6%J6j1KPk0pM%K3j2kk6K4nj1J4Ll0LK3ok1MOJ1MJ4k7MJJ2j2L2k7
$$ 10 -5 1 50 14 14 30 19 21 28 8 1 5 5 28 16 14 -12 12 7 -4 10 13 -17 -14 9 3 -18 -14 -8 3 7 21 -6 -2 -1 11 -1 31 4
7811DNjJ0j4j0K7Jj3K2rk6PK3j6Qmj7J9l8mL7pK2%m0j8K2K2pk0J2OJ5lj6L6l3
$$ 4 9 8 18 4 -6 21 22 9 31 22 -4 3 26 10 18 14 -3 16 -22 -26 11 4 26 26 -14 -32 -10 12 5 -15 -3 3 18 15 -1 35 2
7848BORj2jK5j1noLkoK9k0mK1l3oL0j9J3rj0PK3l2%J5l3K0J6npK5l0J2lj1J9J1
$$ 2 8 17 5 4 29 18 13 7 10 8 2 31 11 7 28 -5 -11 19 0 13 4 -6 1 24 -8 -8 7 -26 -6 10 5 -2 23 -7 5 2 -9 10 21
7887B1nk0KK8k6J7rj8L3j1lj4J2j5M9j2nj9MJ6nJ3k1j9k1M8Ork1mJ9Pl3J8JK3
$$ 21 16 -4 -2 26 0 17 8 -10 23 12 9 -5 7 -8 41 29 24 5 9 25 20 33 12 -7 -28 20 26 17 -4 -8 11 18 -15 3 4 27
7923B7k0k0J8qJ5l6K8npK3LrOJ0j8J2jj9lJ8j4K6nj4j1jK2l5j1L9J0j7Jj4mK0
$$ 27 7 -13 5 -3 12 -24 4 -1 -8 15 18 9 15 25 7 19 18 -1 -4 14 0 26 21 7 -4 -5 17 -18 -29 10 20 3 4 -10 -14 6
7959FmPj1%K0m1JK9j9K6pk4K6j9J6JJ2OLOk0K0k2j3%j6J3jJ3koj2J3J2j4J0Kk9
$$ 6 2 9 -2 -2 18 -23 -22 7 -12 14 7 -17 9 -10 6 7 19 25 28 34 14 34 12 -1 -1 -17 -4 -5 8 6 0 -12 1 13 -1 9 11 -18
7997a8K8J0jjm6K3J4Jj4RJl5L1k7M6j8j3JJ4qRj0RJ7Kl1QK%j1L4lpRl3L7k3qJ1
$$ -18 10 20 19 18 -28 -5 9 10 -4 5 6 -29 2 -25 21 3 -10 -9 5 -3 6 -4 5 22 24 -7 1 3 3 -8 26 23 16 25 -8 29 6 -2 9
8036IJ0j3j0K2jJ0o8L4nRJ2j9L0k7K0k0lL4j2Rk4L5l1J8pRk5NNK2J4k2pJJ7l3
$$ 9 19 6 -4 18 17 27 -41 -7 -12 -3 9 -10 20 -7 13 -7 -10 24 12 21 -3 32 1 19 12 21 -4 1 6 28 42 20 13 14 31 -2
8072bK1j0j5Pj2K9nk3%lJ0K6k9j2lJ4K9j3%k6QJ3oLJJ4J3Kj3j0KJ4j4J0Mk2K9
$$ -2 19 9 -6 1 -11 18 13 -10 -10 -13 -3 23 -6 -18 -21 -7 22 9 9 -17 -9 4 -2 1 2 16 29 31 18 8 10 24 10 20 24 2 31
8109C1nj6lnQPKJKlk1Pl0L4Mm3K2K0loJ8kj0l7K9j0J2J0rJ0Oj4Rj1J6j4PlJ3j2
$$ 31 26 10 7 2 10 17 19 20 22 19 -2 5 -25 9 13 -30 -8 12 9 3 21 19 9 -28 1 -9 3 13 4 14 20 6 15 4 20 6 13 10 23 11
8149A1JK8rj8K8l0j5MJ9j7Ppj6PKPNj%l8L1lj0L3k8nnJ8NpqM1rj1KOjk6J4%rL0
$$ 11 12 40 31 13 41 11 -4 0 19 2 9 2 -14 -7 -5 2 7 6 6 -32 -1 -4 -14 19 -9 -14 -19 -1 4 -3 -11 30 21 10 12 18 17 -9 5 5 -4 26
8191B6
$$ Imaginary data points
##PAGE= N=2
##DATA TABLE= (X++(I..I)), XYDATA
0@%%%%%%%%%%%%%%%%kJ0j6J6j6J6k4L2l2L6m4M9n7O6p4Q8j04J18j30J47j67J85
$$ 0 0 0 0 0 0 0 0 0 0 0 0 0 0 0 0 0 -2 8 -8 8 -8 8 -16 16 -16 20 -24 25 -32 34 -40 48 -56 62 -68 79 -88 97
38I7k05K29k58K88l19L53l88M30m78N26n77O35p01P74q53R39j037J147j271J412
$$ 97 -108 121 -137 151 -168 185 -203 227 -251 275 -302 333 -368 406 -447 492 -545 602 -669 743
58G43j575J768j995K268k607L041l616M421n630P681j2049L7356m5960m0305J03172
$$ 743 -832 936 -1059 1209 -1398 1643 -1973 2448 -3182 4499 -7550 29806 -16154 -56459 46713
73D6713k0081p1371K9483L8852m2667N138K7231k2513p76L7429k5554k0624M4486
$$ 46713 26632 -44739 -15256 23596 -19071 -13933 13298 -9215 -9991 27438 1884 -18740 25746
86B5746m52n5451K3088M2602m3740l2158M7287J1288l8643M558K7726q054o309
$$ 25746 25294 -30157 -7069 35533 -8207 -40365 6922 18210 -20433 -15875 11851 3797 -2512
99b512R714k362k271O118o801l587P613q856j0395J5413M048j9926K060K0131
$$ -2512 7202 4840 2569 8687 1886 -1701 5912 -2944 -13339 2074 6122 -13804 -11744 8387
113H387k133j0452K637N131M980o11j3439k9J5996p835j7071J3074Q727j7607
$$ 8387 6254 -4198 -1561 3570 8550 7939 -5500 -5529 10467 2632 -14439 -1365 7362 -10245
127a0245K457J7449j0399q229J6474n21j2146J0479K254j6182Q734J2957j9950
$$ -10245 -7788 9661 -738 -8967 7507 6986 -5160 5319 7573 -8609 125 13082 -6868
140f868o565K2612l866j7902J2718P382j5122P030J2456j7902l698K2753p332
$$ -6868 -13433 9179 5313 -12589 129 7511 -7611 -581 11875 -6027 -9725 13028 5696
153E696k0217J5379J0273j8743J950J5368j1955o600J6774l485j4231J1223O011
$$ 5696 -14521 858 11131 -7612 -5662 9706 -2249 -8849 7925 4440 -9791 1432 7443
166G443j3866M231J0404j2109k238J5119o187j1361J2541L426j3791N198R088
$$ 7443 -6423 -2192 8212 -3897 -6135 8984 2797 -8564 3977 7403 -6388 -1190 7898
179G898j2545k859J3534m636j0559Q605M997o877K332L132n076M159M885j0068
$$ 7898 -4647 -7506 6028 1392 -9167 -562 4435 -2442 -110 3022 -2054 2105 6990 -3078
193c078j659J1525m839j0908Q564N448j0659O25R746l818m318O325P72l116K638
$$ -3078 -4737 6788 1949 -8959 -395 5053 -5606 -4981 4765 947 -3371 2954 3726 610 3248
208C248j984l775N443n02r715L686Q309p998m568J0552P71p943M845N597n509
$$ 3248 1264 -2511 2932 2430 -7285 -3599 4710 -3288 -7856 2696 3467 -4476 369 5966 457
223D57o11M079l229j301K360m518j265O355l452o218Q378M496r271J419R889m694
$$ 457 -154 3925 696 -605 1755 -2763 -4028 2327 -1125 -7343 1035 5531 -3740 -2321 7568 2874
239B874o097O768P36p101J987K372n273Q43L439m310N43O399l617l029Q315M7
$$ 2874 -3223 3545 4281 -2820 -833 1539 -3734 -2891 548 -3762 -3219 3180 -437 -3466 4849 4896
255D896q581M661O169q793l228Q178k330o714M711K504m596K556L097l962K192
$$ 4896 -3685 976 7145 -1648 -4876 3302 972 -5742 -1031 1473 -3123 -567 2530 -1432 760
270G60M473n793j378P657m012q038P134L934j0144j98R368l386n576N970K178
$$ 760 5233 -560 -1938 5719 1707 -6331 803 4737 -5407 -5605 3763 377 -5199 771 2949
285B949m270K437J733m010K005K744n673n20O073l792n149O482K361p046J382
$$ 2949 -1321 1116 2849 -1161 844 3588 -2085 -2605 3468 -324 -5473 1009 3370 -3676 -2294
300b294O423k893l247L570L55j987J201j285j940L142k18m572K510L712m268r78
$$ -2294 4129 1236 -2011 1559 1914 -73 1128 -157 -2097 1045 827 -3745 -1235 2477 -1791 -2769
316b769N351j373l772L649J646l800Q87J922k825O47K352l758o55N334k027m595
$$ -2769 2582 1209 -2563 1086 2732 -1068 -181 1741 -1084 -437 1915 -1843 -2498 2836 809 -3786
332c786M819K599n688Q66M882l767k468M797j087m257L394J399m528J869L465
$$ -3786 1033 3632 -2056 -1190 3692 -75 -2543 2254 1167 -3090 304 1703 -2825 -956 2509
347B509m416m94N615k337m236M818J565n309J493L736l996j067M450j981l210
$$ 2509 -1907 -2401 3214 877 -3359 1459 3024 -2285 -792 2944 -1052 -2119 2331 350 -2860
362b860L982Q06m037J942K724l478j26L553k405k147L511m77l360K262J523l322
$$ -2860 1122 1928 -2109 -167 2557 -921 -1047 2506 101 -2046 1465 988 -2372 -110 1413 -1909
378a909P90K880k505r80L366r83k242K707L06l059J892J819l577Q8L662k314k381
$$ -1909 -1119 1761 -744 -1724 1642 659 -1583 1124 1430 -1629 263 2082 -1495 -1407 2255 -59 -2440
395b440L707L81l704K015K516l298l71L390j821k328K948J6l281J856K017l160
$$ -2440 1267 1648 -2056 -41 2475 -823 -1194 2196 375 -1953 995 1011 -2270 -414 1603 -1557
411a557j51L519j481k431K809J154k917L74K308j322j265J360J12j007M08K00
$$ -1557 -1708 1811 330 -2101 708 1862 -1055 -681 1627 305 -960 400 512 -495 -87 113
427A13m36N06K41n82K48N92m30l84J05J86O7n69m95J077K60j747L09K163j185
$$ 113 -323 183 424 -158 90 682 252 -132 -27 159 226 -343 -838 239 499 -1248 -939 1224 39
446C9j833K209J150k488J55K231j246j314J840j31j652J492O69k284Q52K213k443
$$ 39 -1794 415 1565 -923 -768 1463 217 -1097 743 612 -1040 452 1121 -1163 -311 1902 -541
463e41j225L385m17l409J950K544l088r47L149p54k418J984R29k382P55J827k061
$$ -541 -1766 1619 1202 -2207 -257 2287 -801 -1748 1401 647 -1771 213 1142 -1240 -485 1342 -719
480g19o38K588q74k170K219J303k735J67K808j276k076J963R18k169M5J608j042
$$ -719 -1357 1231 357 -1813 406 1709 -1026 -859 1949 673 -1403 560 1478 -691 -646 962 -80
497h0r40J322j7j290Q20J016j161k76J428k72j301P82P75j304m33J287k54j196
$$ -80 -1020 302 285 -1005 -185 831 -330 -606 822 550 -751 31 806 -498 -931 356 102 -1094
515a094P87R07r64j34J314j92r44R25O13j346j72J164p55j158R83L56j260L97
$$ -1094 -307 600 -364 -498 816 624 -320 605 1218 -128 -300 864 109 -1049 -66 290 -970 -573
533e73J168r20l33J541k65j377J152Q39j760k15J538r55j304J457M07j494O28
$$ -573 595 -325 -658 883 618 -759 393 1232 -528 -743 795 -160 -1464 -7 400 -1094 -466
550d66J499j060m68J583j33j315Q17O62j366k18J018p70q68J053J60j067O14J062
$$ -466 1033 -27 -495 1088 955 -360 457 1119 -247 -465 553 -217 -1085 -32 128 -939 -325 737
568G37q48l50J205r5j105N02N52r00k69O76l59m89O72J17n54N49O66n55j54P92
$$ 737 -111 -461 744 649 -456 46 598 -302 -571 105 -254 -743 -71 46 -508 41 707 152 -2 790
588G90p1p87K04L59o09k83L94j66l79L55K74m38R3O34j45m94M09M00o28k53N37
$$ 790 719 -68 136 495 -114 -397 -3 -169 -548 -193 81 -357 -264 370 225 -269 140 540 -88 -341 196
609A96j73o16L55M42n38o9Q21j33n56N33M56o74q3N94l55m33M72p9p36M51N50
$$ 196 23 -593 -238 204 -334 -403 418 285 -271 262 718 44 -39 555 200 -233 239 160 -576 -125 425
630D25q75k59J221j71j123O29Q93q60m59Q41j4o16L61J12n08M46L96q61K0J175
$$ 425 -450 -709 512 341 -782 -153 740 -120 -579 262 248 -368 -7 105 -403 43 439 -422 -402 773
650G73m38j041Q59P59j051k78R38k28o31M45J27n48K12M27o51j80P18m4o27K77
$$ 773 335 -706 153 912 -139 -417 521 293 -338 107 234 -314 -102 325 -326 -506 212 168 -459 -182
670a82M28l34r8L09j21j42L61qm61J68N29l36m84M10M30m43l17L84K92l01k10
$$ -182 246 -88 -186 123 2 -140 221 213 -248 -80 449 113 -371 39 469 26 -291 93 385 84 -126
691a26J13K13j9k71j63K16K13l36l25L45L52l24k53L34K34j79q7P4Q0J21p9k63
$$ -126 -13 200 181 -90 -253 -37 176 -160 -485 -140 212 -112 -365 -31 203 24 -63 11 91 212 133 -130
713a30J10L61k58l40L08K83l30j30L09m5j33J75j54k49L48P1n53j3N92j96n45
$$ -130 -20 341 83 -257 51 334 4 -126 183 138 5 180 26 -223 125 196 -357 -370 222 26 -519
734e19L53L79l34j12L21m4q8K13n2k66K79K66m80j62N74o0n36K21M24l18k19L26
$$ -519 -166 213 -121 -233 88 44 -44 169 117 -149 130 396 -84 -246 328 268 -268 -47 377 59 -160 166
756A66l6k55J84L7l16J28K33l37j87M67J7m33J23L93k09k32L60O2k42J43J39k62
$$ 166 130 -125 59 96 -220 -92 141 -196 -383 84 101 -332 -209 184 -25 -257 103 165 -77 66 205 -57
778e7P0L02k79k21M31M2n13J68M37l57k85L87O0l43N5J46j45nJ29j88j9K84j20
$$ -57 13 315 36 -185 246 288 -225 -57 380 23 -262 125 185 -158 -103 43 -102 -107 22 -166 -185 99 -21
801b1k81K42L08k65j72K99O6j48k9P4M9O1r8j94J96J74k63j63K53Q5j89k4k6O4
$$ -21 -302 -60 248 -17 -189 110 176 28 -1 73 122 183 85 -109 87 261 -2 -165 88 173 -16 -40 -66 -2
825bK4n2j86Q7K54j44l04K21L02k51k11K21J98j06j20N2J30N3p6j12M1K40o2l41
$$ -2 22 -30 -216 -129 125 -19 -323 -102 200 -51 -262 -41 157 51 -69 -17 113 166 90 -22 19 259 197 -144
849a44J5L99l7m66OM69q6m32J01L19j55j65J16m2j5J78j11k71L19L23m10k05N10
$$ -144 -129 270 233 -233 -227 242 156 -276 -175 144 -11 -176 -60 -102 -117 61 -50 -321 -2 321 -89 -294 216
872B16P2m40J15L12j81r9J47j16q6L29j33l79K34L29l59k33L10P6k69J5R9p6J15
$$ 216 288 -152 -37 275 94 -5 142 26 -60 269 136 -243 -9 320 -39 -272 38 114 -155 -140 -41 -117 -2
895bLk61P4L61j43l26K59K89k47j53K60N9j46L3Rn7J42Kk25L1K24j25k44J69J63
$$ -2 1 -260 -186 175 32 -294 -35 254 7 -146 114 173 27 60 69 12 154 156 -69 -38 186 61 -183 -14 149
920A49j59j59R6J10j09m7M9oJ5rK4K4k1P1j2l6L8O7m2n7J35k0j22O5J15j43m1
$$ 149 -10 -169 -73 37 -72 -119 -70 -76 -61 -70 -46 -22 -43 28 16 -20 18 85 43 -14 121 101 -21 44 159 16 -25
947b5J73n7j90Q4J21j34q8J30Jj31O7M1r1L4J06j22q2K29K0j68L8J62o3o4L5M6
$$ -25 148 91 -99 -15 106 -28 -116 14 15 -116 -49 -8 -99 -65 41 -81 -163 66 86 -82 -44 118 55 -9 26 72
973G2J6J1m1o0M9J12j37j33J28Q2j34j27J21J34j36j20O3J10n6r1J1J09P0p6q4
$$ 72 88 99 58 -2 47 159 22 -111 17 99 -35 -162 -41 93 -43 -163 -100 10 -46 -137 -126 -17 53 -23 -107
998a07Q1J45q0j00O9J66n4j60M5J68o2j29%J08l1o5j4qK2J4o0j01Q9J18j20j23
$$ -107 -26 119 39 -61 8 174 120 -40 5 173 111 -18 -18 90 59 -6 -20 -28 -6 8 -52 -153 -64 54 -66 -189
1024a89J08J38j05q9R1R3n7l3N8J7M6J3r1KJ66K5k90K0L10j17k85J20K30j33k10
$$ -189 -81 57 -48 -137 -46 47 -10 -43 15 32 78 91 0 2 168 193 -97 -77 233 116 -169 -49 181 48 -162
1049a62J14P6o7o3M2l3M7M6j28l9K12Nj85J8K48l3k11J30J27j21JO6k5l8Q2Mj35
$$ -162 -48 28 -39 -102 -60 -93 -46 0 -128 -167 45 50 -135 -117 131 98 -113 17 144 23 24 90 65 27 109 113 -22
1076b2oJ21l8j25M2P7n4j02M0O1Mo7m8M6N9Jr6K0J30K8j24M0J07L7j72nK15o3
$$ -22 -28 93 55 -70 -28 49 -5 -107 -67 -6 -2 -69 -117 -71 -12 -11 -107 -87 43 71 -53 -13 94 131 -41 -46 169 106
1104A06j61M9J49j05j24J07M7p1k8K9l5J0J9q2J3R3q7j05J35J21j56k9J53J8j14
$$ 106 -55 -6 143 38 -86 21 68 -3 -31 -2 -37 -27 -8 -90 -77 16 -71 -176 -41 80 -76 -105 48 66 -48
1129d8M7J31l2j16P5K3k8k0J3k7J9k5j9J4N7p2m3K3M0q2m1M3L0n0OM4K6k8rP8
$$ -48 -1 130 98 -18 57 80 52 32 45 18 37 12 -7 7 64 -8 -51 -28 12 -70 -111 -68 -38 -88 -82 -38 -12 -40 -49 29
1159B9Km0J1N7j7l3RN9k5k8K1RK6n5l6N2Po7l0J3K3p2l9N1M8m8mM5M8n2qM8J9
$$ 29 31 -9 2 59 42 9 18 77 52 24 45 54 80 25 -11 41 48 -19 -49 -36 -13 -85 -124 -73 -25 -73 -77 -32 16 -36 -44 4 23
1192B3om5J8K6J3jk1N3L5n4JM3J0m5K1l7l8k8ll1k3K3l4J9N5OJ4l7Q9k3n1JN8
$$ 23 17 -28 -10 16 29 28 7 60 95 41 42 85 95 50 71 34 -4 -32 -35 -66 -89 -66 -100 -81 -26 -20 -6 -43 46 23 -28 -27 31
1225C1m8n0N4K1n3J7J00OqK6K3rk8%n2n4Mn1o6N7Ql6j4J27M0q2O6Q1m8j21N3M4
$$ 31 -17 -67 -13 8 -45 -28 72 78 70 96 119 110 82 82 30 -24 -20 -71 -137 -80 -72 -108 -122 5 45 -37 29 110 62 -59 -6 38
1257C8q0n2O6J6l8J9R2M3lK5k2J1M6q0j02K7L5j63q0J50Rj44P4J78n2p0J08O6
$$ 38 -42 -94 -28 -12 -50 -31 61 104 101 126 104 115 161 81 -21 6 41 -122 -202 -52 -43 -187 -113 65 13 -57 51 117
1285A17p0l1J2k8j1o7k4P2M6l5k2J30R4r7n7J25J9j78l8R5m6j25k2R5Ko8PJ20
$$ 117 47 16 28 0 -11 -78 -102 -30 16 -19 -41 89 183 86 29 154 173 -5 -43 52 6 -119 -141 -46 -44 -112 -105 15
1313A5K2j01K2J14mj12qQ9jp6j7O4Q7o7p0J20J29j29j18J16J10k15j09J90J3j94
$$ 15 37 -64 -42 72 68 -44 -52 37 36 -40 -57 7 94 27 -43 77 206 77 -41 75 185 -30 -139 51 64 -130
1339a30J1J71oj19j2J14L0r4q5N4J13p0j70J24J43l4j36J27J76r9j44J12J18j67
$$ -130 -119 52 46 -73 -85 29 59 -35 -120 -66 47 -23 -193 -69 74 40 -96 31 207 108 -36 76 194 27
1363B7j25J00Q0j44r2J51J25j46m3J36M8l3p6j6Krq4r0P7N2j18M6K36p1r7K17
$$ 27 -98 2 82 -62 -154 -3 122 -24 -67 69 117 84 8 -8 -6 -15 -99 -189 -112 -60 -178 -132 104 33 -64 153
1389A53J62j84j57K16Pk38j05J32J4j19l2N6J48Mp2L3K16o1k37M4J89j76k78P0
$$ 153 315 131 -26 190 197 -41 -146 -14 0 -119 -151 -95 53 57 -15 18 234 173 -64 -20 169 -7 -285 -215
1413b15K22j34j68J45K23O0j45N6J64P8j55j01J14m6j55p7O5m0j8M4O2L2oP2P4
$$ -215 7 -127 -295 -150 73 133 -12 44 208 286 131 30 144 98 -57 -134 -69 -109 -127 -83 -21 11 5 77 151
1438A51k9r5j5P6j04j81J7J26j21r2J81J42r4k7K57R1j72q2J48N5j50k65M9K36
$$ 151 122 27 12 88 -16 -197 -180 -54 -175 -267 -86 56 -38 -65 192 283 111 29 177 232 82 -183 -134 102
1462A02o8l04P2L52jk97P9K89l1k38l9J84k2k39m4J14O8j20q6K14R6j17j3J90
$$ 102 34 -270 -198 154 153 -144 -65 224 193 -45 -84 100 78 -161 -205 -91 -23 -143 -229 -15 81 -36 -49 141
1486A41M3j29l0N6M4r8n1j6L0k3j7P6k3m9P9P7r7j45J49J06j44j52R8J42q0j31
$$ 141 184 55 25 81 125 27 -24 -40 -10 -33 -50 26 3 -46 33 110 13 -132 17 123 -21 -173 -75 67 -13 -144
1512a44M3J56nj25k3K10K2j91m0K06P5k30m5K10M0k09m5J65N4j54j02R9J11p5
$$ -144 -101 55 50 -75 -98 112 134 -57 -97 109 184 -46 -91 119 159 -50 -95 70 124 -30 -132 -33 78 3
1536Cj19J2J43Kj04j7J10N7j18JQ1Pq8OM1l3k5N1L0o4L4Q5k4k8K5l8m2kMj8o4
$$ 3 -116 -104 39 41 -63 -80 30 87 -31 -30 51 58 -30 -24 17 -16 -41 10 40 -24 10 95 71 43 68 30 -12 -14 -10 -28 -92
1567i2L8j9J8M1j6j01J30J03q5j05J49O1j54m4J03J9q5j5K7O6J6Mm0P5K2m4p0
$$ -92 -54 -73 -55 -14 -30 -131 -1 102 17 -88 61 122 -32 -76 27 46 -39 -54 -27 39 55 59 19 94 116 72 2
1594BN1lq3o0O3J3j19L4P3j5j1L0N3k8MK0Rpk7J9m0JJ4j9J5N0Pj2L4OnnK1m6l8
$$ 2 53 50 -33 -93 -30 -17 -136 -102 -29 -44 -55 -25 28 0 4 24 33 26 -1 18 -22 -21 -7 -26 -11 39 46 34 68 74 69 64 85 39 1
1629Al8L1j5p0J3K3L5k6K3J5K4j2oM4ml4j4K0m5L9j5NNM6J1j4M0L7r9K1N3p8m3
$$ 1 -37 -6 -21 -91 -78 -55 -20 -46 -23 -8 16 4 -2 42 38 4 -10 10 -35 4 -11 -6 -1 45 56 42 82 119 20 41 94 16 -27
1662b7kJ5p0j2N9Oo3R2Mm8P1M0n1K3ll5p3P0J4p2J3R7J4o8N6N5n6l2N0K1o4m9
$$ -27 -29 -14 -84 -96 -37 -31 -94 -2 2 -46 25 65 14 37 34 -1 -74 -4 10 -62 -49 48 62 -6 50 105 49 17 67 88 24 -25
1694b5k2Nj5k6j4M8N4n6k7J20P1q2m4R1Qj15k5N5j1n5J8O5mKM7j9P4l3m5NM1m6
$$ -25 -47 -42 -57 -83 -97 -49 5 -51 -78 42 113 31 -13 78 86 -29 -54 1 -10 -65 -47 18 14 16 63 44 118 85 40 45 86 40
1726D0j09qM8o2q0N9J08l8j2R6N0n0kM3k3m1j5n6K7Pn7pQ6J4j5M2Q2k4m9L7K5
$$ 40 -69 -77 -29 -91 -171 -112 -4 -42 -54 42 92 42 40 83 60 19 4 -52 -25 -18 -75 -82 4 18 3 45 127 103 54 91 116
1757A16o3q7k2J0n2l5K2L5J7j2N1J09k2p2L2P3o1o7L3oj0o0J3K6P8l3m0J27N9
$$ 116 53 -34 -56 -46 -98 -133 -111 -76 -59 -71 -20 89 67 -5 27 100 39 -28 5 -1 -11 -71 -58 -32 46 13 -27 100 159
1786A59j13l4J02k2j37%O9o2r0M5J9KJ6L1j5O2K2l9J9N9n1q9K8O1q5j5P7K8p6
$$ 159 46 12 114 92 -45 -45 24 -38 -128 -83 -64 -62 -46 -15 -30 32 54 15 34 93 42 -47 -19 42 -43 -58 19 47 -29
1815b9J0Q9k7l7K7N6m7m4J0J3k0k8l4J8J0j1k6O6Ll8j9P9K6m7j0Q3K7q0k6O0M
$$ -29 -19 70 43 6 33 89 42 -2 8 21 1 -27 -61 -43 -33 -44 -70 -4 -1 -39 -58 21 47 0 -10 73 100 20 -6 54 58
1846E8j20M2L9o5j2K0L5L8Lm7L1M2k1p8J6N1n9p5P5j1p0KQ4M3m2L3M0K0K4m2K4
$$ 58 -62 -20 19 -46 -58 -38 -3 35 38 -9 22 64 43 -35 -19 32 -27 -102 -27 -38 -108 -106 -22 21 -21 12 52 72 96 54 78
1877G8J4m9o0K8jp1k6M1K9k7L5M9Pj3k1L6n4j2l3j9Ll6k9M9K5RMR1P0m8oL9Qo4
$$ 78 92 43 -17 11 10 -61 -87 -46 -17 -44 -9 40 47 34 13 49 -5 -17 -50 -69 -66 -102 -131 -82 -57 -48 -44 47 117 69 63 102 110 46
1911D6k8jl2m9k5M2j1L5j1L1P2j7k5J8N6q8q2M8Jp1j4L7nJ2L0M4N3kK9pJ2Ln7
$$ 46 18 17 -15 -64 -89 -47 -58 -23 -34 -3 69 52 27 45 101 13 -69 -21 -20 -91 -105 -68 -73 -61 -31 13 66 64 93 86 98 101 44
1944D4p7Q1m2j02O0M0k7o3R0L3p5N5O9n9k7NK3q1Jj4k1J8P6n3QP8jn1O6P1p8m8
$$ 44 -33 48 6 -96 -36 4 -23 -86 4 37 -38 17 86 27 0 5 28 -53 -52 -66 -87 -69 7 -46 -38 40 39 -12 54 125 47 -1
1976aP9Pj42K9O6p0m7Q2mm9M6P6r7K3Q6r4n7R0j5r0M4M7o9k5J31j1n7M7P4q1j3
$$ -1 78 85 -57 -28 38 -32 -79 3 -1 -50 -4 72 -25 -2 84 -10 -67 23 8 -82 -38 9 -60 -85 46 35 -22 25 99 18 5
2007EO5j2l7J7jl5k3N2j02K2O6n4k4N4K8p2QQ0k4o5O9L3q5J1N1k0m1L0J6l2O3
$$ 5 70 58 21 38 37 2 -21 31 -71 -49 17 -37 -61 -7 21 -51 -43 37 13 -52 17 50 -35 -24 27 7 -34 -4 12 -20 43
2038D3K5n4J7N2m4o8Q5L4j26J8M6p2m6O3M4r7L1M2j4lN2j1o4Q9lq7N3M0o9n1J12
$$ 43 68 14 31 83 39 -29 56 90 -36 -18 28 -44 -90 -27 17 -80 -49 -7 -21 -24 28 17 -47 42 39 -48 5 45 -24 -75 37
2069C7Mj17Q1R1o5n9J30l9p3N8pq0J5O5q4k7R1n0q0J01N4j08K5J02k0r2N8N3r1
$$ 37 41 -76 5 96 31 -28 102 63 -10 48 41 -39 -24 41 -43 -70 21 -29 -109 -8 46 -62 -37 65 45 -47 11 64 -27
2098b7J1N0n7oL6Rn3Q0j1j5LL1l8l2O4k8n4K6N3q6k2N7Rn7O5k6NK0K6m3J5K8k4
$$ -27 -16 34 -23 -29 7 16 -37 43 32 17 20 51 13 -19 45 17 -37 -11 42 -44 -66 -9 0 -57 8 -18 -13 7 33 -10 5 33 9
2131Ij1K2K2p1J6O0l1p0N5N9n3j6L4On4RRj0l2K3MMMQk6J8N1m3k5R8j9r7N8N8
$$ 9 -2 20 42 -29 -13 47 16 -54 1 60 7 -9 25 31 -23 -14 -5 -15 -47 -24 -20 -16 -12 -4 -30 -12 39 -4 -29 69 50 -47 11 69
2165F9m9n0Q0k0p9O1M9m3l4N8m4l3N0J2q1N0K1p5rQ9l1m8M1M1m6j5P9k7n5N6K
$$ 69 20 -30 50 30 -49 12 61 18 -16 42 -2 -35 15 27 -54 -4 17 -58 -67 22 -9 -57 -16 25 -21 -36 43 16 -39 17 19
2196A9j5oL2j5NL7k6m6P1j0p4K2O5m9n2N9J7p8mL3Pk5OL8n3K2j7K4L4%m6K9K8
$$ 19 4 -2 30 15 20 57 31 -15 56 46 -28 -6 59 10 -42 17 34 -44 -48 -15 -8 -33 -27 11 -42 -20 -37 -13 21 21 -25 4 32
2229C2j4l8N3lj2k5L8qqj2jK8m1%L6k4qjJ1k3K0mkk1K1m1RN6qm1K4O5m8j2K5K1
$$ 32 18 -20 33 30 18 -7 31 23 15 3 2 30 -11 -11 25 1 -7 -8 3 -20 0 -4 -6 -27 -6 -47 -38 18 10 -31 -7 58 10 -2 23 44
2265D4l4k1L6j2mK0k7LJ0j5l7M2Ok8k3O0k7MnK6m2K2K2nj4M6o9L7L0l9j7M4K8
$$ 44 10 -11 25 13 9 29 2 5 15 0 -37 5 11 -17 -40 20 -7 -3 -8 18 -24 -2 20 15 1 47 -22 15 45 6 -11 33 61
2298F1p7jN1k8l6%L0L8m5J0kJ0l9JJJ4mk2K6K2k4J0K0Kk2j7K8K3l0KJ0j2nnM7
$$ 61 -16 -17 34 6 -30 -30 0 38 -7 3 1 11 -28 -27 -26 -12 -16 -38 -12 10 -14 -4 16 18 -4 -21 7 30 0 2 12 0 -5 -10 37
2333C7k1j5L7j9qnJ1l9M2ln6J8L6l0j3L4Nl6KM5l5j2K9J7k7K5K4j1j6J5l7J6K9
$$ 37 16 1 38 19 11 6 17 -22 20 17 -39 -21 15 -15 -28 6 11 -25 -23 22 -13 -25 4 21 -6 19 43 32 16 31 -6 10 39
2366C9l2l7M1J8n7M3K3l6l7L3nk4K0J6k8RJ7j7qJ9jpM1l8k6O8k1j7J5J2j9l3O3
$$ 39 7 -30 11 29 -28 15 38 2 -35 -2 -7 -31 -11 5 -23 -14 3 -14 -22 -3 -4 -11 30 -8 -34 34 13 -4 11 23 4 -29 34
2399C4on2J5M0k4k5K4lloK7l6pN6m9kM4%l7L5kk3JL0ol8M0J6k4k9J2K8l2Pkok
$$ 34 28 -24 -9 31 7 -18 6 3 0 -6 21 -15 -22 34 -15 -17 27 27 -10 25 23 0 1 31 25 -13 27 43 19 -10 2 30 -2 5 3 -3 -5
2436ekN3o0OKnpL9m8QL0j5J3JJ7j9l3%M5Pk6J8J3m2L8J1l6nL5no6M9j7j8N0ko7
$$ -5 -7 46 -14 -8 -6 -11 -18 21 -27 -19 11 -4 9 10 27 8 -25 -25 20 27 1 19 32 -10 28 39 3 -2 33 28 -38 11 -6 -24 26 24 -43
2473d3K2J3Mk6J3K1l9O2j7k9%J9K4rK1j3k6N7k8j8Qoj2PJ9k4nPRj0j6J2j0k4L2
$$ -43 -21 -8 -4 -30 -17 4 -35 27 10 -19 -19 0 24 15 36 23 -3 54 26 8 16 10 -2 5 24 0 -5 2 11 1 -15 -3 -13 -37 -5
2508eOj8J5J1l2L0joKl1K3K3k1RJ1QNj0j6NJL6l3J7m0J3l4L7J4k2j1J9j7j3J0
$$ -5 1 -17 -2 9 -23 7 6 0 2 -29 -6 17 -4 5 16 24 29 19 3 8 9 45 12 29 -11 2 -32 5 19 -3 -14 5 -12 -25 -15
2543a5L6k5K2rj1QqK1Ll0MQK0J9m9J2j5J4j4L4j7k2K9Nm3OLJ3MOk4LK6Jrq%lJ6
$$ -15 21 -4 18 9 -2 6 -2 19 22 -8 -4 4 24 43 -6 6 -9 5 -9 25 8 -14 15 20 -23 -17 -14 -1 3 9 -15 -12 14 15 6 -2 -2 -5 11
2582A1K8l3qK4pqK5qkj2rJRqJ0l8K2j1j8J6K6k5J0J9k0qJ4mL0l3J0NJ1Rl3L3J1
$$ 11 39 6 -2 22 15 7 32 24 22 10 1 2 11 3 13 -25 -3 -14 -32 -16 10 -15 -5 14 -6 -14 0 -4 26 -7 3 8 19 28 -5 28 39
2619C9j2l8K0K9l3K2%j2j0kKj4RJ0m2J0L9qJ0k3J5l0J9Rj5j1K0J2ljNJ1J4k6%
$$ 39 27 -11 9 38 5 27 27 15 5 3 5 -9 0 10 -32 -22 17 9 19 -4 11 -19 0 9 -6 -17 3 15 12 11 16 27 41 15 15
2654A5J8j1k5J0J2nLok0kJ8j3J8n2J2K5okJJJ8rjJ8l8K6PkKkjPJ2j8k1NK9j9P
$$ 15 33 22 -3 7 19 14 17 11 -9 -11 7 -6 12 -40 -28 -3 -9 -11 -10 -9 9 0 -1 17 -21 5 12 10 12 10 9 16 28 10 -11 -6 23 4 11
2693A1J4n4L3jJ6j9K6l2KK3k0J1LooK2l1L3k5rM1k8%J9J1l2Llj0K3J2l5J1jj5
$$ 11 25 -29 4 3 19 0 26 -6 -4 19 -1 10 13 7 1 23 -8 25 0 -9 32 4 4 23 34 2 5 2 -8 15 27 -8 3 2 -13
2728a3l5K9J4nLJ5j7mML1mk5oL0j7J9pl1PK3j4Rj1lMJ2oj4PmJ3kj2pL5k8mJ8l
$$ -13 -48 -19 -5 -10 -7 8 -9 -13 -9 22 18 -7 -13 17 0 19 12 -19 -12 11 -3 6 -5 -8 -4 8 2 -12 -5 -9 4 2 -10 -17 18 -10 -14 4 1
2767Al2j8N6j1oRK1l4J4K0j2%J5l9K4OPk7j1K4Mk6J8J2qk8J0L3k6j4J6J1k5J5
$$ 1 -31 -49 7 -4 -10 -1 20 -14 0 20 8 8 23 -16 8 14 21 -6 -17 7 11 -15 3 15 7 -21 -11 22 -4 -18 -2 9 -16 -1
2801aj3J3kJ8m5L0JJRNJk1J2Jj0j6J7K2k9j0LRK2qlPPk5K2j7qpRJ2j7J6k3J8M
$$ -1 -14 -1 -3 15 -30 0 1 2 11 16 17 -4 8 9 -1 -17 0 22 -7 -17 -14 -5 17 9 6 13 20 -5 17 0 -8 -15 -6 6 -11 5 -18 0 4
2840Dj8J1L6l3m0N8K3p0M1J7j3k0l3K7K4k8j9L6Rk4%qK5j0k6J3L4k4nnJ4K2l2
$$ 4 -14 -3 33 0 -40 18 41 -29 12 29 16 -4 -37 -10 14 -14 -33 3 12 -12 -12 -20 5 -5 -31 -18 16 -8 -13 -18 -4 18 -14
2873a4L4nJ5l2K5qQm6K3L0n5J1jL3j5k9J3K5j1j0NL0m1ojL6j5j7J9RRk4jL6l0
$$ -14 20 15 30 -2 23 15 23 -23 0 30 -25 -14 -15 18 3 -26 -13 12 1 -9 -4 26 -15 -21 -22 14 -1 -18 1 10 19 -5 -6 30 0
2908@nL0Jlj1J7pJk2KL3k8l2L8j0j4j5M2Mk8LqK7j9j1NL4k6j8J1K5Nj7J1J6l4
$$ 0 -5 25 26 23 12 29 22 23 1 3 36 8 -24 14 4 -10 -25 17 21 -7 -4 -12 15 -4 -15 -10 24 -2 -20 -9 16 21 4 15 31 -3
2944cNL5j9nl3K2J9k0%k5M5k4j6RM3l9l6K2L3k0pK1pJ7l7L2Kk2kNL2j9Lk2M7m5
$$ -3 2 37 18 13 -20 2 21 1 1 -24 21 -3 -19 -10 33 -6 -42 -20 13 -7 -14 7 0 17 -20 12 14 -8 -10 -5 27 8 11 -11 36 -9
2980iK1j0L9m3j2jM0Jm2K2Rnm1K9L2j1m7J4M2l3%J5JJ5l0MJ2J4rl1J7Mk4OK4m
$$ -9 12 2 41 -2 -14 -15 25 26 -16 6 15 10 -31 -2 30 19 -28 -14 28 -5 -5 10 11 26 -4 0 12 26 17 -14 3 7 -17 -11 13 9
3016IPj8mJ3k3J6jK4j1nKjk1L1k4K1j5k2M8j5%j2K2l4J4J5l0OJ9j3rK2j2L5l9
$$ 9 16 -2 -6 7 -16 0 -1 23 12 7 9 8 -13 18 -6 15 0 -22 26 11 11 -1 21 -13 1 16 -14 -8 11 -2 -11 11 -1 34 -5
3051eK4m5L6kn7L0J2%k3N6l4j4O0jl8J4k3L2rOmk1KJ7j0l4M8j5K0k8J3j5J0Nl2
$$ -5 19 -26 10 8 -49 -19 -7 -7 -30 26 -8 -22 38 37 -1 13 -10 22 13 19 15 -6 -4 13 3 -31 17 2 22 -6 7 -8 2 7 -25
3086b5L4j8j1K3jNnj1QJk9L5kj6J0J5l5L1J8j7k6NK5qmmkj4J5j0LK9l6K5l5JK5
$$ -25 9 -9 -20 3 2 7 2 -9 -1 0 -29 6 4 -12 -2 13 -22 9 27 10 -16 -11 14 6 2 -2 -4 -18 -3 -13 -10 19 -17 8 -27 -26 -1
3123ak3M4k7%NNK4ok6Qpm0J6J3L5l0J2K2k7NJ2j5Qk9J1qK0k5ML1Mj1j0PK1Jj5
$$ -1 -24 20 -7 -7 -2 3 27 21 -5 3 -4 -44 -28 -15 20 -10 2 24 -3 2 14 -1 7 -22 -11 -19 1 -24 -20 11 15 4 -6 1 22 23 8
3160HmRk0J0k8K4lk0M4J6n0lN2k7lMK7l7k3J9jj4J4J0qKl%KL7k8k0K5j8J2j6J3
$$ 8 4 13 -7 3 -25 -1 -4 -24 20 36 -14 -17 35 8 5 9 36 -1 -24 -5 -6 -20 -6 4 -4 -2 -5 -5 -3 34 6 -14 11 -7 5 -11 2
3197Bj8oJ9oM1l9j4N1jk7loJ2l2Kj2K2%o%L1kj6J7K3Kn5J6K4k9k5K3J8Lj7J2J
$$ 2 -16 -22 -3 -9 32 -7 -21 30 29 2 -1 -7 5 -27 -25 -37 -15 -15 -21 -21 10 8 -8 9 32 34 -21 -5 19 -10 -35 -12 6 9 -8 4 5
3234E%J1LJ9pm3j0N1k7n3J7M1k0k1O7k7Mk5J8pJ1l2lj0K9l3J2M6k8J2K5J0Qk2
$$ 5 5 16 19 38 31 -12 -22 29 2 -51 -34 7 -13 -34 33 6 10 -15 3 -4 7 -25 -28 -38 -9 -42 -30 16 -12 0 25 35 43 21
3268B1qPk9m3J3K4j9QK8J7k0j7K0J6Nl1J0M4n7k0J1K9j9j4PKJ5%OL1j4m3JK6j9
$$ 21 13 20 -9 -52 -39 -15 -34 -26 2 19 -1 -18 2 18 23 -8 2 46 -11 -31 -20 9 -10 -24 -17 -15 0 0 6 37 23 -20 -19 7 -12
3303a2k6PK7k7K0j2K8J2%l1L1k0jMk5MJ2j5MJ2j9L2QLpnJ4J7rl7K5ln4MM0k7K4
$$ -12 -38 -31 -4 -31 -11 -23 5 17 17 -14 17 -3 -4 0 -25 -21 -9 -24 -20 -8 -27 5 13 16 9 4 18 35 26 -11 14 11 -43 -39 1 -26 -2
3340bqJ1k5J7J2Qj5oOmk4J0kJ3qJ0kK0nOpJ3%l0%J1jOj5NK7o6K8LM2j5j5J3K9
$$ -2 -10 1 -24 -7 5 13 -2 -8 -2 -6 -30 -20 -22 -9 -17 -7 -9 11 6 12 5 18 18 -12 -12 -1 -2 4 -11 -6 21 -45 -17 -14 28 13 -2 11 40
3379D0m9k2KJJ0j7L3RNj7k4L7qj6M1j8j8L3k4K3l0MJ1j1K4l9K2K0k8J4Jpk0j4
$$ 40 -9 -31 -29 -28 -18 -35 -2 7 12 -5 -29 8 0 -16 25 7 -11 22 -2 21 -9 -5 6 -5 19 -20 2 22 -6 8 9 2 -18 -32
3413c2rK1Nj7PM0nJj1Pjj9j2lM4m6KJ4MlnK2pNlJ1nj2k3K7K6m0kK7Jj8J8LNj3
$$ -32 -41 -20 -15 -32 -25 15 10 11 0 7 6 -13 -25 -28 16 -30 -28 -14 -10 -13 -18 4 -3 2 -1 10 5 -7 -30 -3 23 -17 -19 8 9 -9 9 12 17 4
3453DjJ8LMm4LPJ6m6K7K9l2L0k1Nj8K1j0OqrqK2j0k2qL5J4rk6L7J0l3nL3Qk1o
$$ 4 3 21 24 28 -16 -13 -6 10 -36 -9 20 -12 18 -3 2 -16 5 -5 1 -7 -16 -24 -2 -12 -34 -42 -7 7 -2 -28 9 19 -14 -19 14 22 1 -5
3491eK5j5j9kK4j4j1L5jk4rL5m1K7j4J7k1oK3k3K9qPk8M0k3pK5ok0j0L0jll7N5
$$ -5 20 5 -14 -16 8 -6 -17 18 17 -7 -16 19 -22 5 -9 8 -13 -19 4 -19 10 2 9 -19 21 -2 -9 16 10 -10 -20 10 9 6 -31 24
3527B4l5JK5j8K2l8kJ0K6k4Nqj7J4L3j6qJ6l3NL9%k4j6L0K0n3J7J6ol0L7j6%J
$$ 24 -11 -10 15 -3 19 -19 -21 -11 15 -9 -4 -12 -29 -15 18 2 -6 10 -23 -18 21 21 -3 -19 11 31 -22 -5 11 5 -25 12 -4 -4 -3
3562cjK0Ljl1K0Kj3rJ0lj3K4J8l2%K5Qj9lk5M0J3k4j2MK0n8N8j0j4KK3mj6J1k6
$$ -3 -4 16 19 18 -13 7 9 -4 -13 -3 -6 -19 5 23 -9 -9 16 24 5 2 -23 17 30 6 -6 -2 18 -40 18 8 -6 -4 19 15 -1 10 -16
3599a6M4l3l1K3M9m2Mj9K4k0JLJ4J8j0j9K5J9m0KJ8ppLj5L0k0LQj4rJ3J0qj8K5
$$ -16 28 -5 -36 -13 36 -6 -2 -21 3 -17 -16 -13 1 19 9 -10 15 34 -6 -4 14 7 0 3 -12 18 -2 1 9 -5 -14 -1 9 1 -17 8
3635H%j0qJ2Pk7L6l5QKJ0J5k0k1J9J9rj7L0j1k2J2OoM1j1m1M0j8k0j2K0qkkJ0
$$ 8 8 -2 -10 2 9 -18 18 -17 -9 -7 3 18 -2 -23 -4 15 6 -11 19 8 -14 -2 4 -2 39 28 -13 27 9 -11 -23 -3 -11 -13 -15 -5
3671eJ8j6J5k4J7J7k1j2nnPJ0RJJ3l0KK3j1%J1ll3L9j8jNk5J2J9j4Oj4OK4o3N1
$$ -5 13 -3 12 -12 5 22 1 -11 -16 -21 -14 -4 5 6 19 -11 -9 14 3 3 14 11 -22 17 -1 -2 3 -22 -10 9 -5 1 -13 -7 17 -46 5
3708ENl1J0J4rlLK8k7KLmm%K4k1J6Qm5J8J1qJ9kk0PJ9Kj1rJ5kMk3J4lk1K0k6L1
$$ 5 10 -21 -11 3 -6 -9 -6 22 -5 -3 0 -4 -8 -8 16 -5 11 19 -26 -8 3 -5 14 12 -8 -1 18 20 9 0 15 13 17 -6 8 5 -16 4 -22 9
3748IJ6j1Lj2j2olK9j8J1k9J2J5k0J3%rK3rrKK1rk5K4nJ8l5M0n2K2J3j0k2K7j2
$$ 9 25 14 17 5 -7 -13 -16 13 -5 6 -23 -11 4 -16 -3 -3 -12 11 2 -7 -5 16 7 -18 6 1 19 -16 24 -28 -6 7 -3 -25 2 -10
3784a0oQJ5J1m0K1nOPk7K5qmK2k2K0j4mK%J4m4M6qj6OrJ0k3M9j6Pj0qL0ok7Pj1
$$ -10 -16 -8 7 18 -22 -1 -6 0 7 -20 5 -3 -7 15 -7 13 -1 -5 -3 -3 11 -33 13 5 -11 -5 -14 -4 -27 22 6 13 3 -5 25 19 -8 -1 -12
3823a2K0Rpk5J7j2KK4QNk5k0J3nJ3k3OJ5mk0KK1k2k%K4j5JL8Mm9K1j3J7j8J2r
$$ -12 8 17 10 -15 2 -10 -8 16 24 29 4 -16 -3 -8 5 -18 -12 3 -1 -21 -19 2 -20 -22 -22 2 -13 -12 26 30 -19 2 -11 6 -12 0 -9
3860iK0j6J4J0n2L7K7Pm2K4j9LLJ2m0K5l0J8J1pQk0jM1k5j5L9l2j8K3mL5m5N5
$$ -9 11 -5 9 19 -33 4 31 38 -4 20 1 4 7 19 -21 4 -26 -8 3 -4 4 -16 -17 24 -1 -16 23 -9 -27 -4 -8 27 -18 37
3894C7n9M1j0kjk3L5k7M9k8%npK9k9mj%pJ6J9pk3nL6mj1j3Plo%KlJ6j8%KKj6J9
$$ 37 -22 19 9 7 6 -17 18 -9 40 12 12 7 0 29 0 -4 -5 -5 -12 4 23 16 -7 -12 24 20 9 -4 3 0 -6 -6 -4 -7 9 -9 -9 -7 -5 -21 -2
3935bMojJ6oK5m1K8j2J1j8kNLj3NJ4k2Oj5K9kkrQkj9kJ3l6K8J6J1Kj3lJ6j0k5
$$ -2 2 -4 -5 11 5 30 -11 17 5 16 -2 -4 1 4 -9 -4 10 -12 -6 -21 8 6 4 -5 3 1 -18 -20 -7 -43 -15 1 12 14 1 -2 14 4 -21
3974b1K7pJ5Jj0nJ0Nl0lJ4qJ9J4j3k2K5jk2L1J4k2j8K2j3j4K1pjrmK4j2j0K6k2
$$ -21 6 -1 14 15 5 0 10 15 -15 -18 -4 -12 7 21 8 -14 11 10 -12 19 33 11 -7 15 2 -12 9 2 1 -8 -12 12 0 -10 16 -6
4010fk3L6Lk8kK3k3M3j0j7J3j9J5J3pjk2J1K1ql1K5JoJ0qKj2QJj1J2KOKKk4Ll
$$ -6 -29 7 10 -18 -20 3 -20 23 13 -4 9 -10 5 18 11 10 -12 -1 20 12 -19 6 7 1 11 3 5 -7 1 2 -9 3 5 11 13 15 -9 -6 -9
4049iJ0jQk8P%J0j1J9Lj8J6j0pJ5kQM%nNj3lK0j9OJ1k3PQk0J1lJ6k6J0OK1k9J3
$$ -9 1 0 8 -20 -13 -13 -3 -14 5 8 -10 6 -4 -11 4 2 10 14 14 9 14 1 -2 18 -1 5 16 -7 0 8 -12 -1 -4 12 -14 -4 2 23 -6 7
4089GJ3l2pL3k0qJ8jQJNl4M1k4J0rNKK2k1QrOqMKkMj1jj7J7Qkm8M2Knk7K0L1m6
$$ 7 20 -12 -19 14 -6 -14 4 3 11 12 17 -17 24 0 10 1 6 8 30 9 17 8 14 6 10 12 10 14 3 2 -15 2 10 8 -40 2 4 -1 -28 -8 23 -23
4131b3L8J3k1k0J1J8j9k5K2nLJ9j6J3%J2Ok0L3m5K7Nj2Qj4L5m0k4M6k2KQljjl
$$ -23 15 28 7 -13 -2 16 -3 -28 -6 -11 -8 11 -5 8 8 20 26 6 39 -6 21 26 14 22 8 43 3 -21 25 3 5 13 10 9 8 5
4167EJ6j0rj3J1%%J0Rk3Qj7k3M3k5J3J0nJ9k1RK0k2%j1J4k4J5J0J5rMpklnJ7J
$$ 5 21 11 2 -11 0 0 0 10 19 -4 4 -13 -36 7 -18 -5 5 0 19 -2 7 27 5 5 -6 8 -16 -1 9 24 15 19 12 10 7 2 19 20
4205B0l1J9j0OJqJ0lj4KK6jk3j1P%j5OOj1qO1m5K6K0l3pmN2m3K7j9J5jk3JpnK1
$$ 20 -11 8 -2 4 5 -3 7 4 -10 -8 18 17 -6 -17 -10 -10 -25 -19 -13 -24 -32 29 -16 10 30 -3 -10 -14 38 -5 22 3 18 17 -6 -5 -12 -17 4
4244DpnJ6K6k9nJ8j1kNj5j1mK7%j9RkMM6k5k6K2l4%RKJ7Ql6K1jQj1LrJ6Mj4J5
$$ 4 -3 -8 8 34 5 0 18 7 5 10 -5 -16 -20 7 7 -12 -3 -5 -1 45 20 -6 16 -18 -18 -9 -7 10 18 -18 3 2 10 -1 2 -7 9 13 -1 14
4284A4pk0K1j5J0Lk2K8Oj3J0mqj7L3j6j3OJ5oPk9MRKK3j4j7K8ok3L7j8j7J4j8
$$ 14 7 -13 8 -7 3 6 -16 12 18 5 15 11 3 -14 19 3 -10 -4 11 5 12 -17 -13 -4 -2 21 7 -10 18 12 -11 26 8 -9 5 -13
4320a3QJ3k3J5J4Jk8J8J1qJ9j3j7J9l0L6lk5oK1j5rL4k2LnMj5M7jk5%MOk8K6k7
$$ -13 -5 8 -15 0 14 15 -13 5 16 8 27 14 -3 16 -14 22 19 -6 -12 9 -6 -15 19 -3 0 -5 -1 -16 31 30 5 5 9 15 -13 13 -14
4357a4J5pJ6nj0mK4j4oK2Joj2J0j1j3L9m3J2Mj9K6Mk5J7j7PJ8j3qJ1mJ1J7l1J
$$ -14 1 -6 10 5 -5 -9 15 1 -5 17 18 12 0 10 -1 -14 25 -18 -6 -2 -21 5 9 -16 1 -16 -9 9 -4 -12 -1 -5 6 23 -8 -7
4393g%J5j5nK9ORj9k4J5J0mj4NMolK0k8%J2KPmJ2k2K8k8K7l7lJ0J2k3mJ1L3k1
$$ -7 -7 8 -7 -12 17 23 32 13 -11 4 14 10 -4 1 5 -1 -4 16 -12 -12 0 2 9 5 17 -5 23 -5 22 -15 -18 -8 4 -19 -23 -12 21 0
4431@%JPk9K3%jrK5ok0J4J7k9J3Pl5J5QqM2k9qJ6j9J3k2L6j8nQMl3JK9J8l8J6
$$ 0 0 1 8 -21 2 2 1 -8 17 11 -9 5 22 -7 6 13 -22 -7 1 -7 35 6 -2 14 -5 8 -14 22 4 -1 7 11 -22 -21 8 26 -12 4
4469Dl6M1k5K5pJ2rJJ5l4M%J4PoPqojPRK6n3J4J0lPj6pJJ5j1K2k8pJ7k1j0j8M3
$$ 4 -32 9 -16 9 2 14 5 6 21 -13 -9 -9 5 12 6 13 5 -1 -2 5 14 40 -13 1 11 8 15 -1 -8 -7 8 -3 19 -9 -16 1 -20 -30 -48 -5
4509eJJ2k7PK0QLj0j4oK2j4J0k7OK0KqNoOKJ9l7mK0%k9L9Jl0j5L4nJ6j1j5J4j1
$$ -5 -4 8 -19 -12 8 16 19 9 -5 -11 11 -3 7 -20 -14 6 8 0 5 -1 5 7 26 -11 -15 5 5 -24 15 16 -14 -29 5 0 16 5 -10 4 -7
4548gJ3l2L0j0l5L6k0L1j6pK1K2qk1nlK2jk8M7l0lK3k3J1rNl1L4KMk6J4j7K3K8
$$ -7 6 -26 4 -6 -41 -5 -25 6 -10 -17 4 26 18 -3 -8 -11 11 10 -18 29 -1 -4 19 -4 7 -2 3 -28 6 8 12 -14 0 -17 6 34
4584C4l9J1lMk1K1Qk4MKML0k9j7K8k0nL9l3J7Nnj4qNj3lJ9J2oqJ5Pj1mRJl9L3
$$ 34 -5 6 3 7 -14 7 15 -9 -5 -3 1 31 2 -15 13 -7 -12 27 -6 11 16 11 -3 -11 -6 -19 -22 -3 9 3 -5 10 17 6 2 11 12 -27 6
4623Fqk5K5j6Pj3J8pORl1L4J4j9%j5j2K7j1K3m3K7pK9pnJ2nKk2K6j6QL1m6Ok2
$$ 6 -2 -27 -2 -18 -11 -24 -6 -13 -7 2 -29 5 19 0 0 -15 -27 0 -11 12 -31 -4 -11 18 11 6 18 13 15 -7 19 3 11 42 -4 2 -20
4660b0J5j6J8OlJ0k3k2K0J8Lmj1J9kJ5Kn1J7J6k2kL8j7l8L4j1KL8k0j4Qj1J8j1
$$ -20 -5 -21 -3 3 0 10 -13 -35 -15 3 6 2 -9 10 8 23 25 -26 -9 7 -15 -17 21 4 -34 0 -11 -9 29 9 -5 3 -8 10 -1
4695aj8K7J5j1j3k4K3NnMqpKj7M0j8LroKK5Jj0RLQj2j0nJ0jj7J9k8K5j1L7k9O
$$ -1 -19 8 23 12 -1 -25 -2 3 -2 2 -6 -13 -11 -28 12 -6 -3 -12 -18 -16 9 10 0 9 12 20 8 -2 -7 3 2 -15 4 -24 1 -10 27 -2 4
4734Dk6J3PK3jlk8pK6j5LJPkJ2jk1J4Ml3L2j4Nlk0L5%mk1PrK0Ol5M6m6L4pjJ3
$$ 4 -22 -9 -2 21 20 17 -11 -18 8 -7 -4 -3 4 2 14 13 -8 6 10 -23 9 -5 0 -3 -23 12 12 8 -13 -6 -15 5 11 -24 22 -24 10 3 2 15
4774A5j7Pj1%J9Lm0J5KJ5k0K3rj3OJ1j4L3l0L0k6j2J3k1L3k2QJ4l7K6J2k4j0j
$$ 15 -2 5 -6 -6 13 16 -24 -9 -7 8 -12 11 2 -11 -5 6 -8 25 -5 25 -1 -13 0 -21 12 -10 -2 12 -25 1 13 -11 -21 -22
4808b2PL3Lj9J0l0L9j3k4JJ3J5k5J3J4k2j7M1Nl5KJ5J5l6J8K1qj3J1rNJ2j9pJ6
$$ -22 -15 18 21 2 12 -18 21 8 -16 -15 -2 13 -12 1 15 -7 -24 17 22 -13 -11 4 19 -17 1 22 14 1 12 3 8 20 1 -6 10
4843A0k6J7k0L5kj4Qj8nJ6j6PnNLK7j4J7k4J8l9J0MPK4k4OK9l4Nl6M1j2K1mk4
$$ 10 -16 1 -19 16 14 0 8 -10 -15 1 -15 -8 -13 -8 -5 22 8 25 1 19 -20 -10 -6 1 25 1 7 36 2 7 -29 12 0 21 17 -7
4879gmqPJ7j8K9k6J6j6J3qrK4j5Olk1K4k1K2lj2PK8Pqj8lMJok8L5Qk6J1k1K4J9
$$ -7 -11 -19 -12 5 -13 16 -10 6 -10 3 -5 -14 10 -5 1 -2 -23 1 -20 2 -1 -13 -6 22 29 21 3 0 4 5 -1 -29 6 14 -12 -1 -22 2 21
4918B1j0k2J3mJ5m4mN1m1K5k0J5l1M8k5J9pNj7J3J6J1k9j5Qj1J4RNlJ4lnk2J8
$$ 21 11 -11 2 -2 13 -31 -35 16 -25 0 -20 -5 -36 12 -13 6 -1 4 -13 0 16 27 -2 -17 -9 -20 -6 3 8 5 19 16 11 -11 7
4953GMl4N5o5%J8KJ7j1%Oj0J7mJ6j4J9m0K6j1l2J9J6K9m2PL8k2j6KK5j1Rj1l0
$$ 7 11 -23 32 -33 -33 -15 -13 4 -7 -7 -1 -11 6 2 18 4 23 -17 9 -2 -34 -15 1 30 -12 -5 33 11 -5 -3 22 11 20 9 -21
4988b1j5L5kk2%M8pj4L5l3mj6J8K3k0Lj9mLK0l1K4J0%k2J1J2j0j5MPj8pM2l7K
$$ -21 -36 -1 -3 -25 -25 23 16 2 37 4 0 -16 2 25 5 8 -11 -15 -12 8 -23 1 11 11 -11 0 12 2 -13 -9 -2 -20 -27 15 -22 -20
5024b0K3kNlMOj4j3MQK5m4J0J7JJkj5J1K3j2noj1k4L5l1L1k5%K0JJ1j4j0J0J0
$$ -20 3 1 6 3 7 13 -1 -14 -10 -2 23 -21 -11 6 7 8 6 -9 2 25 13 8 2 -9 -33 2 -29 2 -23 -23 -3 -2 9 -5 -15 -5 5
5061EJ2j4jqlM1k1j0J1llNqlJ4j4jj2RoK8k8J8Qnj9L5m2J7j1L0j9nlOKj6L0m0
$$ 5 17 3 2 -6 -9 32 11 1 12 9 6 11 3 0 14 0 -1 -13 -4 -10 18 -10 8 16 11 -8 27 -15 2 -9 21 2 -3 -6 0 2 -14 16 -24
5100b4L0KJ2Jk2J4J6k4LJ8k6J4l2jjNL4j9rK3K4l2j0J7pk2kl3L4kL2k2Mj1LL9
$$ -24 6 8 20 21 -1 13 29 5 8 26 0 14 -18 -19 -20 -15 19 0 -9 14 38 6 -4 13 6 -16 -18 -51 -17 -19 13 -9 -5 -16 -13 26
5136B6k6ROj2k6lJM1k5%L8k7j0%kJ2J9k1nlQj9J6j2NJ7qj1K4j8j4J8j8J2j2J5
$$ 26 0 9 15 3 -23 -26 -25 16 -9 -9 29 2 -8 -8 -10 2 21 0 -5 -8 0 -19 -3 -15 -10 7 -1 -12 12 -6 -20 -2 -20 -8 -20 -5
5172ekk6L0Qj2mPMJ1j1J2j5LL0m1PK0l1J0mJ7KqJ0j1kjJ5j5Ok5L9j9k8L3j0J2
$$ -5 -7 -33 -3 5 -7 -11 -4 0 11 0 12 -3 0 30 -11 -4 16 -15 -5 -9 8 10 2 12 1 -1 -2 13 -2 4 -21 18 -1 -29 4 -6 6
5209FrJ9qj3mJ6qJ2k1qJ9%J2l1%K9J9l5%J2Loj3L7m8K7j5L7l3OnkqJ1Oj7J1oJ5
$$ 6 -3 16 8 -5 -9 7 -1 11 -10 -18 1 1 13 -18 -18 11 30 -5 -5 7 10 4 -9 28 -20 7 -8 29 -4 2 -3 -5 -13 -2 4 -13 -2 -8 7
5248Gkk2Mj3J0l7L3K5Kj4Qj5nmM4j8l8M1jJ1m1K8NmqJQpj2K6j7j3K5lrj2K6l0
$$ 7 5 -17 -13 -26 -16 -53 -20 5 7 -7 1 -14 -19 -23 21 3 -35 6 5 16 -25 3 8 4 -4 -3 5 -2 -14 12 -5 -18 7 4 -5 -17 9 -21
5286b1kRJ9k0J7l6J5K3k1K2Lj1l9K5J4QplLnOppK1lj1jJ0j8K3Pk3J2j8j6J9L6
$$ -21 -23 -14 5 -15 2 -34 -19 4 -17 5 8 -3 -42 -17 -3 5 -2 -5 -2 -7 -1 -8 -15 6 3 -8 -9 1 -17 6 13 -10 2 -16 -32 -13 23
5323B3n5M6qj0kj2J5jQlJ3m4K4qJ5j9J2jJ4J0qj3kmJ8m2J8J1MMoLpJ9J5j0j8O
$$ 23 -32 14 6 -4 -6 -18 -3 -4 4 1 14 -30 -6 -14 1 -18 -6 -7 7 17 9 -4 -6 -10 8 -34 -16 -5 -1 3 -3 0 -7 12 27 17 -1 5
5361EK0ml2lL6j4Mpj5OK0j7j4J5j1oQJ0j1K8k3P%pkJ%K3m8M6m9K8J2j2pRj0J3
$$ 5 25 21 -11 -14 22 8 12 5 -10 -4 16 -1 -15 0 -11 -17 -9 1 -10 18 -5 2 2 -5 -7 -6 -6 17 -31 15 -34 -6 6 -6 -13 -4 -14 -1
5399aJ8k6JQMLk0lK1j2oJ5j6PK0j6KkrQrK8j7k6O7k7Kk6MNjmJ1Oj3Nj8J8%J0n3
$$ -1 17 -9 -8 0 4 7 -13 -16 5 -7 -13 2 -14 -7 13 -3 -1 -3 -12 -4 -13 15 -2 -28 39 12 14 -12 -8 -3 -4 -8 3 9 -4 1 -17 1 1 11 -42
5440d2M7JMkl2L3j7K0nmOnP%nKJ1k9l4L5nqL0k3j6K9J3j4J7j0QLJ2l2JMJ7l6M
$$ -42 5 6 10 8 -24 9 -8 12 7 3 9 4 11 11 6 8 19 -10 -44 -9 -14 -22 8 -15 -31 -2 11 -3 14 4 12 15 27 -5 -4 0 17 -19 -15
5479a5K2mJ7nqOmjj2j4L0j7j8LK0lrj5L2j2J2j7j0K7Nrj7%M2k1l1L0JKPqLOj6
$$ -15 7 3 20 15 7 13 9 8 -4 -18 12 -5 -23 -20 0 -3 -12 -27 5 -7 5 -12 -22 5 10 1 -16 -16 26 5 -26 4 5 7 14 6 9 15 -1
5518aMllQL7j5k8MJ2Pk4J7Mlj5Pm6L1J5QNk4Okj1K4k7Rr%K7l6KK2J3Jk0Rj9K5
$$ -1 3 0 -3 5 42 27 -1 3 15 22 -2 15 19 16 1 8 -38 -7 8 16 21 -3 3 1 -10 14 -13 -4 -13 -13 14 -22 -20 2 15 16 -4 5 -14 11
5558A1j4J0lj4J2J0mJ1jk7J0M4n3J6MRj8j8J6%lj0KrK9nqkkJ2qmJ0Kj8J1nPJ1
$$ 11 -3 7 4 -10 2 12 8 19 18 -9 1 45 -8 8 12 21 3 -15 1 1 -2 -12 -10 -19 10 5 -3 -5 -7 5 -3 -7 3 5 -13 -2 -7 0 11
5597A1qJ6qK0k6rK2l4K3j5RrmJ0K3k5K0j9J7k1K6k8J3ONm0%K5j7M0j4k8K6MlJ8
$$ 11 3 19 11 31 5 -4 18 -16 7 -8 1 -8 -12 -2 21 -4 16 -3 14 -7 19 -9 4 10 15 -25 -25 0 -17 23 9 -19 7 11 8 26
5633B6m1K5j7KRqkJ8lk4pL7j2kMl2L4j2Qj3K6l1L5pLJ3k3J5k4l3M1k9K4rJl7N3
$$ 26 -15 10 -7 -5 4 -4 -6 12 9 -15 -22 15 3 1 5 -27 7 -5 3 -10 16 -15 20 13 16 29 6 21 -3 -36 5 -24 0 -9 -8 -45 8
5670Hnk9K1J9m6K0PRP%j1Kj7POj7K6j6Lj1L4%J0l0Oj1JJ9j1nK9rrj%pj7L1pj3
$$ 8 3 -26 -5 14 -32 -12 -5 4 11 11 0 2 -15 -8 -2 -19 7 -9 -6 -17 17 17 27 -3 3 -8 -7 12 1 -4 25 16 7 6 6 -1 -18 13 6 -7
5710gL0k0J2j6j1K1k5J9J8j8k1J2K%K2j1k7K4JmJ4k5QqJ4%j8K7j4nK1l0L3j6p
$$ -7 23 3 15 -1 -12 9 -16 3 21 3 -18 -6 -4 -4 18 7 -20 4 5 1 15 -10 -2 -10 4 4 -14 13 -1 -6 15 -15 18 2 -5
5745eJ1j3J2j7J4rjpK6j9j1K3j0J5j5j0J7j2J7J7k7J1Nj8K6Ll2RJ5j0PNk3K4l3
$$ -5 6 -7 5 -12 2 -7 -8 -15 11 -8 -19 4 -6 9 -6 -16 1 -11 6 23 -4 7 12 -6 20 23 -9 0 15 5 12 17 -6 18 -15
5780a5J1J5J3m5J1KRRl4L6m2M9l4K6JLll2K5k4k8O6k2lrM2l1k5J7j6M3n1L0or
$$ -15 -4 11 24 -21 -10 -8 1 10 -24 12 -30 19 -15 11 12 15 12 -20 5 -19 -47 19 -3 -6 -15 27 -4 -29 -12 -28 15 -36 -6 -12 -21
5815b1K4j7K8j5OJ1qJ0j1%k0K9k2lJ5j8JK9l6MJ%Nj6KJ1J0j8L4j7%jPljJ7l8O
$$ -21 3 -14 14 -1 5 16 8 18 7 7 -13 16 -6 -9 6 -12 -11 18 -18 -14 -13 -13 -8 -24 -22 -11 -1 -19 15 -2 -2 -3 4 1 0 17 -21 -15
5853a5JQpK0k7K0ROkk5J6lJll5J1K0J1Rj7L5n9K5lLJ1k4K2k4jK5%rokK2j7J7j6
$$ -15 -14 -6 -13 7 -20 0 9 15 13 -12 4 1 2 -1 -36 -25 -5 6 15 -2 33 -26 -1 -4 -1 10 -14 8 -16 -17 8 8 -1 -7 -9 13 -4 13 -3
5892ck5rO7l0oOMKJ0j2QPj8j%Oplk2K0K5l6K7j3NNj9K2l3J3j6K4j1K9l1Pk2L0
$$ -3 -28 -37 30 0 -6 0 4 6 16 4 12 19 1 0 0 6 -1 -4 -26 -6 19 -17 10 -3 2 7 -12 10 -23 -10 -26 -2 -13 16 -15 -8 -30 0
5930@Oj8Qk2L9l0J2J8j7MpK7n2K4nK3qj5K2J1l2j7K7l2K4J4k1j1M1j5poQJ6j8
$$ 0 6 -12 -4 -26 13 -17 -5 13 -4 0 -7 20 -32 -8 -13 10 2 -13 9 20 -12 -29 -2 -34 -10 4 -17 -28 13 -2 -9 -15 -7 9 -9
5965ijmoJ7nklK2jRkj0J2m0J4K1j2jl5L2j2PJ2J5k4j3K4J4j5j5j4K1J9j3rOk2
$$ -9 -10 -14 -20 -3 -8 -10 -13 9 8 17 15 5 17 -23 -9 12 0 -1 -36 -4 -16 -9 3 18 -6 -19 5 19 4 -11 -25 -4 15 2 -7 -1 -23
6002b3J3PrNk0JK1l%Pmj3J0mL3ml0M5n3J5oj1K2j2J3nLklJ4k4K2Lrj8OL4l0l4
$$ -23 -10 -3 -12 -7 -27 -26 -5 -8 -8 -1 -5 -18 -8 -12 21 17 -13 32 -21 -6 -12 -23 -1 -13 0 -5 -2 -4 -7 7 -17 5 8 -1 -19 -13 21 -9 -43
6041d3L8Kj9L1m3K1oJ2Qqj7L4k1K7j8Nj%kK4k7k5J4JJ7%Rj9J3rpj9L3Qj1j5%j8
$$ -43 -5 -3 -22 9 -34 -13 -19 -7 1 -7 -24 10 -11 16 -2 3 2 2 0 24 -3 -28 -14 -13 4 4 13 -6 7 -2 -9 -28 5 13 2 -13 -13 -31
6079c1M5k3%J0j1lK3%k1J3mJ3%%j2J1qoj1PMJ8k8J4NJ6j6J6jrj9L6k7mK6m6L0
$$ -31 14 -9 -9 1 -10 -13 10 10 -11 2 -2 11 11 11 -1 10 2 -4 -15 -8 -4 14 -14 0 5 21 5 21 20 11 -8 28 1 -3 23 -23 7
6116GKpk5M3k8qK8l1K4K%Qj6j8RQkpJ9qj5k0QL3Kj5oK1pk0L8j5j0MLljmMJ3lP
$$ 7 9 2 -23 20 -8 -16 12 -19 5 7 7 15 -1 -19 -10 -2 -4 -11 8 0 -15 -35 -27 6 8 -7 -13 8 1 -19 19 4 -6 -2 1 -2 -3 -7 -3 10 7 14
6158A4k6oJ3j4L0Rml3k4M1J%oJ3k1j%J6J4m4L4NMjrOLj4k1PK6nl3K8J5j8KRRj5
$$ 14 -12 -18 -5 -19 11 20 16 -17 -41 0 1 1 -5 8 -13 -14 -14 2 16 -28 6 11 15 14 5 11 14 0 -21 -14 12 7 -26 2 17 -1 1 10 19 4
6198Dj9nL7k6NrJ1J6Lk3J5j7jlJ9j9pONOL0m5J7j5J2j3j2L3k3L0k0nOk3K9KL8
$$ 4 -15 -20 17 -9 -4 -13 -2 14 17 -6 9 -8 -9 -12 7 -12 -19 -13 -8 -2 28 -17 0 -15 -3 -16 -28 5 -18 12 -8 -13 -7 -30 -1 1 39
6235C9n7nK9pLjLNJk0llqJ2pJ1j0nJ4j7j2J5K6oJqLj2L5j8L4j9l6RJ0kK2%j2l
$$ 39 -18 -23 6 -1 2 1 4 9 10 -10 -13 -16 -24 -12 -19 -8 -18 -23 -9 -26 -38 -23 3 -3 -2 -10 -7 -19 16 -2 32 13 -23 -14 -4 -6 16 16 4 1
6275AlJ0KNmm1M5j6lk5K8omQoj2PL3m3J1K1k7KK1Oomj5J5J6Kj7nKp%J0K2qk1N
$$ 1 -2 8 10 15 11 -30 15 -1 -4 -29 -1 -7 -11 -3 -9 -21 -14 19 -24 -13 8 -19 -17 4 10 4 0 -15 0 16 18 1 -4 -2 -9 -9 1 23 15 -6 -1
6316aj8K2j2%J6J7k6J0K2j9l6K9qj3J1J3J2l4J8l3J7L5m5lK3pj4OJ0J4NOj1J9
$$ -1 -19 3 -9 -9 7 24 -2 8 30 11 -25 4 -4 -17 -6 7 19 -15 3 -30 -13 22 -23 -26 -3 -10 -24 -18 -8 6 11 17 6 25
6350B5k6J2jpJ0NK7p0K7Qj3lnK0k0Ok4K2MK1Ml8KJ1J4j9J0j9lL8j8J3j7Km0O7
$$ 25 -1 11 10 3 13 18 45 -25 2 10 -3 -6 -11 9 -11 -5 -29 -7 -3 18 22 -16 -14 -3 11 -8 2 -17 -20 18 0 13 -4 -2 -42 25
6386B5l8LqJ7KJ0jJ0j8Rl3OMLK9%k1K0Lqj8olL5l6K1j1j5Nl8M4J2JOj2k4K0Kr
$$ 25 -13 -10 -18 -1 1 11 10 20 2 11 -22 -16 -12 -9 20 20 -1 19 22 14 -4 -10 -13 22 -14 7 -4 -19 -14 -52 -8 4 5 11 -1 -25 -5 -3 -12
6425a2NK3m2K6j0OJ9k1K0j3joROk7J6j7J3j9K4Mj1L7l0pK2k8J0J5j8J3j6lK3j6
$$ -12 -7 16 -26 0 -10 -4 15 -6 14 1 0 -6 3 9 -18 -2 -19 -6 -25 -1 3 -8 29 -1 -8 14 -14 -4 11 -7 6 -10 -13 10 -6
6460fj6M0l3KK3l5K5kj3jJ6k1K1j6K6Kl8M3k4LONqroMJ9KLl7K0K0j3mk%j3RmK9
$$ -6 -22 18 -15 -13 10 -25 0 -2 -15 -16 0 -21 0 -16 10 12 -26 17 -7 -4 2 7 -1 -10 -16 -12 7 9 12 -25 -5 15 2 -2 -4 -4 -17 -8 -12 17
6500A7k8Kj0J0Kk0OmK1J0mNj8J7j0Lj6%rjJ2L0j8J5j2j2J0mkK4n%j6J0qmj9L1
$$ 17 -11 -9 -19 -9 -7 -27 -21 -25 -4 6 2 7 -11 6 -4 -1 -17 -17 -26 -27 -15 15 -3 12 0 -12 -2 -6 -8 16 11 11 -5 5 -3 -7 -26 5
6538Ekj4J9l0PRj0OqJ1j7K3J0j5j0L1m2J1RQlkjj0N2m9J6k0K4j8J3Ll3L5L0l8
$$ 5 3 -11 8 -22 -15 -6 -16 -10 -18 -7 -24 -1 9 -6 -16 15 -27 -16 -7 1 -2 -4 -5 -15 37 -12 4 -16 8 -10 3 6 -27 8 38 0
6574@J7j7K2l7J1pJ5mk0L5kk0jKOj2j8L4l4L9j2j1K0pk8L0k1J8Oj6M2l5qJ8l0
$$ 0 17 0 22 -15 -4 -11 4 0 -20 15 13 -7 -8 -6 0 -12 -30 4 -30 9 -3 -14 6 -1 -29 1 -20 -2 4 -12 30 -5 -13 5 -25
6609b5K9Rj9j5K0nKk3L9k0J2j3PJ7Rl1%oj2K5Rl3NQkL4k9pJ4Pj9J6j7J6Jj3Lj
$$ -25 4 13 -6 -21 -1 -6 -4 -27 12 -8 4 -9 -2 15 24 -7 -7 -13 -25 0 9 -24 -19 -11 -13 21 -8 -15 -1 6 -13 3 -14 2 3 -10 -7 -8
6647hNJ7j3K1k4OrMMopk1L8j4J2j2J5l2J4kMMkMKj7J0oJJ3k1%K2J2l9J2lO8o4
$$ -8 -3 14 1 22 -2 4 -5 -1 3 -3 -10 -31 7 -7 5 -7 8 -24 -10 -12 -8 -4 -6 -2 0 -17 -7 -13 -12 1 -20 -20 2 14 -25 -13 -16 52 -12
6686a2jJ0j8L6j4rqL2pj2J2k1KJ0j9K6j1roK0pkJ6k2j8M7rl2J1QK9l7J4rK5j0
$$ -12 -13 -3 -21 15 1 -8 -16 16 9 -3 9 -12 -10 0 -19 7 -4 -13 -19 1 -6 -8 8 -14 -32 15 6 -26 -15 -7 22 -15 -1 -10 15 5
6722Ek2ON9p2J8%Nj2J8mJ3k3pL8Nj0j0J2jk5PrJKj1J8j0NK%k8K0J8j6j2J3nL7
$$ 5 -17 -11 48 -24 -6 -6 -1 -13 5 1 14 -9 -16 22 27 17 7 19 18 -7 0 -9 -8 -6 -17 1 -9 -4 -2 -2 -30 -10 8 -8 -20 -7 -12 25
6760B5l0rrj0K9mJ9rJ7%rl8K7K9ok7JkKOj2Jj2M2j9oM%j2L2j4knj1k2J0J8k0J0
$$ 25 -5 -14 -23 -33 -4 -8 11 2 19 19 10 -28 -1 28 22 -5 -4 -6 -4 2 -10 -9 -21 21 2 -4 0 0 -12 20 6 4 -1 -12 -34 -24 -6 -26 -16
6799a6J8j5K1rqpK5Lj2Ppj2KJK8k2j1K0j6lJ4j9PK5J2n2L8Kj4mk4K6MoNJ4l5J3
$$ -16 2 -13 8 -1 -9 -16 9 12 0 7 0 -12 -10 -9 19 -3 -14 6 -10 -13 1 -18 -11 14 26 -26 12 14 0 -4 -28 -2 2 -4 1 15 -20 -7
6837goQJ9mj6KJ9qk2J0j5K7j0qNpK6nj0MrokQK5l2Ql0QJ8K2noLj1J5JJ0k2k7K3
$$ -7 -13 -5 14 10 -6 -4 15 7 -15 -5 -20 7 -3 -11 -6 -13 13 8 -2 2 -7 -13 -15 -7 18 -14 -6 -36 -28 -10 12 7 1 4 -7 8 9 19 -3 -30 -7
6878gj6MJ2lNJ8rpJ2k0J5k4MK2J4k6L2mk4pqK8j8K3k3JjRJ2k0j8K7Jj2J2j9OJ
$$ -7 -23 -19 -7 -10 -5 13 4 -3 9 -11 4 -20 -16 6 20 -6 26 22 -2 -9 -17 11 -7 16 -7 -6 -7 2 14 -6 -24 3 4 -8 4 -15 -9 -8
6916hK0Pj2j0RKk%l2K5rPpK4k0NQnJ2l0L4Rk3kJ3J4k5j7L5j9j0oLJ9Jm8M5lj6
$$ -8 12 19 7 -3 6 8 6 6 -26 -1 -10 -3 -10 14 -6 -1 7 2 14 -16 18 27 4 2 15 29 4 -13 22 3 -7 -13 -10 9 10 -38 7 4 -12
6955a2K2j6j6K1KoJ0l6L3J2rJ6j9j3OJ6qJ3rMj0MrJJ3ll0N1l8mK3Kqk9J7J1J2
$$ -12 10 -6 -22 -1 1 -5 5 -31 2 14 5 21 2 -11 -5 11 3 16 7 11 1 5 -4 -3 10 7 -23 28 -10 -14 9 11 3 -26 -9 2 14
6992A4j2KK0k4JJ5j7j9K5m6L8%J7k8LmK7oj6MJ0pk2L9k0J4j6NQk8K3J1qL%J3k6
$$ 14 2 4 24 0 1 16 -1 -20 5 -41 -3 -3 14 -14 -11 -15 12 6 -10 -6 4 -3 -25 14 -6 8 -8 -3 5 -23 0 11 3 6 6 19 -7
7029grj1L9k4J8j4OkJ7j2j8rL3j0qj4K9J6nj4J9k7k6L3l6N9l5K6l9J3J8nK3j6
$$ -7 -16 -27 12 -12 6 -8 -2 -4 13 1 -17 -26 7 -3 -11 -25 4 20 15 1 20 -7 -33 0 -36 23 -12 14 -25 -12 6 1 24 8
7063Hj9oJ9k2M4j6jj1pJK2j6%j4kL6j3j3OJ5l0L5k4jJ7jjk4L8l2LqNK2l4PJ4Q
$$ 8 -11 -17 2 -20 24 8 7 -4 -11 -10 12 -4 -4 -18 -20 16 3 -10 -4 11 -19 16 -8 -9 8 7 6 -18 20 -12 -9 -17 -12 10 -24 -17 -3 5
7101EMn2L0PQj1kL0j9k1K1k5L3K2l0Mj9%L2l5qJ9lQnnQjjkkJ7k1J6l0K7Ok0L5
$$ 5 9 -43 -13 -6 2 -9 -11 19 0 -21 0 -25 8 30 0 4 -15 -15 17 -18 -26 -7 -10 -2 -7 -12 -4 -5 -6 -8 -10 7 -14 2 -28 -1 5 -15 20
7140B0l4K0j5K7j9Rj1j0llL3m5K1ROk3M2k3j6J7j0j5K8Lm9L7K%j3K5j5J0j9jK8
$$ 20 -14 6 -9 18 -1 8 -3 -13 -16 -19 14 -31 -10 -1 5 -18 24 1 -15 2 -8 -23 5 8 -41 -4 -2 -2 -15 10 -5 5 -14 -15 13
7175A3J2pqKl6J7J0J5k7JPJ2JJ3l6Rj4K9Mj3MrnkK6m6L2pRnj9K5k8N9l7j1K0l2
$$ 13 25 18 10 12 -24 -7 3 18 -9 -8 -1 11 12 25 -11 -2 -16 13 17 4 8 -1 -6 -8 18 -28 4 -3 6 1 -18 7 -21 38 1 -10 10 -22
7213b2K8j2PkrK1j2j6JJ8J2k1J1nJ3oLk0J9j6kRJ5Ll4J6k0nJ4J7J9k7K8k3JLR
$$ -22 6 -6 1 -1 -10 11 -1 -17 -16 2 14 -7 4 -1 12 6 9 -11 8 -8 -10 -1 14 17 -17 -1 -21 -26 -12 5 24 -3 25 2 3 6 15
7250A5k1J0OJj4nK5j9MJ3rj5nMJ1k1L2mpNK0j1j3j2lJ4k3M8k4J0j7K7m1NK1no
$$ 15 -6 4 10 11 -3 -8 17 -2 2 15 6 -9 -14 -10 1 -20 12 8 1 6 26 15 2 -10 -13 1 -22 26 2 12 -5 22 -19 -14 7 2 -4
7287dOnJ5k6PppPOnlK2k3rK6qOpPqJ2KlL2l6OnJ9j5k6L1Nj1lloK4k2NrOJOj6j1
$$ -4 2 -3 12 -14 -7 -14 -21 -14 -8 -13 -16 6 -17 -26 0 -8 -2 -9 -2 -10 2 4 1 33 -3 3 -2 17 2 -24 7 12 1 -2 -5 -11 13 -9 -4 -13 -7 -6 0 -16 -27
7332b7K1Kpj3L0qRJk3LJ7k0J8j3J8mmKrQJ4j5oPkNk0K1qK0k5K1Pj6J8jk0j6J0
$$ -27 -6 -4 -11 -24 6 -2 7 8 -15 -12 5 -15 3 -10 8 4 0 2 -7 1 15 0 -6 1 -1 4 -16 5 -3 17 -8 13 20 4 22 21 1 -15 -5
7371eQkj8K6nJ1k9K5omj1Ompj2J1J0qJ0k8M6j7K0j8K7l7L5qJ0k8PLkj8LlK0k0
$$ -5 3 1 -17 9 4 15 -14 11 5 1 -10 -4 -8 -15 -27 -16 -6 -14 -4 -32 14 -3 17 -1 26 -11 24 16 26 -2 5 8 6 -12 -9 -12 8 -12
7409a2K7j6k9M8%%lql4L9k8K3pQJ6j5rJ1J7j6j7K4j8J8j5j4J0QjKJk3K9j7L0r
$$ -12 15 -1 -30 18 18 18 15 7 -27 12 -16 7 0 8 24 9 0 11 28 12 -5 19 1 19 4 -10 0 8 7 9 10 -13 16 -1 29 20
7445B0k7MJ7k6L0j7j1J9j5j2K3j0kNqMkJ4k7J8Qj0M2k7Ll2PJ9j7NJ6%l6K1Kj3
$$ 20 -7 -3 14 -12 18 1 -10 9 -6 -18 5 -5 -7 -2 -10 -6 -8 6 -21 -3 5 -5 37 10 13 -19 -12 7 -10 -5 11 11 -25 -4 -2 -15
7481a5RKl3L5Mk4k2M8k9L4j9J0nRl7QK6j6Pk5L0j5LJPjMNJ2j8K0j0Qoj0qj1M0
$$ -15 -6 -4 -37 -2 2 -22 -44 4 -25 9 -10 0 -5 4 -33 -25 1 -15 -8 -33 -3 -18 -15 -14 -7 -8 -4 1 13 -5 15 5 13 7 -3 -11 -22 18
7519A8j3Kj2J2J1j6Pj2Mknj0J8J9l3OQQll0K0L9k8kj8KJ8k5J2K0j9J0%j9K2pJ4
$$ 18 5 7 -5 7 18 2 9 -3 1 -1 -6 -16 2 21 -12 -6 2 10 7 -23 -3 36 8 6 -12 -10 8 -17 -5 15 -4 6 6 -13 9 2 16
7556A6k8J8j0K6m5J8J4k3PNK5j7j5L6m3J4kPj8Rl6N6k8Mj8J8K9l1J8j9pL2k2Q
$$ 16 -12 6 -4 22 -23 -5 9 -14 -7 -2 23 6 -9 27 -16 -2 -4 3 -15 -6 -42 14 -14 -10 -28 -10 19 -12 6 -13 -20 12 -10 -2
7590bRj2k0K1LPJ0j6Lk1L2j6K2k4L0k5j3J4J1kl3J9J0j4Nj7RlJ5Mk8RJ4lj6%N7
$$ -2 7 -5 -25 -4 -1 6 16 0 3 -18 14 -2 20 -4 26 1 -12 2 13 11 -22 -3 7 -7 -2 -19 -10 -13 2 6 -22 -13 1 -2 -18 -18 39
7627C9m0k3J0M3l5lJ0j1J2k7L9Mj3Jk7K1RmJ8oj9nk0M9l5lJ9J0j1pk8L1jj7K9
$$ 39 -1 -24 -14 29 -6 -9 1 -10 2 -25 14 18 5 6 -21 0 9 5 23 17 -2 -7 -27 22 -13 -16 3 13 2 -5 -33 -2 -3 -20 9
7662Ik5JM4m5J3Lk5J5j8L3nj6mQOjK7olMj2Nk3K0j3k2L9j7j1jK1J6l2K9k0j9K9
$$ 9 -16 -15 29 -16 -3 0 -25 -10 -28 5 0 -16 -20 -12 -6 -7 20 14 11 15 3 8 -15 5 -8 -30 9 -8 -19 -20 1 17 -15 14 -6 -25 4
7699DoJ3k8NnJ8J0k0K3LPj9j8M0n0K5j2LOjK0oKk9Lj8J5J9prJ4k2K4nlj4K1k2
$$ 4 -2 11 -17 -12 -17 1 11 -9 14 17 24 5 -13 27 -23 2 -10 -7 -1 -2 18 12 14 -15 -12 -30 -15 4 -3 -12 2 -20 4 -1 -4 -18 3 -19
7737a9K0Rk0nK5J1m2K8mj5oRK4Ll2KOpK7j3%qK2j9J1j4j1L8m1J5J7Rm0J7k3J8
$$ -19 1 10 -10 -15 10 21 -21 7 3 -12 -18 -9 15 18 -14 -12 -6 -13 14 1 1 -7 15 -4 7 -7 -18 20 -21 -6 11 20 -20 -3 -26 -8
7773h%qJ1Ok0J7%Moj1Ok2K4KJL0l4j5M2l5J8k7L4J4k7j2M6k7nl1J5J7J7k3JPk0
$$ -8 -8 -16 -5 1 -19 -2 -2 2 -4 -15 -9 -31 -7 -5 -4 26 -8 -23 19 -16 2 -25 9 23 -4 -16 30 3 -2 -33 -18 -1 16 -7 -6 1 -19
7810a9JRJ4KJ2k1Kk2J9kj3J5j7MJ8k9J3J5lJ5qj0j1J9j5J4j1NJ2mJj8K%J0k5J3
$$ -19 -18 -9 5 7 19 -2 0 -22 -3 -5 -18 -3 -20 -16 2 -27 -14 1 -2 13 5 -5 -16 3 -12 2 -9 -4 8 4 5 -13 -11 -11 -1 -26 -13
7847a3Qk3K9k0K3l0J6J9j1k7J6j3K0Nk6K1J2j1j0JJ6J0k8NK1jj2k2QJ4j9M3n0
$$ -13 -5 -28 1 -19 4 -26 -10 9 -2 -29 -13 -26 -6 -1 -27 -6 6 -5 -15 -14 2 12 -16 -11 10 9 -3 -25 -17 -3 -22 21 -29
7880b9K5lK0k0K7k7oJ2oJ4k3L0j4rmK1kk9NJ3j5J8j2Pk0M6k8J0mj8lK2OQl9J9
$$ -29 -4 -7 13 -7 20 -7 -13 -1 -7 7 -16 14 0 -9 -13 8 6 -23 -18 -5 -20 -2 -14 -7 -27 19 -9 1 -3 -21 -24 -2 4 12 -27 -8
7916hj1Nj7L6j5RJk1J7KNj3J8j7K1j8J2l7M3k2Kk4K2ML1k9L0l0j0J7j0oK1mj2
$$ -8 -19 -14 -31 5 -10 -1 0 -21 -4 -2 3 -10 8 -9 12 -6 6 -31 12 -10 -8 -32 -10 -6 25 -4 26 -4 -14 3 -7 -13 8 4 -8
7951hOjnJ6mk9RM2j8%j0K8j9Lm1nK8j2LK0oJKj0Pj2QK4j8J1jm1K8rJ3rmrRJ2j
$$ -8 -2 -3 -8 8 4 -25 -16 26 8 8 -2 26 7 10 -31 -36 -8 -20 -17 3 -3 -2 0 -10 -3 -15 -7 17 -1 10 9 -32 -4 -13 0 -9 -13 -22 -13 -1 -2
7992bJ1rlOj3mkK4QK5o5J3K1j1Nk3j7L0JqJ8rql6O4pj6PJ3kkLj7MMjrLJ5ol4J0
$$ -2 9 0 -3 3 -10 -14 -16 8 16 41 -24 -11 10 -1 4 -19 -36 -6 -5 -13 5 -4 -12 -48 16 9 -7 0 13 11 9 12 -5 -1 3 2 -7 -4 11 5 -29 -19
8034a9%jJ7nj8L3j7oL0kj4K7k1rlJ2kk1JLK5k1j3J9jJ5j1K1j6mJ3K0m3RNj0J5
$$ -19 -19 -20 -3 -8 -26 7 -10 -16 14 12 -2 25 4 -5 -8 4 2 -19 -18 -15 10 -11 -24 -5 -6 9 -2 19 3 -1 12 32 -11 -2 3 -7 8
8071HPj9jj0J6Mj9K3j6J9k7POj2K7Kk8K2Jk0K2j0Lk8M4l0LK0Nl0L2j6%J9m7K0
$$ 8 15 -4 -5 -15 1 5 -14 9 -7 12 -15 -8 -2 -14 13 15 -13 9 10 -10 12 2 5 -23 21 -9 -6 14 19 -11 21 5 5 24 -23 -3
8107cPrJKpkK3j5lJkL3k1j%J1mj4J9k5lPNj3K8k3j7K6JnK5j8k4K1K6m3K3oJRj3
$$ -3 4 -5 -4 -2 -9 -11 12 -3 -6 -5 -7 26 5 4 4 15 11 -3 16 -9 -12 -5 0 -13 15 -8 -25 1 2 -3 22 4 -20 1 27 -16 7 1 2 11 -2
8148bJ1k9M4l0L2j4Km0J5K0j9LJQ%Oj2J1m1K4K0j8J9k1K9Lkj2j7K0j6oJ2l3L9
$$ -2 9 -20 24 -6 26 12 14 -26 -11 9 -10 -7 -6 2 2 8 -4 7 -34 -10 10 -8 11 -10 19 22 20 8 -9 11 -5 -11 1 -32 7
8183Gnk8L6qpK9j7P
$$ 7 2 -26 10 2 -5 24 7 14
8191A4
##END NTUPLES=NMR FID
##END=
