##TITLE=1H_AM_NV39
 CDCl3
 8 sc, 
 19.4.2023
##JCAMPDX= 6.0         $$ Bruker NMR JCAMP-DX V2.0
##DATA TYPE= NMR FID
##DATA CLASS= NTUPLES
##ORIGIN= UXNMR, Bruker Analytische Messtechnik GmbH
##OWNER= root
$$ XWIN-NMR		Version 3.5
$$ Wed Apr 19 14:19:12 2023 Russian Standard Time (UT+4h)  she@DPX200
##.OBSERVE FREQUENCY= 200.13135
##.OBSERVE NUCLEUS= ^1H
##.DELAY= (6, 6)
##.ACQUISITION MODE= SIMULTANEOUS
##.ACQUISITION SCHEME= undefined
##.AVERAGES= 8
##.DIGITISER RES= 18
##SPECTROMETER/DATA SYSTEM= spect
##.PULSE SEQUENCE= zg30
##.SOLVENT NAME= CDCl3
##.SHIFT REFERENCE= (INTERNAL, CDCl3, 0, 15.7039)
##AUDIT TRAIL= $$ (NUMBER, WHEN, WHO, WHERE, WHAT)
$$ ##TITLE= Audit trail, XWIN-NMR		Version 3.5
$$ ##JCAMPDX= 5.01
$$ ##ORIGIN= Bruker BioSpin GmbH
$$ ##OWNER= she
$$ F:/spectra/data/she/nmr/H-F/1/audita.txt
$$ ##AUDIT TRAIL=  $$ (NUMBER, WHEN, WHO, WHERE, WHAT)
(   1,<2023-04-19 14:18:16.04 +0400>,<she>,<DPX200>,
      <created by zg, POWCHK disabled, PULCHK disabled
       configuration hash MD5:
       00 E9 B6 7A A2 85 ED C7 34 08 36 98 17 FE 4E 26
       data hash MD5: 16K
       69 F4 56 D9 37 C1 CB 40 69 0A FE 8A 22 D0 BA 25>)
$$ ##END=
$$ 
$$ hash MD5
$$ 53 EB A5 D9 74 DE 38 99 14 29 30 C5 3A 96 C8 15
##$RELAX= 
##$RELAX= 
##$RELAX= 
##$RELAX= 
##$RELAX= 
##$RELAX= 
$$ Bruker specific parameters
$$ --------------------------
##$DU= <F:/spectra>
##$EXPNO= 1
##$NAME= <H-F>
##$PROCNO= 1
##$TYPE= <nmr>
##$USER= <she>
##$AMP= (0..31)
100 100 100 100 100 100 100 100 100 100 100 100 100 100 100 100 100 100 
100 100 100 100 100 100 100 100 100 100 100 100 100 100 
##$AQSEQ= 0
##$AQ_mod= 1
##$AUNM= <au_zg>
##$AUTOPOS= <>
##$BF1= 200.13
##$BF2= 200.13
##$BF3= 200.13
##$BF4= 200.13
##$BF5= 200.13
##$BF6= 200.13
##$BF7= 200.13
##$BF8= 200.13
##$BYTORDA= 1
##$CFDGTYP= 0
##$CFRGTYP= 5
##$CHEMSTR= <none>
##$CNST= (0..31)
1 1 145 1 1 1 1 1 1 1 1 1 1 1 1 1 1 1 1 1 1 1 1 1 1 1 1 1 1 1 1 1 
##$CPDPRG= <>
##$CPDPRG1= <>
##$CPDPRG2= <>
##$CPDPRG3= <>
##$CPDPRG4= <mlev>
##$CPDPRG5= <mlev>
##$CPDPRG6= <mlev>
##$CPDPRG7= <mlev>
##$CPDPRG8= <mlev>
##$CPDPRGB= <>
##$CPDPRGT= <>
##$D= (0..31)
0 1.2 0 0 0 0 0 0 0 0.06 0 0.03 0 0 0 0 0.0002 0 0 0 0 0 0 0 0 0 0 0 0 
0 0 0 
##$DATE= 1681899495
##$DBL= (0..7)
120 120 120 120 120 120 120 120 
##$DBP= (0..7)
150 150 150 150 150 150 150 150 
##$DBP07= 0
##$DBPNAM0= <>
##$DBPNAM1= <>
##$DBPNAM2= <>
##$DBPNAM3= <>
##$DBPNAM4= <>
##$DBPNAM5= <>
##$DBPNAM6= <>
##$DBPNAM7= <>
##$DBPOAL= (0..7)
0.5 0.5 0.5 0.5 0.5 0.5 0.5 0.5 
##$DBPOFFS= (0..7)
0 0 0 0 0 0 0 0 
##$DE= 6
##$DECBNUC= <off>
##$DECIM= 32
##$DECNUC= <off>
##$DECSTAT= 4
##$DIGMOD= 1
##$DIGTYP= 9
##$DL= (0..7)
0 120 120 120 120 120 120 120 
##$DP= (0..7)
150 150 150 150 150 150 150 150 
##$DP07= 0
##$DPNAME0= <>
##$DPNAME1= <>
##$DPNAME2= <>
##$DPNAME3= <>
##$DPNAME4= <>
##$DPNAME5= <>
##$DPNAME6= <>
##$DPNAME7= <>
##$DPOAL= (0..7)
0.5 0.5 0.5 0.5 0.5 0.5 0.5 0.5 
##$DPOFFS= (0..7)
0 0 0 0 0 0 0 0 
##$DQDMODE= 0
##$DR= 18
##$DS= 0
##$DSLIST= <SSSSSSSSSSSSSSS>
$$ [...]
##$SUBNAM2= <"">
##$SUBNAM3= <"">
##$SUBNAM4= <"">
##$SUBNAM5= <"">
##$SUBNAM6= <"">
##$SUBNAM7= <"">
##$SUBNAM8= <"">
##$SUBNAM9= <"">
##$SW= 18.05172834244
##$SWIBOX= (0..15)
0 0 2 0 0 0 0 0 0 0 0 0 0 0 0 0 
##$SW_h= 3612.71676300578
##$TD= 16384
##$TD0= 1
##$TE= 0
##$TE2= 300
##$TE3= 300
##$TEG= 300
##$TL= (0..7)
0 120 120 120 120 120 120 120 
##$TP= (0..7)
150 150 150 150 150 150 150 150 
##$TP07= 0
##$TPNAME0= <>
##$TPNAME1= <>
##$TPNAME2= <>
##$TPNAME3= <>
##$TPNAME4= <>
##$TPNAME5= <>
##$TPNAME6= <>
##$TPNAME7= <>
##$TPOAL= (0..7)
0.5 0.5 0.5 0.5 0.5 0.5 0.5 0.5 
##$TPOFFS= (0..7)
0 0 0 0 0 0 0 0 
##$TUNHIN= 0
##$TUNHOUT= 0
##$TUNXOUT= 0
##$USERA1= <user>
##$USERA2= <user>
##$USERA3= <user>
##$USERA4= <user>
##$USERA5= <user>
##$V9= 5
##$VALIST= <valist>
##$VCLIST= <CCCCCCCCCCCCCCC>
##$VD= 0
##$VDLIST= <DDDDDDDDDDDDDDD>
##$VPLIST= <PPPPPPPPPPPPPPP>
##$VTLIST= <TTTTTTTTTTTTTTT>
##$WBST= 1024
##$WBSW= 4
##$XGAIN= (0..3)
0 0 0 0 
##$XL= 0
##$YL= 0
##$YMAX_a= 228828
##$YMIN_a= -136797
##$ZGOPTNS= <>
##$ZL1= 120
##$ZL2= 120
##$ZL3= 120
##$ZL4= 120
##$ABSF1= 10
##$ABSF2= 0
##$ABSG= 5
##$ABSL= 3
##$ALPHA= 0
##$AQORDER= 0
##$ASSFAC= 0
##$ASSFACI= 0
##$ASSFACX= 0
##$ASSWID= 0
##$AUNMP= <proc_1d>
##$AZFE= 0.1
##$AZFW= 0.1
##$BCFW= 1
##$BC_mod= 2
##$BYTORDP= 1
##$COROFFS= 0
##$CY= 11.3945322036743
##$DATMOD= 1
##$DC= 2
##$DFILT= <>
##$DTYPP= 0
##$F1P= 15.7292609196834
##$F2P= 12.9074282941183
##$FCOR= 0.5
##$FTSIZE= 0
##$FT_mod= 4
##$GAMMA= 1
##$GB= 0.15
##$INTBC= 1
##$INTSCL= 1
##$ISEN= 128
##$LB= 0.24
##$LEV0= 0
##$LPBIN= 0
##$MAXI= 10000
##$MC2= 0
##$MEAN= 0
##$ME_mod= 0
##$MI= 1.114404
##$NCOEF= 0
##$NC_proc= 0
##$NLEV= 6
##$NOISF1= 3.799351
##$NOISF2= 2.8
##$NSP= 1
##$NTH_PI= 0
##$NZP= 0
##$OFFSET= 15.70392
##$PC= 1
##$PHC0= -19738.7
##$PHC1= 8.20081
##$PH_mod= 1
##$PKNL= yes
##$PPARMOD= 0
##$PSCAL= 0
##$PSIGN= 0
##$REVERSE= no
##$SF= 200.130013532006
##$SI= 16384
##$SIGF1= 3
##$SIGF2= 2
##$SINO= 400
##$SIOLD= 16384
##$SREGLST= <1H.CDCl3>
##$SSB= 0
##$STSI= 0
##$STSR= 0
##$SW_p= 3612.71676300578
##$SYMM= 0
##$S_DEV= 0
##$TDeff= 0
##$TDoff= 0
##$TI= <>
##$TILT= no
##$TM1= 0
##$TM2= 0
##$TOPLEV= 0
##$USERP1= <user>
##$USERP2= <user>
##$USERP3= <user>
##$USERP4= <user>
##$USERP5= <user>
##$WDW= 1
##$XDIM= 8192
##$YMAX_p= 0
##$YMIN_p= 0
$$ End of Bruker specific parameters
$$ ---------------------------------
##NTUPLES= NMR FID
##VAR_NAME=  TIME,          FID/REAL,        FID/IMAG
##SYMBOL=    X,             R,               I
##VAR_TYPE=  INDEPENDENT,   DEPENDENT,       DEPENDENT
##VAR_FORM=  AFFN,          ASDF,            ASDF
##VAR_DIM=   8192,          8192,            8192
##UNITS=     SECONDS,       ARBITRARY UNITS, ARBITRARY UNITS
##FACTOR=    0.0002768,     1,               1
##FIRST=     0,             0,               0
##LAST=      2.2672688,     0,               0
##MIN=       0,             -136797,         0
##MAX=       2.2672688,     228828,          0
$$ Real data points
##PAGE= N=1
##DATA TABLE= (X++(R..R)), XYDATA
$$ plain form
0 0 0 0 0 0 0 0 0 0 0 0 0 0 0 0 0 8 -8 8 -8 8 -8 16 -16 16 -24 24 -29 32 -38 42 -48 56 -63 71 -80 90 -101
37 -101 113 -125 141 -157 173 -191 211 -234 258 -284 314 -345 379 -418 461 -509 560 -622 689 -766
57 -766 858 -966 1091 -1248 1442 -1693 2031 -2509 3240 -4482 6975 -13887 72238 228828
71 228828 9757 -61665 107542 137539 26091 18535 -1945 -60332 -9588 33501 -72374
82 -72374 -104440 1560 22482 -35091 -6451 19297 -15142 6758 39542 -30001 -63611 13143
94 13143 24687 -57329 -49003 43169 62413 10061 -1086 52883 99151 62201 -15355 -17668 33518
107 33518 12375 -59468 -75906 -55458 -47876 -30755 -19982 -40725 -29702 31430 55736 25694
119 25694 8447 17845 33191 41679 12328 -31597 -14320 29818 10106 -24706 1532 27271
$$ packed form
0@%%%%%%%%%%%%%%%Qj6J6j6J6j6K4l2L2m0M8n3O1p0Q0r0J04j19J34j51J70j91
37a01K14k38K66k98L30l64M02m45M92n42N98o59P24p97Q79r70J069j182J311j455
57g66J624j824K057k339K690l135L724m540N749p722J1457k0862Q6125J56590
71B28828k19071p1422J69207K9997j11448p556k0480n8387N0744M3089j05875
82g2374l2066J06000K0922n7573K8640K5748l4439K1900L2784o9543l3610P6754
94A3143J1544q2016Q326R2172J9244n2352j1147N3969M6268l6950p7556k313N1186
107C3518k1143p1843j6438K0448P582J7121J0773k0743J1023O1132K4306l0042
119B5694j7247R398J5346Q488k9351m3925J7277M4138j9712l4812K6238K5739
$$ plain form
131 27271 6783 -181 14996 5938 -13599 -22588 -32089 -27848 -17239 -39461 -53883 -9568 24016
144 24016 3279 5392 40927 40597 31852 52257 37601 -8716 -212 24748 -12705 -46000 -22394
157 -22394 -14841 -31871 -11738 7325 -14867 -11853 23390 15239 -12735 -508 5298 -20055 -14186
170 -14186 11917 -4557 -23291 7106 32756 20606 16972 26647 20003 17095 25143 4771 -30762
183 -30762 -28726 -9147 -21173 -42941 -36343 -17003 -5238 3856 7712 6536 16757 32155 27362
196 27362 9772 4361 6807 3231 -2826 -9253 -14500 -6475 7257 2863 -7072 5228 19104 5991
210 5991 -9400 -3843 -455 -11482 -19329 -21352 -20030 -6355 4384 -5874 -7290 19971 35070
223 35070 18476 8187 16121 17445 11541 3720 -14997 -25571 -7663 3127 -18885 -30429 -5682
$$ packed form
131B7271k0488o964J5177r058j9537q989r501M241J0609k2222j4422M4315L3584
144B4016k0737K113L5535l30q745K0405j4656m6317Q504K4960l7453l3295K3606
157b2394P553j7030K0133J9063k2192L014L5243q151k7974J2227N806k5353N869
170a4186K6103j6474j8734L0397K5650j2150l634R675o644k908Q048k0372l5533
183c0762K036J9579j2026k1768O598J9340J1765R094L856j176J0221J5398m793
196B7362j7590n411K446l576o057o427n247Q025J3732m394r935J2300J3876j3113
210E991j5391N557L388j1027p847k023J322J3675J0739j0258j416K7261J5099
223C5070j6594j0289P934J324n904p821j8717j0574J7908J0790k2012j1544K4747
$$ plain form
236 -5682 14492 6228 -4304 -994 7204 12506 7482 -7935 -14258 -1466 8490 -1960 -14314 -3847
250 -3847 18012 19204 1924 -179 15447 16923 661 -9117 -10024 -9857 -6554 -9947 -23611 -18535
264 -18535 7080 9847 -8049 -976 19947 16524 6758 8900 1454 -6132 7350 6973 -21135 -20756
278 -20756 11719 11350 -15132 -8640 15376 13336 1696 814 -1546 -2325 2577 -5511 -19483 -12536
292 -12536 1371 -1601 -5856 882 6321 10760 17219 11958 529 4437 12739 2920 -13550 -15510
306 -15510 -6370 -1473 -8418 -16283 -5860 12115 8880 -3976 3566 15142 5962 -3175 2094 -445
320 -445 -10172 -5744 393 -7291 -8293 5032 9147 2933 5028 10490 8292 4869 1071 -6309 -6658
335 -6658 -1603 -8636 -18877 -9416 4569 -957 -7631 4577 14973 8569 4374 9053 6496 -1058
$$ packed form
236e682K0174q264j0532L310Q198N302n024j5417o323J2792R956j0450j2354J0467
250c847K1859J192j7280k103J5626J476j6262r778r07J67L303l393j3664N076
264a8535K5615K767j7896P073K0923l423r766K142p446p586J3482l77k8108L79
278b0756L2475l69k6482O492K4016k040j1640q82k360p79M902q088j3972O947
292a2536J3907k972m255O738N439M439O459n261j1429L908Q302r819j6470j960
306a5510R140M897o945p865J0423J7975l235j2856P542J1576r180r137N269k539
320d45r727M428O137p684j002J3325M115o214K095N462k198l423l798p380l49
335f658N055p033j0241R461J3985n526o674J2208J0396o404m195M679k557p554
$$ plain form
349 -1058 -612 -377 -8257 -10910 -3965 -1444 -3928 -989 3755 4833 6787 7241 1853 -250 2586 -2317
365 -2317 -9938 -6233 -2312 -8807 -8437 3492 5837 139 5248 12736 8600 4503 5670 715 -5362
380 -5362 -3202 -3948 -11188 -10364 -3211 -2275 -2383 2093 4051 4776 8698 7571 1089 876 3212 -2683 -8526
397 -8526 -5206 -1933 -4316 -4362 1169 5741 5326 3588 5187 6792 2920 -1450 -1483 -4085 -9692 -7362
413 -7362 -2411 -6770 -8762 1786 8131 3594 3736 8536 7603 6314 4881 -3481 -5926 1671 -2610
428 -2610 -14003 -5937 4951 -4011 -6110 9150 8363 -3617 4352 11623 -2893 -7711 3157 -2052
442 -2052 -12384 -4001 633 -6276 318 8587 370 2354 16125 6765 -7605 5413 10869 -10655
456 -10655 -13914 3286 -2679 -15546 -3047 5685 -4112 -763 11182 5639 276 7370 4460 -4214
$$ packed form
349a058M46K35p880k653O945K521k484K939M744J078J954M54n388k103K836m903
365b317p621L705L921o495L70J1929K345n698N109P488m136m097J167m955o077
380e362K160p46p240Q24P153R36j08M476J958P25L922j127o482k13K336n895n843
397h526L320L273k383m6N531M572m15j738J599J605l872m370l3k602n607K330
413g362M951m359j992J0548O345m537J42M800r33j289j433q362k445P597m281
428b610j1393Q066J0888q962k099J5260p87j1980P969P271j4516m818J0868n209
442b052j0332Q383M634o909O594Q269q217J984J3771r360j4370J3018N456k1524
456a0655l259J7200n965j2867J2499Q732r797L349J1945n543n363P094k910q674
$$ plain form
470 -4214 -204 -382 -10390 -6044 3576 -4646 -8411 6497 9742 -1860 1653 11791 4920 -3416
484 -3416 487 414 -5970 -6344 -5033 -6002 -2717 321 -1123 2459 8247 4911 1637 6623 5859 -2916
500 -2916 -3837 171 -3767 -8476 -5350 -1569 -1077 -406 1119 4359 7437 4626 833 3778 4040 -3810
516 -3810 -5815 -1037 -3703 -8134 -2742 1312 -1787 719 6027 3752 2755 6068 2192 -2494 1638
531 1638 87 -8780 -5301 2423 -4323 -7527 4365 6606 -2263 2389 10209 1987 -2980 4184 1130
546 1130 -8013 -3640 279 -7022 -5830 2844 116 -2543 6222 7163 -360 3492 8259 -806 -5024
561 -5024 1897 -681 -8164 -3585 801 -3863 -2247 4293 1837 -448 4879 4480 -1436 -135 1618
576 1618 -3670 -4680 -907 -2900 -4664 846 3057 55 2665 6739 3961 1620 3463 1698 -2175
$$ packed form
470d214M010j78j0008M346R620q222l765J4908L245j1602L513J0138o871q336
484c416L903p3o384l74J311r69L285L038j444L582N788l336l274M986p64q775
500b916r21M008l938m709L126L781M92O71J525L240L078k811l793K945K62p850
516c810k005M778k666m431N392M054l099K506N308k275r97L313l876m686M132
531A638j551q867L479P724o746l204J1892K241q869M652P820q222m967P164l054
546A130r143M373L919p301J192Q674k728k659Q765R41p523L852M767r065m218
561e024O921k578p483M579M386m664J616O540k456k285N327l99n916J301J753
576A618n288j010L773j993j764N510K211l002K610M074k778k341J843j765l873
$$ plain form
591 -2175 -2186 -2724 -5339 -4486 -2374 -2942 -2129 957 1951 2348 3610 2648 1472 2619 1287 -2323 -1946 -607
609 -607 -2592 -2338 534 -105 -273 3918 4095 61 1679 4089 -693 -3514 -465 -2246 -6249 -2939
625 -2939 -428 -3910 -2064 3807 2201 247 5018 5401 346 1407 3514 -1620 -3573 237 -1724
640 -1724 -5329 -1047 1704 -2158 -1088 3821 1980 -610 2262 1863 -2156 -1001 481 -3042 -3293 357
656 357 -530 -1668 2272 3010 22 2457 5209 789 -1885 1576 872 -3917 -3383 -1019 -2509 -2698 -157
673 -157 -148 -72 2619 2578 465 2003 3110 -391 -1717 745 -395 -3416 -1532 909 -968 -1336 1842
690 1842 2394 289 730 2185 882 -983 -1020 -897 -1547 -2012 -1848 -1157 -16 484 480 1356 2574 2042 528
709 528 729 1373 -335 -2415 -1510 -62 -1677 -2982 -301 2061 300 -652 2177 3453 934 -340
$$ packed form
591b175j1n38k615Q53K112n68Q13L086R94L97J262r62j176J147j332l610L77J339
609f07j985K54K872o39j68M191J77m034J618K410m782k821L049j781m003L310
625b939K511l482J846N871j606j954M771L83n055J061K107n134j953L810j961
640a724l605M282K751l862J070M909j841k590K872l99m019J155J482l523k51L650
656C57q87j138L940P38k988K435K752m420k674L461p04m789N34K364j490j89K541
673a57RP6K691m1k113J538J107l501j326K462j140l021J884K441j877l68L178
690A842N52k105M41J455j303j865l7J23o50m65J64O91J141N00mQ76J218n32j514
709E28K01O44j708k080R05J448j615j305K681K362j761r52K829J276k519j274
$$ plain form
725 -340 767 417 -1277 -1711 -1611 -1894 -1249 -455 -587 -122 1157 1249 966 1651 1258 -395 -106 929 -833
744 -833 -2576 -454 1285 -868 -1590 1832 3019 221 -393 1929 1836 -770 -1742 -1363 -1485 -1628 -1790 -2413
762 -2413 -1751 403 1331 625 699 1810 2522 2547 1430 -485 -495 1332 529 -2636 -2487 661 959 -1428
780 -1428 -1383 907 1623 79 -1238 -601 668 -175 -2444 -2210 72 542 -607 -419 926 2235 3190
797 3190 2326 112 467 2915 1779 -2421 -3411 -917 -26 -1937 -3622 -2681 430 1880 -386 -1567
813 -1567 1571 3369 711 -844 742 1026 -163 -181 -352 -592 1066 1800 -510 -763 2431 2436 -1178 -2079
831 -2079 -296 -77 -1192 -2761 -4065 -1930 1985 476 -3463 -495 5225 3832 -318 873 3330
846 3330 2154 598 -171 -1604 -1332 368 -989 -3317 -1323 1438 -178 -1939 -39 1613 437 -1096
$$ packed form
725c40J107l50j694m34J00k83O45P94j32M65J279R2k83O85l93j653K89J035j762
744h33j743K122J739k153p22L422J187k798o14K322r3k606r72L79j22j43j62o23
762b413O62K154R28p06P4J111P12K5j117j915j0J827q03l165J49L148K98k387
780a428M5K290P16j544j317O37J269q43k269K34K282M70j149J88J345J309R55
797C190q64k214L55K448j136m200r90K494Q91j911j685R41L111J450k266j181
813a567L138J798k658j555J586K84j189j8j71k40J658P34k310k53L194Nl614r01
831b079J783K19j115j569j304K135L915j509l939K968N720j393m150J191K457
846C330j176j556p69j433K72J700j357k328J994K761j616j761J900J652j176j533
$$ plain form
862 -1096 -1384 -545 787 240 -2208 -1855 2171 3682 437 -1228 2087 4764 2377 -1330 -1234 928 425
879 425 -2286 -3425 -2617 -1643 -908 -851 -1551 -594 2053 2258 71 428 2583 1504 -870 -312 819 40
897 40 -522 -510 -716 783 2499 238 -2161 691 3183 -359 -3533 -1545 90 -1286 -1835 -1536 -1687
914 -1687 110 2522 1393 -337 1715 3696 1925 217 561 325 -697 -970 -1326 -1829 -1206 -707 -1078
931 -1078 -493 1002 914 -280 -146 1084 1173 -432 -1692 -825 693 225 -963 -344 1052 1403 1591 1619
949 1619 516 276 1372 597 -1688 -1787 -1014 -1962 -2159 -632 -801 -1605 276 2044 1087 685 1733 1214
967 1214 416 1243 711 -1616 -1341 682 59 -1423 -455 643 363 679 985 -184 -616 337 -170 -1765
985 -1765 -1430 -664 -1347 -1387 279 995 285 600 1941 2407 1699 776 205 232 290 -503 -1858 -2162 -1068 -14
$$ packed form
862a096k88Q39J332n47k448L53M026J511l245j665L315K677k387l707R6K162n03
879D25k711j139Q08R74P35N7p00R57K647K05k187L57K155j079k374N58J131p79
897D0n62J2k06J499J716k261k399K852K492l542l174J988J635j376n49K99j51
914a687J797K412j129j730K052J981j771j708L44k36j022k73l56n03O23M99l71
931a078N85J495q8j194J34J230Q9j605j260Q67J518m68j188O19J396L51J88K8
949A619j103k40J096p75k285r9P73r48j97J527j69q04J881J768r57m02J048n19
967A214p98Q27n32k327K75K023o23j482R68J098k80L16L06j169m32R53n07j595
985a765L35P66o83m0J666P16p10L15J341M66p08r23n71K7N8p93j355l04J094J054
$$ plain form
1005 -14 -464 -1263 -479 1188 1397 348 -97 302 419 137 -574 -1201 -572 495 -104 -754 904 2082 601
1024 601 -93 1493 1666 -361 -1103 -767 -1066 -1178 -1102 -1884 -1845 302 1280 -16 -135 1591 2164 1316 724
1043 724 145 -161 434 185 -1531 -1683 183 446 -938 -577 1020 878 -270 -65 523 -171 -974 -918 -838
1062 -838 -902 -519 -63 -114 284 1390 1877 1289 853 1197 1204 526 -470 -1308 -1333 -659 -889 -2054 -1685 265 647
1083 647 -553 -177 1374 1161 -26 220 719 -182 -676 51 100 -529 45 927 679 369 882 1036 385
1102 385 -104 -340 -759 -925 -1171 -1705 -1541 -491 -203 -739 35 1552 1399 498 1127 1782 647 -312 288
1121 288 253 -1044 -1151 -50 -97 -969 -455 706 596 -164 -115 339 219 -357 -848 -849 -340 -203 -624 -398 654
1142 654 950 603 946 1408 771 203 596 301 -1086 -1375 -420 -566 -1689 -1264 291 401 -374 98 1289
$$ packed form
1005a4m50p99P84J667K09j049m45L99J17k82p11o27O29J067n99o50J658J178j481
1024F01o94J586J73k027p42L36k99j12P6p82L9K147R78j296j19J726N73q48n92
1043G24n79l06N95k49j716j52J866K63j384L61J597j42j148K05N88o94q03N6Q0
1062h38o4L83M56n1L98J106M87n88m36L44Po78r96q38k5O74k30j165L69J950L82
1083F47j200L76J551k13j187K46M99r01m94P27M9o29N74Q82k48l10N13J54o51
1102C85m89k36m19j66k46n34J64J050K88n36P74J517j53r01O29O55j135r59O00
1121B88l5j297j07J101m7q72N14J161j10p60M9M54j20n76m91jN09J37m21K26J052
1142F54K96l47L43M62o37n68L93k95j387k89R55j46j123M25J555J10p75M72J191
$$ plain form
1161 1289 1161 230 79 567 478 -262 -726 -485 63 109 -256 -145 524 729 342 283 217 -363 -493 -16 -538
1182 -538 -1671 -1131 369 96 -989 -161 1418 1258 286 531 1153 784 -82 -414 -255 -232 -670 -1027 -567
1201 -567 156 77 -235 242 740 547 214 288 -40 -535 -266 86 -634 -1226 -250 838 290 -458 293 1228
1221 1228 808 -17 -38 116 -44 -366 -680 -666 -308 -196 -379 106 719 480 198 630 805 97 -252 -24
1241 -24 -395 -943 -517 -185 -759 -863 247 787 156 -27 602 891 506 137 -48 -65 46 -40 -395 -392 13
1262 13 158 65 167 255 -52 -141 14 -145 -674 -740 -430 -423 -523 -120 220 139 380 970 1023 468 413 701 442
1285 442 -122 -321 -388 -589 -582 -410 -460 -592 -236 113 81 -46 32 49 74 135 -32 -158 22 287 360 324 489 617
1309 617 558 441 437 174 -356 -575 -420 -653 -1190 -1095 -610 -523 -567 -53 455 412 572 1046 948 522 584 623 199
$$ packed form
1161A289j28r31j51M88q9p40m64K41N48M6l65J11O69K05l87n9o6n80j30M77n22
1182e38j133N40J500k73j085Q28J579j60r72K45O22l69q66l32J59K3m38l57M60
1201e67P23p9l12M77M98j93l33P4l28m95K69L52p20n92R76J088n48p48P51R35
1221A228m20q25k1J54j60l22l14J4L58J12j83M85O13k39k82M32J75p08l49K28
1241b4l71n48M26L32n74j04J110N40o31j83O29K89l85l69j85j7J11q6l55LM05
1262A3J45r3J02Q8l07q9J55j59n29o6L10Pj00M03L40q1K41N90N3n55n5K88k59
1285D42n64j99o7k01PJ72n0j32L56L49l2j27P8J7K5O1j67j26J80K65P3l6J65J28
1309F17n9j17mk63n30k19J55k33n37R5M85Q7m4N14N08m3J60M74r8m26O2L9m24
$$ plain form
1332 199 22 35 -276 -449 -107 -43 -445 -394 10 -194 -551 -296 -275 -730 -697 -215 -278 -413 40 578 619 765
1354 765 1094 1057 919 1058 695 6 -99 -123 -745 -1140 -819 -755 -1125 -840 -183 -173 -361 124 533 317 203
1375 203 409 383 260 359 302 230 428 592 310 299 614 271 -339 -165 -47 -886 -1287 -705 -637 -1308 -947 5
1397 5 19 -101 585 1063 829 862 1048 689 425 385 -46 -359 -96 -310 -831 -361 249 -343 -740 186 464 -514
1419 -514 -704 125 -53 -774 -495 91 -5 45 416 710 851 1066 860 608 750 525 -381 -641 -352 -875 -1521
1440 -1521 -1014 -524 -897 -772 258 514 126 484 1093 713 217 413 396 -112 -244 0 -63 -121 90 176 309
1461 309 572 311 -207 27 245 -619 -1306 -657 -365 -1092 -1087 -6 234 -53 601 1303 1019 740 1077 869
1481 869 246 5 -154 -676 -771 -497 -738 -835 -183 99 -207 143 630 173 -94 421 180 -681 -410 221 -283
$$ packed form
1332A99j77J3l11j73L42O4m02N1M04k04l57K55K1m55L3M82o3j35M53N38M1J46
1354G65L29l7j38J39l63o89j05k4o22l95L21O4l70K85O57J0j88M85M09k16j14
1375B03K06k6j23R9n7p2J98J64k82j1L15l43o10J74J18q39m01N82O8o71L61R52
1397EJ4j20O86M78k34L3J86l59k64m0m31l13K63k14n21M70O10n92l97R26K78r78
1419e14j90Q29j78p21K79N86r6N0L71K94J41K15k06k52J42k25r06k60K89n23o46
1440a521N07M90l73J25J030K56l88L58O09l80m96J96j7n08j32K44o3n8K11Q6J33
1461C09K63k61n18K34K18q64o87O49K92p27NJ081K40k87O54P02k84k79L37k08
1481H69o23k41j59n22r5K74k41r7O52K82l06L50M87m57k67N15k41q61K71O31n04
$$ plain form
1502 -283 -647 257 663 153 342 995 714 212 333 191 -362 -509 -684 -967 -757 -433 -652 -490 405 620
1522 620 92 469 1141 621 -96 248 389 -367 -630 -189 -214 -496 -151 257 138 160 430 319 86 -33 -209
1543 -209 -442 -399 -409 -702 -467 166 166 -54 583 1159 648 234 690 682 -217 -595 -185 -400 -1000 -792 -252 -221
1565 -221 -295 123 477 516 365 267 254 249 -42 -534 -500 -36 -114 -511 -139 580 493 211 538 828 354 -65 68
1588 68 -98 -635 -763 -526 -529 -568 -288 103 273 347 510 708 619 275 61 117 4 -528 -721 -379 -84 -227
1610 -227 -274 120 471 502 333 183 246 239 -93 -481 -404 -276 -466 -493 -29 153 72 357 672 469 285 499 244
1633 244 -338 -346 -79 -474 -837 -400 -42 -138 -5 313 324 340 618 401 -112 -83 142 -250 -642 -304 -127 -279
1655 -279 -113 296 288 214 438 379 89 64 24 -347 -516 -296 -301 -501 -298 98 274 334 396 386 439 436 153 -118 -131
$$ packed form
1502b83l64R04M06n10J89O53k81n02J21j42n53j47j75k83K10L24k19J62Q95K15
1522F20n28L77O72n20p17L44J41p56k63M41k5k82L45M08j19K2K70j11k33j19j76
1543b09k33M3j0k93K35O33%k20O37N76n11m14M56qq99l78M10k15o00K08N40L1
1565b21p4M18L54L9j51r8j3nk91m92L4M64p8l97L72P19q7k82L27K90m74m19J33
1588F8j66n37j28K37ll9K80L91J70P4J63J98q9l44k14N6j13n32j93L42K95j43
1610b27m7L94L51L1j69j50O3pl32l88P7J28j90k7M64J82q1K85L15k03j84K14k55
1633B44n82qK67l95l63M37L58r6J33L18J1J6K78k17n13K9K25l92l92L38J77j52
1655b79J66M09qp4K24n9k90k5m0l71j69K20nk00K03L96J76O0O2j0N3lk83k71j3
$$ plain form
1680 -131 -225 -427 -403 -247 -269 -135 172 229 256 374 391 82 14 135 -180 -615 -443 -143 -355 -328 117 181 160
1703 160 547 726 217 26 461 217 -598 -529 -77 -369 -705 -199 208 73 196 434 398 487 563 7 -467
1724 -467 -4 167 -739 -1065 -146 208 -305 -269 457 549 289 522 571 39 -173 138 -116 -744 -706 -196 -103 -322
1746 -322 -140 402 683 455 213 461 703 171 -628 -595 12 -131 -880 -943 -53 556 201 -225 265 1010 784
1767 784 18 -54 202 -170 -529 -289 -398 -872 -263 593 60 -470 590 1248 191 -325 542 527 -538 -695
1787 -695 -260 -332 -326 -268 -612 -176 1149 776 -690 3 1585 645 -979 -359 419 -507 -746 18 -388 -825
1807 -825 477 1042 -194 -276 1026 873 -289 -180 190 -292 -472 -313 -563 -439 282 90 -479 331 1288
1826 1288 350 -589 170 891 -70 -914 -582 -146 -124 -172 -298 -240 383 916 560 -8 196 580 309 -286 -562
$$ packed form
1680a31r4k02K4J56k2J34L07N7K7J18J7l09o8J21l15m35J72L00k12K7M45O4k1
1703A60L87J79n09j91M35k44q15O9M52k92l36N06M07j35J23K38l6Q9P6n56m74
1724d67M63J71r06l26R19L54n13L6P26R2k60K33M9n32k12L11k54o28L8N10R3k19
1746c22J82N42K81k28k42K48K42n32p99L3O07j43p49o3Q90O09l55m26M90P45k26
1767G84p66p2K56l72l59K40j09m74O09Q56n33n30J060O58j057n16Q67j5j065j57
1787f95M35p2ON8l44M36J325l73j466O93J582r40j624O20P78r26k39P64m06m37
1807h25J302N65j236q2J302j53j162J09L70m82j80J59k50J24P21j92n69Q10R57
1826A288r38r39P59P21r61q44L32M36K2m8j26N8O23N33l56n68K04L84k71n95k76
$$ plain form
1847 -562 -555 -346 -277 -428 -484 36 500 282 125 575 661 92 -122 3 -169 -361 -452 -727 -509 327 368 -431
1869 -431 -50 1206 974 -159 8 528 -9 -385 -283 -702 -876 13 139 -652 -147 970 462 -3 838
1888 838 751 -384 -125 539 -507 -1239 -73 136 -1011 -510 878 398 -460 474 1154 250 -243 148 -40
1907 -40 -338 -212 -462 -769 -147 375 -108 -225 610 764 156 200 580 91 -538 -194 53 -591 -904 -128 320
1928 320 -191 -297 518 793 182 6 493 386 -317 -422 -99 -208 -433 -350 -130 125 221 195 156 402 426 33
1950 33 -208 30 -86 -547 -527 -96 -80 -378 -111 533 466 -23 282 778 345 -373 -146 247 -301 -777 -249
1971 -249 106 -321 -192 451 312 -62 395 600 -57 -190 129 -238 -591 -134 -145 -685 -163 644 69 -308
1991 -308 663 851 -168 -145 638 -45 -818 -100 220 -648 -653 256 187 -206 369 617 33 137 676 163 -512
$$ packed form
1847e62PK09O9j51n6N20M64k18j57M50Q6n69k14J25j72j92r1k75K18Q36M1p99
1869d31L81J256k32j133J67N20n37l76J02m19j74Q89J26p91N05J117n08m65Q41
1888H38q7j135K59O64j046p32J166K09j147N01J388m80q58R34O80r04m93L91j88
1907d0k98J26k50l07O22N22m83j17Q35J54o08M4L80m89o29L44K47o44l13P76M48
1928C20n11j06Q15K75o11j76M87j07p03j05L23j09k25Q3K20K55R6k6l9K46K4l93
1950C3k41K38j16m61K0M31J6k98K67O44o7m89L05M96m33p18K27L93n48m76N28
1971b49L55m27J29O43j39l74M57K05o57j33L19l67l53M57j1n40N22Q07n75l77
1991c08R71J88j019K3P83o83p73P18L20q68nR09o9l93N75K48n84J04N39n13o75
$$ plain form
2012 -512 -153 78 -447 -498 -56 -212 -302 279 458 9 23 535 319 -129 -45 -84 -362 -348 -83 -185 -352 -44
2034 -44 264 258 229 252 235 214 238 38 -208 -278 -227 -177 -161 -241 -227 10 301 260 89 118 274 136 9 -46 -227 -323
2060 -323 -162 -24 -140 -174 71 154 195 312 233 -74 -21 279 -12 -464 -340 -18 -153 -223 -12 66 -57 218
2082 218 476 103 -133 148 169 -89 -136 -153 -285 -195 125 -18 -185 113 351 134 70 260 72 -227 -102 118
2104 118 -128 -462 -263 151 139 -129 -145 183 365 131 1 67 -14 -140 -59 -33 -242 -291 -64 107 70 1 26
2127 26 192 321 201 -98 -55 207 -45 -342 -66 198 -260 -382 316 454 -269 -285 484 379 -258 -211 148
2148 148 -71 -280 -75 -81 -237 -53 137 44 99 206 23 27 394 133 -462 -110 380 -130 -621 29 401 -218
2170 -218 -290 396 360 -239 -131 336 160 -246 -192 -15 -13 -70 -178 -148 133 182 -50 57 292 49 -198 78 241
$$ packed form
2012e12L59K31n25n1M42j56r0N81J79m49J4N12k16m48Q4l9k78J4K65j02j67L08
2034d4L08ok9K3j7k1K4k00k46p0N1N0J6q0J4K37K91m1j71K9J56j38j27n5j81r6
2060c23J61J38j16l4K45Q3M1J17p9l07N3L00k91m52J24L22j35p0K11P8j23K75
2082B18K58l73k36K81K1k58m7j7j32R0L20j43j67K98K38k17o4J90j88k99J25K20
2104A18k46l34J99M14j2k68j6L28J82k34j30O6q1j26Q1K6k09m9K27J71l7o9K5
2127B6J66J29j20k99M3K62k52k97K76K64m58j22O98J38p23j6P69j05o37M7L59
2148A48k19k09K05oj56J84J90r3N5J07j83ML67k61n95L52M90n10m91O50L72o19
2170b18p2O86l6n99J08M67j76m06N4J77Kn7j08L0K81M9k32J07K35k43k47K76J63
$$ plain form
2193 241 -210 -415 -14 183 -181 -348 73 294 19 -115 111 277 81 -165 34 140 -121 -334 -37 161
2213 161 -66 -216 101 273 46 -69 121 161 -36 -158 -23 17 -164 -226 -16 111 -49 -79 85 248 163 -23
2235 -23 18 144 54 -203 -117 28 -109 -253 -43 102 -90 -119 198 193 -106 -12 207 -1 -192 -33 45 -113 -40
2258 -40 37 -22 61 216 73 5 175 165 -127 -53 94 -124 -273 -40 4 -234 -62 208 33 -120 163 226 -72
2281 -72 -32 138 -8 -131 -39 -40 -113 -4 66 -24 49 176 55 -5 134 63 -173 -56 48 -133 -245 -10 90 -108
2305 -108 -59 191 186 33 47 145 68 -57 -62 -37 -63 -140 -124 -44 -17 -27 -19 65 157 44 -19 45 85 -33 -184 -23 80
2332 80 -93 -154 78 181 -3 -10 224 161 -35 -26 49 -86 -108 -54 -82 -100 -26 -21 -38 116 126 -37 79 272 66 -164
2358 -164 83 154 -139 -180 54 18 -128 13 77 -29 8 75 -60 -98 68 -52 -191 -54 2 -143 -60 143 23
$$ packed form
2193B41m51k05M01J97l64j67M21K21k75j34K26J66j96k46J99J06k61k13K97J98
2213A61k27j50L17J72k27j15J90M0j97j22J35M0j81o2K10J27j60l0J64J63q5j86
2235b3M1J26r0k57Q6J45j37j44K10J45j92k9L17nk99R4K19k08j91J59P8j58P3
2258d0P7n9Q3J55j43o8J70j0k92P4J47k18j49K33M4k38J72K70j75j53K83O3k98
2281g2M0J70j46j23R2jp3J09P0r0P3J27j21o0J39p1k36J17J04j81j12K35J00j98
2305a08M9K50nj53J4R8p7j25nK5k6p7J6Q0K7j0QQ4R2j13o3O4M0j18j51J61J03
2332H0j73o1K32J03j84pK34o3j96RP5j35k2N4k8j8P4Nj7J54J0j63J16J93k06k30
2358a64K47P1k93m1K34l6j46J41O4j06L7O7j35l8J66j20j39J37N6j45Q3K03j20
$$ plain form
2381 23 -30 200 227 18 42 184 78 -87 -21 -15 -118 -42 -15 -77 -64 71 2 -95 43 113 8 -75 29 17 -89
2406 -89 -54 -3 -24 -11 108 57 3 43 76 22 -4 -7 -35 -105 -50 -74 -121 -81 71 52 -27 39 183 85 -20 41 128 14
2434 14 -64 -17 5 1 -20 -48 -39 25 45 -46 -42 13 -2 -70 -62 -45 -88 -78 59 4 -66 73 180 73 -11 90 151 26 -82
2463 -82 -17 21 1 -58 -126 -47 46 -18 -60 -22 49 52 8 -18 -23 29 45 -18 -24 18 83 49 6 0 29 75 24 -48 -64 42 -11 -138
2495 -138 -104 14 7 -79 -46 70 54 20 41 30 -20 46 102 -39 -96 61 104 -3 -66 -1 47 26 12 -44 -32 20 15 -76
2523 -76 -77 -2 -24 -34 28 38 -35 -9 130 100 -83 -43 90 44 -59 -71 8 14 -107 -63 71 33 -49 -4 82 17 -7 59
2551 59 76 -39 -25 86 61 -16 -19 54 153 65 -100 -63 175 162 -170 -244 102 136 -129 -175 -27 69 -17 -48 38 -11 -5
2578 -5 82 74 -55 -53 68 102 -93 -99 66 154 -23 -141 28 181 65 -163 -91 156 131 -191 -228 75 217 -53 -199
$$ packed form
2381B3n3K30K7k09K4J42j06j65O6Oj03P6K7o2J3J35o9r7J38P0j05q3J04j2j06
2406h9L5N1k1J3J19n1n4M0L3n4k6lk8p0N5k4m7M0J52j9p9O6J44r8j05O1Q7j14
2434A4p8M7K2mk1k8RO4K0r1MN5j5o8QJ7m3J0J37n5p0J39J07j07q4J01O1j25j08
2463h2O5L8k0n9o8P9R3o4m2L8P1Lm4k6nN2J6o3oM2O5l4m3oK9M6n1p2j6J06n3j27
2495a38L4J18pq6L3J16j6l4K1j1n0O6N6j41n7J57M3j07o3O5M8k1j4n6J2N2nr1
2523g6jP5k2j0O2J0p3K6J39l0j83M0J33m6j03j2P9Oj21M4J34l8q2M5Q6o5k4O6
2551E9J7j15J4J11k5p7lP3R9q8j65L7K38j3l32p4L46L4k65m6J48R6q6l1Q6m9O
2578eQ7qj29KJ21L4j95oJ65Q8j77j18J69J53j16k28P2K47k5l22l7L03J42k70j46
$$ plain form
2603 -199 21 150 60 -33 -22 -36 31 105 44 -133 -91 100 119 -101 -159 47 180 21 -146 -24 174 82 -158 -102
2627 -102 141 120 -139 -196 64 168 -22 -176 31 169 90 -33 -89 8 67 68 -23 -120 -44 113 97 -79 -119 76
2651 76 211 35 -181 -70 137 78 -183 -142 93 76 -131 -107 45 102 -3 -73 -17 65 101 -60 -134 -5 99 16
2675 16 -63 -54 2 86 92 -57 -103 48 208 34 -203 -50 179 71 -156 -122 77 61 -30 -60 3 33 40 -13 -79 -41 64
2702 64 -9 -110 -53 72 27 -88 -48 16 56 55 36 -70 6 172 70 -150 -51 165 65 -131 -66 73 50 16 30
2727 30 -22 -60 85 75 -94 -80 83 49 -79 -82 29 42 -10 30 27 24 39 45 -49 -50 64 70 -73 -104 54 72 -79 -63 52
2756 52 54 -3 22 21 -61 -2 112 4 -137 11 114 -18 -63 26 40 19 52 1 -69 12 94 -27 -131 -14 105 -40
2782 -40 -113 26 56 -60 -12 77 16 11 33 23 -55 -29 60 -3 -74 -18 31 30 -39 4 35 34 54 39 -17 12 100 12 -81 -6 115
$$ packed form
2603a99K20J29r0r3J1j4O7P4o1j77M2J91J9k20n8K06J33j59j67J22J98r2k40N6
2627a02K43k1k59n7K60J04j90j54K07J38p9j23n6R7N9Jr1r7P6J57j6j76m0J95
2651G6J35j76k16J11K07n9k61M1K35j7k07K4J52N7j05p0N6Q2L6j61p4J29J04q3
2675A6p9RN6Q4Oj49m6J51J60j74k37J53K29j08k27L4J99j6r1l0O3L0Pn3o6L8J05
2702F4p3j01N7J25m5j15M0O4M0jj9j06P6J66j02k20R9K16j00j96O5J39k3l4J4
2727C0n2l8J45j0j69J4J63l4j28lJ11J3n2M0llJ5Or4jJ14Oj43l1J58J8j51J6J15
2756E2Kn7K5jq2N9J14j08j41J48J03j32m5Q9J4k1L3n1p0Q1Q2j21j04J17J19j45
2782d0p3J39L0j16M8Q9o1nK2j0p8K6Q9o3p1N6M9jo9M3L1jK0j5n6K9Q8q8r3P5J21
$$ plain form
2813 115 -13 -74 54 87 -42 -32 24 16 -48 3 42 -65 -59 -2 -12 -40 -31 2 -23 23 7 -50 0 53 40 -52 -3 77 7
2842 7 -51 43 61 -12 -34 70 55 -21 -22 68 29 -45 -34 4 6 -30 -31 3 -8 25 -15 -18 49 49 -37 -27 50 42 -53 -42 7 -4 -36
2875 -36 56 35 -44 0 88 52 -52 -14 63 22 -17 -43 -16 35 9 -51 -17 56 28 -30 5 103 24 -40 1 41 14 -36 -21 23
2905 23 -18 15 44 13 -4 39 83 -24 -60 -37 34 20 -45 -69 -3 28 16 -58 -48 95 72 -23 -46 43 7 -31 -8 35 -9
2934 -9 -11 51 42 10 46 46 22 -2 47 16 -54 -4 -4 28 -7 -27 -27 -12 65 19 -74 -59 63 52 -63 -46 -1 -21 -63 -13 8 -21
2966 -21 2 70 37 -16 67 72 34 -29 27 42 -43 -4 55 12 -20 1 28 4 62 64 -31 -44 54 24 -84 -56 42 14 -24 14 3
2997 3 -22 11 70 39 -25 -15 64 16 -37 5 6 -17 -18 36 32 -10 28 58 7 10 22 -1 -15 16 0 -61 -41 46 10 -30 11 51 -14
3030 -14 -22 66 21 -46 -3 46 -15 -39 8 -4 -18 -5 -14 -9 -18 52 47 18 20 -5 5 10 15 -31 -19 -11 35 30 -40 3 63 44 7 34 63
$$ packed form
2813A15j28o1J28L3j29J0N6qo4N1L9j07ON7j0k8RL3k5M6j6n7N0N3j3r2M9Q0p0
2842Gn8R4J8p3k2J04j5p6jR0l9p4J1L8Kl6jL4j1L3m0lO7%q6J0P7qr5J1M9j1l2
2875c6R2k1p9M4Q8l6j04L8P7m1l9k6K7N1k6o0L4P3k8n8L5R8p9o4M1M0k7n0J5M4
2905B3m1L3K9l1j7M3M4j07l6K3P1j4o5k4O6L1j2p4J0J43k3r5k3Q9l6l8K3M3m4
2934ikO2rl2L6%k4k4M9l1p0N0%L2l5k0%J5P7m6r3J5J22j1j15J7M5k0m2N0K1k9
2966b1K3O8l3n3Q3Nl8o3N6J5q5L9N9m3l2K1K7k4N8Kr5j3R8l0j08K8R8k8l8L8j1
2997Ck5L3N9l1o4J0P9m8n3M2Jk3jN4mm2L8L0n1LJ2k3j4L1j6o1K0Q7l6m0M1M0o5
3030a4qQ8m5o7M3M9o1k4M7j2j4J3rNrP0nk9Kk5J0NNm6J2QM6np0M3O0j9l7K7K9
$$ plain form
3065 63 -4 16 40 -10 -24 9 17 7 -2 16 -10 -11 28 -6 -64 -26 16 -46 -16 -19 -5 -51 6 9 0 -28 30 16 -5 -3 -1 24 25 17 26 30
3101 30 -13 -2 31 25 -3 18 24 -20 2 10 -5 -9 -7 -24 -25 16 11 -22 13 14 -17 -8 -7 -17 -10 19 2 20 5 17 4 -26 11 0 -7 12
3137 12 38 23 8 32 4 -8 36 22 -25 9 10 22 6 14 11 -23 -4 38 24 11 14 -16 -11 -9 6 -41 -17 -5 17 -16 17 11 -3 -15
3171 -15 9 5 -4 -11 20 40 -30 -28 11 6 -7 -22 30 32 -11 36 27 19 15 1 -11 32 39 15 -9 14 16 1 -4 24 -26 -15 4 10 -27 -5 -15
3208 -15 -23 -3 -41 -33 4 -5 -48 -22 26 -17 -14 6 41 6 10 37 36 39 17 7 15 38 1 1 11 63 9 -36 25 50 2 -14 2 3 0 -36
3244 -36 24 11 -11 -15 -3 4 -3 -39 30 50 17 16 28 -1 9 -12 20 37 11 9 0 55 14 -8 12 77 27 17 26 23 17 -20 15 18 4
3279 4 -36 -32 16 15 -27 -32 27 19 -7 5 18 -27 -18 -34 20 -20 -5 -10 3 -14 -29 12 38 2 11 31 2 29 -10 -18 10 7 -6 -14 16 12
3315 12 -5 15 43 48 16 -1 30 61 -13 -5 21 12 5 5 25 4 -4 -11 33 22 5 -15 -4 -23 -46 -43 -9 -17 -8 -12 12 24 45 19 -7 27
$$ packed form
3065F3o7K0K4n0j4L3Qj0rJ8k6jL9l4n8L8M2o2L0lJ4m6N7Lrk8N8j4k1KKK5JqRM
3101C0m3J1L3ok8K1Om4K2Qj5mKj7jM1nl3L5Jl1RJj0PK9j7J8j5J2j3l0L7j1pJ9
3137A2K6j5j5K4k8j2M4j4m7L4JJ2j6Qll4J9M2j4j3Ll0NKJ5m7K4J2K2l3L3oj4j2
3171a5K4mrpL1K0p0KL9nj3j5N2Km3M7rqmj4j2M3Pk4k4K3Kj5nK8n0J1J9Ol7K2j0
3208a5qK0l8QL7rm3K6M8m3LK0L5l5MK7jLk2j0QK3l7%J0N2n4m5O1K5m8j6J6Jll6
3244c6O0j3k2mJ2Ppl6O9K0l3jJ2k9J0k1L2J7k6krN5m1k2K0O5n0j0Rlol7L5Lj4
3279Dm0MM8jm2nN9qk6J2J3m5Rj6N4m0J5nJ3j7j5M1K6l6RK0k9K7l9qK8lj3qL0m
3315A2j7K0K8Nl2j7L1L1p4QK6rp%K0k1qpM4j1j7k0J1j9k3LL4qRmK4J2K1k6k6L4
$$ plain form
3351 27 39 7 8 27 5 -12 26 32 6 3 30 54 32 33 10 21 3 -7 -9 -34 -34 -13 -15 -3 -17 -17 25 30 24 0 -10 -3 11 2 -46 -23
3387 -23 -1 2 5 23 21 1 12 39 34 1 21 48 37 -10 -19 20 5 18 -9 -14 -6 11 14 -19 -2 5 -1 -33 -9 4 -45 -50 1 3 22 1
3423 1 33 17 35 44 48 9 4 35 11 -28 -14 8 4 40 2 -11 35 23 13 -31 -8 17 14 -31 -13 12 29 -2 -2 25 -1 16 2 -6
3457 -6 33 -23 4 -9 -18 32 9 -38 -37 29 27 -18 -23 15 28 18 -4 14 -2 29 39 -4 -28 34 32 13 15 18 28 20 18 3 -2 9 19 3
3493 3 -15 6 30 -23 -26 30 36 -22 -52 25 29 -40 -49 -16 -6 -9 -9 -23 -37 -13 13 -32 -37 -16 29 -11 30 23 -7 -11 45 57 -37 -28 27 31
3529 31 -31 38 30 3 -1 -13 14 -19 -19 -23 -11 -8 0 7 -21 8 22 -13 -25 13 1 0 18 20 2 4 54 41 -8 -15 54 77 0 -39 32 5
3565 5 -26 -23 -22 -2 3 10 24 16 10 30 34 38 7 5 25 -13 -15 -14 -3 -6 -11 -14 -24 45 17 -35 -14 41 -3 -63 -21 25 -23 -16 19 54 18 -13
3603 -13 14 21 15 -7 35 23 -5 -23 20 -10 23 7 15 14 17 19 -34 39 58 -6 -29 40 45 -31 -59 22 22 -47 -49 10 24 -33 -50 -5 32
$$ packed form
3351B7J2l2JJ9k2j7L8Ok6lK7K4k2Jk3J1j8j0kk5%K1kJ2j4%M2Nok4j0PJ4rm8K3
3387b3K2LLJ8kk0J1K7nl3K0K7j1m7rL9j5J3k7nQJ7Ll3J7Pol2K4J3m9nN1KJ9k1
3423AL2j6J8RMl9nL1k4l9J4K2mL6l8j3M6j2j0m4K3K5lm5J8K5J7l1%K7k6J7j4q
3457fL9n6K7j3rN0k3m7JO6km5nL8J3j0k2J8j6L1J0m3k4O2kj9KLJ0qkj5nJ1J0j6
3493Cj8K1K4n3lN6On8l0P7Mo9rL3J0l%j4j4K4K6m5nK1M5m0M1pl0mN6J2r4RN5M
3529C1o2O9qk7mj2K7l3%mJ2LQPk8K9J4l5j2L8j2jJ8Kj8KN0j3m9pO9K3p7l9P1k7
3565El1LJK0NPJ4qoK0MMl1kK0l8kJJ1lnlj0O9k8n2K1N5m4o0M2M6m8PL5L5l6l1
3603a3K7Pok2M2j2k8j8M3l0L3j6QjLKn3P3J9o4k3O9Np6k8Q1%o9kN9J4n7j7M5L7
$$ plain form
3638 32 -36 -16 28 -10 -4 -6 -8 28 44 10 14 61 28 12 15 74 -6 -24 6 54 29 -64 -16 44 3 -62 6 53 -38 -64 28 22 -42
3671 -42 -20 33 17 -16 -4 7 23 25 12 -50 8 22 -19 -46 34 39 -25 -44 47 34 -28 6 69 21 -3 29 42 15 -20 15 -23
3702 -23 -7 -1 20 7 -5 11 4 -23 -12 -26 -24 -21 -2 -16 -29 19 45 22 -1 60 45 27 15 50 20 -30 -40 -26 -27 -36 -10 -1 10 -16
3736 -16 14 4 28 7 43 51 13 15 16 27 15 13 34 7 20 58 -6 -23 9 16 -45 -63 -19 -38 -92 -41 -15 -8 -27 14 54 17 11 60
3770 60 16 3 26 11 7 -14 4 15 -19 40 16 18 20 19 -2 -13 7 11 -34 -48 -14 -13 -21 -6 16 32 15 50 61 24 -4 -27 -2 -42
3804 -42 -51 -38 -66 -72 -23 -23 -31 -3 50 53 30 33 34 39 -4 13 1 -4 -19 22 19 6 8 19 -1 14 22 -7 -35 -22 0 -59 -52 -17 -10 -28 15
3841 15 53 44 21 72 84 16 -30 31 13 -56 -33 -21 -43 -33 -4 -2 7 2 71 33 -15 70 25 -20 -14 16 -13 -18 55 53 35 40 46 41 20
3876 20 32 32 -7 -50 -36 -27 -43 -47 -22 -26 -12 45 10 55 42 44 25 15 -4 -8 -41 8 15 -8 4 -9 12 53 -4 28 40 25 21 2
$$ packed form
3638C2o8K0M4l8OkkL6J6l4MM7l3j6LN9q0j8L0M8k5r3M8O0m1o5O8M7r1k6R2oo4
3671d2K2N3j6l3J2J1J6Kj3o2N8J4m1k7Q0No4j9R1j3o2L4O3m8k4L2J3k7l5L5l8
3702b3J6OK1j3j2J6pk7J1j4KLJ9j4j3M8K6k3k3O1j5j8j2L5l0n0j0J4jrK6RJ1k6
3736a6L0j0K4k1L6Ql8KJJ1j2kK1k7J3L8o4j7L2Po1j8M4j9n4N1K6Pj9M1M0l7oM9
3770F0m4j3K3j5mk1J8J1l4N9k4KKjk1j1K0Mm5j4L4JqJ5K2J6j7L5J1l7k8k3K5m0
3804d2rJ3k8oM9%qK8N3Lk3LJNm3J7j2nj5M1lj3KJ1k0J5Qk9k8J3K2n9PL5Pj8M3
3841A5L8rk3N1J2o8m6O1j8o9K3J2k2J0K9KRnO9l8m8Q5m5m5OL0k9nP3kj8NOnk1
3876B0J2%l9m3J4Rj6mK5mJ4N7l5M5j3Kj9j0j9ml3M9Pk3J2j3K1M1n7L2J2j5mj9
$$ plain form
3910 2 11 -17 -8 14 -14 -14 0 12 32 41 31 9 10 -9 -23 -20 -35 -15 -71 -55 -31 1 -12 10 35 60 22 26 52 16 -17 -11 7 -16 2
3945 2 6 13 45 9 -2 39 24 37 -3 -6 -14 -18 -67 -49 -39 18 -4 -12 27 25 8 29 35 27 9 -11 -2 -15 -39 -36 3 -5 -20 18 21 27 47 0
3983 0 12 23 4 -28 -37 38 19 -39 4 62 29 -1 24 43 43 -7 6 23 -11 -38 -11 2 -27 -32 -2 31 -11 27 35 51 -7 1 -28
4016 -28 21 4 -40 -18 6 12 -28 -39 15 49 1 -6 101 41 -10 -20 14 13 -39 9 49 18 -17 36 43 27 10 9 27 9 2 -29 -28
4049 -28 -1 -24 -36 -18 7 -20 -23 27 33 0 16 60 16 -9 4 4 18 -16 -10 29 49 35 35 39 44 26 1 -8 10 -21 -16 18 1 17 -28
4084 -28 20 17 -16 1 -2 30 -6 -28 6 -4 -31 -24 -50 -13 -8 12 20 2 10 -27 16 37 19 -4 -17 10 -23 11 7 -12 28 33 21 -5
4118 -5 16 54 16 -9 0 17 -21 -6 -23 -45 -10 9 13 -3 10 30 -2 29 -1 -28 -20 8 -7 -28 6 13 -27 -12 46 17 18 8 18
4151 18 -5 3 -3 -5 -30 30 26 -11 3 20 26 34 40 11 5 39 11 -37 -39 -5 -12 -41 -10 4 -21 2 2 6 13 22 14 -4 -22 -22 -20 -28 14 -21 7
$$ packed form
3910BRk8RK2k8%J4J2K0Rj0k2Jj9j4Lj5K0n6J6K4L2j3K2K5K5l8MK6l6l3OJ8k3J8
3945BMPL2l6j1M1j5J3m0lqmm9J8J0N7k2qL9kj7K1Oqj8k0Rj3k4LL9qj5L8LOK0m7
3983@J2J1j9l2rP5j9n8M3N8l3l0K5J9%n0J3J7l4k7K7J3k9nL0L3m2L8QJ6n8Qk9
4016b8M9j7m4K2K4Om0j1N4L4m8pJ07o0n1j0L4jn2M8M0l1l5N3Pj6j7jJ8j8pl1J
4049b8K7k3j2J8K5k7lN0Ol3J6M4m4k5J3%J4l4OL9K0j4%MNj8k5rJ8l1NL4j7J6m5
4084b8M8ll3J7lL2l6k2L4j0k7Pk6L7NK0Qj8Ql7M3K1j8k3j3K7l3L4mj9M0Nj2k6
4118eK1L8l8k5RJ7l8J5j7k2L5J9Mj6J3K0l2L1l0k7QK8j5k1L4Pm0J5N8k9Jj0J0
4151A8k3Qokk5O0ml7J4J7OQOk9oL4k8m8kL4pk9L1J4k5K3%MPRqj8j8%KqM2l5K8
$$ plain form
4190 7 -11 -4 25 43 10 3 28 20 16 8 24 -20 10 6 -7 -12 21 9 24 31 14 9 -14 9 -15 -10 -29 11 -27 3 -4 -9 -5 8 6 5 14 -3 -8
4229 -8 2 5 -11 -7 18 22 15 34 37 -9 30 34 26 -19 6 -5 5 -12 -35 -7 -19 -6 -30 -6 43 22 1 15 32 -14 -9 18 4 -21 -4
4264 -4 8 2 21 21 4 13 17 -16 16 8 13 -39 -37 3 2 -7 11 22 13 2 32 52 18 26 22 -6 -10 -6 -23 -33 12 -10 16 16 2 -4 28 20 -15
4303 -15 -7 -6 -11 -19 -25 -14 -31 -19 -44 -26 29 28 12 -1 51 28 -7 9 15 -14 -35 13 -6 7 29 16 30 38 48 21 14 22 11 20 -11 -16
4339 -16 -39 -39 -29 -25 -36 -18 6 7 6 -16 -25 -16 16 17 -1 -23 -32 -1 19 27 26 -4 55 28 24 28 46 4 -1 -18 -4 -30 1 -24 28 -4 17
4376 17 8 -7 20 21 15 3 8 -18 -14 -8 -12 -34 3 8 5 16 9 15 -5 1 8 -6 5 6 12 -3 -11 -11 12 16 25 20 46 35 18 1 -18 -12 -24 -8 -16
4417 -16 -24 -46 19 26 26 32 13 -1 20 -8 6 -15 -3 -46 -32 -14 -12 -9 5 47 19 13 7 27 -15 -16 -3 -14 -37 -1 7 13 15 25 27 65 55
4454 55 8 25 34 1 -51 -1 -9 -8 -61 18 -22 -12 19 42 30 -1 15 6 -12 -35 -35 -11 -22 0 -31 -9 18 -29 -8 41 24 43 4
$$ packed form
4190Gj8PK9J8l3pK5qmqJ6m4L0mj3nL3j2J5Pj7nk3K3k4Nj9M0l8L0pnMJ3kjRj7n
4229hJ0Lj6MK5MpJ9Lm6L9Mqm5K5j1J0j7k3K8j2J3k4K4M9k1k1J4J7m6NK7j4k5J7
4264dJ2oJ9%j7RMl3L2qNn2KM0jrJ8J1rj1L0K0l4Qmk8mMj7j0M5k2K6%j4oL2ql5
4303a5QJnqoJ1j7J2k5J8N5jj6j3N2k3l5J6Ok9k1M8j9J3K2j3J4QJ0k7pQj1Rl1n
4339a6k3%J0Mj1J8K4Jjk2rRL2Jj8k2rL1K0Qjl0N9k7mMJ8m2nj7J4k6L1k5N2l2K1
4376A7rj5K7Joj2Nk6MOmk2L7NlJ1pOk0OPj4J1JOj5q%K3MRnK6j1j7j7j9Oj2J6q
4417a6qk2O5P%Oj9j4K1k8J4k1J2m3J4J8KLJ4M2k8ooK0m2jJ3j1k3L6QOKJ0KL8j0
4454E5m7J7Rl3n2N0qJn3P9m0J0L1K3j2l1J6rj8k3%K4j1K2l1K2K7m7K1M9j7J9l9
$$ plain form
4487 4 4 -6 11 10 -25 7 16 26 5 53 45 2 65 72 22 -15 26 -21 -30 -28 9 -28 -12 26 25 -13 22 24 5 0 13 2 -46 12 13 -35
4523 -35 16 -2 -8 42 36 16 21 63 24 5 4 4 -60 3 21 -28 -18 47 17 -14 34 66 -14 -9 28 21 -19 -14 1 -27 24 23 -32 -30 58
4558 58 43 -23 26 11 -9 2 15 -41 -42 3 -10 -4 25 4 -14 30 40 -2 1 42 4 -17 9 -1 -39 6 23 -18 -5 91 31 3
4590 3 20 47 -40 -1 44 -30 -69 18 -16 -58 11 9 -41 -9 35 -5 -11 19 15 -47 7 -17 -27 -11 51 25 -35 50 30 6 28 23 -3
4623 -3 -12 45 1 -22 20 -12 -56 17 48 6 1 25 23 -36 35 13 -47 -7 28 -35 -28 27 -6 -2 34 29 -29 0 45 6 -38 32 7 -36
4657 -36 14 21 -40 15 37 19 9 31 42 -6 13 41 -35 -28 7 -20 -16 -11 20 -10 8 39 -4 -11 43 13 -45 2 0 -75 -8 11 -19
4690 -19 -29 19 21 -31 -13 20 14 11 29 -14 -11 51 -1 -53 51 28 9 4 54 51 -18 36 51 18 5 28 -26 -40 18 -16 -23 47 6
4723 6 -39 5 54 11 -27 28 23 -56 1 6 -24 -18 -3 -4 7 48 20 -16 27 35 -15 0 30 -32 -28 15 1 23 -16 7 18 -3 27 1
$$ packed form
4487D%j0J7jl5L2RJ0k1M8qm3O3Pn0l7M1m7rKL7l7J6L8jl8L5Kj9nJ3j1m8N8Jm8
4523c5N1j8oN0ok0NM2l9j9j%o4O3J8m9J0O5l0l1M8L2q0NL7pm0NJ5k8N1jn5KQ8
4558E8j5o6M9j5k0J1J3n6jM5j3OK9k1j8M4J0m2LM1l8k1K6j0l8M5J7m1J3R6o0k8
4590CJ7K7q7L9M5p4l9Q7l4m2O9kn0L2M4m0oL0mo2N4k4j0J6O2k6o0Q5k0k4K2nk6
4623crN7m4k3M2l2m4P3L1m2nK4kn9P1k2o0M0L5o3PN5l3ML6nn8K9M5l9m4P0k5m3
4657c6N0Po1N5K2j8j0K2J1m8J9K8p6PL5k7MNL1l0J8L1m3pN4l0n8M7kp5O7J9l0
4690a9j0M8Kn2J8L3olJ8m3LO2n2n2J04k3j9nN0lo9N4J5l3j3K3n4j4N8l4pP0m1
4723Fm5M4M9m3l8N5np9N7Nl0OJ5jJ1M1k8l6M3Qn0J5L0o2MM3j4K2l9K3J1k1L0k6
$$ plain form
4757 1 19 16 17 -26 -7 -2 -26 -2 24 -13 -26 3 2 -7 24 14 17 -14 -22 3 -33 14 9 -2 14 5 -8 37 68 39 -2 35 10 10 -19 0
4793 0 7 -10 -6 9 -10 3 23 8 23 26 13 -10 1 4 -28 -19 -1 -18 -24 -4 41 -14 13 6 13 1 15 9 -5 -12 -20 7 1 -1 -5 41 20 26
4831 26 33 26 13 0 19 24 -6 -15 -24 -18 -12 -4 31 39 49 16 20 29 10 17 -16 -29 13 -22 -29 4 3 -6 -9 11 12 -23 -3 21 9 -10 16 -36 -8
4870 -8 -11 13 -3 2 57 11 32 62 4 -8 34 6 -1 26 18 -13 -32 34 -17 -18 10 9 -30 -14 19 -44 -31 14 -16 -56 1 16 -24 -6
4904 -6 30 -6 10 29 7 -5 -11 9 -11 1 20 -17 6 24 23 -15 1 36 -10 -3 45 -19 -36 12 10 -19 -24 35 -34 -22 8 25 -35
4937 -35 11 34 -25 -18 -1 -9 -22 -11 16 -36 -7 36 -9 10 58 -4 2 51 22 -14 23 27 -21 -38 29 -3 -40 50 12 -29 20 63
4969 63 -3 -2 42 -10 -48 19 28 -46 -11 20 -27 -31 15 28 -31 -7 5 -35 -19 23 -11 -24 1 -5 -50 33 47 -28 14 53 -7 -16 38
5002 38 8 -31 -15 46 -36 -30 40 5 -47 33 41 -32 12 59 -76 -54 28 0 -85 -2 16 -37 -5 21 9 -17 50 7 -10 22 33
$$ packed form
4757AJ8lJm3J9Nk4K4K6l7j3K9jrL1j0Ll1qK5l6M7nj1J6rj3M5L1k9m1L7k5%k9J9
4793@Pj7MJ5j9J3K0j5J5Lj3k3J1Ll2RJ8j7oK0M5n5K7pPj2J4oj4pqK7okmM6k1O
4831B6Ppj3j3J9Nl0rrOOQL5QJ0l3MRj9Pl3j3M2l5pL3jrlK0Jl5K0K4j2j9K6n2K8
4870hlK4j6NN5m6K1L0n8j2M2k8pK7ql1j9O6n1jK8jl9J6L3o3J3M5l0m0N7J5m0J8
4904fL6l6J6J9k2j2oK0k0J2J9l7K3J8jl8J6L5m6PM8o4j7M8kk9nN9o9J2L0J7o0
4937c5M6K3n9PJ7qj3J1K7n2K9M3m5J9M8o2OM9k9l6L7Mm8j7O7l2l7R0l8m1M9M3
4969F3o6JM4n2l8O7Rp4L5L1m7mM6J3n9K4J2m0J6M2l4j3K5om5Q3J4p5M2L9o0rN4
5002C8l0l9J6O1q2OP0l5n2Q0Qp3M4M7j35K2Q2k8q5Q3J8n3L2K6j2k6O7m3j7L2J1
$$ plain form
5033 33 -27 -36 9 -26 -40 22 21 -44 12 36 -1 36 71 35 -30 40 11 -40 3 19 -39 -24 51 -4 -21 44 28 -36 33 14 -62
5064 -62 -40 7 -58 -63 13 2 -23 12 63 5 -17 40 28 -12 29 28 -45 -18 48 -48 -39 38 17 -21 43 58 -18 11 44 -18 -18 20
5096 20 16 -49 5 30 -27 4 58 6 -12 61 20 -59 3 32 -32 -50 5 7 -46 4 14 -32 -2 65 12 -4 34 15 -34 29 26 -64
5128 -64 -13 18 -24 -11 72 25 -17 53 61 -4 26 40 -55 -50 5 -8 -91 -13 23 -17 1 25 15 -12 27 -9 -16 -12 -20 -54 -9 -15 -7 -11
5162 -11 23 34 10 55 75 22 11 27 20 -11 17 2 -27 -19 13 -16 17 54 13 -5 17 29 -20 9 -2 -21 -54 -3 -7 -54 -3 34
5194 34 6 -4 49 24 -20 43 7 -20 -25 6 -16 -12 49 12 -8 46 7 14 17 62 -1 5 -3 1 -36 -4 2 -23 -12 19 7 -13 61 -8
5228 -8 7 30 32 -18 -12 -25 -15 -30 -16 8 -6 12 29 4 17 41 0 -18 12 3 -20 -12 -16 -13 -5 12 28 13 21 5 20 16 0 -6 -11 -18 5
5265 5 -5 7 -4 -17 -31 17 4 -20 -1 15 5 -17 -3 -19 -28 8 -16 -15 -15 -2 13 -1 11 12 9 -4 18 2 -9 18 -15 -9 10 9
$$ packed form
5033C3o0rM5l5j4O2jo5N6K4l7L7L5l6o5P0k9n1M3J6n8J5P5n5j7O5j6o4O9j9p6
5064f2K2M7o5nP6j1k5L5N1n8k2N7j2m0M1jp3K7O6r6RP7k1l8O4J5p6K9L3o2%L8
5096B0mo5N4K5n7L1N4n2j8P3m1p9O2K9o4j8N5Kn3N0J0m6L0O7n3j6L8j9m9O3lr0
5128f4N1L1m2J3Q3m7m2P0Qo5L0J4r5NN5j3q3P8L6m0J8K4j0k7L9l6pMql4M5oQm
5162a1L4J1k4M5K0n3j1J6pl1K8j5k9QL2k9L3L7m1j8K2J2m9K9j1j9l3N1mm7N1L7
5194C4k8j0N3k5m4O3l6k7nL1k2MO1l7k0N4l9PLM5o3OqMl7L2Ok5J1L1j2k0P4o9
5228hJ5K3Kn0Oj3J0j5J4K4j4J8J7k5J3K4m1j8L0rk3QmLQJ7J6j5Qj6J5mj6onpK3
5265Ej0J2j1j3j4M8j3k4J9J6j0k2J4j6rL6k4J%J3J5j4J2Jlj3K2j6j1K7l3OJ9j
$$ plain form
5299 9 6 35 23 17 28 25 1 -5 -2 -3 -17 -28 -41 -19 -13 10 -10 -15 8 8 -5 4 4 -38 -27 -11 1 -18 11 3 20 -5 26 18 5 17 18 22
5337 22 -16 1 12 1 5 18 -4 26 44 -1 -3 16 7 -4 -8 -2 14 -17 7 -20 -21 15 -9 -18 11 29 -7 28 17 2 -17 -1 6 -14
5371 -14 -14 -17 -13 7 37 17 12 34 28 -24 -1 31 13 -1 17 0 -8 11 23 -17 2 5 10 -6 37 -20 -56 18 19 -27 -43 15 -16 -21 11
5406 11 35 7 -22 16 -3 -25 -11 -36 -15 22 8 -27 16 26 21 3 30 10 8 10 43 -16 -5 33 25 4 -3 15 -9 19 11 -1 0 27
5440 27 5 -21 -14 10 -31 -47 -8 -25 -15 -2 -36 -11 3 23 17 2 17 4 -49 22 -16 -13 40 10 -13 3 40 5 -1 25 6 -14
5472 -14 5 17 -12 3 1 -49 -39 9 26 -19 6 7 -13 -12 17 -20 -34 13 -19 -35 -14 17 -16 -25 13 -1 -4 10 8 25 23 21 4 -9
5506 -9 34 5 -20 19 22 -9 20 26 26 -1 24 18 -10 -3 -14 -19 0 11 -38 24 26 4 -14 -16 17 -17 -18 -1 -4 -23 -2 -12 -31 -5 -4 -9 1
5543 1 11 -6 13 18 -12 -12 -2 18 -5 0 26 22 4 31 28 8 1 27 22 6 -7 -2 -39 -5 -7 -20 1 -23 -17 -31 -11 -17 -15 22 1 -15 -13
$$ packed form
5299IlK9j2oJ1lk4oLjj4j1j3K2OK3k0nK3%j3R%m2J1J6J2j9K9qJ7k5L1qj3J2JM
5337B2l8J7J1j1MJ3k2L0J8m5kJ9rj1mOJ6l1K4k7jL6k4rK9J8l6L5j1j5j9J6Pk0
5371a4%lMK0L0k0nK2on2K3L2j8j4J8j7qJ9J2m0J9LNj6M3n7l6P4Jm6j6N8l1nL2
5406A1K4k8k9L8j9k2J4k5K1L7j4l5M3J0nj8K7k0kKL3n9J1L8qk1pJ8k4K8qj2JK7
5440B7k2k6PK4m1j6L9j7J0J3l4K5J4K0oj5J5j3n3P1l8LN3l0k3J6L7l5oK6j9k0
5472a4J9J2k9J5kn0J0M8J7m5K5Jk0JK9l7j4M7l2j6K1L1l3rL8j4lJ4kJ7kkj7j3
5506iM3k9k5L9Ll1K9O%k7K5ok8Pj1nJ9J1m9O2Kk2j8kL3l4jJ7lj9K1j0j9K6JnJ0
5543AJ0j7J9Nl0%J0K0k3NK6mj8K7lk0pK6nj6j3Nl7L4kj3K1k4Oj4K0oKL7k1j6K
$$ plain form
5580 -13 13 16 -20 27 11 -10 31 47 -6 3 13 10 11 6 21 -19 22 11 -30 12 36 2 -8 37 11 -25 7 38 -4 -22 17 12 -43
5613 -43 16 25 3 -22 11 -17 -7 -17 -12 2 -5 0 8 21 20 -5 -25 13 28 12 8 5 -24 17 3 8 3 0 19 -3 -1 28 -29 16 14 20 -22
5650 -22 -2 3 12 -22 -8 0 -3 -8 -36 -12 9 -3 -8 16 6 12 -3 -2 -17 -10 3 -1 -2 -3 5 20 4 -14 -3 3 8 43 13 7 25 18 -4 -10 3
5689 3 2 1 -15 9 -22 -4 16 -10 15 6 -16 -36 -3 9 -4 23 4 6 -13 -12 -9 -5 -13 0 2 -5 -15 8 -7 24 0 3 34 -1 16 -2
5725 -2 -2 -6 12 18 -12 -8 -16 -2 -14 -14 -4 22 -21 -8 -29 -18 -14 5 -29 -28 -9 -4 -6 12 -8 13 8 13 -10 5 11 2 -17 1 5 4 19 5 29
5764 29 13 22 -1 23 27 -9 10 -1 -5 -1 -12 0 -8 -14 21 -9 -9 -24 -12 11 -15 1 -21 6 -4 -12 -12 -7 9 8 -9 -6 9 -11 -21 6
5800 6 14 -22 -19 15 13 0 8 -9 -23 14 13 10 20 -5 5 8 14 -14 14 -5 -7 -21 17 -2 -6 -19 -13 -27 -14 15 -39 -15 -4 4 -24 -1 -9
5837 -9 -12 14 -5 1 -5 8 27 -9 22 9 15 10 -2 -3 0 20 -7 15 -8 27 9 -35 -3 2 -17 -30 11 2 6 12 -6 -7 20 -20 -1 -15 -8
$$ packed form
5580a3K6Ll6M7j6k1M1J6n3RJ0lJnJ5m0M1j1m1M2K4l4j0M5k6l6L2L1m2j8L9nn5
5613d3N9Rk2k5L3k8J0j0NJ4pNQJ3jk5k0L8J5j6mlk9M1j4NnlJ9k2KK9n7M5kOm2
5650b2K0NRl4J4Qlnk8K4K1j2nK4j0Oj5Jj5PJ3mjjQJ5j6j8J1ONL5l0oJ8pk2oJ3
5689Cjjj6K4l1J8K0k6K5rk2k0L3J2j3K7j9Kj9JLMqJ3Kpj0K3j5L1k4LL1l5J7j8
5725b%mJ8Ol0MqJ4j2%J0K6m3J3k1J1MJ9l4JJ9NkJ8k0K1nNk3J5Orj9J8MjJ5j4K4
5764B9j6Rk3K4Ml6J9j1mMj1J2qoL5l0%j5J2K3k6J6k2K7j0q%NJ6jj7LJ5k0j0K7
5800FQl6LL4kj3Qj7j4L7jlJ0k5J0LOk8K8j9kj4L8j9mj3Oj4J3K9n4K4J1Qk8K3q
5837ilK6j9OoJ3J9l6L1j3Onj2jLK0k7K2k3L5j8m4L2Nj9j3M1rMOj8jK7m0J9j4P
$$ plain form
5874 -8 23 9 -5 20 6 10 5 6 4 7 28 3 14 13 -6 0 34 -17 24 1 18 -9 20 19 11 -9 -15 1 -15 -12 10 -1 7 -8 -43 -18 0
5911 0 -25 -19 40 10 -13 -14 0 15 -19 4 15 -12 26 18 15 5 -2 17 17 36 25 16 9 -9 15 15 -13 16 9 -7 41 -12 4 3 -1 3 -3 -5
5949 -5 8 -8 -14 -16 -16 -16 0 -19 -14 16 10 -11 9 -15 -21 8 -12 14 10 12 4 8 2 22 22 28 19 19 18 29 -2 -8 18 -16 19 13 4 2 -9 6 -18
5990 -18 -1 -29 -8 -21 -9 -8 -4 -32 -1 -22 -4 -9 -2 -12 -5 -33 1 8 27 5 11 -9 9 19 12 21 19 -13 16 14 0 5 27 18 -23 -10 16
6027 16 -22 -8 11 -24 6 -26 10 3 8 -14 -17 23 5 11 -5 -11 -18 -14 3 21 18 -7 5 -15 19 12 9 20 -5 10 37 6 1 6 22 1
6063 1 2 3 8 18 -22 -9 4 0 3 4 -1 -3 3 -11 5 -48 -8 -1 -4 6 -10 1 -11 -20 8 9 -8 -3 -32 24 26 7 33 -16 -10 11 28 10 10
6102 10 -1 7 34 -17 33 -1 -1 -14 2 12 7 -4 -28 -14 -23 -5 -32 -3 -3 7 10 -9 6 -5 -19 -13 17 -7 -1 11 10 15 4 -19 3
6137 3 2 11 21 -6 8 -7 31 10 -4 2 27 12 6 5 4 1 5 -12 -8 -4 -15 -21 -7 -16 -12 -19 -20 -5 12 -40 -16 -7 -1 -25 -16 -8 7 -3 8 10 -17
$$ packed form
5874hL1j4j4K5j4MnJkLK1k5J1jj9OL4n1M1k3J7k7K9jqk0oJ6j6LK2j1Qj5l5K5J8
5911@k5ON9l0k3jJ4J5l4K3J1k7L8qlj0pJ9%J9j1rpj8K4%k8K9pj6M8n3J6jmMok
5949eJ3j6ok%%J6j9NL0ok1K0k4oK9k0K6mKqMoK0%Or%jJ1l1oK6l4L5orkj1J5k4
5990a8J7k8K1j3J2JMk8L1k1J8nPj0Pk8L4PJ9k2Ok0J8J0pRkl2K9kj4NK2rm1J3K6
6027A6l8J4J9l5L0l2L6pNk2lM0j8Oj6opMJ7J8lk5J2k0L4plJ1k5J5K7l1nNJ6k1
6063AJJNJ0m0J3J3mLJnkOj4J6n3M0PlJ0j6J1j2rK8Jj7Nk9N6Kj9K6m9OK1J7j8%
6102A0j1QK7n1N0l4%j3J6J0nj1k4J4rJ8k7K9%J0Lj9J5j1j4OL0k4OJ2jNj1k3K2
6137CjRJ0k7J4j5L8k1j4OK5j5ojjlMj7MMj1oJ4rMpjJ5J7n2K4ROk4RQJ5j0J1Kk7
$$ plain form
6178 -17 10 -5 -4 -4 -2 28 -7 19 -15 -3 9 -14 -4 11 -3 -15 -16 19 6 -25 -13 -13 6 -24 11 -10 -21 -27 1 2 11 -24 -10 -11 -15
6213 -15 -1 -4 10 -29 15 3 5 16 -7 3 -6 7 9 15 1 0 1 12 4 15 2 -18 12 0 11 -20 -1 -15 0 -27 -3 -16 -3 -16
6247 -16 -25 -39 -22 -10 -23 -2 -19 -6 -5 -23 16 -20 -3 6 16 26 19 -2 6 8 2 35 -26 11 -8 15 1 0 22 29 -4 10 -3 -4 5 11
6283 11 -13 -18 -4 -28 0 0 2 7 -16 -18 -13 0 -16 6 1 16 1 0 12 26 -8 5 27 -6 -5 5 -12 12 -7 -3 33 -2 7 16 18 17 9 -22
6321 -22 19 10 10 -4 -17 -3 17 3 -16 4 -13 -6 10 -25 -23 0 -25 -13 -7 2 -8 15 -15 -14 -15 3 27 22 33 5 3 2 12 15 1 15
6357 15 16 -16 18 22 10 1 15 -11 -27 -34 26 -19 -13 -18 -12 -18 -16 -3 -12 -5 10 -46 -34 5 -20 -18 22 12 1 -11 -16 -1 25 21 17 12 15 -20 8
6396 8 18 -4 55 8 11 22 43 4 10 -14 23 -19 -4 11 -24 -10 10 -2 -5 29 -6 -9 3 4 7 -17 -17 -22 -13 -33 -19 -7 3 -10 -23
6431 -23 4 -7 6 -4 6 25 13 5 10 15 22 -6 -4 -24 -3 12 23 -5 -8 25 -22 10 -4 -15 8 -9 -40 -2 -5 -23 -25 9 -23 -12
$$ packed form
6178a7K7j5J%KL0l5K6l4J2J2k3J0J5j4j2jL5j3l1J2%J9l0L5k1j1oK8JRl5J4jm
6213a5J4lJ4l9M4j2KJ1k3J0rJ3KOj4jJJ1qJ1j3k0L0j2J1l1J9j4J5k7K4j3J3j3
6247a6rj4J7J2j3K1j7J3Jj8L9l6J7RJ0J0pk1QKoL3o1L7j9K3j4jK2Pl3J4j3jRO
6283A1k4nJ4k4K8%KNk3kNJ3j6K2nJ5j5jJ2J4l4J3K2l3JJ0j7K4j9ML6l5RRKjql1
6321b2M1r%j4j3J4K0j4j9K0j7PJ6l5KK3k5J2ORj0K3l0JjJ8K4nJ1k8kjJ0Lj4J4
6357A5Jl2L4Mj2rJ4k6j6pO0m5OnOoKJ3rPJ5n6J2L9k5KM0j0j1j2nJ5K6mmnLl5K8
6396HJ0k2N9m7LJ1K1l9Ok4L7m2J5J5l5J4K0j2lL4l5lJ2JLk4%nRk0J4J2J0j3j3
6431b3K7j1J3j0J0J9j2qNNPk8Kk0K1J5J1k8lL3m7L2j4j1K3j7l1L8lj8kL4l2J1
$$ plain form
6465 -12 -23 -14 7 -3 -4 -23 11 13 3 -6 -18 10 0 15 16 -10 0 3 -3 -13 8 -2 2 -10 22 13 26 11 -5 4 2 14 -18 -1 -15 -16
6501 -16 -7 -2 15 -20 -11 3 -15 -9 -15 -9 -4 22 -10 7 16 15 10 10 10 4 10 4 39 9 16 10 24 12 -10 -3 0 -23 3 -8 -23 9 -15 2 23 0
6541 0 15 -26 8 -3 -14 -3 2 -12 -1 -8 -12 -5 6 0 14 6 25 1 6 15 1 0 29 8 7 21 7 28 15 3 6 7 -6 -2 5 12 6 7 -8
6580 -8 -19 -8 -9 -14 13 9 4 -3 3 -7 -17 -13 11 -12 -22 -17 -6 16 -14 13 5 -4 -10 -7 -4 20 -1 -17 -1 -10 11 6 14 9 14 -14 13 19 -25 -9
6620 -9 -2 9 -2 -12 -17 3 9 -27 2 -4 -24 -28 -13 15 11 -4 7 -26 -13 7 7 -24 6 9 6 5 20 17 27 8 1 -11 7 -2 15 -8 -23
6657 -23 13 29 16 -19 17 -5 -15 0 2 -1 0 11 -44 -5 17 -20 -8 3 -5 -24 -16 -15 13 -24 1 -2 -8 2 12 37 23 7 7 -5 17
6692 17 16 11 33 -24 22 24 19 -3 -24 5 12 -3 16 13 -5 0 -16 -19 -7 5 -20 -10 -16 -7 -14 -6 4 -2 1 -28 -18 -9 11 12 10 -2 0 -4 29 4
6732 4 30 5 21 22 29 16 29 2 -15 22 -1 15 -1 12 -16 4 13 -11 -17 0 -6 11 -3 -13 -6 -8 5 -12 -23 -16 -2 -20 2 -2 -37
$$ packed form
6465a2j1RK1j0jj9L4Kj0rj2K8j0J5Jk6J0Loj0K1j0Mj2L2rJ3j5j6RkJ2l2J7j4j
6501a6RNJ7l5RJ4j8OoONK6l2J7Rjn%%oOoL5l0PoJ4j2k2PLk3K6j1j5L2k4J7K1k3
6541@J5m1L4j1j1J1Nj4J1pmPJ1oJ4qJ9k4NRj4jK9k1jJ4j4K1j3j2LJj3MPPoJj5
6580hj1J1jnK7mnpOj0j0MK4k3j0NJ1K2l0K7qroLLK4k1j6J6rK1nQnNk8K7Om4J6
6620iPJ1j1j0nK0Ol6K9ok0mJ5K8mj5J1l3J3K0%l1L0LljJ5lJ0j9pj2J8rJ7k3j5
6657b3L6J6j3l5L6k2j0J5KlJJ1n5L9K2l7J2J1qj9QJK8l7K5loJ0J0K5j4j6%j2K2
6692A7jnK2n7M6Knk2k1K9Pj5J9lj8Nj6lJ2J2k5J0oRpQJ0oLk9J0RK0Jkj2KmL3k5
6732DK6k5J6JPj3J3k7j7L7k3J6j6J3k8K0Rk4oJ7oJ7j4j0PkJ3j7j1PJ4j8K2ml5
$$ plain form
6767 -37 15 27 22 14 -11 11 -18 -13 1 26 -15 23 37 16 14 7 24 -1 5 0 -16 -3 7 3 2 5 -21 -13 -43 2 -33 -14 -18 -14 -28 -16 18
6804 18 -17 -1 -17 0 -3 -11 -2 -4 8 1 3 19 19 5 20 43 -16 -11 -3 -10 -8 5 30 -18 12 3 3 -29 5 10 -29 -26 -24 -15 6 15 -14 -26 -2
6843 -2 5 -33 -9 -22 -35 0 1 -5 -27 9 3 -12 27 16 8 16 10 -5 -9 -6 -12 9 -11 9 -2 -13 1 10 2 1 -7 20 4 23 -32 0 -13 -13
6881 -13 -14 -4 3 4 8 -1 -11 -13 -7 10 -4 -6 -11 -20 14 10 -11 -1 -3 17 -5 38 11 30 6 4 24 -3 -7 -5 11 3 21 -6 -20 -9 -1 -23 1
6920 1 7 8 22 3 -13 -31 -11 8 -9 -33 4 -13 7 30 4 -28 32 -7 3 14 -7 -26 -24 26 -2 10 5 28 19 28 15 -10 11 19
6954 19 -4 -12 4 -22 -14 -19 1 -21 23 11 -12 -13 18 -12 -44 -2 -29 -23 -16 -6 -15 -13 2 14 -12 7 14 21 14 19 2 -8 15 0 -12 9
6990 9 18 -6 -1 14 30 8 9 5 -1 -3 -23 -3 -22 3 4 -13 15 2 -4 0 -1 5 6 -22 -19 2 4 -5 13 3 21 15 3 10 17 31 14 -14 -21 13
7030 13 6 1 16 24 10 9 -5 14 4 -5 7 8 10 -4 -4 -17 -12 -8 -25 -7 -16 27 -25 3 -13 -17 -32 14 -16 -21 9 -15 -13 -17 10 -4 -25 9
$$ packed form
6767c7N2J2nqk5K2k9NJ4K5m1L8J4k1kpJ7k5Onj6J3J0mjLk6Ql0M5l5J9mMj4J2L4
6804A8l5J6j6J7lqRkJ2pKJ6%j4J5K3n9NQpKJ3K5m8L0r%l2L4Nl9LKRK1Rk9j2K4
6843bPl8K4j3j3L5Jok2L6oj5L9j1qQoj5mLoK1k0K0j1j1J4RqjqK7j6J9n5L2j3%
6881a3jJ0PJMrj0kOJ7j4knrL4mk1J0kK0k2M3k7J9k4kK0k7mKJ6qJ8k7j4J1Qk2K4
6920AOJJ4j9j6j8K0J9j7k4L7j7K0K3k6l2O0l9J0J1k1j9KN0k8J2nK3rRj3k5K1Q
6954A9k3qJ6k6QnK0k2M4j2k3jL1l0l2M2k7OPJ0rKJ5J2k6J9PPpNj7j0K3j5j2K1
6990IRk4NJ5J6k2Jmokk0K0j9K5Jj7K8j3oMjOJk8LK1KrJ8j0J8oj2PPJ4j7k8pL4
7030A3pnJ5Qj4jj4J9j0rJ2JKj4%j3NMj7J8rM3n2K8j6mj5M6l0nL0k4KmK7j4k1L4
$$ plain form
7068 9 -16 16 26 -7 0 18 9 13 -22 -10 -5 12 -17 14 9 -20 1 -17 -20 2 -4 -7 -8 -20 -5 -22 -18 14 9 6 3 -19 -2 -11 24 -37 -14 25
7106 25 5 -9 2 -7 -2 3 23 26 11 20 12 16 38 18 10 17 2 33 0 -3 -7 0 -5 -21 -21 -11 -11 5 10 -8 -6 -1 19 -13 -5 -7 1 6 -11 31 32 8
7148 8 -5 -2 -22 -17 -6 -6 -19 -15 15 5 5 3 -4 1 6 17 -26 23 2 -7 -3 0 -19 -9 -9 -21 -7 -23 2 5 -20 13 -40 -20 3 7 5 -8 -9
7187 -9 18 7 31 11 -3 10 10 27 -5 45 4 43 15 12 17 0 -4 -13 18 35 -6 -2 8 25 -2 2 -5 4 2 -7 -21 -1 11 -4 -12 -15 -8 -14
7225 -14 -35 6 -22 -21 8 -10 -42 13 19 -7 12 17 -2 9 26 -17 0 -4 21 15 7 19 9 -13 13 4 -10 -2 -9 -14 8 -2 0 -44 -2 5
7261 5 7 -51 7 11 -2 13 5 -8 -3 24 -28 -5 -14 -13 -14 15 -1 -6 14 48 9 16 13 -4 18 23 -15 -11 14 9 -22 -2 32 11 -14 2 -6 -15
7299 -15 -2 1 -3 -19 8 0 -23 -10 6 -10 -2 -2 -2 4 11 -15 -22 -6 15 -17 -5 -6 -14 6 13 18 28 8 -7 6 -18 1 1 9 -12 5 -15 -18
7337 -18 7 5 -16 -12 -6 -11 9 -26 -32 -1 19 -12 4 13 -12 -12 18 11 10 -16 -1 -2 -4 -17 8 -10 -7 16 11 7 17 16 16 38 4 26 39 1
$$ packed form
7068Ik5L2J0l3PJ8rMl5J2NJ7k9L1nk9K1j8lK2oljj2J5j7ML2nllk2J7rL5o1K3L9
7106B5k0j4J1rNNK0Lj5RqMK2k0qPj5L1l3lmPnj6%J0%J6Nj8KNK0l2QkQNj7M2Jk4
7148Hj3Lk0NJ1%j3ML0j0%kpNNJ1m3M9k1rMLj9J0%j2J4j6K5Lk5L3n3K0K3Mkj3j
7187iK7j1K4k0j4J3%J7l2N0m1L9k8lNj7mrL1J7m1MJ0J7k7MpRkrj4K0J2j5qlPo
7225a4k1M1k8JK9j8l2N5Ok6J9Nj9J1J7m3J7mK5oqJ2j0k2K6rj4QpnK2j0Km4M2P
7261EKn8N8Mj3J5qj3NK7n2K3rJjK9j6nK0L4l9Plj7K2Nl8MK5nl1K0L4k1k5J6qr
7299a5J3Lmj6K7qk3J3J6j6Q%%OPk6pJ6K1l2J2jqK0PNJ0k0j5J3k4J9%Qk1J7k0l
7337a8K5kk1MOnK0l5oL1K0l1J6Rk5%L0pjk6J5jkj3K5j8LK3nmJ0j%K2l4K2J3l8
$$ plain form
7375 1 10 17 4 -21 2 20 6 12 -12 -9 -10 -3 30 5 -14 0 0 -12 -12 17 -17 -10 5 1 -3 9 32 10 -2 8 -6 4 18 -2 -10 4 9
7412 9 8 33 31 22 5 -20 33 11 -11 -3 -16 13 3 5 8 -4 11 1 -20 -4 -15 7 14 -9 -2 1 -17 15 -43 13 23 -12 17 -7 -15 25
7448 25 34 -17 2 23 15 8 4 57 15 14 9 18 -5 9 32 15 2 4 -7 -7 -11 -22 -27 -1 18 6 -5 4 -5 -2 -12 -11 -1 -4 4 -3 0 4 14 32
7488 32 31 25 10 16 11 14 1 22 12 -5 17 10 13 -9 -26 -22 13 -9 24 -8 2 20 -8 -4 -17 -1 -4 -20 -6 -19 -22 -1 -1 -5 5 -9 12
7525 12 5 -4 15 8 -8 6 22 5 1 6 30 1 24 17 16 7 3 10 3 -21 -8 12 -12 -7 3 10 6 -13 18 -12 -24 9 14 -23 -6 6 -6 -20
7563 -20 -15 0 -15 6 -25 -19 33 15 11 -30 -5 -3 17 16 -1 17 6 -7 -14 12 8 -6 -7 7 13 21 -3 -2 -1 2 14 -10 -5 -3 -6 13 -5 -12 0
7602 0 -14 17 1 -11 9 -20 0 3 3 -4 -22 20 42 0 -8 0 -9 -1 28 4 -1 -19 26 26 17 19 -12 8 5 21 21 7 10 -7 -35 -26 3 6 10
7641 10 -5 3 8 -2 -35 -20 -2 -9 -16 -1 20 -24 2 6 6 -4 28 7 0 19 18 16 7 7 17 -8 13 -23 2 13 7 37 -5 19 -31 7
$$ packed form
7375ARPj3k5K3J8j4Ok4LjPL3k5j9J4%j2%K9l4PJ5mmJ2K3k2j2J0j4J0J4k0qJ4N
7412IjK5krj7k5N3k2k2Qj3K9j0KLj2J5j0k1J6j1K2Pk3PLj8L2n8N6J0l5K9k4qM0
7448B5Rn1J9K1qpmN3m2jnRk3J4K3j7j3Kj1%mj1nK6J9j2j1RrLj0JJ0lQpLMJ0J8
7488C2joj5OnLj3K1j0j7K2pLk2j7ML5k2L3l2J0J8k8Mj3J6lj6J4j3lK1%mJ0j4K1
7525A2prJ9pj6J4J6j7mNK4k9K3pjrmPpk4J3K0k4NJ0Pmj9L1l0j2L3Nl7J7J2j2j4
7563b0NJ5j5K1l1ON2j8mm1K5KK0jj7J8j1j3pK6mj4jJ4OQk4JJLJ2k4NKlJ9j8pJ2
7602@j4L1j6j2K0k9K0L%pj8M2K2m2qQrQK9k4nj8M5%rKl1K0lJ6%j4Lj7k8RK9LM
7641A0j5QNj0l3J5J8ppJ5K1m4K6M%j0L2k1pJ9jkr%J0k5K1l6K5J1oL0m2K4n0L8
$$ plain form
7677 7 -21 -14 -33 -3 5 7 2 6 -28 -14 -7 0 -13 -3 -9 -5 -7 -5 4 17 30 2 24 -12 30 25 21 12 18 4 36 -5 9 6 -4 -12 16 18 13 3 -4
7718 -4 33 -13 4 2 23 8 6 0 -28 8 -17 -12 2 -32 -10 -10 -14 13 -31 -4 -11 8 -17 -1 -28 0 -18 0 7 22 33 -10 28 1 21
7753 21 15 13 14 -19 -4 -18 6 10 -7 0 -19 5 12 -19 -13 8 -17 -14 -1 -3 3 20 14 -15 -6 -4 9 4 -9 -6 -9 14 4 39 32 5 7 7 22 20
7793 20 17 17 19 0 9 -2 17 6 -43 9 0 -22 5 7 -13 0 9 6 28 -11 -35 -8 0 -30 -4 -6 -5 -10 19 -2 1 -12 -24 8 1 4 -20 -6
7831 -6 4 8 10 12 30 -23 21 -8 3 6 18 8 -26 -14 16 -16 5 -17 8 -1 -27 1 -26 0 14 7 -23 6 27 16 12 1 -12 -15 12
7866 12 -1 21 22 9 6 40 5 32 3 12 11 16 19 8 12 4 16 14 29 -6 -2 15 -9 -9 -20 6 2 26 17 -6 -2 -21 -12 -15 -10 -4 18 -1 -6 11
7906 11 25 -6 -15 25 15 -2 6 13 11 5 35 9 33 6 4 14 -8 -4 -8 1 -9 -19 4 24 0 7 -2 4 6 -12 -17 -14 -8 -32 -3 -14 23 -11
7944 -11 28 -11 7 -15 -2 3 -8 -3 11 18 -2 0 10 11 3 10 6 20 17 17 -3 -16 15 25 18 -8 -1 12 13 0 -6 -11 -19 -1 14 10 6 -16 5
$$ packed form
7677Gk8Pj9L0QKnMl4J4PPj3J0oMkKRJ3J3k8K2l6M2nmrOj4L2m1J4lj0qK8Knj0p
7718dL7m6J7kK1j5kok8L6k5NJ4l4K2%mK7m4K7pJ9k5J6k7K8j8J8PJ5J1m3L8k7K0
7753B1okJl3J5j4K4Mj7Pj9K4Pl1OK1k5LJ3kOJ7ok9RKJ3nj3LlK3j0L5pk7K%J5k
7793B0l%Kj9Rj1J9j1m9N2rk2K7Kk0J3RlK2l9k4K7Ql0K6kJnK9k1Lj3j2L2pLk4J4
7831fJ0MKKJ8n3M4k9J1LJ2j0l4J2L0l2K1k2K5rk6K8k7K6J4pl0K9K1j1mj1j3lK7
7866A2j3K2Jj3lL4l5K7k9RjNLj1MqJ2kJ5l5MJ7k4%j1K6mK4rk3Mj9RlNOK2j9nJ7
7906A1J4l1rM0j0j7QPkoL0k6K4k7kJ0k2MmRj0j0K3K0k4PrOKj8nLOk4K9j1L7l4
7944a1L9l9J8k2J3Nj1NJ4Pk0KJ0JqPmJ4l%k0j3L1J0pk6PJ3Jj3onqJ8J5mmk2K1
$$ plain form
7983 5 1 -33 7 4 0 -17 -23 34 2 -6 -6 0 12 -11 -5 -22 -11 -15 -15 19 24 4 11 -2 11 15 10 12 -18 -21 -17 -27 -2 -7 -26 -13 -3 -9 -20 -16 -4
8024 -4 0 -7 -37 -12 5 -18 -1 8 18 24 -16 -9 24 2 25 1 16 -13 3 2 1 -1 9 5 24 -5 3 10 -1 2 3 -3 -1 6 22 -16 -11 -14 -22 -2
8064 -2 -7 -24 -12 13 0 -20 3 6 -20 25 15 -5 20 8 11 23 11 32 5 34 13 -8 0 -11 -6 8 -4 -16 -5 -16 4 15 -17
8097 -17 -23 8 -18 -4 33 -3 -26 -14 7 -39 -5 5 -6 8 -13 -15 2 20 -7 -2 7 34 -3 -16 -5 -17 14 7 -24 1 16 11 26
8130 26 14 11 6 11 8 7 -3 17 -11 14 -21 4 -6 -5 33 -43 7 -5 -6 -12 -12 -5 -12 -15 33 -6 3 0 15 24 1 -27 -27 24 17 37 15 -2 6
8169 6 20 17 18 44 23 16 -2 7 1 22 -1 4 22 22 -5 13 3 -18 9 -13 6 -29
$$ packed form
7983Eml4M0lmj7oN7l2q%OJ2k3Oj7J1m%L4Nk0Pj3J3MnKl0lMj0K5nj9J3J0oj1MJ2
8024dMpl0K5J7k3J7RJ0Om0PL3k2K3k4J5k9J6jjkJ0mJ9k9QPj1LJoKPJ6l8NlqK0
8064bnj7J2K5j3k0K3Lk6M5j0k0K5j2LJ2j2K1k7K9k1k1Qj1NJ4j2j2J1j1K0J1l2
8097a7oL1k6J4L7l6k3J2K1m6L4J0j1J4k1kJ7J8k7NRK7l7j3J1j2L1pl1K5J5nJ5
8130B6j2lnNljj0K0k8K5l5K5j0JL8p6N0j2jo%PplM8l9RlJ5Rk3k8%N1pK0k2j7Q
8169FJ4lJK6k1pj8RoK1k3NJ8%k7J8j0k1K7k2J9l5
8191b9
$$ Imaginary data points
##PAGE= N=2
##DATA TABLE= (X++(I..I)), XYDATA
$$ plain form
0 0 0 0 0 0 0 0 0 0 0 0 0 1 -8 8 -8 8 -10 16 -16 24 -24 32 -40 42 -50 61 -72 81 -94 106 -122 140 -161 179
34 179 -203 230 -259 289 -324 362 -401 448 -497 547 -607 671 -739 818 -900 989 -1091 1202
52 1202 -1324 1462 -1615 1789 -1985 2207 -2470 2778 -3147 3598 -4164 4898 -5901 7346 -9624
67 -9624 13771 -23742 99830 28946 -136797 70973 89214 -54736 -94428 -47705 -85342 -36632
79 -36632 17616 -51525 -86471 37103 67969 -8658 -5421 38910 344 -1953 28556 -18541
91 -18541 -54047 25637 51517 -22561 -18369 75138 79427 5817 -13695 32301 49935 -6116 -80532
104 -80532 -71964 -11158 -21250 -82656 -73949 -16619 8107 18561 30672 18272 23685 68229 72670
117 72670 19454 -8595 4601 14240 8423 -17651 -46850 -23121 24460 8179 -31100 -7279
$$ packed form
0@%%%%%%%%%%%JrJ6j6J6j8K6l2M0m8N6p2Q2r2J11j33J53j75K00k28K62l01L40
34A79l82M33m89N48o13O86p63Q49r45J044j154J278j410J557j718J889k080K293
52A202k526K786l077L404l774M192m677N248n925O745p762R062j0799J3247j6970
67i624K3395l7513J23572p0884j65743K07770J8241j43950l9692M6723l7637M8710
79c6632N4248o9141l4946J23574L0866p6627L237M4331l8566k297L0509m7097
91a8541l5506P9684K5880p4078M192R3507M289p3610j9512M5996J7634n6051p4416
104h0532Q568O0806j0092o1406Q707N7330K4726J0454J2111j2400N413M4544M441
117G2670n3216k8049J3196R639n817k6074k9199K3729M7581j6281l9279K3821
$$ plain form
129 -7279 23241 -2057 -20592 -5337 -10508 -30334 -28978 -21565 -11414 5107 -682 -6284 34747
142 34747 65031 33671 16086 41546 34507 3690 5464 -6184 -47800 -40490 -5528 -28974 -56394
155 -56394 -20031 7015 -7703 4170 26282 5957 -1909 27053 19282 -15869 -7127 9672 -8868
168 -8868 -6946 21687 12350 -8260 17810 40525 16421 -2247 4061 -3211 -15262 -12823 -25820
181 -25820 -49731 -36794 -4960 -7059 -21851 -5397 22097 30086 28293 24984 18193 18519 23021 10241
195 10241 -11815 -16209 -8483 -8686 -12808 -12759 -10200 -608 11122 6142 -5890 1560 12000 -3046
209 -3046 -20041 -11840 -2695 -10583 -14125 -6080 2410 14200 22443 12464 7072 25673 31827 5423
223 5423 -12032 -3854 -1951 -12412 -19079 -26028 -26157 -4603 9575 -7457 -15512 11244 29177 12709
$$ packed form
129g279L0520k5298j8535J5255n171j9826J356P413J0151J6521n789n602M1031
142C4747L0284l1360j7585K5460p039l0817J774j1648m1616P310L4962k3446k7420
155e6394L6363K7046j4718J1873K2112k0325p866K8962p771l5151Q742J6799j8540
168h868J922K8633r337k0610K6070K2715k4104j8668O308p272j2051K439j2997
181b5820k3911J2937L1834k099j4792J6454K7494P989j793l309o791L26M502j2780
195A0241k2056m394P726k03m122M9K559R592J1730m980j2032P450J0440j5046
209c046j6995Q201R145p888l542Q045Q490J1790Q243r979n392J8601O154k6404
223E423j7455Q178J903j0461o667o949j29K1554J4178j7032q055K6756J7933j6468
$$ plain form
237 12709 -3622 800 8595 7994 -204 -11919 -12683 2639 12091 1561 -8424 3122 20629 15282
251 15282 -6205 -10308 3917 3446 -14846 -21910 -13909 -7702 -3560 -2454 -7814 -562 22215 22907
265 22907 1012 2543 21042 13380 -5247 -5029 -5855 -12362 -2170 1974 -18289 -16324 16411 17456
279 17456 -11801 -7856 17546 12018 -7556 -8385 -5249 -6042 -2028 -5010 -13411 -3530 13302 10182
293 10182 2300 8241 13129 10798 9476 1945 -9965 -7560 612 -7782 -20616 -15473 -780 4839
307 4839 -748 -5013 5157 19322 12629 -4072 -266 10551 441 -11613 -5237 -2172 -9230 -4400
321 -4400 5230 601 -1478 10331 13126 2518 394 4584 245 -6208 -8344 -11096 -9413 -2173 -3890
336 -3890 -9600 991 15427 9341 -431 8540 16406 5427 -3985 -661 -1809 -9308 -8387 -4410 -7910
$$ packed form
237A2709j6331M422P795o01q198j1715p64J5322R452j0530r985J1546J7507n347
251A5282k1487m103J4225m71j8292p064Q001O207M142J106n360P252K2777O92
265B2907k1895J531J8499p662j8627K18q26o507J0192M144k0263J965L2735J045
279A7456k9257L945K5402n528j9574q29L136p93M014k982q401R881J6832l120
293A0182p882N941M888k331j322p531j1910K405Q172q394j2834N143J4693N619
307D839n587m265J0170J4165o693j6701L806J0817j0110j2054O376L065p058M830
321d400R630m629k079J1809K795j0608k124M190m339o453k136k752J683P240j717
336c890n710J0591J4436o086r772Q971P866j0979r412L324j148p499R21L977l500
$$ plain form
351 -7910 -7927 1494 5817 2364 3488 7400 5921 3414 1796 -3549 -6255 -2823 -4309 -9268 -3929 3534
367 3534 16 -219 10449 12014 2794 3384 8695 1996 -5997 -5042 -6860 -11208 -7211 -3482 -6899 -4134
383 -4134 5232 6880 4281 6637 7559 4773 4508 2093 -4819 -5633 -1822 -4875 -8522 -2780 3160 1611
399 1611 1155 5884 8173 4658 471 -77 154 -3866 -8026 -6628 -5396 -7338 -3523 3580 1988 -29
415 -29 8695 13490 5350 1249 4670 2298 -2632 -4120 -8595 -9629 -993 -758 -9320 -1765 11138 3520
431 3520 -2813 9586 9729 -5312 -2040 6669 -5997 -12844 363 624 -9471 -983 8112 1239
445 1239 3060 11399 3353 -1089 9006 1793 -14273 -4001 5615 -12304 -16285 4688 4651 -9241
459 -9241 1849 14046 3019 479 11257 5370 -4959 385 326 -8873 -5512 -733 -7328 -3969
$$ packed form
351g910j7R421M323l453J124L912j479k507j618n345k706L432j486m959N339P463
367C534l518k35J0668J565r220N90N311o699p993R55j818m348L997L729l417K765
383d134R366J648k599K356R22k786k65k415o912q14L811l053l647N742N940j549
399A611m56M729K289l515m187n48K31m020m160J398J232j942L815P103j592k017
415b9Q724M795q140m101L421k372m930j488m475j034Q636K35q562P555J2903p618
431C520o333J2399J43j5041L272Q709j2666o847J3207K61j0095Q488R095o873
445A239J821Q339q046m442J0095p213j6066J0272R616j7919l981K0973l7j3892
459i241J1090J2197j1027k540J0778n887j0329N344n9r199L361M779o595L359
$$ plain form
473 -3969 7480 2174 -3896 8432 12005 -2211 -2961 6913 180 -10258 -5245 -1389 -6355 -5389 -198
488 -198 726 3133 6388 4403 4546 7796 3247 -2789 119 228 -7772 -8182 -1528 -2546 -5915 -962
504 -962 4464 4106 3334 4013 4766 4822 797 -4037 -2290 -893 -6741 -7869 -727 -69 -3662 1667 7020
521 7020 3201 2647 6724 3497 -867 1050 -1412 -6487 -2804 -1050 -7289 -4046 5531 1331 -3566
536 -3566 6522 9500 -1516 -989 6700 -987 -8464 -1157 -458 -8750 -4289 3386 -1728 -2046 7251
551 7251 5724 39 5794 7053 -2323 -1870 3487 -4059 -9167 -974 128 -6683 -2137 4852 725
566 725 -106 5874 3588 -1434 2042 2296 -4314 -3869 -156 -3457 -4466 1025 1335 -776 3870 6271
582 6271 1913 1824 4796 1088 -3217 -1738 -2182 -5502 -4536 -2493 -3252 -1599 1895 1951 1943 4256 4299 2548
$$ packed form
473c969J1449n306o070J2328L573j4216p50R874o733j0438N013L856m966R66N191
488a98R24K407L255j985J43L250m549o036K908J09q000m10O654j018l369M953
504i62N426l58p72O79P53N6m025m834J747J397n848j128P142O58l593N329N353
521G020l819n54M077l227m364J917k462n075L683J754o239L243R577m200m897
536c566J0088K978j1016N27P689p687p477P307O99q292M461P675n114l18R297
551G251j527n685N755J259r376M53N357p546n108Q193J102o811M546O989m127
566G25q31N980k286n022L476K54o610M45L713l301j009N491L10k111M646K401
582F271m358q9K972l708m305J479m44l320R66K043p59J653L494N6qK313M3j751
$$ plain form
600 2548 2160 796 -1320 -893 -1374 -4007 -3028 -71 -734 -744 2366 2272 756 3140 2959 -1898 -1861 962
618 962 -2803 -5751 -1590 -685 -3741 -306 3919 1079 1235 6284 4430 -20 2669 3106 -2887 -3265
634 -3265 -108 -3537 -5617 -738 -209 -3494 375 4189 350 -370 4087 2323 -1951 114 885 -2955
650 -2955 -2183 814 -1336 -1816 2448 2520 288 2844 3626 -273 80 2492 -1731 -5033 -1277 -428 -4513
667 -4513 -3461 751 268 -432 2194 2573 1429 2729 2412 -506 -164 1048 -1852 -3275 -259 -9 -2519
684 -2519 -551 2601 956 -300 2318 2611 -433 -824 580 -675 -2607 -2001 -930 -1060 -977 -93 908
701 908 1714 1827 1272 1281 1625 535 -1249 -1285 -461 -1515 -2795 -1250 867 -21 -997 1558 3567 1382
719 1382 -393 1643 2387 -785 -2480 -937 -693 -2153 -2045 -908 -469 224 1180 1005 940 1676 1415 356
$$ packed form
600B548l88j364k116M27m81k633R79K957o63j0L110r4j516K384j81m857L7K823
618I62l765k948M161R05l056L435M225k840J56N049j854m450K689M37n993l78
634c265L157l429k080M879N29l285L869L814l839p20M457j764m274K065P71l840
650b955P72K997k150m80M264P2k232K556P82l899L53K412m223l302L756Q49m085
667d513J052M212m83p00K626L79j144J300l17k918L42J212k900j423L016K50k510
684b519J968L152j645j256K618K93l044l91J404j255j932O06J071j30Q3Q84J001
701I08Q06J13n55RL44j090j784l6Q24j054j280J545K117q88r76K555K009k185
719A382j775K036P44l172j695J543K44j460J08J137M39O93R56j75o5P36k61j059
$$ plain form
737 356 353 6 -1400 -1210 129 -779 -2032 211 2262 318 -813 2034 2810 -548 -1800 516 399
754 399 -2371 -2875 -1303 -660 -596 -201 -60 778 2557 2837 1324 741 1410 1380 328 -1012 -2280 -1907 -68
773 -68 -387 -2720 -1959 1485 1814 -815 -883 1465 1723 -320 -1465 -496 752 50 -1567 -821 1719 2130
791 2130 573 513 1776 2176 1602 83 -1980 -1806 218 -840 -4326 -4113 -433 888 -923 -1747 153
808 153 2983 3536 899 -584 2027 3302 94 -1936 2 810 -632 -749 -144 -215 687 1195 -926
825 -926 -1547 1038 882 -2835 -3354 -640 -9 -1305 -1815 -1452 921 4041 2558 -1195 1131 5922 3437
842 3437 -2051 -1193 1696 15 -2363 -2381 -2382 -1769 109 -453 -2271 -282 2547 828 -1401 309 1937
859 1937 262 -1383 -917 321 1223 720 -983 -329 3091 3653 -162 -1947 1074 2893 -421 -4042
$$ packed form
737C56ll47j406J90J339r08j253K243K051j944j131K847P76l358j252K316j17
754C99k770n04J572O43O4L95J41Q38J779K80j513n83O69l0j052j340j268L73J839
773f8l19k333P61L444L29k629o8K348K58k043j145R69J248p02j617P46K540M11
791B130j557o0J263M00n74j519k063J74K024j058l486K13L680J321j811q24J900
808A53K830N53k637j483K611J275l208k030J938Q08j442j17O05p1R02N08k121
825i26o21K585j56l717n19K714O31j296n10L63K373L120j483l753K326M791k485
842C437n488Q58K889j681k378j8jO13J878n62j818J989K829j719k229J710J628
859A937j675j645M66J238R02n03j703O54L420N62l815j785L021J819l314l621
$$ plain form
875 -4042 -3101 -261 -491 -2816 -2860 -658 966 1362 1302 802 1397 3025 2549 -223 -501 1363 352 -2159
893 -2159 -1444 336 -305 -1032 -470 -138 663 1581 -403 -2628 -163 2171 -1200 -4099 -1149 1564 138
910 138 -626 567 1105 2110 3483 1895 -491 842 2288 -167 -2434 -1716 -1211 -1965 -1821 -1278 -1132
927 -1132 -282 584 372 590 1595 1238 -218 -273 813 652 -840 -1497 -154 1441 975 -280 346 1693
945 1693 1491 668 176 -868 -1301 -440 -921 -2712 -2349 -520 -602 -732 948 1284 383 1574 2899 1299
963 1299 -84 685 328 -903 -445 -434 -2031 -1522 894 614 -1014 -57 1320 660 169 270 -653 -1213
981 -1213 -195 -269 -1547 -929 564 343 153 1618 2063 870 587 1387 1154 -259 -1292 -1516 -1245 -968
999 -968 -1315 -1911 -1365 231 1264 707 -41 653 1904 1550 -67 -609 -12 112 -298 -686 -797 -10 1003
$$ packed form
875d042R41K840k30k325m4K202J624L96o0n00N95J628m76k772k78J864j011k511
893b159P15J780o41p27N62L32Q01R18j984k225K465K334l371k899K950K713j426
910A38p64J193N38J005J373j588k386J333J446k455k267P18N05p54J44N43J46
927a132Q50Q66k12K18J005l57j456n5J086j61j492o57J343J595m66j255O26J347
945A693k02q23m92j044m33Q61m81j791L63J829q2j30J680L36r01J191J325j600
963A299j383P69l57j231M58J1j597N09K416k80j628R57J377o60m91J01r23n60
981a213J018p4j278O18J493k21j90J465M45j193k83Q00k33j413j033k24K71K77
999i68l47n96N46J596J033n57p48O94J251l54j617n42N97J24m10l88j11P87J013
$$ plain form
1018 1003 540 -249 859 1702 -74 -1263 65 241 -1773 -2304 -1087 -658 -681 -123 -165 177 1974 2605
1036 2605 878 195 1573 1685 38 -877 -991 -1021 -495 -455 -1510 -1341 690 1069 -483 -407 1133 753
1054 753 -767 -711 65 -449 -1089 -613 45 227 584 1050 1008 1047 1558 1453 293 -467 -311 -404 -1135 -1774 -1864
1075 -1864 -1244 -266 -76 -769 -169 1647 1787 209 119 1425 925 -638 -543 197 -469 -891 11 380 -187
1094 -187 189 972 511 -158 72 98 -661 -1148 -1023 -981 -864 -584 -489 -12 1096 1417 738 1032 2017 1396 -104
1115 -104 35 540 -649 -1625 -862 -436 -1344 -1200 212 404 -437 -60 1004 685 -351 -311 193 36 -480
1134 -480 -616 -243 412 665 326 438 1214 1265 416 232 390 -325 -1093 -767 -761 -1697 -1579 -210 86 -736 -225
1155 -225 1386 1355 241 406 1281 876 -364 -552 51 -5 -637 -761 -223 395 415 14 96 565 546 -117 -402
$$ packed form
1018A003m63p89J108Q43j776j189J328J76k014n31J217M29k3N58m2L42J797O31
1036B605j727o83J378J12j647r15j14l0N26M0j055J69K031L79j552P6J540l80
1054G53j520N6P76n14o40M76O58J82L57M66m2L9N11j05j160p60J56r3p31o39r0
1075a864O20R78J90o93O00J816J40j578r0J306n00j563R5P40o66m22R02L69n67
1094a87L76P83m61o69K30K6p59m87J25M2J17K80R5M77J108L21o79K94R85o21j500
1115a04J39N05j189r76P63M26r08J44J412J92q41L77J064l19j036M0N04j57n16
1134d80j36L73O55K53l39J12P76N1q49j84J58p15p68L26Or36J18J369K96q22N11
1155b25J611l1j114J65Q75m05j240j88O03n6o32j24N38O18K0m01Q2M69j9o63k85
$$ plain form
1176 -402 -387 -744 -794 -244 -355 -1048 -317 1211 1006 -207 391 1747 1136 -292 -268 309 -153 -1020 -1049 -551
1196 -551 -274 -428 -434 175 838 654 143 366 754 301 -281 -262 -384 -694 -391 108 -268 -673 314 1271 573
1217 573 -434 146 973 232 -749 -666 -282 -323 -528 -498 -200 262 460 342 535 922 555 -72 139 252 -514
1238 -514 -892 -439 -385 -729 -244 311 -41 -130 832 1157 261 -164 391 505 -140 -585 -548 -361 -173 -159 -317
1259 -317 -201 211 317 95 46 100 -132 -317 -157 -183 -459 -363 167 324 221 538 783 572 498 760 452 -292
1281 -292 -488 -216 -435 -936 -930 -605 -523 -347 -58 54 32 318 647 453 218 251 278 258 251 141 32 227 430
1304 430 337 169 110 95 -126 -370 -484 -702 -997 -991 -627 -477 -666 -287 441 679 542 872 1199 868 676 820
1326 820 495 -146 -221 -124 -480 -626 -415 -522 -572 -163 -2 -385 -334 87 -77 -438 -169 37 -210 -79 491
$$ packed form
1176d02J5l57n0N50j11o93P31J528k05j213N98J356o11j428K4N77m62q67k9M98
1196e51K77j54oO09O63j84n11K23L88m53n82J9j22l10L03M99l76m05R87R57o98
1217E73j007N80Q27p41r81Q3L84m1k05L0K98M62J98j18J93L87l67o27K11J13p66
1238e14l78M53N4l44M85N55l52q9R62L25q96m25N55J14o45m45L7J87J88J4j58
1259c17J16M12J06k22m9N4k32j85J60k6k76R6N30J57j03L17K45k11p4K62l08p44
1281b92j96K72k19n01OL25Q2J76K89J12k2K86L29j94k35L3K7k0pj10j09J95K03
1304D30r3j68n9j5k21k44j14k18k95OL64J50j89L79P28K38j37L30L27l31j92J44
1326H20l25o41p5R7l56j46K11j07n0M09J61l83N1M21j64l61K69K06k47J31N70
$$ plain form
1347 491 545 308 687 1073 839 573 575 278 -141 -268 -601 -1130 -1091 -765 -977 -1034 -369 40 -136 170 878 805
1369 805 400 646 877 470 130 266 221 -15 -11 14 -118 -42 35 -285 -414 -196 -429 -986 -770 -374 -821 -967
1391 -967 -83 333 -47 295 1259 1210 718 1040 1235 592 169 183 -257 -642 -615 -775 -923 -558 -418 -718 -254
1412 -254 421 -54 -549 268 634 -369 -562 407 455 -251 72 806 718 490 752 763 589 345 -7 -459 -468
1433 -468 -653 -1316 -1357 -712 -737 -1003 -283 584 341 319 1147 1258 504 425 808 330 -415 -223 -90 -460 -465 -44
1455 -44 43 -45 157 209 121 150 -117 -616 -465 -147 -709 -1144 -259 418 -77 -76 1032 1276 643 764 1182 545
1477 545 -165 -80 -251 -915 -1061 -824 -910 -776 -215 -107 -122 502 823 362 366 676 237 -255 112 95 -630 -339
1499 -339 480 182 -280 523 904 158 -12 433 72 -679 -607 -514 -884 -878 -549 -497 -114 421 383 401 1064 1108 321
$$ packed form
1347D91N4k37L79L86k34k66Kk97m19j27l33n29L9L26k12n7O65M09j76L06P08p3
1369H05m05K46K31m07l40J36m5k36MK5j32P6P7l20j29K18k33n57K16L96m47j46
1391i67Q84M16l80L42R64m9m92L22J95o43m23J4m40l85K7j60j48L65J40l00M64
1412b54O75m75m95Q17L66j003j93R69M8p06L23P34q8k28K62J1j74k44l52m52r
1433d68j85o63m1O45k5k66P20Q67k43k2Q28J11p54p9L83m78p45J92J33l70nM21
1455d4Q7q8K02N2q8K9k67m99J51L18n62m35Q85O77m95JJ108K44o33J21M18o37
1477E45p10Q5j71o64j46K37q6J34N61J08j5O24L21m61ML10m39m92L67j7p25K91
1499c39Q19k98m62Q03L81p46j70M45l61p51P2R3l70OL29N2L83N35l8J8O63M4p87
$$ plain form
1522 321 302 751 120 -685 -379 -22 -605 -761 -80 101 -163 133 512 244 20 143 18 -368 -412 -398 -459
1543 -459 -270 -55 -76 207 786 743 324 570 898 190 -459 -135 -59 -860 -1081 -392 -237 -592 -253 480 487 256
1565 256 518 692 427 61 -123 -182 -230 -360 -654 -411 185 233 -106 231 825 560 8 99 290 -283 -696
1586 -696 -451 -402 -699 -574 -44 145 207 454 723 670 499 386 309 39 -382 -543 -415 -362 -647 -605 -27 334
1608 334 184 107 402 585 383 22 -170 -159 -136 -378 -567 -286 12 17 39 492 637 355 413 510 128 -265 -155
1631 -155 -262 -758 -672 -154 -268 -521 1 520 363 265 490 372 167 206 -28 -504 -406 -52 -289 -490 -1
1652 -1 330 159 232 532 413 142 160 45 -299 -375 -280 -474 -474 -119 62 -45 140 495 531 381 237 132 12
1675 12 -78 -329 -555 -409 -281 -303 -168 125 191 270 440 449 226 175 105 -253 -396 -173 -303 -561 -274 192 91
$$ packed form
1522C21j9M49o31q05L06L57n83j56O81J81k64K96L79k68k24J23j25l86m4J4o1
1543d59J89K15k1K83N79m3m19K46L28p08o49L24P6q01k21O89J55l55L39P33Pk31
1565B56K62J74k65l66j84n9m8j30k94K43N96M8l39L37N94k65n52R1J91n73m13
1586f96K45M9k97J25N30J89O2K47K69n3j71j13p7k70m21j61J28N3k85M2N78L61
1608C34j50p7K95J83k02l61j92J1K3k42j89K81K98NK2M53J45k82N8R7l82l93J10
1631a55j07m96Q6N18j14k53N22N19j57r8K25j18k05L9k34m76R8L54k37k01M89
1652aL31j71P3L00j19k71J8j15l44p6R5j94%L55J81j07J85L55L6j50j44j05j20
1675A2r0k51k26J46J28k2J35K93O6P9J70Rk23n1p0l58j43K23j30k58K87M66j01
$$ plain form
1698 91 55 423 529 251 310 357 -233 -494 -88 -155 -787 -609 123 46 -238 268 686 422 263 424 263 45
1720 45 -1 -405 -762 -274 71 -548 -716 301 774 122 -10 667 609 74 -4 17 -484 -611 -237 -251 -636 -381
1742 -381 328 460 217 305 714 714 249 -125 -23 108 -374 -987 -685 47 30 -503 -333 628 994 426 -106
1763 -106 227 721 235 -657 -700 -224 -399 -657 -260 -61 -269 218 1010 486 -242 515 1056 -138 -870 36
1783 36 208 -812 -839 -28 114 -11 165 62 289 1154 713 -801 -387 1056 157 -1580 -809 432 -291
1802 -291 -710 235 257 -207 725 1214 -108 -519 730 572 -797 -723 -19 -293 -501 -95 -49 18 636 517
1822 517 -133 334 1020 37 -1010 -209 541 -392 -1181 -447 300 273 121 131 210 622 843 252 -421 -270 128
1843 128 -200 -732 -702 -336 -16 119 57 86 512 776 379 20 225 217 -405 -624 -352 -318 -436 -294 -202 28
$$ packed form
1698I1l6L68J06k78N9M7n90k61M06o7o32J78P32p7k84N06M18k64j59J61j61k18
1720D5m6m04l57M88L45o19j68J017M73o52j32O77n8n35p8K1n01j27L74j4l85K55
1742c81P09J32k43Q8M09%m65l74J02J31m82o13L02P32j7n33J70R61L66n68n32
1763a06L33M94m86q92m3M76j75k58L97J99k08M87P92n24p28P57N41j194p32R06
1783C6J72j020k7Q11J42j25J76j03K27Q65m41j514M14J443q99j737P71J241p23
1802b91m19R45K2m64R32M89j322m11J249j58j369P4P04k74k08M06M6O7O18j19
1822E17o50M67O86r83j047Q01P50r33p89P34P47k7j52J0P9M12K21n91o73J51L98
1843A28l28n32L0L66L20J35o2K9M26K64l97l59K05qo22k19K72L4j18J42R2K30
$$ plain form
1865 28 723 711 -136 34 1040 629 -721 -634 115 -304 -744 -377 -326 -365 478 752 -27 195 1129 566 -349
1886 -349 176 311 -847 -778 172 -490 -1179 74 681 -385 -142 1210 748 -469 191 870 -170 -862
1904 -862 -278 -145 -495 -294 -158 -267 298 826 320 -23 614 655 -213 -333 64 -299 -842 -397 87 -344
1924 -344 -528 298 761 187 -79 548 721 -96 -425 31 -19 -605 -602 -76 -7 -184 13 319 425 340 230 104
1946 104 161 88 -300 -480 -186 -121 -439 -298 239 323 22 209 686 445 -157 -58 324 -118 -794 -458 118 -245
1968 -245 -652 1 518 98 40 617 449 -131 103 284 -342 -543 -70 -179 -519 -3 247 -232 118 844
1988 844 307 -321 394 612 -486 -621 254 -178 -990 -196 456 -273 -341 645 632 -31 290 602 -80 -258
2008 -258 251 -125 -801 -327 137 -284 -314 237 225 -25 378 546 -39 -180 241 49 -473 -358 -151 -295 -268
$$ packed form
1865B8O95j2q47J70J006m11j350Q7P49m19m40L67N1l9Q43K74p79K22R34n63r15
1886c49N25J35j158O9R50o62o89J253O07j066K43J352m62j217O60O79j040o92
1904h62N84J33l50K01J36j09N65N28n06l43O37M1q68j20L97l63n43M45M84m31
1924c44j84Q26M63n74k66O27J73q17l29M56n0n86LN26O9j77J97L06J06q5j10j26
1946A04N7p3l88j80K94O5l18J41N37Q4l01J87M77k41o02R9L82m42o76L36N76l63
1968b45m07O53N17m20n8N77j68n80K34J81o26k01M73j09l40N16K50m79L50P26
1988H44n37o28P15K18j098j35Q75m32q12P94O52p29o8R86j3o63L21L12o82j78
2008b58N09l76o76M74M64m21l0N51j2k50M03J68n85j41M21j92n22J15K07j44K7
$$ plain form
2029 -268 119 106 -41 235 504 344 129 85 30 -70 -125 -217 -380 -297 -88 20 44 44 92 233 405 244 -45
2052 -45 -74 25 -78 -249 -250 -255 -227 -8 169 45 -17 202 268 144 143 12 -266 -219 103 -95 -458 -259 232 152 -39
2077 -39 197 255 74 187 361 -48 -313 -47 33 -221 -299 -102 -149 -51 234 136 -92 158 325 56 -152 21
2099 21 -77 -363 -184 99 -72 -323 -25 378 322 -14 -46 231 284 -23 -208 -109 -114 -225 -145 -67 -171 -148 123 292
2123 292 133 11 52 136 193 1 -267 -206 83 -42 -327 -19 293 -68 -214 370 509 -219 -320 381 311 -458
2145 -458 -416 101 3 -284 -50 83 -47 59 277 89 35 141 -14 -124 161 1 -507 -190 363 -25 -493
2166 -493 114 564 -59 -270 376 388 -289 -262 279 109 -354 -246 88 77 -28 -78 2 211 211 -63 -37 148 -23
2189 -23 -313 -82 109 -255 -411 59 286 -72 -202 206 375 77 -108 87 238 -39 -223 -42 103 -109
$$ packed form
2029b68L87j3j47K76K69j60k15m4n5j00n5r2j63Q3K09J08K4%M8J41J72j61k89
2052d5k9R9j03j71jnK8K19J77j24o2K19O6j24jj31k78M7L22j98l63J99M91q0j91
2077c9K36N8j81J13J74m09k65K66Q0k54p8J97m7R8K85r8k28K50J67k69k08J73
2099B1r8k86J79K83j71k51K98M03n6l36l2K77N3l07j85R9nj11Q0P8j04K3K71J69
2123B92j59j22M1Q4N7j92k68O1K89j25k85L08L12l61j46N84J39p28j01P01p0p69
2145d58M2N17r8k87K34J33j30J06K18j88n4J06j55j10K85j60n08L17N53l88m68
2166d93O07M50o23k11O46J2o77K7N41j70m63J08L34j1j05n0Q0K09%k74K6J85j71
2189b3k90K31J91l64j56M70K27l58j30M08J69k98j85J95J51k77j84J81J45k12
$$ plain form
2209 -109 -265 69 259 3 -123 141 239 -19 -172 -2 54 -150 -235 -58 57 -93 -125 121 221 62 -9 157
2231 157 250 66 -150 -110 61 -13 -226 -133 99 -8 -124 45 234 35 -90 175 177 -128 -110 99 -28 -202
2253 -202 -15 101 -29 -11 134 56 59 186 49 -83 34 74 -225 -177 37 -111 -226 44 163 -105 12 263
2275 263 116 -116 108 188 -138 -174 45 -48 -207 -36 22 -41 22 97 12 40 141 28 -85 23 -12 -177 -86 70
2299 70 -47 -131 135 247 16 -1 228 194 -32 -46 15 -74 -175 -163 -86 -85 -119 -66 35 80 35 25 98 107 7 -64 -13
2326 -13 102 -45 -145 16 161 19 -54 146 236 0 -50 127 72 -137 -106 -11 -110 -164 -46 -21 -40 49 65 56 124
2351 124 112 -54 -2 115 -57 -232 -27 115 -155 -213 108 119 -93 2 123 3 4 47 -53 -137 31 18 -147
2374 -147 -24 110 -1 8 176 90 -33 114 147 -89 -156 31 -43 -191 -142 -33 -79 -25 24 -18 -21 120 75 -79 40
$$ packed form
2209a09j56L34J90k56j26K64R8k58j53J70N6k04q5J77J15j50l2K46J00j59p1J66
2231A57R3j84k16M0J71p4k13R3K32j07j16J69J89j99j25K65Kl05J8K09j27j74
2253b02J87J16j30J8J45p8LJ27j37j32J17M0k99M8K14j48j15K70J19k68J17K51
2275B63j47k32K24Q0l26l6K19r3j59J71N8o3O3P5q5K8J01j13j13J08l5j65R1J56
2299G0j17q4K66J12k31j7K29l4k26j4O1q9j01J2P7Jl4N3J01M5m5j0P3Rj00p1N1
2326a3J15j47j00J61J45j42p3K00R0k36n0J77n5k09L1R5r9n4J18K5j9Q9J6rO8
2351A24j2j66N2J17j72j75K05J42k70n8L21J1k12R5J21j20JM3j00q4J68j3j65
2374a47J23J34j11RJ68q6j23J47L3k36o7J87p4j48M9J09m6N4M9m2lJ41m5j54J19
$$ plain form
2399 40 115 -14 -93 -3 38 -78 -15 76 14 -8 69 47 -62 -31 3 -90 -121 -66 -57 -73 2 31 -32 23 133 129 -4 95 162
2428 162 89 -77 -46 53 -32 -137 -42 18 -13 -28 -45 -29 11 29 -57 -58 -6 1 -82 -38 24 -37 4 101 64 -10 76 160 55
2457 55 -79 8 45 -33 -137 -43 18 -5 -78 -76 -10 106 43 -33 45 84 26 -26 -12 -20 -6 14 -42 -48 -6 63 5 -38 -17 -17 -10
2488 -10 -28 -102 -96 50 0 -108 -61 95 98 -45 10 146 106 -6 82 58 -37 8 47 -43 -133 26 65 -47 -90 11 51
2515 51 26 -18 -45 -33 -2 30 -63 -14 49 40 6 53 122 -26 -9 89 64 -55 -78 47 3 -104 -102 11 25 -73 -51 89
2543 89 47 -29 -4 98 36 -51 54 59 -61 -2 95 39 -31 -38 66 105 9 -133 -98 122 71 -200 -207 115 159 -143 -189
2570 -189 59 119 4 -53 35 28 19 41 18 -72 -78 75 65 -73 -98 71 153 -33 -123 51 159 28 -153 -60 182 129
2596 129 -178 -200 139 252 -67 -198 31 195 11 -138 -63 -32 -13 24 -52 -142 -78 137 80 -105 -114 98 201 14
$$ packed form
2399D0P5j29p9R0M1j16O3R1o2k2P7k2j09L1L4r3l1N5Rj6P5K9o3N5J10mj33R9O7
2428A62p3j66L1R9q5j05R5O0l1j5j7J6M0J8q6jN2Pq3M4O2o1M1R7l7p4Q6Q4j05
2457E5j34Q7L7p8j04R4O1k3p3KO6J16o3p6P8L9n8n2J4qJ4K0n6oM2O9n8m3K1%P
2488a0j8p4OJ46n0j08M7J56Lj43N5J36m0j12Q8k4r5M5L9r0r0J59L9j12m3J01M0
2515E1k5m4k7J2L1L2r3M9O3rl4M7O9j48J7R8k5j19k3J25m4j07KJ13J4r8K2J40
2543H9m2p6K5J02o2q7J05Nj20N9R7n6p0pJ04L9r6j42L5K20n1k71pL22M4l02m6
2570a89K48O0j15n7Q8prK2k3r0oJ53j0j38k5J69Q2j86r0J74J08j31j81R3K42n3
2596A29l07k2L39J13l19j31K29J64j84j49P5L1J9L7p6r0O4K15n7j85rK12J03j87
$$ plain form
2620 14 -159 -16 197 77 -163 -108 128 122 -123 -138 138 174 -24 -169 49 165 35 -105 -93 18 38 29 -101
2643 -101 -85 -19 104 62 -100 -103 93 163 -15 -204 -68 161 70 -191 -103 149 118 -84 -69 104 117 22 -72 -28 86
2668 86 83 -96 -137 -2 95 -31 -111 -9 71 109 51 -51 -92 83 178 -39 -202 -31 219 62 -142 -78 121 120 -35
2693 -35 -67 41 64 21 -38 -83 -49 54 -34 -109 -24 79 58 -68 -30 59 68 34 -7 -43 -8 133 41 -168 -89 182 99
2720 99 -115 -68 117 67 -3 -16 -40 -31 65 53 -131 -129 57 75 -91 -55 67 77 7 -23 -19 9 16 18 -76 -63 39 29 -89
2749 -89 -65 73 118 -23 -40 63 82 13 23 19 -49 -9 86 -12 -128 10 116 -20 -101 25 61 -19 -20 -17 -39 -27 50 -20
2777 -20 -104 -9 95 -31 -90 51 100 -30 -19 54 37 -13 6 5 -51 8 61 39 -79 -34 72 0 -45 0 18 0 29 3
2805 3 -36 -21 89 -14 -87 2 103 3 -63 64 99 -21 -49 64 14 -50 -39 47 -53 -65 21 23 -22 9 15 4 10 25
$$ packed form
2620A4j73J43K13j20k40N5K36ok45j5K76L6j98j45K18J16j30j40J2J11K0rj30
2643a01J6O6J23m2j62lJ96P0j78j89J36K29r1k61Q8K52l1k02J5J73J3r5r4M4J14
2668H6lj79m1J35R7j26q0J02Q0L8n8j02m1J75R5k17j63J71K50j57k04O4J99jj55
2693c5l2J08K3m3n9m5L4J03q8p5Q5J03k1j26L8Q9Rl4m1l6L5J41r2k09P9K71q3
2720I9k14M7J85n0p0j3k4RR6j2j84KJ86J8j66L6J22J0p0l0MK8PKr4J3J02j0j18
2749h9K4J38M5j41j7J03J9o9J0mo8M0R5r8j16J38J06j36q1J26L6q0jLk2J2P7p0
2777b0q4R5J04j26n9J41M9j30J1P3j7n0J9jn6N9N3k2j18M5J06p2m5M5J8j8K9k6
2805Cl9J5J10j03p3Q9J01j00o6J27L5j20k8J13n0o4J1Q6j00j2Q6Km5L1Oj1OJ5
$$ plain form
2833 25 -21 -23 30 13 -55 11 56 -9 -61 37 108 -4 -40 71 66 -42 -73 50 29 -73 -34 29 -16 -20 20 8 -11 24 -16
2862 -16 -8 29 41 -64 -37 49 8 -107 -39 70 1 -37 -17 57 -12 3 84 15 -44 -29 66 28 -26 -23 21 44 44 -40 6 39
2892 39 48 -45 -45 50 9 -80 -49 25 -32 -64 -20 -9 17 -5 21 -12 -25 13 35 -23 -82 -17 41 28 -41 -28 19 69 55 -15 -11 105
2924 105 54 -63 -44 62 19 -77 -6 43 13 9 37 31 -1 7 9 -11 -39 21 4 -68 -70 -21 33 8 -33 -6 16 63 23 -56 -40
2955 -40 92 38 -62 -92 19 25 -21 -22 22 -13 2 42 45 -57 8 42 2 -52 1 48 -47 -45 54 55 -4 8 41 9 13 4 -43 -42
2987 -42 45 23 -77 -57 35 -4 -35 -18 9 -4 -7 19 10 -62 -44 38 -15 -43 3 31 -21 4 71 69 10 40 53 10 -32 -16 -10 -22
3019 -22 64 7 -78 -36 48 10 -45 1 28 -5 -25 36 3 -58 -17 52 -31 -58 6 4 -10 39 18 -12 -5 11 15 26 3 8 9 -8 39
3052 39 6 -32 10 25 19 -27 -1 29 5 -28 27 15 -44 -20 23 -26 -46 14 30 3 6 18 -18 4 5 -11 -19 -12 3 -37 -18 -4 40
$$ packed form
2833B5m6kN3j7o8O6M5o5n2R8P1j12l6J11nj08l1J23k1j02L9O3m5mM0j2j9L5m0
2862a6QL7J2j05K7Q6m1j15O8J09o9l8K0P4o9J5Q1o9n9J5R5l8n4LM4K3%q4M6L3
2892C9Rr3%R5m1q9L1P4n7l2M4J1K6k2K6l3j3L8K2n8n9O5N8j3o9J3M7N0j4p0MJ16
2924A05n1j17J9J06m3r6P1M9l0mK8ol2QKk0k8O0j7p2kM9N4k5m1K7K2M7m0p9J6
2955d0J32n4j00l0J11Om6jM4l5J5M0Lj02O5L4m0n4N3M7r5KR9Jn9J2L3l2Mrm7J
2987d2Q7k2j00K0R2l9l1J7K7j3lK6rp2J8Q2n3k8M6K8n2K5O7kn9L0J3m3m2J6Oj2
3019b2Q6n7q5M2Q4l8n5M6K7l3k0O1l3o1M1O9q3k7O4kj4M9k1l0PJ6MJ1k3NJj7M7
3052C9l3l8M2J5om6K6L0k4l3N5j2n9K4M3m9k0O0J6k7LJ2l6K2Jj6qPJ5m0J9J4M4
$$ plain form
3085 40 -4 12 29 -34 -12 17 39 -1 -9 7 2 -6 24 -24 10 5 2 23 10 -11 26 22 -18 -6 8 -11 0 -5 -4 -16 -4 17 -23 -5
3119 -5 9 -25 -22 -9 9 -18 -17 2 -18 6 12 6 -4 19 17 25 26 37 10 27 19 11 4 40 21 -14 -11 6 -1 -10 24 13 -34 -20 -8 -3 -28 -8
3157 -8 4 -26 -17 -12 -18 -9 -14 -15 -5 -16 13 13 12 19 42 15 5 13 41 -4 -12 34 52 -8 -7 34 12 23 -20 22 6 -20 5 -6 -2 1 -11 -2
3195 -2 -6 -12 -20 -2 18 17 -21 -19 6 17 -2 4 -6 9 8 -6 8 -18 -20 5 53 27 0 1 17 3 6 5 -2 -3 -24 -13 14 -10 -20 -20 20 24
3233 24 -10 2 8 36 7 3 0 33 -6 -49 -4 -4 -35 -65 19 28 -39 -35 12 32 -13 -36 -3 4 11 -18 3 13 -9 -14 8 50 -15 -30 19
3268 19 34 11 -19 4 21 16 -15 -15 6 -9 -33 -20 6 -8 -22 -6 40 1 -35 -28 19 8 -22 -23 30 15 -41 -1 62 13 -8 22
3300 22 52 -14 -14 11 11 20 -74 1 17 28 -11 -17 21 18 2 -15 4 14 -47 -41 9 21 -24 -31 8 19 -40 -4 -1 -1 2 -25 -9 -25 0
3335 0 -15 -18 -25 -21 -14 12 14 -2 5 9 28 39 5 -21 12 -12 -24 -6 7 -24 -52 9 34 -8 -3 31 6 -13 -8 -25 6 -12 -37 -18 -16 -10
$$ packed form
3085D0m4J6J7o3K2K9K2m0qJ6nqL0m8L4nlK1j3k1L7mm0J2J4j9J1nJj2J2K1m0J8
3119eJ4l4LJ3J8k7JJ9k0K4Ooj0K3kQJJ1k7J7qqpL6j9l5LJ7prL4j1m7J4J2Nk5K0
3157hJ2l0RNoRnjJ0j1K9%jPK3k7j0QK8m5qM6J8o0JM1k2J1m3M2j6k6K5j1MLj2R
3195bmoqJ8K0jl8KK5J1j9Oj0J5jj4J4k6kK5M8k6k7JJ6j4Ljpjk1J1K7k4j0%M0M
3233B4l4J2OK8k9mlL3l9m3M5%l1l0Q4Ro7MM7K0m5k3L3PPk9K1J0k2nK2M2o5j5M9
3268A9J5k3l0K3J7nl1%K1j5k4J3K6j4j4J6M6l9l6PM7j1l0jN3j5n6M0O3m9k1L0
3300B2L0o6%K5%Rr4P5J6J1l9oL8lj6j7J9J0o1ON0J2m5pL9J1n9L6L%Lk7J6j6K5
3335@j5lpMPK6Kj6PMJ9J1l4k6L3k4j2J8J3l1k8O1K5m2NL4k5j9Nj7L1j8k5J9KO
$$ plain form
3371 -10 -15 -3 14 5 13 32 19 -8 -8 -24 -41 -7 -21 -42 -29 18 -13 22 12 26 25 41 41 21 -34 1 39 8 -16 -35 -12 30 9
3404 9 2 -6 -35 15 -1 -19 -22 0 -11 -21 -24 3 -23 -30 -13 1 -4 -2 6 30 19 0 -46 -12 -2 32 34 -35 24 55 40 -9 -2 6 23 59
3440 59 14 -37 1 9 -7 -38 -22 -8 2 -7 -27 -1 -12 -25 -15 2 -8 5 -29 -10 -20 -1 16 -5 -7 29 45 -13 -25 23 56 19
3472 19 -17 20 27 24 5 -26 -37 26 14 -17 10 -22 34 -2 -14 -13 12 5 22 11 -15 1 26 -7 -26 4 13 -26 -41 1 1 -16 -16 11
3506 11 1 -33 -5 -27 -35 12 40 -28 -57 7 28 18 37 36 0 6 51 11 -32 6 41 23 -47 -5 19 -28 11 -27 -31 -6 6 -18
3538 -18 13 4 -27 -1 5 -7 -16 -8 -29 -8 7 -19 6 -6 -37 12 28 37 -29 -5 34 30 -10 -34 8 28 -9 -21 10 42 37 0 43 -27
3572 -27 7 -1 -15 -33 -35 -25 -10 -23 -56 -14 -31 -5 -16 -16 -17 32 17 -24 -32 71 3 -57 -10 76 33 -32 3 41 21 -37 12 -15
3604 -15 11 -13 0 -6 -43 -5 -16 -4 13 4 -3 13 50 11 3 52 30 -4 -43 0 26 -21 -56 10 61 -32 -51 51 49 -20 -35 17
$$ packed form
3371a0nJ2J7rQJ9j3k7%j6j7L4j4k1J3M7l1L5j0J4jJ6%k0n5L5L8l1k4j9K3M2k1
3404Ipqk9N0j6j8lK2j1j0lK7k6pJ7J4nKQK4j1j9m6L4J0L4Ko9N9L1j5m9PQJ7L6
3440E9m5n1L8Qj6l1J6J4J0rk0K6j1j3J0J7j0J3l4J9j0J9J7k1kL6J6n8j2M8L3l7
3472A9l6L7Plj9l1j1O3j2l1K7l2N6l6j2JK5pJ7j1k6J6K5l3j9L0Rl9j5M2%j7%K7
3506A1j0l4K8k2qM7K8o8k9O4K1j0J9jl6OM5m0m3L8L5j8p0M2K4m7L9l8mK5J2k4
3538a8L1rl1K6Oj2rQk1K1J5k6K5j2l1M9J6Ro6K4L9mm0k4M2K0l7j2L1L2nl7M3p0
3572b7L4qj4j8kJ0J5j3l3M2j7K6j1%jM9j5m1qJ03o8o0M7Q6m3o5L5L8k0n8M9k7
3604a5K6k4J3ol7L8j1J2J7rpJ6L7l9qM9k2l4l9M3K6m7l5O6N1r3j9J02ko9j5N2
$$ plain form
3636 17 16 -11 -7 25 1 27 11 24 22 43 2 7 6 -16 -10 9 38 10 -45 -12 33 -4 -63 -21 49 -9 -75 17 42 -11 -56 1 58
3669 58 -31 -34 33 2 -23 -11 12 -27 -15 -6 -39 -8 2 -32 -37 26 40 -23 -12 64 52 -23 13 50 34 -37 -1 20 1 -50 -14 35
3701 35 -34 -29 18 -23 -48 -35 17 -23 -11 -19 -46 -27 2 -4 4 32 74 54 10 37 50 14 -9 6 -19 -16 -34 -2 -9 -41 -23 -6 29
3734 29 19 10 6 42 19 -6 0 -47 -11 -3 -4 -5 14 19 -4 0 16 -18 -30 -27 -8 -63 -43 18 -17 -42 -8 78 26 9 61 62 5 -4 10 5
3770 5 -54 -46 9 -34 -40 9 -11 -20 22 21 8 -16 26 -27 -41 -33 -30 -27 -13 25 45 25 12 37 20 10 3 7 -34 -45 -49 -36 -53 -24 -25 -4
3806 -4 7 34 63 32 39 82 45 5 -4 7 -30 -50 4 14 -20 -14 41 27 5 27 4 -17 -18 -20 -45 -72 -54 -6 2 -29 20 51 36 21
3840 21 72 36 6 22 30 -28 -52 -24 -18 -46 -55 26 15 15 54 59 22 68 53 -12 -26 -4 -13 -35 -24 27 15 2 34 39 -8 18 26 -6
3874 -6 -36 -38 -7 -41 -71 -44 4 -21 -6 15 50 36 48 68 24 58 34 13 -26 -6 -3 -43 -23 24 -2 -1 12 31 31 14 -3 25 -23
$$ packed form
3636A7jk7ML2k4K6j6J3kK1m1Njk2OJ9K9k8n5L3M5l7n9M2P0n8o6R2K5n3m5N7N7
3669E8q9lO7l1k5J2K3l9J2Rl3L1J0l4nO3J4o3J1P6j2p5L6L7j6p1L6K1j9n1L6M9
3701C5o9NM7m1k5J3N2m0J2qk7J9K9oQK8M2k0m4K7J3l6k3J5k5Lj8L2pl2J8J7L5
3734B9j0rmL6k3k5Om7L6QjjJ9Nk3MJ6l4j2LJ9n5K0O1l5k5L4Q6n2j7N2Jn7rJ4n
3770En9QN5m3oM9k0rM2jj3k4M2n3j4QLLJ4L8K0k0j3K5j7j0pMm1j1mJ3j7K9jK1
3806dJ1K7K9l1PM3l7m0rJ1l7k0N4J0l4ON5j4k2K2k3k1jkk5k7J8M8Ql1M9L1j5j5
3840B1N1l6l0J6Qn8k4K8Ok8rQ1j1%L9Nl7M6j5o5j4K2rk2J1N1j2j3L2Nm7K6Ql2
3874fl0kL1l4l0K7M8k5J5K1L5j4J2K0m4L4k4k1l9K0Lm0K0M7k6JJ3J9%j7j7K8m8
$$ plain form
3907 -23 -23 -10 -9 -33 -26 10 10 10 40 13 -4 6 12 -57 -47 -25 -62 -80 -55 -21 -18 -20 -12 36 35 32 35 39 -10 -5 21 17 -29 -30 12 -5 14 10 17
3946 17 23 26 18 18 3 -36 -27 -31 12 -11 -50 -2 38 14 10 10 17 15 8 -18 -1 -12 -19 -36 -28 -14 -24 -18 12 45 37 53 55 34 26 1 27 5 -5
3985 -5 -18 -8 43 37 -20 30 40 43 -14 -14 10 -21 -48 -59 -16 -25 -79 -46 16 5 -5 39 59 18 -13 29 23 -13 -4 -37 -21 9 -20 -38
4019 -38 1 33 29 -5 77 44 15 -17 29 26 -34 -20 51 -11 -69 20 39 9 24 5 26 -1 -22 -11 -1 -1 -23 -39 -27 -9 -31 -41
4051 -41 14 49 -2 -31 63 29 -14 9 20 -4 -8 -34 7 -5 19 12 8 15 28 5 6 32 -3 3 15 12 -11 -19 14 32 1 0 28 27 4
4086 4 -13 6 -19 -22 -1 -35 -24 -16 -42 10 23 0 6 -10 24 5 12 -4 29 -11 -12 4 20 -2 26 27 16 28 8 21 16 -10 12 -17
4120 -17 -40 -8 -35 -32 -16 -16 -23 -10 20 14 -12 33 27 12 -22 -14 -25 -9 30 -20 -12 18 3 10 19 34 36 -9 18 36 17 -5 13 -10 5
4155 5 9 30 17 14 30 27 -8 16 -1 -50 -19 0 -32 -56 -27 -13 -24 -7 -8 -6 -28 4 10 -2 23 -6 -15 0 3 5 -11 8 27 11 12 39
$$ packed form
3907b3%J3Jk4PL6%%L0k7j7J0Oo9J0K2l7j8K5L4LkQM8jlLMm9NK6mm6jM2j7J9mP
3946A7OLq%j5l9RmM3k3l9M8M0k4m%Pkpk6J7j1pj7QJ4j0OL0L3qJ6Kk1qk5K6k2j0
3985ej3J0N1on7N0J0Ln7%K4l1k7j1M3rn4L3O2j1j0M4K0m1l1M2ol6Rl3J6L0k9j8
4019c8L9L2ml4Q2l3k9l2M6lo0J4P1o2n8Q9J9l0J5j9K1k7k1J1J0%k2j6J2J8k2j0
4051d1N5L5n1k9R4l4m3K3J1k4mk6M1j2K4pmPJ3k3JK6l5OJ2lk3qL3J8l1jK8jk3
4086Dj7J9k5lK1l4J1Qk6N2J3k3Oj6L4j9Pj6L3m0jJ6J6k2K8Jj1J2k0J3nk6K2k9
4120a7k3L2k7LJ6%pJ3L0ok6M5oj5l4Qj1J6L9n0QL0j5PRJ5Km5K7J8j9k2J8k3J5
4155EMK1j3lJ6ll5K4j7m9L1J9l2k4K9J4j1J7jKk2L2Oj2K5k9rJ5LKj6J9J9j6JK7
$$ plain form
4191 39 14 18 11 11 9 -3 -8 -3 -15 4 6 4 14 16 17 8 6 0 -11 -5 -22 -5 -27 -45 -9 -13 -6 -3 6 4 -25 19 9 -7 29 -2 -15 -11 3 5 -15
4232 -15 33 11 9 12 16 13 -5 12 12 -17 -19 1 -17 -16 0 -29 22 -3 9 -1 -4 2 -29 -12 13 -35 -49 1 -4 -16 -13 7 4 18 6 18
4268 18 44 -7 7 -18 15 -3 -19 -1 40 19 -8 30 44 44 21 20 31 -13 -30 -13 -14 -24 -35 -25 -20 -12 1 -3 22 -8 -29 6 13 -12
4302 -12 -37 18 -28 -18 -9 1 13 31 -3 19 22 29 0 4 34 5 -40 -35 29 -15 5 -6 27 15 34 34 27 -9 20 -42 -18 -14 -27 -33 -31
4337 -31 -7 -30 -6 -5 5 -8 4 9 -16 -4 -23 -28 -51 -19 -16 10 6 -15 12 45 21 0 16 8 -17 -12 -6 6 -30 -18 4 13 13 20 24 23 29
4374 29 12 15 11 -21 -9 -30 -11 -38 -6 -24 -30 -21 -12 46 31 4 -7 5 -17 -6 -13 -7 -26 1 31 5 17 -3 66 36 30 23 20 25 -2 -32
4410 -32 -9 2 -11 -32 6 16 -6 -26 11 27 -7 -4 0 -17 -28 -48 -24 -9 -4 -20 -10 -8 20 5 9 25 11 2 -16 23 0 -39 16
4443 16 -7 3 -10 33 38 16 40 -8 17 42 9 -15 7 -17 -53 -7 9 -1 -17 7 52 24 -5 0 -14 -24 -24 -23 -28 -29 -54 -20 13
$$ packed form
4191C9k5Mp%kj2nNj2J9KkJ0KJrkoj1Oj7J7k2j8L6mPLRkk9M4j0j6L6l1j3MJ4Kk0
4232a5M8k2kLMlj8J7%k9kK0j8JJ6k9N1k5J2j0lOl1J7K5m8j4N0nj2LK0lJ4j2J2
4268A8K6n1J4k5L3j8j6J8M1k1k7L8J4%k3jJ1m4j7J7jj0j1J0NQJ3mK5l0k1L5Pk5
4302a2k5N5m6J0RJ0J2J8l4K2LPk9ML0k9m5NO4m4K0j1L3j2J9%pl6K9o2K4Mj3oK
4337c1K4k3K4JJ0j3J2Nk5J2j9nk3L2LK6mk1K7L3k4k1J6qk5NOJ2l6J2K2R%PMjO
4374B9j7Lml2J2k1J9k7L2j8oRRN8j5k7j1J2k2J1pOj9K7L0k6J2k0O9l0oplNk7l0
4410c2K3J1j3k1L8J0k2k0L7J6l4LMj7j1k0K4J5Nj6J0KK8j5MJ6j4rj8L9k3l9N5
4443A6k3J0j3M3Nk2K4m8K5K5l3k4K2k4l6M6J6j0j6K4M5k8k9Nj4j0%Jnjk5L4L3
$$ plain form
4476 13 0 26 28 15 1 10 26 -2 -4 -30 -3 9 -4 -6 -12 0 51 27 42 67 48 1 0 34 -39 -35 7 -40 -33 -30 25 -16 5 24 7
4511 7 -3 10 -18 -37 -3 -3 -33 -47 5 3 -7 14 18 20 38 36 -10 -29 21 -9 -56 -13 26 -32 -4 46 11 12 25 35 -7 26 32 -44
4545 -44 -30 20 -32 -72 -5 -22 -45 27 54 -14 -22 52 7 -22 3 4 -41 -12 27 -1 -10 14 23 11 30 33 -5 45 27 -19 -25 -8 -20
4578 -20 -53 5 2 -31 -5 35 -35 1 20 6 -48 12 3 -75 -55 21 -9 -70 26 48 -35 -1 29 -22 -19 58 34 -54 -8 11 -53 27
4610 27 55 -14 -26 33 32 -38 28 47 -15 -12 5 -28 -32 5 -6 -35 17 46 -27 5 31 -11 -53 0 -15 -57 -1 -24 -60 -35 19 -33
4642 -33 -73 23 9 -18 19 37 -4 -18 38 -4 -44 24 27 -7 37 54 -22 -3 86 -7 11 43 22 -56 -20 29 -45 -33 22 -7 -28
4673 -28 -7 10 -42 12 42 -63 -32 20 -20 -45 -1 13 -39 -24 31 -14 -20 20 15 -17 11 26 -23 -6 21 -40 -13 47 24 -29 27
4704 27 73 -1 -33 56 30 -48 3 4 -54 -28 -11 -39 -47 16 -3 -27 16 17 -65 -25 29 -25 -54 10 -1 -54 -24 35 -28 -44 31 26
$$ packed form
4476A3j3K6Kj3j4RJ6k8kk6K7J2j3koJ2N1k4J5K5j9m7jL4p3MM2m7PLN5m1K1J9j7
4511Gj0J3k8j9L4%l0j4N2kj0K1MKJ8km6j9N0l0m7M3L9n8K8N0l5JJ3J0m2L3Op6
4545d4J4N0n2m0O7j7k3P2K7o8qP4m5k9K5Jm5K9L9k8rK4Rj2J9Ll8N0j8m6oJ7j2
4578b0l3N8ll3K6M0p0L6J9j4n4O0rp8K0P6l0o1R6K2q3L4L0n1LP7k4q8M6J9o4Q0
4610B7K8o9j2N9jp0O6J9o2LJ7l3mL7j1k9N2K9p3L2K6m2m2N3j5m2N6k3l6K5N4n2
4642c3m0R6j4k7L7J8m1j4N6m2m0O8Ll4M4J7p6J9Q9r3J8L2k1p8L6M9p4J2N5k9k1
4673b8K1J7n2N4L0j05L1N2m0k5M4J4n2J5N5m5oM0nl2K8J5m9J7K7o1K7O0k3n3N6
4704B7M6p4l2Q9k6p8N1Jn8K6J7k8qO3j9k4M3Jq2M0N4n4k9O4j1n3L0N9o3j6P5n
$$ plain form
4736 26 7 16 24 -3 -6 46 -37 -20 2 -11 -44 34 48 -6 15 38 20 -20 26 12 -27 13 -8 -34 -12 -12 -51 -14 4 1 -39 -22 22
4769 22 -28 -22 -10 -20 -47 7 7 -48 6 21 -25 33 47 19 7 23 16 -30 -3 14 -35 1 30 20 -25 -10 5 17 -7 16 3 -7
4801 -7 -28 -22 -25 -34 -17 -45 -39 -10 11 -28 13 13 18 -15 21 14 3 12 3 18 -10 27 4 21 49 35 19 31 3 22 25 -29 -13 -35 -8 -11
4837 -11 -22 -3 -31 -16 -16 -10 11 19 26 -3 -21 -14 -17 -27 0 -6 -20 13 -6 21 13 -5 37 9 13 1 4 -38 -17 2 1 1 26 9 -1 28
4873 28 -1 14 15 20 -28 -34 26 -11 -37 -37 10 14 -9 20 4 -27 16 26 -41 17 -1 -6 -47 -14 -17 -42 -8 39 -30 -23 61 -6 -25 -5
4907 -5 25 -12 1 26 -13 4 48 11 -12 22 52 7 10 30 -6 -27 -9 -13 -53 14 8 -17 -33 22 -22 -36 38 15 -61 3 30 -23
4939 -23 -19 -7 -19 -53 -6 17 -18 13 25 9 -3 37 16 0 14 17 -4 7 34 -19 -37 7 21 -14 23 23 -17 -11 28 -11 -25 11
4971 11 1 -71 18 18 -34 -21 44 -15 -15 20 11 -36 3 32 -63 -17 24 -7 -21 31 22 -10 31 44 -10 4 69 2 -51 -9 32 -42
$$ packed form
4736B6j9RQk7lN2q3J7K2j3l3P8J4n4K1K3j8m0M6j4l9M0k1k6K2%l9L7J8lm0J7M4
4769B2n0OJ2j0k7N4%n5N4J5m6N8J4k8j2J6pm6K7J7m9L6K9j0m5J5J5J2k4K3j3j0
4801gk1OlrJ7k8OK9K1l9M1%Nl3L6pj1RrJ5k8L7k3J7K8j4j6J2k8J9Ln4J6k2K7l
4837a1j1J9k8J5%OK1QPk9j8Plj0K7oj4L3j9K7qj8M2k8Mj2Lm2K1J9j%K5j7j0K9
4873B8k9J5JNm8oO0l7k6%M7Mk3K9j6l1M3J0o7N8j8nm1L3lk5L4M7o9PQ4o7j9K0
4907eL0l7J3K5l9J7M4l7k3L4L0m5LK0l6k1J8mm0O7ok5j6N5m4j4P4k3p6O4K7n3
4939b3MJ2j2l4M7K3l5L1J2j6j2M0k1j6J4Lk1J1K7n3j8M4J4l5L7%m0OL9l9j4L6
4971A1j0p2Q9%n2J3O5n9%L5rm7L9K9r5M6M1l1j4N2rl2M1J3n4J4O5o7n3M2M1p4
$$ plain form
5003 -42 -15 46 -12 -5 20 -5 -27 55 39 -46 -19 30 -24 -71 -11 -13 -53 20 54 -36 -14 51 10 -35 17 21 -65 -32 34 -51 -44 38
5035 38 -11 -23 59 42 13 47 35 -4 0 44 11 -40 23 4 -31 -18 51 -13 -27 13 0 -27 22 6 -63 -12 34 -34 -43 18 4
5066 4 -69 22 38 -53 43 57 14 -8 23 4 -28 3 45 -45 -24 52 34 -7 66 40 2 61 54 12 -19 10 -20 -65 6 -12 -57
5097 -57 -10 53 -3 6 59 -2 -65 35 35 -45 -37 -1 5 -23 24 18 -12 30 48 11 11 48 12 -9 38 0 -65 -6 27 -24 3 14 -17
5130 -17 -21 50 47 -20 16 21 -42 -39 7 -36 -54 16 -6 -52 14 45 -13 2 31 10 -51 0 14 -29 -52 2 -11 -39 25 16 -3 63 48
5163 48 32 28 47 1 -30 20 12 -49 -10 35 -3 -9 20 31 23 17 18 -49 7 27 -46 -47 -7 -14 -38 23 -6 -28 30 33 9 7 28 -3 -30
5198 -30 -12 10 -59 -17 15 -9 2 44 27 4 49 55 -12 4 7 3 -5 2 -9 -20 10 5 -11 -13 28 31 -6 -1 7 -24 21 6 -38 -38 -33 3
5234 3 3 7 20 0 32 33 0 4 10 -7 1 -19 13 -7 3 9 44 16 61 30 3 32 20 -16 -35 14 -3 -28 -5 4 -2 9 43 3 -33
$$ packed form
5003d2K7O1n8PK5k5k2Q2j6q5K7M9n4m7O0km0P3L4r0K2O5m1m5N2Mq6L3O6q5PQ2
5035C8m9j2Q2j7k9L4j2l9MM4l3n1O3j9l5J3O9o4j4M0j3k7M9j6o9N1M6o8rO1j4
5066Dp3R1J6r1R6J4m3k2L1j9l2L1M2r0K1P6j8m1P3k6l8N9pm2l1K9l0m5P1j8m5
5097e7M7O3n6RN3o1o3J00%q0QL6Ok8M7ol0M2J8l7%L7l6k1M7l8o5N9L3n1K7J1l1
5130a7mP1lo7L6No3LM6m3j8P0k2m6O6L1n8J5K9k1o1N1J4m3k3N4j3k8O4rj9O6j5
5163D8j6mJ9m6l1N0qo1L9M5l8oK9J1qoJo7N6K0p3jM0pk4O1k9k2N8Lk4kK1l1k7
5198c0J8K2o9M2L2k4J1M2j7k3M5Oo7J6LmqPj1j1L0nj6kM1Ll7NQl1M5j5m4%NL6
5234C%MJ3k0L2Jl3MOj7Qk0L2k0J0OL5k8M5l1k7K9j2l6j9M9j7k5K3RoJ1L4m0l6
$$ plain form
5269 -33 8 16 -18 15 -19 -21 -25 -15 3 -33 6 12 4 26 18 25 -8 16 41 16 12 -24 14 15 21 -12 15 8 44 10 0 10 -5 -17 4 -18
5305 -18 -31 9 7 -14 -11 -2 5 -29 0 4 -37 0 6 5 -13 0 4 -24 -22 -1 15 7 33 17 23 -2 34 -2 9 24 4 -1 8 22 -1 8 16 22
5343 22 -15 16 9 -13 2 20 -4 -19 -18 -51 -3 -15 -16 -11 0 -5 -13 26 17 -21 11 -13 7 -13 0 -11 8 28 43 -8 10 31 33 4
5377 4 -6 45 -4 14 -2 -1 -29 10 5 -10 7 17 -7 3 20 -3 -30 29 7 -25 -3 -2 -19 -26 14 2 4 18 23 -7 -5 32 3 -11
5411 -11 24 16 5 19 30 -4 -11 49 32 -10 33 27 10 -12 -7 -22 4 11 -8 -1 5 17 -21 -7 6 -21 8 26 -29 -32 -7 9 -26 -13
5445 -13 9 -8 6 25 28 -6 11 32 -8 -19 1 -11 -6 13 27 1 23 46 -4 23 59 28 -24 12 7 -14 2 6 -16 -5 8 -5
5477 -5 -15 16 14 -39 26 24 -20 -31 15 6 -30 9 -2 -48 0 40 8 -17 31 12 30 -2 6 -13 14 38 5 8 9 21 14 7 31 -22 5
5512 5 -9 -14 -14 -10 -28 -49 -19 -5 -7 6 -12 -1 11 5 11 -27 4 18 -8 -34 16 -5 -17 10 12 9 0 22 17 0 18 14 -22 2 21 -21
$$ packed form
5269c3M1Ql4L3l4kmJ0J8l6L9OqK2qPl3K4K5k5ml6L8JOl3K7pL6l4j0J0j5j2K1k2
5305a8j3M0kk1LRPl4K9Mm1L7Ojj8J3Mk8KK1J6qK6j6Ok5L6l6J1J5k0nRJ4k3RQO
5343B2l7L1pk2J5J8k4j5Jl3M8j2jNJ1nqL9rl8L2k4K0k0J3j1J9K0J5n1J8K1Kk9
5377Dj0N1m9J8j6Jk8L9nj5J7J0k4J0J7k3k7N9k2l2K2Jj7pM0j2KJ4Nl0KL7k9j4
5411a1L5qj1J4J1l4pO0j7m2M3oj7k2Nj5K6Pj9POJ2l8J4J3k7K9J8n5lK5J6l5J3
5445a3K2j7J4J9Ll4J7K1m0j1K0j2NJ9J4k6K2K3n0K7L6l1n2L6nk1J6Mk2J1J3j3
5477ej0L1kn3O5km4j1M6rl6L9j1m6M8M0l2k5M8j9J8l2Qj9K7K4l3LJJ2ppK4n3K7
5512Ej4n%Mj8k1L0J4kJ3j8J1J2oOl8L1J4k6k6N0k1j2K7KlrK2nj7J8ml6K4J9m2
$$ plain form
5548 -21 -1 22 -28 0 26 20 -7 -17 29 -22 11 8 -10 -22 -19 -17 -25 -31 3 -15 -32 39 -1 -15 14 -5 -37 -20 10 -22 -18 36 19 -14
5582 -14 12 12 -10 38 11 -16 -36 15 3 -33 15 5 -40 -12 6 3 -14 1 5 -49 -22 10 -32 -27 -2 14 -30 -11 -22 -38 -4 17
5614 17 -8 -21 11 6 13 3 19 -14 -2 28 9 6 15 26 22 13 -2 11 5 -23 -16 -17 -18 -11 1 2 -22 -37 3 -26 -9 -27 2 -20 -29 1 -6
5651 -6 -23 -14 -5 -13 -11 -17 10 0 -11 14 9 21 22 3 15 31 27 -1 27 8 19 9 -2 16 6 22 13 12 -11 11 16 12 24 -11 -5 3 -3 -34
5689 -34 -11 -20 4 -10 -23 23 -42 -7 -8 -1 -16 16 17 41 7 1 9 3 10 28 24 10 31 15 -4 28 11 16 10 17 11 -27 -18 14 -3 0 4 12 7
5728 7 2 19 9 -35 -5 17 -15 -20 -34 -5 -11 -19 -3 -6 -11 -1 -16 19 -3 -16 -11 3 22 -10 -17 35 1 10 -9 8 36 0 23 18 7 -8
5764 -8 -2 -21 3 -27 -20 -33 10 -1 -6 1 -1 -2 -2 6 -23 17 -59 -2 -1 -8 6 12 22 -2 30 -6 26 5 -25 -6 26 1 -7 -27 38 25 21
5801 21 20 8 -4 2 29 16 4 -6 7 -17 -27 -6 -9 11 3 -9 -23 19 -17 -6 -5 12 9 -25 -18 -22 -11 -16 -2 17 10 3 0 21 19 18 3
$$ packed form
5548b1K0K3n0K8K6ok7j0M6n1L3lj8j2LKqoL4j8j7P1m0j4K9j9l2J7L0l2MN4j7l3
5582a4K6%k2M8k7k7k0N1j2l6M8j0m5K8J8lj7J5Mn4K7L2m2NK5J6m4J9j1j6L4K1
5614A7k5j3L2nPj0J6l3J2L0j9lRJ1mrj5J3ok8PjjPJ2Jk4j5M0k9J7j8K9k2rL0p
5651fj7RRqKoK7j0j1K5nJ2Jj9J2J6mk8K8j9J1j0j1J8j0J6rjk3K2NmJ2l5OQol1
5689c4K3rK4j4j3M6o5L5jPj5L2JK4l4oQoPJ8mj4K1j6j9L2j7NoPol8RL2j7LMQn
5728GnJ7j0m4L0K2l2nj4K9oqJ6lnJ0j5L5k2j3NJ4J9l2pN2l4Rj9J7K8l6K3nj1j5
5764hOj9K4l0Pj3M3j1nPkj%Qk9M0p6N7JpJ4OJ0k4L2l6L2k1l0J9L2k5qk0O5j3m
5801B1jj2j2OK7j3j2j0J3k4j0K1lK0qj2j4M2l6J1JJ7ll4PmJ1nJ4J9pplK1kjj5
$$ plain form
5838 3 -8 14 35 -12 8 11 9 -1 -2 20 11 16 12 24 -2 4 -9 -10 2 -13 2 -8 7 -26 -34 2 -23 23 -2 -4 -25 6 6 27 18 3 13
5875 13 2 27 -27 -14 21 5 -10 26 19 -9 19 -7 22 11 34 1 -15 0 4 -46 -15 1 -10 6 6 -13 -8 -12 -7 -11 -23 -9 8 -8
5909 -8 -14 -29 14 -18 20 -5 -9 10 -2 -19 17 20 -11 30 9 14 14 24 2 13 0 19 1 8 6 9 -7 -41 1 3 -24 -27 -15 -3 -7 -7 7
5946 7 -12 -18 -9 -10 0 -1 -16 12 14 4 -19 9 23 -1 20 3 10 -7 -11 24 13 19 8 16 19 27 -17 16 -8 4 13 11 11 -7 13 -45 -27 4
5984 4 -14 -46 -1 19 -15 -18 -6 18 -15 -12 -11 -10 -4 -17 -4 14 28 -20 4 7 17 44 14 6 -15 32 3 12 -20 -6 -4 -10 -3 28 13 -7
6020 -7 10 2 -7 -2 -14 -32 -24 10 -4 -18 -5 -7 -1 -11 12 -29 -4 -6 -16 -8 -11 3 -6 -1 28 28 -3 17 6 -20 16 3 -3 -5 14 6 1 -8 -6 1
6060 1 17 -10 -48 -15 -22 -23 -13 -13 0 -2 -16 -45 0 -36 -3 17 2 -6 9 4 -10 -1 -2 -12 1 -12 28 13 14 -13 18 20 12 11 6 20 4
6097 4 37 16 16 1 17 0 14 8 10 -8 8 -5 -21 -18 -17 -5 -1 6 -8 -5 -7 -15 7 1 -1 -26 -12 8 15 -1 -13 27 22 2 -4 5 -2 10 1 2
$$ packed form
5838Cj1K2K1m7K0Lkj0jK2rNmJ2k6Oj3jJ2j5J5j0J5l3qL6k5M6k5kk1L1%K1rj5J0
5875A3j1K5n4J3L5j6j5L6pk8K8k6K9j1K3l3j6J5Mn0L1J6j1J6%j9NmNmj2J4J7j6
5909hoj5M3l2L8k5mJ9j2j7L6Ll1M1k1N%J0k2J1j3J9j8PkLj6l4M2Kk7lJ2J2m%J4
5946Gj9oRjJ0jj5K8Kj0k3K8J4k4K1j7Pj7mL5j1Oj1QLQm4L3k4J2Rk%j8K0n8J8L1
5984Dj8l2M5K0l4lJ2K4l3LJJOj3J3J8J4m8K4LJ0K7l0qk1M7k9Rl2J4KoPL1j5k0
6020gJ7qrNj2j8QL4j4j4J3kOj0K3m1K5kj0QlJ4rNK9%l1K0j1k6L6j3okJ9qnrKP
6060AJ6k7l8L3pjJ0%J3kj4k9M5l6L3K0j5qJ5nj4Rjj0J3j3M0j5Jk7L1KqjnJ4j6
6097DL3k1%j5J6j7J4oKj8J6j3j6LJJ2MPj4LkqK2okk5J4K0Pj6j2M0nk0oRpJ2rJ
$$ plain form
6137 2 5 -1 6 3 -12 28 -13 16 11 8 -23 -3 1 -16 -18 -6 28 11 2 -25 -12 -20 1 1 5 -1 -14 5 13 10 -3 10 11 14 11 38 -15 5 12 -17
$$ packed form
6137BLoPlj5M0m1K9nll1K0Mj7kJ2L4j7rk7J3qK1%Moj3J9Qlj3J3JLlK7n3K0Pk9
$$ [...]
8191i
##END NTUPLES=NMR FID
##END=
