##TITLE=1H_AM_NV38
 CDCl3
 8 sc, 
 19.4.2023
##JCAMPDX= 6.0         $$ Bruker NMR JCAMP-DX V2.0
##DATA TYPE= NMR FID
##DATA CLASS= NTUPLES
##ORIGIN= UXNMR, Bruker Analytische Messtechnik GmbH
##OWNER= root
$$ XWIN-NMR		Version 3.5
$$ Wed Apr 19 14:13:34 2023 Russian Standard Time (UT+4h)  she@DPX200
##.OBSERVE FREQUENCY= 200.13135
##.OBSERVE NUCLEUS= ^1H
##.DELAY= (6, 6)
##.ACQUISITION MODE= SIMULTANEOUS
##.ACQUISITION SCHEME= undefined
##.AVERAGES= 8
##.DIGITISER RES= 18
##SPECTROMETER/DATA SYSTEM= spect
##.PULSE SEQUENCE= zg30
##.SOLVENT NAME= CDCl3
##.SHIFT REFERENCE= (INTERNAL, CDCl3, 0, 15.7039)
##AUDIT TRAIL= $$ (NUMBER, WHEN, WHO, WHERE, WHAT)
$$ ##TITLE= Audit trail, XWIN-NMR		Version 3.5
$$ ##JCAMPDX= 5.01
$$ ##ORIGIN= Bruker BioSpin GmbH
$$ ##OWNER= she
$$ F:/spectra/data/she/nmr/H-F/1/audita.txt
$$ ##AUDIT TRAIL=  $$ (NUMBER, WHEN, WHO, WHERE, WHAT)
(   1,<2023-04-19 14:12:24.96 +0400>,<she>,<DPX200>,
      <created by zg, POWCHK disabled, PULCHK disabled
       configuration hash MD5:
       00 E9 B6 7A A2 85 ED C7 34 08 36 98 17 FE 4E 26
       data hash MD5: 16K
       0F 8A 9B 87 B4 45 2E BE D9 B7 24 AA C6 54 FE 4A>)
$$ ##END=
$$ 
$$ hash MD5
$$ 5F A7 0D 10 BE C2 25 D5 52 88 CF 42 FD 00 0C 22
##$RELAX= 
##$RELAX= 
##$RELAX= 
##$RELAX= 
##$RELAX= 
##$RELAX= 
$$ Bruker specific parameters
$$ --------------------------
##$DU= <F:/spectra>
##$EXPNO= 1
##$NAME= <H-F>
##$PROCNO= 1
##$TYPE= <nmr>
##$USER= <she>
##$AMP= (0..31)
100 100 100 100 100 100 100 100 100 100 100 100 100 100 100 100 100 100 
100 100 100 100 100 100 100 100 100 100 100 100 100 100 
##$AQSEQ= 0
##$AQ_mod= 1
##$AUNM= <au_zg>
##$AUTOPOS= <>
##$BF1= 200.13
##$BF2= 200.13
##$BF3= 200.13
##$BF4= 200.13
##$BF5= 200.13
##$BF6= 200.13
##$BF7= 200.13
##$BF8= 200.13
##$BYTORDA= 1
##$CFDGTYP= 0
##$CFRGTYP= 5
##$CHEMSTR= <none>
##$CNST= (0..31)
1 1 145 1 1 1 1 1 1 1 1 1 1 1 1 1 1 1 1 1 1 1 1 1 1 1 1 1 1 1 1 1 
##$CPDPRG= <>
##$CPDPRG1= <>
##$CPDPRG2= <>
##$CPDPRG3= <>
##$CPDPRG4= <mlev>
##$CPDPRG5= <mlev>
##$CPDPRG6= <mlev>
##$CPDPRG7= <mlev>
##$CPDPRG8= <mlev>
##$CPDPRGB= <>
##$CPDPRGT= <>
##$D= (0..31)
0 1.2 0 0 0 0 0 0 0 0.06 0 0.03 0 0 0 0 0.0002 0 0 0 0 0 0 0 0 0 0 0 0 
0 0 0 
##$DATE= 1681899144
##$DBL= (0..7)
120 120 120 120 120 120 120 120 
##$DBP= (0..7)
150 150 150 150 150 150 150 150 
##$DBP07= 0
##$DBPNAM0= <>
##$DBPNAM1= <>
##$DBPNAM2= <>
##$DBPNAM3= <>
##$DBPNAM4= <>
##$DBPNAM5= <>
##$DBPNAM6= <>
##$DBPNAM7= <>
##$DBPOAL= (0..7)
0.5 0.5 0.5 0.5 0.5 0.5 0.5 0.5 
##$DBPOFFS= (0..7)
0 0 0 0 0 0 0 0 
##$DE= 6
##$DECBNUC= <off>
##$DECIM= 32
##$DECNUC= <off>
##$DECSTAT= 4
##$DIGMOD= 1
##$DIGTYP= 9
##$DL= (0..7)
0 120 120 120 120 120 120 120 
##$DP= (0..7)
150 150 150 150 150 150 150 150 
##$DP07= 0
##$DPNAME0= <>
##$DPNAME1= <>
##$DPNAME2= <>
##$DPNAME3= <>
##$DPNAME4= <>
##$DPNAME5= <>
##$DPNAME6= <>
##$DPNAME7= <>
##$DPOAL= (0..7)
0.5 0.5 0.5 0.5 0.5 0.5 0.5 0.5 
##$DPOFFS= (0..7)
0 0 0 0 0 0 0 0 
##$DQDMODE= 0
##$DR= 18
##$DS= 0
##$DSLIST= <SSSSSSSSSSSSSSS>
$$ [...]
##$SUBNAM2= <"">
##$SUBNAM3= <"">
##$SUBNAM4= <"">
##$SUBNAM5= <"">
##$SUBNAM6= <"">
##$SUBNAM7= <"">
##$SUBNAM8= <"">
##$SUBNAM9= <"">
##$SW= 18.05172834244
##$SWIBOX= (0..15)
0 0 2 0 0 0 0 0 0 0 0 0 0 0 0 0 
##$SW_h= 3612.71676300578
##$TD= 16384
##$TD0= 1
##$TE= 0
##$TE2= 300
##$TE3= 300
##$TEG= 300
##$TL= (0..7)
0 120 120 120 120 120 120 120 
##$TP= (0..7)
150 150 150 150 150 150 150 150 
##$TP07= 0
##$TPNAME0= <>
##$TPNAME1= <>
##$TPNAME2= <>
##$TPNAME3= <>
##$TPNAME4= <>
##$TPNAME5= <>
##$TPNAME6= <>
##$TPNAME7= <>
##$TPOAL= (0..7)
0.5 0.5 0.5 0.5 0.5 0.5 0.5 0.5 
##$TPOFFS= (0..7)
0 0 0 0 0 0 0 0 
##$TUNHIN= 0
##$TUNHOUT= 0
##$TUNXOUT= 0
##$USERA1= <user>
##$USERA2= <user>
##$USERA3= <user>
##$USERA4= <user>
##$USERA5= <user>
##$V9= 5
##$VALIST= <valist>
##$VCLIST= <CCCCCCCCCCCCCCC>
##$VD= 0
##$VDLIST= <DDDDDDDDDDDDDDD>
##$VPLIST= <PPPPPPPPPPPPPPP>
##$VTLIST= <TTTTTTTTTTTTTTT>
##$WBST= 1024
##$WBSW= 4
##$XGAIN= (0..3)
0 0 0 0 
##$XL= 0
##$YL= 0
##$YMAX_a= 29509
##$YMIN_a= -23745
##$ZGOPTNS= <>
##$ZL1= 120
##$ZL2= 120
##$ZL3= 120
##$ZL4= 120
##$ABSF1= 10
##$ABSF2= 0
##$ABSG= 5
##$ABSL= 3
##$ALPHA= 0
##$AQORDER= 0
##$ASSFAC= 0
##$ASSFACI= 0
##$ASSFACX= 0
##$ASSWID= 0
##$AUNMP= <proc_1d>
##$AZFE= 0.1
##$AZFW= 0.1
##$BCFW= 1
##$BC_mod= 2
##$BYTORDP= 1
##$COROFFS= 0
##$CY= 11.3945322036743
##$DATMOD= 1
##$DC= 2
##$DFILT= <>
##$DTYPP= 0
##$F1P= 15.7292609196834
##$F2P= 12.9074282941183
##$FCOR= 0.5
##$FTSIZE= 0
##$FT_mod= 4
##$GAMMA= 1
##$GB= 0.15
##$INTBC= 1
##$INTSCL= 1
##$ISEN= 128
##$LB= 0.24
##$LEV0= 0
##$LPBIN= 0
##$MAXI= 10000
##$MC2= 0
##$MEAN= 0
##$ME_mod= 0
##$MI= 1.114404
##$NCOEF= 0
##$NC_proc= 0
##$NLEV= 6
##$NOISF1= 3.799351
##$NOISF2= 2.8
##$NSP= 1
##$NTH_PI= 0
##$NZP= 0
##$OFFSET= 15.70392
##$PC= 1
##$PHC0= -19747.1
##$PHC1= 17.60081
##$PH_mod= 1
##$PKNL= yes
##$PPARMOD= 0
##$PSCAL= 0
##$PSIGN= 0
##$REVERSE= no
##$SF= 200.130013532006
##$SI= 16384
##$SIGF1= 3
##$SIGF2= 2
##$SINO= 400
##$SIOLD= 16384
##$SREGLST= <1H.CDCl3>
##$SSB= 0
##$STSI= 0
##$STSR= 0
##$SW_p= 3612.71676300578
##$SYMM= 0
##$S_DEV= 0
##$TDeff= 0
##$TDoff= 0
##$TI= <>
##$TILT= no
##$TM1= 0
##$TM2= 0
##$TOPLEV= 0
##$USERP1= <user>
##$USERP2= <user>
##$USERP3= <user>
##$USERP4= <user>
##$USERP5= <user>
##$WDW= 1
##$XDIM= 8192
##$YMAX_p= 0
##$YMIN_p= 0
$$ End of Bruker specific parameters
$$ ---------------------------------
##NTUPLES= NMR FID
##VAR_NAME=  TIME,          FID/REAL,        FID/IMAG
##SYMBOL=    X,             R,               I
##VAR_TYPE=  INDEPENDENT,   DEPENDENT,       DEPENDENT
##VAR_FORM=  AFFN,          ASDF,            ASDF
##VAR_DIM=   8192,          8192,            8192
##UNITS=     SECONDS,       ARBITRARY UNITS, ARBITRARY UNITS
##FACTOR=    0.0002768,     1,               1
##FIRST=     0,             0,               0
##LAST=      2.2672688,     0,               0
##MIN=       0,             -23745,          0
##MAX=       2.2672688,     29509,           0
$$ Real data points
##PAGE= N=1
##DATA TABLE= (X++(R..R)), XYDATA
$$ plain form
0 0 0 0 0 0 0 0 0 0 0 0 0 0 0 0 0 0 0 0 0 0 0 0 0 0 0 0 -7 8 -8 8 -8 8 -8 8 -12 16 -16 16 -16 22 -24 24 -29 32 -32 38
46 38 -40 46 -52 55 -61 69 -76 84 -92 101 -114 126 -143 162 -184 214 -253 302 -375 486 -675 1058
68 1058 -2107 10515 29509 -13595 -14866 21436 10107 -14746 1615 6821 -8885 -2830 3236
81 3236 -10233 -3787 8766 -5751 -8577 13454 7384 -12344 3060 17301 -3546 -11568 6188
94 6188 5691 -8328 -4823 1672 -1980 -1698 1039 -779 1215 3477 136 1676 5187 -1036 -3892 3693
110 3693 2616 -6546 -4621 1931 154 -2724 -2314 -725 3532 3490 -2824 -614 6513 1117 -4416 2446
126 2446 2896 -4999 -1564 3526 -2811 -3524 2967 -62 -2419 3937 1525 -4486 2775 5817 -4374
141 -4374 -3668 5073 14 -4982 1818 935 -4839 1638 4279 -4867 -2488 6613 292 -5322 2959 3363
$$ packed form
0@%%%%%%%%%%%%%%%%%%%%%%%%%%pJ5j6J6j6J6j6J6k0K8l2L2l2L8m6M8n3O1o4P0
46C8p8Q6r8J07j16J30j45J60j76J93k15K40k69L05l46L98m67N55o77Q61j161J733
68A058l165J2622J8994m3104j271L6302j1329k4853J6361N206j5706O055O066
81C236j3469O446J2553j4517k826K2031o070j9728J5404J4241k0847q022J7756
94F188m97j4019L505O495l652K82K737j818J994K262l341J540L511o223k856P585
110C693j077r162J925O552j777k878M10J589M257m2o314K210P127n396n533O862
126B446M50p895L435N090o337p13O491l029k357O356k412o011P261L042j0191
141d374P06Q741n059m996O800q83n774O477K641r146K379R101o321n614Q281M04
$$ plain form
157 3363 -4140 180 4220 -2815 -2290 4503 79 -3713 2402 1659 -3660 878 2808 -3699 -1601 4033
173 4033 -1133 -3484 2916 1464 -3324 1600 3310 -2974 -1464 3602 -557 -3396 614 424 -1658
188 -1658 710 147 -1935 2028 3065 -2085 -496 4267 256 -2950 1678 1607 -3165 -1366 1334 -1485
204 -1485 -1854 583 -92 92 1771 -171 -528 2941 1130 -2849 362 2388 -2384 -2681 1464 -301
220 -301 -2684 487 1335 -689 749 1744 226 1390 1825 -1234 -345 2186 -1493 -3448 1087 854 -3493
237 -3493 -907 2518 -667 -1280 2288 1224 -763 1362 1032 -1297 212 427 -2365 -919 1130 -1885
253 -1885 -1841 2345 807 -2064 1707 3181 -956 -475 2537 104 -1631 532 -243 -1835 69 -194
269 -194 -1978 538 1521 -1642 -166 3207 -144 -2157 2155 1866 -2678 -977 1878 -1039 -1969 644
$$ packed form
157C363p503M320M040p035N25O793m424l792O115p43n319M538J930o507K098N634
173D033n166k351O400j452m788M924J710o284J510N066m159k839M010j90k082
188a658K368n63k082L963J037n150J589M763m011l206M628p1m772J799K700k819
204a485l69K437o75J84J679j942l57L469j811l979L211K026m772k97M145j765
220c01k383L171Q48k024J438R95j518J164M35l059Q89K531l679j955M535k33m347
237c493K586L425l185o13L568j064j987K125l30k329J509K15k792J446K049l015
253a885M4M186j538k871L771J474m137M81L012k433j735K163p75j592J904k63
269a94j784K516R83l163J476L373l351k013M312k89m544J701K855k917r30K613
$$ plain form
285 644 -58 -977 1029 522 -885 1451 1659 -1273 104 2261 -812 -1944 1316 573 -2369 -579 1180
302 1180 -666 -793 563 60 222 955 -417 -492 1351 100 -1643 398 945 -1463 -672 1324 -354
319 -354 -1035 1022 659 -517 739 638 -654 724 959 -1431 -552 1560 -672 -1840 978 710 -1638
336 -1638 70 1361 -933 -594 1419 -204 -1048 1007 229 -1400 564 878 -1566 -337 1700 -562
352 -562 -1209 1446 724 -1189 645 1192 -1013 -151 1321 -627 -1047 951 44 -1304 404 586 -1125
369 -1125 -29 1035 -658 -564 1054 -77 -922 660 322 -1034 181 699 -859 -267 919 -288 -454
386 -454 1001 153 -685 865 697 -1012 110 1076 -770 -811 940 -116 -1243 476 601 -1043 -56
403 -56 1013 -499 -541 965 4 -1000 542 541 -1088 -183 991 -415 -752 791 458 -656 183 763
$$ packed form
285F44p02r19K006n07j407K336K08k932J377K157l073j132L260p43k942J790J759
302A180j846j27J356n03J62P33j372p5J843j251j743K041N47k408P91J996j678
319c54o81K057l63j176J256j01j292J378K35k390Q79K112k232j168K818k68k348
336a638J708J291k294L39K013j623q44K055p78j629J964L14k444J229K037k262
352e62o47K655p22j913J834N47k205Q62J472j948m20J998r07j348J708J82j711
369a125J096J064j693R4J618j131q45J582l38j356J215N18j558N92J186j207j66
386d54J455q48q38J550j68j709J122R66j846m1J751j056j127J719J25j644R87
403e6J069j512m2J506r61j004J542jj629R05J174j406l37J543l33j114Q39N80
$$ plain form
421 763 -115 -148 409 86 -152 52 -142 -258 47 -116 -307 5 108 -86 -84 -34 59 197 -176 -300 390 236
443 236 -640 -84 734 -274 -685 598 515 -595 57 750 -207 -266 587 -75 -453 513 162 -791 260 691
463 691 -830 -541 960 -105 -1151 403 726 -832 -333 813 -199 -586 599 233 -620 401 624
480 624 -587 -102 857 -263 -704 664 427 -811 13 859 -236 -561 549 302 -527 52 347 -364
498 -364 -296 244 -229 -581 81 138 -480 -125 437 5 -212 400 382 -210 22 421 -52 -317 148 105 -338 -82
520 -82 250 -96 -149 394 282 -191 153 438 -138 -288 164 -117 -521 -86 10 -539 -202 388 -138 -300 541
541 541 439 -280 233 619 -219 -279 408 -47 -603 67 268 -430 -165 469 5 -241 414 336 -244 103 314
562 314 -279 -344 145 -195 -592 -47 138 -381 -132 437 94 -151 352 375 -85 98 278 -102 -163 149 -127
$$ packed form
421G63q78l3N57l23k38K04j94j16L05j63j91L12J03j94KN0R3J38l73j24O90j54
443B36q76N56Q18j008m11J283q3j110O52O93r57n9Q53o62l78R66l51r53J051M31
463F91j521K89J501j065j046J554L23j558M99J146j012l87J185l66q53J021K23
480F24j211M85R59j120m41J368k37j238Q24Q46j095l25J110k47q29N79K95p11
498c64O8N40m73l52O62N7o18L55N62m32k17O12j8n92K32L99m73k65M65m3m43K56
520h2L32l46n3N43j12m73L44K85n76j50M52k81m04M35R6n49L37N90n26j62Q41
541E41j02p19N13L86q38o0O87m55n56O70K01o98K65O34m64k46O55p8n80L47K11
562C14n93o5M89l40l97N45J85n19K49N69l43k45N03K3m60J83J80l80o1L12k76
$$ plain form
583 -127 -342 30 144 -234 -45 318 93 -113 171 164 -147 -80 49 -189 -299 -20 -79 -336 -124 178 -50 -148
605 -148 232 302 -11 89 337 61 -131 147 114 -218 -79 195 -80 -211 133 120 -152 42 175 -109 -71 171
627 171 -97 -304 80 51 -408 -212 264 -91 -351 134 278 -109 -41 248 72 13 187 4 -88 252 100 -329
649 -329 43 346 -135 -299 235 184 -255 -89 141 -130 -122 84 -105 -185 97 35 -246 -71 150 -54 -167 51
671 51 85 -60 57 112 -46 51 229 44 -106 147 219 -94 -154 101 120 -133 -163 7 33 -55 -117 -77 53 63 -121
696 -121 -130 80 134 -125 -167 71 96 -103 -82 70 83 35 36 5 87 172 39 -116 76 166 -107 -171 85 20 -196 -63
722 -63 9 -127 -55 83 -95 -133 138 74 -225 -37 197 -46 -171 75 108 -71 34 123 4 37 162 39 -61
745 -61 165 152 -150 -65 173 -23 -201 -24 72 -123 -110 17 -86 -89 20 -42 -118 38 65 -110 -71 142 30 -108
$$ packed form
583a27k15L72J14l78J89L63k25k06K84pl11O7J29k38j10K79n9k57K12L02k28r8
605a48L80P0l13J00K48k76j92K78l3l32J39K74k75j31L44j3k72J94J33k84L8K42
627A71k68k07L84k9m59J96M76l55k60M85J44l87O8K89j76n9J74j83r2L40j52m29
649c29L72L03m81j64N34n1m39J66K30k71QK06j89q0K82o2k81J75K21k04j13K18
671E1L4j45J17N5j58R7J78j85j50K53P2l13o0K55J9k53l0J70K6q8o2M0J30J0j84
696a21rK10N4k59m2K38K5j99K1J52J3m8Jl1Q2Q5j33j55J92R0k73o4K56o5k16J33
722f3P2j36P2J38j78l8K71o4k99J88K34k43j25K46L3j79J05Q9j19L3J25j23j00
745f1K26j3l02Q5K38j96j78J77R6j95J3J27j03lJ09o2p6J56K7j75L9K13j12j38
$$ plain form
769 -108 63 148 6 14 107 54 12 102 42 -21 82 76 -82 -43 97 -46 -183 26 46 -132 -104 21 -36 -78 -25 -45
795 -45 -57 46 -18 -102 47 120 -59 -51 121 108 -31 5 80 57 44 9 -23 45 96 -52 -111 59 45 -122 -106 24 -9
822 -9 -89 -52 -37 -25 49 -26 -95 14 145 -25 -118 98 168 -39 -64 111 100 -13 -9 45 47 42 25 -80 -55 102 28 -169
850 -169 -75 138 -29 -225 -41 123 -79 -177 38 38 -70 1 50 -76 45 175 -52 -95 178 169 -121 -27 220 53
874 53 -98 53 68 -43 6 22 -125 -23 67 -96 -185 31 83 -151 -135 47 9 -72 -42 -30 19 68 -15 -65 80 140
900 140 -12 -58 132 122 -6 -1 47 40 20 11 -60 6 41 -39 -96 -1 25 -73 -85 -19 -10 -69 -71 -16 -6 -17 -37 -21 22 14 8 35
932 35 45 31 34 37 15 41 60 5 23 37 -2 -14 11 5 -43 -40 -5 -53 -69 -31 -32 -73 -55 -17 -12 -8 -4 -28 18 46 24 -23 19 71 46
967 46 0 20 49 44 -7 -23 18 29 -22 -86 -28 20 -32 -72 -44 -5 -20 -54 -63 6 23 -19 -52 17 47 12 -26 28 69 55 11 17
$$ packed form
769a08J71Q5j42QR3n3m2R0o0o3J03oj58L9J40j43j37K09K0j78K8J25n7m2N3k0
795d5j2J03o4q4J49P3j79QJ72j3j39L6P5k3j3l5l2O8N1j48n9J70j4j67J6J30l3
822iq0L7J5J2P4p5o9J09J31j70r3K16P0k07k5J75j1j13MN4Knj7j05K5J57p4j97
850a69R4K13j67j96J84J64k02r8K15%j08P1M9j26J21J30k27m3K73rk90R4K47j67
874E3j51J51J5j11M9J6j47J02R0j63q9K16N2k34J6J82l8q1L0J2M9M9q3n0J45O0
900A40j52m6J90j0j28NM8pk0rp1O6L5q0n7R5K6r8j2O6Rn9kN5J0j1k0J6M3qoK7
932C5J0j4LLk2K6J9n5J8J4l9j2K5om8LL5m8j6L8jm1J8L8NMMk4M6K8k2m7M2N2k5
967D6m6K0K9nn1j6M1J1n1o4N8M8n2m0K8L9j5l4rO9J7m2l3O9L0l5l8N4M1j4m4O
$$ plain form
999 17 58 63 11 -15 44 63 8 -58 -19 20 -12 -63 -64 7 -28 -68 -77 -26 -30 -9 -50 -64 5 53 -16 -40 25 101 -3 -29 73 89
1031 89 17 -9 46 46 44 35 -39 -6 88 8 -110 -24 73 -45 -153 -17 53 -84 -91 -7 -2 -54 -18 -31 -7 27 32 -40 3 91 26
1062 26 -24 52 96 24 -23 54 64 25 -13 27 -4 -9 5 -20 -36 -21 -7 -42 -75 -41 -2 -28 -74 -26 35 -10 -45 0 29 1 5
1093 5 -4 10 33 46 -10 -5 93 44 -45 20 76 -17 -74 32 43 -54 -64 2 -26 -50 -30 -22 -12 13 -11 -47 3 54 -20 -24 41 56
1125 56 -23 3 73 44 -25 34 54 28 -6 20 30 -28 -27 -18 -24 -29 -52 -33 -27 -42 -25 -31 -16 -13 -15 -24 -31 6 7 -12 17 42 10 0 69 60
1161 60 -9 21 84 19 -13 24 27 -30 -26 9 -33 -34 -19 -30 -38 -44 -32 -39 -34 -18 -22 -50 -27 6 -15 -43 24 49 -7 10 70 55 -11 32
1195 32 45 25 2 8 4 -4 -2 -16 -37 5 15 -37 -19 3 -14 -54 -41 -21 -67 -81 -28 -11 -24 -39 8 30 36 35 23 33 42 11 -3 -2
1229 -2 6 -14 -18 -5 4 -5 -23 44 31 5 -8 15 7 -47 -59 -38 -48 -75 -50 -14 13 2 3 46 82 58 34 56 69 5 -32 -8 -11 -67
$$ packed form
999A7M1Nn2k6N9J9n5o6L9L9l2n1jP1l5m0rN1mK1m1j4O9M8o9k4O5P6j04k6J02J6
1031H9p2k6N5%krp4L3R4q0j18Q6R7j18j08J36P0j37pQ4Nn2L6j3K4L4Np2M3Q8o5
1062B6n0P6M4p2m7P7J0l9l8M0l1nJ4k5j6J5J4l5l3L4L9k6m6M8O1m5l5M5K9k8M
1093ErJ4K3J3n6NR8m9q9O5N6r3n7J06J1r7j0O6k8k4K0QJ0K5k4l6N0N1p4mO5J5
1125E6p9K6P0k9o9N9K0k6l4K6J0n8JRonk3J9Oj5J7oJ5LkrpL7Jj9K9K5l2j0O9r
1161F0o9L0O3o5l2L7Ln7ML5m2jJ5j1qoJ2pNJ6mk8K3L3k1k8O7K5n6J7O0j5o6M3
1195C2J3k0k3OmqKj4k1M2J0n2J8K2j7m0J3K0m6j4N3J7j3j5M7K2Ojj2J0Rl1j4J
1229bQk0mJ3Rrj8O7j3k6j3K3qn4j2K1j0k7K5L6K7j1JM3L6k4k4K2J3o4l7K4ln6
$$ plain form
1263 -67 -51 -5 7 -10 -6 16 54 34 -46 8 20 -32 -92 -49 -22 -90 -92 -7 24 -17 16 75 91 63 49 52 89 37 -14 -9 35 -23
1295 -23 -85 -13 41 -26 -54 3 64 3 -40 -3 5 -48 -82 -81 -26 -47 -96 -33 35 9 -49 29 104 31 -25 49 94 10 -13 -4 52 28
1327 28 -30 -41 60 49 -40 -2 76 9 -81 -43 33 -45 -104 -50 31 -8 -87 -36 89 33 -58 -23 64 54 -77 -59 27 40 -39
1356 -39 -36 66 75 1 3 89 71 -39 -55 56 13 -122 -94 10 -4 -93 -28 35 46 21 32 50 57 30 -10 -28 -2 -44 -96 -18
1386 -18 23 -58 -23 126 100 -18 47 137 75 -68 -37 -2 -44 -126 -140 -79 -11 -65 -86 54 103 28 0 145 131 -25 -56
1413 -56 34 29 -70 -130 -46 54 -1 -76 47 184 107 13 81 121 9 -48 -32 -77 -144 -110 -90 -114 -99 -45 6 52 41 20 70
1442 70 101 12 -44 17 14 -112 -96 18 9 -81 -2 133 112 -11 48 165 133 -34 -81 31 68 -137 -205 -39 48 -85
1468 -85 -149 -2 101 26 -53 11 101 48 -65 -75 40 -7 -138 -43 70 -12 -70 39 117 76 7 39 50 23 1 -22 -38
$$ packed form
1263f7J6M6J2j7MK2L8k0q0N4J2n2o0M3K7o8kQ5L1m1L3N9J6k8j4LL7n2n1NM4n8
1295b3o2P2N4o7k8N7O1o1m3L7Qn3l4JN5k1m9O3O8k6n8P8P5p3n6P4M5q4k3RN6k4
1327B8n8j1J01j1q9L8P8o7r0L8P6p8n9N4Q1l9p9N1J25n6r1L5Q7j0j31J8Q6J3p9
1356c9LJ02Rp4KQ6j8j10j6J11m3j35K8J04j4q9O5O3J1k5J1J8Pk7m0j8K6m2n2P8
1386a8M1q1L5J49k6j18O5R0o2j43L1L5m2q2j4O1O8n4k1J40M9p5k8J45j4j56l1
1413e6R0nr9o0Q4J00n5p5J23J37p7r4O8M0j12n7J6m5o7L4K0k4J5N4N1M6j1k1N0
1442G0L1q9n6O1lj26J6J14rr0P9J35k1j23N9J17l2j67m7J12L7k05o8J66Q7j33
1468h5o4J47J03p5p9O4R0n3j13j0J15m7j31R5J13q2n8J09P8m1o9L2J1k7k2k3j6
$$ plain form
1495 -38 -19 -40 -33 -40 -58 -39 11 40 -50 -59 62 69 -54 -67 49 62 -56 -85 8 85 0 -62 30 101 14 -83 11 83 1 -84
1525 -84 -24 57 4 -107 -37 45 29 -83 -79 36 50 -69 -88 15 62 -6 -51 21 73 47 -8 43 68 30 5 9 35 -15 -40
1554 -40 -10 -26 -32 -26 -5 -14 -7 -8 -18 1 -14 -19 -40 -29 -50 -65 -38 -4 -56 -50 47 51 -12 24 103 73 11 1 53 33 -4 -38 -32 17 -17
1589 -17 -61 -28 37 14 -37 10 30 -9 -55 -26 -8 -44 -92 -32 -22 -28 -31 -10 22 14 13 22 46 48 14 15 24 -23 -27 -16 -5 -24 -28 5 25
1624 25 9 7 31 28 5 -21 -17 5 -25 -32 -45 -10 -9 -67 -25 48 35 -9 31 51 24 20 22 16 -31 -17 -12 -33 -23 -4 -24 -23 35 19 -31
1659 -31 28 49 -11 -40 17 -12 -81 -24 5 -49 -34 21 19 11 38 47 30 41 59 1 -5 31 -27 -78 -12 5 -54 -65 1 17 -30 -15
1691 -15 27 10 -15 -4 -30 -29 -26 -64 -47 -8 -24 -34 10 60 43 14 51 101 61 24 -1 48 11 -55 -53 -10 -29 -61 -7 15 9 9 20
1724 20 36 27 -15 -29 -23 -18 -88 -78 -29 -53 -70 -41 39 44 29 52 67 71 49 25 16 19 -22 -60 -31 -4 -55 -33 35 46 -17 22 69 25
$$ packed form
1495c8J9k1Ppj8J9N0K9r0rJ21Pj23j3J16J3j18k9R3P7q5o2R2P1q7r7R4P2q2q5
1525h4O0Q1n3j11P0Q2j6j12MJ15J4j19j9J03M7o8m5P2N2k6n5N1K5l8k5MK6n0k5
1554d0L0j6oOK1rPjj0J9j5nk1J1k1j5K7L4n2OR7Mo3L6P9l0o2j0N2k0l7l4OM9l4
1589a7m4L3O5k3n1M7K0l9m6K9J8l6m8O0J0olK1L2qjRK4Kl4JRm7mJ1J1j9mL3K0
1624B5j6kK4lk3k6MK2l0pj3L5Jn8M2P3j3m4M0K0k7mKom7J4Nk1J0J9k0JN8j6n0
1659c1N9K1o0k9N7k9o9N7K9n4J5N5kqK7Rj7J1J8n8oL6n8n1O6J7n9j1O6J6m7J5
1691a5M2j7k5J1k6JLl8J7L9j6j0M4N0j7k9L7N0m0l7k5M9l7o6KM3j9l2N4K2o%J1
1724B0J6rm2j4ONp0J0M9k4j7K9Q0Nj5K3J5Mk2k4rLm1l8K9K7n1K2O8J1o3L9M7m4
$$ plain form
1758 25 3 4 19 -31 -39 -65 -80 -30 -33 -76 -9 75 8 10 92 82 14 20 45 0 -28 -25 -45 -33 -5 -42 -47 41 48 -40 9 115 28 -63
1792 -63 18 42 -18 -48 -18 -6 -56 -26 1 2 48 22 13 50 63 31 -7 42 44 -43 -23 14 -31 -63 -9 2 -18 -15 -7 21 5 -15 -3
1825 -3 28 -3 -7 -2 8 -5 -11 0 22 23 -8 0 30 59 3 10 70 43 -15 17 60 0 -38 -18 -5 -34 -50 -47 -48 -49 -47 -48 6 36 -12 -18 45
1862 45 33 -14 -24 9 -13 -26 -19 -13 -27 -23 3 43 55 39 21 67 62 10 6 7 -9 -68 -58 -15 -53 -81 -24 9 -14 22 28 37 41 21 7
1897 7 12 13 -33 -72 -17 -7 -70 -34 29 32 -11 32 88 37 6 41 25 -6 -45 -34 -65 -58 -50 -67 -31 31 1 7 78 92 23 22 55 19
1931 19 -42 -47 -26 -39 -49 -40 -19 -3 24 20 26 46 51 3 3 -6 -41 -81 -43 -43 -89 -76 -17 -19 -24 17 40 30 33 75 35 22 38 5 -27 4
1967 4 13 -33 -5 46 7 -30 48 64 -10 11 74 -11 -48 4 -17 -83 -41 -7 -67 -48 1 -31 -39 39 30 -29 28 84 -3 -27 82 40
1999 40 -52 11 45 -33 -35 55 20 -25 21 45 -21 16 63 -9 -16 22 -6 -75 -1 2 -63 -72 15 -14 -83 14 45 -25 -17 56 17 -20 30
$$ packed form
1758B5k2JJ5n0qk6j5N0lm3O7Q4o7KQ2j0o8OK5m5k8Lk0J2K8l7nQ8Pq8M9J06q7r1
1792f3Q1K4o0l0L0J2n0L0K7JM6k6rL7J3l2l8M9Kq7K0L7m5l2N4J1k0LQK8j6k0J2
1825cL1l1mNJ0j3oJ1K2Jl1QL0K9n6PO0k7n8L2M3o0l8K0J3k9j6LjjKjN4L0m8oO3
1862D5j2m7j0L3k2j3POj4MK6M0J2j6j8M6nn2mJj6n9J0M3l8k8N7L3k3L6ORMk0j4
1897GNJm6l9N5J0o3L6O3Lm3M3N6n1l1L5j6l1l9J1l1PQj7L6O2l0OP1J4o9jL3l6
1931A9o1nK1j3j0RK1J6K7mOK0Nm8%rl5m0L8%m6J3N9knM1K3j0LM2m0j3J6l3l2L1
1967DRm6K8N1l9l7P8J6p4K1O3q5l7N2k1o6M2L4o0J9M9l2qP8rn9N7N6q7k4J09m2
1999D0r2O3L4p8kR0l5m5M6K4o6L7M7p2pL8k8o9P4Lo5rQ7k9o9R7L1p0QP3l9l7N0
$$ plain form
2032 30 22 -28 -17 13 -35 -29 2 -8 -31 32 36 -26 -20 64 34 -52 32 47 -41 -45 31 -11 -54 -4 20 -36 7 36 -7 8 60 24 -18
2065 -18 47 51 -55 -11 45 -25 -80 -7 36 -46 -27 36 -6 -40 40 10 -32 20 12 -59 -10 32 -34 -47 38 21 -44 23 70 5 -3
2096 -3 87 52 -11 24 41 -17 -1 29 -27 -33 12 -30 -53 27 13 -56 -33 29 -13 -27 5 1 -22 -16 20 -11 -15 29 13 -2 49 34 -8
2129 -8 56 63 3 2 54 6 -44 2 16 -16 -31 9 10 -32 -6 16 -27 -27 3 4 -33 5 -6 -31 -21 17 -24 -25 23 24 -39 1 62 -3
2163 -3 -26 42 55 -28 -11 43 -6 -23 24 25 -37 -6 7 -32 3 38 2 -43 18 17 -39 -7 50 -20 -47 51 25 -30 13 39 12 -30
2195 -30 30 27 -8 -13 -1 -7 19 -6 -36 -10 16 -21 -49 10 13 -39 -23 21 10 -23 -8 22 7 1 -7 14 30 12 4 33 20 -7 1 13
2229 13 27 -18 1 4 1 -11 -19 -19 3 -19 -26 -19 -12 -27 -24 7 4 -10 -10 7 4 -10 0 5 25 6 -8 24 25 2 -9 20 27 -3 13 32 1
2266 1 -9 -9 -9 -23 -10 -18 -28 -1 6 -49 -24 34 6 -53 -16 14 -15 -13 -2 -3 -9 11 -4 3 36 12 9 15 40 1 -8 34 5 -29 -17 19
$$ packed form
2032C0qn0J1L0m8OL1j0k3O3Mo2OQ4l0q6Q4J5q8mP6m2m3N0K4n6M3K9m3J5N2l6m2
2065a8O5Mj06M4N6p0n5P3M3q2J9O3m2l4Q0l0m2N2qp1M9M2o6j3Q5j7o5O7M7o5q
2096cR0l5o3L5J7n8J6L0n6oM5m2k3Q0j4o9K3O2m2j4L2mk3OL6l1mM4j6j5N1j5m2
2129hO4Po0jN2m8n0M6J4l2j5M0Jm2K6K2m3%L0Jl7L8j1k5J0L8m1jM8Jo3M0O1o5
2163ck3O8J3q3J7N4m9j7M7Jo2L1J3l9L5L5l6m5O1jn6L2N7p0k7R8k6n5M3K6k7m2
2195c0O0ll5nJ2oK6k5l0K6K6l7k8N9Ln2J6M4j1l3J5L0j5oqK1J6j8qK9j3k7QJ2
2229A3J4m5J9Llj2q%K2k2pPPj5LL1lj4%J7lj4J0NK0j9j4L2Jk3j1K9Pl0J6J9l1
2266Aj0%%j4J3qj0K7Pn5K5N8k8n9L7L0k9KJ1joK0j5PL3k4lOK5l9rM2k9l4J2L6
$$ plain form
2302 19 32 -6 -9 6 1 -18 -8 -3 -12 -6 -19 2 18 9 -8 3 8 -4 -9 19 27 -10 -5 29 22 -21 -17 28 4 -12 18 24 -9 -8 2 -5 -17 7
2340 7 -5 2 19 -10 -10 7 31 -4 -29 19 32 -7 15 12 -21 -3 13 8 -4 16 4 -17 15 -17 -23 2 12 -15 -2 5 -30 -21 -14 4 -14
2375 -14 -14 8 2 -6 22 1 -6 23 8 -6 35 34 -4 28 18 -3 9 45 34 -22 5 20 -41 -25 24 -15 -33 2 -3 -27 -20 1 -29 -16
2409 -16 -9 2 -18 10 9 -13 3 16 22 -6 8 23 6 11 34 12 -11 16 14 3 22 18 -4 -24 3 7 -3 -20 20 8 -16 2 10 -13
2443 -13 -1 14 0 -11 -8 13 0 -15 23 8 -40 8 20 -20 -6 22 -6 -6 25 1 -12 19 16 -8 -2 12 -10 7 8 2 -10 15 25
2476 25 2 18 7 5 2 -4 7 -20 2 10 6 10 13 -8 -15 -9 -37 -2 22 8 -11 -22 -4 -20 -15 2 -7 -28 -9 14 -7 -4 12 23 -15 13
2512 13 28 10 14 6 15 26 37 -1 -7 4 12 -2 -2 2 2 -10 -11 5 -24 -23 -22 -17 -14 -6 -14 -18 -31 6 2 -13 -7 7 14 2 23 3 22 16 29 13
2552 13 1 18 22 1 17 9 -16 10 16 4 -10 1 10 -10 -7 7 4 -21 -22 -4 -5 -11 -6 -1 -16 -13 7 7 -6 17 20 1 -11 -1 11 -9 5
$$ packed form
2302A9J3l8lJ5nj9J0NrOj3K1J6rj7J1Nj2nK8Ql7NL4pm3MM5k4j6L0Ol3JJ0pj2K4
2340Gj2PJ7k9%J7K4l5k5M8J3l9K2ll3J8J6nj2K0j2k1L2l2oK5J0k7J3Pl5RPJ8j8
2375a4%K2oqK8k1pK9j5j4M1jl8L2j0k1J2L6j1n6K7J5o1J6M9l9j8L5nk4PK1l0J3
2409a6PJ1k0K8jk2J6J3Ok8J4J5j7NK3k2k3K7kj1J9mk2k0K7Mj0j7M0j2k4J8Qk3
2443a3J2J5j4j1LK1j3j5L8j5m8M8J2m0J4K8k8%L1k4j3L1lk4OJ4k2J7Joj2K5J0
2476B5k3J6j1kloJ1k7K2QmMLk1pOk8L5K4j4j9j1J8j6NJ7rk1J9K3k1LJ6J1l8K8
2512A3J5j8MqRJ1J1l8oJ1Qj4%M%j2jJ6k9JJNLQqmj3L7mj5OJ4Pj2K1k0J9oJ3j6
2552A3j2J7Mk1J6qk5K6Oj2j4J1Rk0LJ4lk5jJ8joNNj5LK0%j3K3Lj9j2J0J2k0J4
$$ plain form
2589 5 -11 -13 -7 16 3 -5 14 1 -5 -14 -5 -13 -13 -7 13 -6 11 -7 0 -1 20 -10 -25 30 -2 -3 2 7 -11 -6 15 -5 -4 -5 6 -2 -3 -14 -10 -19 -6
2630 -6 2 -3 12 -3 5 17 -11 13 14 1 -1 16 17 -6 8 27 4 0 27 15 0 3 4 -9 -1 0 -9 -8 0 -7 -33 -10 -14 -15 -31 4 -8 -24 -6
2669 -6 -10 -5 6 0 0 11 24 7 -12 16 18 22 11 24 18 5 8 13 10 12 11 15 5 -2 -4 -20 -9 -19 5 -3 -23 -7 -5 -6 -12 -7 7 -3 12 10 17 21
2711 21 43 1 8 26 3 9 6 12 16 11 18 -1 3 -4 -24 2 3 -1 -7 -8 -4 4 0 4 5 3 -3 19 15 5 23 2 -4 -6 4 -9 -2 -4 13 -10 -7 -12 5 -8
2755 -8 4 -4 -4 -10 -7 2 -3 2 1 5 2 2 19 -5 1 18 13 -3 11 16 15 7 5 2 -6 1 -8 -21 -8 0 -12 -12 -8 -10 -29 -15 -7 -14 -27 0 2 9 -5 -1 -7 -17
2801 -17 18 7 15 4 -10 13 30 6 7 20 30 2 12 21 11 16 3 18 5 1 7 -8 -11 -17 -13 -9 -28 -21 -12 2 -19 -3 6 -6 2 -2 2 -2 11
2840 11 9 0 24 33 18 5 21 14 -16 10 17 15 -3 9 2 9 12 12 -8 -1 7 -7 0 15 12 -6 11 16 11 -2 -1 7 -21 -16 5 4 -6 -26 26 -2
2880 -2 -28 3 19 6 -10 -1 -14 -2 -3 5 -3 12 3 18 6 24 -8 3 6 17 10 -11 20 14 -1 -6 7 13 2 -12 7 5 1 -12 -5 -17 -2
$$ packed form
2589Ej6kOK3j3qJ9j3orRq%OK0j9J7j8PjK1l0j5N5l2jNNj8NK1k0JjJ1qjj1MrJ3
2630fQnJ5j5QJ2k8K4Jj3kJ7Jk3J4J9k3mK7j2j5LJj3QJrJQpk6K3mjj6L5j2j6J8
2669fmNJ1o%J1J3j7j9K8KMj1J3oj3LNlKjMj0pkj6J1j0K4qk0J6KjoNJ4j0J5kPM
2711B1K2m2PJ8k3OlOMnPj9Mpk0K6JmojMQmMJkoK2mj0J8k1okJ0j3PkJ7k3LnJ7j3
2755hJ2q%oLRnNjMl%J7k4OJ7nj6J4NjqklqPrj3J3Qj2%Mkj9J4Qpj3K7KPj4Moj0
2801a7L5j1Qj1j4K3J7k4JJ3J0k8J0Rj0Nj3J5j3mOj5loMMj9PRJ4k1J6Rj2QmMmJ3
2840A1krK4Rj5j3J6pl0K6Pkj8J2pPL%k0PQj4PJ5lj8J7Nnj3JQk8NK1jj0k0N2k8
2880bk6L1J6j3j6Rj3J2jQqJ5rJ5j2J8l2J1LJ1pk1L1oj5nJ3Oj1j4J9kmj3Pj2J5
$$ plain form
2917 -2 -15 10 -1 -24 -8 1 -4 -5 -1 2 16 11 -6 20 16 15 2 16 43 15 18 15 13 23 10 25 16 2 4 6 -5 5 -1 -25 -4 -2 -11 2 19
2956 19 -18 -13 5 12 -4 -7 1 1 1 -16 15 17 5 -4 6 26 20 -1 -3 17 -9 5 20 19 11 4 17 20 2 -4 12 12 -3 -13 14 17 -11 -18 -4
2995 -4 -8 -11 -10 6 0 -3 19 8 -17 -9 7 -10 1 7 1 -7 9 10 -4 8 -6 -2 -1 0 14 8 6 6 3 3 6 15 -4 -5 3 5 8 2 -9 2 2 10 -20 -1
3039 -1 -19 -6 -1 6 -7 -8 -17 -18 2 -8 -9 -8 -10 17 6 21 27 -1 14 37 5 8 1 11 -1 13 -2 15 6 16 13 9 6 -4 -18 -4 -6 -26 3
3078 3 -6 6 -1 2 -20 -14 2 -3 -6 -9 2 -11 -15 2 -16 7 11 2 15 17 0 12 10 30 12 -10 18 -2 4 6 8 15 -7 11 -1 0 -1 -15 -6 10
3118 10 -4 -22 -5 -6 -19 -26 -20 -6 -2 -8 -20 7 8 1 -6 11 0 -13 -9 -3 -6 -12 6 0 3 8 6 20 26 -9 -6 14 11 -1 -12 -9 -20 -6 -2 4 16
3159 16 -3 20 6 9 22 -12 17 11 -16 -19 -1 -2 -32 -11 4 -6 -14 9 16 3 -5 -10 6 -8 -3 -14 -4 12 -6 0 17 26 4 8 15 24 3
3196 3 5 6 14 -16 -19 -26 -14 2 -19 -4 -5 -4 -8 1 -16 -31 -32 -13 -16 -17 -26 -7 3 -7 -5 18 28 19 5 -4 13 -1 5 14 6 1 -15 12 21 7 7 17
$$ packed form
2917bj3K5j1k3J6RnjMLJ4nj7K6mjj3J4K7k8LlkJ0j3J5rj4KKj1J0ok4K1KrJ3J7
2956A9l7NJ8Pj6lQ%%j7L1Kj2rJ0K0ok1kK0k6J4J5jqpJ3Lj8oJ6%j5j0K7Lk8pJ4
2995dmlJJ6olK2j1k5QJ6j7J1OoqJ6Jj4J2j4MJJJ4ok%l%LRj9jQKLoj1J1%Ql0J9
3039aj8J3NPj3jrjK0j0jJkK7j1J5Ok8J5K3l2LpJ0j2J4j5J7rJ0lmlj0j4J4kk0K9
3078CrJ2pLk2OJ6nllJ1j3mJ7j8K3MrJ3Kj7J2kK0j8k2K8k0OKKPk2J8j2Jjj4RJ6
3118A0j4j8J7jj3pOJ4Moj2K7JppJ7j1j3MOloJ8oLNkJ4Ol5LK0lj2j1Lj1J4MOJ2
3159A6j9K3j4LJ3l4K9ok7lJ8jl0K1J5j0qK3Pj3qnJ6j4Nj1J0J6j8OJ7Rk2MPRk1
3196CKJQl0lpJ2J6k1J5jJmRj7j5jJ9ljrJ9J0j0KK3J0rj4rJ7j4ORqnj6K7Rj4%J0
$$ plain form
3238 17 31 2 11 5 -1 -9 -29 2 -21 -28 -17 2 -2 -16 -11 -5 -3 6 -5 11 -5 -22 -10 7 21 -13 -10 23 15 2 18 28 18 6 10 14 0
3275 0 7 -4 9 3 -8 1 3 0 15 -7 21 -3 -17 -9 -5 -24 -7 -13 -7 -18 -11 -29 -14 8 14 -5 -2 8 -3 -15 -14 0 -22 -18 -14 5 -4 11 26
3314 26 9 17 12 15 5 3 -14 9 4 -5 -9 10 8 6 1 15 27 15 1 -6 -1 -7 -8 -13 -3 -21 -15 -11 -19 -13 -4 -4 -19 17 1 9 5 12 6 3 3 16 11 -3
3358 -3 15 17 5 14 8 8 -5 1 -3 14 -7 -9 -13 -7 -13 -15 15 2 -13 -4 -4 -12 -10 1 6 -14 -9 -8 1 5 -9 -8 27 27 6 -3 10 12 14 6 -1 5 -8 0 -10
3403 -10 9 5 5 2 26 8 -2 10 8 1 -9 -8 -1 -3 -11 -3 -3 11 0 9 12 1 8 17 -2 -5 -6 -7 -2 -23 -1 -7 12 5 5 0 -2 20 7 18 21 7 -12
3446 -12 26 13 1 -8 4 2 16 5 21 -4 2 5 -1 -1 6 -6 -16 4 -8 -23 -16 0 -19 -6 -8 3 1 4 -5 -5 1 -16 -4 9 27 1 0 16
3484 16 18 9 17 18 31 -6 19 13 22 10 -3 6 -15 -5 -25 -21 0 -20 -3 8 -8 -5 -17 -13 -12 2 -10 -12 -10 0 -20 6 8 -2 11 5 -4 19
3522 19 -6 -4 4 -18 7 10 2 16 2 8 -8 -8 -12 3 -8 -15 -17 16 -2 -15 -2 4 -15 -16 -26 -6 10 -9 -16 -14 -1 4 3 3 -8 -2 10 -12 -6
$$ packed form
3238A7J4k9Rooqk0L1k3pJ1J9mj4NOKRj1J6j6j7J2J7J4l4LL3qj3J6J0j0j2MMj4
3275@Pj1J3oj1RKlJ5k2K8k4j4QMj9J7oOj1Pj8J5K2Oj9LJ0j1j2JJ4k2MMJ9rJ5J5
3314B6j7QnLj0kj7K3nrmJ9kknJ4J2j2j4pNojnJ0j8OMqOR%j5L6j6QmPol%J3nj4
3358cJ8Kj2Ro%j3OmJ7k1kmOokL0j3j5R%qKJ1Nk0NJRMj4JL5%k1rJ3KKqpOj3Qj0
3403a0J9m%lK4j8j0J2kpj0JPkqQ%J4j1RLj1PRj9ljjNk1K2oJ9p%nkK2j3J1Lj4j9
3446a2L8j3j2rJ2kJ4j1J6k5OLo%Pj2j0K0j2j5PJ6j9J3kJ1kLr%Oj7J2J3J8k6jJ6
3484A6KrQJJ3l7K5oRj2j3Rk1J0k0MK1k0J7J1j6Lj2MJJ4j2kKJ0k0K6Kj0J3orK3
3522A9k5KQk2K5LqJ4j4Oj6%mJ5j1pkL3j8j3J3Oj9jj0K0J6j9pKJ3Nj%j1OJ2k2O
$$ plain form
3561 -6 -12 6 2 -8 1 13 1 31 10 0 1 5 1 -23 1 -4 7 -3 12 -2 -6 0 -6 5 5 6 6 -9 -6 3 -12 -11 -11 -6 -5 -18 -24 -9 -13 -11 -10 -1 1
3604 1 -7 -3 13 15 -9 13 1 -4 19 14 15 19 22 11 19 11 1 0 -3 3 -3 5 -2 4 -14 -14 -14 -7 -12 -14 -22 5 -7 -25 -5 -12 4 -12 10 -1 8 -6 -6 13
3648 13 2 9 1 7 1 -8 -3 2 15 3 4 2 -11 -6 9 14 10 -17 -28 -19 -4 -6 -13 -1 -4 -31 -3 -2 0 -16 -21 16 7 4 14 -12 -2 1 -16 -1 0 13
3690 13 20 8 -2 5 24 17 17 8 20 17 -9 -5 7 6 19 1 -10 -10 9 14 -3 -8 -7 -19 -20 -7 -7 -11 2 -12 -5 5 -2 -15 -10 1 -17 -5 8
3729 8 -15 1 13 4 -9 5 3 17 5 20 9 9 7 14 1 2 9 -27 6 8 0 6 14 -7 14 11 -5 -15 -3 -27 -8 -8 -6 -19 -17 2 -19 -22 -6
3768 -6 3 -17 9 -6 -6 -14 17 0 3 9 -12 7 21 19 10 22 -5 19 8 16 10 16 5 8 -6 -10 10 -12 5 -1 -26 -14 -8 0 -2 -6 9 -12 2
3807 2 2 -1 0 -17 -12 -15 -9 0 2 1 -18 -18 -3 10 -2 -1 7 0 17 5 4 20 4 -4 -1 14 -8 17 -6 -4 -1 -15 -5 -16 -15 -19 -3 5 0 6 -11 -9 -15
3850 -15 -4 -27 -10 -6 -3 -13 -19 -2 -7 -6 -7 4 2 2 -1 -1 6 -5 -3 6 16 2 7 -2 -5 16 3 -3 3 5 -2 -14 -6 -3 -24 -17 -15 -9 -22 -25 -1 7 -13 -6
$$ packed form
3561foJ8mj0RJ2j2L0k1j0JMmk4K4nJ1j0J5j4mOoJ1%J%j5LRj5J%NJj3oJ5mKJRK
3604AqMJ6Kk4K2j2nK3nJMLj1Qqj0jlOoQpOj8%%PnkqK7j2j8K0pJ6j6K2j1Rj4%J9
3648A3j1PqOorNNJ3j2Jkj3NJ5Nmk7j1RJ5kpJ2lk7K8JKj6nL7rlJ0k6J0Lj7J5JJ3
3690A3Pj2j0PJ9p%rJ2lk6MJ2jJ3j8j1%J9Nj7nJj2jJ3%mJ3j4PJ0pj3NJ1j8J2J3
3729Hk3J6J2rj3J4kJ4j2J5j1%kPj3JPl6L3KqOQk1K1lj6j0J2k4J9%Kj3KJ9k1lJ6
3768fRk0K6j5%qL1j7LOk1J9J4krJ2k7K4j1QoOj1Lj4mK0k2J7ok5J2OQkmJ5k1J4
3807B%lJj7NlORKjj9%J5J3j2JQpJ7j2jJ6j6qLJ5k2K5k3KLj4J0j1JmJ6QnOj7Ko
3850a5J1k3J7MLj0oJ7nJjJ1k%l%Pj1KRJ0j4NrlK1j3oOKpj2QLk1PKOj3lK4Qk0P
$$ plain form
3894 -6 -29 5 -9 6 -4 4 -1 -3 2 0 6 -7 -1 -3 -12 -5 9 -2 4 10 -3 -3 0 10 1 -2 5 -16 2 -5 -7 -10 -11 -19 -7 1 -8 -24 -3 -9 -13 -10 15 1
3938 1 9 6 -4 -5 -7 5 6 -4 11 7 2 21 27 3 17 15 8 -1 7 1 8 5 8 -13 -12 1 9 -5 5 5 11 -5 -9 1 -1 -17 -6 -1 -4 -21 -9 9 12
3981 12 -4 -5 7 -1 14 -4 7 -3 10 -4 6 16 12 2 -4 4 -3 24 22 -3 5 26 9 2 5 8 -4 2 2 -5 -12 -9 0 -9 -7 -17 -17 -18 -1 -14 -2
4022 -2 0 -15 -3 14 -6 -4 -17 19 -13 -10 3 2 8 18 6 12 30 11 20 -4 2 6 3 13 6 -1 -6 -5 -29 -8 -7 -14 -12 -4 -18 -32 -21 -23 7 -34
4062 -34 -2 7 4 -3 -4 -6 14 -3 -4 1 12 20 9 21 11 -1 -10 -1 -1 -6 5 7 5 0 -6 2 -14 -4 -9 -6 -6 -8 -3 -27 3 -1 2 -14 -7 -15 -3 3 -11 -4
4106 -4 1 2 12 -2 2 16 -9 -9 3 -9 -2 21 -6 22 -1 7 9 -3 -7 8 4 -8 -1 -7 5 7 -8 -2 -10 1 8 -8 -9 11 10 -2 -9 3 -4 -18
4146 -18 -15 -11 -19 -18 -4 -13 -8 3 6 -9 -3 8 -6 -2 -4 2 2 3 -7 0 -1 6 10 4 -4 9 -4 4 -6 -2 -16 -12 -6 -14 -1 -15 -14 -25 2 -10 -10 -11 -18 -1
4190 -1 -13 -17 -24 -8 3 6 1 -7 -1 4 4 -1 17 -2 4 5 -8 -8 5 7 1 -8 -8 4 19 0 7 -6 -10 12 -7 -5 -7 -16 2 2 -12 -14 -15 -16 -16 6 -23 -10
$$ packed form
3894fk3L4j4J5j0QnkNkOj3OkrPJ4j1OOj3%LJ0rlPk1J8pkljqJ2Qrj6K1omLK5j4
3938AQlj0jkJ2Jj0J5mnJ9Ok4J4kprQoPlLk1JJ3Qj4J0%Oj6mJ0kj6J1Nlj7J2J8L
3981A2j6jJ2qJ5j8J1j0J3j4J0J0mj0oQpK7kk5QK1j7pLLj2O%ppLRrKj0%jJ7j3J2
4022bKj5J2J7k0Kj3L6l2LJ3jOJ0j2OJ8j9Rk4OMlJ0ppnJk4K1JpKQj4j4J1kL0m1
4062c4L2RlpjkK0j7jNJ1Qj1J2j0j2rR%nJ1KknoQj6J0nL%kNk4L0mLj6PqJ2Oj4P
4106dNJJ0j4MJ4k5%J2j2PK3k7K8k3QKj2mJ5mj2PoJ2Kj5OqJ1Pj6jK0jj2pJ2pj4
4146a8LMqJJ4rNJ1Lj5OJ1j4MkO%Jj0PjPMoqJ3j3Qj0Mj4MOqJ3j4Jj1K7j2%jpJ7
4190aj2mpJ6J1LnqON%nJ8j9OJj3%J3Kor%J2J5j9Pj3mK2j9KkrJ8%j4kjj%K2k9J3
$$ plain form
4234 -10 5 -17 -6 6 19 3 19 2 9 8 8 7 15 -2 -14 10 18 8 11 4 -2 -7 4 5 1 -7 -15 -1 -5 2 -17 1 -11 0 -1 -3 -14 6 1 -6
4274 -6 -11 -21 -15 -25 -7 3 3 -7 2 8 -1 10 14 -1 17 8 11 10 25 -4 -3 6 -2 1 11 9 -2 -14 1 -6 -10 -13 -5 -21 -5 14 -18 -23 5 -3 -6 5
4316 5 -26 -16 -21 -9 -9 -10 -3 5 4 13 13 7 9 23 8 1 1 5 9 -9 1 -3 1 18 11 15 -8 -10 -1 14 2 -18 -15 -15 -23 4 -12 -16 -7 -23 -5 3 -11 -3
4360 -3 4 -15 5 -4 11 9 12 10 3 6 5 6 13 0 6 3 -4 -7 3 -9 6 18 3 10 -4 8 1 4 -12 -14 -7 -1 3 -3 -12 0 -11 -20 -3 -6 -7 -6 2 -14 8
4405 8 1 -1 8 7 6 10 27 5 15 16 19 -4 19 26 19 -1 4 13 10 -13 17 5 8 6 -2 0 -11 -1 -1 -2 -20 5 -5 -13 -10 1 13 8 7 18 -5 -6 -7
4448 -7 -1 -5 7 5 -5 14 8 10 21 26 15 17 -7 1 8 -4 2 -12 9 12 -2 2 -7 -1 3 -17 2 -17 -14 -12 -20 -9 -17 -20 -1 -16 -4 -2 -4 -16 5 1
4490 1 -3 8 6 -15 7 9 -1 3 7 8 1 9 5 6 17 -6 12 7 4 6 2 1 2 -12 -21 -4 -9 -15 -11 -4 -17 -12 -11 9 -1 -3 -2 7 -16 12 -7 7 8 -8
4534 -8 -24 -10 9 1 0 5 14 12 10 9 14 8 9 11 5 -3 -18 -5 22 9 0 6 2 7 -13 0 20 2 -12 -9 -16 -14 -4 -21 -19 2 -4 -8 -15 1 -3 -2 -9 15
$$ packed form
4234a0J5k2J1J2J3j6J6j7Pj%jQj7j2K4Qj0LponJ1JmqqJ4mPj9J8j2J1jkj1K0np
4274fnj0Oj0J8J0%j0ROrJ1Mj5J8rLjJ5k9JRqLJ0kj1j2J5pmlQj6J6J9l2nK8qlJ1
4316El1J0nJ2%jPQjR%oKJ4j5p%MMj8J0mMJ7pMk3kRJ5j2k0L%qK7j6mRj6J8Qj4Q
4360cPj9K0rJ5kLkpLjJPj3OlplJ0j2J5J2j5Pj4J2pLj6kPOMorJ2j1rJ7ljJQj6K2
4405HpkRjjMJ7k2J0JLk3K3Ppk0NRlk3L0j2LkqKj1J0%jj8K5j0qLJ1J2njJ1k3jj
4448gOmJ2kj0J9oKJ1Nj1Kk4QPj2Oj4K1Lj4MrOMk0J9j9LKqJ1qlJ9j5J2Kkj2K1m
4490AmJ1kk1K2Kj0MMJpQmJJ1k3J8nlKmjJj4rJ7noMPj3NJK0j0kJRk3K8j9J4Jj6
4534hj6J4J9qjNRkkjNoJKoqj5J3K7j3rOmNk0J3K0j8j4LpKJ0j7KK1ompJ6mJpK4
$$ plain form
4578 15 -14 3 4 -1 -5 16 11 -9 2 0 18 25 10 10 -8 -2 -10 5 5 -4 -9 -16 -5 -16 -13 -4 -6 8 -3 -16 -9 20 -11 -23 -15 -12 -8 -18 -14 3 -6
4619 -6 5 14 -3 -2 15 -1 13 1 15 26 8 -6 14 2 8 16 7 11 0 -12 -26 10 1 -1 -9 -5 -5 -5 -13 -5 3 -9 3 -5 -14 -20 -2 -2 7 -19 -9
4660 -9 1 -1 21 17 8 2 -12 -5 9 -6 6 10 10 -2 -2 1 11 2 -11 -6 3 -2 -6 2 -5 -8 13 5 -18 -18 -7 -4 -16 -22 -15 2 -14 -4 -7 0 -15 -13 -4 -13
4704 -13 1 -7 -3 8 3 -12 5 9 -6 9 26 15 14 17 -3 3 23 14 -2 -14 -15 -14 -9 -2 -3 -20 2 -15 -15 6 -5 -10 -25 1 -15 -10 -15 -3 -22
4743 -22 -17 19 3 9 1 4 17 0 5 -7 0 -11 1 25 -5 2 -6 15 -3 -1 2 -3 9 11 -10 4 -6 4 -7 -14 -12 -15 -7 -20 -25 -6 -8 7 -7
4782 -7 2 -9 1 3 -10 5 13 12 2 0 1 -8 -9 0 10 9 1 6 -7 2 8 -13 2 -9 18 0 10 0 -1 2 -11 0 4 -5 0 -3 -8 -15 -1 -22 -20 0
4824 0 -1 -7 -16 0 -1 -7 -11 -6 -1 17 3 4 11 2 0 8 4 2 4 29 1 3 7 5 8 -10 8 -8 -16 11 -11 -3 -6 -6 7 -2 -2 -11 -9 -8 -13 -6 -4 -10 -15 -12 -16 5 -2
4873 -2 -11 -10 6 9 2 15 -9 5 9 -6 3 3 6 -1 14 11 4 2 -11 -4 -8 -14 -7 -18 -6 -29 -2 -7 -27 -8 -12 -13 7 -3 6 1 -10 -1 -8 8 -6 -9 -19
$$ packed form
4578A5k9J7JnmK1nk0J1kJ8Pj5%j8OqJ5%rnpJ1j1LRkJ4j1j3PK9l1j2QLMj0MJ7r
4619fJ1Rj7JJ7j6J4j2J4J1j8j4K0j2OQrMj1j2j4L6rkqM%%qQQj2J2qroJ8%Rk6J0
4660iJ0kK2mroj4PJ4j5J2M%j2%LJ0rj3NRnmQplK1qk3%J1Lj2oPJ7j6J0lPj5KRr
4704a3J4qMJ1nj5J7Mj5J5J7j1jLk0OK0rj6j2jJNPjj7K2j7%K1j1nj5K6j6NnJ2j9
4743b2NL6j6OqLJ3j7Nj2Pj1J2K4l0PqK1j8KLnJ2Kk1J4j0J0j1pKlQj3nJ9kJ5j4
4782gRj1J0Kj3J5Qjj0kJrjRJ0jqNj3ROk1J5j1K7j8J0j0jLj3J1MrNlnpJ4k1KK0
4824@jorJ6jomNNJ8j4JPrkQmkKK5k8KMkLj8J8j6qK7k2Ql%J3r%rKJnPKonLmK1p
4873brJJ6LpJ3k4J4Mj5R%LpJ5lpkj3PmoPj1J2k3K7nk0J9mjK0j0Rnj1RpJ6j4lj0
$$ plain form
4916 -19 3 -2 6 29 17 2 6 0 -9 -13 -1 13 -19 -2 -3 -6 -5 4 9 7 -17 -11 -8 -8 8 -1 -18 -9 1 -3 -12 -3 -3 11 8 8 16 -6 -16 2 1 -12 -10
4959 -10 -11 7 9 17 0 9 18 13 14 16 19 15 -8 4 15 -1 0 -7 11 -3 -3 -3 10 6 -12 -19 -6 -23 -29 -16 1 -11 -4 -9 -26 -9 2 1 1 10 -6
5000 -6 -5 11 6 0 9 17 14 20 15 18 3 -4 -4 2 2 9 -20 -10 -8 -13 -6 -9 -7 5 11 -8 -19 -19 7 -10 -11 -14 -13 -20 -12 -24 -13 -5 -5 -9 2 -16 -7 -9 -1 -4 12
5047 12 1 -5 -13 20 2 16 -7 9 13 7 9 12 -6 -3 -11 -5 -9 -6 1 -8 1 -6 -12 -10 -8 -3 -21 1 8 -22 -5 -4 -5 -11 5 -21 -1 -1 2 -3 -13 -9 -6 -5 -4
5092 -4 0 8 19 16 -7 4 2 8 8 2 4 -11 0 -5 -2 8 -19 -6 3 -13 -18 4 0 -21 -9 -3 3 -4 -6 0 2 8 -2 -12 7 -9 -19 19 16 -1 -20
5133 -20 4 4 9 19 -4 -14 2 17 6 2 2 2 -6 1 -20 -9 -7 -13 -2 6 4 5 15 6 -12 -16 0 -25 -29 -19 -4 0 -5 -2 0 -1 13 1 8 10 5 -2
5175 -2 7 5 18 -3 19 -2 -5 5 2 12 -1 8 -10 -8 -13 -14 -3 10 -17 -16 -16 4 -5 -8 1 -1 0 -5 -12 -17 0 1 -9 2 -2 12 0 13 -5 -5 0 -13
5217 -13 -5 17 10 15 17 12 -2 18 7 -8 8 -6 9 9 -7 -7 -7 -1 0 -2 -15 -15 -16 -7 -4 -11 -8 -19 -16 -21 -4 -7 -10 -8 8 -6 -6 -10 -10 -6 -10 7 4 11 -6
$$ packed form
4916a9K2nQK3j2j5MormJ2J4l2J7jlJRNkk4OL%J6rj7RJ0mrR%J4l%Qk2j0J8jj3K
4959a0jJ8KQj7RRnJKLmk3J2J1j6JpJ8j4%%J3mj8pJ3j7oJ3J7j2Pnj7J7J1j%Rj6
5000fJJ6noRQlOnLj5p%O%Pk9J0KnPlKJ2Oj9j1%K6j7jlJpQj2J1Q%mJ1j8RkQlJ6
5047A2j1oqL3j8J4k3J6MoKLj8LqOmLPrRpoKKNj8K2Pl0J7JjoJ6k6K0%Lnj0MLJJ
5092dMQJ1lk3J1kO%oKj5J1nLJ0k7J3Rj6nK2mk1J2OOpkOKOj0j0J9j6j0L8lj7j9
5133b0K4%NJ0k3j0J6J5j1m%%qPk1J1KoJ1QkJJ0rj8mJ6k5mJ0J5MnLKjJ4j2PKnp
5175bRkJ3k1K2k1lJ0lJ0j3Rj8KnjJ1J3k7J%K0rlRkJnpnJ7Jj0J1mJ4j2J3j8%Nj3
5217a3QK2pNKnj4K0j1j5J6j4J5%j6%%OJkj3%jRLpLj1LnJ7llKJ6j4%m%MmJ7lPj7
$$ plain form
5262 -6 -2 4 1 -1 7 -6 4 3 -13 -1 4 4 -3 2 -28 -1 9 -10 -5 -11 0 -12 -25 -7 -5 -20 -16 -14 -18 5 -4 5 3 -2 6 -2 -3 -12 10 24 5 1 6 -5
5306 -5 -8 6 -2 8 -3 -9 -6 2 -18 -22 -2 -10 -20 -14 -12 -23 -18 -27 -21 -6 -7 -29 -27 -7 -9 -14 -6 -22 -12 -2 -1 -9 -7 -16 -8 -4 11 12 -13 17 -7 3 -5
5349 -5 8 -8 8 7 12 10 -1 6 -5 -8 -11 -12 -12 -13 -7 -13 -11 -8 -23 -14 -25 -19 -10 -13 -13 -16 -16 -14 -1 -9 10 -10 -3 -11 4 -6 3 -19 19 24 -1 1 6 12 10 -10
5395 -10 2 3 6 -15 11 -3 12 -3 12 -9 -16 -7 0 -26 0 1 -12 -13 2 -3 -10 -19 5 -4 -21 -2 1 -6 1 6 14 -4 24 14 -10 0 2 -2 13
5434 13 -5 11 9 -13 16 2 6 17 7 0 0 11 -14 -18 -15 -21 -20 -13 -25 -1 -11 -7 -16 -9 -10 -24 -4 2 -1 -8 -11 8 6 -2 1 5 7 19 -7 21 0
5475 0 16 0 -5 -5 -2 -7 2 -1 -10 3 -3 0 -2 1 -4 0 8 -17 -17 -1 -22 -13 -11 7 -21 -6 -2 -2 -9 -5 -27 4 -2 4 24 3 -4 -3 -13 8 9 -5 6 -4
5519 -4 -7 8 17 -8 7 -4 6 -3 -1 3 -8 8 -3 -12 -12 -16 -2 -12 -18 2 -19 -3 -11 -12 -2 3 3 5 2 -2 -13 -7 2 -3 8 4 1 -4 -1 6 6 -10 16
5562 16 17 -3 -1 8 9 -15 6 6 11 3 -15 -19 -20 15 -23 -5 -26 -13 -1 -22 2 -19 -11 -19 -17 -4 -15 -10 8 0 -7 -2 14 -3 18 -6 -5 6 6
$$ packed form
5262fMOlkQj3J0jj6J2N%pNl0K7J0j9NoJ1j2j3J8Kj5MKmK3rRknQqjrK2J4j9mNj1
5306elJ4qJ0j1oLQk0mK0qj0OKj1NrOJ5jk2KK0knQj6J0J0JqKrQMJ5Jk5L0k4J0q
5349eJ3j6J6jNkj1Pj1llj%jOoKLj5Rj1ORl%l%KJ3qJ9k0PqJ5j0Rk2L8Nk5KNOkk0
5395a0J2JLk1K6j4J5j5J5k1pRPk6K6Jj3jJ5nprK4rj7J9LpPNQj8K8j0k4J0KmJ5
5434A3j8J6kk2K9j4MJ1j0p%J1k5mLoJPj2K4j0MrPjj4K0OlplJ9kqLMKJ2k6K8k1
5475@J6j6n%LnRlrJ3oLkLnMQk5%J6k1RKJ8k8J5M%pMk2L1oOK0k1pJj0K1Jj4J1j0
5519dlJ5Rk5J5j1J0rKMj1J6j1r%mJ4j0oK0k1J6qjJ0N%Klmj1ORnJ1mlnLP%j6K6
5562A6Jk0KRJk4K1%Nqj8mjL5l8J8k1J3J2k1K4k1QqKJ3j1NJ8qpNJ6j7K1k4JJ1%
$$ plain form
5601 6 10 8 19 4 -3 -10 8 10 1 -3 6 -6 -2 5 -15 -15 0 -15 -10 -11 -17 6 -13 -2 -2 -16 -10 -9 -4 -6 -3 -14 -5 0 5 -1 -9 -14 15 -3 2 3 -8 -7 9
5646 9 12 19 4 11 -6 -5 -19 -2 5 -26 4 0 -17 -6 -7 1 -6 -16 -22 -4 -9 -9 -20 -9 5 3 1 -17 -5 -23 6 1 -4 -1 -9 2 0 -8 -6 8 -4
5687 -4 -14 -14 8 12 5 -6 6 -6 -21 -1 -9 -8 -10 -19 -8 -3 -11 -8 -23 -21 -2 0 -17 -21 -12 -24 -20 2 -19 -15 1 10 -10 -17 -27 -2 -4 -9 4 3 -3 3
5729 3 6 3 16 -4 -13 9 3 6 -5 -11 -8 5 -10 -5 -3 1 -9 -13 -12 -16 -30 -6 -9 -20 0 -2 -18 -1 -2 -11 7 -2 -8 0 4 -2 6 -3 11 -20 -2 19 9
5772 9 4 6 6 8 16 8 15 6 1 4 2 -10 -12 0 -9 -1 0 -6 -7 -6 -9 -10 0 -19 -12 -18 1 -8 2 -8 -6 -5 -1 7 7 11 2 4 0 9 -15 15 12 16 0 -2 0 6 -6 7
5822 7 18 -6 0 -9 -2 -15 -4 -8 -16 1 4 -9 -20 -17 -6 0 -10 -1 2 -24 -11 8 1 -4 -12 -2 4 11 7 17 -9 1 -10 13 -7 2 11 -2 17 1
5862 1 -1 0 -11 -7 -10 2 13 -18 -5 -18 -9 -1 1 -5 -5 -17 -6 2 2 -10 -4 13 -9 1 3 -7 1 -5 -12 -3 -1 -7 -2 6 13 17 14 6 -1 5 9 13 -2 -1 7 -3
5908 -3 6 -19 -20 -2 0 -11 -7 -24 -11 -26 -10 -24 -14 -10 -2 -9 -24 -3 -4 -7 -12 -11 10 -1 13 6 9 10 1 23 0 -6 -4 -4 5 9 9 -3 2 -9 5 10
$$ packed form
5601FMkJ1j5ppJ8KrmRj2MPk0%J5j5NjoK3j9J1%j4OJNkLj1RNNoqnK9j8NJj1JJ6
5646ILPj5Pj7Jj4J7Pl1L0mj7J1jQpj0oJ8n%j1J1J4kkj8J2j8K9nnLqJ1kqKJ4j2
5687dj0%K2Mpj1J2j2j5K0qJkrJ1NqLj5KJ9Kj7mRj2MK2k1MJ6Rk0pj0K5knJ3joO
5729CLlJ3k0rK2oLj1oLJ3j5NKMj0mJmj4K4lj1K0kj6J7jrJ8roQMoQrJ4l1J8K1j0
5772InK%KQqPrnLkj2kJ2rQJojJljJ0j9PoJ9rJ0j0KJMQ%MrKmRk4L0lMj6kKOj2J3
5822GJ1k4OrPj3J1mqJ7Lj3j1LJ1Oj0RLk6J3J9pnqJ0OPmJ0k6J0j1K3k0RRj3J9j6
5862AkJj1MlJ2J1l1J3j3RQKo%j2J1Q%j2OJ7k2J0Kj0QopRKoNQPMlqpOMMj5JQj0
5908cRk5jJ8Kj1Mj7J3j5J6j4J0MQpj5K1jlnJK1j1J4pLJrK2k3oK%RM%j2Nj1J4N
$$ plain form
5950 10 16 14 -8 -23 -7 -2 -14 2 0 -15 -20 -3 -4 -21 -19 -1 -18 -13 -10 -29 -1 1 -10 -14 -2 1 -7 19 -10 1 7 7 7 9 -7 -6 -4 -2 -15 -11 5
5991 5 -10 -7 -8 -5 -7 -7 -14 -10 2 -23 -14 -11 -9 -10 -29 -25 -4 -1 -15 6 -3 11 1 -4 -7 9 1 -6 -8 2 5 14 16 -11 0 -1 13 15 12 14 -21 6 -7 7
6035 7 4 -3 1 -17 -13 -24 -5 -20 -12 -12 -6 -2 7 17 -15 -2 -10 -8 -19 10 8 -7 -9 -2 1 5 11 3 -1 32 -3 -6 -10 3 -1 -8 13 4 -8 -19 24 -6 -8
6078 -8 -18 7 -1 -15 6 -14 -15 -1 -16 -25 -10 -13 -25 -15 4 -24 -12 -14 -15 -14 -4 -24 -18 0 8 -14 8 6 -2 4 11 11 12 10 -5 9 13 5 3 -9
6118 -9 -9 4 -4 -3 -7 -6 -14 -6 -3 -11 5 -12 -23 -21 -25 -21 -14 -12 -23 -3 -3 -14 12 -5 -10 -6 5 -2 0 -11 19 -5 15 8 10 -8 6 2 4 -8 -3 6 -12
6161 -12 13 -2 7 1 16 0 -23 1 -4 -11 -8 -4 -1 -2 -1 4 -7 2 3 4 -20 -30 3 -5 -19 4 -23 11 0 -13 13 6 -10 11 5 12 2 3 6 5
6201 5 -1 -11 -5 -11 -2 -7 6 4 3 -8 3 -12 -4 -15 -5 -11 -5 -8 -20 -10 -14 -5 -5 -14 -7 1 -12 0 -12 -15 -13 13 5 16 7 12 -1 10 3 -3 -3 12 -17
6244 -17 7 -11 -9 -1 -20 -4 -4 -5 -17 -24 -14 -23 -22 -14 -12 -23 -14 -15 -13 -6 0 0 -28 -6 9 14 -10 -3 12 14 4 -14 10 5 10 25 10 8 10 10 15 0
$$ packed form
5950A0Okk2j5J6Nj2J6kj5nJ7jj7KJ8j7NLj9K8Kj1mJ2LqK6k9J1O%%Kj6JKKj3MJ6
5991Ej5LjLk%pMJ2k5RLKjj9MK1Lj4K1rJ4j0nlJ6qpkJ0LRKk7J1jJ4KlKl5K7j3J4
6035GlpMj8Mj1J9j5Q%OMRJ0l2J3qKj1K9kj5kPLMOqmL3l5lmJ3mpK1rj2j1M3l0k
6078hj0K5qj4K1k0jJ4j5rJ5lj2J0J9k8J2kjJJ0k0OJ8Qk2K2kqOP%Jkj5J4Mqkj2
6118i%J3qJmJqQLqJ6j7j1KmMPKj1K0%j1K6j7nMJ1pKj1L0k4K0pKj8J4mKj2NRj8
6161a2K5j5RoJ5j6k3K4npLMLjJNj1RJJk4j0L3qj4K3k7L4j1j3K6pj6K1oPj0JLj
6201Eoj0OoRnJ3kjj1J1j5Qj1J0oOlj2J0mR%rPQj3J2j2lKK6qJ1rNj3J1po%J5k9
6244a7K4j8KQj9J6%jj2pJ0rJQKj1RjKPO%k8K2J5Nk4PJ5Kj0j8K4nNJ5j5kK%Nj5
$$ plain form
6286 0 -8 5 -12 -5 13 -7 11 4 -6 -1 -13 -3 -5 -1 -11 -22 -4 -11 -10 -7 0 -6 -17 5 -4 -1 0 19 3 -8 1 0 12 -6 -6 -3 -3 -1 6 -4 12
6327 12 14 -1 -16 3 -12 5 -7 -15 -31 6 0 -13 0 -20 -19 -12 -24 -35 -17 -1 -3 4 -8 -8 -9 -7 2 -1 -5 0 -3 -10 -17 -6 -1 -2 4 1 21 3 9
6368 9 2 -3 2 11 -4 -4 -8 -1 -7 -2 -3 -5 -22 -4 -13 -5 -2 -20 -3 -24 -16 11 -15 -13 12 -4 2 -4 -4 5 -2 -16 12 -16 0 13 21 -16 9 -12 -5 4 17
6411 17 -4 -14 -6 7 -1 9 10 -16 -3 -16 -14 -3 1 -23 -2 -14 11 -7 -29 -10 20 -2 4 -16 -5 -5 2 4 -12 -16 14 -5 4 -5 -3 -2 -7 -2
6449 -2 -9 6 -2 10 4 -5 5 -4 -5 -5 -6 -5 -18 -5 -8 -19 -13 -4 -4 -4 1 -1 -11 -12 -12 -24 -6 -3 -4 6 -10 9 -2 -14 2 -4 5 6 -14 1 3 9 1 -5
6493 -5 -4 -2 -12 10 -2 9 -1 1 -16 9 2 0 -14 -4 -2 -18 -15 -11 -4 1 1 -7 -17 -3 0 5 -17 -3 -2 -13 -14 9 8 0 18 -17 15 2 16 -9
6533 -9 1 16 13 12 16 16 -3 5 6 5 1 9 -4 0 3 -20 2 10 -15 -10 -22 -3 -11 0 3 0 -5 -6 -7 -3 -4 -22 -5 9 -1 -12 4 9 15 2 9 9 13 -6
6577 -6 -7 -15 12 20 0 -1 -4 -7 -6 -1 6 -7 -1 -14 1 0 -11 -13 -5 -1 -12 -12 16 -17 -1 -7 -1 0 -12 5 -14 3 4 -2 5 4 16 -5 2 7 8 -6 15
$$ packed form
6286@qJ3j7PJ8k0J8pj0Nj2J0kMj0j1J8pJLPoj1K2rLJJ9j6j1RjJ2j8%L%KPj0J6
6327A2Kj5j5J9j5J7j2qj6L7oj3J3k0JPj2j1J8J6kPj2%jKRlmNlppJ1NjOlK0j8O
6368IpnNRj5%mPoNjkj7J8rQLj8J7k1QK7k6KK5j6Oo%Rpj4K8k8J6J3Ql7K5k1PRJ3
6411A7k1j0QJ3qJ0Jk6J3j3KJ1Mk4K1j2K5j8k2J9L0k2Ok0J1%PKj6mL0j9RrKJnN
6449bpJ5qJ2orJ0rj%jJj3J3lj1OR%%Nkj0j%j2J8LjJ0j6J9j1j2J6oRJk0J5KOqo
6493eJKj0K2j2J1j0Kj7K5pkj4J0Kj6LMPN%qj0J4LNk2J4Jj1jK3jqJ8l5L2j3J4k5
6533iJ0J5ljM%j9QJjmQj3MLk3K2Qk5Nj2J9qJ1LlnjjMjj8J7J4j0j1J6NOj3P%Mj9
6577fjqK7Qk0jllJNPj3Oj3J5jj1kQMj1%K8l3J6oOJj2J7j9J7JoPjJ2k1PNJj4K1
$$ plain form
6620 15 -6 8 8 3 12 -12 10 12 18 8 -10 -5 -8 -20 -2 1 -13 -11 0 -4 -4 -22 -3 7 -8 -6 -10 14 -7 -1 -5 2 13 5 4 7 12 12 -1 21 27
6661 27 5 -1 4 5 9 4 17 13 -3 -1 -16 -2 1 20 -1 -11 -11 -4 -19 -18 -3 -4 -7 -11 -1 -16 -7 -4 -1 7 3 13 10 12 6 9 1 17 1 6 21 7 2
6704 2 23 15 18 -4 -2 14 11 7 0 0 -4 -15 -26 -13 -6 4 -11 1 -10 -4 -6 -8 -2 0 -4 -15 0 -2 -2 5 -8 -8 12 0 5 13 17 13 12 4 13 9 8 -6 3
6749 3 -4 5 -11 1 -3 -10 12 -16 15 -3 -3 1 -9 -8 -18 -14 -13 -17 9 -1 -7 -1 13 8 -6 -3 -8 -3 -6 -10 8 2 -12 -6 21 5 4 13 6 0 3 4 2 0 1
6794 1 1 8 5 2 20 1 -31 10 2 1 6 -7 -13 -15 -21 -16 -17 -12 2 -10 1 -8 -8 -1 1 3 -1 -8 -4 4 -8 8 1 9 6 -13 7 -1 -3 2 12 -1 1 3 -1 14
6840 14 28 23 -6 1 -3 -3 -6 -17 -10 -6 -2 -8 -2 0 0 -21 -8 0 -3 -13 -6 10 12 -3 -19 11 -3 15 6 -6 23 3 18 6 7 8 -3 12 -7 3
6880 3 2 -2 -2 -10 -6 -6 0 -1 -3 -5 8 6 -7 5 -2 -9 -6 -8 -11 3 0 7 13 -3 -7 -3 -7 5 -5 1 0 1 -2 8 -6 6 2 -1 -9 1 15 -2 -1 -7 6 -16
6926 -16 -7 -7 -13 4 -9 -14 -10 -13 -7 -9 -3 4 -2 -18 -24 -2 -23 -5 -15 -2 10 -9 -6 14 0 -1 -2 -10 -6 -14 -2 -1 -16 26 -2 5 7 -1 3 -5 -2 9 -14
$$ packed form
6620A5k1J4%nRk4K2KOj0j8Nlj2J8Lj4KJ1m%j8J9J0j5KmK4k1OmPJ1qjLN%j3K2O
6661B7k2oNJMnJ3mj6Kj5J4LJ9k1j0%Pj5JJ5jlmJ0j5RLLQmJ0lKoLqJ6j6NJ5j4n
6704BK1qLk2KJ6lmp%mj1j1J3PJ0j5J2j1OkkOKmj1J5k%Pj3%K0j2NQMmjqRmjj4R
6749CpRj6J2mpK2k8L1j8%Mj0Jj0MJmK6j0oOJ4nj4LnNlmJ8oj4OK7j6jRpoLJkkJ
6794A%PllJ8j9l2M1qjNj3okoNjNJ4j2J1r%PKKmpMQj2J6pQlj9K0qkNJ0j3KKmJ5
6840A4J4nk9Pm%lj1PMMoOK%k1J3Qlj0PJ6Kj5j6L0j4J8rj2K9k0J5j2JJj1J5j9J0
6880Cjm%qM%OjkkJ3kj3J2ppLklJ4lPOj6mMmJ2j0OjJlJ0j4J2mlqJ0J4j7JoJ3k2
6926a6R%oJ7j3nMlOkOPoj6oK2k1J8j0J3J2j9LK0j4jjqMqJ2Jj5M2k8PKqMqLJ1k3
$$ plain form
6969 -14 -4 -10 -20 -9 -17 -4 -3 -12 -12 -17 -10 -15 -4 -5 -7 -13 -13 -6 -3 -13 8 8 1 -4 6 15 4 14 -3 -2 -3 -11 2 1 7 6 3 17 -1 7 3 -9 -8 13
7013 13 -1 0 -5 -8 -4 12 3 -7 -14 -16 -3 -2 -11 -4 2 3 12 -6 11 -7 6 -2 16 -5 14 0 10 16 -4 5 13 24 14 1 17 0 -7 -4 -5 -8 2
7054 2 1 0 -7 -5 10 -21 -1 -8 7 -12 2 -18 -8 -14 -18 2 5 -2 7 -3 1 20 20 22 6 9 11 0 -9 -1 -12 15 -3 6 0 -14 -6 1 -4 -15 8 -24
7096 -24 -5 -23 -6 -16 -8 9 1 -6 -2 6 -21 1 -18 3 -4 -12 -8 -16 16 -2 -13 -1 4 15 0 11 5 9 -3 2 14 -5 17 6 -7 5 -2
7133 -2 6 -2 -3 -5 17 -7 -5 7 6 2 -18 -7 -7 -19 -6 0 0 -8 -10 -11 -5 -10 -25 2 -8 -1 6 0 -9 -11 -12 4 3 -1 4 -4 -8 9 -7 10 -5 8 6 -11
7177 -11 -14 13 -4 4 6 -8 -10 0 -16 -11 7 -4 3 2 13 -2 -2 -7 -5 -7 7 -8 -4 11 -4 -3 -1 3 14 -1 9 5 4 1 4 10 17 21 5 11 -12 13
7219 13 -7 -5 16 22 -1 -7 -8 -6 -5 -23 -9 -3 13 -8 16 -3 4 9 -8 0 4 2 0 -16 1 11 12 15 7 8 9 9 3 9 2 12 -2 18 -6 14 1
7260 1 -3 5 -9 9 12 -15 7 0 12 -22 -4 -20 -14 -5 -5 6 -12 -8 -5 -3 -3 -3 -5 -8 -1 10 -13 10 -7 1 -1 9 11 1 2 -7 20 -5 -9 -8 0 -12
$$ packed form
6969a4J0oj0J1qJ3Jr%nPnJ1jko%PLj0K1%pnJ0Rj1J0j7JjqJ3jOjlJ4j8Qmj2JK1
7013A3j4JnlMJ6rj0pkJ3JrPOJRj8J7j8J3qJ8k1J9j4J0Ok0RQJ1j0j3J6j7pLjlJ0
7054BjjpKJ5l1K0pJ5j9J4k0J0omK0LpRj0MJ9%Kj6LKj1rQj1K7j8Roj4QPnj1K3l2
7096b4J9j8J7j0QJ7qpMQk7K2j9K1pqMqL2j8j1J2NJ1j5J1oMj2NJ2j9K2j1j3J2p
7133bQqjkK2k4KJ2jmk0J1%j2J3O%qkjOnj5K7j0PPorkjJ6jmNqmJ7j6J7j5J3kj7
7177a1lK7j7QKj4kJ0j6NJ8j1PjJ1j5%nKkJ4j5MJ5j5JKMJ1j5J0mjlLOPMj6Ok3K5
7219A3k0KK1Ok3ojKJj8J4OJ6k1K4j9PNj7QMkkj6J7J0JLqJJ%oOpJ0j4K0k4K0j3
7260AmQj4J8Lk7K2pJ2l4J8j6OR%J1j8MLK%%klPJ1k3K3j7QkJ0Kj0JrK7k5mJQj2
$$ plain form
7302 -12 0 2 5 1 -21 3 -10 -17 -8 -29 2 -10 -6 -13 1 -8 -7 -19 -8 -8 -19 -16 -7 -15 -2 -4 -13 -7 -8 1 -17 1 12 -8 -4 -2 7 2 0 -6 12 -7
7344 -7 2 -3 3 4 1 -4 3 3 -8 -16 -10 -5 -15 -4 -11 -10 -15 -5 -5 -5 -11 -9 -4 -14 8 -6 -2 3 4 -2 14 1 -3 9 -3 3 14 7 13 11 0 -3 -13 -7 -10 -12 -10
7391 -10 -5 -4 -6 6 5 -2 -18 -12 -13 -14 -4 0 -9 -10 13 -2 -18 9 11 0 2 -1 -13 -17 -3 4 21 6 7 11 6 7 -2 10 14 0 -4 -1 9 7 -6 1 -1 -7
7435 -7 -10 6 3 -6 2 -10 -6 -5 -14 -1 -15 -8 4 -9 6 -8 -13 -23 3 2 -9 4 11 -2 4 -3 20 25 9 5 8 27 5 4 -1 -2 4 -10 -7 -8 3 7
7477 7 1 -1 1 -14 -6 1 -1 -7 3 -14 -13 -10 -14 -9 -4 -4 5 -5 5 6 -4 -5 -3 -4 3 -3 -2 -9 -14 9 -2 5 -11 1 -1 10 1 7 6 8 2 3 2 -7 8 -20 -14 -16
7525 -16 -5 2 -20 -11 9 -6 -12 -6 0 -2 4 -3 8 -8 -6 -2 14 -8 4 8 3 -10 18 9 1 6 7 24 30 -4 5 5 8 -1 4 -6 15 8 -6 2 12 0
7567 0 5 -3 -18 0 2 0 4 1 -1 0 -6 -12 7 18 8 1 11 8 -4 10 5 -6 6 0 -2 3 -12 -12 16 16 1 17 5 -7 -2 -4 -11 10 -7 -1 -8 -2 -8
7610 -8 -14 -16 4 6 -8 -1 -15 -6 7 3 2 -10 5 2 17 0 11 14 2 4 3 -12 13 7 17 13 8 10 -3 14 10 -1 -9 -7 -15 -2 5 -3 -1 5 -16 -13 -20
$$ packed form
7302a2J2KLmk2K4j3pRk1L1j2MpJ4rJj2J1%j1LRqJ3krOjRj8J8J1k0MKRnkoJ8j9
7344gRnOJlnP%j1qONj0J1pJnJ0%%oKNj0K2j4MNJoJ6j3mJ2j2OJ1pOkj1lj0OlkK
7391a0NJkJ2jpj6OjjJ0MrjK3j5j6K7Kj1Klj2mJ4PJ7j5JMnJrJ2Mj4mLJ0kj3Pko
7435glJ6lrQj2MJrJ3j4PJ2j3J5j4nj0K6jj1J3Pj3OpK3Nj6mLJ9k2jnjOj4LjJ1M
7477GokKj5QPkoJ0j7JLmNN%Rj0J0Jj0jKjPoJpnK3j1Pj6J2kJ1rOjKoJjrJ5k8Ok
7525a6J1Pk2RK0j5oOOkOpJ1j6KMJ6k2J2Mnj3K8rqNJJ7Ol4R%LrNj0K1pj4QJ0j2
7567@Nqj5J8KkMlkJooJ9J1j0pJ0lj2J4nj1J2okNj5%K8%j5J6j2j2NkpK1j7OpOo
7610hokK0Kj4Pj4RJ3mjj2J5lJ5j7J1Lj2Kjj5K5oJ0mnKj3J7mj1qKqJ3PqKOk1Lp
$$ plain form
7653 -20 -7 -5 -18 -6 -4 -6 -10 -15 -15 3 5 7 17 8 15 4 0 -5 4 5 -1 -10 -1 15 -5 1 20 13 9 6 7 0 6 1 1 3 3 -2 -16 -2 -3 -2 -4 -5 10 -15 -12
7700 -12 8 -16 -17 -3 -15 -4 -5 9 7 -7 8 10 6 7 9 1 -2 9 7 2 2 1 8 11 -7 -2 4 -10 -1 4 -3 -16 10 2 -14 -1 -13 -17 5 -1 -8 -13 0
7743 0 -10 5 -9 -6 -13 10 4 3 9 -3 1 0 6 -2 -4 5 3 2 2 2 8 -6 3 4 4 2 1 5 2 -4 -18 -12 13 -16 -9 -5 -8 2 -4 0 -8 14 -5 -7 -7 -13 7 2
7791 2 3 -6 -17 -11 4 5 7 -3 13 0 -3 2 0 7 5 4 3 1 7 3 -7 -6 1 2 3 -1 1 -9 -1 -19 -13 -8 -26 -4 14 0 -9 -13 -26 -7 -5 -5 7 7 6 0
7837 0 0 -4 9 15 -3 6 11 11 12 2 6 1 -13 -1 -3 -1 9 -13 -11 0 -1 -10 -14 -23 -1 2 -22 -6 -5 0 -3 -7 -23 0 -11 -6 6 -3 1 10 15 -7 -4 2 5
7882 5 7 3 0 3 6 10 -1 -1 0 0 -19 -17 0 -8 15 8 1 14 -11 -1 -5 15 0 0 -5 -6 4 12 -12 -7 -17 15 -12 9 5 11 4 1 -3 2 15 -7 6
7925 6 -3 1 8 -9 10 11 -6 2 -6 11 3 7 -1 -13 7 -15 -10 5 -8 -13 -4 7 -16 -9 -9 1 -15 -14 -12 -1 -14 -1 4 -4 -8 3 -12 -2 -7 -15 -14 -17
7967 -17 -4 12 1 0 7 -4 -9 1 4 19 -18 -14 2 3 -5 2 -7 -11 4 11 -1 -13 -34 -6 -5 -10 5 -4 -13 -16 -7 -2 -10 -10 0 0 3 6 -6 -1 -3 -1 3 -3
$$ packed form
7653b0J3Kj3J2Kkmn%J8KKJ0rPj1mnRJorRJ6k0OJ9pmlJpOn%K%nj4J4jJkjJ5k5L
7700a2K0k4jJ4j2J1jJ4kj4J5KmJKqlJ1kn%jPLj8NOj4RNpj3K6qj6J3j2mK2opnJ3
7743@j0J5j4LpK3ojOj2MjOqkRkj%%Oj4RJ%kjMloj4OK5k9PMlJ0oMqK2j9k%oK0n
7791BJrj1OJ5JKj0J6j3lNkPkjjkOmj0JPJJmKj0Qj8ONj8K2J8j4rmj3J9K%J2%jo
7837@%mJ3Oj8RN%Jj0Mnj4J2kKJ0k2KJ1jrmrK2Lk4J6JNlmj6K3j1NJ2rMRNk2LOL
7882EKmlLLMj1%J%j9KJ7qK3ppJ3k5J0mK0j5%njJ0Qk4Nj0L2k7K1mOplmNJ3k2J3
7925FrMPj7J9Jj7QqJ7qMqj2K0k2NJ5j3nRJ1k3P%J0j6JKJ1j3J3NqmJ1j5J0nqJl
7967a7J3J6j1jPj1nJ0LJ5l7MJ6JqPrmJ5Pj2j2k1K8JnJ5rrlRNq%J0%LLj2NkKMo
$$ plain form
8011 -3 8 11 14 3 4 -1 3 2 -1 0 11 14 14 -14 3 -1 5 -15 0 -6 2 -21 -9 -20 -15 14 -13 -9 -12 -4 -1 3 -4 -9 8 -6 -4 -9 2 3 -10 5 2 13
8055 13 -8 -3 -3 -7 13 0 7 -9 -6 -16 8 -8 -3 -4 -3 -17 -9 1 -7 -2 -13 -8 -9 0 13 -2 2 -1 -17 -14 6 4 -3 -10 3 -3 -9 14 13 -5 14 18
8097 18 14 0 -2 4 -6 10 -9 11 5 3 1 -6 3 10 -1 6 3 -22 -16 -7 4 -3 -5 -14 -17 -13 4 -4 -1 -7 -7 -18 -4 4 -7 20 17 9 -5 15 16 5 11 -12
8141 -12 -1 11 -12 25 24 15 7 -2 4 6 2 5 -17 -2 -2 7 -8 -23 -14 -5 -23 -11 3 -13 -1 -13 -22 -9 -5 -19 -10 2 -6 8 -7 0 8 2 -10 -7
8181 -7 12 -2 12 5 13 4 6 -12 -15 -2
$$ packed form
8011cJ1LLj1JnMjlJJ1L%k8J7mOk0J5oQk3J2j1NK9k7MlQLMpnJ7j4KnJ1Jj3J5lJ1
8055A3k1N%mK0j3Pj6Lj0K4j6NjJj4QJ0qNj1NjRJ3j5Mlj6LK0kppJ3ooK3jj8J9M
8097A8mj4kOj0J6j9K0okkpRPj1Plk5ORJ1pkrlMJ7qLo%j1J4Qj1K7lqj4K0Jj1Ok3
8141a2J1J2k3L7jrqrOKmLk2J5%Rj5j5RRj8J2J4j6J2j2rJ3Mj4RJ2qJ4j5PQoj2L
8181gJ9j4J4pQrKj8lJ3
8191b
$$ Imaginary data points
##PAGE= N=2
##DATA TABLE= (X++(I..I)), XYDATA
$$ plain form
0 0 0 0 0 0 0 0 0 0 0 0 0 0 0 0 0 0 0 0 0 0 0 8 -8 8 -8 8 -8 9 -16 16 -16 21 -24 24 -32 32 -40 40 -48 51 -57 64
42 64 -72 80 -88 97 -106 117 -130 143 -158 174 -190 211 -232 257 -286 319 -355 400 -452 516 -596
63 -596 702 -843 1046 -1360 1925 -3230 12874 -6845 -23745 19986 10989 -19022 -6165 9968
77 9968 -8085 -5635 5543 -3831 -3724 11411 315 -7322 11160 9588 -12905 -2026 14407 -4657
91 -4657 -16480 3532 6957 -8796 -5972 5061 1534 -621 3061 1847 1363 3689 361 -599 2578
106 2578 -1779 -5581 1427 2258 -6300 -4364 4126 2388 -1970 -388 1805 3656 3021 -2748 -2154 4563
122 4563 516 -6370 -180 2968 -4627 -2840 4242 -663 -3413 3663 2554 -2121 2822 2738 -4001 822
138 822 5422 -3858 -5228 4629 1579 -5555 763 3006 -3571 370 4883 -3309 -3486 6006 1388 -6329
$$ packed form
0@%%%%%%%%%%%%%%%%%%%%%Qj6J6j6J6j6J7k5L2l2L7m5M8n6O4p2Q0q8R9j08J21
42F4j36J52j68J85k03K23k47K73l01L32l64M01m43M89n43O05o74P55q52R68j112
63e96J298j545J889k406L285n155J6104j9719j6900M3731q997l0011J2857J6133
77I968j8053K450J1178r374J07J5135j1096p637J8482j572k2493J0879J6433j9064
91d657j1823K0012L425j5753K824J1033l527k155L682j214m84K326l328r60L177
106B578m357l802P008Q31q558J936Q490j738m358J582K193J851o35n769N94O717
122D563m047o886O190L148p595J787P082m905k750P076j109m675M943q4o739M823
138H22M600r280j370R857l050p134O318K243o577L941M513q192j77R492m618p717
$$ plain form
154 -6329 1232 4321 -3910 -1762 4266 -1686 -3439 3907 1248 -4288 1325 2909 -3110 -292 3585
169 3585 -2229 -2116 4349 545 -3666 2379 2803 -3170 80 3315 -2722 -2857 2980 -79 -4073 359
185 359 1798 -1308 290 1275 -1115 1263 2946 -1901 -1828 3253 198 -4031 391 1988 -2840 -1640
201 -1640 2396 91 -1269 1704 1512 282 1533 265 -1145 1464 552 -3543 -1066 2052 -2025 -3094
217 -3094 1707 1125 -2039 777 2529 -171 222 1734 -108 -189 749 -1686 -1623 1319 -946 -3211 1237
234 1237 2367 -2057 -411 3720 680 -1436 1999 1503 -1629 -131 517 -2041 -1097 268 -1940 -1168
250 -1168 1648 -440 -1358 2548 1849 -1827 857 2996 -1307 -1956 1620 -60 -2530 -43 491 -1420
266 -1420 244 1125 -759 778 2343 -679 -549 2734 96 -2918 888 1696 -2981 -1914 1921 -391
$$ packed form
154f329P561L089q231K148O028n952j753P346k659n536N613J584o019K818L877
169C585n814J13O465l804m211O045M24n973L250L235o037j35N837l059l994M432
185C59J439l106J598R85k390K378J683m847P3N081l055m229M422J597m828J200
201a640M036k305j360K973j92j230J251j268j410K609r12m095K477L118m077j069
217c094M801n82l164K816J752k700L93J512j842q1R38k435O3K942k265k265M448
234A237J130m424J646M131l040k116L435m96l132J498O48k558R44J365k208P72
250a168K816k088r18L906o99l676K684K139m303o49L576j680k470K487N34j911
266a420J664Q81j884J537J565l022J30L283k638l014L806Q08m677J067L835k312
$$ plain form
282 -391 -2205 851 1049 -725 869 1082 -780 679 1502 -1389 -912 1696 -644 -2345 986 1244 -1901
299 -1901 -457 2035 181 -728 962 655 -65 563 -373 -952 681 47 -1885 -149 1096 -1173 -967
316 -967 1417 176 -1160 856 1002 -724 154 681 -747 0 847 -1139 -828 1577 5 -1668 996
333 996 1493 -1186 -163 1736 -451 -963 1250 113 -1435 473 497 -1476 -28 1051 -1239 -721 1683
350 1683 -118 -1498 1089 1072 -1310 15 1284 -869 -688 1271 -239 -1219 889 655 -1118 309
366 309 1115 -697 -218 1204 -311 -850 854 137 -1179 248 495 -1066 -228 803 -608 -557 918
383 918 17 -669 766 406 -834 408 775 -952 -304 1128 -417 -947 965 434 -1052 418 1073
400 1073 -714 -243 1148 -226 -861 691 160 -1200 131 630 -1023 -497 985 -206 -929 633 639
$$ packed form
282c91j814L056J98j774J594K13j862J459Q23k891M77K608k340j701L331K58l145
299a901J444K492j854r09J690l07p20O28r36n79J633o34j932J736J245k269K06
316i67K384j241j336K016J46j726Q78N27j428P47Q47j986L11K405j572j673K664
333I96M97k679J023J899k187n12K213j137j548J908K4j973J448J079k290N18K404
350A683j801j380K587j7k382J325J269k153J81J959j510r80K108k34j773J427
366C09Q06j812M79J422j515n39J704p17j316J427K47j561Q38J031j411N1J475
383I18r01o86J435l60j240J242L67j727O48J432j545n30J912n31j486J470O55
400A073j787M71J391j374o35J552n31j360J331M99j653N26J482j191p23J562O
$$ plain form
417 639 -709 -74 780 -120 -418 328 138 -268 49 60 -115 199 172 -85 181 319 26 -41 57 24 47 -180
439 -180 -381 147 174 -660 -318 592 -187 -809 393 590 -615 -192 744 -117 -486 466 158 -508 373 413
459 413 -607 120 828 -483 -602 963 269 -1056 294 973 -658 -601 815 4 -815 362 354 -734
477 -734 1 578 -571 -438 705 -118 -827 505 620 -680 -100 987 -9 -592 507 516 -488 -93 466
496 466 -242 -353 277 -19 -475 144 342 -290 -120 474 30 -374 139 215 -429 -296 201 -156 -471 56 188
517 188 -239 -20 436 153 -31 432 373 -175 7 335 -152 -439 81 26 -441 -57 238 -268 -133 491 56
538 56 -334 364 331 -477 -213 325 -362 -611 194 19 -565 87 513 -168 -80 654 292 -203 354 395 -287 -105
560 -105 256 -273 -448 111 -3 -445 34 372 -166 -129 426 113 -323 85 171 -337 -261 90 -214 -339 80
$$ packed form
417F39j348O35Q54r00k98P46j90m06L17J1j75L14k7k57K66J38k93o7R8l3K3k27
439a80k01N28K7q34L42R10p79o22J202J97j205M23R36q61l69R52l08o66Q81M0
459D13j020P27P08j311j19J565o94j325J350O79j631N7J416q11q19J177qj088
477g34P35N77j149J33J143q23p09J332J15j300N80J087r96n83J099Rj004L95N59
496D66p08j11O30k96m56O19J98o32J70N94m44m04N13P6o44J33M97l57l15N27J32
517A88m27K19M56k83j84M63n9n48J82L28m87k87N20n5m67L84K95n06J35O24m35
538E6l90O98l3q08K64N38o87k49Q05j75n84O52M26o81Q8P34l62m95N57M1o82J82
560a05L61n29j75N59j14m42M79L38n38L7N55l13m36M08Q6n08P6L51l04j25M19
$$ plain form
581 80 3 -233 151 368 5 77 450 221 -102 127 193 -164 -146 61 -120 -229 30 49 -207 -32 250 17
603 17 -177 130 195 -173 -205 102 -90 -327 -35 71 -209 -90 246 82 -104 227 285 -47 58 279 5 -103
625 -103 145 -28 -281 50 140 -295 -167 297 41 -340 72 282 -171 -208 148 21 -174 29 -42 -164 117
646 117 92 -256 8 422 -3 -258 274 321 -186 -77 262 10 -126 94 -24 -190 29 57 -238 -144 139 -75
668 -75 -244 9 71 -126 -58 72 -60 -45 142 11 -146 85 221 -76 -126 143 182 -39 -52 117 142 23 -44
691 -44 25 113 56 -99 -137 43 48 -185 -241 20 45 -177 -167 53 50 -56 -25 -4 27 91 -8 -112 70 201 -39 -128
717 -128 153 167 -86 13 179 24 2 128 -39 -116 84 69 -236 -107 136 -103 -265 -4 82 -141 -101 58 -31
740 -31 -41 107 7 -107 100 157 -120 -62 224 65 -144 53 198 -19 -53 99 31 -62 44 -2 -115 -5 48
$$ packed form
581H0p7k36L84K17l63P2L73k29l23K29O6l57J8K07j81j09K59J9k56J75K82k33
603A7j94L07O5l68l2L07j92k37K92J06k80J19L36j64j86L31N8l32J05K21k74j08
625a03K48j73k53L31R0m35J28M64k56l81M12K10m53l7L56j27j95K03p1j22K81
646A17k5l48K64M14m25k55N32M7n07J09L39k52j36K20j18j66K19K8k95R4K83k14
668g5j69K53O2j97O8J30j32J5J87j31j57K31J36k97n0K69L9k21j3J69K5j19o7
691d4O9Q8n7j55l8J80Nk33n6K61K5k22J0K20lj06L1K1L1O4r9j04J82J31k40q9
717a28K81J4k53R9J66j55k2J26j67p7K00j5l05J29K43k39j62K61Q6k23M0J59q9
740c1j0J48j00j14K07N7k77N8K86j59k09J97J45k17l4J52o8r3J06m6j13J10N3
$$ plain form
763 48 -123 -128 60 -7 -173 -20 102 -80 -87 54 39 -38 31 52 -23 57 105 -32 -19 144 40 -98 69 145 -47
788 -47 -66 98 -9 -93 -39 -9 -68 -28 -35 -137 -36 43 -102 -115 47 48 -84 -36 62 47 9 19 13 65 120 7 -28 116
816 116 139 -45 -43 92 60 -59 -18 -8 -23 -3 -49 -142 -55 74 -101 -218 6 98 -112 -136 64 84 -44 -36 56 57 43
843 43 41 -19 40 143 104 -80 7 200 57 -163 -8 203 -20 -178 33 66 -99 -61 -5 -91 -68 64 -75 -162 84
868 84 128 -155 -113 183 55 -146 22 114 -17 31 76 -12 19 149 13 -117 100 148 -94 -115 72 61 -85 -48
892 -48 -15 -27 -1 -67 -101 19 78 -79 -121 42 80 -57 -45 57 46 14 21 3 48 88 12 -34 59 87 -37 -65 29 25 -22
921 -22 -67 -20 -6 -36 -62 -51 -22 -28 -42 -15 4 -17 -11 -15 5 29 43 20 39 73 50 13 49 61 5 14 73 15 -32 3 30 -33 -51
954 -51 -12 -44 -47 -50 -55 -60 4 -36 -71 -23 33 -31 -41 -5 29 21 9 0 60 100 39 -11 46 91 43 -3 25 65 34 -27 -38 13 7 -35
$$ packed form
763D8j71nJ88o7j66J53J22j82pJ41j5p7O9K1p5Q0M8j37J3J63j04j38J67P6j92
788d7j9J64j07q4N4L0n9M0pj02J01P9j45j3J62Jj32M8R8j5l8J0oN2N5j13l5J44
816A16K3j84KJ35l2j19M1J0j5K0m6r3Q7J29j75j17K24R2k10k4K00K0j28QR2Jj4
843D3ko0N9J03l9j84Q7J93j43k20J55K11k23j58K11L3j65L8N6q6K3J32j39q7K46
868H4M4k83M2K96j28k01J68R2j31M8M5q8L1J30j36j30K17M8k42k1J87j1j46L7
892d8L3j2K6o6l4J20N9j57m2J63L8j37J2J02j1l2Pj8M5M0p6m6R3K8j24k8R4mm7
921b2m5M7J4l0k6J1K9oj4K7J9k1OmK0K4J4k3J9L4k3l7L6J2n6RN9n8m7L5K7o3j8
954e1L9l2llnnO4m0l5M8N6o4j0L6L4qj2rO0M0o1n0N7M5m8m6K8M0l1o1j1N1om2
$$ plain form
988 -35 -77 -35 -16 -45 -92 -61 3 -26 -69 -32 21 26 -31 -39 29 61 4 -8 47 61 50 -9 20 65 57 17 0 26 13 0 -46 -49 -13
1021 -13 15 -32 -81 0 36 -57 -96 18 50 -36 -43 19 39 12 6 1 10 77 45 -83 15 126 -9 -83 39 78 -38 -94 17
1050 17 19 -43 -42 -32 -41 -13 -19 -65 -52 46 -1 -95 -12 57 3 -54 29 54 26 11 40 29 37 40 28 7 -1 34 12 -30 5 36 -18 -58
1084 -58 -33 1 -28 -86 -51 -8 -21 -55 -33 -26 -7 17 -24 -1 82 40 -32 39 100 39 -40 72 106 4 -3 78 51 -3 4 2 -18
1115 -18 -6 -19 -59 -37 -10 -67 -88 -19 -17 -55 -48 19 13 -34 6 37 9 -34 29 60 10 12 18 45 17 10 24 35 -2 7 18 0 -13 -40
1149 -40 -16 -30 -26 -31 -50 -20 5 -31 -43 15 10 -36 -19 50 -2 -26 1 47 5 -6 46 49 29 31 30 28 19 2 -5 -24 -8 -29 -53 -33 1
1184 1 -35 -38 3 3 -54 -51 18 5 -47 -9 16 -11 -11 19 34 34 43 31 40 45 47 4 -7 10 -12 -51 -52 -30 -48 -55 -24 -22 -33 -21 7 3 -26
1221 -26 -23 -23 -6 -14 -25 -24 0 20 6 42 56 86 60 68 76 64 5 -14 30 -34 -76 -56 -35 -35 -41 -34 -8 -1 -6 -19 -1 24 -11 -60 -15 -10
$$ packed form
988c5m2M2J9k9m7L1O4k9m3L7N3Nn7qO8L2n7j2N5J4j1n9K9M5qm0j7K6j3j3m6lL6
1021a3K8m7m9Q1L6r3l9J14L2q6pO2K0k7onRO7l2j28R8J11j35p4J22L9j16n6J11
1050A7Ko2JJ0rK8om6J3R8m7r4Q3O9n4n7Q3K5k8j5K9j1QLj2k1qL5k2m2L5L1n4m0
1084e8K5L4k9n8L5M3j3l4K2PJ9K4m1K3Q3m2p2P1O1o1p9J12L4j02pQ1k7n4Pkk0
1115a8J2j3m0K2K7n7k1O9Kl8PO7om7M0L1k8m3O3L1n0KOK7k8pJ4J1l7RJ1j8j3k7
1149d0K4j4Mnj9L0K5l6j2N8nm6J7O9n2k4K7M6m2j1N2Lk0Kjkrj7pj9J6k1k4K0L4
1184Al6lM1%n7LO9j3n2L8K5k7%L0J5%Rj2RNKm3j1J7k2l9jK2j8pL1Kj1J2K8mk9
1221b6L%J7qj1JK4K0j4L6J4L0k6QQj2n9j9M4o4m2K0K1%oPK6Pnj3J8K5l5m9M5N
$$ plain form
1257 -10 -66 -88 -21 13 -37 -9 38 79 48 61 76 88 36 -5 -17 41 -35 -92 -42 15 -43 -53 15 28 3 -4 32 17 -26 -35 -61
1288 -61 -31 -55 -89 -59 17 7 -38 26 95 47 -8 65 107 2 -45 13 14 -44 -68 -56 -6 -4 -56 -27 57 17 -55 14 46 -10 -57
1319 -57 -8 30 -27 -57 -21 43 34 -12 17 71 67 -10 6 75 32 -71 -26 57 -27 -85 -1 53 4 -71 -24 50 3 -84 -51 23 4
1350 4 -95 -70 27 49 -27 1 80 103 8 -1 69 61 -50 -41 61 52 -71 -42 96 66 -27 -1 87 47 -20 -38 -8 -50 -63 -124 -99
1381 -99 -66 -65 -94 -4 66 -10 13 140 126 -31 9 104 26 -108 -39 31 4 -64 -53 50 99 30 7 115 121 -18 -58 28
1409 28 15 -153 -177 -49 -18 -116 -130 5 105 57 -13 75 186 77 -78 -16 52 -51 -119 -57 -38 -59 -15 38 32 39 74
1436 74 100 93 43 -4 5 1 -95 -141 -63 -27 -112 -94 59 61 -34 42 165 99 -37 -14 113 67 -96 -141 20 64 -104 -146 40
1465 40 150 -1 -71 79 153 30 -67 -21 36 -26 -135 -103 21 -35 -117 -39 104 45 -38 46 143 55 5 36 54 29 -5
$$ packed form
1257a0n6k2O7L4n0K8M7M1l1J3J5J2n2m1j2N8p6n7N0N7n8j0O8J3k5pL6j5m3rk6
1288f1L0k4l4L0P6j0m5O4O9m8n5P3M2j05m7N8Jn8k4J2N0Kn2K9Q4m0p2O9L2n6m7
1319e7M9L8n7l0L6O4rm6K9N4mp7J6O9m3j03M5Q3q4n8Q4N4m9p5M7P4m7q7L3P4j9
1350Dr9K5R7K2p6K8P9K3r5rP0qj11RJ02rj23K9J38l0r3K6Q8m0o7j8L0m2j3o1K5
1381i9L3Jk9R0P0p6K3J27j4j57M0R5p8j34O9P0k7o8J1J03M9o9k3J08Oj39m0Q6
1409B8j3j68k4J28L1r8j4J35J00m8p0Q8J11j09j55O2O8j03o8O2J9k1M4N3oPL5
1436G4K6pn0m7Rmr6m6P8L6q5J8J53Kr5P6J23o6j36K3J27m6j63m5J61M4j68m2J86
1465D0J10j51p0J50P4j23r7M6N7o2j09L2J24n6q2P8J43n9q3Q4R7q8n0L1J8k5l4
$$ plain form
1492 -5 -8 -28 11 15 8 11 33 -1 40 29 -47 -57 36 27 -108 -114 17 46 -80 -110 13 69 -21 -57 4 95 20 -58 14 113 35 -62
1524 -62 14 108 38 -52 10 94 76 -51 -63 41 58 -57 -75 14 49 -27 -65 2 42 -4 -48 -31 9 4 -47 -21 -5 -31 -29 12
1554 12 36 17 53 62 53 40 41 33 4 1 -4 -28 -26 -34 -41 -15 10 -36 -3 53 45 -49 -32 63 13 -58 -52 -6 11 -41 -44 2 34 35 2 30 82
1591 82 38 -26 -3 39 -12 -66 -29 -8 -56 -60 -29 3 -10 -12 -6 24 12 4 -2 17 -7 -11 -22 -7 0 -31 1 31 19 22 55 48 29 12 21
1626 21 4 -15 -24 -26 -17 -42 -53 -38 1 8 -30 -18 28 23 -39 -15 7 1 -39 -9 10 -20 -9 27 12 9 69 44 45 70 66 4 17 50 -13
1661 -13 -48 9 -3 -65 -47 10 -48 -42 24 25 -26 -2 18 -20 -25 -15 -46 -46 -2 -22 -47 13 53 14 13 83 58 31 -1 32 12 -27 -27
1694 -27 -25 -39 -49 -52 -46 3 -5 -40 25 57 27 -25 19 12 -43 -58 -60 -25 -37 -70 -25 21 31 8 24 77 38 31 21 24 -3 -40 -75 -20
1728 -20 -40 -54 -57 4 8 -9 20 58 42 11 26 19 7 -16 -41 -44 -22 -33 -44 -9 61 15 26 75 73 32 34 45 6 -44 -47 -38 -62 -59 -59
$$ packed form
1492elk0L9MpLK2l4M1j1p6j0R3rj35oJ31K9j26l0J23N6r0l6O1R1p5p8P2R9p8r7
1524f2P6R4p0r0O2Q4j8j27j2J04J7j15j8Q9L5p6l8O7M0m6m4J7M0nn1K6J6k6KM1
1554A2K4j9L6Rrj3Jqk9lnk4KqpK6K5m6L3N6qr4J7R5n0p1OM6J7n2lM6L2Jl3K8N2
1591H2m4o4K3M2n1n4L7K1m8mL1L2j3kOL0j2qoJ9k4mj1J5Pl1L2L0j2LL3pj9j7R
1626B1j7j9rkRk5j1J5L9Pl8J2M6no2K4K2om0L0J9l0J1L6j5lO0k5JK5mo2J3L3o3
1661a3l5N7j2o2J8N7n8OO6Jn1K4K0l8nJ0l1%M4k0k5O0M0l9jP0k5k7l2L3k0l9%
1694b7Kj4j0lOM9ql5O5L2l0n2M4pn5j5kL5j2l3M5M6J0k3J6N3l9pj0Lk7l7l5N5
1728b0k0j4lO1Mj7K9L8j6l1J5pj2k3k5lK2j1j1L5P0m6J1M9km1KJ1l9n0lRk4L%
$$ plain form
1763 -59 -48 3 -1 -36 17 97 5 -40 65 60 -53 -44 14 -16 -37 -8 -14 6 54 23 18 95 99 8 15 86 25 -88 -34 17 -64 -95
1795 -95 -25 -27 -41 -29 2 14 24 14 -20 22 24 -25 -34 8 -1 -57 -29 26 13 -21 17 74 17 -10 50 65 33 5 11 21 14 -41 -4
1828 -4 5 -22 -35 -6 11 -13 -19 -20 15 31 -20 -11 34 7 -36 -13 35 4 -47 5 19 -22 -32 20 22 27 22 15 21 35 13 -24 3 -1 -53 -55
1864 -55 -3 -35 -37 -34 11 17 14 47 57 70 36 11 20 35 -17 -49 -5 -18 -72 -39 15 -1 -24 27 44 19 29 21 -13 -30 -41 -70 -51
1897 -51 -55 -55 -72 4 41 1 10 65 76 30 60 94 27 -27 2 -13 -47 -55 -30 -39 2 13 11 17 84 37 -16 33 40 -45 -68 -35 -59 -92
1931 -92 -85 -29 -37 -30 3 49 46 47 48 38 47 22 -17 -17 17 -38 -53 -11 10 -28 -11 53 29 10 33 57 1 -22 -5 -29 -53 -34 -39 -65 -32
1966 -32 -3 -19 2 49 28 8 47 77 -21 -12 63 6 -53 -4 11 -56 -25 35 2 -30 45 17 -24 44 41 -37 -17 48 -35 -76 21
1997 21 1 -66 4 62 -41 -36 71 51 -22 29 64 -9 -8 47 -5 -35 8 5 -55 -18 26 -48 -61 47 12 -62 5 75 -18 -44
$$ packed form
1763e9J1N1ml5N3Q0r2m5J05nj13RN8l0k1K9oK0M8l1nP7Mr1PP1o1j13N4N1q1l1
1795i5P0kj4J2L1J2J0j0l4M2Km9rM2rn6K8N5j3l4L8N7n7k7O0J5l2k8OJ0pn5L7
1828dRk7j3K9J7k4ojL5J6n1RM5k7m3K3M8l1n1N2J4m1j0N2KNnpOJ4k2l7K7mn2k
1864e5N2l2kLM5OlL3J0J3l4k5RJ5n2l2M4j3n4L3N4j6k3N1J7k5J0ql4j7j1k9J9
1897e1m%j7P6L7m0RN5J1m6L0L4o7n4K9j5l4qK5rM1J1kOO7m7n3M9Pq5k3L3k4l3
1931i2PN6qPL3M6lJJj0Rk5l9%L4n5j5M2K1l8J7O4k4j9K3K4n6k3J7k4k4J9nk6L3
1966c2K9j6K1M7k1k0L9L0r8RP5n7n9M9J5o7L1O0l3l2P5k8m1O8lp8K0O5q3m1R7
1997B1k0o7P0N8j03NJ07k0p3N1L5p3JN5n2l0M3lo0L7M4p4j3J08l5p4O7P0r3k6
$$ plain form
2027 -44 37 10 -59 -4 2 -33 -10 26 8 -16 54 33 -6 53 72 -5 -3 63 4 -57 -10 40 -56 -67 5 -7 -60 -26 25 -37 -1
2058 -1 28 -28 -28 20 0 -66 -6 28 -56 -47 53 15 -51 38 85 -12 20 78 31 -12 42 30 -21 2 -1 -49 -31 22 -17 -60 26 44
2090 44 -66 -15 58 -16 -45 29 6 -35 -17 30 -34 -13 18 -6 -11 40 29 -8 55 64 -13 8 64 11 -39 15 7 -39 -9 27 -14
2121 -14 -28 31 5 6 3 13 -24 9 32 -14 -33 37 26 -39 5 35 6 -22 31 43 2 -24 28 2 -29 -9 -9 -39 -18 -6 -30 -15
2153 -15 19 1 -29 21 29 -33 -1 43 11 -35 36 67 -15 1 51 16 -36 19 60 -1 -8 41 -4 -8 31 -18 -48 11 15 -57 -37 25
2185 25 -29 -48 12 27 -41 -15 53 -16 -30 4 24 -5 -10 6 14 14 20 -6 0 58 18 -18 28 32 -4 11 35 13 -28 -23 23 0 -19 -19
2219 -19 -7 3 -18 -15 -19 12 11 -19 -6 17 -3 -12 17 27 0 -6 32 43 -4 -8 27 26 1 5 20 0 -17 -14 9 4 -2 -26 -27 -4 -1 -28 -9
2256 -9 13 -14 -24 18 29 -6 -2 29 -9 9 11 -13 -3 1 -13 -13 6 28 -37 -25 0 -3 -34 -11 21 1 -10 8 7 -32 5 12 8 3 11 8
$$ packed form
2027d4Q1k7o9N5Ol5K3L6j8k4P0k1l9N9J9p7KO6n9o1M7N0r6j1P2j2n3L4N1o2L6
2058aK9n6%M8k0o6O0L4q4RJ00l8o6Q9M7r7L2N8m7m3N4j2n1K3lm8J8N3l9m3Q6J8
2090D4j10N1P3p4k9P4k3m1J8M7o4K1L1k4nN1j1l7O3Rp7K1N6n3n0N4qm6L0L6m1
2121a4j4N9k6JlJ0l7L3K3m6j9P0j1o5M4L0k9k8N3J2m1k6N2k6l1K0%l0K1J2k4J5
2153a5L4j8l0N0Qo2L2M4l2m6P1L1q2J6N0l5n2N5M1o1pM9m5mL9m9l0N9Mp2K0O2
2185B5n4j9O0J5o8K6O8o9j4L4K0k9nJ6Q%Ok6ON8m0l6M6Ml6J5K4k2m1NM6k3j9%
2219a9J2J0k1LmL1jl0J3K3k0rK9J0k7oL8J1m7mL5jk5MJ5k0j7LK3nok4jK3Lk7J9
2256iK2k7j0M2J1l5ML1l8J8Kk4J0Mj4%J9K2o5J2K5ll1K3L2k0j1J8jl9L7PmnQl
$$ plain form
2292 8 12 24 3 -8 43 17 -26 3 35 11 -24 7 13 -17 -12 4 -8 -22 -31 -22 -23 11 -38 -37 -6 -1 -14 -14 4 12 -22 -31 20 17 -7 1 34
2329 34 9 4 24 32 14 15 18 32 -17 18 3 -21 4 1 -22 -10 -7 -52 -22 -3 -5 -43 -34 8 -25 -14 -21 8 -15 10 25 -1 14 18 2
2364 2 10 31 28 4 21 11 4 19 12 -2 2 20 -29 -9 21 -2 -5 1 -6 -17 -7 8 -7 -5 17 -6 -26 8 0 -30 -17 22 -16 5 1 8 -10
2401 -10 4 33 -13 7 13 16 -2 12 6 -17 -8 4 -11 -7 17 -8 -12 11 19 21 9 21 -1 13 22 33 -1 -7 4 6 -8 -1 -13 -15 -17 5 -14
2438 -14 -37 -16 -18 -33 -36 4 -4 -40 6 -1 -4 -23 3 6 0 17 31 8 13 36 11 -8 21 47 -2 17 28 1 -7 19 4 -23 -3 11 -10
2473 -10 -7 -4 -18 -3 0 -31 -34 -8 -29 -26 -6 16 -21 -18 5 -2 2 -4 11 -3 -5 16 -4 12 32 -1 1 33 -6 -11 18 18 -20 4 8 6 -26 -17
2511 -17 -5 -8 -20 2 -7 -21 -8 -11 1 -13 -4 10 -9 7 12 3 -4 -8 1 -14 -5 0 -11 -27 -2 1 -8 -14 -2 -5 -18 -1 -2 -18 0 15 1 -2 10
2550 10 17 -9 3 6 3 13 11 5 -5 7 4 -19 -11 -11 -12 -29 -11 -3 -26 -17 -17 6 -12 -19 0 3 -16 6 5 -13 3 7 -6 3 24 20 14 18 31 19
$$ packed form
2292HMJ2k1j1N1k6m3K9L2k4l5L1Ol0NJ6j2j4rRjL4m9JL1Nj3%J8Ql4rN1lk4QL3
2329C4k5nK0Qj8JLJ4m9L5j5k4K5lk3J2Lm5L0J9kl8RM2l3J1pK9k3K5J5k6J5Mj6
2364BQK1lk4J7j0pJ5pj4MJ8m9K0L0k3lOpj1J0J5j5KK2k3k0L4ql0J3L9l8K1mPj8
2401a0J4K9m6K0OLj8J4ok3RJ2j5MK4k5mK3QKj2J2k2J4RJ1l4oJ1Kj4Pj2kkK2j9
2438a4k3K1kj5lM0ql6M6plj9K6LoJ7J4k3NK3k5j9K9K6m9J9J1k7qK6j5k7K0J4k1
2473a0LLj4J5Ll1lK6k1LK0K2l7LK3pMoJ5j4kK1k0J6K0l3KL2l9nK9%l8K4Mkl2R
2511a7J2lj2K2rj4J3lJ2j4RJ4j9J6NrpmRj5RNj1j6K5LroJ2lj3J7jj6J8J5j4lJ2
2550A0Pk6J2LlJ0koj0J2lk3Q%jj7J8Qk3R%K3j8pJ9Lj9K2jj8J6Mj3RK1moMJ3j2
$$ plain form
2590 19 13 12 20 -13 11 2 -10 -13 12 -2 -15 -5 -12 -36 -4 -3 -16 -26 -6 -6 -22 -8 -3 -5 -10 -9 10 1 24 19 14 10 13 16 10 33 14 29 -4 21
2630 21 -4 -8 -4 -1 9 0 -12 -3 3 4 -3 2 -16 -3 2 -5 -11 -4 -10 2 10 3 -8 -5 7 11 -8 -5 -5 -4 12 12 11 8 18 -2 0 -10 12 -9 0 16 1
2673 1 1 18 -5 -7 -5 -5 -11 -4 11 8 -15 -5 4 -10 -13 1 -3 0 4 -16 -6 -6 -8 -10 2 -12 -15 -14 6 -17 15 -15 -8 1 6 -5 -5 12 2 16 14 10
2715 10 3 20 13 -2 3 17 23 8 -2 2 10 5 -12 -1 -21 0 -4 -6 -17 -24 -30 -2 -9 -8 -5 -19 3 12 -7 -4 6 31 22 4 16 17 10 9 20 22 12
2756 12 20 7 -1 7 -4 -4 20 -1 -6 -13 -2 7 -8 -13 4 -22 -13 3 -8 -5 -8 -7 5 -8 5 -11 -4 5 12 2 -4 11 12 12 9 7 -10 24 -3 -2 22
2797 22 15 7 -8 -9 6 4 1 -1 5 -16 2 2 0 11 -1 -4 -1 3 6 -2 -16 6 -19 -20 6 -8 -7 -12 -1 4 -17 -24 9 -13 0 -31 10 -5 17 0
2837 0 -2 4 12 6 16 18 16 17 5 24 0 16 3 10 -6 -14 6 -23 -22 -12 1 -12 -9 -13 7 2 -15 -16 13 3 -13 -20 -4 -10 -6 9 10 9 0 9 18 45
2879 45 4 5 13 26 7 7 3 9 26 5 12 16 -10 -12 -6 4 -9 -26 -18 -10 -11 -19 -2 -7 -7 -4 3 -4 3 -11 6 16 2 5 11 24 8 -6 6 31 0
$$ packed form
2590A9ojQl3K4rj2lK5j4j3J0pk4L2Jj3j0K0%j6J4NknJJ9rK3nnmLLoK3j9J5l3K5
2630B1k5mMLJ0rj2ROJpNj8J3NpoPoJ2Qpj1LJ2Mj9L%JJ6%jlJ0k0Kj0K2k1RJ6j5
2673A%J7k3kK%oPJ5lk3J0Rj4lJ4mLMk0J0%kkJ2j4lJK0k3L2l0PRNj1%J7j0J4km
2715A0pJ7pj5NJ4Oj5j0MQnj7J1k0K1mkj1poK8pJLj4K2Rj9LJ0K5rj8J2JpjJ1Kj0
2756A2Qj3qQj1%K4k1npJ1Rj5nJ7k6RJ6j1LlJJ2j3J3j6PRPj0oJ5J%lkj7L4k7JK4
2797B2pqj5jJ5klkOk1J8%kJ1j2lLMLqj4K2k5jK6j4JnJ1Nk1pL3k2J3l1M1j5K2j7
2837@kOQoJ0KkJj2J9k4J6j3Pj6qK0k9JJ0J3j3LmK0nj7jK9j0j6pJ6oMJ5JjrRRK7
2879D5m1JQJ3j9%mOJ7k1PMk6kOJ0j3j7QQjqJ7n%LPpPj4J7J0j4LOJ3j6j4J2K5l1
$$ plain form
2920 0 5 6 13 4 3 6 13 -1 2 8 6 -9 -22 -1 -1 9 -18 4 9 -14 -5 23 -15 -18 -9 4 0 4 -6 -2 -2 -31 -16 -14 4 11 -6 12 23 -4 0 14
2962 14 -11 -5 -14 8 33 8 5 5 15 3 7 1 7 9 17 22 20 -17 -15 -3 21 0 10 -2 9 14 -6 -26 4 -10 -28 -27 -2 -16 -17 -5 -23 -13
3000 -13 -14 6 -3 3 7 20 28 21 9 10 14 13 2 5 -1 22 1 23 -8 -4 -9 -9 1 9 -26 -11 2 -26 -14 -8 -4 -15 -11 2 -4 12 -14 -11 -2 -1 17
3041 17 -20 -5 9 3 -2 8 5 8 14 24 6 5 28 26 -2 -15 9 -3 3 10 -9 -1 2 -14 -5 -2 12 -19 -13 -8 -22 -12 -10 -19 2 2 -5 -22 4 14
3081 14 -1 6 11 -2 -4 1 0 -9 1 25 2 13 15 -4 -5 16 15 -4 -2 8 3 16 -11 10 2 -16 11 10 10 4 -2 -14 -8 -4 -16 2 -15 -23 -19 -21 -2
3122 -2 -11 6 -1 6 6 -2 10 -8 -1 8 1 -4 -13 6 18 10 13 17 12 16 4 5 -3 6 -18 14 -4 -16 -24 -18 -10 -5 -20 -12 -5 -12 -17 -17 -14 -23 -16 -28 -16 -14 -15 -8 3
3169 3 17 -2 13 19 15 14 18 26 14 14 0 5 -2 -1 -9 -7 -3 1 -6 -5 3 -8 -12 -14 -7 -16 -23 7 -3 -27 -6 5 -8 -7 14 11 3 -21 -6 16 17 -21 -20 0
3213 0 9 -3 2 -8 18 -7 -2 27 26 1 -11 10 12 -1 -3 1 4 -7 -5 14 10 8 4 -1 -3 -15 -27 -23 -10 -32 -41 -2 0 -12 -15 5 1 -11 -3 13 -3
$$ packed form
2920@NJPrjLPj4LOkj5j3K1%J0k7K2Nk3RK8l8lRJ3mMj0M%k9J5KJ8Pj7J8J1k7MJ4
2962A4k5OrK2K5k5l%J0j2MoOKQNkl7KJ2K4k1J0j2J1Nk0k0L0j4j8JK5j4jJ2j8J0
3000a3jK0rOMJ3Qpj2JMjj1LoK3k1K2l1Mn%J0Ql5J5J3k8J2OMj1MJ3oJ6k6LRJJ8
3041A7l7J5J4onJ0lLOJ0j8jK3kk8j3K4j2OPj9QLj6RLJ4l1ONj4J0KrK1%pj7K6J0
3081A4j5PNj3kNjrJ0K4k3J1Kj9jK1jj9KJ0nJ3k7K1qj8K7j%ooj2OMj2J8j7qMkJ9
3122brJ7pP%qJ2j8PRpnrJ9J2qLMnMj2JqRk4L2j8j2qOQNj5QPpn%LrPj2J2KjPJ1
3169CJ4j9J5OmjMQj2%j4NpJqKMMpJQj1mkPrpL0j0k4K1J1j3JK1lqk4J5K2Jl8JK0
3213@Rj2Nj0K6k5NK9jk5j2K1Kj3kMLj1KJ9mkmnkj2j2MJ3k2rL9Kj2lK0mj2QJ6j6
$$ plain form
3254 -3 -11 -26 -9 -10 4 -8 9 5 1 -9 37 21 5 15 36 20 -15 -6 -4 -4 -7 -14 -4 -5 -10 6 0 -2 -15 -9 0 -23 -23 -23 -14 -6 -20 -26 -8 11 14
3295 14 0 14 13 17 8 15 6 -12 6 1 4 -4 -4 17 16 11 5 4 16 14 -8 -16 -2 -22 -38 -10 -23 -12 9 0 3 4 2 -16 -1 -13 -28 -5 -8 -19
3335 -19 -13 -1 2 2 -1 23 -1 14 7 7 21 9 -8 3 -6 12 -9 -1 9 13 1 13 1 10 -10 -17 4 7 3 -12 4 -10 -17 -4 -10 4 -12 3
3373 3 1 3 11 -6 -3 2 -8 -3 -5 -1 5 -1 -1 16 18 0 16 26 -1 19 18 14 -12 10 14 10 -6 -4 -16 5 -7 -25 -3 -3 -7 -14 1 -10 -28 -15 -11
3414 -11 -9 -16 -15 -1 -20 -8 0 20 -1 -5 0 -7 -3 13 -8 7 16 21 -9 10 18 9 29 -5 12 28 -2 3 19 -15 -10 -10 -14 -13 -16 -3 -14 -12 -6 1 -21
3455 -21 0 -12 1 -6 -8 -22 2 16 0 0 8 19 13 11 23 8 16 -2 3 -4 6 7 3 6 -7 1 -5 21 -1 -18 -10 7 -4 -5 -30 -5 -14 -5 -16
3494 -16 -8 14 -6 -25 8 -15 -7 -3 -20 -7 -7 -15 2 -3 4 -13 17 -8 9 15 20 28 8 8 6 4 22 -2 4 11 -10 -3 -9 0 -4 15 -2 1 -14 2
3534 2 -7 -8 -8 -28 -10 3 -34 -33 12 0 -6 -5 -2 -7 -8 10 13 10 -3 11 15 16 15 10 10 12 13 2 21 16 12 28 3 15 2 -24 -7 -1 5 -24 -5 -7
$$ packed form
3254cqj5J7jJ4j2J7mmj0M6j6j6J0K1j6l5RK%lpJ0jnJ6okj3ORk3%%RQj4oJ8J9L
3295A4j4J4jMrPrj8J8nLq%K1jnojJ2kk2qJ4k0j6K8j3J1K1rLJkj8J5j2j5K3lj1
3335a9OJ2L%lK4k4J5p%J4j2j7J1rJ8k1QJ0Mj2J2j2Rk0pK1Lmj5J6j4pJ3oJ4j6J5
3373CkKQj7LNj0NkMOo%J7Kj8J6J0k7K0jmk6K2Mmj6Kj2K1j2j8K2%mpJ5j1j8J3M
3414a1KpJJ4j9J2QK0k1mNpMJ6k1J5RNl0J9QrK0l4J7J6l0NJ6l4N%mJlJ3j1KOPk2
3455b1K1j2J3pkj4K4J4j6%QJ1okJ2j5Qj8NpJ0JmLj3QoK6k2j7QJ7j1jk5K5rRj1
3494a6QK2k0j9L3k3QMj7J3%qJ7nPj7L0k5J7ONQk0%kkJ8k4OPk1PoRmJ9j7Lj5J6
3534Brj%k0J8J3l7JM5j2oJLnjJ8Llj3J4MJjn%KJj1J9nmJ6k5J2j3k6J7OOk9J9k
$$ plain form
3576 -7 -23 -11 -8 3 -23 -27 -8 -3 -19 -5 15 9 -7 -11 -2 -6 1 -10 12 12 2 9 16 13 -11 -19 6 7 14 -9 24 23 -5 7 6 11 5 -5 -18 -2
3616 -2 -22 -4 -4 2 -4 -29 -6 -25 -10 -5 -22 6 -8 -4 5 -4 0 -7 10 11 -11 4 -2 13 4 20 21 0 10 21 14 -5 2 -11 14 -1 -24 4
3654 4 0 -7 -3 -2 11 -11 -6 -9 4 -24 -9 -3 -18 -3 -14 -3 -6 -13 -11 -9 5 -2 -8 2 5 8 -16 7 6 -1 -6 7 7 16 13 -6 4 4 -20 1 2 -10
3696 -10 -4 -10 -3 -11 5 -15 -24 -8 -30 -15 -17 1 -10 -24 2 -3 -9 3 -20 -6 -14 -1 1 0 4 8 -13 7 5 -9 14 19 9 4 8 6 6 14 1 13
3736 13 -16 -20 -12 -12 -3 -6 -19 -15 -1 -4 -4 4 -4 -7 -3 -3 -13 15 -9 -13 -5 6 -8 -6 -6 4 11 8 3 -2 0 14 14 -12 0 -2 -1 3 17 -12 4 -11 9
3779 9 1 1 -1 18 6 -2 8 -14 -14 1 -8 -6 -22 -21 -19 -15 3 -1 -12 -22 1 6 4 -12 -11 -8 -7 13 -2 -5 2 16 1 -12 12 -17 4 13 21 13 3
3820 3 -6 12 6 -5 -18 -12 -10 6 13 -16 -8 -28 -23 -16 -5 -25 -14 -11 -17 -7 -24 -15 -19 -21 -5 -11 -13 1 -6 10 5 13 -5 10 12 13 5 4 27 -6 12 2
3862 2 0 5 11 -13 -5 -12 4 17 -4 -8 -5 -6 -12 3 -21 -1 -7 2 -11 -2 -3 -8 -18 -7 -1 6 -1 1 -2 -11 -18 8 2 7 1 13 -10 8 11 -4 15 8 -6 5
$$ packed form
3576gj6J2LJ1k6mJ9Nj6J4K0oj6mRmPj1K2%j0PPlk4qK5JPk3L3jk8J2jNoj0j3J6
3616bk0J8%Ook5K3j9J5Nj7K8j4MRrMpJ7Jk2J5oJ5rJ6Jk1J0J1pj9Pj3K5j5k3K8
3654DmpMJJ3k2NlJ3k8J5Oj5J5j1J1lpKKJ4poJ0LLk4K3jpnJ3%Rlj9J0%k4K1Jj2
3696a0OoPqJ6k0rJ6k2J5kJ8j1j4K6noJ2k3J4qJ3KjMMk1K0kj4K3Nj0nMk%Qj3J2
3736A3k9mQ%Rlj3MJ4l%QqlM%j0K8k4mQJ1j4K%J0PlnnKJ4%k6J2kJMJ4k9J6j5K0
3779Iq%kJ9j2qJ0k2%J5rKj6JKMJ8mj1j0K3Nkj6JLJK0j5lPJ4j5j3K4k9K1RQqj0
3820CrJ8oj1j3OKJ6Pk9Qk0NPJ1k0J1LoJ0j7RmkJ6okJ4pJ6nQj8J5KJqjK3l3J8j0
3862BkNOk4QpJ6J3k1mLjoJ5k4K0oRj3Rjnj0J1OPpKlrpK6oNoJ2k3J8Lj5J9pj4J1
$$ plain form
3906 5 9 -8 -7 -11 -17 -24 -6 -20 -16 -18 -11 -15 -18 -5 -14 -23 19 -6 -14 -10 -11 -6 -11 8 -18 -11 0 -13 -2 -9 -10 13 -7 -4 4 -4 8 -10 -1 9 2 0 17 28
3950 28 -11 0 6 -5 -4 -20 -16 -21 -9 -27 0 -9 -13 -19 -15 -13 -7 -27 -2 -13 -12 -15 -8 5 4 20 -1 22 -1 -2 4 6 -3 -9 0 0 -2 7 -4 12 14 9 -3
3993 -3 -12 7 -16 -14 -17 -23 -20 -11 -21 -2 -6 -5 -18 -1 -12 -13 4 -20 -1 -4 -7 -5 -7 1 23 13 18 8 7 3 6 30 10 2 22 9 3 -4 0 -21 2 21
4035 21 -12 -18 8 0 -19 2 -6 13 -10 -11 -14 0 -8 1 -3 0 5 -19 -27 -1 0 -8 -17 5 0 5 14 4 0 -1 9 17 -3 9 11 17 -3 10 5 -7 7 -20
4077 -20 -21 -3 -10 -8 -5 -9 -3 -12 -27 -12 -13 -28 -16 -18 -11 -11 0 -16 -20 -23 3 -6 -5 -5 8 14 17 15 17 18 6 -13 15 18 25 10 10 19 1 6 0 -3 -16 -5
4121 -5 -3 -4 1 9 -10 -9 -17 -22 -1 -7 -28 -8 4 1 -15 -12 -3 -1 -6 1 -2 17 1 11 -10 -1 18 -1 -9 28 -9 12 -3 9 2 10 12 -11 2 13 15
4162 15 -2 -11 9 -6 -9 -13 -23 0 3 3 -12 -15 3 -30 -32 -19 -12 -12 -9 -6 -14 -3 -8 6 -8 3 10 6 2 6 1 1 1 13 2 -10 6 9 -8 2 -2
4203 -2 -4 3 19 -4 -20 3 0 -11 -6 -8 -19 -13 16 0 -10 -2 -17 -11 -16 0 -21 -4 -14 9 9 -1 10 8 13 9 22 4 -1 -1 2 21 7 8 -3
$$ packed form
3906EMj7JmopJ8j4MkPmlJ3rrM2k5qMjNnJ9k6PJ1j3J1pjK3k0LQqJ2j8RJ0pkJ7J1
3950B8l9J1Oj1Jj6MnJ2j8K7rmoMKOk0K5j1JlPJ3jJ6k1K3k3jOKroR%kRj1J6Knj2
3993crJ9k3KloLRj0J9mJj3J7j1jJ7k4J9llKkQK2j0Nj0jmLK4k0qK0j3opMk1K3J9
4035B1l3oK6qj9K1qJ9k3jlJ4qRmLNk4qK6JqrK2nNRj0mjJ0Qk0J2KOk0J3nj2J4k7
4077b0jJ8pKLmOrj5J5jj5J2kP%J1j6mlK6rJ%J3OLkKJj2j9K8LPj5%Rj8Nolj3J1
4121eKjNQj9JqnK1ok1K0J2lj6LRKnPlJ9j6J0k1RJ9j9qL7l7K1j5J2pQKk3J3J1K
4162A5j7rK0j5lmj0K3L%j5lJ8l3kJ3P%LLqJ1nJ4j4J1PmmMn%%J2j1j2J6Lj7J0m
4203bkPJ6k3j6K3lj1Nkj1OK9j6j0Qj5OnJ6k1J7j0K3%j0J1kNmJ3j8n%LJ9j4Jj1
$$ plain form
4242 -3 -1 3 7 3 -1 5 15 -12 -17 -3 -21 -30 -5 -13 -18 -17 -15 -7 3 1 -12 -17 -9 -9 -15 9 5 9 -1 -1 -3 23 7 21 12 15 24 -2 11 1 8 24 25 -1
4286 -1 -8 -2 7 15 -8 -5 -13 -20 0 -6 -15 -2 -4 -23 -20 -30 -9 -11 -9 -7 -7 1 13 -15 16 -5 -1 -8 -3 3 -3 -1 1 10 16 11 -1 -1 2 20 4 24 -4 0 17
4331 17 1 -11 -5 -1 -7 -4 -3 -10 -12 -19 -13 -7 -10 -21 -12 -26 -11 -7 -6 -5 -8 1 -22 -11 13 -1 7 7 10 10 8 14 10 -10 15 9 12 9 10 3 14 -16 -4 -8 -5 4
4377 4 -10 5 -2 -9 -8 -10 -19 -11 -12 -1 -6 -16 -2 -10 -18 -19 8 -7 -24 -7 6 4 -2 5 19 12 11 24 2 8 9 9 -9 4 -4 -1 -8 -19 -3 0 -3 -22 -13
4420 -13 -8 -8 -24 8 -12 -9 -18 -6 3 -23 -6 -5 -2 27 -3 -3 8 -4 -2 5 2 10 0 14 4 -1 25 8 12 12 20 3 3 -3 -4 -15 -9 -13 -5 -26 -4
4461 -4 -4 -16 -15 8 10 -9 4 -13 -11 -19 -5 1 -14 -16 -6 6 -16 -10 -11 -10 -5 8 5 13 15 14 -9 0 12 7 4 -5 4 4 14 14 -4 -6 15 -9 -10 -6 -11 4
4505 4 -4 3 -11 -13 2 -30 -13 -9 -24 -18 -38 -22 -11 -25 6 -14 -18 3 5 -1 9 13 8 10 32 13 1 7 26 -3 12 6 -3 14 15 -11 -10 15 -10
4544 -10 -6 -11 -1 -13 -7 -1 4 -6 1 -14 -4 -30 -10 -20 -19 -21 4 -11 -4 -10 -1 -5 -6 5 12 17 23 4 12 -3 -5 5 4 9 -7 15 -5 5 1 -1 -8 3
$$ packed form
4242cKMMmmOJ0k7nJ4j8rK5qnJKQJ0kj3nQ%oK4mMj0%kK6j6J4rLRk6J3j0PJ6Jk6
4286apORQk3LqpK0orJ3kj9Lj0K1kKK%QJ2k8L1k1MpNOoKKROnj2%LJ8j6K0k8MJ7
4331A7j6j2OMoLJpkpOOlj1Rj4J5MJJlRk3J1K4j4Q%L%kOmk0K5oLlJpJ1l0J2mLR
4377Dj4J5ppJkrQjJ1nj0J4qqjK7j5j7J7J3koPJ4pjJ3k2OJ%j8J3qLpj1J6Llj9R
4420a3N%j6L2k0LrJ2Rk6J7JLK9l0%J1j2KPlQj0J4j0nK6j7M%Qj7%ojj1OmQk1K2
4461d%j2JK3Kj9J3j7KqJ4Oj5kJ0J2k2OjJNJ3lQKjk3RJ2nlrR%J0%j8kK1k4jMnJ5
4505DqPj4kJ5l2J7Mj5Ok0J6J1j4L1k0mK1KoJ0MnKK2j9j2OJ9k9J5orJ7Jk6JK5k5
4544a0MnJ0j2OONj0Pj5J0k6K0j0JkK5j5PoRmjJ1PNOj9Qj5kJ0jNj6K2k0J0mkpJ1
$$ plain form
4586 3 -2 1 3 -16 -1 10 -24 -5 -3 -2 -8 -8 9 -19 -28 -26 -17 -16 -7 -10 -9 -13 -17 5 3 4 -13 2 4 14 -18 0 11 13 -5 8 9 26 16 5 14 4
4628 4 -9 -9 -2 -18 -7 -18 -7 -11 -23 -12 -2 -20 -9 -6 -8 6 -32 0 -3 0 -1 -7 12 11 30 10 8 5 -4 14 14 -3 0 3 10 0 11 3 1 -4 7
4669 7 1 -15 2 -1 -11 -13 -15 3 -17 -19 -25 -11 -10 -18 -5 -12 -11 -10 2 -10 -5 3 -1 6 -6 -5 13 1 10 -5 -5 4 -6 11 6 -1 -3 6 3 -2 -1 1 -6 0 -5 -5
4715 -5 1 -11 9 0 -5 -16 -16 -4 9 -3 1 -24 -8 -7 -3 -3 -6 -15 -13 -14 -8 -3 10 4 0 4 -1 10 17 2 8 8 13 11 -11 4 2 3 -9 -1 18 -12 1 -8
4759 -8 -11 -12 3 -9 -3 -10 -3 -7 -10 -8 5 -9 14 12 -13 -8 -2 2 -20 -9 -5 -2 2 2 14 1 17 24 19 -7 11 6 11 6 3 -8 -4 -3 -7 -9 -30 -12 -8 -9 -7
4804 -7 -13 -15 -13 -24 -12 -13 -14 -8 -2 -18 -17 -7 -15 -14 0 6 7 -4 4 -9 0 -7 19 2 3 21 4 8 3 7 -1 -8 3 8 12 14 3 0 -2 -4 -8 -15 4 -21 -14 -11
4850 -11 -14 -26 -26 -12 -14 -10 -17 10 4 -3 -3 -12 5 4 -11 -1 43 23 5 -2 11 -9 -1 -1 2 13 -7 -2 2 -12 -2 14 -1 1 -4 -3 -17 -25 -13 -17 -12
4891 -12 -8 -13 -17 -18 -20 -11 8 -10 0 -20 -6 -4 -15 -16 -12 -1 -9 4 14 17 3 12 22 11 5 24 7 14 7 18 1 1 3 -3 -8 -6 0 6 6 10 -20 -5
$$ packed form
4586CnLKj9J5J1l4J9KJo%J7k8rKRJRlJmmK2kJj7J5KJ0l2J8J1Kj8J3JJ7j0j1Rj0
4628Dj3%Pj6J1j1J1mj2J1J0j8J1LkJ4l8L2lLjoJ9jJ9k0klrJ8%j7LLPj0J1qknJ1
4669Goj6J7lj0kkJ8k0koJ4JqJ3pJJJ2j2NQmPj2JJ8j2Rj5%Rj0J7npkRlnJKpOn%
4715eOj2K0rnj1%J2J3j2Mk5J6JM%lrKjONJ3omMnJ1Pj5O%Nkk2J5kJj2QJ9l0J3r
4759hljJ5j2OpPmlKJ3j4K3kk5NOMk2J1MLM%J2j3J6Pnk6J8nNnlj1MJmkk1J8MjK
4804gokKj1J2jjOOj6JJ0qJJ4OJj1Qj3RpK6j7JJ8j7MnMqpJ1NMKj1lkkmpJ9k5PL
4850a1lj2%J4kMpK7op%rJ7jj5J0M4k0j8pJ3k0Q%LJ1k0NMj4J0J6j5KnJj4qJ2mN
4891a2MnmjkRJ9j8J0k0J4Kj1jMJ1qJ3J0Lj4RJ0j1oJ9j7PpJ1j7%KonKOO%Ml0J5
$$ plain form
4933 -5 -17 -14 -10 -21 -5 -3 -34 -3 -5 3 -11 -18 10 7 4 -7 -5 2 2 -4 5 18 13 4 20 15 11 10 12 7 -9 7 -22 -13 -1 -15 -14 -16 1 -31 -8 -24
4975 -24 -20 -15 -22 -12 4 -5 5 -3 -16 0 -10 6 5 -8 3 8 7 7 -7 5 -6 3 -1 6 4 -9 2 10 14 -1 18 14 1 -11 0 10 -2 -12
5013 -12 -14 -4 -16 0 -17 -30 -33 2 -3 -16 3 -18 -12 -20 -1 11 5 6 -9 -2 3 11 -10 -5 14 21 16 -4 7 1 -1 10 -19 14 -7 19 6 -2
5051 -2 7 -13 4 -2 -5 1 -6 -2 -2 -8 2 -7 4 -13 -21 -12 -8 2 -12 -10 -4 2 7 -10 -2 -2 10 -5 -4 1 14 18 3 25 11 -7 15 2 3 2 14 5 -4
5094 -4 -9 3 -16 -5 7 -7 -1 -9 0 -16 8 0 -12 -21 1 -12 -16 -19 -10 -4 -7 -10 3 2 12 7 -12 -4 -1 -5 7 0 5 6 24 14 7 -3 5 6 8 -13 -25
5137 -25 -24 -26 -16 -14 -9 -9 -3 0 -11 2 -12 -7 -4 -3 -1 -8 -20 -22 -7 -3 -3 10 -8 1 9 2 -2 4 5 0 -2 11 17 4 12 26 -3 -2 5 20 13 0 -3 13 15
5182 15 4 -6 -18 -2 -28 -22 1 -5 3 -10 -2 -5 -7 0 -8 -24 -11 -4 20 -9 -3 -7 -3 11 4 19 32 7 -1 17 18 4 2 -4 3 23 -2 -7 0 12
5222 12 3 -11 -24 -16 -7 -20 -18 7 -22 -5 -11 -14 -8 -17 -12 -19 -1 -14 -10 4 -6 3 -1 3 22 9 19 -1 -1 15 5 18 -9 -7 2 8 6 -7 6 -11
$$ packed form
4933ej2LMj1J6Kl1L1kQj4pK8llj1KP%oRJ3nrJ6nmjKnj6J6k9RJ2j4JkJ7l2K3j6
4975b4MNpJ0J6rJ0qj3J6j0J6jj3J1Nj%j4J2j1RmPkj3J1QMj5J9mj3j2J1J0j2j0
5013a2kJ0j2J6j7j3lL5nj3J9k1OqJ9J2oJj5PNQk1NJ9Pnk0J1okJ1k9L3k1K6j3q
5051bRk0J7olOpM%oJ0rJ1j7qRMJ0j4KOONj7Q%J2j5JNJ3Mj5K2j4j8K2j3JjJ2rr
5094dnJ2j9J1J2j4OqRj6K4qj2rK2j3mlROllJ3jJ0nj9QLmJ2pNJJ8j0pj0QJKk1j2
5137b5JkJ0KN%OLj1J3j4NLJKpj2kJ5M%J3j8RQpmOJnkJ3Oj3QJ4k9JPJ5pj3lJ6K
5182A5j1j0j2J6k6OK3oQj3QlkPqj6J3PK4k9OmMJ4pJ5J3k5qJ8Jj4koPK0k5nPJ2
5222A2rj4j3QRj3KK5k9J7olOrNpJ8j3MJ4j0RmMJ9j3J0k0%J6j0J3k7KROkj3J3j7
$$ plain form
5262 -11 1 -8 -12 -11 9 3 -25 -13 -1 -10 -12 -16 -2 -3 -17 -18 9 2 -17 -7 -13 -12 9 -11 -17 6 1 0 -8 7 11 11 -3 16 19 5 -11 8 -1 3 -6
5303 -6 12 5 -17 -14 6 0 -7 -8 0 -16 -9 0 -10 -10 -2 1 -7 -16 -4 5 -4 10 0 0 -12 -17 -6 0 10 3 -1 14 5 13 20 11 18 29 22 10 18 6 1 -3 0 8
5349 8 -14 -9 0 2 -15 -15 -12 -15 -8 -17 -10 -20 -30 -11 -19 2 3 -5 8 -4 17 7 1 15 9 11 -5 25 2 14 23 0 23 9 26 12 -8 5 2
5388 2 5 0 -14 15 5 -4 -12 -8 -6 -5 -16 -7 -6 -7 -13 9 -16 -8 -12 -20 -5 -4 2 4 10 3 7 9 -6 7 4 19 38 9 5 12 5 4 3 -1 8 -1 3 4 0 8 -7 -24
5436 -24 -3 7 9 -4 -7 -20 3 -26 2 13 6 -6 -13 -8 -4 -1 -10 -7 4 9 -5 -5 13 19 0 10 18 25 3 21 37 12 14 1 -4 14 13 0 9
5475 9 4 1 16 -20 -7 -14 -15 -9 -25 -15 -19 -11 -7 -21 -37 -20 6 1 -2 5 -5 -5 14 3 -3 18 3 9 9 -1 29 7 18 2 4 12 -2 -3 2 0 7
5516 7 14 7 1 7 9 6 -16 -24 -17 -17 -23 -12 -6 -34 -5 -21 -7 -1 -4 5 -5 0 5 18 -1 0 -8 13 0 0 9 19 13 10 8 16 11 18 21 5 15 13 8 8 12 2
5562 2 -10 -5 -4 8 -2 2 0 -9 -3 -17 -3 -4 -10 2 -3 -4 -10 13 5 23 21 -13 5 -1 5 8 20 1 14 15 22 10 2 10 27 10 11 11 2 -1 -2 1 -13 -6
$$ packed form
5262a1J2rmJK0ok8J2J2rkmJ4jj4jK7pj9J0oJK1k0oK3njqJ5M%j4J9Lj4j6J9rMr
5303fJ8pk2LK0opjQj6PRj0%QLqrJ2RrJ4j0%j2nJ1OJ0pmJ5rQPrPJ1pj2Qj2nmLQ
5349Hk2NRKj7%LlPrPj0j0J9qK1JqJ3j2K1j0oJ4oKj6L0k3J2Rk3K3j4J7j4k0J3l
5388BLnj4K9j0rqMKJj1RJjoK2k5QmqJ5JOKOpMKj5J3lJ5J9k9mPpjjmRrMJmQj5j7
5436b4K1J0Kj3lj3K3k9K8J1pj2pNMLrLJ1Nj4%J8Oj9J0QPk2J8J6k5Kj3nJ8jj3R
5475InlJ5l6J3pjOj6J0mQMj4j6J7K6nlPj0%J9j1oK1j5O%j0L0k2J1j6KQj4jNkP
5516GPpoOKlk2qP%oJ1Ok8K9j6J4OlRj0NNJ3j9JqK1j3%RJ0olkQnPLj6J0kn%Mj0
5562Bj2NJJ2j0MkrOj4J4joJ2njoK3qJ8kl4J8oOLJ2j9J3JPj2qQJ7j7J%rljLj4P
$$ plain form
5606 -6 -11 2 5 -21 -13 -4 5 -15 -30 -11 -9 -6 -16 2 -21 0 -10 -1 -7 7 5 -22 5 23 6 6 12 19 11 19 23 1 23 1 -4 -8 -12 10 3 -7 -8
5647 -8 -8 -14 -5 -12 -13 1 1 -3 -2 -11 -11 -13 -7 1 -10 -20 10 11 11 -16 -14 16 3 12 11 14 -10 17 1 -2 20 6 1 6 11 12 15 -10 -3 14 -19 2 0 -11
5691 -11 -3 -5 -15 -20 -5 -19 -15 -7 -3 3 3 -7 3 3 9 14 -8 -7 -18 10 7 -1 10 27 13 15 18 7 -3 0 -21 4 11 11 26 -13 0 16 7 -16
5731 -16 1 1 -13 -14 0 3 -35 -17 -13 -12 -27 -4 -1 0 -7 -13 -10 5 8 0 -7 -2 7 10 8 27 13 2 16 8 12 -5 7 -3 -4 12 9 13 -2 -19 -16 -8
5773 -8 -16 2 -1 5 2 -3 -7 10 -4 -11 -14 -14 3 -2 -24 -2 -16 -13 -8 9 -1 -4 2 -5 10 -12 9 9 12 4 -1 -2 23 19 -1 23 1 12 5 -7 -13 -21 -9
5816 -9 -10 -14 -8 -4 7 -2 -7 -19 6 1 -6 -18 -5 -9 -13 -10 -10 -12 -6 -7 2 11 10 -3 9 3 2 2 5 -2 8 -9 -1 6 8 -5 8 6 3 14 -1 13 -7 4 -11
5861 -11 -9 -10 -10 -25 -22 -18 -11 -6 -10 -22 -20 -6 -8 -8 -12 2 -14 9 6 7 4 14 -7 9 -7 9 -2 6 7 3 22 3 -7 13 8 7 -8 -11 2 -7 10
5902 10 -11 -9 -6 -7 -6 -8 -21 2 -20 -14 -18 -8 -7 -16 -1 -6 12 0 20 -2 7 10 -3 20 15 14 15 5 15 12 10 17 -6 1 -9 7 -3 -1 14 1
$$ packed form
5606fnJ3Lk6QRRk0j5J9KLj0J8k3K1j0RoJ4kk7K7J8j7%OPqQMk2K2k2nmmK2pj0j
5647h%oRpjJ4%mJr%kOQj1j0L0J%k7KL0j3RjLk4K7j6lK2j4nNNJLk5PJ7l3K1kj1
5691a1Qkj0nJ5j4MQMO%j0J0%ONk2Jj1K8lqJ1J7j4KLj1j0Lk1K5P%J5l9J3J6rk3
5731a6J7%j4jJ4Ll8J8MJj5K3LJpoLJ5LqpNRLkJ9j4j1J4qMj7J2j0jJ6lMj5j7LQ
5773hqJ8lOlnmJ7j4pl%J7nk2K2j4LNJ7j0lOpJ5k2K1%LqnjK5mk0K4k2J1pj2oqJ2
5816ijmOMJ1rnj2K5npj2J3mmL%kOjRRjj3J2oj%LpJ0j7QPKj3J3klJ1j5J4k0J1j5
5861a1Kj%j5LMPNmj2KJ4k%mJ4j6K3lJlJ0k1J6j6J6j1QJmJ9j9j0K0njj5lJ3rJ7
5902A0k1KLjJkj3K3k2OmJ0JrJ5nJ8j2K0k2RLj3K3njJj0J0lkPk3Pj0J6j0KJ5j3
$$ plain form
5942 1 1 -14 -15 0 -16 -16 3 0 -2 -10 -12 -13 -10 -14 0 4 3 2 -10 -14 -10 0 2 14 4 1 7 0 17 16 17 8 6 7 0 6 3 -3 3 -13 -11 -10 -2 -14 -9 -12 -4 -5 -8
5991 -8 -11 -15 -8 -11 -15 -14 -5 -9 6 -10 -22 -13 2 -1 3 7 5 8 12 3 9 2 19 25 16 7 16 1 5 -1 14 5 -1 -4 4 -14 -13 -20 -13 -17 -7 -13 -3 -24 -4 -12 -10 -11 -22
6040 -22 -14 -4 -5 -20 21 -1 11 -5 -5 8 6 10 8 -5 9 13 2 31 -1 6 14 11 12 20 2 6 -4 0 -7 0 -1 -3 0 -14 -10 -20 -25 -23 -20 -15 -7 -26 -7
6083 -7 -7 -1 0 13 4 -1 -1 11 11 14 -12 3 16 2 -3 14 19 11 7 0 9 9 3 -9 3 -6 1 5 4 -1 1 -2 -20 -11 4 -1 -2 -11 -1 -20 -16 -4 -18 -14 -6 4
6129 4 -8 4 -2 -8 0 13 -1 -6 7 16 -1 7 10 20 14 -11 14 4 1 -3 -4 -4 -8 9 2 -21 -4 2 1 11 -4 -6 9 -5 -17 -11 -17 -10 -21 -9 8
6170 8 -3 -18 -7 0 -9 17 13 9 -9 7 14 0 11 16 11 12 17 8 10 16 7 25 17 -8 -14 -6 -23 -6 -16 -8 -22 -12 -18 -28 -12 -9 -27 -22 -7 -6 -19
6211 -19 -11 -2 -14 14 9 22 5 -9 -2 1 0 -7 3 14 7 8 7 -17 11 -6 7 -6 4 11 -10 -9 5 4 -6 -6 -2 -27 -10 -9 -29 -24 -16 -18 -22 4
6251 4 -8 -12 -2 -31 -5 -12 -1 -17 -10 9 -1 18 8 10 24 0 14 13 13 11 -7 9 -1 14 6 11 6 9 -3 13 -5 -9 -7 -9 -15 -20 -12 -9 -2 -21
$$ packed form
5942A%j5jJ5j6%J9lkqkjLmJ4Mjjj2mMJ0KJ2j0lOpJ7jJrkJpOloOj6KJQj2NlQjl
5991hlmPlmJRmJ5j6j2RJ5lMMkLMrOpJ7OrrRj5MoJ5rolQj8JpPmJ0oJ0k1K0qKjj1
6040b2QJ0jj5M1k2J2j6%J3kMkj3J4Mj1K9l2PQlJQj8Mj0MpPjkLj4Mj0nKLNQj9J9
6083g%OJJ3rn%J2%Lk6J5J3j4nJ7NqmpR%oj2J2rPMjnKlj8RJ5njrJ0j9MJ2j4MQJ0
6129Dj2J2ooQJ3j4nJ3Rj7QLJ0ok5K5j0lmj%mJ7pk3J7OjJ0j5kJ5j4j2OoPj1J2J7
6170Hj1j5J1PrK6mmj8J6Pj4J1NnJNrKOrJ8qk5oQj7J7j0Qj4J0oj0J6Lj8NJ5Jj3
6211a9QRj2K8nJ3j7j4PLjpJ0J1pJjk4K8j7J3j3J0Pk1JJ4jj0%Mk5J7Jk0NQkmK6
6251Dj2mJ0k9K6pJ1j6PJ9j0J9j0KJ4k4J4j%kj8J6j0J5qNnLj2J6j8mKkonQLPj9
$$ plain form
6291 -21 -3 -16 -12 -18 -13 -17 -18 2 -5 4 3 5 -12 -2 -8 5 17 4 6 12 2 9 10 3 -4 14 0 29 1 -7 0 -4 0 6 -11 -7 -11 -16 -2 -7 -7 -2 -10 -4 -14
6336 -14 -13 -8 -9 -11 -1 -6 -3 25 0 -4 1 2 -19 -2 -1 15 8 23 -5 4 18 3 -2 16 14 0 -4 -3 1 -12 -18 -15 -11 -33 -12 -13 -16 -9 -10 -4 -10 0 7 -14
6380 -14 -1 -6 -17 -15 13 0 -8 -1 -8 -8 3 -5 12 -2 -2 -9 11 4 5 11 7 4 11 -9 -6 -5 3 3 -9 -15 -1 -10 -6 -6 -2 -7 -25 -12 -13 -29 -23 -8 3 -17
6424 -17 6 5 -3 -17 -2 -6 -20 4 -4 6 -10 12 27 26 9 2 4 -13 -6 -3 5 -4 12 -13 -5 5 -2 -8 -2 3 -9 -13 -8 -17 -17 -2 -21 -12 -8 -4 -9 -4 -2
6467 -2 4 -10 -25 -29 6 1 -6 8 6 -4 13 29 10 7 3 3 7 5 -10 -6 -17 -3 8 18 -3 12 7 -4 -11 -9 -18 -3 -21 -16 -11 8 -1 -9 5 -12
6507 -12 4 6 -9 -4 -4 -8 -1 9 -7 -6 -1 2 5 12 8 0 5 10 13 4 3 9 -5 1 14 -1 -11 7 -7 -8 -13 -11 -18 -24 -32 -7 1 -22 -8 -8 -13 -4 -4 -7 -12 -1
6553 -1 0 8 1 0 7 2 -1 8 1 18 0 10 15 5 0 4 9 -10 15 10 9 0 -14 -2 8 10 8 -2 -14 -7 -12 -2 -7 -34 -6 -9 -20 -17 -1 -9 -14 14 -7
6596 -7 -7 -8 -27 -3 -5 0 15 21 6 11 -3 -5 -4 0 1 9 -11 -4 5 -1 -27 -3 4 -5 -23 3 9 -9 -16 -26 -3 0 -25 -22 -17 -13 -10 -27 -10 -27 -6 -15 -33
$$ packed form
6291b1J8j3MoNmjK0pRjKj7J0oJ3J2j3KOj0PJppJ8j4K9k8qPmMOj7MmnJ4n%NqOj0
6336a4JNjkJ0nLK8k5mNJk1J7JJ6pJ5k8RJ4j5nJ8kj4mJMj3oLMk2K1jlPjOoJ0Pk1
6380a4J3nj1KK8j3qPp%J1qJ7j4%pK0pJOmlPk0LJQ%j2oJ4rM%Mnj8J3jj6OJ5J1k0
6424a7K3jqj4J5mj4K4qJ0j6K2J5jj7pKj7PLQrJ6k5QJ0poONj2mNr%J5j9RMMnNK
6467bOj4j5mL5npJ4kj0J7J6j9lm%Mkj5Mj1J4J1J0k1J5nj1pKrJ5j8NNJ9rqJ4j7
6507a2J6Kj5N%mPJ0j6JNLLPmqNNLrjOj4OJ3j5j0J8j4jnKpoqK5Qk3J4%nR%lnJ1
6553aJQpjPnlRpJ7j8J0Nj0nMNj9K5njrj4J2J0Kkj0j2PnJ0nk7K8lj1LJ6qnK8k1
6596g%jj9K4kNJ5Oj5Nj4kJMJQk0PRok6K4Prj8K6Oj8pj0K3Lk5LNMLj7J7j7K1rj8
$$ plain form
6639 -33 -10 -21 13 1 8 13 -21 27 13 11 0 -4 -6 6 8 2 -1 4 6 -12 -9 -19 -6 -15 -21 -10 1 -14 -13 -4 -16 -28 -4 -13 -13 0 -12 -2 -13
6678 -13 -21 -19 -13 -24 -3 -8 3 -3 -6 20 12 1 4 14 16 2 12 22 18 20 5 4 15 13 8 10 -1 6 -5 -16 -18 -24 -27 -19 -7 -17 1 -8 -14 3 -23
6719 -23 1 -9 -4 19 -12 -1 -7 -7 -14 1 23 -10 -1 9 5 8 1 -24 14 9 19 0 -2 8 12 -6 -7 -4 -20 4 -1 -8 -14 -19 -17 -11 3 -3 -5 -6 -8 -12
6761 -12 -11 -4 0 -3 3 0 3 -7 -3 0 -22 8 4 6 9 -11 5 15 3 2 -2 0 19 4 -8 2 10 2 -2 -4 -8 -14 -5 -7 -4 -5 -7 -15 2 -17 -17 -12 -2 -9 -3 4
6807 4 12 3 -20 -10 9 6 13 22 1 8 13 8 14 21 12 19 5 4 -8 -11 -5 -6 11 -5 -12 0 -6 -10 -6 -22 -6 -12 1 -8 -11 -8 -10 -16 -14 -20 -8 -15 -8 1 0 -22 -2
6854 -2 1 -3 -6 -8 7 20 8 18 4 20 0 19 15 33 6 13 11 12 1 -13 -7 -18 -22 -6 -13 -8 -3 -13 -12 -18 -1 -8 6 4 -24 -13 -3 -1 8 10 5
6895 5 13 21 2 -4 1 -3 -2 4 15 11 -9 15 17 9 12 -11 -3 10 -7 2 -14 -10 3 -12 -20 -7 -20 -13 -15 -9 -20 -12 -17 -24 -13 3 -24 -27 -3 -1 12 13 -1
6938 -1 6 19 -7 10 -5 -9 -5 2 -1 1 -13 -20 6 10 1 1 -6 11 0 -7 -7 -10 -18 -9 4 -9 -8 -20 -24 -17 -9 -24 -16 -12 -22 -16 -12 -25 -6 -15 5 19 -6
$$ packed form
6639c3K3j1L4j2PNl4M8j4kj1mkJ2KolNKj8Lj0J3roJ1J1j5JRj2j2K4r%J3j2J0j1
6678a3qKOj1K1nJ1olK6qj1LJ0Kj4J0J0mKj5jJ1knKj1Pj1j1kolQJ2j0J8roJ7k6
6719b3K4j0NK3l1J1o%pJ5K2l3RJ0mLpk5L8nJ0j9kJ0Mj8jLj6K4nponKOJ4okjkm
6761a2JPMlOlLj0MLk2L0mKLk0J6J0j2jmKJ9j5j2J0QqmkmoRkLjkqJ7j9%NJ0pOP
6807DQrk3J0J9lPRk1PNnOPrPj4jj2lOjJ7j6pJ2omMj6J6oJ3rlLkoKoJ2pPRjk2K0
6854bLmlkJ5J3j2J0j4J6k0J9mJ8k7PkJj1j4Oj1mJ6pNNj0JoJ7pJ4kk8J1J0KRKn
6895EQQj9oNmJOJ1mk0K4KqLk3QJ3j7Rj6MJ3j5qJ3j3PkOj1QnpJ1J6k7lK4KJ3Jj4
6938aPJ3k6J7j5mMPlKj4pK6Mr%pJ7j1p%lqRJ3j3Jj2mPQj5QMj0OMj3J9rK0J4k5
$$ plain form
6981 -6 -2 7 -3 4 3 21 -1 -1 -10 -6 1 -10 3 -10 -4 4 6 6 -5 0 -6 1 -11 -24 0 -11 -8 7 -4 -9 1 -6 -18 -15 -25 -16 -22 4 -10 -17 -16 -1
7023 -1 -15 6 -7 -4 13 -4 -7 2 16 4 13 4 16 24 -5 17 -9 10 3 -15 0 -20 -5 -5 -7 -5 -19 -19 2 -3 -9 -18 11 -17 7 1 1 1 -18
7062 -18 -9 0 -5 2 -23 -4 -11 3 4 10 16 7 9 20 3 14 8 11 -2 3 -4 11 -3 -2 5 -17 -8 -5 -10 -2 -12 -2 -19 -27 -10 -8 -19 -13 -15 -4 2 -4 -1 -14
7106 -14 -3 -4 3 -14 -5 -6 9 6 7 3 -1 -8 -3 5 10 4 1 -10 10 4 9 15 -4 0 11 -15 -32 -18 -19 -27 -14 -18 -27 -12 -5 -6 -9 -24 -4 -9 -1 -2 0 0 -4 10
7152 10 13 -9 14 12 11 7 -4 6 1 -2 -1 4 -9 6 -20 -1 -16 1 7 -2 -3 -17 -20 -13 -13 -14 -19 -9 4 -13 9 -15 -20 -10 -11 -11 -14 -2 -18 -10 9
7193 9 5 5 18 -3 6 8 17 2 11 16 22 6 19 1 -7 8 -2 -1 9 -11 -12 -10 -9 -1 -10 -7 -18 -27 -15 5 -11 -25 -22 12 -7 -3 2 -6 -1 -5 10 -8
7235 -8 7 -8 6 -6 20 14 3 20 13 7 26 20 9 11 4 -2 8 1 10 0 -1 11 -12 3 -3 -18 -5 -3 -18 -14 -19 -26 -6 -7 -11 -4 -15 16 -1 5
7275 5 -8 -12 -8 -1 -1 -5 0 -2 12 6 -10 8 18 2 9 15 -4 -4 0 -3 -20 9 3 -12 0 -9 -12 -8 -10 -15 -20 -8 -13 -15 -28 -12 -28 -12 -11 0 1 -16 -12
$$ packed form
6981fMRj0PjJ8k2%rMPj1J3j3OQK%j1NoPj2j3K4j1LJ5j1nJ0pj2Lj0RoK6j4pJJ5
7023aj4K1j3LJ7j7lRJ4j2RrJ2Qk9K2k6J9pj8J5k0J5%kKj4%K1norK9k8K4o%%j9
7062a8RRnPk5J9pJ4JOOrKJ1j7J1oLj3NpJ5j4JPk2RLnQj0J0j7qJ7Kj1OkJ1OoLj3
7106a4J1jPj7RjJ5lJmmpNQNolj1K0oNOj9MJ1k6j7J4jqJ3mrJ5Pjlj5K0nQjK%mJ4
7152A0Lk2K3kjmj1J0nlJNj3J5k6J9j5J7Orjj4lP%jnJ0J3j7K2k4nJ0j%lJ2j6QJ9
7193Im%J3k1RKRj5RNOj6J3j8qJ5j0JJ0k0jKJQrLj1rJ2K0j6j4LL4j9MNqNmJ5j8
7235hJ5j5J4j2K6oj1J7poJ9oj1KpoJ0pRj0jJ2k3J5oj5J3Kj5MnpK0jmPj1L1j7O
7275Ej3mMP%mNkJ4oj6J8J0j6POj9%Mlj7K9oj5J2rlMknnJ2nkj3J6j6J6JJ1Jj7M
$$ plain form
7318 -12 7 1 -5 2 -17 21 5 20 6 9 18 17 7 -1 4 1 18 -8 -14 5 -2 -3 3 -1 -8 6 -7 -11 -10 -11 11 -8 -14 -20 -14 -8 -4 -4 -3 14 5 -19 -1
7361 -1 -22 14 8 -7 16 -6 7 -2 -6 9 17 23 -7 3 11 -14 5 -9 -6 3 -2 -12 -12 -7 -12 -17 -6 -6 -18 -11 -8 -19 -5 -17 -19 -2 10 -13 2
7400 2 -10 0 7 -7 -6 -9 3 -10 -7 4 -7 16 -1 18 12 3 -7 -3 13 6 3 12 -8 -4 -1 -6 -7 -21 -16 -26 -6 -21 -25 -2 -21 -22 -17 -10 -11 -16 -20 -13
7442 -13 -7 -15 -21 5 2 3 -4 -12 1 10 -1 0 -4 -2 7 6 13 19 19 13 0 -9 -15 -12 -2 8 1 -8 -9 -6 -20 -14 -26 -33 -15 -23 -1 -23 -15 -25 -7 -13 -13 5 -7
7487 -7 3 1 7 2 17 -1 16 6 11 8 6 1 16 2 -5 -3 0 -1 -6 2 -9 -5 -3 -10 -28 -18 -5 -7 -8 -19 -5 14 -5 -15 -16 -13 -9 -10 -15 -14 -18 -6 0 -5
7531 -5 -4 9 9 -15 6 -1 13 -5 -16 9 22 9 12 1 0 5 -1 -12 -14 -19 7 -18 -16 3 -10 -16 -12 -4 -21 -15 -16 15 -12 4 -8 -10 -23 -7 -7
7570 -7 15 2 -1 -5 1 13 3 19 11 10 10 23 2 17 11 2 -9 7 19 0 0 -7 -11 1 5 -15 -11 -16 -16 -27 -11 -21 -14 -6 0 0 -22 -18 7 -14 8
7611 8 -6 -11 2 2 6 10 1 6 -7 9 23 7 13 10 6 16 5 11 0 -1 18 -5 -9 -9 -14 3 11 -17 -1 -33 -5 -17 -3 -20 -14 -13 -11 -16 -1 -13
$$ packed form
7318a2J9ooPj9L8j6J5j4LRjj0qNlJ7k6oJ9pjOmpJ4j3mJjK2j9ooOOM%JJ7rk4J8
7361ak1L6oj5K3k2J3rmJ5QOl0J0Qk5J9j4LRnj0%NnnJ1%j2PLj1J4j2kJ7J2k3J5
7400Bj2J0Pj4JlJ2j3LJ1j1K3j7J9orj0MJ6plRk0MLnjj4Nj0K0j5mK3j9jNPjnmP
7442a3OqoK6lJpqJ3Rj1JmKRjPO%oj3roLJ0J0prjLj4Oj2pJ8qK2k2Qj0J8o%J8j2
7487gJ0kOnJ5j8J7j0NlknJ5j4pKLjnQj1MKpj8J0J3kjj1J4J9j9j0jLMjnJmJ2On
7531eJJ3%k4K1pJ4j8j1K5J3j3Lj1jNoj1knK6k5KJ9j3oMQj7OjL1k7J6j2kj3J6%
7570gK2j3lmOJ2j0J6qj%J3k1J5orj1J6J2j9%pmJ2Mk0Mn%j1J6j0PQO%k2MK5k1K2
7611Hj4nJ3%MMrNj3J6J4j6OlmJ0j1Oj1jJ9k3m%nJ7Qk8J6l2K8j2J4j7OJKnJ5j2
$$ plain form
7651 -13 -31 -15 -3 -16 -11 1 -3 -5 -2 3 -11 11 22 7 6 10 8 -7 -7 -1 -6 1 -6 -8 -10 7 -9 2 -2 -11 -18 -22 -10 -19 -23 -5 -19 -20 -8 -33 -11
7692 -11 -7 -22 -9 -20 -21 -13 4 -7 1 3 0 5 -4 8 -14 8 -11 4 13 7 4 -8 7 -16 6 2 -7 -5 -9 -1 -4 -7 -13 -21 -18 12 -7 -20 -19 -14 -4 -25
7734 -25 -9 -5 -17 -15 -2 -23 -8 2 -13 -9 -10 -10 11 9 6 16 5 8 13 -7 -2 -1 16 12 -10 2 -3 15 -4 -12 -18 -10 7 -9 -9 -16 -35 -17 -4
7773 -4 -10 -22 -14 -18 -13 -7 4 -17 17 10 -5 4 5 10 -8 10 0 15 9 -1 18 16 5 -5 23 16 9 22 3 -7 9 7 -15 -2 -3 -10 -2 -26 -23 -37
7813 -37 -15 -18 -8 -17 -16 -18 -4 -6 -5 12 0 -22 5 3 -9 8 -6 -2 22 4 17 -6 10 13 11 3 2 2 -11 -16 14 -9 -9 10 -8 -4 -7 -19 -3
7852 -3 -16 -17 -19 -5 -16 -19 -29 -20 -6 -22 1 -16 -1 -10 3 -14 12 -21 -2 -2 -9 17 13 8 12 6 20 8 14 6 2 -13 -13 14 11 -7 -23 -8 -27
7891 -27 10 -1 4 -5 -8 -19 6 -5 -11 -10 -4 -15 -19 -27 6 -3 -6 -12 -7 -7 1 -1 -2 1 -2 -2 -9 6 6 19 10 13 4 3 7 0 -1 8 -14 9 -23 -14 -1 -3 -10 -14 -20
7938 -20 -11 -24 -23 -23 -18 -2 -22 -15 -18 -21 -3 -3 3 5 -5 3 2 5 -5 -14 10 3 -17 7 -3 6 8 6 17 14 13 7 2 -9 4 -6 -18 -5 -5 -11 -6 -26 -25
$$ packed form
7651a3j8J6J2j3NJ2mkLNj4K2J1j5jMkj5%OnPpkkJ7j6J1mrpmJ2rmJ8j4jJ2k5K2
7692a1Mj5J3j1jQJ7j1QKlNrJ2k2K2j9J5Rolj2J5k3K2mrKmQlloqLL0j9j3JNJ0k1
7734b5J6Mj2KJ3k1J5J0j5Mj%K1klJ0j1LNk0NJJ7mk2J2nJ8j9qoQJ7j6%pj9J8J3
7773doj2QmNOJ1k1L4pj5RJNj8J8j0J5oj0J9kj1j0K8ppJ3j9j0J6kk2J3jpQk4Lj4
7813c7K2lJ0rJkJ4kJJ7j2k2K7kj2J7j4MK4j8J3k3J6Lkqj%j3nL0k3%J9j8Mlj2J6
7852cj3jkJ4j1lj0RJ4j6K3j7J5rJ3j7K6l3J9%pK6mnMoJ4j2Oqmj5%K7lj8j6J5j9
7891b7L7j1Nrlj1K5j1oJOj1mqL3rloN%QkjLl%pJ5%J3rLrjMpjRk2K3l2RJ3kpmo
7938b0Rj3J%NJ6k0PllJ8%OKj0QjLj0rK4pk0K4j0RKkJ1ljonj1J3j0j2J3%oNk0J
$$ plain form
7981 -25 -31 -15 -22 -17 -8 -28 -13 -28 -2 -15 -1 -10 -16 -10 -14 -6 9 -4 3 6 0 9 11 12 5 -5 -5 12 20 6 -9 -3 4 -1 -8 -8 -15 -3 1 -22 -14 -24 -7
8024 -7 -7 -18 -9 -18 -15 -12 -4 -18 -30 -15 1 -26 -9 -9 -21 -12 13 7 7 9 5 0 -10 -4 13 8 -2 -1 -3 -5 14 -2 -13 -13 17 -6 -32 -17 -9 3 -11
8065 -11 -24 -6 -5 -27 -22 -16 -9 -24 -9 -9 -21 -15 -4 -15 -20 -6 3 -19 -5 9 -3 8 7 11 11 13 13 9 13 9 20 16 3 -7 2 -12 -11 -14 -11 -1 -9
8106 -9 -10 -12 -14 -4 -11 -18 -18 -19 -3 -2 -4 6 -14 -14 -1 -16 3 13 12 -24 3 5 7 -4 -10 -2 11 9 -1 -4 4 -3 10 1 -6 -3 -4 5 5 -11 -14 -8 -5 -5 -10 -11
8152 -11 -28 -27 2 -4 -23 6 2 8 -7 4 -10 -1 13 8 -6 8 12 7 -9 -9 -4 16 16 0 -2 -1 2 4 10 3 4 11 -6 12 11 15 -1 -5 -5
$$ packed form
7981b5oJ6pNRk0J5j5K6j3J4roOmQJ5j3PLoRKJpj0%J7Qj4j5OPnp%pJ2Mk3Qj0J7
8024g%j1RrLLQj4j2J5J6k7J7%j2RK5o%Kmnj0OJ7nj0JkkJ9j6j1%L0k3k6J5QJ2j4
8065a1j3J8Jk2NOPj5J5%j2OJ1j1nJ4Rk2J4J4j2J1jM%K%mMmJ1mj3j0Rj4JlLJ0q
8106ijkkJ0pp%jJ6JkJ0k0%J3j5J9J0jl6K7KKj1oQJ3kj0lQpJ3rpLjR%j6lOL%nj
8152a1j7JK9oj9K9mOj5J1j4RJ4nj4J4Mnj6%NK0%j6kJLKOpJPj7J8jMj6m%
8191e
##END NTUPLES=NMR FID
##END=
