##TITLE=1H_AM_NV37VAP
 CDCl3
 8 sc, 
 18.4.2023
##JCAMPDX= 6.0         $$ Bruker NMR JCAMP-DX V2.0
##DATA TYPE= NMR FID
##DATA CLASS= NTUPLES
##ORIGIN= UXNMR, Bruker Analytische Messtechnik GmbH
##OWNER= root
$$ XWIN-NMR		Version 3.5
$$ Tue Apr 18 15:45:35 2023 Russian Standard Time (UT+4h)  she@DPX200
##.OBSERVE FREQUENCY= 200.13135
##.OBSERVE NUCLEUS= ^1H
##.DELAY= (6, 6)
##.ACQUISITION MODE= SIMULTANEOUS
##.ACQUISITION SCHEME= undefined
##.AVERAGES= 8
##.DIGITISER RES= 18
##SPECTROMETER/DATA SYSTEM= spect
##.PULSE SEQUENCE= zg30
##.SOLVENT NAME= DMSO
##.SHIFT REFERENCE= (INTERNAL, DMSO, 0, 15.7039)
##AUDIT TRAIL= $$ (NUMBER, WHEN, WHO, WHERE, WHAT)
$$ ##TITLE= Audit trail, XWIN-NMR		Version 3.5
$$ ##JCAMPDX= 5.01
$$ ##ORIGIN= Bruker BioSpin GmbH
$$ ##OWNER= she
$$ F:/spectra/data/she/nmr/H-F/1/audita.txt
$$ ##AUDIT TRAIL=  $$ (NUMBER, WHEN, WHO, WHERE, WHAT)
(   1,<2023-04-18 15:44:27.07 +0400>,<she>,<DPX200>,
      <created by zg, POWCHK disabled, PULCHK disabled
       configuration hash MD5:
       00 E9 B6 7A A2 85 ED C7 34 08 36 98 17 FE 4E 26
       data hash MD5: 16K
       3B 75 A9 81 95 16 DE E6 2A 3C 92 FF 9A 3D 69 A1>)
$$ ##END=
$$ 
$$ hash MD5
$$ CA 6F BB 60 3E 13 0E 90 FC A5 79 17 CB AC A4 EF
##$RELAX= 
##$RELAX= 
##$RELAX= 
##$RELAX= 
##$RELAX= 
##$RELAX= 
$$ Bruker specific parameters
$$ --------------------------
##$DU= <F:/spectra>
##$EXPNO= 1
##$NAME= <H-F>
##$PROCNO= 1
##$TYPE= <nmr>
##$USER= <she>
##$AMP= (0..31)
100 100 100 100 100 100 100 100 100 100 100 100 100 100 100 100 100 100 
100 100 100 100 100 100 100 100 100 100 100 100 100 100 
##$AQSEQ= 0
##$AQ_mod= 1
##$AUNM= <au_zg>
##$AUTOPOS= <>
##$BF1= 200.13
##$BF2= 200.13
##$BF3= 200.13
##$BF4= 200.13
##$BF5= 200.13
##$BF6= 200.13
##$BF7= 200.13
##$BF8= 200.13
##$BYTORDA= 1
##$CFDGTYP= 0
##$CFRGTYP= 5
##$CHEMSTR= <none>
##$CNST= (0..31)
1 1 145 1 1 1 1 1 1 1 1 1 1 1 1 1 1 1 1 1 1 1 1 1 1 1 1 1 1 1 1 1 
##$CPDPRG= <>
##$CPDPRG1= <>
##$CPDPRG2= <>
##$CPDPRG3= <>
##$CPDPRG4= <mlev>
##$CPDPRG5= <mlev>
##$CPDPRG6= <mlev>
##$CPDPRG7= <mlev>
##$CPDPRG8= <mlev>
##$CPDPRGB= <>
##$CPDPRGT= <>
##$D= (0..31)
0 1.2 0 0 0 0 0 0 0 0.06 0 0.03 0 0 0 0 0.0002 0 0 0 0 0 0 0 0 0 0 0 0 
0 0 0 
##$DATE= 1681818266
##$DBL= (0..7)
120 120 120 120 120 120 120 120 
##$DBP= (0..7)
150 150 150 150 150 150 150 150 
##$DBP07= 0
##$DBPNAM0= <>
##$DBPNAM1= <>
##$DBPNAM2= <>
##$DBPNAM3= <>
##$DBPNAM4= <>
##$DBPNAM5= <>
##$DBPNAM6= <>
##$DBPNAM7= <>
##$DBPOAL= (0..7)
0.5 0.5 0.5 0.5 0.5 0.5 0.5 0.5 
##$DBPOFFS= (0..7)
0 0 0 0 0 0 0 0 
##$DE= 6
##$DECBNUC= <off>
##$DECIM= 32
##$DECNUC= <off>
##$DECSTAT= 4
##$DIGMOD= 1
##$DIGTYP= 9
##$DL= (0..7)
0 120 120 120 120 120 120 120 
##$DP= (0..7)
150 150 150 150 150 150 150 150 
##$DP07= 0
##$DPNAME0= <>
##$DPNAME1= <>
##$DPNAME2= <>
##$DPNAME3= <>
##$DPNAME4= <>
##$DPNAME5= <>
##$DPNAME6= <>
##$DPNAME7= <>
##$DPOAL= (0..7)
0.5 0.5 0.5 0.5 0.5 0.5 0.5 0.5 
##$DPOFFS= (0..7)
0 0 0 0 0 0 0 0 
##$DQDMODE= 0
##$DR= 18
##$DS= 0
##$DSLIST= <SSSSSSSSSSSSSSS>
$$ [...]
##$SUBNAM2= <"">
##$SUBNAM3= <"">
##$SUBNAM4= <"">
##$SUBNAM5= <"">
##$SUBNAM6= <"">
##$SUBNAM7= <"">
##$SUBNAM8= <"">
##$SUBNAM9= <"">
##$SW= 18.05172834244
##$SWIBOX= (0..15)
0 0 2 0 0 0 0 0 0 0 0 0 0 0 0 0 
##$SW_h= 3612.71676300578
##$TD= 16384
##$TD0= 1
##$TE= 0
##$TE2= 300
##$TE3= 300
##$TEG= 300
##$TL= (0..7)
0 120 120 120 120 120 120 120 
##$TP= (0..7)
150 150 150 150 150 150 150 150 
##$TP07= 0
##$TPNAME0= <>
##$TPNAME1= <>
##$TPNAME2= <>
##$TPNAME3= <>
##$TPNAME4= <>
##$TPNAME5= <>
##$TPNAME6= <>
##$TPNAME7= <>
##$TPOAL= (0..7)
0.5 0.5 0.5 0.5 0.5 0.5 0.5 0.5 
##$TPOFFS= (0..7)
0 0 0 0 0 0 0 0 
##$TUNHIN= 0
##$TUNHOUT= 0
##$TUNXOUT= 0
##$USERA1= <user>
##$USERA2= <user>
##$USERA3= <user>
##$USERA4= <user>
##$USERA5= <user>
##$V9= 5
##$VALIST= <valist>
##$VCLIST= <CCCCCCCCCCCCCCC>
##$VD= 0
##$VDLIST= <DDDDDDDDDDDDDDD>
##$VPLIST= <PPPPPPPPPPPPPPP>
##$VTLIST= <TTTTTTTTTTTTTTT>
##$WBST= 1024
##$WBSW= 4
##$XGAIN= (0..3)
0 0 0 0 
##$XL= 0
##$YL= 0
##$YMAX_a= 450602
##$YMIN_a= -674672
##$ZGOPTNS= <>
##$ZL1= 120
##$ZL2= 120
##$ZL3= 120
##$ZL4= 120
##$ABSF1= 10
##$ABSF2= 0
##$ABSG= 5
##$ABSL= 3
##$ALPHA= 0
##$AQORDER= 0
##$ASSFAC= 0
##$ASSFACI= 0
##$ASSFACX= 0
##$ASSWID= 0
##$AUNMP= <proc_1d>
##$AZFE= 0.1
##$AZFW= 0.1
##$BCFW= 1
##$BC_mod= 2
##$BYTORDP= 1
##$COROFFS= 0
##$CY= 11.3945322036743
##$DATMOD= 1
##$DC= 2
##$DFILT= <>
##$DTYPP= 0
##$F1P= 15.7292609196834
##$F2P= 12.9074282941183
##$FCOR= 0.5
##$FTSIZE= 0
##$FT_mod= 4
##$GAMMA= 1
##$GB= 0.15
##$INTBC= 1
##$INTSCL= 1
##$ISEN= 128
##$LB= 0.24
##$LEV0= 0
##$LPBIN= 0
##$MAXI= 10000
##$MC2= 0
##$MEAN= 0
##$ME_mod= 0
##$MI= 1.114404
##$NCOEF= 0
##$NC_proc= 0
##$NLEV= 6
##$NOISF1= 3.799351
##$NOISF2= 2.8
##$NSP= 1
##$NTH_PI= 0
##$NZP= 0
##$OFFSET= 15.70392
##$PC= 1
##$PHC0= -19830.5
##$PHC1= 13.40081
##$PH_mod= 1
##$PKNL= yes
##$PPARMOD= 0
##$PSCAL= 0
##$PSIGN= 0
##$REVERSE= no
##$SF= 200.130013532006
##$SI= 16384
##$SIGF1= 3
##$SIGF2= 2
##$SINO= 400
##$SIOLD= 16384
##$SREGLST= <1H.CDCl3>
##$SSB= 0
##$STSI= 0
##$STSR= 0
##$SW_p= 3612.71676300578
##$SYMM= 0
##$S_DEV= 0
##$TDeff= 0
##$TDoff= 0
##$TI= <>
##$TILT= no
##$TM1= 0
##$TM2= 0
##$TOPLEV= 0
##$USERP1= <user>
##$USERP2= <user>
##$USERP3= <user>
##$USERP4= <user>
##$USERP5= <user>
##$WDW= 1
##$XDIM= 8192
##$YMAX_p= 0
##$YMIN_p= 0
$$ End of Bruker specific parameters
$$ ---------------------------------
##NTUPLES= NMR FID
##VAR_NAME=  TIME,          FID/REAL,        FID/IMAG
##SYMBOL=    X,             R,               I
##VAR_TYPE=  INDEPENDENT,   DEPENDENT,       DEPENDENT
##VAR_FORM=  AFFN,          ASDF,            ASDF
##VAR_DIM=   8192,          8192,            8192
##UNITS=     SECONDS,       ARBITRARY UNITS, ARBITRARY UNITS
##FACTOR=    0.0002768,     1,               1
##FIRST=     0,             0,               0
##LAST=      2.2672688,     0,               0
##MIN=       0,             -674672,         0
##MAX=       2.2672688,     450602,          0
$$ Real data points
##PAGE= N=1
##DATA TABLE= (X++(R..R)), XYDATA
$$ plain form
0 0 0 0 0 0 0 0 0 8 -8 8 -8 13 -16 18 -24 32 -40 48 -57 72 -85 105 -122 145 -169 195 -228 267 -306 349
30 349 -402 459 -522 589 -666 750 -844 946 -1056 1179 -1312 1460 -1620 1793 -1984 2190
46 2190 -2418 2667 -2940 3238 -3568 3930 -4330 4778 -5280 5842 -6481 7214 -8065 9064
60 9064 -10261 11722 -13552 15922 -19126 23716 -30866 43611 -73092 282798 -182661 -599597
72 -599597 450602 269486 -452566 -56118 405851 -198273 -259622 216849 36671 -206139
82 -206139 200199 114156 -290658 32637 335526 -155032 -219039 270796 81199 -367996
92 -367996 10823 317124 -109150 -246387 136586 97586 -145116 35545 163298 -69442
102 -69442 -91621 93572 37956 -68578 30791 43692 -80649 -58906 50108 28564 -28122
$$ packed form
0@%%%%%%%Qj6J6j6K1k9L4m2N6p2Q8j05J29j57J90k27K67l14L64m23M95n73O55
30C49p51Q61r81J111j255J416j594J790k002K235k491K772l080L413l777M174
46B190m608N085n607O178o806P498q260R108j0058J1122j2323J3695j5279J7129
60I064j9325K1983k5274K9474l5048M2842n4582P4477j16703L55890m65459m16936
72e99597J050199j81116p22052L96448M61969o04124o1349M76471j80178k42810
82b06139M06338q6043m04814L23295L02889m90558o4007M89835j89597m49195
92c67996L78819L06301m26274j37237L82973l9000k42702J80661J27753k32740
102f9442k2179J85193n5616j06534R9369J2901j24341K1743J09014k1544n6686
$$ plain form
113 -28122 -7343 6545 -19031 1368 51390 32610 -27182 -23239 2402 -13347 11640 51048
125 51048 -34442 -98508 27088 83379 -53943 -47427 99996 20255 -121517 15431 135526
136 135526 -13531 -90875 22340 34274 -35394 -310 30418 -8706 -12269 -20047 -35007 49379
148 49379 80523 -63054 -91076 69926 62970 -78414 -14916 86549 -27880 -91726 35399
159 35399 67925 -21355 -21333 6254 -21505 529 36997 -842 -14567 9936 -20428 -24001 47032
172 47032 38891 -36468 -22468 17029 -6704 3528 38710 -9191 -52443 -2452 25284 -9162
184 -9162 -7201 17803 -3361 -29379 -10511 29489 42565 -4044 -51060 -7207 47884 -822
196 -822 -38723 22881 25793 -59631 -36233 65621 40805 -44763 -24981 26041 15053 602
$$ packed form
113b8122K0779J3888k5576K0399N0022j8780n9792L943K5641j5749K4987L9408
125E1048q5490o4066J25596N6291j37322O516J47423p9741j41772J36948J20095
136A35526j49057p7344J13215J1934o9668L5084L0728l9124l563p778j4960Q4386
148D9379L1144j43577k8022J61002o956j41384O3498J01465j14429o3846J27125
159C5399L2526q9280K2K7587k7759K2034L6468l7839j3725K4503l0364l573P1033
172D7032q141p5359J4000L9497k3733J0232L5182m7901m3252M9991K7736l4446
184i162J961K5004k1164k6018J8868M0000J3076m6609m7016M3853N5091m8706
196h22l7901O1604K912q5424K3398J01854k4816q5568J9782N1022j0988j4451
$$ plain form
208 602 6506 6454 5420 -17549 -41125 10740 58502 -17123 -75775 6808 53909 -19280 -25012 48442
222 48442 18868 -54874 -11615 55854 21591 -30257 -20846 -1473 -1080 1293 4836 4696 -1205 -15485
236 -15485 -11465 24452 36495 -1686 -25302 -2032 11930 -1924 170 10608 -14209 -38696
248 -38696 -6509 30050 7834 -17328 2856 6473 -19014 4528 45975 8668 -42193 -10580
260 -10580 22983 -4364 -8811 17024 -4979 -31662 -2239 21280 12757 12663 -4097 -30227 6469
273 6469 42427 -5966 -28546 22726 4060 -56786 -1202 64352 -7358 -59659 7822 30326
285 30326 -17243 1670 35223 -7930 -30913 6051 13704 3291 13671 -8981 -36596 3465
297 3465 32331 -7191 -12887 22806 -2832 -35848 13996 46136 -5224 -30937 1799 4947 -11105
$$ packed form
208F02N904n2j034k2969k3576N1865M7762p5625n8652Q2583M7101p3189n732P3454
222D8442k9574p3742M3259O7469l4263n1848R411J9373L93K373L543j40n901j4280
236a5485M020L5917J2043l8181k3616K3270J3962j3854K094J0438k4817k4487
248c8696L2187L6559k2216k5162K0184L617k5487K3542M1447l7307n0861L1613
260a0580L3563k7347m447K5835k2003k6683K9423K3519q523r4j6760k6130L6696
273F469L5958m8393k2580N1272j8666o0846N5584O5554p1710n2301O7481K2504
285C0326m7569J8913L3553m3153k2983L6964P653j0413J0380k2652k7615M0061
297C465K8866l9522n696L5693k5638l3016M9844L2140n1360k5713L2736L148j6052
$$ plain form
310 -11105 8885 17554 -14884 -26561 -289 13449 7484 3924 -2126 -12737 -7680 10545 16342
323 16342 3850 -8265 -11050 -7199 4095 15239 7900 -10613 -12130 -526 4751 11641 16212
336 16212 -5566 -25144 -2065 20657 2891 -7055 6676 -6969 -26126 3259 29133 1054
348 1054 -20403 -3530 1712 -3697 10917 15299 -7268 -15430 -3988 3349 11563 13177 -8185 -20043
362 -20043 -34 11990 3319 5692 6969 -12050 -16687 8398 20284 3940 -10732 -10547 -4235
375 -4235 1557 5042 7100 2010 -14349 -17244 8244 21025 587 -9875 -387 -5205 -7398 14938
389 14938 17864 -10900 -16571 591 1822 4726 16354 186 -20802 -2780 13348 710 3960
402 3960 13158 -13333 -24640 11488 21513 -8507 -7988 5750 -14136 -14626 22710 18580 -18932
$$ packed form
310a1105J9990Q669l2438j1677K6272J3738n965l560o050j0611N057J8225N797
323A6342j2492j2115k785L851J1294J1144p339j8513j517J1604N277O890M571
336A6212k1778j9578K3079K2722j7766r946J3731j3645j9157K9385K5874k8079
348A054k1457J6873N242n409J4614M382k2567q162J1442P337Q214J614k1362j1858
362b0043K0009J2024q671K373J277j9019m637K5085J1886j6344j4672J85O312
375d235N792L485K058n090j6359k895K5488J2781k0438j0462R488m818k193K2336
389A4938K926k8764n671J7162J231K904J1628j6168k0988J8022J6128j2638L250
402C960R198k6491j1307L6128J0025l0020N19J3738j9886m90L7336m130l7512
$$ plain form
415 -18932 -12366 8616 -4413 -2045 21982 4819 -25499 -7181 14896 2159 1164 11394 -8858
428 -8858 -20558 8434 19018 -1961 -1678 4390 -15104 -11067 22765 15593 -18578 -10672 7351
441 7351 -7046 -5084 20321 7218 -23905 -11499 12050 5647 2242 7587 -7600 -16222 4383
454 4383 13299 1373 1691 620 -15292 -7133 19938 13148 -11760 -7495 2404 -5829 32 16826
468 16826 5026 -16462 -10572 4190 6182 6777 3659 -9759 -12339 1128 7834 4970 2393 -4776
482 -4776 -12470 -3557 11939 10953 -1379 -6674 -5264 -1095 6626 10938 4032 -8617 -11002 -357
496 -357 8388 7773 1786 -6054 -10887 -3727 9982 9920 -815 -6087 -6122 -5507 3617 12534 1738 -12219
512 -12219 -8623 -88 2638 7749 6881 -8285 -12041 2644 9187 4990 5551 -147 -13245 -6138 13036
$$ packed form
415a8932O566K0982j3029K368K4027j7163l0318J8318K2077j2737r95J0230k0252
428h858j1700K8992J0584k0979K83O068j9494M037L3832p172l4171P906J8023
441G351j4397J962K5405j3103l1123J2406K3549o403l405N345j5187q622K0605
454D383Q916j1926L18j071j5912Q159K7071o790k4908M265R899q233N861J6794
468A6826j1800k1488N890J4762J992N95l118j3418k580J3467O706k864k577p169
482d776p694Q913J5496r86j2332n295J410M169P721M312o906j2649k385J0645
496c57Q745o15n987p840m833P160J3709o2j0735n272l5O15R124Q917j0796j3957
512a2219L596Q535K726N111q68j5166l756J4685O543m197N61n698j3098P107J9174
$$ plain form
527 13036 9566 -4101 -3925 -4900 -8614 4062 14884 1658 -9927 -3669 -1205 350 11150 8079
541 8079 -11199 -12312 1772 3448 2448 6655 -2678 -14898 -3754 11642 8086 1440 -213 -6358
555 -6358 -6773 6511 12184 1920 -6385 -7052 -5137 2001 9214 4761 -6177 -8922 -2774 4797 8538
570 8538 5111 -4065 -9378 -5292 4072 8692 3204 -6263 -8917 -4167 2481 7767 6930 -2747 -9425
585 -9425 -2961 6318 8151 5281 -1056 -8970 -6562 5547 8800 1496 -3836 -6599 -7002 1973 10985
600 10985 4629 -5607 -6185 -4140 77 8634 7458 -6121 -10597 -3183 1556 5126 7457 -1761 -11043
615 -11043 -3688 6401 6029 4519 1749 -7794 -7727 5516 9593 2415 -1626 -5590 -9068 1199 11848
630 11848 4175 -6134 -4373 -3816 -3406 7883 10697 -5005 -11860 -1572 2839 2198 6701 1644 -11037
$$ packed form
527A3036l470j3667J76r75l714J2676J0822j3226j1585O258K464J555J0800l071
541H079j9278j113J4084J676j000M207r333j2220J1144J5396l556o646j653o145
555f358m15J3284N673j0264q305o67J915P138P213m453j0938k745O148P571L741
570H538l427r176n313M086R364M620n488r467k654M750O648N286q37r677o678
585i425O464R279J833k870o337p914K408J2109L253p304n332k763m03Q975R012
600A0985o356j0236n78K045M217Q557j176j3579m476P414M739L570K331r218r282
615a1043P355J0089l72j510k770r543O7J3243M077p178m041l964l478J0267J0649
630A1848p673j0309J761N57M10J1289K814j5702o855J0288M411o41M503n057j2681
$$ plain form
645 -11037 -6893 6375 5723 2354 3557 -5197 -11481 3205 14055 3019 -5336 -1901 -4110 -3798
659 -3798 8468 9821 -4658 -9066 -2299 -184 2774 8471 1318 -11217 -7018 4402 5234 2728
673 2728 1419 -5454 -9286 828 10019 4568 -2805 -4192 -5037 -2146 7368 9534 -1256 -8026 -4033
688 -4033 1325 4584 6955 2044 -7426 -7433 1476 6218 4209 170 -5587 -8263 -1186 7881 5868 -1832
704 -1832 -5761 -5215 -1426 5382 7775 397 -6788 -5934 -257 5379 7297 2020 -6683 -6958 1182 6367
720 6367 5499 1146 -4284 -6461 -1226 5914 6666 467 -5837 -7295 -1973 5721 6698 18 -6412 -6271
736 -6271 -1137 4558 6283 1568 -4730 -6318 -2086 4917 7308 1904 -5651 -6064 -245 4985 5990
751 5990 2420 -3862 -6270 -1417 5010 6556 2175 -4299 -7076 -2243 4918 5634 435 -4342 -5743
$$ packed form
645a1037M144J3268o52l369J203q754o284J4686J0850j1036q355L435k209L12
659c798J2266J353j4479m408O767K115K958N697p153j2535M199J1420Q32k506
673B728j309o873l832J0114R191n451p373j387q45K891R514K166j0790o770L993
688d033N358L259K371m911r470pQ909M742k009m039n757k676P077R067k013p700
704a832l929N46L789O808K393p378p185Q54N677N636J918n277q703k75Q140N185
720F367q68m353n430k177N235P140P52o199o304j458N322P694R77o680o430J41
736f271N134N695J725m715o298j588M232P003K391n404p555m13N819N230J005
751E990l570o282k408M853O427J546m381o474k777M833P161P16n199m777j401
$$ plain form
766 -5743 -2845 2954 6743 2636 -4946 -6963 -1865 4402 6154 2504 -3901 -6071 -1717 4350 6053
781 6053 2892 -2749 -6059 -2716 4437 7039 2320 -3877 -6025 -2397 3488 6003 2131 -3663 -6561
796 -6561 -3701 2744 6415 2461 -4108 -6572 -2568 3409 5787 2643 -3009 -5697 -2665 2792 6123
811 6123 4087 -2493 -6558 -3144 4449 6951 2561 -3129 -4766 -2681 1692 5639 4415 -2710 -6775
826 -6775 -3260 2347 5191 3501 -2447 -7009 -4006 3629 5200 1524 -1432 -4359 -5301 1466 8198
841 8198 4001 -3923 -4618 -1976 551 5459 6136 -2096 -7381 -1831 3295 2922 3875 1401 -6848 -6653
857 -6653 4024 6591 257 -2018 -2913 -5643 -950 7707 4358 -4669 -4674 -1804 -971 4264 6936 -1389
873 -1389 -7723 -2398 3093 3288 4173 1492 -5871 -5472 3508 6172 1728 -790 -2804 -5144 -661 6238
$$ packed form
766e743K898N799L789m107p582k017N098O267J752l650o405k170M354O067J703
781F053l161n641l310L343P153K602m719o197k148L628N885K515l872n794k898
796f561K860O445L671l954o569k464M004N977K378l144n652k688L032N457L331
811F123k036o580m065L414P593K502m390n690j637K085M373L947j224p125m065
826f775L515N607K844j690n948m562L003P635J571l676k956k927r42O767O732
841H198m197p924o95K642K527M908O77q232n285N550N126l73R53k474q249J95
857f653J0677K567o334k275q95k730M693Q657l349r027nK870Q33N235K672q325
873a389o334N325N491J95Q85k681p363L99Q980K664m444k518k014k340M483O899
$$ plain form
889 6238 4930 -2202 -5390 -3796 183 4694 4476 -1746 -5727 -3330 330 3495 4402 705 -5316 -5000
905 -5000 1402 5369 4227 -159 -4107 -4179 826 5203 4297 50 -3638 -4519 -634 5074 5379 -926
921 -926 -5407 -3896 91 3436 4121 223 -4665 -5384 -275 4528 3807 195 -3767 -5323 -927 5384
937 5384 4836 -1085 -3487 -2403 -1400 2865 6301 1506 -5475 -3905 1517 2966 3724 2507 -3876 -6464
953 -6464 60 4937 2679 154 -1951 -5698 -3089 5210 5536 -1810 -3987 -2118 -2030 1044 6200 2605
969 2605 -5368 -4629 895 2925 3823 3091 -3289 -6205 81 5285 2932 706 -874 -4682 -3634 3647
985 3647 6138 228 -4035 -3560 -1882 1773 4985 1630 -4151 -4501 -879 2182 3872 2550 -2866 -5714
1001 -5714 -1251 4001 4322 1319 -2018 -3854 -2169 2737 5027 2075 -2299 -4288 -2076 2689 4910
$$ packed form
889F238j308p132l188J594L979M511k18o222l981K397L660L165R07l697o021L16
905e000O402L967j142m386l948p2N005M377r06m247l688q81L885N708L05o305
921i26m481J511L987L345O85l898m888p19N109M803p21l612l962j556M396O311
937E384n48n921k402J084J003M265L436m795o981J570N422J449P58j217o383k588
953f464O524M877k258k525k105l747K609Q299L26p346k177J869Q8L074N156l595
969B605p973P39N524K030Q98p32o380k916O286N204k353k226j580l808J048P281
985C647K491n910m263M75J678L655L212l355n781l50L622L061J690j322n416k848
1001e714M463N252L21l003l337j836J685M906K290k952m374j989K212M765K221
$$ plain form
1016 4910 1618 -2820 -4353 -2067 1919 4300 1850 -3013 -4391 -2255 1889 4122 2298 -2494 -4949
1031 -4949 -1924 2457 4027 2610 -1344 -4643 -2766 3201 5078 1611 -1775 -2937 -2268 995 4921
1046 4921 3225 -2641 -4498 -1808 1300 3717 3021 -2017 -5615 -2395 2708 3241 1586 -567 -3877
1061 -3877 -4297 1544 5483 2127 -2520 -3163 -2054 372 4228 3496 -1667 -4067 -1527 1606 3267 3255
1077 3255 -318 -4687 -3266 2261 4467 1826 -1339 -3326 -3113 171 3807 2973 -1403 -4292 -2953
1092 -2953 936 3641 2965 -832 -4159 -2931 1728 3794 2228 -447 -2757 -3337 300 4825 3618
1107 3618 -1500 -3724 -1797 630 3080 3678 -25 -4442 -3307 1167 3181 2468 -197 -3532 -3837 558
1123 558 3895 2080 -866 -2687 -3008 -559 3827 3906 -590 -4050 -2370 854 3154 3425 322 -3355
$$ packed form
1016D910l292m438j533K286L986K381k450m863j378K136M144K233j824m792k455
1031d949L025M381J570j417l954l299J877N967J877l467l386j162O69L263L926
1046D921j696n866j857K690L108K417o96n038l598L220N103N33j655k153l310
1061c877m20N841L939l356m647o43J109K426L856p32n163k400K540L133J661j2
1077C255l573m369J421N527K206k641l165j987K13L284L636q34m376k889J339
1092b953L889K705o76l797l327J228M659K066j566k675k310n80L637M525j207
1107C618n118k224J927K427K450N98l703m417J135M474K014p13k665l335l05M395
1123E58L337j815k946j821l21K449M386P9m496l460J680L224K300K71l103l677
$$ plain form
1139 -3355 -2943 608 3537 3090 382 -3369 -3389 305 2956 2809 81 -3371 -3704 42 3190 2707 -110
1156 -110 -2905 -3624 -372 3734 3239 -540 -2653 -2497 -760 2662 4277 563 -3898 -2709 457 2497
1172 2497 2996 1251 -2613 -4079 -102 3448 2364 -126 -2112 -3317 -1387 3151 3689 -576 -3179
1187 -3179 -2449 -1184 1620 3964 963 -3604 -3477 173 2440 2777 1288 -1985 -3482 -534 3038 3349
1203 3349 774 -1950 -3128 -1014 2524 3566 633 -2763 -3188 -781 2145 3115 1087 -2368 -3580
1218 -3580 -1068 2349 3099 406 -2566 -3033 -1429 1745 3404 1571 -1991 -3170 -712 2339 3292 1622
1234 1622 -1679 -3343 -895 2405 2918 791 -1689 -3157 -1732 1987 3613 1140 -2163 -2902 -1108
1249 -1108 1195 3034 1676 -1981 -3692 -1563 1641 2565 1030 -1474 -3120 -1373 2257 3602 1256
$$ packed form
1139c355M12L551K929m47k708l751k0L694K651j47k728l452l33L746L148m83k817
1156a10k795p19L252M106m95l779k113J56J737L422J615l714m461J189L166K040
1172B497M99j745l864j466L977L550j084k490j986j205J930M538N38m265k603
1187c179P30J265K804K344l001m567J27L650K267L37j489l273j497K948L572L11
1203C349k575k724j178K114L538J042k933l396m25K407K926R70k028l455j212
1218c580K512L417P50k693k972m67J604L174J659j833l562j179K458L051R53j670
1234A622l301j664K448L300N13k127k480j468J425L719J626k473l303p39J794
1249a108K303J839j358l657j711K129L204R24j535k504j646J747L630J345k346
$$ plain form
1264 1256 -1492 -2301 -1434 1042 3672 2096 -2253 -3385 -966 1297 2365 1963 -936 -3749 -1682 2424
1280 2424 2724 813 -727 -2802 -2843 1186 3529 857 -2152 -2368 -1699 545 3513 2758 -1512 -3044
1296 -3044 -545 1723 2168 2243 -349 -3557 -2287 1860 3061 841 -680 -2269 -2242 660 3423 1970
1312 1970 -1452 -2889 -1895 626 2638 1779 -1335 -2923 -1751 752 2483 1966 -372 -2362 -2053 709
1328 709 3460 2410 -1360 -2602 -1161 470 1849 2685 350 -3315 -2476 1473 2898 1003 -524 -2043
1344 -2043 -2367 -120 2622 1829 -977 -2404 -2167 -285 2744 3047 -986 -3460 -1169 1173 1318 1765
1360 1765 827 -2360 -3345 752 3596 1510 -787 -1264 -1540 -410 2624 2921 -593 -2769 -1810 -251
1376 -251 1445 2468 -331 -3462 -2568 764 1850 1388 778 -1383 -2897 35 3424 2152 -1041 -1729
$$ packed form
1264A256k748q09Q67K476K630j576m349j132K419K263J068m02k899k813K067M106
1280B424L00j911j540k075m1M029K343k672l009k16O69K244K968p55m270j532
1296c044K499K268M45P5k592l208J270M147J201k220j521j589K7K902K763j453
1312A970l422j437R94K521K012q59l114j588J172K503J731n17k338j990L09K762
1328G09K751j050l770j242J441J631J379Q36k335l665Q39L949J425j895j527j519
1344b043l24K247K742p93k806j427K37J882L029L03m033k474K291K342J45M47
1360A765r38l187r85M097K844k086k297m77k76J130L034K97l514k176R59J559
1376b51J696J023k799l131Q94L332J086m62o10k161j514K932L389j272l193o88
$$ plain form
1392 -1729 -1713 -795 1870 2867 141 -2326 -1462 314 2196 2929 652 -2494 -2007 581 1415 1386 330
1409 330 -2216 -3268 -623 2227 2106 100 -1504 -2095 70 2347 2244 130 -1310 -2150 -1215 1695
1425 1695 2773 -79 -2496 -1806 -136 1596 2960 1332 -1953 -2126 276 1817 1629 669 -1933 -3075
1441 -3075 -902 1633 1537 189 -1357 -2355 -868 2123 2882 151 -1645 -1419 -823 810 2411 1103
1457 1103 -2096 -3131 -521 2045 2452 544 -1348 -1415 -18 1269 2027 1478 -1011 -2926 -1419 1563
1473 1563 2227 -70 -1983 -2055 -748 1189 2048 940 -1004 -2238 -1004 1506 2582 731 -1858 -2304
1489 -2304 -528 1173 1780 1295 -821 -2320 -936 1994 2385 603 -679 -1639 -1329 689 2555 1036
1505 1036 -1896 -2465 -1022 754 1883 1252 -1515 -2479 -651 1226 1422 1107 -44 -2488 -1750 1743
$$ packed form
1392a729J6R18K665R97k726k467Q64J776J882P33k277l146M87K588Q34k9j056
1409C30k546j052K645K850j21k006j604n91K165K277j03k114j440q40R35K910
1425A695J078k852k417O90J670J732J364j628l285j73K402J541j88r60k602j142
1441c075K173K535r6j348j546r98J487K991P59k731j796K26N96J633J601j308
1457A103l199j035K610K566M07j908j892o7J397J287P58n49k489j915J507K982
1473A563O64k297j913p2J307J937Q59j108j944j234J234K510J076j851k589m46
1489b304J776J701O07m85k116j499J384K930L91j782j282r60L10K018J866j519
1505A036k932n69J443J776J129o31k767r64J828J877J96l15j151k444P38L493
$$ plain form
1521 1743 2826 421 -1079 -1093 -1079 361 2648 1757 -1165 -1930 -738 322 1927 2039 -1199 -3097 -795
1538 -795 1538 1127 569 -179 -1829 -2241 605 2524 707 -1032 -1591 -1575 308 2376 1737 -1032 -1755
1555 -1755 -642 634 2027 1836 -345 -2487 -1228 1069 1487 1098 -99 -1855 -1833 779 2163 1446
1571 1446 -683 -1899 -1499 386 1653 1187 -587 -2073 -1736 63 2210 1958 -805 -1805 -658 608
1587 608 1633 2024 358 -2071 -1628 599 1677 1387 55 -1905 -1952 637 1992 908 111 -969 -1875
1604 -1875 -464 2221 1916 -1134 -1806 -979 -557 1042 2120 202 -2720 -1592 1149 1372 1271 673 -1335
1621 -1335 -2216 544 2194 876 -220 -844 -2040 -714 2297 1980 -842 -1531 -686 -328 818 2344
1637 2344 159 -2747 -1362 659 704 924 755 -1760 -2387 258 1922 1104 271 -784 -1695 -445 2243
$$ packed form
1521A743J083k405j500j4J4J440K287q91k922p65J192J060J605J12l238j898K302
1538g95K333m11n58p48j650m12K846J919j817j739n59J6J883K068o39k769p23
1555a755J113J276J393j91k181k142J259K297M18l89j197j756K2K612J384p17
1571A446k129j216M00J885J267m66j774j486L37J799K147k52k763j000J147J266
1587F08J025L91j666k429M43K227J078k90j332j960m7K589J355j084p97j080r06
1604a875J411K685l05l050o72Q27M22J599J078j918k922J128K741K23j01n98k008
1621a335q81K760J650j318j096o24j196J326L011l17k822o89Q45L58J146J526
1637B344k185k906J385K021M5K20j69k515o27K645J664q18q33j055r11J250K688
$$ plain form
1654 2243 1737 -211 -1094 -1262 -827 1358 2153 -174 -1927 -997 -11 462 1742 886 -1753 -1994 303
1671 303 1278 971 594 -1026 -2342 -668 1491 1386 277 -842 -1588 -791 1711 1852 -12 -949 -816
1688 -816 -548 561 2144 806 -1896 -1900 -47 1214 1248 896 -766 -1805 -500 1297 1585 498 -951
1705 -951 -2080 -964 1280 1401 -3 -816 -1108 -1028 734 2415 1072 -1350 -1421 25 745 1382 973 -952
1723 -952 -2039 -347 1137 1314 554 -653 -1910 -642 1353 1542 337 -557 -1387 -1323 436 1972 381
1740 381 -1633 -1587 -482 245 1265 1208 -657 -1512 -273 1169 1356 1142 -216 -1894 -989 1037 1449 358
1758 358 -660 -1268 -1136 834 1922 780 -876 -1148 -775 300 1618 917 -1039 -1906 -745 431 1292
1775 1292 1087 -458 -1875 -927 1093 1730 1017 -257 -1253 -814 664 1282 777 -367 -1487 -1396 409
$$ packed form
1654B243n06j948q83j68M35K185P95k327j753R30R86M73J280q56k639k41K297
1671C03R75l07l77j620j316J674K159j05j109j119p46P97K502J41j864r37J33
1688h16K68J109J583j338k702mJ853J261L4l52j662j039J305J797K88j087j449
1705i51j129J116K244J21j404q13k92Q0J762J681j343k422p1J446P20O37m09j925
1723i52j087J692J484J77p60j207j257J268J995J89j205q94q30O4J759J536j591
1740C81k014M6J105P27J020n7j865q55J239J442J87k14j358j678R05K026M12j091
1758C58j018o08J32J970J088j142j656k72L73J075J318p01j956q67J161J176Q61
1775A292k05j545j417R48K020O37p13j274r96M39J478O18n05j144j120R1J805
$$ plain form
1792 409 1821 874 -733 -1148 -733 246 1428 1237 -359 -1735 -968 395 1050 921 -528 -1773 -1000
1809 -1000 771 1170 996 322 -1168 -1373 663 1843 1041 -623 -968 -664 -149 1353 1419 -425 -1475
1826 -1475 -793 442 1035 1102 -252 -1576 -1139 512 1264 794 -15 -1321 -1397 75 1748 1037 -700 -1060
1844 -1060 -641 -62 1099 1516 -15 -1510 -899 507 1131 1194 37 -1232 -1367 171 1174 782 -229
1861 -229 -1109 -1650 -199 1538 1161 -443 -1051 -943 -251 1019 1571 -5 -1578 -1171 77 950 1078 30
1879 30 -1147 -1097 335 1386 1204 583 -762 -1122 148 1402 1025 -313 -854 -1366 -677 996 1196 -233
1897 -233 -1231 -939 -236 925 1498 241 -998 -974 27 719 816 350 -1160 -1715 -19 1015 909 227
1915 227 -384 -1114 -374 1297 1415 184 -1105 -1091 -476 539 1103 60 -1277 -1278 -271 611 1200 691 -882
$$ packed form
1792D09J412r47j607m15M15R79J182j91j596j376P67J363O55j29j449j245P73
1809a000J771L99j74o74j490k05K036J180q02j664l45L04N15J502O6j844j050
1826a475O82J235N93O7j354j324M37J651P52m70q09j306p6J472J673p11j737l60
1844a060M19N79J161M17j531j495O11J406O24O3j157j269j35J538J003l92j011
1861b29q80n41J451J737l77j604o08J08O92J270N52j576j573M07J248Q73J28j048
1879C0j177N0J432J051j82o21j345l60J270J254l77j338n41n12O89J673K00j429
1897b33r98K92P03J161N73j257j239K4J001O92R7m66j510n55J696J034j06o82
1915B27o11p30P40J671J18j231j289J4O15J015N64j043j337jJ007Q82N89n09j573
$$ plain form
1934 -882 -1312 -16 1179 935 244 -899 -1343 -529 840 1210 201 -720 -1013 -504 1037 1519 363 -611
1952 -611 -791 -479 596 1384 388 -1284 -1356 -289 387 759 722 -715 -1727 -67 1168 943 444 -5
1970 -5 -1409 -1071 1012 1508 -168 -811 -557 -805 158 1792 866 -1154 -800 205 221 793 1152 -699 -1910
1989 -1910 -349 990 333 46 94 -1420 -1366 1211 1694 -141 -817 -189 -799 -203 1604 1077 -1304 -1198
2007 -1198 178 147 641 1303 -204 -1795 -439 1221 723 503 164 -1308 -1234 759 1690 81 -672 -473
2025 -473 -801 -284 1312 954 -1072 -1212 -254 222 698 1000 -84 -1518 -689 818 775 613 106 -1058
2043 -1058 -955 784 1283 339 -159 -219 -910 128 1555 984 -704 -1015 -418 130 752 1120 -505 -1488
2061 -1488 -645 238 634 720 72 -1116 -887 607 1161 540 141 -710 -1025 107 1232 670 -310 -604 -739
$$ packed form
1934h82m30J296J195k44o91j143m44Q14J369L70j009r21k93N09J541M82j156r74
1952f11j80L12J075P88r96j672p2J067O76L72l7j437j012J660J235k25m99m49
1970ej404L38K083M96j676o43K54k48R63J634r26k020L54J005J6N72L59j851j211
1989a910J561J339o57k87M8j514N4K577M83j835o76O28o10N96J807n27k381J06
2007a198J376l1M94O62j507j591J356J660m98k20l39j472P4J993R31j609p53J99
2025d73l28N17J596l58k026j40R58M76M76L02j084j434Q29J507m3j62n07j164
2043a058J03J739M99r44m98o0o91J038J427n71j688l11N97N48O22L68j625r83
2061a488Q43Q83L96Q6o48j188K29J494N54o21l99q51l15J132J125n62r80k94j35
$$ plain form
2080 -739 -168 975 1066 -284 -891 -458 -32 835 996 -147 -1339 -813 306 624 794 -45 -1250 -964
2098 -964 241 1007 702 272 -570 -1015 124 1271 611 -145 -531 -873 -324 1059 1080 -313 -932 -508 -85
2117 -85 592 1025 122 -1160 -873 215 428 654 419 -779 -1478 77 1094 361 73 -134 -1044 -756 1259
2136 1259 1373 -451 -713 -248 -403 517 1388 396 -1053 -654 252 358 555 719 -981 -1516 38 966
2154 966 504 54 -441 -999 -751 1030 1226 -305 -886 -286 -312 109 1051 552 -953 -884 182 576 609 549
2174 549 -597 -1148 16 856 693 132 -228 -883 -612 997 1167 -68 -753 -569 -573 66 988 329 -825
2193 -825 -925 -189 519 721 172 -512 -846 -210 646 908 554 -320 -1112 -310 767 964 238 -291 -593 -604
2213 -604 510 1127 417 -741 -984 -255 373 982 253 -672 -857 -559 486 832 431 -704 -1150 -295 637
$$ packed form
2080g39N71J143R1j350o07M33M26Q67J61j143j192N26J119L18J70q39j205K86
2098i64J205P66l05m30q42m45J139J147o60p56l86l42N49J383K1j393o19M24M23
2117h5O77M33r03j282K87J088K13K26k35j198o99J555J017p33k88k07r10K88K015
2136A259J14j824k62M65j55R20Q71r92j449L99R06J06J97J64j700n35J554R28
2154I66m62m50m95n58K48J781J96j531n81O00k6M21R42m99j505O9J066L94L3o0
2174E49j146n51J164Q40j63n61l60o55K71J609J70j235o85J84mO39R22o59j154
2193h25j00P36P08K02n49o84l34O36Q56K62l54q74p92Q02J077J97p26n29l02j1
2213f04J114O17p10j158k43P29O28O09p29r25j85K98J045L46m01j135m46Q55R32
$$ plain form
2232 637 722 460 -82 -712 -564 527 1062 416 -661 -748 -308 339 681 592 -414 -895 -506 240 759 465
2252 465 -539 -856 -535 451 758 501 -284 -912 -699 424 717 345 -407 -596 -335 261 757 644 -240
2271 -240 -851 -306 528 730 488 -100 -715 -697 264 906 336 -317 -885 -570 304 747 431 -308 -778 -592
2291 -592 -74 1004 572 -356 -667 -264 355 494 645 81 -814 -768 306 928 370 -340 -634 -610 117 572
2311 572 524 -265 -772 -743 28 758 738 -274 -878 -381 101 473 659 101 -802 -796 176 812 382 -79 -436
2332 -436 -500 -155 826 927 -126 -750 -670 -22 698 592 -146 -782 -704 -144 380 608 -94 -814 -739 303 507
2353 507 501 51 -580 -833 -45 589 693 34 -600 -812 185 712 532 114 -376 -532 -245 780 780 -135 -765
2374 -765 -496 -97 481 770 141 -625 -909 82 494 468 161 -610 -976 -139 770 431 256 -250 -892 -213
$$ packed form
2232F37Q5k62n42o30J48J091N35o46j077q7M40O47L42q9j006m81L89P46N19k94
2252D65j004l17L21R86L07k57p85o28K13J123K93l72p52j89K61N96M96j13q84
2271b40o11N45Q34K02k42n88o15J8R61O42n70o53n68L15Q74M43l16p39m70J86
2291e92N18J078m32r28l11M03O19J39J51n64q95M6J074O22n58p10k94K4P27M55
2311E72m8p89n07K9P71P30k0j012o04M97M82L72J86n58r03OR72O36m30m61l57
2332d36o4L45R81J01j053o24Q0O48P20j06p38o36P8N60N24K28p02p20P5J042K04
2353E07om50o31k53P88O34J04o59o34k12R97N27j80m18m90j56K87J025%r15o30
2374g65K69L99N78K89o29p66k84R91M12k6l07p71l66Q37R09l39j75n06o42O79
$$ plain form
2394 -213 623 740 -55 -536 -261 -333 477 932 351 -773 -550 -55 266 542 467 -428 -877 -133 582 525 70
2415 70 -322 -798 -481 744 696 -137 -351 -456 -292 255 887 420 -653 -688 -143 155 452 383 -157 -692 -328
2436 -328 494 625 148 -405 -646 -269 450 404 158 -417 -671 -449 363 781 269 -422 -650 -314 211 574
2456 574 460 -349 -494 -354 461 628 179 -236 -536 -215 269 586 434 -218 -694 -443 440 587 53 -393
2476 -393 -676 -668 238 655 254 -418 -590 -365 110 439 436 -174 -565 -221 221 440 493 -72 -714 -402 577 706
2498 706 53 -174 -357 -517 187 898 285 -462 -550 -185 8 467 509 -257 -631 -378 121 377 373 -193 -533
2519 -533 -427 184 509 499 -148 -489 -386 258 557 397 -73 -567 -371 97 416 359 28 -491 -319 -82 572
2540 572 353 -89 -656 -404 -33 375 418 92 -625 -562 180 433 334 156 -319 -494 75 583 486 -37 -275
$$ packed form
2394b13Q36J17p95m81K75p2Q10M55n81j124K23M95L21K76p5q95m49P44P15n7m55
2415G0l92m76L17J225m8q33k14j05J64N47O32m67j073l5N45K98K97o9n40n35L64
2436c28Q22J31m77n53k41L77P19m6k46n75k54K22Q12M18n12o91k28L36N25L63
2456E74j14q09j45J40Q15J67m49m15l00L21M84L17j52o52m76K51Q83J47n34m46
2476c93k83QR06M17m01o72j72K25M75L29lo10l91L44M42K19N3n65o42L12R79J29
2498G06o53k27j83j60P04P11o13p47q8L65J93M59M2p66l74K53M99K56mn66l40
2519e33J06O11L25j0o47l41J03O44K99j60m70m94J96M68L19n7l31n19J72K37O54
2540E72k19m42n67K52L71M08M3l26p17O3P42K53r9j78m75j75N69N08r7n23k38
$$ plain form
2561 -275 -418 -83 542 503 -233 -425 -353 -40 291 665 72 -574 -478 78 263 249 330 -456 -828 88 694 463
2583 463 79 -444 -497 -281 547 754 -154 -422 -234 -47 139 640 278 -533 -334 43 534 227 152 -265 -686
2604 -686 -181 604 634 -214 -237 -455 -262 267 564 102 -336 -354 -142 325 608 212 -197 -568 -11 519 267
2625 267 172 -346 -592 -204 435 536 -26 -424 -413 -297 168 460 -2 -401 -638 -196 242 386 178 -321 -487
2646 -487 -17 361 486 172 -129 -576 -192 345 516 280 -348 -453 -284 331 423 237 -141 -398 -223 186
2666 186 431 217 -245 -434 -151 326 424 140 -325 -426 -223 133 499 353 -330 -296 -146 122 529 250 -112
2687 -112 -442 -186 293 342 397 -77 -367 -167 93 457 216 -308 -372 -426 267 425 268 -124 -374 -214 -105
2708 -105 582 246 -421 -334 -242 180 422 357 -82 -489 -326 284 407 229 184 -178 -386 130 486 272 41
$$ packed form
2561b75j43L35O25l9p36j92P2L13L31L74n93o46R6N56J85j4Q1p86l72R16O06k31
2583D63l84n23n3K16Q28K07r08k68J88J87J86N01l62q11J99L77M91l07p5m17m21
2604f86N05P85L0q48k3k18J93N29K97m62m38j8K12M67K83l96m09l71N57N30k52
2625B67r5n18k46L88O39J01n62l98J1J16M65K92m62l99k37M42M38J44k08m99j66
2646d87M70L78J25l14l01m47L84N37J71k36o28j05J69O15R2j86l78k57J75M09
2666A86K45k14m62j89K83M77R8k84m65j01K03L56L66j46o83L4J50K68M07k79l62
2687a12l30K56M79M9N5m74k90K00K60L64k41n24o4n4O93J58j57l92k50J60J09
2708a05O87l36o67Q7R2M22K42o5m39m07J63O10J23j78m5l62k08N16L56k14k31
$$ plain form
2729 41 -435 -281 53 427 254 -101 -378 -336 41 335 226 50 -608 -349 78 324 304 -35 -273 -201 132
2750 132 396 440 53 -379 -460 19 309 302 115 -402 -236 222 237 70 -79 -361 -372 -57 329 339 -271 -488
2772 -488 -314 -55 396 426 118 -350 -323 141 337 421 93 -356 -400 77 323 357 -14 -199 -276 -76 412 440
2794 440 -42 -328 -150 -21 326 289 2 -301 -527 -72 312 212 45 -116 -397 105 265 247 -10 -270 -108
2815 -108 47 272 582 18 -302 -235 -116 202 303 213 -139 -405 -123 226 351 -82 -377 -401 -231 247 390
2836 390 86 -169 -263 -56 159 210 240 -274 -428 23 191 288 -182 -243 -283 -68 322 327 137 -162 -249 18 196
2859 196 222 135 -268 -527 -35 198 64 177 -221 -384 -227 237 240 -12 -147 -304 -271 118 389 220 -283 -185
2881 -185 77 137 248 232 -207 -354 -214 193 328 278 -51 -330 -77 172 282 118 -48 -286 -297 65 199
$$ packed form
2729D1m76J54L34L74j73l55k77M2L77K94j09j76o58K59M27K46k0l39k38P2L33
2750A32K64M4l87m32q1M79K90pj87n17J66M58J5j67j49k82j1L15L86J0o10k17
2772d88J74K59M51L0l08m68K7M64J96Q4l28m49m4M77K46L4l71j85p7K00M88K8
2794D40m82k86J78J29L47l7k87l03k26M55L84j00j67j61k81N02J60j8k57k60J62
2815a08J55K25L10n64l20O7J19L18J01r0l52k66K82L49J25m33k95k4J70M78J43
2836C90l04k55r4K07K15N1L0n14j54M51J68R7m70o1m0K15L90Nj90k99q7K67J78
2859A96K6q7m03k59M92K33j34J13l98j63J57M64Lk52j35j57L3L89K71j69n03R8
2881a85K62O0J11j6m39j47J40M07J35n0l29k79K53K49J10j64j66k38j1L62J34
$$ plain form
2902 199 157 -130 -369 -109 101 256 298 -65 -365 -275 -79 479 247 -177 -265 -158 99 350 262 -81 -258 -182
2924 -182 350 225 48 -211 -258 -158 45 333 58 -83 -361 -149 45 341 159 -228 -169 -138 -64 199 219 9
2946 9 -262 -225 125 334 231 -225 -236 -334 104 228 236 -7 -221 -291 87 310 197 -228 -250 -71 -5 219 233 26
2970 26 -137 -248 -52 312 399 -41 -213 -156 -55 261 53 83 -272 -385 162 240 209 -47 -179 -182 3 226 219
2993 219 -3 -271 -273 56 358 204 5 -166 -325 14 253 179 88 -439 -161 -73 214 308 121 -164 -123 43
3015 43 161 257 110 -350 -193 -105 226 199 182 -211 -100 -4 42 371 110 -251 -324 -115 189 197 99 -166 -266 -120
3039 -120 20 267 134 29 -243 -79 249 323 207 -205 -321 -9 75 147 195 -17 -222 92 130 234 67 -122
3061 -122 -264 -110 195 174 47 -68 -203 -126 311 362 116 -225 -103 -215 32 368 247 -134 -184 -66 115
$$ packed form
2902A99m2k87k39K60K10J55M2l63l00R0J96N58k32m24q8J07K57K51q8l43j77P6
2924a82N32j25j77k59m7J00K03K88k75j41k78K12J94K96j82l87N9L1P4K63K0k10
2946Ik71L7L50K09j03m56j1r8M38J24Qk43k14p0L78K23j13m25k2J79O6K24J4k07
2970B6j63j11J96L64Q7m40j72N7J01L16k08L0l55j13N47P8l1k56j32lJ85K23p
2993B19k22k68kL29L02j54j99j71j59L39K39p4r1n27K78Q8K87R4j87k85M1J66
3015D3J18R6j47m60J57Q8L31k7j7l93J11R6M6L29k61l61p3K09L04Qr8k65j00J46
3039a20J40K47j33j05k72J64L28P4j16m12j16L12Q4P2M8k12k05L14L8J04j67j89
3061a22j42J54L05k1j27j15j35P7M37N1k46l41J22j12K47L36j21l81n0J18J81
$$ plain form
3082 115 247 200 -199 -295 -148 -1 175 125 -3 -382 -286 -2 190 135 -37 -235 -371 43 244 64 -190 -269
3104 -269 -136 -22 281 128 -15 -83 -27 162 141 214 84 -274 -372 36 270 177 -36 -439 -301 38 228 174
3126 174 -211 -267 -140 -97 128 204 -14 -167 -228 145 364 195 94 -111 -199 84 65 6 -61 -116 -194 2 268
3149 268 239 -51 -133 -281 -23 87 150 117 -253 -175 69 368 207 47 -255 -98 44 181 253 41 -228 -276
3171 -276 -166 163 96 19 1 -169 -92 69 329 196 -133 -163 -134 153 279 -5 -213 -311 72 -4 -75 -125 -69 -269
3195 -269 -112 133 136 -76 21 -100 -87 90 177 263 -376 -51 14 132 74 113 -91 -195 35 61 27 120 -71 -259
3219 -259 -88 44 196 174 -85 -234 -268 133 335 110 -46 -133 96 76 314 96 -118 -188 -80 93 279 54
3241 54 -121 -247 -194 241 76 137 -247 -124 -68 -65 187 -84 9 -262 30 181 91 93 -25 -161 -108 40 230 111
$$ packed form
3082A15J32m7l99r6J47J47J76n0j28l79R6K84J92n5j72j98j36M14K01j80k54p9
3104b69J33J14L03j53j43o8N6J89k1P3j30l58r8M08K34r3k13m03J38L39J90n4
3126A74l85n6J27M3K25P6k18j53o1L73K19j69j01k05q8K83j9n9o7n5p8J96K66
3149B68k9k90q2j48K58J10O3l3l70P8K44K99j61j60l02J57J42J37P2k12k69m8
3171b76J10L29o7p7j8j70P7J61K60j33l29l0K9K87J26k84k08r8L83p6p1n0N6k00
3195b69J57K45Lk12R7j21J3J77Q7Q6o39L25O5J18n8L9k04j04K30K6l4R3j91j88
3219b59J71J32J52k2k59j49l4M01K02k25j56q7K29k0K38k18k14p0J08J73J86k25
3241E4j75j26N3M35j65O1l84J23N6LK52k71R3k71K92J51r0Kj18j36N3J48J90j19
$$ plain form
3265 111 -35 -292 -136 -30 287 162 -103 -133 -128 -88 262 26 -24 -25 -258 198 247 129 -123 -202 -30 103 8
3288 8 151 -161 -133 -95 97 279 0 -105 -105 -51 -82 163 217 163 -192 -58 74 44 126 -89 -222 21 8 161
3312 161 28 41 -130 -227 7 28 -21 2 -142 -59 -40 100 174 -205 -140 -86 -6 91 -70 -30 -320 -53 -37 230 157
3337 157 92 -260 -141 -111 46 116 49 -137 -246 -30 45 172 99 -62 -365 105 249 160 28 -142 -199 -67 145
3360 145 133 -7 -126 -170 33 236 200 80 -131 -255 3 74 131 169 -22 -168 44 176 144 42 -212 5
3382 5 -125 87 165 163 -115 -66 -70 49 48 22 -179 -155 -144 159 164 106 -134 -134 -281 244 102 136 47 -132 -104 74 125
3409 125 64 -118 -185 -111 145 78 28 -63 -39 65 59 77 216 19 -264 -55 -161 101 -76 109 -73 -248 -73
3432 -73 307 103 3 -101 -1 2 163 87 -153 -26 -45 -52 30 127 -61 -189 -148 217 18 123 92 -149 -90 54
$$ packed form
3265A11j46k57J56J06L17j25k65l0NM0L50k36n0jk33M56M9j18k52p9J72J33r5
3288HJ43l12K8L8J92J82k79j05%N4l1K45N4n4l55J34J32l0Q2k15j33K43j3J53
3312A61j33J3j71r7K34K1m9K3j44Q3J9J40P4l79O5N4Q0R7j61M0k90K67J6K67p3
3337A57o5l52J19L0J57P0o7j86j09K16P5J27p3j61l03M70J44q9j32j70n7J32K12
3360A45j2j40j19m4K03K03l6j20k11j24K58P1N7L8j91j46K12J32l2j02k54K17
3382Ej30K12P8kk78M9mJ19jk6k01K4J1L03Nn8k40%j47N25j42L4q9j79K8J78N1
3409A25o1j82o7P4K56o7n0r1K4J04oJ8J39j97k83K09j06K62j77J85j82j75J75
3432g3L80k04j00j04J00LJ61p6k40J27j9pQ2R7j88j28M1L65j99J05l1k41N9J44
$$ plain form
3456 54 182 -47 26 33 -23 -147 179 293 -6 -61 47 18 145 16 20 -73 -166 185 157 -169 1 -250 -99 204
3480 204 6 171 -63 -281 -81 -155 135 151 42 -176 -8 83 137 143 37 -70 80 90 73 110 -79 -82 -192 76
3504 76 183 -2 -152 150 -88 -12 46 193 -24 -155 -217 -172 35 55 -135 -119 -213 -21 200 154 128 -155 -110 -53
3528 -53 -134 147 69 -182 -158 30 109 57 26 41 4 -127 136 109 10 -110 -184 -86 -82 210 20 -105 -214 1 163
3553 163 -93 22 -27 -200 8 142 175 27 -9 -20 -201 84 159 58 -36 -106 -188 26 163 145 -82 -219 -4
3576 -4 -100 127 149 -113 -134 -235 78 142 41 -27 -159 -133 -11 171 159 -33 -73 -24 128 207 197 -227 -6 84 -141
3601 -141 137 163 26 -147 -137 -29 63 124 -129 -272 -28 -23 104 49 41 2 -102 -124 106 30 16 -20 4 -60 152
3626 152 185 -88 -219 -44 234 21 106 -26 -66 -58 124 171 58 -94 -35 36 -53 159 193 -49 -147 -145 -28 -89 157
$$ packed form
3456E4J28k29P3Pn6j24L26J14k99n5J08k9J27j29Mr3r3L51k8l26J70k51J51L03
3480B04j98J65k34k18K00p4K90J6j09k18J68R1N4Oj06j07J50J0j7L7j89lj10K68
3504G6J07j85j50L02k38P6N8J47k17j31o2M5K07K0j90J6r4J92K21m6k6k83M5N7
3528e3q1K81p8k51K4J88P9n2l1J5l7j31K63k7r9j20p4R8MK92j90j25j09K15J62
3553A63k56J15m9j73K08J34L3j48l6j1j81K85P5j01r4p0q2K14J37j8k27j37K15
3576dr6K27K2k62k1j01L13O4j01o8j32K6J22J82j2j92m0M9J52P9j0m24K21R0k25
3601a41K78K6j37j73J0J08R2O1k53j43K44NJ27n5ql9j04k2K30p6j4l6K4o4K12
3626A52L3k73j31J75K78k13Q5j32m0QJ82M7j13j52N9P1q9K12L4k42r8KJ17o1K46
$$ plain form
3651 157 206 -16 -171 66 -97 102 -69 -165 -131 -24 149 127 24 -78 -148 -122 146 127 90 -84 -147 169 150
3674 150 152 19 -40 -202 -53 -4 102 -9 -11 -101 -91 -24 -27 -125 -64 -44 -163 -19 -92 15 -118 -270 33 -15 117
3699 117 89 -98 -158 -46 114 114 -78 -123 -3 89 50 182 112 -107 -61 55 129 203 -23 12 -44 0 173 119 28
3724 28 -94 -126 -117 177 195 -102 -111 -61 -99 44 188 65 -34 -217 32 -95 70 128 -141 -137 8 140 167 174 -91
3749 -91 -161 -206 -22 154 38 116 -92 -96 60 121 101 24 -224 16 45 70 146 -16 -109 -57 -44 147 13 -94 -23
3774 -23 -172 195 175 161 -183 -123 -164 25 176 46 25 -91 -95 95 373 83 83 -128 -125 161 -6 182 -18 -107
3798 -107 -165 78 37 55 -106 -60 -146 141 187 8 -76 -15 -21 48 93 -54 37 -85 -217 52 254 36 -5 -132 -12
3823 -12 -39 43 203 71 32 -236 20 47 102 134 -65 -175 11 -9 6 -15 -63 -76 -124 107 38 -67 -64 -90 -221 133
$$ packed form
3651A57M9k22j55K37j63J99j71r6L4J07J73k2j03j02p0K6K68j9l7j74o3L16j9
3674A50Kj33n9j62J49M9J06j11kr0J0O7lr8O1K0j19J44p3J07j33j52L03m8J32
3699A17k8j87o0J12J60%j92m5J20R2l9J32p0k19M6J16P4P4k26L5n6M4J73n4r1
3724B8j22l2RK94J8k97rN0l8J43J44j23r9j83K49j27J65N8k69MJ45J32K7Pk65
3749i1p0m5J84J76j16P8k08mJ56O1k0p7k48K40K9K5P6j62r3N2J3J91j34j07P1
3774b3j49L67k0j4l44O0m1J89J51j30k1j16mJ90K78k90%k11LK86j67J88k00q9
3798a07n8K43m1J8j61M6q6K87M6j79q4O1oO9M5j47R1j22j32K69K02k18m1j27J20
3823a2k7Q2J60j32l9k68K56K7N5L2j99j10J86k0J5k1m8j3m8K31o9j05Lk6j31L54
$$ plain form
3849 133 13 118 -12 -24 -13 -57 148 -81 -39 -135 -118 8 93 88 -113 -82 -30 48 21 -2 -118 -131 62 30 95 162
3875 162 -225 -87 180 1 263 -74 -76 -133 65 143 214 161 -237 -49 -70 42 4 79 1 -198 -62 38 137 5
3899 5 80 13 -188 65 22 70 -30 -57 -189 141 59 206 -209 -323 -105 -8 75 39 40 -154 21 29 136 -134 16
3924 16 -86 -71 68 123 51 -65 -30 -117 207 255 83 -81 -111 9 218 26 -3 44 24 -179 14 126 -16 55
3948 55 -94 -51 75 -35 79 98 -146 -38 -100 61 132 -15 -147 -137 -40 25 93 32 -34 -72 -113 140 136 -173 -158
3973 -158 -217 -76 -12 280 -11 -15 -130 103 159 155 53 -57 -211 -11 71 84 -49 31 -97 74 97 48 112 -74
3997 -74 -123 -26 82 -131 -27 -40 -88 4 130 -3 47 -143 -73 -64 35 85 -83 -67 -111 62 85 175 33 -128 -70 58
4023 58 -10 95 -8 -71 -147 143 181 54 26 -185 -82 46 117 186 -11 -34 3 -156 141 203 56 78 -105 -15
$$ packed form
3849A33j20J05j30j2J1m4K05k29M2r6J7J26Q5nk01L1N2P8k7k3j16j3J93l2O5O7
3875A62l87J38K67j79K62l37kn7J98P8P1n3l98J88k1J12l8P5p8j99J36J00R9j32
3899EP5o7k01K53m3M8j00k7j32L30q2J47m15j14K18R7Q3l6Jj94J75QJ07k70J50
3924A6j02J5J39N5p2j16L5q7L24M8j72j64l0J20K09j92k9M7k0k03J93J12j42P1
3948E5j49M3J26j10J14J9k44J08o2J61P1j47j32J0R7O5O8o1o6l8m1K53ml09J5
3973a58n9J41O4K92k91mj15K33N6mj02j10j54K00Q2J3j33Q0j28J71K3m9O4j86
3997g4m9R7J08k13J04j3m8R2J26j33N0j90P0RR9N0j68J6m4J73K3R0j42j61N8J28
4023E8o8J05j03o3p6K90L8j27k8k11J03J28P1O9j97k3L7j59K97O2j47K2j83R0
$$ plain form
4047 -15 81 122 90 39 -162 -99 182 146 81 -119 -149 -52 133 283 36 -85 22 -77 150 20 95 -168 -99 -63 250
4072 250 52 88 82 -76 -66 102 251 174 -49 -172 -112 16 100 -69 -137 -62 38 18 144 -7 -28 -190 -252 173
4096 173 85 30 -2 -252 72 121 140 157 -89 59 -268 7 174 171 -8 -165 71 85 27 10 -11 -77 71 58 -34
4121 -34 190 -100 -114 54 75 99 127 109 -224 117 39 166 153 -86 -36 109 53 186 40 8 -258 -4 156 189
4145 189 19 -35 -124 78 -8 206 40 81 -167 59 -130 125 122 31 -147 -48 -133 282 141 -100 -252 -191 63
4168 63 197 201 14 -214 -138 -121 150 114 55 -73 76 179 17 114 93 -15 -222 117 172 192 -45 -75 -133 75
4192 75 101 145 53 -53 -113 4 74 47 -151 -230 -56 -81 103 210 -1 -161 -85 183 78 122 114 -152 -79 -62 49
4217 49 132 23 -57 -157 -2 62 24 33 -150 -182 -94 75 107 111 -42 -63 -88 -13 68 -87 -127 -146 -38 70 -42 93
$$ packed form
4047a5R6M1l2n1k01O3K81l6o5k00l0R7J85J50k47j21J07r9K27j30P5k63O9L6L13
4072B50j98L6oj58J0J68J49p7k23j23O0J28Q4j69o8P5J00k0J26j51k1j62o2M25
4096A73q8n5l2k50L24M9J9J7k46J48l27K75J67lj79j57K36J4n8j7k1o6J48j3r2
4121c4K24k90j4J68K1K4K8j8l33L41p8J27j3k39N0J45n6J33j46l2k66K54J60L3
4145A89j70n4q9K02q6K14j66M1k48K26j89K55lr1j78R9q5M15j41k41j52O1K54
4168F3J34Mj87k28P6J7K71l6n9j28J49J03j62R7k1j08k07L39N5K0k37l0n8K08
4192G5K6M4r2j06o0J17P0k7j98p9J74k5J84J07k11j60P6K68j05M4qk66P3J7J11
4217D9Q3j09q0j00J55O4l8Rj83l2Q8J69L2Mj53k1k5P5Q1j55m0j9J08J08j12J35
$$ plain form
4243 93 -180 -168 -120 -63 84 43 -13 87 -94 136 11 63 -137 -130 192 117 134 98 -110 -41 -92 -33 143 -67 16
4268 16 -117 -93 168 45 29 -67 -223 5 16 124 22 41 -66 -57 168 140 68 -66 -187 -157 99 127 -132 78
4292 78 -165 -212 6 93 162 -86 -104 -57 29 47 115 -18 -105 20 38 131 56 51 -100 -128 47 75 210 -78 -45 -69
4318 -69 112 72 -75 85 -170 -88 18 109 204 -69 -234 -33 50 201 72 -103 -160 -81 203 66 92 2 -271
4341 -271 -96 8 155 130 99 35 -57 -25 69 66 38 -106 -129 124 105 98 -10 2 -53 -42 57 89 40 -17 -179 146 57
4368 57 -47 -14 -95 -102 94 68 163 -12 -259 -144 38 86 43 16 -218 -133 175 256 106 -120 83 -17 51 10 166
4393 166 -40 -227 -86 -31 143 175 -60 -128 -199 153 154 92 6 15 -80 -45 89 156 22 -34 -125 -30 159 93 -107 -184
4419 -184 -166 -114 7 94 149 -156 -135 63 241 -12 69 -48 38 69 37 125 39 77 -134 83 39 87 79 -24 -134
$$ packed form
4243I3k73J2M8N7J47m1n6J00j81K30j25N2k00PL22p5J7l6k08O9n1N9J76k10Q3
4268A6j33K4K61j23j6r6j56K28J1J08j02J9j07RK25k8p2j34j21L0K56K8k59K10
4292G8k43m7K18Q7O9k48j8M7Q6J8O8j33q7J25J8R3p5nj51k8J75K8J35k88L3k4
4318f9J81m0j47J60k55Q2J06R1R5k73j65K01Q3J51j29j75n7P9K84j37K6r0k73
4341b71J75J04J47k5l1o4r2L2R4lk8j44k3K53j9pj08J2n5J1R9L2m9n7j62L25q9
4368E7j04L3q1pJ96k6R5j75k47J15J82M8m3k7k34Q5L08Q1j50k26K03j00O8m1J56
4393A66k06j87J41N5J74L2k35o8p1L52Jo2q6Rr5L5J34O7j34n6r1R5J89o6k00p7
4419a84J8N2J21Q7N5l05K1J98J78k53Q1j17Q6L1l2Q8q6L8k11K17m4M8qj03j10
$$ plain form
4444 -134 -53 144 129 -82 -195 -90 -4 28 280 123 -214 -213 -28 194 219 229 -105 -209 -66 56 17 -164 22
4467 22 -176 72 207 -27 -158 -258 -35 -72 70 81 31 -114 -99 -30 103 154 122 -132 -120 5 318 128 -69
4490 -69 -6 -142 -15 23 -12 123 -220 -114 57 160 135 56 -153 -222 -83 159 174 -40 -187 -128 -28 77 149
4513 149 100 -132 -229 -7 -19 170 -1 -158 -49 -74 128 48 38 86 -117 118 36 182 29 -148 -132 -96 116
4536 116 36 -72 -198 -106 -9 213 154 32 -121 -115 -250 3 169 111 -173 -78 -111 76 139 158 137 -109 -267 165
4560 165 175 71 -8 -123 -96 5 233 67 55 -118 -75 79 138 151 -19 -56 -63 125 148 2 76 -184 -193 106 223
4585 223 111 51 -110 -108 50 306 50 -48 -137 -124 142 182 120 -83 -230 -229 5 37 19 -74 -150 -68 -11 183 82
4610 82 -30 -58 -130 -96 -47 252 78 -47 -96 121 233 275 29 -103 -46 -54 -55 82 -64 63 -168 7 -33 89
$$ packed form
4444a34Q1J97j5k11j13J05Q6L2K52j57l37JJ85K22K5J0l34j04J43J22l9j81J86
4467B2j98K48J35k34j31j00K23l7J42J1n0j45J5O9J33N1l2k54J2J25L13j90j97
4490f9O3j36J27L8l5J35l43J06J71J03k5p9k09o9J39K42J5k14j47N9J00J05P2
4513A49m9k32r7K22j2J89j71j57J09k5K02q0j0M8k03K35q2J46j53j77J6L6K12
4536A16q0j08j26R2R7K22n9j22j53Oj35K53J66n8k84R5l3J87O3J9k1k46j58M32
4560A65J0j04p9j15K7J01K28j66j2j73M3J54N9J3j70l7pJ88K3j46P4k60rK99J17
4585B23j12o0j61KJ58K56k56r8q9J3K66M0o2k03j47JK34L2j8r3p6Q2N7J94j01
4610H2j12k8p2L4M9K99j74j25m9K17J12M2k46j32N7qjJ37j46J27k31J75m0J22
$$ plain form
4634 89 221 -154 -150 -91 95 35 -91 -291 -166 -94 109 193 -98 -119 -133 168 22 -8 110 -185 -197 38 267 113
4658 113 72 -54 -68 -31 68 -4 -55 -77 -141 106 130 212 64 -114 -107 16 173 237 -10 -4 -137 -33 79 236 52
4683 52 -154 -188 -44 37 79 -16 -124 -184 -12 57 171 61 -142 42 -134 30 -19 169 -112 -129 -87 70 193
4706 193 -100 64 -197 116 262 188 -17 40 -149 -182 115 -60 -40 -123 -72 -114 88 18 6 -72 -216 -12 80 204
4730 204 28 -107 -142 -78 33 147 -34 -99 -123 -20 122 65 139 -49 -37 -62 80 14 15 -20 -13 -159 130 81 95
4755 95 -32 -45 -6 130 99 160 -125 86 -146 99 4 142 -61 -146 6 -4 304 86 60 -132 -77 60 185
4778 185 46 -126 -329 -10 -98 187 -32 -124 -146 -61 74 70 -48 -44 -106 -107 77 45 3 -90 -196 -25 134 198 73
4803 73 -117 -136 -7 -20 161 135 -116 -74 -26 21 146 177 -4 -134 -30 58 230 187 -107 -236 -34 -24 77 -15
$$ packed form
4634H9J32l75MN9J86o0j26k00J25P2K03Q4k91k1j4L01j46l0J18k95j2K35K29j54
4658A13m1j26j4L7R9p2n1k2o4K47K4Q2j48j78PJ23J57O4k47Oj33J04J12J57j84
4683E2k06l4J44Q1M2r5j08o0J72O9J14j10k03J84j76J64m9J88k81j7M2J57J23
4706A93k93J64k61L13J46p4k05N7j89l3K97j75K0q3N1m2K02p0j2p8j44K04R2J24
4730B04j76j35l5O4J11J14j81o5k4J03J42n7P4j88J2k5J42o6Jl5Pj46K89m9J4
4755I5j27j3L9J36l1O1k85K11k32K45r5J38k03q5J52j0L08k18k6j92N5J37J25
4778A85j39j72k03L19q8K85k19r2k2Q5J35mj18Mo2jJ84l2m2r3j06J71J59O4j25
4803G3j90j9J29j3J81k6k51M2M8M7J25L1j81j30J04Q8J72m3k94j29K02J0J01r2
$$ plain form
4827 -15 -28 -164 -119 24 96 144 54 23 20 54 61 147 -51 -64 5 -144 46 229 57 -191 -150 -2 69 199 -22 -94
4853 -94 -153 32 22 44 -1 -167 44 -85 4 30 -24 -249 -44 -55 -26 143 54 -205 -148 -139 117 100 -108 -77 -7 109
4879 109 128 38 93 63 -16 -44 178 21 -187 -4 -80 50 32 46 22 -22 31 22 186 141 51 -100 -152 -162 133 88
4905 88 16 -104 67 55 58 237 60 -156 -43 -61 65 5 159 -42 -139 -60 196 114 -47 -65 -11 -57 31 94 -160
4930 -160 -109 -208 119 215 -59 75 -84 -155 -58 120 -4 78 -50 -149 -17 142 162 10 -96 -87 -20 94 83 -43
4954 -43 -222 6 116 121 105 102 -130 -227 -67 -31 210 188 -24 -261 65 50 82 152 9 -225 -60 132 162 175 -15
4979 -15 -120 -19 -27 248 165 -31 -57 -5 178 176 -56 -74 -41 -213 -31 229 108 -75 -147 2 20 159 113 -43
5003 -43 -156 -130 80 158 55 -5 -127 -140 -72 81 145 24 -6 -147 6 118 44 -80 -107 38 33 36 90 -160 18
$$ packed form
4827a5j3j36M5J43P2M8r0l1lL4PQ6j98j3O9j49J90J83j72k48M1J48P1J30k21p2
4853i4n9J85j0K2m5j66K11j29Q9K6n4k25K05j1K9J69q9k59N7RK56j7k08L1P0J16
4879A09J9r0N5l0p9k8K22j57k08J83p6J30j8J4k4m4N3rJ64m5r0j51n2j0K95m5
4905H8p2j20J71j2LJ79j77k16J13j8J26o0J54k01r7P9K56q2j61j8N4m6Q8O3k54
4930a60N1r9L27R6k74J34j59p1R7J78j24Q2j28r9J32J59K0j52j06RO7J14j1j26
4954d3j79K28J10Nj6lk32r7J60L6K41k2k12k37L26j5L2P0j43k34J65J92L0J3j90
4979a5j05J01qK75q3j96k6N2J83kk32j8L3j72J82K60j21j83p2J49J8J39m6j56
5003d3j13K6K10P8j03o0j22j3O8J53O4j21l0j41J53J12p4j24k7J45nLN4k50J78
$$ plain form
5028 18 -127 70 136 175 0 -23 -20 149 105 51 9 -220 -62 86 233 56 39 -66 -358 48 180 46 86 -77
5052 -77 -93 -14 71 106 185 -10 -128 0 143 77 16 -199 -142 -39 77 161 -28 -132 21 88 44 4 -63 -100 73
5077 73 94 235 152 -103 -88 -61 181 18 -32 -128 -206 -146 -73 -77 148 108 -153 10 23 104 130 38 -68 -51 14 -50 282
5104 282 44 -165 -8 -73 -39 -110 76 -141 -240 -128 107 125 52 -156 -119 -88 62 132 173 -84 -123 57 96 105 177
5129 177 -113 -29 7 196 110 49 -113 -201 -79 39 67 -11 -80 -75 -14 -2 202 6 -59 -105 101 170 50 -160 -220
5154 -220 -36 77 -51 -35 -51 -2 23 17 117 88 123 -39 -22 -32 111 -3 153 7 -187 0 225 143 53 -6
5178 -6 -80 34 4 94 12 -100 -153 -86 158 -38 -7 41 -205 8 75 114 219 19 54 -59 27 205 17 -103 -46
5203 -46 54 167 193 -73 -81 -173 -168 121 167 8 -172 166 -188 6 -128 55 -40 -61 -87 14 119 -69 -39 -201
$$ packed form
5028A8j45J97O6L9j75k3LJ69m4n4m2k29J58J48J47j77j7j05k92M06J32j34M0j63
5052g7j6P9Q5L5P9j95j18J28J43o6o1k15N7J03J16Q4j89j04J53O7m4m0o7l7J73
5077G3K1J41q3k55J5K7K42j63n0r6p8O0P3mK25m0k61J63J3Q1K6r2j06J7O5o4L32
5104B82k38k09J57o5L4p1J86k17r9J12K35J8p3k08L7L1J50P0M1k57l9J80L9RP2
5129A77k90Q4L6J89q6o1j62q8J22J18K8p8o9NO1J2K04j96o5m6K06O9j20k10o0
5154b20J84J13j28J6j6M9K5oJ00k9L5j62J7j0J43j14J56j46j94J87K25q2r0n9
5178fp4J14l0R0q2j12n3O7K44j96L1M8k46K13O7L9J05k00L5j13Q6J78j88j20N7
5203d6J00J13K6k66qr2NK89M6j59j80L38l54J94j34J83r5k1k6J01J05j88L0j62
$$ plain form
5227 -201 -38 159 157 -64 -97 -82 110 -75 -6 -136 -56 -170 -78 38 114 4 -122 -209 -100 171 42 19 -90
5250 -90 -34 -99 73 76 95 -261 -131 -38 152 49 96 -78 -122 -57 -60 123 -94 -10 -51 12 -75 126 78 -118 -124 -146 -44
5277 -44 -15 95 -96 -111 -168 166 125 290 -71 -105 14 91 128 47 -74 -1 -28 102 102 234 -234 41 10 -2 135
5302 135 77 -44 -67 -56 144 26 94 -161 -18 -200 53 134 19 145 -186 -280 -82 7 85 -115 -125 -220 -47
5325 -47 7 38 124 10 -130 50 172 28 43 -203 -77 128 216 65 -74 -48 -88 -37 88 -93 3 -177 -109 -54
5349 -54 9 -39 83 -27 -205 -27 43 23 -15 -223 -41 -7 205 -83 38 -90 -34 37 21 73 -61 -51 5 47 13
5374 13 41 -140 -27 -25 117 144 128 8 -38 -205 95 5 20 25 -112 -10 -52 62 112 202 -126 -105 -52 23 61 144
5400 144 -88 -77 12 -16 10 12 -65 -19 -43 68 122 115 -154 71 -43 79 104 90 -3 84 85 170 30 128 -68 -142 -77
$$ packed form
5227b01J63J97kk21l3J5J92j85O9j30Q0j14R2J16P6j10j26q7J09K71j29k3j09
5250i0N6o5J72LJ9l56J30R3J90j03M7j74m4O5lJ83k17Q4m1O3q7K01m8j96ok2J02
5277d4K9J10j91j5n7L34m1J65l61l4J19P7L7q1j21P3k7J30%J32m68K75l1j2J37
5302A35n8j21k3J1K00j18O8k55J43j82K53Q1j15J26l31r4J98Q9P8k00j0r5J73
5325d7N4L1Q6j14j40J80J22j44J5k46J26K05Q8j51j39K6m0N1J25j81R6j80O8N5
5349e4O3m8J22j10j78J78P0k0l8k08J82L4K12k88J21j28N6P1j6N2j34J0N6M2l4
5374A3K8j81J13KJ42K7j6j20m6j67L00r0J5Nj37J02m2J14N0R0l28K1N3P5L8Q3
5400A44k32J1Q9k8K6Kp7M6k4J11N4pk69K25j14J22K5j4r3Q7JQ5j40R8j96p4O5
$$ plain form
5427 -77 -20 176 8 -197 -199 72 -146 91 28 56 -54 79 -35 39 148 -188 -100 -61 106 143 -16 -151 -187 63
5451 63 221 3 16 1 -151 -138 -35 10 -25 46 61 -51 138 101 -43 -71 82 -39 -117 22 -144 -145 -116 -30 225
5476 225 141 81 -29 -70 -23 152 3 -101 17 66 -118 47 216 7 -13 -195 -86 -6 138 -8 -118 10
5498 10 16 -132 45 114 -122 -127 84 49 183 137 -250 -100 93 102 128 83 -31 7 -116 31 225 93 -15 -9 -138
5523 -138 68 -41 88 2 -92 -141 94 62 29 70 -137 -57 84 131 198 26 25 -41 -11 23 254 6 -141 6 178
5548 178 163 84 -5 -251 11 80 30 298 6 -104 60 -5 131 95 142 -79 -76 149 93 80 23 -292 -159 -88 9
5573 9 20 -119 -271 64 -66 192 58 -38 6 36 -57 21 -11 -13 -52 -53 -31 81 19 87 -16 -91 -52 94 135 -37 -127
5600 -127 129 -25 -90 -4 19 -347 -142 -92 -25 -124 61 -1 -100 72 38 127 36 -65 -68 39 53 162 39 -76 -181
$$ packed form
5427g7N7J96j68k05kK71k18K37o3K8j10J33j14P4J09l36Q8L9J67L7j59j35l6K50
5451F3J58k18J3j5j52J3J03M5l5P1J5j12J89l7j44k8J53j21p8J39j66jK9Q6K55
5476B25q4o0j10m1M7J75j49j04J18M9j84J65J69k09k0j82J09Q0J44j46j10J28
5498A0Oj48J77O9k36nK11l5J34m6l87J50J93RK6m5j14L8j23J47J94j32j08Oj29
5523a38K06j09J29q6r4m9K35l2l3M1k07Q0J41M7O7j72jo6L0L4K31k48j47J47J72
5548A78j5p9q9k46K62O9n0K68k92j10J64o5J36l6M7k21LK25n6j3n7l15J33P1R7
5573IJ1j39j52L35j30K58j34r6M4L0r3P8l2kl9jK2J12o2O8j03p5L9J46M1j72r0
5600a27K56j54o5Q6K3l66K05N0O7r9J85o2r9J72l4Q9r1j01lJ07J4J09j23j15j05
$$ plain form
5625 -181 -3 144 165 96 -116 -181 -71 -81 31 -40 -171 -8 -28 -40 53 37 -14 -58 -129 48 3 -9 -58 -18 38 183
5651 183 84 -37 -190 27 -102 177 56 36 -168 -202 52 -35 146 57 -14 -78 -228 -45 145 117 -10 -189 17
5674 17 71 -32 10 7 -133 34 108 55 35 -100 -13 -20 200 11 -69 23 -5 -46 -75 70 210 -18 11 106 42 -79
5700 -79 -70 52 56 -81 124 125 22 -76 -250 41 63 46 -33 16 -96 -203 148 63 110 -63 -14 -197 111 48 -22 -91
5726 -91 -93 35 6 180 78 101 -35 14 13 98 22 -142 -30 78 -15 94 136 6 41 50 60 25 109 -33 -121 -303
5752 -303 109 77 53 -28 -200 -173 -116 85 -71 -33 -156 -14 88 147 167 68 24 -98 -124 102 241 105 -40 -89
5776 -89 27 51 -39 -7 -226 7 233 109 99 -122 -171 56 -31 20 139 -81 -14 -161 9 -10 13 -15 -65 -185
5800 -185 -33 105 20 38 -216 -80 90 158 168 12 -78 -109 -175 26 33 52 -10 -21 43 20 206 -70 -121 -49 -12 148
$$ packed form
5625a81J78J47K1o9k12o5J10j0J12p1j31J63k0j2R3j6n1m4p1J77m5j2m9M0N6J45
5651A83r9j21j53K17j29K79j21k0k04l4K54q7J81q9p1o4j50J83J90k8j27j79K06
5674A7N4j03M2lj40J67P4n3k0j35Q7pK20j89q0R2k8m1k9J45J40k28K9R5o4j21
5700g9RJ22Mj37K05Jj03r8j74K91K2j7p9M9j12j07L51q5M7j73M9j83L08o3p0o9
5726i1kJ28k9J74j02K3j36M9jQ5p6j64J12J08r3J09M2j30L5RJ0l5Q4j42q8j82
5752c03M12l2k4q1j72K7N7K01j56L8j23J42J02N9K0r9m4j22k6K26J39j36j45m9
5776h9J16K4r0L2k19K33K26j24j0k21m9K27q7N1J19k20O7j47J70j9K3k8n0j20
5800a85J52J38q5J8k54J36J70O8J0j56r0l1o6K01PJ9o2j1O4k3J86k76n1P2L7J60
$$ plain form
5826 148 42 41 -81 9 -138 34 140 37 -146 -40 53 -89 128 96 -50 -114 184 245 -70 50 -67 -164 3
5849 3 25 10 39 -70 65 21 70 117 -88 87 -48 -161 -66 77 -158 -35 13 -16 161 76 -89 -158 -254 -139 -26
5874 -26 124 34 34 32 85 185 -99 -120 70 108 29 142 139 45 -149 -159 -73 -39 139 -26 -65 46 5 55 116 177 -38
5901 -38 -163 -214 37 144 135 98 -19 154 -18 -266 90 109 -41 -113 53 22 -35 -11 -94 -29 124 100 0 87 -88
5926 -88 -10 -84 72 9 -150 5 -20 -181 221 -35 -26 62 40 -13 124 36 44 -61 -44 15 93 -37 -100 -24 -41 -92 158
5953 158 32 48 -81 28 139 36 104 41 -75 88 -106 126 -36 -13 -61 -104 28 155 198 -57 -116 -133 -43
5976 -43 150 18 65 38 -144 -9 92 -114 -74 31 -20 19 -15 9 -2 108 -66 150 123 74 -83 -58 17 24 117
6001 117 142 169 69 -74 -8 37 50 -40 93 -88 64 -1 9 -20 3 -5 118 16 84 23 -177 -133 28 -6 5 -39
$$ packed form
5826A48j06jj22R0j47J72J06j03j83J06R3j42K17l2j46o4K98O1l15J20j17r7J67
5849CK2j5K9j09J35m4M9M7k05J75j35j13R5J43k35J23M8k9J77q5j65o9r6J15J13
5874b6J50r0%kN3J00k84k1J90L8p9J13lr4j94j0Q6L4J78j65l9J11m1N0O1O1k15
5901c8j25n1K51J07rl7j17J73j72k48L56J9j50p2J66l1n7K4q3O5J53k4j00Q7j75
5926h8P8p4J56o3j59J55k5j61M02k56RQ8k2n3J37q8Qj05J7N9P8j30o3P6j7n1K50
5953A58j26J6j29J09J11j03O8o3j16J63j94K32j62K3m8m3J32J27M3k55n9j7R0
5976d3J93j32M7k7j82J35J01k06M0J05n1L9l4K4j1J10j74K16k7m9j57K5P5PR3
6001A17K5K7j00j43O6M5J3r0J33j81J52o5J0k9K3qJ23j02O8o1k00M4J61l4J1m4
$$ plain form
6027 -39 -11 -18 19 42 32 220 -39 -76 -52 -11 162 181 -72 -59 -161 3 -36 -53 -65 18 20 16 -97 13 -116 18 44
6054 44 -19 -175 -24 85 -56 124 59 136 -85 -37 -129 -101 61 39 69 3 -231 -58 123 28 -6 -12 -159 19 82
6079 82 -216 -38 -69 -125 -89 53 223 -7 -206 153 -49 -19 -43 -11 85 -16 -90 143 115 -20 34 -271 -7 81
6103 81 47 27 -102 38 -79 52 24 -120 -188 -10 109 92 -18 -31 22 -99 31 46 54 56 -98 88 74 13 13 -120
6129 -120 -52 4 70 -6 53 64 50 -11 74 92 -86 52 -90 31 -16 24 37 -94 79 44 -59 -90 -5 -109 -35 87
6155 87 34 -49 -65 28 -58 -47 -143 -178 68 -320 -1 -59 78 24 -68 -41 -8 42 145 -61 81 -36 22 -135 -175 13
6181 13 -30 -6 21 -117 50 97 21 69 134 17 -98 133 26 5 -158 98 73 33 96 -59 -43 -97 -100 -73 -69 -132 120
6208 120 170 -14 5 41 -61 -40 -19 27 -67 70 21 -153 33 66 139 36 -80 4 29 -113 67 -249 34 -52
$$ packed form
6027c9K8pL7K3j0J88k59l7K4M1J73J9k53J3j02J64l9j7j2Q3Kmj13J10j29J34K6
6054D4o3j56J51J09j41J80o5P7k21M8r2K8J62k2L0o6k34J73J81r5l4oj47J78O3
6079H2k98J78l1n6L6J42J70k30j99L59k02L0k4L2R6j01p4K33k8j35N4l05K64Q8
6103H1l4k0j29J40j17J31k8j44o8J78J19j7j10j3N3j21J30J5QKj54J86j4o1%j33
6129a20O8N6O6p6N9J1j4o1Q5J8j78J38j42J21m7M0J3j31J73l5j03l1Q5j04P4J22
6155H7n3q3j6R3q6J1r6l5K46l88L19n8J37n4r2K7L3N0J03k06J42j17N8j57m0J88
6181A3m3K4K7j38J67M7p6M8O5j17j15K31j07k1j63K56k5m0O3j55J6n4lK7Mo3K52
6208A20N0j84J9L6j02K1K1M6r4J37m9j74J86L3P3j03j16Q4K5j42J80l16K83q6
$$ plain form
6232 -52 -41 -45 -90 88 -112 -39 14 -45 -41 24 -7 -61 134 -9 12 -25 9 140 27 5 99 129 30 53 -151 -117 7
6259 7 70 -26 61 3 -123 162 -23 99 -66 1 -5 -17 13 98 -84 -62 25 -27 -43 82 36 -120 -109 49 46 -66 -62
6286 -62 5 2 -134 51 24 -1 -7 -71 12 62 18 -85 21 -99 135 117 16 -30 -175 -177 -40 -2 77 -55 -62 27 31 27
6314 27 -31 71 9 -196 37 37 56 -102 -32 -140 41 6 -32 -34 43 215 52 122 28 70 -118 -76 61 -149 -43
6339 -43 75 6 20 -120 -67 22 -71 -89 41 -6 -189 82 104 7 12 72 58 34 77 -133 -100 -161 -49 -116 19 35 -75
6366 -75 39 -6 -17 -67 99 -90 0 -119 -21 18 49 -36 8 -10 -20 83 43 34 82 38 -92 12 -16 84 -48 61
6392 61 -34 -48 -67 -174 -25 -50 -104 49 -56 7 203 -144 -28 23 -28 -25 -156 -70 47 95 4 -92 81 -39 -137
6417 -137 -18 135 -16 9 92 45 33 -106 -17 -138 -55 128 90 131 172 15 86 49 -88 -107 -113 80 -71 1 -147
$$ packed form
6232e2J1mm5J78k00P3N3n9MO5l1n4J95j43K1l7L4J31j13k2R4L0r9K3k04L4J24
6259GO3r6Q7n8j26K85j85J22j65O7oj2L0Q5j82K2Q7n2j6J25m6j56J1J58lj12M
6286f2O7lj36J85k7k5oo4Q3N0m4j03J06j20K34j8j01m6j45kJ37L8P9j32pQ9Mm
6314B7n8J02o2k05K33%J9j58P0j08J81l5l8kP7J72j63P0r4M2j88M2J37k10J06
6339d3J18o9J4j40N3Q9r3j8J30m7j83K71K2r7NO0j4k4M3k10L3o1J12o7J35J6j10
6366g5J14m5j1n0J66j89R0j19R8L9L1q5M4j8j0J03m0rM8m4j30J04k8J00j32J09
6392F1r5j4j9j07J49k5n4J53j05O3J96l47J16N1n1Lj31Q6J17M8r1r6J73j20r8
6417a37J19J53j51K5Q3m7j2j39Q9j21Q3J83l8M1M1j57P1l7j37j9oJ93j51P2j48
$$ plain form
6442 -147 -239 92 -6 -30 -112 35 100 43 -30 -48 -20 91 32 161 56 78 -90 9 8 -127 6 -109 59 18 -199
6467 -199 17 -78 -46 -24 10 9 -30 42 -87 16 -243 -3 154 121 -56 -14 -178 -12 -1 -22 -8 30 -128 80 -85
6492 -85 -110 -63 -93 -26 88 91 96 -33 -132 10 97 62 18 117 39 -72 -85 89 -125 -174 -15 67 81 -117 -168 128 60
6519 60 -15 58 61 115 20 13 -11 -125 166 93 100 -2 13 -200 -28 -25 -152 36 -29 -52 -15 -189 -27 -61 -8 22 -92
6546 -92 176 47 36 -50 -129 66 -80 74 109 -94 -193 -36 121 67 39 -43 93 38 42 -13 42 -71 215 -4 137
6571 137 196 -66 -62 54 -68 -13 60 -33 51 93 169 28 -41 -95 114 -104 -61 5 -97 80 -134 8 -49 32 -41
6596 -41 -26 -56 -162 41 124 18 1 -8 53 176 45 16 37 40 -7 -148 74 -31 -134 -37 -78 148 118 76 36 -34
6622 -34 -198 -95 -106 17 26 -20 -2 73 -10 96 -61 -27 31 29 -136 60 -121 -86 -84 -54 73 -5 19 10 38 -162 19
$$ packed form
6442a47r2L31r8k4q2J47O5n7p3j8K8J11n9J29j05K2j68R9jj35J33j15J68m1k17
6467a99K16r5L2K2L4jl9P2j29J03k59K40J57l3j77M2j64J66J1k1J4L8j58K08j65
6492h5k5M7l0O7J14LNj29r9J42Q7l5m4R9p8j11j3J74k14m9J59Q2J4j98n1K96o8
6519F0p5P3LN4r5pk4j14K91p3Pj02J5k13J72Lj27J88o5k3L7j74J62l4N3L0j14
6546i2K68j29j1q6p9J95j46J54L5k03r9J57J57n4k8q2J36n5Mn5N5j13K86k19J41
6571A37N9k62MJ16j22N5P3r3Q4M2P6j41o9n4K09k18M3O6j02J77k14J42n7Q1p3
6596d1J5l0j06K03Q3j06j7rO1J23j31k9K1Lm7j41K22j05j03R7m1K26l0m2m0p0
6622c4j64J03j1J23Rm6J8P5q3J06j57L4N8kj65J96j81L5KL0J27p8K4rK8k00J81
$$ plain form
6649 19 24 81 -78 -108 -50 77 -105 -26 31 -87 -106 20 -37 23 -73 -125 -54 135 123 -160 -85 -37 -98 25 -33 -46 -154
6676 -154 -84 -24 27 159 6 -30 58 173 52 34 -271 -110 -96 -72 138 -73 8 -20 -10 -12 6 47 111 8 -30 -32
6702 -32 -96 124 -40 -82 55 151 -48 66 -119 9 -93 -58 29 -41 -153 -55 31 185 -59 99 84 -176 16
6725 16 87 107 12 271 106 -95 -93 -14 66 101 139 -50 28 -3 26 -96 -77 67 -22 67 -38 -129 135 -68 51 72
6751 72 -8 -13 -69 13 94 22 -137 33 3 25 35 0 96 199 53 -62 -11 23 144 82 -36 21 36 -34 68 -43
6777 -43 -11 -49 17 -114 -24 25 -41 -39 5 -55 -13 6 95 -154 2 56 101 28 31 -2 -3 -10 -144 104 66 85 42 66 -71
6806 -71 -52 -1 16 -69 -148 -3 83 29 -93 -66 57 -99 114 53 -36 -54 147 67 227 -15 76 -10 -191 90 22
6831 22 43 -41 -14 32 -13 74 -208 -205 18 126 164 104 22 -238 123 -180 1 5 76 -16 -35 -148 92 41 230 -22
$$ packed form
6649A9NN7j59l0N8J27j82P9N7j18j9J26n7O0r6n2P1J89j2k83P5M8o1J23n8j3j08
6676a54P0O0N1J32j53l6Q8J15j21j8l05J61J4K4K10k11Q1k8J0kJ8M1O4j03l8k
6702c2o4K20j64m2J37R6j99J14j85J28j02L5Q7p0j12R8Q6J54k44J58j5k60J92
6725A6P1K0r5K59j65k01KP9Q0L5L8j89P8l1K9j22J9J44q9Q9j05r1K64k03J19K1
6751G2q0nn6Q2Q1p2j59J70l0K2J0l5R6J03j46j15N1L4J21o2j18N7J5p0J02j11
6777d3L2l8O6j31R0M9o6KM4o0M2J9Q9k49J56N4M5p3Ll3jpj34K48l8J9m3K4j37
6806g1J9N1J7q5p9J45Q6n4j22K7J23j56K13o1q9j8K01q0J60k42R1q6j81K81o8
6831B2K1q4K7M6m5Q7k82LK23J08L8o0q2k60L61l03J81MP1r2j9j13K40n1J89k52
$$ plain form
6857 -22 -148 -25 69 2 -60 -57 13 -29 -9 146 54 40 -102 -130 113 -1 -21 80 -24 -72 -5 14 45 -26 -71 -32 50
6884 50 10 105 74 -71 -42 102 119 -119 109 110 16 -76 21 119 86 -114 34 -57 89 -18 -106 43 -194 47 65
6909 65 -188 -12 1 -173 -12 43 25 -14 -161 64 120 -160 -153 -19 29 10 -6 93 -107 -63 -45 40 -6 -90 70 -8
6935 -8 -135 52 36 63 61 -1 66 108 -74 -47 79 -28 91 -125 158 80 -35 -57 -63 87 45 -11 -63 71 -79 131
6961 131 -57 96 176 -27 29 109 2 -6 72 -29 -58 76 -39 -99 25 -130 7 70 -137 -78 27 -73 -45 -62
6985 -62 72 139 99 35 -105 -39 59 49 -53 -69 6 -43 -32 -229 118 -31 -218 48 70 61 -47 -57 51 82 -14 94
7011 94 -32 -11 90 85 -34 46 231 178 50 103 35 97 -38 -45 1 -64 102 55 35 -28 105 -156 174 -74 12 153
7037 153 -128 32 -93 -22 -149 81 -38 -32 -139 -8 14 -116 -82 73 -18 240 18 -120 -76 -93 -2 -86 -34 48
$$ packed form
6857b2j26J23R4o7o2LP0m2K0J55r2j4j42k8K43j14k0J01j04m8O7J9L1p1m5L9Q2
6884E0m0R5l1j45K9J44J7k38K28Jr4r2R7R8l3k00J48r1J46j07q8J49k37K41J8
6909F5k53J76J3j74J61N5j8l9j47K25N6k80PJ34M8j9j6R9k00M4J8Q5m6q4J60p8
6935hj27J87j6K7ko2O7M2j82K7J26j07J19k16K83p8j15k2oJ50m2n6n2J34j50K10
6961A31j88J53Q0k03N6Q0j07qP8j01k9J34j15o0J24j55J37O3k07N9J05j00K8j7
6985f2J34O7m0o4j40O6R8j0j02j6P5m9J1j97L47j49j87K66K2rj08j0J08L1r6J08
7011I4j26K1J01nj19Q0J85n3j28N3o8O2j35pM6o5J66m7k0o3J33k61L30k48Q6J41
7037A53k81J60j25P1j27K30j19Oj07J31K2j30L4J55r1K58k22j38M4j7R1q4N2Q2
$$ plain form
7061 48 77 58 -25 7 -2 -18 135 -53 -29 31 9 115 13 -76 154 -64 -97 10 -64 -57 80 113 193 19 115 -14
7087 -14 -97 4 -50 60 80 -94 -48 -199 42 -59 -49 27 -57 -79 -161 103 47 85 56 -48 16 -79 -77 26 61 -51
7113 -51 137 -169 -38 70 -9 39 -201 -46 -9 -105 45 -21 83 -22 8 -77 41 124 -57 -27 -66 -57 20 61 73
7138 73 22 -86 -8 -191 -49 -16 160 -155 -104 36 46 95 32 -115 -207 42 45 62 -75 -281 97 -57 -72 72
7162 72 33 -15 108 -50 -131 -75 -106 -49 -66 -12 -97 17 -60 -2 -61 86 12 -31 -32 -47 -136 -12 37 23 113 -49 -21 -105
7190 -105 60 -66 -147 -25 43 -191 127 -15 -17 102 -22 80 33 -190 59 -46 10 28 97 -102 9 -47 -85
7213 -85 174 88 34 -91 -48 -40 117 90 27 -24 23 -179 -36 -71 163 -81 93 89 -28 -119 170 -32 -23 -26 -123 -70 -31
7240 -31 -161 -25 100 -217 48 -10 -30 23 -34 15 22 -77 -80 70 83 -74 36 23 -72 -43 -107 -76 123 154 -62 -166
$$ packed form
7061D8K9j9q3L2rj6J53j88K4O0k2J06j02q9K30k18l3J07p4PJ37L3Q0j74R6j29
7087a4q3J01n4J10K0j74M6j51K41j01J0P6q4k2q2K64n6L8k9j04O4r5KJ03L5j12
7113e1J88l06J31J08p9M8k40J55L7r6J50o6J04j05L0q5J18Q3j81L0l9RP7M1J2
7138G3n1j08P8j83J42L3J76l15N1J40J0M9o3j47r2K49LJ7j37k06L78j54j5J44
7162G2l9m8J23j58q1N6l1N7j7N4q5J14p7N8n9J47p4m3jj5q9J24M9j4R0j62K8q4
7190a05J65j26q1J22O8k34L18j42kJ19j24J02m7k23K49j05N6J8O9j99J11n6l8
7213h5K59q6n4j25M3QJ57k7o3n1M7k02J43l5K34k44J74mj17r1K89k02Rlr7N3L9
7240c1j30J36J25l17K65n8k0N3n7M9Pr9lJ50J3j57J10j3r5K9o4L1J99L1k16j04
$$ plain form
7266 -166 87 -59 -121 -37 66 -75 -19 7 53 -3 -117 -20 -84 -26 41 -45 20 42 155 58 62 142 -109 43 12 39
7292 39 37 3 69 16 -139 -166 10 3 -85 -149 71 208 14 151 34 -5 107 -69 36 -33 -32 -57 14 67 -8 87 -63
7319 -63 -31 -202 119 176 -3 73 87 -43 -61 163 89 -134 -124 -10 67 35 -110 29 31 -113 185 -81 65 -57
7343 -57 -33 -171 59 30 172 1 7 -43 -111 -112 -40 -34 -7 61 91 -52 -26 100 86 -26 -45 27 -17 121 -9 -124 -88
7370 -88 36 58 111 -61 -61 -1 92 21 -24 24 -14 22 -108 161 42 -56 -72 -140 -17 33 22 -122 -56 -62 -94 -20 42 -26
7398 -26 -2 -73 66 -192 49 11 -77 -75 -16 -10 -50 155 37 -149 -44 13 -86 -85 -41 89 81 -79 -17 50 41 6 -80 -101
7426 -101 0 -34 33 -20 24 -59 -6 -136 -76 21 -144 4 106 -44 -117 50 50 86 -97 -53 -113 34 -167 -7 92
7451 92 -57 16 -130 -59 124 -6 96 -142 -48 -15 168 33 -42 -81 5 116 177 62 16 -73 95 136 57 -100
$$ packed form
7266a66K53j46o2Q4J03j41N6K6M6n6j14R7o4N8O7q6O5K2J13r7MQ0k51J52l1K7
7292C9kl4O6n3j55k7J76pq8o4K20J37j94J37j17l9J12j76J05o9Jk5P1N3p5R5j50
7319f3L2j71L21N7j79P6J4j30j8K24p4k23J0J14P7l2j45J39Kj44K98k66J46j22
7343e7K4j38K30k9J42j71On0o8jP2OK7O8L0j43K6J26j4j12j9P2m4J38j30j15L6
7370h8J24K2N3j72%O0R3p1m5M8l8L6j30K69j19r8j6o8J23N0j1j44O6ol2P4O2o8
7398b6K4p1J39k58K41l8q8KN9Om0K05j18j86J05N7r9JM4J30qj60O2O7rl5q6k1
7426a01J01l4O7n3M4q3N3j30O0R7j65J48J02j50p3J67%L6j83M4o0J47k01J60R9
7451I2j49P3j46P1J83j30J02k38R4L3J83j35p5l9Q6J11O1j15m6q9J68M1p9j57
$$ plain form
7475 -100 -159 -124 167 -56 102 -129 96 -43 -66 108 -84 -117 124 -73 97 205 -51 139 22 72 -70 -31
7497 -31 -57 94 -113 94 22 -105 159 -23 56 60 -12 -138 -94 0 -5 -51 -21 229 150 47 72 -48 119 8 69
7522 69 48 -109 -142 42 -5 29 -14 11 99 -50 -4 -9 -46 -53 38 53 -3 144 129 50 -42 128 -18 38 51 29 -13 33
7550 33 93 6 -19 -8 -36 -102 105 0 79 33 -123 -40 -7 119 328 -144 106 -155 74 78 -60 182 -43 -46 77
7575 77 -15 72 73 -122 41 -181 61 74 13 -31 137 -12 38 -50 80 20 -62 -57 -67 64 -59 -126 64 56 144 -36
7601 -36 24 15 -8 -7 168 24 9 -38 -53 72 28 0 51 108 9 47 103 15 -88 177 -37 -108 -39 -48 48 -36 -103 35
7629 35 -56 66 -90 -67 38 -30 35 7 -198 -22 -31 82 29 -19 103 -55 -57 117 -74 90 70 103 -8 53 -64
7654 -64 -126 61 -217 0 15 234 -75 -173 84 -60 83 126 199 -64 48 -108 49 -16 114 153 17 13 -47 -68
$$ packed form
7475a00n9L5K91k23J58k31K25j39k3J74j92l3K41j97J70J08k56J90j17N0j42L9
7497c1k6J51k07K07p2j27K64j82P9Mp2j26M4R4nm6L0K50p9j03K5j20J67j11O1
7522F9k1j57l3J84m7L4m3K5Q8j49M6nl7pR1J5n6J47j5p9r2J70j46N6J3k2m2M6
7550C3O0q7k5J1k8o6K07j05P9m6j56Q3L3J26K09m72K50k61K29Mj38K42k25lJ23
7575G7r2Q7Jj95J63k22K42J3o1m4J68j49N0q8J30o0q2Nj0J31j23o7J90qQ8j80
7601c6O0rk3JJ75j44j5m7j5J25m4k8N1N7r9L8N6q8j03K65k14p1O9rR6q4o7J38
7629C5r1J22j56K3J05o8O5k8k05J76rJ13n3m8J22j58kJ74j91J64k0L3j11O1j17
7654f4o2J87k78K17J5K19l09r8K57j44J43M3P3k63J12j56J57o5J30L9j36mo0k1
$$ plain form
7678 -68 69 111 -96 13 34 -10 23 -37 43 51 -89 -65 24 -41 62 -12 -79 5 -125 38 -103 60 -108 34 -29
7703 -29 73 95 49 -134 -45 4 -19 96 7 134 -191 -19 -15 53 -200 75 -52 -28 -8 -12 -65 -24 79 -17 -159 -101
7729 -101 31 -73 95 29 -42 19 -48 60 -154 -81 -55 31 -11 -13 -98 1 45 84 173 -6 77 -162 10 146 15
7754 15 -9 -48 -30 68 -2 27 104 -76 129 -176 46 33 -1 -8 6 -132 8 215 41 -67 84 -122 132 -11
7778 -11 128 -249 -35 57 -27 1 -17 10 150 184 -27 34 -2 61 -39 141 -73 -184 -3 6 -54 -94 -69 -119 -206 89
7804 89 -49 115 48 18 30 -70 -10 -20 -82 -40 -10 -37 9 6 -16 -75 97 -82 -69 -87 60 -8 19 20 196 -60 157
7831 157 -116 102 46 -89 -53 -48 -45 28 27 105 -15 -204 71 56 -39 -130 83 -26 1 -11 68 -42 30 32 -115 2
7857 2 1 -160 46 134 -89 -33 -69 92 -28 111 36 -29 -162 232 19 -64 -158 68 64 -13 -111 -56 -8 -38 -89 17
$$ packed form
7678f8J37M2k07J09K1m4L3o0Q0Qj40K4Q9o5J03p4o7Q4j30J63j41J63j68J42o3
7703b9J02K2m6j83Q9M9k3J15q9J27l25J72MO8k53K75j27K4K0mn3M1J03r6j42N8
7729a01J32j04J68o6p1O1o7J08k14P3K6Q6m2kq5R9M4L9Q9j79Q3k39J72J36j31
7754A5k4l9J8R8p0K9P7j80K05l05K22j3l4pJ4j38J40K07j74j08J51k06K54j43
7778a1J39l77K14R2q4K8j8K7J40L4k11O1l6O3j00J80k14j11J81Ro0m0K5n0q7K95
7804H9j38J64o7l0J2j00O0j0o2M2L0k7M6lk2n9J72j79J3j8J47o8K7JJ76k56K17
7831A57k73K18n6j35L6NLP3jP8j20j89K75j5r5r1K13j09K7j2P9j10P2Kj47J17
7857Bjj61K06Q8k23N6l6J61j20J39p5o5j33L94k13q3r4K26mp7r8N5M8l0n1J06
$$ plain form
7883 17 131 104 6 -113 44 -13 -283 -106 122 91 -121 -108 18 37 -26 -40 -4 43 104 89 95 108 -54 -106 135 -12
7909 -12 40 -28 -1 43 133 10 -74 -8 152 160 -87 -45 44 6 -158 -194 27 -29 40 70 60 -22 48 -18 -22 7 27 108 -98
7938 -98 -104 20 3 80 64 -10 2 -17 -119 -44 -20 18 -72 -92 33 -81 -92 -271 47 -130 13 6 -16 -21 -100 161 0
7965 0 -138 140 -46 119 -33 54 60 55 75 -88 137 -19 -175 -3 133 19 43 53 -160 56 -31 -63 94 -22
7989 -22 117 -55 -10 -12 -3 -48 -5 118 -104 39 82 -22 58 76 -31 -114 -210 -20 -66 -57 60 -98 -28 -3 53 -14 1
8016 1 -195 33 -98 15 -41 -175 -11 6 70 -114 -104 -26 147 -158 -52 -123 13 53 30 47 -70 -67 -150 12 25
8041 25 40 19 67 -12 74 -38 62 42 -14 -62 42 1 -193 -44 42 -62 -12 54 -32 -46 125 93 -55 -70 -26 72
8067 72 27 -2 -61 44 34 -216 -89 -21 32 92 -17 -1 23 -30 48 24 -77 -35 -26 104 81 -52 117 0 28 39
$$ packed form
7883A7J14k7r8j19J57n7k70J77K28l1k12J3J26J9o3j4L6M7O1j5OJ3j62n2K41j47
7909a2N2o8K7M4R0j23q4O6J60Qk47M2Q9l8j64l6K21n6O9L0j0q2P0o6mK9K0Q1k06
7938i8oJ24j7P7j6p4J2j9j02P5K4L8r0k0J25j14j1j79L18j77J43pk2np9K61j61
7965@j38K78j86J65j52Q7OnK0j63K25j56j56J72J36j14K4J0k13K16q7l2J57j16
7989b2J39j72M5kRm5M3J23k22J43M3j04Q0J8j07q3r6J90m6RJ17j58P0K5N6o7J5
8016Aj96K28j31J13n6j34J64J7O4j84J0P8J73l05J06p1J36M0k3J7j17Lq3J62J3
8041B5J5k1M8p9Q6j12J00k0n6m8J04m1j94J49Q6j04N0O6q6j4J71l2j48j5M4R8
8067G2m5k9n9J05j0k50J27O8N3O0j09J6K4n3P8k4j01M2RJ30k3j33J69j17K8J1
$$ plain form
8093 39 13 -27 -164 105 -123 57 -81 -67 18 -9 -88 -57 -18 29 -133 201 16 68 -78 -34 101 149 97 62 160
8118 160 64 -53 179 128 -51 30 118 60 135 39 -114 53 -196 111 -176 -86 -232 18 -53 31 83 -34 -102 23
8142 23 -86 72 -2 -83 -150 17 -31 -106 67 -29 135 104 -67 1 86 -96 -15 69 65 12 19 -91 51 148 -40 45
8168 45 74 133 -130 54 -103 36 -4 97 31 67 8 36 -104 -89 124 -21 145 29 -84 13 158 23 83
$$ packed form
8093C9k6m0j37K69k28J80j38J4Q5k7p9L1L9M7j62L34j85N2j46M4J35M8n2l5R8
8118A60r6j17K32n1j79Q1Q8n8P5r6j53J67k49L07k87R0j46K50p1Q4N2j17o8J25
8142B3j09J58p4q1o7J67m8p5J73r6J64l1j71O8Q5j82Q1Q4mn3Pj10J42R7j88Q5
8168D5K9N9k63J84j57J39m0J01o6L6n9K8j40J5K13j45J66j16j13R7J45j35O0
8191H3
$$ Imaginary data points
##PAGE= N=2
##DATA TABLE= (X++(I..I)), XYDATA
$$ plain form
0 0 0 0 0 0 0 0 0 0 0 0 8 -8 8 -8 8 -16 16 -20 24 -28 33 -40 48 -55 65 -76 88 -100 114 -131 150 -169 192
33 192 -216 242 -272 304 -340 380 -422 468 -520 574 -636 701 -773 853 -939 1034 -1139 1255
51 1255 -1383 1527 -1685 1868 -2073 2311 -2589 2914 -3308 3791 -4400 5191 -6265 7804 -10172
66 -10172 14237 -22485 45410 -230978 -674672 343364 414054 -462819 -173360 445397 -89848
77 -89848 -334133 228843 168903 -210272 104898 175661 -249035 -41034 329547 -100411 -293571
88 -293571 205237 141351 -339016 -36486 349597 -64468 -288084 132413 179688 -135571
98 -135571 -19246 162456 -60285 -133914 81291 60229 -89817 -8288 48369 -64927 -51949
109 -51949 72690 50650 -32349 -11425 22507 602 5702 40887 15738 -45638 -36673 9510
$$ packed form
0@%%%%%%%%%%Qj6J6j6J6k4L2l6M4n2O1p3Q8j03J20j41J64j88K14k45K81l19L61
33A92m08M58n14N76o44P20q02Q90r88J094j210J337j474J626j792J973k173K394
51A255k638K910l212L553l941M384m900N503o222P099q191R591j1456J4069j7976
66a0172K4409l6722O7895k76388m43694J018036P0690q76873K89459O18757n35245
77h9848k44285N62976n9940l79175L15170P0763m24696K08001L70581m29958j93160
88b93571M98808o3886m80367L02530L86083m14065k23616M20497M7275l15259
98a35571J16325J81702k22741p3629K15205k1062j50046Q1529N6657j13296J2978
109e1949J24639k2040q2999K0924L3932k1905N100L5185k5149o1376Q965M6183
$$ plain form
121 9510 2652 713 27653 -27606 -80362 30008 97275 -35313 -64945 78109 34312 -112747
133 -112747 -480 132381 -17420 -119422 15433 61062 -29583 -13050 36284 -6922 -22266
144 -22266 -613 -6536 38430 62465 -56278 -90018 67307 81015 -74470 -41147 80579
155 80579 -11594 -93238 33967 81942 -31613 -47841 11414 -3653 -2644 33501 -596 -29385
167 -29385 4519 -1986 -15238 38397 35030 -43526 -32508 28625 10366 -4623 24563 -8547
179 -8547 -49583 3167 41916 -699 -13842 14653 719 -23237 -15 32048 25888 -19694
191 -19694 -52147 -7358 47173 2162 -46863 7558 29682 -42414 -28574 68879 43117 -54287
203 -54287 -31374 37840 22029 -9950 -2927 -442 -5794 -14258 -23721 14244 51306 -13509 -68656
$$ packed form
121I510o858j939K6940n5259n2756J10370O7267j32588k9632J43054m3797j47059
133a12747J12267J32861j49801j02002J34855M5629r0645J6533M9334m3206j5344
144b2266K1653n923M4966K4035j18743l3740J57325J3708j55485L3323J21726
155H0579r2173q1644J27205M7975j13555j6228N9255j5067J009L6145l4097k8789
167b9385L3904o505j3252N3635l367p8556J1018O1133j8259j4989K9186l3110
179h547m1036N2750L8749m2615j3143K8495j3934k3956K3222L2063o160m5582
191a9694l2453M4789N4531m5011m9025N4421K2124p2096J3840R7453k5762r7404
203e4287K2913O9214j5811l1979P023K485n352q464r463L7965L7062o4815n5147
$$ plain form
216 -68656 13149 70062 -8368 -36970 34227 19568 -55261 -16368 54777 12754 -49033 -26738
228 -26738 9937 8990 3909 5636 2543 -1975 -7194 -537 25354 27948 -12577 -33048 -2405 17989
242 17989 288 -6921 3654 -9915 -25567 6001 38781 11255 -22167 -2503 12437 -9762
254 -9762 25 32400 -1605 -50935 -15146 30283 1768 -17277 9830 419 -25022 4936 32293
267 32293 11254 -2734 -7554 -21669 5309 38872 -5404 -38691 11148 15007 -40501 -1204
279 -1204 63915 -2311 -63578 8586 47652 -10780 -12633 26399 -8651 -37531 6034 21742
291 21742 -3616 -2362 -8691 -28243 6540 38044 -2763 -21797 15852 5762 -28056 11783
303 11783 44183 -9865 -40685 2381 17953 -5309 3628 14380 -13742 -23059 8538 22314
$$ packed form
216f8656Q1805N6913p8430k8602P1197j4659p4829L8893P1145m2023o1787K2295
228b6738L6675r47n081J727l093m518n219O657K5891K594m0525k0471L0643K0394
242A7989j7701p209J0575j3569j5652L1568L2780k7526l3422J9664J4940k2199
254i762R787L2375l4005m9330L5789M5429k8515j9045K7107r411k5441K9958K7357
267C2293k1039j3988m820j4115K6978L3563m4276l3287M9839L859n5508L9297
279a204O5119o6226o1267P2164L9066n8432j853L9032l5050k8880M3565J5708
291B1742k5358J254o329j9552L4783L1504m0807j9034L7649j0090l3818L9839
303A1783L2400n4048l0820M3066J5572k3262Q937J0752k8122r317L1597J3776
$$ plain form
315 22314 5590 -4534 -6536 -10659 -3579 12068 11401 -5465 -15707 -10598 -658 8262 12401 2063
329 2063 -13885 -10796 6234 11520 8599 6864 -8986 -21722 2062 25376 4526 -14071 669
342 669 -1037 -16396 6843 30088 -823 -26250 -3417 11045 490 5600 8813 -12134 -18553
355 -18553 628 9625 7983 4565 -11505 -18571 4180 18277 3853 -2297 1705 -9602 -11389
368 -11389 12433 20617 -1606 -16349 -8445 3031 7672 6664 3135 -2567 -11919 -9866 12205 20484
382 20484 -4009 -17734 -2692 1094 -3687 10610 12177 -15424 -19722 5173 10349 3277 8058
395 8058 -2364 -19658 -1070 19655 4120 -3989 6248 -9370 -19560 13835 25466 -9582
407 -9582 -15830 6344 -3431 -9654 20630 17413 -22509 -17645 12938 4149 -5171 12781 1674 -27015
$$ packed form
315B2314j6724j0124k002m123P080J5647o67j6866j0242N109R940Q920M139j0338
329B063j5948L089J7030N286k921j735j5850j2736K3784K3314k0850j8597J4740
342F69j706j5359K3239K3245l0911k5427K2833J4462j0555N110L213k0947o419
355a8553J9181Q997j642l418j6070p066K2751J4097j4424o150M002j1307j787
368a1389K3822Q184k2223j4743P904J1476M641j008l529n702r352K053K2071Q279
382B0484k4493j3725J5042L786m781J4297J567k7601m298K4895N176p072M781
395H058j0422j7294J8588K0725j5535q109J0237j5618j0190L3395J1631l5048
407i582o248K2174r775o223L0284l217l9922M864L0583q789r320J7952j1107k8689
$$ plain form
421 -27015 -7851 20965 5422 -6944 4228 -6014 -16622 10329 22547 -4027 -10563 2918
433 2918 -6626 -6730 21393 14651 -21373 -14245 13185 2965 -4756 15055 5486 -24513 -10424 19038
447 19038 9419 -5154 -111 -7111 -13674 6191 15908 -1585 -7009 -1699 -9419 -3444 19440 11361
461 11361 -16417 -11060 7566 1990 800 13150 2636 -17810 -7986 11493 9692 2054 -1756
474 -1756 -9911 -9404 5620 11037 1877 -3829 -6819 -9121 625 13092 7453 -7513 -10561 -3065 3045
489 3045 6903 6872 -1611 -10901 -7831 4821 11527 5859 -3036 -7094 -6152 2737 12811 8916 -5260
504 -5260 -9031 -3265 463 5544 9334 -2016 -14466 -6795 5837 6194 4403 1864 -9391 -10950
518 -10950 5657 11917 1571 -2704 -4195 -11052 -3438 14274 8759 -8755 -7264 -413 -1453 6634
$$ packed form
421b7015J9164K8816j5543j2366J1172j0242j0608K6951J2218k6574o536J3481
433B918r544j04K8123o742l6024P128K7430j0220p721J9811r569k9999J4089K9462
447A9038r619j4573N043p000o563J9865R717j7493n424N310p720N975K2884q079
461A1361k7778N357J8626n576j190J2350j0514k0446R824J9479j801p638l810
474a756q155N07J5024N417r160n706k990k302R746J2467n639j4966l048P496O110
489C045L858l1q483r290L070J2652O706n668q895m058R42Q889J0074l895j4176
504e260l771N766L728N081L790j1350j2450P671J2632L57j791k539j1255j559
518a0950J6607O260j0346m275j491o857P614J7712n515j7514J491O851j040Q087
$$ plain form
532 6634 14207 -364 -12927 -2953 5065 2965 6884 3525 -13074 -11992 6028 8214 413 944
546 944 -3985 -12270 -311 14728 6893 -5554 -5260 -5262 -3711 7078 10336 -2687 -10440 -5318 915
561 915 6197 9165 2174 -7748 -6469 2800 8540 7140 361 -7572 -8631 -1173 6964 7125 -1315 -9298
577 -9298 -7681 684 6367 6843 2309 -6112 -9316 -303 8580 6441 -907 -5928 -8401 -2935 8408
592 8408 8935 -1417 -6453 -4035 -753 6086 11093 2122 -8663 -6087 997 3827 7077 3622 -8918
607 -8918 -10865 548 6209 4471 2859 -4629 -10836 -1612 9555 5566 -920 -3034 -7507 -5264 7338
622 7338 9680 -1315 -6173 -4609 -3368 4784 12241 2495 -9177 -4548 1438 1701 7089 7664 -7236
637 -7236 -12789 1101 7713 2087 1662 -1231 -10552 -5385 8995 7060 -2287 -2154 -4692 -8061 4798
$$ packed form
532F634P573j4571j2563R974Q018k100L919l359j6599J082J8020K186p801N31
546I44m929q285J1959J5039p835j2447K94kJ551J0789L258j3023p753N122O233
561I15N282K968o991r922J279R269N740j400o779p933j059P458Q137J61q440p983
577i298J617Q365N683M76m534q421l204R013Q883k139p348n021k473N466J1343
592H408N27j0352n036K418L282O839N007q971j0785K576P084K830L250l455j2540
607h918j947J1413N661j738j612p488o207R224J1167l989o486k114m473K243J2602
622G338K342j0995m858J564J241Q152P457r746j1672M629N986K63N388N75j4900
637g236n553J3890O612n626m25k893r321N167J4380j935r347J33k538l369J2859
$$ plain form
652 4798 14125 33 -10475 -2982 497 -52 7898 7964 -6811 -10083 1469 5605 3746 5404 -949
667 -949 -10747 -4611 8492 7092 -976 -2910 -5607 -6428 3146 10023 1728 -7561 -5793 -2126 1243
682 1243 7244 6300 -4748 -9668 -1553 5595 5527 3710 -1438 -7644 -4879 5204 8253 2166 -3061
697 -3061 -5509 -4452 2903 9191 4096 -5589 -6915 -2505 2097 5989 4774 -3559 -8792 -4383 3151
712 3151 6106 4104 -2287 -7986 -4992 4491 7884 3019 -2764 -5502 -4085 2382 7661 5063 -2649
727 -2649 -6669 -4081 2544 7641 5211 -3059 -7537 -3656 2724 5863 3925 -2109 -6912 -5180 1187
742 1187 5871 4715 -2199 -7757 -4910 2730 6325 3752 -1282 -5587 -4865 1796 6916 5152 -1158
757 -1158 -5774 -4947 1591 7423 5191 -2263 -5568 -3710 749 5098 5519 -447 -6926 -5840 1291 5969
$$ packed form
652D798R327j4092j0508P493L479n49P950O6j4775l272J1552M136j859J658o353
667i49r798O136J3103j400q068j934k697q21R574O877q295r289J768L667L369
682A243O001r44j1048m920Q115P148o8j817n148o206K765J0083L049o087n227
697c061k448J057P355O288n095r685j326M410M602L892j215q333n233M409P534
712C151K955k002o391n699K994R483L393m865n783k738J417O467N279k598p712
727b649m020K588O625N097k430q270m478L881O380L139j938o034m803J732O367
742A187M684j156o914n558K847P640L595k573n034m305P22O661N120j764o310
757a158m616Q27O538N832k232p454l305J858M459M349M21n966o479J086P131M678
$$ plain form
773 5969 4188 -1662 -6332 -5521 658 5694 4440 -833 -5240 -5049 49 6332 5717 -801 -5870 -4500
789 -4500 1263 6034 5462 -208 -5185 -4843 187 5575 5652 -268 -6169 -5406 585 5178 4521 -709 -5638
806 -5638 -5324 -263 4511 4841 354 -5399 -6293 -298 6314 5838 -731 -5603 -3950 675 4403 5330
822 5330 1819 -4474 -6104 -16 5719 5099 752 -4449 -5936 -1013 5925 4970 -1310 -4268 -4012 -2420
838 -2420 2961 7173 1059 -7279 -5607 725 3258 4288 3032 -4161 -7450 190 6147 3368 1062
853 1062 -788 -5510 -3829 6217 7745 -1428 -4663 -2094 -1924 1508 7389 2705 -7049 -5491 1036
868 1036 1868 3100 3844 -3417 -8471 -1074 5720 3390 500 -1608 -5732 -3731 5226 6658 -283 -3805
884 -3805 -2544 -2162 1693 6846 3459 -4450 -5611 -692 3382 5057 2576 -3779 -5787 -1139 3332
$$ packed form
773E969j781n850m670Q11O179N036j254n273m407J91N098O283o15o518n069J370
789d500N763M771n72n670m977L42N030N388P7n920n901P63N991M593o57n230m929
806e638L14N061M774L30m487n753q94N995O612m76o569m872J653M625L728R27
822E330l511o293j630O088N735o20m347n201j487M923O938r55o280k958K56J592
838b420N381M212o114q338J672O332K533J030j256p193l289P640N957k779k306
853A062j850m722J681J0046J528r173l235K569J70L432N881m684r754J558O527
868A036Q32J232P44p261n054P397O794k330k890k108m124K001Q957J432o941l522
884c805J261L82L855N153l387p909j161M919M074J675k481o355k008M648M471
$$ plain form
899 3332 3772 1999 -2160 -6047 -3533 3420 5634 1408 -3459 -5095 -2535 3027 5521 2048 -2875
914 -2875 -4484 -2267 2291 5694 3538 -2965 -5568 -1530 3651 4697 2419 -1608 -4888 -3335 2417
929 2417 5668 2194 -2709 -4940 -3457 1243 5747 3041 -3928 -5201 -1290 1054 3153 4373 -995
944 -995 -6607 -2852 4091 4466 1853 -124 -4128 -4498 2581 6721 2067 -2449 -2734 -3337 -497 6179
960 6179 4767 -3809 -5516 -826 853 1800 4189 88 -6984 -4493 3006 4120 1910 -133 -4289
975 -4289 -5236 1936 6562 1950 -2338 -2355 -2892 -943 5162 5681 -1638 -5312 -2013 1526 3302 3876 -153
992 -153 -5170 -3702 1668 3663 2619 -18 -4257 -4972 629 4996 3106 -1652 -3920 -3217 -23 4002
1008 4002 4040 -339 -3918 -3590 387 4463 4165 -227 -4069 -3308 649 3800 3812 0 -4163 -3718 457
$$ packed form
899C332M40j773m159l887K514O953K214m226m867j636K560N562K494l473m923
914b875j609K217M558L403k156o503k603M038N181J046k278m027l280J553N752
929B417L251l474m903k231J483M700M504k706o969j273L911K344K099J220n368
944i95n612L755O943L75k613j977m004l70P079M140m654m516k85o03K840O676
960F179j412q576j707M690J679R47K389m101p072K491P499J114k210k043m156
975d289r47P172M626m612m288j7n37J949O105N19p319l674L299L539J776N74m029
992a53n017J468N370J995j044k637m239p15N601M367j890m758k268P03L194M025
1008D002L8m379l579L28L977M076k98m392l842P61L957L151J2l812m163M45M175
$$ plain form
1025 457 3528 3466 128 -3978 -4466 -22 3784 3105 -342 -3620 -4281 -1174 4059 4390 -765 -3944 -2654
1042 -2654 -215 2495 4381 1525 -3888 -4082 671 3743 3267 1153 -2843 -4800 -162 4813 3321
1057 3321 -634 -2237 -3384 -2099 2835 5238 24 -4911 -3276 -312 1938 3398 1488 -3650 -4607
1072 -4607 24 3328 3019 1239 -1932 -4248 -1296 4250 4565 -44 -3203 -2817 -940 2244 4174 1578
1088 1578 -3002 -4246 -1084 2736 3604 1138 -2951 -4370 -1465 3002 3617 119 -2663 -3050 -1782 1753
1104 1753 4728 2008 -3504 -4022 3 2829 3136 2060 -1562 -4392 -1731 3230 3949 1145 -1650 -3473
1120 -3473 -2206 2336 4485 1129 -2935 -3218 -1400 854 3543 2186 -2792 -4769 -1404 2543 3034
1135 3034 1446 -1664 -3912 -1777 2321 3986 1816 -1611 -3569 -1555 2208 3936 1881 -1438 -3455
$$ packed form
1025D57L071o2l338m106m88M444L806o79l447l278o61L107N233L31n155l179J290
1042b654K439K710J886k856n413j94M753L072m76k114l996j957M638M975j492
1057C321l955j603j147J285M934K403n214m935J635K964K250J460j910n138r57
1072d607M631L304l09j780l171k316K952N546L15m609l159L86J877L184J930k596
1088A578m580j244L162L820Q68k466m089j419K905M467O15l498k782l87J268L535
1104A753K975k720n512n18M025K826L07j076l622k830K661M961P19k804k795j823
1120c473J267M542K149l356m064k83J818K254K689j357m978j977L365L947M91
1135C034j588l110k248K135M098J665k170l427j958K014L763J728k055l319k017
$$ plain form
1150 -3455 -2012 1960 3891 1475 -1752 -3460 -2265 1369 4000 1669 -2659 -3657 -1460 894 2930
1165 2930 2559 -1421 -4555 -2033 2365 3131 1533 -843 -3032 -2862 1624 4547 1834 -1685 -2448 -1794
1181 -1794 648 4007 2902 -2131 -3799 -1222 1081 2255 2491 -822 -4473 -2901 1821 3160 1546
1196 1546 -992 -3108 -2676 923 3773 2093 -1307 -3132 -2287 613 3362 2823 -818 -3171 -1952 1527
1212 1527 3373 2561 -441 -2961 -2611 771 3405 2133 -1096 -3450 -2404 391 2668 2639 -329 -3252
1228 -3252 -2726 676 2961 2168 -476 -2911 -2925 494 3336 2445 -725 -2555 -2070 204 3420 3358 -98
1245 -98 -3127 -2053 614 2411 2394 25 -3115 -3207 151 2963 2217 -351 -2621 -2529 -26 2907 2797
1262 2797 -575 -2959 -2272 68 2027 2808 308 -3334 -2851 914 3061 2433 633 -1664 -2987 18
$$ packed form
1150c455J443L972J931k416l227j708J195L634K631k331m328r98K197K354K036
1165B930l71l980l134K522M398P66j598k376k189J70M486K923k713l519p63O54
1181a794K442L359j105n033j668K577K303J174K36l313l651J572M722J339j614
1196A546k538k116M32L599K850j680l400j825Q45K900K749n39l641k353J219L479
1212A527J846q12l002k520L50L382K634j272l229k354J046K795K277k9k968k923
1228c252N26L402K285p93k644k435j4L419K842q91l170j830M85K274L216o2l456
1245i8l029J074K667J797j7k369l140r2L358K812p46k568k270R2K503K933j10
1262B797l372k384O87K340J959P81k500l642M83L765K147o28j800k297j323L005
$$ plain form
1278 18 3761 2624 -715 -2004 -2164 -1098 2154 3339 -231 -3289 -2182 97 1532 2747 1069 -3152
1294 -3152 -3386 350 2555 1552 135 -1781 -3286 -1035 3215 2974 -182 -1911 -1688 -725 2123 3435
1310 3435 766 -2460 -2769 -253 2143 2601 493 -2485 -2898 -458 1876 2329 672 -1928 -2753 -876
1326 -876 1724 2885 909 -2543 -2833 -79 1693 1836 1211 -798 -2994 -1238 2942 3344 -46 -1682
1342 -1682 -1657 -928 1212 3148 1116 -1991 -2488 -743 1210 2753 1541 -2238 -3703 -499 2385 1453
1358 1453 205 -720 -2530 -2483 1698 3757 545 -2301 -1447 -316 1064 2537 1796 -1642 -3006 -603
1374 -603 1617 2106 1531 -879 -3171 -1227 2622 2580 373 -892 -1814 -2357 616 3039 1051 -2703 -2423
1391 -2423 -767 373 1991 2036 -941 -2622 -569 1739 2426 1736 -626 -2962 -1750 1622 2216 666
$$ packed form
1278A8L743j137l339j289j60J066L252J185l570l058J107K279J435J215j678m221
1294c152k34L736K205j003j417j916j505K251M250k41l156j729K23R63K848J312
1310C435k669l226l09K516K396M58k108k978m13K440K334M53j657k600q25J877
1326h76K600J161j976l452k90K754J772J43o25k009k196J756M180M02l390j636
1342a682K5P29K140J936k032l107m97J745J953J543j212l779j465L204K884r32
1358A453j248r25j810M7M181K059l212k846Q54J131J380J473p41l438j364K403
1374f03K220M89n75k410k292J944L849m2k207j265r22n43K973K423j988l754K80
1391b423J656J140J618M5k977j681K053K308O87o90k362k336J212L372N94j550
$$ plain form
1407 666 -587 -2158 -1880 990 3409 1679 -1084 -1981 -1234 916 2442 829 -1757 -2456 -1571 -77
1423 -77 1945 1924 -1278 -2776 -901 1670 2333 2040 -32 -2541 -1809 1354 2539 849 -744 -1953 -1964
1440 -1964 612 2794 1630 -739 -1649 -1424 403 2578 1824 -1280 -2735 -1164 161 1073 1426 -361
1456 -361 -2897 -2400 951 2941 2000 -669 -1963 -986 889 1799 1308 148 -1852 -2259 -112 2465 2156
1473 2156 -643 -2092 -1098 751 2089 1849 -14 -1838 -2026 -145 1913 1848 -502 -2820 -2032 428
1489 428 1754 1370 233 -1524 -1983 49 2568 2017 -562 -1653 -1171 -195 1242 2318 400 -2184
1505 -2184 -1865 506 1932 1763 332 -1933 -2214 217 1966 1152 -236 -1211 -2312 -1196 2208 2526
1521 2526 -824 -2233 -898 -179 825 2132 700 -1938 -2034 312 1721 1657 1029 -1668 -2846 180
$$ packed form
1407F66j253j571K78K870K419j730k763q97P47K150J526j613k586o99Q85J494
1423g7K022k1l202j498J875K571O63k93k072k509P32L163J185j690j593j209j1
1440a964K576K182j164k369r10K25J827K175p54l104j455J571J325R12L53j787
1456c61k536M97L351J990r41k669j294R77J875R10m91j160k000m07K147K577l09
1473B156k799j449R94J849J338k40j863j824j88J881K058o5k350k318P88K460
1489D28J326l84j137j757m59K032K519n51k579j091M82R76J437J076j918k584
1505b184L19K371J426j69j431k265k81K431J749q14j388r75j101J116L404L18
1521B526l350j409J335P19J004J307j432k638r6K346J409o4o28k697j178L026
$$ plain form
1537 180 2761 1351 -697 -813 -1597 -1167 1598 2384 8 -2018 -1380 -490 987 2192 668 -1964 -2065
1554 -2065 115 1252 1351 667 -1495 -2516 -409 2182 1819 264 -1063 -1654 -584 1776 2526 698
1570 698 -1580 -1863 -390 1139 1813 293 -1403 -1859 -774 1013 2130 855 -1795 -2093 -9 1332
1586 1332 1240 741 -1068 -2489 -1130 1393 2031 550 -780 -1954 -917 1532 2378 665 -1068 -1000 -843
1603 -843 452 2296 1154 -1936 -2229 -16 771 963 1230 -609 -2784 -1184 1821 1726 130 -543 -1533
1620 -1533 -1921 817 2478 421 -1235 -1084 -999 244 2409 1713 -1445 -1882 176 728 1326 1673 -465
1637 -465 -2645 -958 1627 1468 463 -185 -1720 -2054 859 2287 357 -988 -1203 -1151 46 2066 1204
1654 1204 -1222 -1771 -403 247 1511 1750 -514 -2161 -387 1279 1157 1287 232 -1909 -1679 1186
$$ packed form
1537A80K581j410k048j16p84M30K765P86k376k026O38Q90J477J205j524k632j01
1554b065K180J137R9o84k162j021K107K591l63j555j327n91J070K360P50j828
1570F98k278k83J473J529O74j520j696m56J085J787J117j275k650k98K084J341
1586A332r2m99j809j421J359K523O38j481j330j174J037K449Q46j713j733O8J57
1603h43J295J844j142l090k93K213P87J92K67j839k175J600L005r5j596o73r90
1620a533l88K738J661k057j656J51Q5J243K165o96l158m37K058N52N98L47k138
1637d65k180J687K585j59j005o48j535l34K913J428j930j345k15N2J197K020q62
1654A204k426n49J368O50J264K39k264j647J774J666j22J30j055k141K30K865
$$ plain form
1670 1186 1824 503 -343 -1353 -1524 212 2096 1065 -871 -1325 -1065 62 1776 1585 -1166 -1788 -556
1687 -556 284 979 1638 129 -2243 -1359 1312 1780 859 58 -983 -1387 141 1893 936 -522 -1502 -1460
1705 -1460 -137 1793 1302 -812 -1345 -735 158 1145 1637 -28 -2296 -1433 854 1198 715 -65 -1526
1722 -1526 -1499 323 1759 1131 -133 -937 -1318 167 2258 1576 -519 -1499 -1048 -352 1035 1645 -160
1739 -160 -2013 -1174 464 1031 1287 553 -1237 -1848 230 1591 889 -157 -1183 -1796 -417 1698 1477
1756 1477 -334 -1057 -824 -101 1433 1910 252 -1451 -1067 -20 952 1244 117 -1703 -1695 6 1279
1773 1279 1129 434 -986 -1535 -134 1623 1434 -147 -1248 -1472 -319 1061 1218 35 -1020 -1172 -350
1790 -350 1254 1913 286 -1237 -1136 251 916 1401 555 -1069 -1852 -455 1135 1135 399 -1003 -1688 -289
$$ packed form
1670A186O38j321q46j010j71J736J884j031j936m54K60J127J714j91k751o22J232
1687e56Q40O95O59j509k372Q84K671M68r21q01j041m04J528J752r57j458r80M2
1705a460J323J930m91k114n33O10Q93R87M92j665k268Q63K287L44m83p80j461
1722a526K7J822J436o28j264q04l81J485K091o82k095r80M51O96J387O10j805
1739a60j853Q39J638N67K56p34j790o11K078J361p02j046j026o13J379K115k21
1756A477j811p23K33P23J534M77j658j703L84J047R72K92j127j820QJ701J273
1773A279j50o95j420n49J401J757j89j581j101k24J153J380J57j183j055j52Q22
1790c50J604O59j627j523J01J387O65M85q46j624p83J397J590%p36j402o85J399
$$ plain form
1808 -289 1524 1108 121 -579 -1120 -961 1132 1767 132 -1540 -1051 -127 542 1415 758 -955 -1629 -143
1826 -143 1180 1218 468 -498 -1446 -417 1127 1384 97 -900 -1192 -964 619 1657 364 -1364 -1367 -63
1844 -63 475 1112 942 -683 -1785 -529 1306 1330 401 -671 -1225 -838 831 1484 396 -698 -1060 -535
1862 -535 825 1762 808 -987 -1317 -362 464 943 731 -696 -1819 -819 798 1043 524 -500 -1253 -764
1880 -764 1039 1410 717 -357 -1090 -747 551 1544 543 -866 -1154 -661 313 1383 1362 -398 -1339 -377
1898 -377 819 1259 832 -458 -1548 -948 526 993 402 -326 -1321 -1228 627 1614 758 -478 -606 -538 189
1917 189 1450 1096 -637 -1313 -631 281 931 1008 -159 -1353 -753 684 1264 992 76 -1132 -982 131
1935 131 1167 421 -730 -1264 -1087 50 1205 893 -331 -1134 -637 424 1230 1279 -279 -1212 -640 201
$$ packed form
1808b89J813m16r87p00n41J59K093O35j635j672M89R24O69Q73o57j713o74J486
1826a43J323L8p50r66r48J029J544K57j287r97k92K28J583J038j293j728lJ304
1844f3N38O37j70j625j102J256J835K4r29j072n54L87J669O53j088j094l62N25
1862e35J360R37r54j795l30R55Q26M79k12j427j123J000J617K45n19j024p53M89
1880g64J803L71o93j074p33L43J298R93j001j409k88M93R74J070k1j760r41R62
1898c77J196M40m27j290j090O00J474M67n91p28r95R3J855R87q56j236j28O8P27
1917A89J261l54j733o76O82R12O50P7j167j194O00J437N80k72r16j208J50J113
1935A31J036p46j151n34J77J137J155l12j224q03M97J061Q06M9j558r33N72Q41
$$ plain form
1953 201 780 1055 -17 -1490 -1047 518 1043 845 488 -828 -1202 323 1496 641 -396 -586 -1194 -704
1971 -704 1246 1271 -601 -1353 -85 34 491 1664 551 -1588 -949 941 715 336 747 -725 -1623 53
1989 53 1778 558 -361 -111 -833 -814 1290 1734 -752 -1412 -201 -81 95 1217 553 -1802 -1334 579
2007 579 575 102 472 -366 -1651 -197 1790 759 -303 -156 -859 -669 999 1587 -240 -1226 -335 -139
2025 -139 212 1366 651 -1321 -1070 462 682 368 499 -402 -1442 -375 1174 951 -242 -588 -974 -727
2043 -727 1221 1375 -139 -662 -510 -304 478 1574 660 -1284 -1078 152 611 656 659 -788 -1396 -71 952
2062 952 654 196 -377 -976 -410 929 1040 -65 -651 -942 -700 504 1208 260 -1004 -853 -195 510 1199
2081 1199 675 -689 -939 43 546 847 632 -456 -1257 -621 744 873 267 -421 -1195 -697 846 1141
$$ packed form
1953B01N79K75j072j473M43J565N25j98l57j316l74J525J173q55j037j90o08M90
1971g04J950K5j872p52J268J19M57J173j113k139O39J890k26l79M11j472q98J676
1989E3J725j220r19K50p22J9K104M44k486o60J211J20J76J122o64k355M68J913
2007E79mm73L70q38j285J454J987j031j062J47p03J90J668N88j827r86Q91J96
2025a39L51J154p15j972K51J532K20l14J31r01j040J067J549k23j193l46l86K47
2043g27J948J54j514n23J52K06P82J096r14j944K06J230M59M5Lj447o08J325J023
2062I52k98m58n73n99N66J339J11j105n86k91K42J204P04r48j264J51O58P05O89
2081A199n24j364k50R82N03L01k15j088q01O36J365J29o06o88p74M98J543K95
$$ plain form
2099 1141 122 -482 -774 -606 525 1242 399 -1044 -835 -406 282 1096 931 -507 -1115 -101 572 821
2117 821 814 -260 -1189 -439 927 616 103 -102 -827 -1150 510 1311 74 -631 -483 -604 -220 1095 907
2136 907 -766 -1377 48 370 532 797 -48 -1427 -533 922 701 485 188 -690 -972 636 1425 226
2154 226 -573 -403 -685 -247 1070 1138 -694 -1224 -76 220 372 690 121 -1124 -725 692 737 460 28
2173 28 -762 -925 308 1410 533 -391 -403 -825 -23 1139 1127 -479 -903 -214 83 458 730 58 -1259
2192 -1259 -695 413 843 480 -191 -965 -691 109 737 676 -134 -722 -760 108 1084 706 -303 -598 -557 -176
2212 -176 738 1130 -37 -932 -773 412 632 789 106 -829 -641 19 735 739 83 -885 -967 -1 1044 564
2232 564 -200 -386 -587 -352 773 1238 -138 -925 -714 203 694 838 215 -651 -621 88 868 642 82 -785
$$ packed form
2099A141j019o04k92J68J131P17q43j443K09M29O88Q14j65j438o08J014O73K49
2117H21pj074r29P50J366l11n13k05p25l23J660Q01j237p05J48j21L84J315j88
2136I07j673o11J425L22J62K65q45j379Q94J455k21k16k97q78k82J608P89j199
2154B26p99J70k82M38J317O8j832n30J148K96J52L18n69j245L99J417M5k77m32
2173B8p90j63J233J102q77r24j2m22Q02J162j2j606m24O89K97L75K72o72j317
2192a259N64J108M30l63o71p74K74Q00O28o1q10n88l8Q68R76l78j009k95M1L81
2212a76R14L92j167q95J59J185K20J57o83r35J88O60P16Mo56r68q2R66J045m80
2232E64p64j86k01K35J125M65j376p87K11R17M91J44o23q66L0P09P80k26n60q67
$$ plain form
2252 -785 -975 125 843 729 -26 -821 -822 -204 734 1033 -68 -832 -536 -27 650 900 262 -734 -853 66
2272 66 735 606 184 -610 -807 -131 814 1055 28 -547 -699 -54 532 729 90 -570 -580 -342 333 667
2292 667 487 -838 -974 -71 517 510 354 -281 -860 -591 697 924 87 -646 -527 -191 398 803 211 -394
2312 -394 -696 41 531 901 409 -485 -837 -238 506 547 480 -353 -923 -564 659 799 -18 -437 -609 -289
2332 -289 73 764 448 -428 -758 -375 525 860 193 -356 -689 -287 423 690 499 -336 -895 -418 517 777
2352 777 262 -288 -677 -463 197 758 519 -316 -826 -475 328 799 223 -300 -695 -410 194 885 786 -379
2372 -379 -734 -194 247 576 621 -2 -756 -483 486 802 254 -173 -592 -523 148 745 247 -234 -485 -590 -98
2393 -98 804 464 -348 -713 -253 137 500 719 -113 -849 -441 381 468 255 -78 -503 -620 159 849 460 -152
$$ packed form
2252g85j90J100P18j14p55p95jO18R38K99j101p64K96N09O77K50o38r96j19R19
2272F6O69j29m22p94j97O76R45K41j027n75j52O45N86J97o39o60j0K38O75L34
2292F67j80j325j36R03N88pj56o35n79K69J288K27q37p33J19L36N89M05n92o05
2312c94l02P37M90L70m92q94l52N99P44M1o7q33n70L59J223J40q17m19j72L20
2332b89L62O91l16q76l30L83R00L35o67n49l33M02P10K67j91q35n59M77R35K60
2352G77n15n50l89K14O60N61k39q35n10L51Q03M71n76n23l95K85O04O91r9j165
2372c79l55N40M41L29M5o23p54K73R69L16n48m27m19O9O71N97m98m81k51j05M92
2393i8R02l40q12l65M60L90L63K19q32p36M08Q22Q7k13l33m25j17P79O90l89o12
$$ plain form
2414 -152 -570 -646 74 786 561 -376 -793 -314 -30 435 572 137 -807 -615 413 458 193 -11 -519 -424 51
2435 51 816 559 -70 -620 -452 102 613 712 -59 -506 -607 84 494 745 53 -680 -403 179 614 434 113
2456 113 -654 -736 -16 563 566 -104 -502 -447 69 554 499 170 -414 -533 10 690 501 -153 -339 -431 23 358
2478 358 739 251 -634 -743 24 231 368 236 -664 -705 -57 395 404 -10 -373 -822 -211 736 626 -54 -464
2499 -464 -343 -87 392 921 193 -626 -439 71 405 362 389 -369 -560 -221 434 421 304 -48 -651 -256 269
2520 269 677 51 -406 -511 -503 509 696 230 -238 -221 -157 342 675 200 -285 -410 -209 490 708 237 -371
2541 -371 -540 39 400 382 228 -236 -503 -403 328 600 -33 -289 -548 -493 224 742 249 -420 -237 -256 58
2562 58 531 313 -522 -510 -262 201 358 468 86 -848 -302 350 564 97 -113 -311 -536 129 646 196 -535
$$ packed form
2414a52m18p6P20P12k25r37m17M79K84M65J37m35r44J92J028M5k65k04n08R5M75
2435E1P65k57o29n50J68N54N11R9p71m47j01O91M10K51o92p33K77N82M35j80l21
2456A13p67q2P20N79Lo70l98N5N16M85n5l29n84j19N43O80j89o54j86r2M54L35
2478C58L81m88q85j09P67K07J37j32r00m1O48M52Rm14l63m49O11R47j10o80m10
2499d64J21K56M79N29p28q19J87N10L34m3K7p58j91L39O55j3j17l52o03L95N25
2520B69M08o26m57j05QJ012J87m66m68J7O4M99L33m75m85j25K01O99K18m71o08
2541c71j69N79L61j8j54m64k67J00P31K72o33k56k59N5P17N18m93o69J83j9L14
2562E8M73k18q35J2K48M63J57J10l82r34N46O52K14m67k10j98k25O65N17m50p31
$$ plain form
2583 -535 -342 -232 -130 587 404 -475 -570 -159 255 292 406 65 -590 -447 462 535 79 -51 -456 -406 -4
2604 -4 596 291 -274 -406 -192 -85 281 432 -115 -631 -301 136 286 377 -77 -667 -612 81 630 267 -123
2625 -123 -387 -383 -12 498 386 22 -392 -240 73 312 478 -26 -515 -338 49 557 292 -229 -211 -378 36
2646 36 498 258 -234 -547 -436 -30 421 435 16 -430 -388 -5 414 443 26 -356 -392 26 344 471 -28 -362
2668 -362 -381 42 275 321 85 -211 -402 -153 346 301 -114 -432 -351 -157 418 382 -61 -302 -445 -105 266 273
2690 273 -14 -311 -418 47 413 359 157 -252 -293 89 423 432 -87 -258 -382 -69 344 380 20 -523 -603 -114
2712 -114 261 406 200 -391 -460 -181 322 398 57 -237 -537 -147 362 312 43 -382 -335 -64 219 470 222
2733 222 -327 -385 -240 229 506 216 -374 -412 -34 282 377 50 -259 -536 -264 352 329 127 -184 -388 -48
$$ packed form
2583e35J93J10J02P17j83q79r5M11M14L7J14l41o55J43R09P3m56j30m05N0M02
2604dO00l05n65j32K14J07L66J51n47n16L30M37J50R1m54n90N5O93N49l63l90
2625a23k64ML71N10j12l64m14J52L13K39J66n04m89J77L87N08k65n21J8j67M14
2646C6M62k40m92l13J11M06M51J4m19m46M2L83M19K9m17l82l6M18L18J27m99l34
2668c62j9M23K33M6k36k96j91K49M99m5m15l18Q1J94N75l6m43k41j43L40L71P
2690B73k87k97j07M65L66n4k02m09m1L82L34Rn19j71j24L13M13L6l60n43q0M89
2712a14L75J45k06n91o9K79N03P6l41k94l00L90N09n0k69m25M7K71K83K51k48
2733B22n49n8J45M69K77k90n90l8L78L16R5l27l09k77K72O16k3k02l11k04L40
$$ plain form
2754 -48 226 307 81 -214 -191 -172 270 404 323 -255 -389 -132 122 306 56 -373 -396 -9 251 317 122 -132
2776 -132 -376 -100 270 241 278 -120 -196 -134 232 503 222 -117 -328 -229 128 620 296 -109 -278 -164 167 286
2798 286 102 -17 -349 -274 192 338 201 -85 -319 -275 215 390 296 -225 -316 -55 193 391 278 -146 -458
2819 -458 -147 405 367 72 -100 -217 -344 305 291 175 -219 -448 -235 58 323 336 5 -524 -140 125 248
2840 248 81 51 -416 -316 128 316 129 -60 -331 -255 63 358 409 73 -395 -143 173 416 287 90 -392
2861 -392 -317 334 510 237 -103 -202 -64 54 216 198 -87 -195 -288 -102 333 362 -90 -292 -313 17 197 275
2883 275 268 -190 -197 -51 361 123 -12 11 -409 -9 329 256 -36 -350 -338 62 -57 412 -14 -384 -205 -94
2905 -94 215 61 14 -284 -316 16 235 351 24 -236 -379 -70 364 232 122 106 -90 -52 283 230 -114 -272
$$ packed form
2754d8K74Q1k26k95K3J9M42J34q1n78j34K57K54J84k50m29k3L87K60O6j95k54
2776a32k44K76L70k9L7l98p6O2L66K71k81l39k11R9L57M92l24m05j69J14L31J19
2798B86j84j19l32P5M66J46j37k86k34M4M90J75r4n21r1K61K48J98j13m24l12
2819d58L11N52l8k95j72j17j27O49j4j16l94k29K13K93K65J3l31n29L84K65J23
2840B48j67l0m67J00M44J88j87j89k71P6L18K95N1l36m68K52L16K43j29j97m82
2861c92P5O51J76k73l40r9J38J18J62j8k85j08r3J86M35K9m52k02k1L30J80P8
2883B75pm58pJ46M12k38j35K3m20M00L38p3k92l14J2M00j19M69m26l70J79J11
2905i4L09j54m7k98l2L32K19J16l27k60j43L09M34j32j10j6j96L8L35n3l44j58
$$ plain form
2927 -272 -395 -96 224 434 354 -260 -308 -112 161 353 1 -193 -343 -70 286 292 40 -74 -340 -61 253
2948 253 306 46 -160 -374 -109 362 225 134 -313 -189 -324 183 338 148 -83 -349 -18 207 173 149 -226
2969 -226 -475 -74 57 231 169 -49 -427 -43 49 159 114 -19 -284 -12 21 300 197 -98 -180 -12 173 215
2991 215 90 -201 -219 -293 24 293 108 -194 -264 -79 22 206 221 -217 -303 -220 234 246 33 -42 -317 -342 183
$$ packed form
2927b72j23K99L20K10q0o14m8J96K73J92l52j94j50K73L56Ok52j14k66K79L14
2948B53N3k60k06k14K65M71j37r1m47J24j35N07J55j90k31k66L31K25l4k4l75
2969b26k49M01J31J74o2k18l78L84R2J10m5j33k65K72L3K79j03k95q2J68J85M2
2991B15j25k91j8p4L17K69j85l02p0J85J01J84J5m38q6Q3M54J2k13p5k75k5N25
$$ [...]
8191c3
##END NTUPLES=NMR FID
##END=
