##TITLE=1H_AM_NV37
 
 8 sc, 
 14.4.2023
##JCAMPDX= 6.0         $$ Bruker NMR JCAMP-DX V2.0
##DATA TYPE= NMR FID
##DATA CLASS= NTUPLES
##ORIGIN= UXNMR, Bruker Analytische Messtechnik GmbH
##OWNER= root
$$ XWIN-NMR		Version 3.5
$$ Fri Apr 14 14:21:58 2023 Russian Standard Time (UT+4h)  she@DPX200
##.OBSERVE FREQUENCY= 200.13135
##.OBSERVE NUCLEUS= ^1H
##.DELAY= (6, 6)
##.ACQUISITION MODE= SIMULTANEOUS
##.ACQUISITION SCHEME= undefined
##.AVERAGES= 8
##.DIGITISER RES= 18
##SPECTROMETER/DATA SYSTEM= spect
##.PULSE SEQUENCE= zg30
##.SOLVENT NAME= D2O
##.SHIFT REFERENCE= (INTERNAL, D2O, 0, 15.7039)
##AUDIT TRAIL= $$ (NUMBER, WHEN, WHO, WHERE, WHAT)
$$ ##TITLE= Audit trail, XWIN-NMR		Version 3.5
$$ ##JCAMPDX= 5.01
$$ ##ORIGIN= Bruker BioSpin GmbH
$$ ##OWNER= she
$$ F:/spectra/data/she/nmr/H-F/1/audita.txt
$$ ##AUDIT TRAIL=  $$ (NUMBER, WHEN, WHO, WHERE, WHAT)
(   1,<2023-04-14 14:20:48.04 +0400>,<she>,<DPX200>,
      <created by zg, POWCHK disabled, PULCHK disabled
       configuration hash MD5:
       00 E9 B6 7A A2 85 ED C7 34 08 36 98 17 FE 4E 26
       data hash MD5: 16K
       2D BD 01 86 AD F3 05 74 DE C9 D0 29 B9 07 3E 6A>)
$$ ##END=
$$ 
$$ hash MD5
$$ B4 C9 D4 DB DB 1A E3 C9 EC D5 99 FD 8F 8C 12 A7
##$RELAX= 
##$RELAX= 
##$RELAX= 
##$RELAX= 
##$RELAX= 
##$RELAX= 
$$ Bruker specific parameters
$$ --------------------------
##$DU= <F:/spectra>
##$EXPNO= 1
##$NAME= <H-F>
##$PROCNO= 1
##$TYPE= <nmr>
##$USER= <she>
##$AMP= (0..31)
100 100 100 100 100 100 100 100 100 100 100 100 100 100 100 100 100 100 
100 100 100 100 100 100 100 100 100 100 100 100 100 100 
##$AQSEQ= 0
##$AQ_mod= 1
##$AUNM= <au_zg>
##$AUTOPOS= <>
##$BF1= 200.13
##$BF2= 200.13
##$BF3= 200.13
##$BF4= 200.13
##$BF5= 200.13
##$BF6= 200.13
##$BF7= 200.13
##$BF8= 200.13
##$BYTORDA= 1
##$CFDGTYP= 0
##$CFRGTYP= 5
##$CHEMSTR= <none>
##$CNST= (0..31)
1 1 145 1 1 1 1 1 1 1 1 1 1 1 1 1 1 1 1 1 1 1 1 1 1 1 1 1 1 1 1 1 
##$CPDPRG= <>
##$CPDPRG1= <>
##$CPDPRG2= <>
##$CPDPRG3= <>
##$CPDPRG4= <mlev>
##$CPDPRG5= <mlev>
##$CPDPRG6= <mlev>
##$CPDPRG7= <mlev>
##$CPDPRG8= <mlev>
##$CPDPRGB= <>
##$CPDPRGT= <>
##$D= (0..31)
0 1.2 0 0 0 0 0 0 0 0.06 0 0.03 0 0 0 0 0.0002 0 0 0 0 0 0 0 0 0 0 0 0 
0 0 0 
##$DATE= 1681467647
##$DBL= (0..7)
120 120 120 120 120 120 120 120 
##$DBP= (0..7)
150 150 150 150 150 150 150 150 
##$DBP07= 0
##$DBPNAM0= <>
##$DBPNAM1= <>
##$DBPNAM2= <>
##$DBPNAM3= <>
##$DBPNAM4= <>
##$DBPNAM5= <>
##$DBPNAM6= <>
##$DBPNAM7= <>
##$DBPOAL= (0..7)
0.5 0.5 0.5 0.5 0.5 0.5 0.5 0.5 
##$DBPOFFS= (0..7)
0 0 0 0 0 0 0 0 
##$DE= 6
##$DECBNUC= <off>
##$DECIM= 32
##$DECNUC= <off>
##$DECSTAT= 4
##$DIGMOD= 1
##$DIGTYP= 9
##$DL= (0..7)
0 120 120 120 120 120 120 120 
##$DP= (0..7)
150 150 150 150 150 150 150 150 
##$DP07= 0
##$DPNAME0= <>
##$DPNAME1= <>
##$DPNAME2= <>
##$DPNAME3= <>
##$DPNAME4= <>
##$DPNAME5= <>
##$DPNAME6= <>
##$DPNAME7= <>
##$DPOAL= (0..7)
0.5 0.5 0.5 0.5 0.5 0.5 0.5 0.5 
##$DPOFFS= (0..7)
0 0 0 0 0 0 0 0 
##$DQDMODE= 0
##$DR= 18
##$DS= 0
##$DSLIST= <SSSSSSSSSSSSSSS>
##$DSPFIRM= 0
$$ [...]
##$SUBNAM2= <"">
##$SUBNAM3= <"">
##$SUBNAM4= <"">
##$SUBNAM5= <"">
##$SUBNAM6= <"">
##$SUBNAM7= <"">
##$SUBNAM8= <"">
##$SUBNAM9= <"">
##$SW= 18.05172834244
##$SWIBOX= (0..15)
0 0 2 0 0 0 0 0 0 0 0 0 0 0 0 0 
##$SW_h= 3612.71676300578
##$TD= 16384
##$TD0= 1
##$TE= 0
##$TE2= 300
##$TE3= 300
##$TEG= 300
##$TL= (0..7)
0 120 120 120 120 120 120 120 
##$TP= (0..7)
150 150 150 150 150 150 150 150 
##$TP07= 0
##$TPNAME0= <>
##$TPNAME1= <>
##$TPNAME2= <>
##$TPNAME3= <>
##$TPNAME4= <>
##$TPNAME5= <>
##$TPNAME6= <>
##$TPNAME7= <>
##$TPOAL= (0..7)
0.5 0.5 0.5 0.5 0.5 0.5 0.5 0.5 
##$TPOFFS= (0..7)
0 0 0 0 0 0 0 0 
##$TUNHIN= 0
##$TUNHOUT= 0
##$TUNXOUT= 0
##$USERA1= <user>
##$USERA2= <user>
##$USERA3= <user>
##$USERA4= <user>
##$USERA5= <user>
##$V9= 5
##$VALIST= <valist>
##$VCLIST= <CCCCCCCCCCCCCCC>
##$VD= 0
##$VDLIST= <DDDDDDDDDDDDDDD>
##$VPLIST= <PPPPPPPPPPPPPPP>
##$VTLIST= <TTTTTTTTTTTTTTT>
##$WBST= 1024
##$WBSW= 4
##$XGAIN= (0..3)
0 0 0 0 
##$XL= 0
##$YL= 0
##$YMAX_a= 265327
##$YMIN_a= -269334
##$ZGOPTNS= <>
##$ZL1= 120
##$ZL2= 120
##$ZL3= 120
##$ZL4= 120
##$ABSF1= 10
##$ABSF2= 0
##$ABSG= 5
##$ABSL= 3
##$ALPHA= 0
##$AQORDER= 0
##$ASSFAC= 0
##$ASSFACI= 0
##$ASSFACX= 0
##$ASSWID= 0
##$AUNMP= <proc_1d>
##$AZFE= 0.1
##$AZFW= 0.1
##$BCFW= 1
##$BC_mod= 2
##$BYTORDP= 1
##$COROFFS= 0
##$CY= 11.3945322036743
##$DATMOD= 1
##$DC= 2
##$DFILT= <>
##$DTYPP= 0
##$F1P= 15.7292609196834
##$F2P= 12.9074282941183
##$FCOR= 0.5
##$FTSIZE= 0
##$FT_mod= 4
##$GAMMA= 1
##$GB= 0.15
##$INTBC= 1
##$INTSCL= 1
##$ISEN= 128
##$LB= 0.24
##$LEV0= 0
##$LPBIN= 0
##$MAXI= 10000
##$MC2= 0
##$MEAN= 0
##$ME_mod= 0
##$MI= 1.114404
##$NCOEF= 0
##$NC_proc= 0
##$NLEV= 6
##$NOISF1= 3.799351
##$NOISF2= 2.8
##$NSP= 1
##$NTH_PI= 0
##$NZP= 0
##$OFFSET= 15.70392
##$PC= 1
##$PHC0= -19912.65
##$PHC1= 17.20081
##$PH_mod= 1
##$PKNL= yes
##$PPARMOD= 0
##$PSCAL= 0
##$PSIGN= 0
##$REVERSE= no
##$SF= 200.130013532006
##$SI= 16384
##$SIGF1= 3
##$SIGF2= 2
##$SINO= 400
##$SIOLD= 16384
##$SREGLST= <1H.CDCl3>
##$SSB= 0
##$STSI= 0
##$STSR= 0
##$SW_p= 3612.71676300578
##$SYMM= 0
##$S_DEV= 0
##$TDeff= 0
##$TDoff= 0
##$TI= <>
##$TILT= no
##$TM1= 0
##$TM2= 0
##$TOPLEV= 0
##$USERP1= <user>
##$USERP2= <user>
##$USERP3= <user>
##$USERP4= <user>
##$USERP5= <user>
##$WDW= 1
##$XDIM= 8192
##$YMAX_p= 0
##$YMIN_p= 0
$$ End of Bruker specific parameters
$$ ---------------------------------
##NTUPLES= NMR FID
##VAR_NAME=  TIME,          FID/REAL,        FID/IMAG
##SYMBOL=    X,             R,               I
##VAR_TYPE=  INDEPENDENT,   DEPENDENT,       DEPENDENT
##VAR_FORM=  AFFN,          ASDF,            ASDF
##VAR_DIM=   8192,          8192,            8192
##UNITS=     SECONDS,       ARBITRARY UNITS, ARBITRARY UNITS
##FACTOR=    0.0002768,     1,               1
##FIRST=     0,             0,               0
##LAST=      2.2672688,     0,               0
##MIN=       0,             -269334,         0
##MAX=       2.2672688,     265327,          0
$$ Real data points
##PAGE= N=1
##DATA TABLE= (X++(R..R)), XYDATA
0@%%%%%%%%%%%%%%%%%jRj6J6j6J6k1K9l2L2l8M6m8N4o2P2q4R2j00J12j28J42j54
40h0J71j91K08k27K51k77L05l35L68m06M47m90N39n97O64p40Q27r32J058j209
60f46J397j637J957k399L041m044N777r277J8653q3892j98264L81826J03172l63417
74a47753l0790L60135l2567l85682J58956L32362k52809k39098K84309J81796
84B28859l35387j00564L80062k6035l49414J15646K93983j61159k69134K33412
94A0269K18649l10383j16694L29624K3299l15037M3257L07535j21680k81343K04912
105g592K17530k57590j43151K83165P3174k99056K199K99940q2592k76147J55400
116c4720K29838k11141j71386K51025J06094k78024l0893K82440m4961k61304
$$ y = [0, 0, 0, 0, 0, 0, 0, 0, 0, 0, 0, 0, 0, 0, 0, 0, 0, 0, -1, 8, -8, 8, -8, 8, -13, 16, -16, 16, -22, 24, -24, 30, -32, 40, -44, 48, -52, 60, -68, 74, -80, 91, -100, 108, -119, 132, -145, 160, -175, 193, -213, 234, -256, 283, -314, 350, -390, 437, -495, 563, -646, 751, -886, 1071, -1328, 1713, -2331, 3446, -5831, 12822, -71070, -269334, 112492, 215664, -147753, -178543, 181592, 149025, -236657, -77701, 254661, 1852, -237246, 47063, 228859, -106528, -207092, 172970, 146935, -202479, -86833, 207150, 45991, -223143, 10269, 228918, -81465, -198159, 131465, 154764, -160273, -117016, 190519, 68839, -212504, -7592, 209938, -47652, -190803, 92362, 165536, -133520, -131321, 168619, 86027, -190120, -34720, 195118, -16023, -187409, 63616, 169710, -108314, -139207, 143233, 98272, -163032]
126a63032J06144K31924j61751j94017K18742J29560k51382n3765K50519n851
136A07091k42947O1073K32055j25658j96109J78459J41956k08327q7930K28314
146H7977K8158k34591L6753K17567q9070j91763J32593J62868j79310j13838K12066
157F9410M9846k16877N436K10336n4759j98874J08548J68661j53313j23877J80563
168D5100P7793j99263k6330K06310l0373j93767P9418J69799j20271j38773J57007
179B6650R4804j80026m4386J85447j506j82179M5899J70916r1444j45596J30452
190I031J08305j57259o4348J70448J8134j69800K3932J61019o1890j47769J01225
201h972J22331j36329q1804J55585L7797j60777K540J58702m2227j47267P9556
$$ y = [-163032, -56888, 175036, 13285, -180732, 38010, 167570, -83812, -137577, 112942, 107091, -135856, -74783, 157272, 31614, -164495, 13964, 155920, -52407, -140337, 87977, 116135, -118456, -81703, 135864, 46794, -144969, -12376, 150492, -28818, -142656, 69410, 119256, -97621, -92185, 118151, 63392, -135482, -26934, 141727, -11586, -135463, 45100, 122893, -76370, -102700, 103610, 73237, -120530, -41112, 128687, 8416, -130357, 26650, 121454, -58572, -102958, 82489, 80983, -101196, -55297, 115619, 24175, -121421, 9031, 117336, -39923, -104271, 66177, 84311, -85489, -61557, 99462, 37572, -110197, -8972, 113359, -22970, -104774, 50811, 88608, -72169, -69629, 89073, 46846, -100421, -20865]
212b0865J25690j10935r7560J37756O0743j55159j6255J55410k4665j43915N8019
223c1736J29347r0617j07359J20723P3548j38767l4925J43963k075j41424L8069
234d1253J31099p2234j11097J00320Q3343j20314n0847J32031J5757j34826J9296
245d8725J28322n1551j13898P9969R2958j04459o5035J22167L1030j28324L133
256e4413J23885l2632j15114O0811J01774q9771p7588J11394M5263j20054j3856
267f0301J21128j6047j17341M6906J04521p3694q4346R3794O0879j10347l1131
278f5979J19158l239j14521L2085J02977n4549r0753P8190P1409r9362m2310J08792
290D1898J2538j08702J3753J04742m0491r4233O5934P5406q4503n2916R6838K8478
$$ y = [-20865, 104825, -6110, -103670, 34086, 94829, -60330, -76585, 78825, 54160, -89755, -31736, 97611, 6994, -100365, 20358, 93906, -44861, -79786, 64177, 62102, -79322, -41253, 89846, 17612, -93485, 6835, 90178, -30136, -80983, 51048, 66805, -68021, -48725, 79597, 28046, -85852, -5883, 87075, -17384, -82419, 39748, 70778, -57546, -54413, 69472, 36840, -78274, -17463, 84311, -5460, -83048, 28346, 73609, -46445, -60301, 60827, 44780, -72561, -25655, 78866, 5172, -79174, 14620, 75499, -34848, -65979, 53179, 49940, -64581, -32496, 70481, 15932, -74821, 3369, 74778, -24584, -66894, 41898, 54436, -54266, -40513, 64229, 23738, -70495, -4561, 70845, -13658, -66574, 30264, 58742]
302E8742j04546l84J04291k8225r4790N1947Q0283p1032o2764Q7662L9765r8859
314c7910j1968J00415j4585r4424L7057Q5228n8605p0987P8875M8499r1176k2721
326e2302R4119l60r3216K3238Q8201m7540p4465O6949N5216p9137l5509Q8148
338C3342J2689r1949J3254Q6036l4963p5146N1793O3399o8766m5796Q2207K1726
350D7826q5855R87Q3351k0576p8652M0829O8328n9420n1422P1918L2301p9359
362b9744j2066Q2385r821p8887L0274O9923m7483n7716O2266M1518p3130k1739
374d4220P7945J230p7389J8692P1995l7199o1629N2461M7882o4389l1330P2917
386B6966J1432p5325Q985P1212k6411o3961M2107N3684n6852l8002O6652J9453
$$ y = [58742, -45804, -46188, 58103, 29878, -64912, -12965, 67318, -3714, -66478, 21184, 60949, -37910, -49878, 50537, 35952, -58472, -21415, 63813, 5208, -65779, 13096, 61595, -29581, -52302, 41817, 41457, -51759, -28521, 59680, 12140, -62325, 4624, 59840, -19297, -54806, 33342, 46031, -45918, -32664, 53372, 18409, -56737, -4944, 58455, -10311, -56107, 26100, 47826, -38029, -37042, 46309, 25733, -52919, -12090, 56238, -3182, -54604, 17314, 49615, -29744, -41810, 40575, 30754, -48133, -17859, 52064, 4581, -53135, 9131, 50649, -22481, -44220, 33725, 34955, -42434, -23742, 48253, 11054, -50575, 1886, 49768, -14621, -45951, 26966, 38398, -36927, -27942, 43270, 16859, -47102, -4995, 48689, -8163, -46165, 20487, 39940]
398C9940p0071j926P0143j5728o6562L4011N6653m8744m2710N8348K8098o5406
410b3954j1342O8852p815o5618K4960N7823l8623m8356N1248L5206o1273j7694
422c6586O4862L03o3376J4919N9782l0219n2384M4794L9584n4753k4592O0071
434B2405R492o2537O851O0700k3283n3583L6695M3669m7301l1952N6042J6976
446C4174o0541k50N9444j4910n4939K8442M7875m1029l6984N0726K3127n6089
458b0954q488N7817o403n5869K0937M9942l3669m0875M3971K9338n1479j5590
470c1322N5109J075n4795J2916N1233k6135m4264L7649L4036m6139k1895N1539
482A9007Q525n3721N717N1830j9271m6237L0870L8171m0621k7732M8078J4834
$$ y = [39940, -30131, -32057, 38086, 22358, -44204, -10193, 46460, -2284, -44994, 13354, 41452, -23954, -35296, 33556, 25741, -39877, -14917, 42906, 4283, -44073, 7175, 42381, -18892, -36586, 28276, 28579, -34797, -19878, 39904, 9685, -42699, 2095, 41679, -13074, -37666, 22405, 31897, -30640, -23789, 36911, 13628, -39955, -3260, 40409, -6892, -38844, 17198, 34174, -26367, -26617, 32827, 17917, -37022, -8580, 39295, -1734, -38718, 12008, 35135, -20954, -29442, 28375, 21972, -33897, -12960, 36982, 3313, -37562, 6409, 35747, -15732, -31322, 23787, 24862, -29933, -17017, 34216, 8081, -36183, 1466, 35502, -10637, -32532, 19007, 27532, -26189, -20472, 31358, 12087, -34150, -3280, 34891, -5730, -33462, 14616, 29450]
494B9450n1758r28N1271j2195m7776K4308M1549l5187l2185M3490K0471m8336
506a7826p817N0009n109m8563J7833M3544k9047l5457L7761K5526m4076j4155
518b7377M7800J494m7963J1228M4343k2459l8129L1969K9944l9821j9480M4847
530A6396P453m6230M511M4719j5977m0611K6704L3394l5276k3846M0942J3293
542B5472m4263j772M4847j0259m1752K0967L5950k9874k8242L7322J8235m2048
554a5417o868M3239m115m1879J4723L8087k4917l1127L2927K2077l8011j2486
566b3767M1083J893m1654R452L8629j9537l2984K7502K6020l4148j7161L8795
578A4123O456l9991M107L8380j3588l5003K2678K9108l0599k0459L5587J0923
$$ y = [29450, -22308, -23236, 28035, 15840, -31936, -7628, 33921, -1266, -33451, 10039, 30510, -17826, -25643, 24366, 19257, -29306, -11473, 32071, 3024, -32433, 5328, 30854, -13222, -27377, 20423, 21917, -26046, -14818, 29525, 7066, -31063, 906, 30850, -8971, -28451, 16396, 23849, -22381, -17870, 26849, 10872, -29739, -3035, 30359, -4917, -28763, 12179, 25472, -18791, -20563, 24284, 14025, -27727, -6760, 29190, -684, -28926, 8396, 26631, -15417, -22285, 20954, 16839, -25040, -10317, 27770, 2853, -28274, 4653, 26730, -11281, -23767, 17316, 19209, -22445, -12993, 25636, 6099, -26885, 617, 26637, -7511, -24672, 14123, 20579, -19412, -15305, 23075, 9487, -25516, -2838, 26270, -4329, -24788, 10799, 21722]
590B1722l7865j496L8376q509l6185J8377L0753k6194k3583L1807J5622l5973
602a3148o180L7657m178l5902J3401L1998k1190k6842K8325J9328l3492r957L5415
615A5235Q58l5278P869L3561j6897k8873K4549K1796k9567j4243L3042N924l4869
628a6893L584L3523j2386k9678J9527K4807k5933j8189L0925R622l2958r58L2703
641A7696p159l0981J5306K6941k2493k0575K7402J3373l0520n711L2162k846l1325
654a8730J1248K7894j8196k3078K3973J7007k8605r296L0908R82l0715O850K8776
667A9018j4196k5115K0817J9510k5813j2609K8889N108l0163K880K9252j0587
679F991k6202J7316K1468k2731j5385K6490Q492k8508j178K8772o374k6989J3542
$$ y = [21722, -16143, -17639, 20737, 12228, -23957, -5580, 25173, -1021, -24604, 7203, 22825, -13148, -19328, 18329, 14151, -21751, -8350, 23648, 2458, -24384, 3941, 23269, -10223, -20180, 15235, 16093, -19185, -11316, 22245, 5348, -23525, 1024, 22820, -6747, -20990, 12052, 17976, -16893, -13309, 20214, 7828, -21850, -2323, 22484, -3449, -21638, 9287, 18909, -14049, -15007, 17696, 10537, -20444, -5138, 21803, -690, -21265, 6137, 19510, -11010, -16721, 15441, 12595, -18730, -7482, 20412, 2216, -20862, 3111, 20118, -8487, -17783, 13125, 14107, -16608, -9758, 19018, 4822, -20293, 524, 20034, -5779, -18388, 10501, 15609, -14554, -11674, 17578, 6991, -19211, -1895, 19573, -3158, -18543, 7947, 16439, -12069, -13247, 15525, 9151, -17838, -4296]
692d296K3047j9333j7832K3688J1705k6688m604K7676k722k6592R394K4116j5547
705B012k0171K0974J4453k4670p746K6367R99k6580N856K5106j2519k1582J8006
718E05J6758k2126j1156K5145M489k6293K586K5256q999k2806J4799J8966j9809
731b685j3521K3051P411k4577j292K4950n261k3491J1513J9997j6296j5723K0078
744D154J0687k2982m371K3814j988k2715P430K0837j2698j7674J7566J2729k0673
757e884p177K2166J718k2773M292K1740j0305j8625J4960J4584j8473j0036K1276
770G463M411k2544J813K1694p350j9614J2241J6567j6711j2048J9865O550k1230
783h893j081K1300m300k0161R589J7443j4046j3481J7220Q968j9300m026K0298
$$ y = [-4296, 18751, -582, -18414, 5274, 16979, -9709, -14313, 13363, 10641, -15951, -6557, 17559, 2012, -18159, 2815, 17268, -7402, -15148, 11219, 12218, -14362, -8506, 16600, 4081, -17501, 505, 17263, -4863, -16019, 9126, 13615, -12678, -10092, 15164, 6165, -16641, -1842, 17124, -2685, -16206, 6845, 14256, -10321, -11613, 13337, 8076, -15415, -3902, 16095, -201, -15924, 4154, 14841, -8141, -12512, 11302, 9314, -13401, -5971, 14866, 2168, -15506, 2060, 14789, -5884, -13061, 9105, 10823, -11950, -7658, 14082, 3777, -14848, 112, 14696, -3777, -13813, 7463, 11874, -10670, -8857, 12837, 5487, -14127, -1886, 14681, -2030, -14078, 5787, 12337, -8893, -9974, 11326, 7026, -13135, -3546, 13897, -149, -13630, 3590, 12558, -6742, -10768, 9530]
796I530j366j9732O547J7698j0964j4679J4564J0916j7376o281J8978J156j9061
809a0070L772J7959q326j5915J2615J2550j5999q113J7916L438j8721J340J8508
822A0954o353j6764J0830J3691j4198j0041J6769N722j8378o74J8305m160j6866
835a1163Q270J4714j1983j1617J5068P437j6714l026J7144j211j6811N657J5174
848A0939r668j2270J2526Q999j4634n384J6171J003j6329L408J5098p144j3258
861a0543J0548J0618j3563o821J5264K693j5747J190J5594n305j4364R378J1638
874A0580j2373q225J4295M660j5593n63J5806l739j4568P425J2488j0435r859
887a0101J3005O416j4671k369J5010j539j4313N037J2933q271j0763J1003P781
$$ y = [9530, 8164, -11568, -5021, 12677, 1713, -12966, 1598, 12514, -4862, -11143, 7835, 8991, -10070, -6298, 11661, 3335, -12580, 35, 12585, -3414, -11527, 6389, 9827, -8894, -7554, 10954, 4601, -12163, -1333, 12358, -1840, -11881, 4888, 10610, -7768, -8442, 9863, 5703, -11163, -2893, 11821, -162, -11779, 3289, 10726, -5988, -9014, 8130, 6919, -9892, -4235, 10939, 1271, -10999, 1527, 10526, -4108, -9492, 6679, 7682, -8647, -5239, 9859, 2715, -10543, 5, 10623, -2940, -9761, 5503, 8196, -7551, -6361, 9233, 3928, -10436, -1058, 10580, -1793, -10018, 4277, 8937, -6656, -7219, 8587, 4848, -9720, -2295, 10193, -242, -10101, 2904, 9320, -5351, -7720, 7290, 5751, -8562, -3525, 9408, 1137, -9626, 1377, 9158]
900I158j2898m354J3855P91j3982K815J3233o336j1446R282Q889j1448n954J2980
914D585K642j3797J088J3510m757j2119P877J0073j0486p397J2506M032j3533
927e776m23J3533l033j2742O364J1067r294q502J1402N466j2683k187J3150j255
941E087j2673M498J1340p281r451R673O911j1451l778J2235N80j2182K440J1556
955G504n456j0089Q144P783j0027n180J1325K317j2075R66J1824m204j0516O860
969h24Q694r024o493J0880L581j1891k89J1805k738j1035N535R669q143p471J0124
984B380M637j1132j790J1465j072j1252M052J0136o748q178Q722N848j0061l304
998f297J0886M63j0957K438J0165m995q790P177O966r006m571J0217J801j0596
$$ y = [9158, -3740, -8094, 5761, 6552, -7430, -4615, 8618, 2282, -9164, 118, 9007, -2441, -8395, 4585, 7227, -6570, -5482, 8028, 3271, -8848, -971, 9102, -1384, -8781, 3725, 7757, -5776, -6199, 7334, 4301, -8441, -2077, 8990, -304, -8806, 2596, 8062, -4621, -6808, 6342, 5087, -7586, -3088, 8252, 971, -8480, 1193, 8104, -3347, -7125, 5110, 5690, -6492, -4052, 7504, 2048, -8041, 103, 7886, -2141, -7321, 4004, 6321, -5754, -4788, 7036, 2832, -7684, -824, 7870, -1154, -7647, 3233, 6814, -5077, -5366, 6439, 3701, -7334, -1799, 7870, -273, -7744, 2380, 7017, -4115, -5905, 5560, 4488, -6764, -2712, 7424, 676, -7502, 1220, 7068, -2993, -6297, 4589, 5052, -5905, -3467, 6698, 1703, -7087, 90, 7056, -1950, -6521, 3696, 5497, -5099]
1012e099J013J0199l588r274N967P805q116n605R613K981j0285l30J0313k293
1026C301r799M954Q436p222o370Q687M174r733j740J0319j105r952L822Q684n891
1041E65p134P620N289r131k777R808J04r602K247R028m510p959O747O047q322
1056a980l699R068J421r385R38R243l469q283N705O623p323m732Q514K557r244
1071d046o4R230k426q468M553P247o339n668P866L570q836j134R000j214q550
1086e279L340P700n348o305P018M423q126k284Q707Mq687K282Q060m389o877O180
1102D19N202p482l212Q237J129q570J084Q340l371p384N337N858o754m104P749
1117B478K156q357N3Q336k305p576M176O452n748n039P131L117p951r08P980j085
$$ y = [-5099, -4086, 6113, 2525, -6749, -782, 7023, -1093, -6698, 2915, 5896, -4389, -4719, 5594, 3301, -6498, -1544, 6892, -330, -6700, 1987, 6161, -3572, -5312, 5007, 3902, -6050, -2228, 6456, 565, -6569, 1051, 6340, -2791, -5568, 4240, 4344, -5258, -3011, 6017, 1507, -6452, 295, 6342, -1980, -5679, 3389, 4810, -4575, -3637, 5606, 2137, -6146, -441, 6182, -1141, -5873, 2641, 5198, -4046, -4110, 5120, 2694, -5774, -1221, 6026, -313, -5981, 1885, 5455, -3381, -4515, 4485, 3271, -5279, -1939, 5761, 413, -5892, 1126, 5549, -2577, -4861, 3846, 3850, -4837, -2555, 5505, 1116, -5761, 419, 5621, -1861, -5073, 3164, 4293, -4277, -3193, 5147, 1776, -5608, -271, 5587, -1167, -5271, 2478, 4634, -3723, -3670, 4666, 2361, -5215, -1039, 5413, -335, -5374, 1757, 4874, -3077, -3985, 3995, 2910]
1133B910p606K936O953m836n660O405L808p234j938P650P6p803K042P309m101
1148I11o056N585M563o662k970P553R56p888J259P416l160o525M741N397o252
1163a132l717P273J685p559K34P415k064o916L880N896n441m381O501K657p068
1178b737q65P261r93o995K847O172m429m930N614L481o480j829O996o9o950J917
1194a989O376l519n493M961M255o219k512O868O26o942J123O684k864o015M542
1209a18M763n791l190O558J524o965L24O861k155o196L713N201m980l952O019
1224A616K341o589n68O622j122o250K673N525m066m447N197L059n970j487O349
1239B883j98o254J828N735l339m838M619L645n629k148O216M82o350J240O033
$$ y = [2910, -4696, -1760, 5193, 357, -5303, 1102, 4910, -2324, -4262, 3388, 3464, -4339, -2297, 5012, 911, -5145, 440, 5003, -1659, -4629, 2924, 3880, -4008, -2749, 4667, 1507, -5018, -277, 5120, -1132, -4849, 2424, 4109, -3450, -3216, 4199, 2135, -4781, -901, 4995, -446, -4827, 1674, 4331, -2737, -3602, 3659, 2666, -4329, -1482, 4690, 261, -4669, 945, 4426, -2054, -3883, 3113, 3044, -3906, -1989, 4387, 868, -4625, 336, 4591, -1628, -4140, 2728, 3354, -3588, -2465, 4219, 1355, -4660, -118, 4645, -1146, -4336, 2222, 3746, -3219, -2895, 3966, 1811, -4385, -672, 4529, -451, -4403, 1616, 3957, -2632, -3200, 3422, 2300, -3950, -1277, 4248, 182, -4265, 932, 3991, -1979, -3466, 2883, 2685, -3569, -1741, 3994, 655, -4183, 436, 4081, -1548, -3696, 2520, 3002, -3348, -2108, 3925]
1254C925k882n273M287M131n344k737O069J149o423O13O246k265n597L673M600
1269D172m801l344N657J860o125k47O096j288n685K686M964l959l902M933K600
1284C617n552j163N786l02n703J824N196l217m306M283L217n111j905N661L78
1299B703n785J217N452k655m744L883L741m899k431N571R52n842N91N684k078
1314A360n130L448M171m523k952N214J611n559k63N654j217n335K666M529l775
1329a01l487M544K342n104j041N359l78n172J674M701k827m017L922K971m736
1344a350j609N062K78n046R30M929k273m407L588L321m408k108M871R19n200M43
1360b060N155j887m564L042L711l939k764M720J522n154q1N033j185m633K276
$$ y = [3925, 1043, -4230, 57, 4188, -1156, -3893, 2176, 3325, -3098, -2485, 3761, 1496, -4101, -428, 4172, -629, -3973, 1684, 3544, -2581, -2828, 3268, 1980, -3705, -1019, 3945, -14, -3916, 1017, 3617, -1935, -3098, 2688, 2386, -3317, -1493, 3703, 486, -3820, 463, 3680, -1431, -3336, 2325, 2703, -3082, -1865, 3587, 932, -3812, 71, 3812, -1087, -3518, 2053, 3005, -2837, -2246, 3438, 1360, -3770, -322, 3849, -674, -3626, 1588, 3199, -2360, -2623, 3031, 1814, -3521, -855, 3674, -101, -3588, 956, 3298, -1806, -2847, 2512, 2134, -3038, -1364, 3337, 510, -3507, 415, 3386, -1350, -2959, 2103, 2381, -2665, -1735, 3194, 921, -3486, 102, 3423, -985, -3093, 1778, 2697, -2503, -2060, 3095, 1208, -3356, -314, 3397, -542, -3306, 1414, 2936, -2218, -2299, 2734, 1549, -3084, -808]
1375h08M114l368l277M276K071m710p85M740l43m633J464M342k618l651L584K613
1391C011m171j487M483L76m626Q45M415k038l788K957L004l720k138M415R55m735
1407b242M44M424j565l914K448L434l413k643M258J374m511j20M386r31m199K007
1423g63L750l025k881L712J871m120q77M430k91m396J527L859k485l053L076K363
1439B697l690j535M261L26m333R38L858j841l360K633K776l402j884L911P72m001
1455a874K15L976j228l778K333L087l152k108L511J277l826l86M116p96l900J911
1471f22L231k644k535L253J773l816p21L977l25l820J271L509k223k939L046K080
1487B495l506j189L710L13l858P10L717j757l197K572K470l160j624L535P02l649
$$ y = [-808, 3306, -62, -3339, 937, 3008, -1702, -2487, 2253, 1910, -2723, -1259, 3083, 465, -3186, 398, 3011, -1160, -2647, 1836, 2212, -2414, -1569, 2846, 808, -2980, -23, 2981, -739, -2877, 1538, 2493, -2242, -1798, 2626, 1061, -2853, -405, 3029, -384, -3027, 1231, 2605, -1906, -2026, 2360, 1429, -2770, -763, 2987, -38, -2919, 793, 2664, -1456, -2333, 2097, 1806, -2590, -1063, 2796, 311, -2742, 334, 2697, -993, -2528, 1733, 2059, -2274, -1336, 2522, 681, -2679, -46, 2730, -672, -2556, 1355, 2127, -1874, -1659, 2317, 1089, -2689, -356, 2731, -421, -2529, 982, 2259, -1567, -1953, 2163, 1367, -2533, -622, 2609, -35, -2570, 683, 2456, -1360, -2081, 1896, 1571, -2249, -978, 2531, 308, -2631, 415, 2495, -1011, -2200, 1510, 1823, -2035, -1325, 2392, 635, -2562, 10, 2480, -680, -2304, 1231, 1933, -1716]
1503a716J73L614j048l405J990K881k804k036L275J146l457l40L566n55l480J526
1519f70L059k349k424K991J619l424p08L610k64l499J133L208j941k780K767K020
1535B348l364j042L566Q2l468P14L308j516k997K354K374k992j513L316O37l425
1551a618K13L372j064l043J783K569k354k047K931J268l326k73L279n66l010J209
1567f77K778j953k331K654J569l033p70L219n3l263R92K965j826k409K345J892
1583B099k863j196L310J91l335P68L006j427k680K092K194k741j398L063O10l141
1599a448R5L160r36k890J742K289k179j759K527J246k915m76L056m14k837J091
1615f48K532j681k156K276J533k684p93K851O3k899P01K778j503k352K173J704
$$ y = [-1716, -1543, 2071, 1023, -2382, -392, 2489, -315, -2351, 924, 2070, -1387, -1727, 1839, 1284, -2196, -670, 2389, 40, -2384, 607, 2226, -1198, -1906, 1704, 1440, -2059, -926, 2282, 341, -2439, 328, 2348, -1016, -2058, 1508, 1590, -1878, -1164, 2144, 628, -2369, -15, 2359, -633, -2146, 1170, 1807, -1618, -1405, 1967, 903, -2140, -357, 2212, -142, -2189, 742, 2010, -1316, -1589, 1690, 1124, -1886, -677, 2101, 148, -2183, 471, 2040, -993, -1763, 1456, 1403, -1860, -868, 2097, 271, -2138, 207, 2099, -764, -1960, 1350, 1541, -1794, -1026, 1980, 553, -2127, -35, 2159, -582, -1980, 1083, 1693, -1448, -1353, 1807, 871, -2019, -277, 2012, -167, -1926, 601, 1847, -1068, -1544, 1512, 1098, -1739, -648, 1884, 203, -1953, 323, 1856, -828, -1621, 1230, 1293, -1606, -905, 1873, 370, -1982, 191, 1895]
1631A895k598j006K845L21l014N08K925j361k509K039J927k499j308K835N75k952
1647a377K00K839q71k646J535K281k150j652K503R58k610l92K707k50k702R86
1663f41K391j578j953K014J479k446p94K652N2k560N32K451j136k281J916J716
1679A814k468q95K563L00k642L31K701j194k358J903J748k250j245K589O05k864
1695a362K82K698r77k332J393K081j937j653K492Q37k585j74K482k80k471R06
1711f00K270j569j772J959J284k217p98K475J11k497O33K233j152j967J624J650
1727A667k177r71K459K22k469M17K392j054k157J676J666k143j063K410M58k582
1743a249K28K530r17k233J471J827j919j373K290P69k434j35K398m48k266R89
$$ y = [1895, -703, -1709, 1136, 1457, -1557, -1049, 1876, 515, -1994, 45, 1972, -527, -1835, 1000, 1575, -1377, -1177, 1662, 791, -1855, -320, 1961, -189, -1841, 662, 1620, -990, -1382, 1325, 1075, -1627, -641, 1750, 172, -1781, 233, 1712, -734, -1528, 1124, 1176, -1384, -852, 1599, 463, -1818, 98, 1814, -654, -1549, 1014, 1314, -1328, -997, 1704, 510, -1848, 55, 1803, -447, -1692, 897, 1502, -1362, -1080, 1618, 641, -1691, -298, 1783, -154, -1807, 685, 1522, -1063, -1237, 1245, 965, -1506, -600, 1670, 101, -1671, 288, 1572, -645, -1443, 1032, 1143, -1354, -721, 1512, 360, -1607, 17, 1667, -510, -1481, 978, 1200, -1269, -852, 1540, 486, -1671, 5, 1671, -472, -1535, 875, 1333, -1249, -1021, 1509, 592, -1641, -170, 1657, -262, -1635, 655, 1424, -1010, -1145, 1253, 805, -1461, -472]
1759d72K041j487j660J902J137k125n97K259L3k286N48K159j120j807J559J385
1775A469j924r02K220K82k307L68K151r08j937J459J573j979j000K251L53k281
1791a112K03K250p93k096J432J661j832j152K045O81k240j05K301n51k063J024
1807c47J779j384j503J817J009k086m12K077n4k031N06J989j109j653J550J171
1823A319j750p81J976K63k119L77J995r43j692J334J372j699r60K070K93k103
1839a048K75J977p27j821J219J552j701j042J952N00k012k8K034m92j936J039
1855b59J621j423j221J639Q55j858l85J993j86j907O43J711j018j462J389J099
1871A231j717o26J853J57j854K94J798q05j588J276J206j569q10J770L67j886
$$ y = [-472, 1569, 82, -1578, 324, 1461, -664, -1261, 998, 1031, -1255, -707, 1452, 332, -1475, 84, 1469, -455, -1357, 863, 1145, -1162, -794, 1357, 449, -1488, -29, 1544, -435, -1435, 816, 1169, -1112, -909, 1341, 548, -1548, -116, 1545, -287, -1439, 606, 1287, -953, -1058, 1243, 692, -1371, -347, 1432, 48, -1455, 362, 1371, -715, -1127, 950, 896, -1135, -629, 1360, 251, -1402, 148, 1319, -431, -1212, 764, 1027, -1092, -715, 1280, 337, -1355, -21, 1351, -348, -1308, 762, 1055, -1048, -773, 1204, 477, -1344, -125, 1427, -274, -1316, 636, 1136, -876, -904, 1130, 638, -1298, -259, 1362, -61, -1282, 357, 1212, -646, -1031, 962, 776, -1131, -488, 1223, 205, -1257, 132, 1231, -486, -1112, 741, 898, -956, -662, 1136, 331, -1257, 19, 1225, -344, -1154, 616, 983, -903]
1887i03J80J855p19j645J130J364j464r90J755M74j869L7J838m62j741Q87J518
1904A245j319j123J584P16j753l12J830j55j782O67J548j041j289J338R79j585
1920d52n76J737Q4j737L96J616p68j460J148J167j485o92J634K70j708J44J720
1937A038o14j545J042J214j339q60J562M88j724l4J736m69j551Q36J335j183j063
1954a131J484O48j613k28J642j85j613O07J465j002j150J245Q40j429n14J624
1970F90M7j625M12J446p21j265J018J069j396o11J521J82j475R8J501m87j447
1987a043R87J101j255p16J312M72j500q8J617m74j399Q22J087r42r72J274O50
2004I33j547j10J477k60j319M63J314q64j110J265O49j349k82J320Q9j448L50
$$ y = [-903, -723, 1132, 413, -1232, -102, 1262, -202, -1192, 563, 1037, -832, -795, 1043, 581, -1160, -273, 1245, -74, -1197, 387, 1103, -650, -962, 868, 713, -1069, -402, 1146, 105, -1184, 154, 1133, -452, -1028, 709, 793, -944, -548, 1068, 300, -1160, -12, 1155, -330, -1022, 612, 882, -826, -682, 1038, 424, -1121, -79, 1135, -204, -1064, 498, 986, -738, -772, 964, 495, -1056, -220, 1115, -68, -1131, 353, 1001, -612, -840, 802, 617, -996, -389, 1076, 74, -1076, 169, 1009, -420, -934, 690, 737, -888, -476, 970, 249, -1016, 2, 1071, -325, -936, 585, 767, -708, -610, 891, 404, -1043, -56, 1045, -210, -926, 386, 858, -642, -730, 887, 413, -986, -164, 923, -19, -991, 283, 933, -614, -724, 753, 493, -826, -363, 951, 87, -1023, 242, 891, -458, -740, 580, 669, -779, -429]
2021d29J384q15j048R99P75j111n97J357K07j473K74J296n65j110P76R80j083
2038a83p03J330K64j306M1J250l17j230O87J052r98p16J114M55j193j94J305j94
2056D64j273N89J044p85q52R93O14j178k95J271n3j234L73J103o37r54R13O98
2074H01j096m06J175J12j196J81J165n26j006P89P79r66n35J091K47j149M2J156
2092F58l46j059O35Q73q49o43J010L75j098r4J147k17j062M86R18p12p50R34M86
2111F92j080j71J081q7j040L28R86o32q20Q79N38r78k97J037O2j106K60J029n66
2130A15q10P00O70q53m91J054J67j078J58R52l22r07N47Q11q31n22R47K56r55
2149c92o1J010k06j008N39P85p07n76P93M41r51j95J037j56r41L97P89n39p13
$$ y = [-429, 955, 140, -908, 91, 866, -245, -842, 515, 722, -751, -477, 819, 254, -856, -80, 900, -183, -886, 444, 708, -598, -557, 693, 376, -854, -167, 885, -113, -829, 285, 740, -453, -647, 658, 464, -809, -220, 824, 39, -813, 180, 794, -384, -679, 592, 539, -695, -322, 781, 144, -810, 103, 801, -295, -701, 474, 586, -610, -429, 736, 210, -796, -7, 772, -194, -729, 362, 609, -540, -498, 658, 312, -747, -112, 761, -88, -731, 279, 654, -444, -538, 609, 392, -670, -184, 734, 22, -728, 206, 692, -388, -559, 522, 435, -605, -277, 709, 77, -743, 136, 674, -304, -601, 436, 498, -608, -348, 681, 115, -695, 5, 675, -178, -669, 385, 552, -526, -368, 584, 262, -645, -98, 713, -118, -640, 307, 563, -392, -453, 557, 351, -657, -118, 667, -40, -616, 177, 618, -333, -528, 509, 353, -588, -191, 598, 59, -654]
2168f54P59N11r27k25R63rr46K35R20n12p71P16N48q20l40Q93J56r80J32R58m34
2189A73p75N99O18p33m62Q82K08r36N3R04k89q30N01P06o99n09Q18K82q63p8Q84
2210D54j57q64M11P35o07n53P26L90q22j87Q94q7q43L03P68n00o24O60M61q05
2230b47k23Q57%q31J93Q02m21o86O27M82p41k78P82J04q53J23Q33l91o80N53N32
2251E37o83l70P81J61q20O3P98k64p23M45O20o24m27P26K25p56l5P79j65p39L61
2272a10O33n18m84O27L27p37j14P49p5p33K61O76m72n49O33L50p04j68P44mp75
2293d43K27P31m72n68O08M05p10k38P86K2p71J82P11l53o17N15N00o76k94P34
2313B79J02p14N6O90k20o58M13N51n71l69O32K04o65m6O79j22o77L25N74m94m19
$$ y = [-654, 105, 616, -311, -536, 427, 418, -528, -293, 627, 115, -656, 60, 608, -212, -552, 341, 497, -483, -351, 607, 173, -602, -3, 615, -118, -580, 302, 510, -426, -373, 531, 242, -588, -87, 619, -80, -589, 229, 511, -352, -430, 454, 297, -567, -156, 579, -28, -581, 145, 535, -287, -474, 420, 333, -510, -207, 561, 61, -563, 97, 558, -247, -470, 387, 387, -444, -251, 551, 130, -556, 71, 553, -188, -466, 316, 420, -433, -310, 523, 132, -548, 5, 537, -146, -516, 265, 426, -394, -331, 467, 203, -520, -75, 545, -79, -506, 220, 445, -311, -346, 433, 268, -471, -110, 523, 5, -479, 148, 475, -262, -376, 373, 298, -435, -174, 502, 30, -519, 114, 464, -240, -408, 336, 332, -443, -216, 515, 43, -525, 83, 488, -222, -460, 326, 348, -423, -241, 470, 117, -500, 15, 515, -161, -455, 279, 381, -333, -277, 413, 193, -465, -52, 499, -72, -441, 191, 395, -270, -316, 363, 241, -436, -111, 463, -31, -450]
2334d50N84K80o72j09P31j20o91L03O05m55n04O25L31p35j10P54q9p01K56O54
2354D87m28n73O34L60p07j60P04K7p28J59O93l51n83M86M50n84l22O67J24o78
2374c23N4O31j98n89L48N14n03l77O11J99o56k8O66j30o50L34N73n09m27O32K57
2395D29p11n1P23j37o93L20O25n05m98O65K93p22j11P42o8p27K52O43m10n41N40
2416E8L95o25k50P00K8o73J40O07k50n69M03M85n61k96O20J26o33RO63j85o22
2437d30L88N00n28l47O24J89o88j5P34k33o53L98N53n31m36O74K53p74k8P78k04
2458B24o91L40O07m85n03O36L17p08j14P04m7o84K11O35l74n22N12L84n92k40
2478c90O43P9o78J31O27k79n53M09M72n63l19O70J12o91O9O77k44o60M63N21o10
$$ y = [-450, 134, 414, -258, -367, 364, 244, -447, -144, 461, 6, -498, 127, 458, -277, -387, 367, 278, -423, -167, 487, 59, -514, 120, 480, -227, -387, 317, 344, -384, -225, 468, 117, -466, 20, 470, -114, -436, 231, 355, -323, -269, 362, 164, -425, -77, 437, -66, -443, 168, 367, -289, -317, 349, 219, -431, -97, 476, -33, -460, 172, 429, -282, -333, 390, 253, -440, -120, 505, 0, -498, 167, 460, -262, -373, 369, 301, -426, -174, 469, 59, -482, 58, 453, -172, -422, 278, 306, -367, -227, 380, 130, -439, -36, 449, -112, -408, 212, 338, -295, -286, 377, 192, -430, -42, 458, -70, -417, 207, 396, -292, -307, 427, 194, -459, -61, 492, -39, -475, 199, 452, -322, -350, 428, 224, -467, -127, 480, -5, -508, 128, 445, -263, -377, 327, 280, -404, -193, 442, 68, -454, 58, 442, -150, -390, 253, 332, -346, -215, 412, 133, -420, -11, 461, -102, -421, 249, 361, -330, -261, 416, 172, -488, -25, 496, -114]
2499a14l42O81J81p64K8P76k53o94M42N56n50m37O70K73p65m9P51j32o95K80O44
2520D87m57n05N90L27o32j84O71J4o79J80O31l61n13M63M10n81k79O90O8p00J13
2541b47O58k73o16M64M86o07l19O91J33p27N4P38k67o73M64N40n87l84O61K40
2561D29p52k9P78j87o89L44O03m85m71O02L01o69j30O78m7o55K02O12l66n27N18
2582F0L69n99k21O42O7o69J16O51l02n57M42M41n58l17O87J16p19Q8O88k60o32
2603d67M32N32n83l64O77J73p02j2P25j85o80L67N65n03m29O00K87o84j10O92
2623C31p0o69K41N97l85n11N29L47n98j96O42M8o70J48O33l25n38M45M29n54k86
2644d12O74R8o99R4O68k67o14M35N04n66l36O47J51o78KP07j96o66L82N41n06
$$ y = [-114, -456, 225, 406, -358, -330, 446, 193, -501, -59, 497, -53, -490, 180, 453, -312, -361, 390, 258, -437, -157, 487, 30, -475, 115, 442, -190, -374, 297, 311, -368, -188, 443, 82, -431, 32, 442, -139, -418, 272, 340, -360, -247, 411, 138, -478, -14, 472, -135, -454, 237, 370, -357, -303, 435, 168, -505, -41, 499, -88, -472, 189, 429, -323, -352, 426, 239, -450, -106, 497, 12, -459, 143, 444, -225, -355, 323, 276, -379, -177, 435, 69, -458, 60, 429, -170, -391, 251, 318, -351, -235, 416, 114, -443, -1, 440, -118, -435, 252, 368, -351, -263, 425, 165, -467, -35, 497, -86, -450, 227, 400, -302, -314, 411, 226, -454, -87, 478, -25, -454, 146, 433, -251, -361, 331, 261, -408, -167, 430, 45, -466, 63, 410, -188, -384, 258, 306, -364, -216, 417, 92, -446, -1, 428, -126, -412, 262, 360, -339, -245, 423, 156, -458, -23, 481, -85, -421, 226, 377, -301, -299, 408, 212, -454, -72, 469, -37]
2665c7m22O07K68o81q1O90j00o70K72N99m13m89N39L46o41j64O75ko58J61O32
2686D31l38n41M85M18n97k49O51Q7o88R1O87k86n98M36M80n71l37O60J82p24J2
2707c09P12k11o41L66N50n17m34O46K53p04n8O97j07o83K86O14m31m98N79L30
2727D40o62j53O89np01J94O63l88n45N31L99o08k70P05P0p23J24O80l18o00M66
2748a2M80n84l45O76J64p23L0P12k13o49L80N56n27m23O58K40p12n7P25j22o89
2769d35L01O19m75m81N93L25o57j69P23j9p48K36O52l99n41N31M18o43k54P27
2789C04N4p48J36O87k98o26M74N05o24l12O74J48p02J3P14k06o64L96N50n30l93
2810d48O11K65o96p6P32j22o94L00O02m45m96N83L50o90j58P19l2o95J85O67l88
$$ y = [-37, -459, 148, 416, -265, -346, 344, 244, -426, -154, 445, 32, -457, 82, 428, -213, -377, 298, 296, -362, -201, 431, 93, -448, 37, 455, -142, -391, 260, 347, -341, -250, 437, 151, -447, -11, 469, -102, -439, 221, 403, -321, -309, 403, 192, -449, -83, 467, -50, -484, 162, 415, -289, -347, 350, 243, -440, -154, 460, 29, -469, 110, 440, -222, -375, 314, 309, -392, -198, 465, 77, -468, 63, 462, -146, -416, 289, 359, -364, -240, 440, 122, -478, -12, 468, -116, -461, 215, 379, -344, -314, 398, 185, -464, -84, 472, -55, -478, 180, 420, -292, -349, 376, 254, -435, -134, 485, 10, -471, 122, 447, -210, -379, 344, 325, -423, -187, 465, 66, -475, 56, 474, -169, -423, 304, 358, -390, -254, 433, 135, -491, -17, 488, -136, -448, 226, 374, -328, -315, 399, 193, -471, -75, 475, -55, -448, 163, 428, -268, -344, 388, 266, -428, -128, 474, 29, -467, 116, 466, -224, -382, 337, 305, -390, -205, 462, 74]
2831G4n65N56M08o59k55P27N4p32J31P14l34o06M75M98o09l44O98J55p39N1P16
2852D14k14o52L74N63n21m21O41K53o97q3P24j08p02K86O22m52n02N81L41o63
2872b16j77P28l3p23K07O68l85n69N43M39o83k34P37N6p54J36P22l27o39N04N01
2893E01o35l18P11J55p68N6P44k31o74L99N64n52m25O58K61p25o5P29j22o97K89
2914a45O37m62n18N86L70p03j78P51k2p51K22O93m11n77N61M35o63k63P39O0p77
2935d16J64P36l53o29N18M96o37l45P42J44p84O5P52k54o95M35N88n89m29O97
2955B06K33p44n8P57j36p30L22O39m97m87O08L34o87j75P55m4p32K39O72m11n59
2976d95N62M26o85k27P44K8p44J49P20l39o42N37M85o54l10P23J08p56P4P44k69
$$ y = [74, -491, 65, 473, -186, -441, 286, 340, -392, -261, 453, 119, -487, -12, 486, -123, -467, 231, 386, -353, -302, 414, 200, -452, -78, 485, -36, -457, 184, 437, -260, -343, 381, 273, -429, -143, 479, 27, -475, 106, 447, -216, -393, 335, 302, -421, -214, 454, 69, -500, 43, 482, -201, -435, 302, 358, -396, -260, 462, 135, -504, 0, 501, -134, -452, 259, 414, -354, -298, 446, 215, -459, -60, 504, -48, -473, 185, 446, -279, -344, 385, 263, -434, -145, 492, 30, -488, 98, 468, -235, -413, 338, 316, -435, -213, 480, 69, -508, 53, 488, -175, -438, 301, 361, -416, -252, 484, 131, -498, 20, 516, -121, -466, 276, 420, -364, -299, 453, 199, -496, -61, 527, -62, -491, 206, 439, -305, -363, 394, 258, -472, -150, 489, -8, -495, 113, 447, -240, -415, 340, 296, -436, -197, 475, 64, -495, 67, 493, -192, -419, 325, 353, -391, -242, 478, 139, -503, 34, 519, -135, -445, 278, 386, -370, -296, 448, 179]
2997A79o75M60N36n77l99O85K18p52k6P49j65p02L40O11m92m75O11L13o94j31
3017c86P20n3o94K21O64m05n51N57M00o54k18O95N6p37J71O85l64n84M99M57o15
3038a36l09P08R9p34J06O94k67o30M33N19n75l74O75J80p04j8P22j77o63L56N60
3059D65m90m27N92K90o77j12P12o2o98K52O16l99n14N26L81o42j99O82K5o88J50
3080b17O57l35n70M85M25n79k80O60R4o87P5O77k71n89M10M94n44l48O44J79o92
3101c12RO95j90o24L35N47m84m06N85K62o58r7O73o4o69K56N89m07m82N18L49
3122D25o02j98O48L2o63J38O21l07n48M54M24n59k70O33J00o43M5O52k24n83L80
3143d5M85n14l35O00J87o43j3O46j56o10L13N33m62m05N70K52o42q6O59q3o27
$$ y = [179, -496, -36, 500, -77, -476, 209, 427, -325, -351, 398, 233, -469, -129, 482, -10, -485, 126, 439, -255, -386, 334, 281, -413, -192, 472, 67, -484, 73, 473, -181, -399, 296, 352, -385, -214, 471, 107, -477, 22, 479, -136, -445, 263, 362, -372, -266, 428, 161, -469, -36, 483, -92, -466, 209, 389, -315, -333, 389, 212, -451, -95, 465, -25, -452, 140, 430, -247, -359, 353, 291, -407, -155, 461, 62, -452, 74, 455, -187, -386, 296, 321, -367, -217, 440, 105, -465, 20, 445, -134, -414, 246, 340, -347, -272, 405, 134, -455, -45, 449, -95, -443, 201, 380, -312, -303, 392, 202, -422, -87, 460, -24, -430, 155, 417, -241, -338, 335, 271, -398, -142, 447, 40, -442, 76, 425, -177, -375, 273, 305, -358, -220, 401, 94, -454, 0, 424, -135, -405, 228, 328, -315, -270, 382, 158, -425, -45, 440, -74, -409, 191, 378, -265, -278, 368, 212, -398, -85, 448, -14, -419, 151, 403, -239, -325, 334, 251, -376]
3164c76K28N80l99m69N16L26o00j76O34K1o32J39O08l01n32M39M17n47k78O12
3184B10J20o35O2O10k07n60L60M70m92l39N90J79o26k5O41j60n91L03N14m37l96
3205d09N33K54o07r2O30q5o08K34N33l46m62M91L29n90j48O01Pn96J43N67k87
3226I2m98M23L85n09k52N62J22o05L8O05k11n33L38M46m48l20N34J77n85k3N86
3247C24j36n65K86M89m24l63N08K19n58r2N90o4n77K33N12l63m13M55L01n41j52
3268c31N87Nn75J47N34k78m70M02L63m90k34N48Q1n43L6N60j92n17L28M21m25
3289d3k93M80J77n50k3N44j11n23K53M45l78l46M59K42n38q4N54o2n31K08M68
3310C48l10m14M45K84n12j44N57Mn50J40N11k64m44L72L55m65k28N15R0n46N3
$$ y = [-376, -148, 432, 33, -436, 80, 406, -194, -370, 264, 285, -347, -208, 400, 99, -433, 6, 423, -124, -402, 210, 330, -305, -243, 367, 160, -400, -40, 430, -62, -401, 189, 368, -258, -283, 358, 198, -393, -90, 424, -13, -409, 124, 378, -229, -321, 309, 224, -384, -150, 383, 37, -425, 66, 395, -195, -343, 258, 265, -331, -188, 379, 92, -406, 17, 402, -107, -359, 203, 325, -280, -242, 363, 152, -381, -43, 403, -45, -365, 169, 346, -239, -262, 324, 188, -377, -91, 398, -26, -389, 119, 338, -220, -312, 278, 214, -363, -130, 382, 19, -394, 61, 362, -179, -331, 256, 261, -314, -167, 367, 89, -381, 21, 384, -106, -340, 208, 289, -254, -218, 342, 150, -367, -39, 382, -43, -336, 144, 321, -229, -252, 292, 181, -342, -89, 356, -22, -368, 91, 333, -205, -289, 265, 203, -328, -120, 348, 38, -376, 69, 353, -159, -303, 254, 258, -292, -152, 359, 95, -349, 23, 378, -87, -315, 200, 290, -256, -203]
3331b03N21j78m89L04M10m03l15M73J85n20m6N28r3n09K38M46l51l48M39K43n12
3352a80j04N47m9n16J75M86l03l95M02K88m81j55N20K6n31J20M85k43m31L51L45
3373C57m46k33N05R4n16K2N06j47m87K93L96l82l07M62J87n08n9N13o7m94K03
3394a08M37l10l58M14K42m63j26N09pn12J57M81k87l91L82K84m47j78M94L7n05
3415b55Q9M76k14m33L41L31m13k31M57J16m99K5M92j37m69K70L87l57l13M51J85
3436B99m81o5N13p1m88J97M36l22l33L98K45m65j27N02j3m74J28M42k52l96L64
3457C7K93m51j59M79L6n00J00M60k02m25L24L28m01k19M47R6m73K2M73j37m33
3478c05K54L69l41k77M32J45m53l6M71q5m46J90M05k96l28L85K23m44r9M55lm66
$$ y = [-203, 318, 140, -349, -45, 365, -38, -353, 120, 305, -215, -261, 267, 174, -335, -97, 349, -2, -350, 89, 332, -180, -284, 263, 214, -302, -127, 359, 56, -339, 63, 351, -130, -285, 235, 261, -270, -150, 335, 92, -339, 12, 357, -89, -322, 183, 277, -239, -217, 289, 142, -345, -52, 344, -38, -345, 117, 304, -204, -263, 250, 183, -311, -108, 329, 19, -339, 75, 317, -146, -272, 237, 230, -282, -125, 356, 69, -322, 60, 344, -103, -281, 213, 250, -255, -166, 310, 96, -337, 4, 335, -78, -309, 148, 264, -235, -210, 282, 145, -324, -54, 333, -24, -337, 114, 299, -182, -247, 266, 195, -293, -96, 340, 18, -315, 83, 328, -137, -264, 238, 225, -249, -121, 321, 69, -327, 37, 330, -121, -280, 199, 235, -265, -165, 295, 93, -332, -8, 320, -81, -300, 147, 243, -230, -208, 265, 128, -305, -51, 318, -23, -300, 132, 277, -176, -212, 259, 174, -272, -82, 323, 27, -301, 84, 307, -137, -236, 219, 216, -250]
3500b50J24M31k63l55L45K62m08j54M49L4m64Q8M34k03l72K97L10l89j98M31J02
3521B51m67K9M48j35m15K57L40l24k64M10J52m58k0M46p8m38J97L74l00l00L65
3542G0K03m18r8M59k8m44J28M06k36l45L25K69m06j50M36L0m35Q0M19j80l74K92
3564CK87l60j86M01R7m31J6M31j32l89K33L31l20k48L77J56m14m8M32p5m21J84
3586g6L66k94k87L58J94m06r7M32k2m19J29L83k27l37L36K32l65j50M23L7m33
3607b23Q8L95j77l64K84K74l22k04M04Q2m23K1M11j20m01K42L16l03k50L73J52
3628B55m21m2M15o9m01J78L45k67k70L29J96l85r1M04pm10J35L76k24l18L19K37
3650B84l84j34M17K6m19R0L81j88l38K72K76l40j89L89Q1m05K3L93j33l55K14
$$ y = [-250, -126, 305, 42, -313, 32, 294, -114, -268, 181, 215, -249, -161, 273, 70, -302, -5, 305, -84, -282, 149, 251, -216, -187, 261, 126, -289, -32, 308, -16, -280, 130, 282, -176, -196, 250, 172, -266, -69, 305, 5, -295, 70, 273, -145, -243, 216, 188, -256, -128, 278, 42, -303, 22, 291, -115, -265, 171, 201, -234, -154, 265, 85, -289, 3, 290, -70, -256, 145, 242, -189, -173, 258, 126, -263, -30, 301, -19, -267, 110, 266, -148, -196, 236, 161, -260, -76, 290, -4, -291, 67, 261, -145, -242, 190, 168, -251, -122, 261, 34, -303, 33, 265, -100, -250, 173, 210, -223, -135, 260, 83, -281, 3, 277, -45, -249, 155, 237, -186, -165, 246, 126, -275, -33, 283, -20, -270, 103, 255, -166, -208, 207, 138, -263, -85, 260, -7, -277, 52, 248, -137, -228, 176, 169, -241, -106, 270, 46, -272, 47, 284, -100, -234, 183, 209, -210, -120, 261, 73, -265, 7, 283, -57, -246, 143, 224, -181, -158, 235, 102, -253, -39]
3671c9L12l16k25L69J26l93l5M06q1l81J83L30k61k57L30J63l65q2M06k7l84J27
3693i4L58k23k97K98K26l72j05L89J5l97R2L58j88l14K78K35l29j60L70O4l98
3714a94L7L85j46l44K25K92k97k14L49J33l93j6L97r4l59J73L14k54k47L25J71
3735B43l64o9L78l1l76J35L44k18k83K92J93l32j15L65J8l80Q7L48j76l05K46
3756@K44l31j37L49N6l69L8L61j25l29K04K83k90j93L28J21l60k3L69p3l41J67
3778e1K97k30k55L07J63l37o7L58jl80J15L22j98k77K67J96l14j14L36L3l61O6
3800a25L41j65k88K27K42l03j49L26P3l45L2L32j03l23J90K69k51k02L08J13l21
3821a22l4L54o4l40J67K90k27k41K76J68l17j01L57j3l38Q4L18j77k67K42K03
$$ y = [-39, 273, -43, -268, 101, 227, -166, -201, 205, 124, -257, -74, 256, -5, -262, 68, 231, -134, -216, 190, 163, -221, -94, 264, 41, -256, 42, 268, -104, -209, 180, 195, -202, -110, 248, 60, -254, 24, 259, -70, -230, 140, 204, -194, -157, 228, 82, -262, -37, 255, -42, -256, 93, 226, -167, -183, 214, 120, -239, -66, 248, -6, -253, 72, 243, -121, -190, 188, 157, -219, -84, 260, 42, -241, 51, 244, -88, -203, 162, 180, -200, -113, 235, 59, -246, 0, 244, -87, -224, 125, 181, -188, -150, 211, 86, -243, -39, 244, -46, -239, 89, 210, -150, -173, 196, 123, -218, -51, 246, 16, -239, 68, 231, -106, -173, 185, 184, -196, -81, 241, 43, -234, 33, 229, -85, -199, 137, 170, -191, -125, 216, 51, -237, -10, 232, -71, -220, 106, 179, -166, -134, 198, 95, -228, -38, 231, -20, -222, 86, 199, -122, -156, 198, 134, -206, -39, 251, 24, -217, 59, 227, -90, -191, 166, 153, -185, -101, 217, 40, -227, 15, 218]
3842B18k89j42L43K8l45N3L39j39k96K18K33k70j71L34P9l31oL42r7l04J76K52
3864B25k33k01K88J36l16n5L47o5l19J30K78j95k40K67J70l15r3L24J4l32Q0L17
3886B12j66k70K31J95k74j27L09O3l37L7L14j04k87J87K40k57j68L03R2l23rL22
3908A83p1l05J56K63k22k08K81J30l15n2L30m6l15J22K86k00k35K48J65k86j14
3929b05L31J4l21P0L05j64k55K23K11k80j30L09O3l24L1L11r9k96J79K51k47j74
3951a97K82J07l25nL20n9l16J37K77k21k14K78J34l06o2L22l2l23J34K75j88k37
3973b19K44J67k83j03L19Ql14Q1K96j40k57K01K07k57j45L10N5l10K4L10j06l00
3995b12J85K53k39j84K90R3l15j6L20p0l04J45K71k18k20K61J53k97p6L28l1k92
$$ y = [218, -71, -213, 130, 158, -187, -134, 205, 66, -230, -12, 221, -49, -220, 114, 193, -138, -144, 198, 101, -203, -27, 225, -8, -209, 79, 215, -101, -156, 191, 126, -193, -63, 215, 20, -220, 47, 217, -98, -191, 133, 147, -185, -105, 212, 46, -224, 7, 202, -72, -199, 110, 173, -164, -127, 187, 83, -204, -17, 223, -34, -202, 101, 193, -130, -139, 183, 112, -193, -37, 226, 4, -204, 77, 207, -108, -160, 170, 124, -191, -69, 217, 17, -218, 30, 195, -91, -205, 126, 140, -181, -111, 194, 30, -225, -2, 209, -71, -201, 108, 171, -153, -122, 189, 90, -206, -27, 224, -23, -197, 85, 192, -133, -138, 182, 123, -193, -56, 221, 0, -214, 64, 198, -108, -170, 152, 120, -203, -69, 206, 18, -219, 25, 192, -91, -194, 125, 133, -181, -100, 196, 56, -201, 0, 207, -50, -195, 115, 170, -140, -116, 194, 88, -212, -27, 226, -13, -197, 93, 186, -129, -145, 175, 105, -199, -54, 217, -1, -221, 40, 193, -104, -180, 148, 117, -175]
4017a75Q6K84j83k21K44J66k95p5K92K5l09P0K94j49k52K07K03k48j43K94N7l13
4039a41J2L15r6k82J72K33k33j87K88R3l15j6L24o4l09J43K55j91k26K67J49l01
4061a10p7L23j4l05R8K84j71k33K24J84k77r6L03J7l01N8K82j27k56K06J88k50
4083e0j28K89N8l08J4L04j03k79J63K38k26j90K75J12k98k0K96l7l12J33K74j98
4105Gk19K58J49k97o3L10ql12R6K93j71k33K35J59k71j01L04Nk91O2K72j32k42
4128a90K01J90k53j27K86L5k91K4K81q0k69J57K27k29j62K64J00k89k5L07p0k77
4150a90J29K58j95k03K59J38k89p1L23ol21J04K76j74k33K25J78k75r7K97K4l11
4172a54N3K90j39k52K08J84k49j32K88M5k87K5K79r2k60J68K09k09j61K52J06
$$ y = [-175, -89, 195, 12, -209, 35, 201, -94, -169, 123, 148, -161, -91, 203, 54, -198, 9, 212, -36, -179, 115, 172, -141, -129, 186, 90, -192, -20, 213, -20, -207, 81, 174, -141, -157, 167, 103, -206, -63, 192, 1, -225, 42, 191, -110, -187, 136, 122, -183, -85, 199, 28, -205, 19, 203, -74, -170, 133, 150, -151, -93, 189, 62, -194, 12, 200, -50, -178, 111, 169, -139, -125, 179, 76, -203, -40, 198, -28, -218, 57, 169, -129, -149, 147, 110, -202, -69, 205, 7, -212, 46, 195, -102, -165, 145, 137, -175, -79, 214, 43, -190, 45, 204, -67, -168, 136, 141, -150, -88, 184, 52, -190, 11, 201, -52, -179, 107, 142, -149, -125, 156, 76, -193, -36, 191, -38, -200, 64, 164, -125, -150, 157, 87, -190, -61, 197, 2, -201, 58, 196, -93, -164, 159, 153, -168, -64, 212, 38, -195, 30, 208, -67, -164, 133, 157, -154, -101, 189, 50, -202, 6, 190, -59, -191, 97, 142, -145, -120, 159, 67, -193, -25, 184, -25, -186, 66, 172]
4193A72k92j0K79n0k73J22K62j84k14K38J43k86o5K93rk86R5K67j67k32K22J71
4215A96k67j03K81L1k94N5K70j25k42J84J98k34j33K67N4k65J3K73p8k51J52K06
4237A88k15j42K41R1k53l0K70m6k53J14K30j84j83K21J35k63p7K81nk79P6K61
4259A78j42k21J95J60k37j12K62O2l01M8K58j11k14J57J95k03j41K44O7k55oK62
4281A45o0k42J30K09j76j61K25R8k48m6K46j1k42Q1K25j57j85J90J38k28q7K64
4303A08K0k68M6K44j08k17J61J76k04j24K47N1k52J8K45o5k35J35J97j77j52K16
4325F2R5k47l1K64l9k47R9K24j59j77K08J03k21o5K41kk47N4K30j13j97J74J48
4348A57k12r8K32L8k43K0K51q4k31J63J79k01j23K35O2k35k1K56n1k36J17K00
$$ y = [172, -120, -130, 149, 99, -174, -52, 210, 26, -188, 50, 193, -93, -158, 135, 126, -160, -65, 202, 35, -197, 25, 196, -71, -174, 107, 138, -156, -101, 169, 44, -198, -14, 184, -50, -183, 84, 138, -127, -114, 159, 81, -170, -18, 188, -27, -169, 72, 163, -90, -120, 150, 104, -149, -35, 195, 11, -172, 49, 184, -79, -156, 125, 120, -159, -83, 178, 36, -185, 10, 170, -67, -179, 83, 145, -156, -108, 150, 39, -175, -18, 177, -26, -167, 77, 144, -111, -117, 145, 85, -157, -27, 182, 6, -155, 70, 168, -80, -126, 120, 109, -133, -52, 173, 16, -169, 21, 159, -69, -156, 108, 128, -140, -94, 150, 42, -175, -14, 162, -42, -166, 81, 132, -120, -102, 143, 78, -157, -22, 175, -2, -154, 62, 157, -90, -121, 143, 104, -143, -44, 180, 21, -156, 52, 155, -66, -131, 110, 108, -139, -85, 145, 32, -165, 9, 157, -55, -153, 79, 117, -126, -106, 145, 61, -170, -7, 172, -29, -152, 83, 145, -90, -111, 145, 94, -142, -25, 175]
4370A75j61j63K05J01k32m4K43j6k49P6K21j42j80J84J28k20q0K55mk36M4K29
4392A34r4k05J50J73k09j13K37N4k29J1K28o4k28J29J88j74j38K16Q5k32l4K46
4414A31l1k38R3K16j42j83J95J18k30n6K35j2k32O0K22j15j96J67J45j96j08K32
4436G5M4k47K9K30q4k10J41J78j71j36K21O6k33rK43m9k17R7J87j45j43J81J04
4459A52k20m4K42j9k42P2K08j21j88J65J55k20p1K21J8k32L2K37r5k08J43J63
4481A48j88j18K31O5k48NK50o7k16J19J88j70j41K04Q5k27k9K42l2k27Q3K11j42
4504B6j69J84J13k13p3K25Kk25M6K23j11j90J55J55j95j02K31L9k38K3K21p9j98
4527a50J32J88j95j17K06Q0k29j4K37m1k20R2K09j53j66J88J15k29n6K40j4k33
$$ y = [175, 14, -149, 56, 157, -75, -119, 124, 108, -141, -65, 156, 14, -166, 18, 146, -74, -154, 101, 97, -139, -95, 134, 40, -165, -15, 158, -51, -164, 73, 127, -102, -91, 137, 73, -155, -26, 162, -12, -150, 66, 151, -81, -115, 131, 100, -138, -45, 171, 29, -154, 41, 159, -71, -127, 108, 96, -136, -76, 146, 31, -165, 2, 147, -49, -157, 75, 119, -128, -99, 131, 47, -163, -22, 156, -15, -151, 70, 136, -97, -106, 137, 88, -129, -32, 155, 10, -133, 48, 152, -68, -112, 130, 111, -131, -59, 149, 28, -160, 5, 160, -60, -131, 90, 108, -124, -92, 145, 50, -158, -15, 148, -40, -158, 73, 138, -110, -105, 145, 78, -138, -19, 169, -1, -142, 62, 147, -80, -109, 133, 101, -126, -43, 168, 26, -143, 41, 154, -59, -132, 93, 95, -130, -84, 139, 28, -162, -7, 148, -47, -149, 82, 121, -117, -94, 127, 48, -150, -18, 170, -25, -142, 64, 144, -85, -99, 138, 97, -123, -31, 178, 25, -141, 47, 162, -67, -123, 117, 103, -130]
4549a30O8K08j24j95J86J28k01q1K25K1k27K6K22q1k03J51J62j90j24K30N0k30
4571a09J1K31n8k20J22J91j64j50K19P5k21k7K24j8k49J01K01j40j79J95J18k17
4593f4p6K40jk36N1K33j24j97J76J52k10j00K32M9k48K2K41q6j97J30J64j74j19
4616a42K25P0k32k0K37n2k20J02K05j48j68J90J15k32l5K21j2k37O7K23j44j65
4638a52J72J37k23p8K40J8k46M4K32j11j92J61J56j98j03K14O7k41OK38o5k06
4660a30J21J82j73j47K33O5k20l1K22l4k15R6J96j49j64J82J15k15n8K28mk24
4682a24N2K14j20j74J63J31j95r3K28K9k29M0K26j01k03J50J72j94j14K17N3k16
4704h8MK19m9k18J25J72j56j46J96R5k25l7K28l4k24Q2K04j30j72J82J10j96p5
$$ y = [-130, -62, 146, 22, -173, 13, 141, -60, -141, 84, 105, -122, -96, 126, 45, -158, -7, 155, -35, -159, 71, 121, -109, -98, 133, 75, -145, -23, 168, 4, -146, 73, 148, -73, -100, 124, 106, -143, -42, 159, 19, -160, 35, 153, -64, -140, 100, 99, -137, -86, 147, 23, -174, 2, 154, -56, -156, 76, 125, -123, -101, 140, 54, -143, -13, 151, -23, -142, 83, 153, -79, -99, 138, 86, -134, -32, 173, 25, -143, 47, 162, -70, -105, 116, 104, -133, -66, 157, 13, -152, 20, 157, -66, -144, 96, 114, -132, -88, 144, 33, -159, 2, 158, -40, -143, 71, 138, -103, -97, 141, 76, -130, -9, 173, 0, -147, 86, 151, -69, -100, 122, 88, -127, -31, 165, 16, -148, 34, 149, -66, -124, 104, 100, -124, -72, 142, 22, -152, 11, 142, -53, -146, 82, 111, -118, -78, 148, 47, -156, -6, 166, -28, -142, 75, 128, -88, -84, 135, 86, -132, -7, 165, 9, -137, 59, 154, -71, -108, 120, 86, -138, -56, 148, 18, -154, 28, 138, -58, -133]
4727a33K12J7k33O3K13j05j80J47J47j87r4K19M2k18KK23p2j98J25J66j56j23
4749a23J87P3k10l0K29l3k17Q8J89j40j49J72J08k22m2K19j2k16O2K04j16j70
4771a49J60J17j93o6K15K4k15L5K02r0j74J30J60j86r3K08M4k09pK32o8k00J13
4794a0J57j48j21J73Q4k07l2K09l8j91P1J86j33j45J63J12j92p0K23Lk23N6K10
4817A37j11j64J50J35j93q0K07M1k09J3K11p0j87J20J54j64j19J99N7j96k2K08
4839A17l7j98Q7J67j31j43J77Q3j91m5K04j0k02P5J80j21j51J66J00j90o3K15
4861H9J1j98L7K02j03j70J36J46j71j01J99M7k07J0J94n1j89J02J63j43j33J70
4883D0Q7j89m0J87kk05P3J72j24j37J57J02j71o0J91Rk05N5J77q2j63J31J35j76
$$ y = [-133, 79, 96, -137, -74, 139, 34, -146, 1, 148, -39, -133, 86, 128, -90, -88, 135, 63, -135, -10, 156, 0, -123, 64, 137, -73, -103, 126, 93, -124, -36, 153, 13, -136, 36, 144, -78, -120, 99, 87, -129, -67, 137, 21, -149, 11, 128, -65, -131, 84, 108, -107, -72, 130, 40, -134, -4, 156, -30, -123, 85, 129, -80, -87, 145, 77, -123, -10, 147, -1, -122, 51, 135, -72, -104, 105, 67, -124, -53, 133, 0, -145, 18, 130, -62, -132, 91, 94, -129, -73, 137, 26, -138, 12, 147, -46, -126, 81, 122, -87, -74, 137, 67, -120, 0, 154, -10, -129, 70, 127, -69, -91, 117, 80, -118, -31, 136, 5, -138, 39, 122, -69, -114, 90, 80, -122, -47, 133, 12, -139, 27, 127, -63, -126, 89, 100, -98, -61, 141, 38, -132, 4, 150, -21, -122, 77, 124, -83, -73, 121, 70, -119, -17, 146, 3, -130, 40, 127, -62, -102, 85, 83, -122, -49, 123, -1, -138, 19, 121, -50, -110, 81, 90, -115, -60, 117, 35, -128, 3, 138, -38]
4907c8p7J95L2k08L2J88o9j75J18J43j53j02J78O0j91rJ88m2j83R5J38j19j34
4930a33J62R4j98l0J94j4j91N9J66q3j50J41J01j62p2J83J7j83L8J85p4j72J32
4953A0J19j39r9J80M1j94J6J83o1j64R6J46j34j15J59P2j81k5J84m1j63O5J67
4976A22j23j37J52R4j80m0J82J3j99O3J70r2j53J29J19j57p4J93L0j93K1J84o6
4999E8j65J05J39j46r9J72N3j87j2J93l9j91R4J53j37j16J59P7j76m4K03k4j93
5022a23P8J62j12j38J47J13j80n7J87Qj84N7J65p6j64J27J36j63r3J89L1j88J3
5045f5J97p5j76J08J35j30j17J76O1j85j8J94m9j77R1J47j26j22J59Q7j80m9K03
5068H9j6j83O1J77j13j34J51J03j75p0K04Rj85L1J90q5j71J36J26j59r5J79M0
$$ y = [-38, -115, 80, 112, -96, -64, 124, 55, -120, -2, 141, -12, -114, 64, 124, -67, -76, 112, 70, -113, -18, 120, 1, -133, 29, 123, -75, -105, 89, 75, -116, -57, 109, 26, -124, 17, 118, -44, -116, 67, 84, -99, -61, 124, 50, -122, 10, 129, -10, -109, 71, 112, -82, -66, 117, 56, -108, -12, 134, 0, -115, 44, 116, -65, -90, 94, 53, -110, -45, 122, -1, -138, 14, 108, -72, -112, 70, 83, -116, -53, 117, 25, -128, 1, 120, -37, -111, 82, 112, -81, -60, 124, 58, -107, -2, 137, -9, -108, 64, 117, -70, -82, 111, 72, -119, -25, 128, -9, -125, 34, 111, -65, -109, 94, 70, -123, -45, 117, 5, -133, 14, 127, -53, -110, 77, 85, -99, -42, 123, 47, -117, 10, 146, -17, -110, 79, 110, -78, -65, 132, 57, -119, -11, 124, -6, -123, 53, 114, -71, -89, 105, 56, -121, -30, 117, -9, -131, 28, 115, -65, -114, 89, 73, -110, -49, 128, 15, -119, 32, 135, -40, -110, 94, 103, -82, -51, 139, 54, -117, 19, 145, -14, -109, 70, 110]
5091A10j89mJ92m9j88J13J44j51j03J67O9k00k1J98k4j97Q4J71j24j26J56R8j93
5114f7l5J91Nj98O4J79j08j63J59J09j72p3J93K5k02L6J83p8j60J14J38j65r7
5137a22J79N9k09J2J86m6j89J00J59j45j20J72P4j97j9K00k5j91Q8J58j12j34
5159a22J52R5j75n4J94Pj95N5J79r3j52J34J19j71o9J69L4k01K9J87q4j61J11
5182a2J31j46p7J61M8j88nJ91o2j65J06J42j32j17J76O0j84qJ84l7j66O4J63j04
5206B3j32J54P5j61n1J85jj87N8J70r9j45J17J17j67p1J87J6j84K7J75p2j59J04
5230b1J32j45r4J76N4j97OJ84m4j64R3J44j24j06J62O2j75l2J88k9j57O3J49j13
5254A2j28J58Q8j68n2J76mj78M2J70r6j41J19J12j44r6J86J8j70J8J82p2j52J13
$$ y = [110, -79, -83, 109, 60, -128, -15, 129, -22, -125, 42, 111, -89, -110, 88, 64, -133, -49, 122, -2, -128, 28, 126, -67, -102, 89, 94, -104, -40, 139, 31, -132, 27, 136, -36, -109, 84, 109, -93, -57, 126, 48, -112, 2, 140, -25, -122, 57, 116, -93, -81, 105, 59, -130, -30, 129, -16, -136, 36, 110, -87, -106, 94, 69, -122, -34, 124, 12, -122, 30, 125, -50, -104, 90, 97, -98, -43, 136, 43, -109, 25, 144, -27, -96, 73, 107, -94, -65, 122, 38, -123, -12, 119, -27, -104, 57, 105, -83, -88, 103, 41, -124, -18, 124, -8, -125, 51, 111, -73, -81, 103, 66, -100, -36, 127, 23, -109, 45, 120, -41, -92, 93, 92, -95, -37, 133, 34, -111, 6, 123, -44, -115, 72, 88, -96, -69, 106, 34, -125, -21, 111, -34, -128, 48, 102, -95, -89, 95, 51, -113, -20, 124, 0, -106, 56, 118, -57, -89, 99, 70, -87, -24, 125, 12, -116, 42, 130, -38, -90, 86, 82, -96, -54, 116, 20, -121, -2, 110, -34, -130, 56, 74, -96, -78, 104, 32, -120, -7]
5278gJ17j28r7J62N4j70qJ82n0j63R8J29j21r7J59N9j82rJ75k3j64O0J49j20j19
5303a14J35P8j59l8J84rj80N9J44r6j22J15J11j49p4J75J4j61J9J69o2j48J01
5326hJ21j27q2J53M2j61j0J78l6j51O3J38j20r6J41O5j61k1J64k2j68O8J24r1
5350Cj14J30P2j49m6J65Nj66M4J47p3j23J04J06j42o0J60J7j67M0J45m9j48R9
5374@J24j30r8J57N0j60%J46k8j52O3J42j17q9J31O3j56l8J46qj40N4J38j02j21
5399a25J22R8j42m7J48%j43M5J43q8j17J08J00j22o1J51J4j42J7J43n5j24P5J13
5423A11j17q6J37M2j45mJ42l4j39O9J14r3j02J19O9j35l5J51oj48M2J43p9j20
5447a04J12R3j38m6J33K6j46J9J55o7j23R5R7j23o0J40L2j54MJ51l7j55R6R7j08
$$ y = [-7, 110, -18, -115, 47, 101, -69, -77, 105, 55, -108, -10, 119, -2, -99, 60, 119, -63, -72, 103, 80, -84, -24, 125, 5, -114, 21, 99, -60, -98, 86, 77, -103, -44, 100, 4, -118, -3, 108, -41, -115, 60, 74, -87, -68, 101, 39, -109, -8, 113, -14, -96, 57, 99, -62, -72, 106, 70, -81, -18, 120, 0, -96, 45, 110, -51, -72, 92, 70, -98, -30, 94, 3, -111, 19, 91, -58, -104, 61, 66, -100, -56, 91, 18, -105, -1, 105, -37, -97, 63, 80, -87, -47, 98, 49, -99, 0, 124, -6, -104, 53, 103, -57, -57, 89, 61, -91, -28, 114, -3, -92, 39, 102, -54, -92, 54, 46, -94, -40, 98, -4, -125, -3, 95, -47, -94, 54, 54, -89, -44, 99, 11, -106, 2, 102, -20, -81, 70, 84, -58, -41, 102, 47, -77, -2, 111, -6, -92, 45, 87, -58, -62, 80, 46, -93, -24, 90, -3, -105, 14, 83, -52, -87, 64, 58, -90, -48, 95, 16, -104, 8, 101, -37, -83, 50, 76, -70, -51, 104, 37, -86, 9, 106, -17, -77, 63, 95, -59, -55, 96, 59, -96, 0, 97, -11]
5472a1p9J37L4j43j8J53k2j42O4J14r5r8J18P5j33m8J61j0j43L5J45o7j17J00
5496A0Q8j30n4J50J8j52K3J41m5j25P7J05j19p3J34L4j51J1J47m6j44P5J23j11
5520a4q2J10P5j54j3J44k3j41N7J21p5j07J22P3j37l3J47J1j52K5J46o6j16R7
5544A5J00j31o8J53K0j44J5J42o0j33R4J09j25q3J47L6j42j0J37j6j59P5J20j09
5568a7q6J21O7j44j7J46j7j48O2J38q2j22J24P1j32k8J41%j35K7J46q1j23J06
5592A7Q7j28o1J53Oj44J8J35m7j29Q8R7j11q4J35M4j68J3J52m0j32O8J22j05q0
5617i4J21N8j39j8J59l2j37O4J25r1r7J18O5j32l6J45jj52L5J31p1j16J00R6j33
5642c2n5J40J8j54J8J58p5j26R1J02j20o4J53K4j56RJ54m5j29P9J21j18p9J36
$$ y = [-11, -90, 47, 81, -62, -80, 73, 51, -91, -27, 87, -8, -106, 12, 87, -46, -94, 67, 57, -86, -51, 94, 27, -90, 10, 98, -32, -86, 64, 82, -70, -47, 94, 49, -76, 1, 106, -13, -86, 48, 82, -69, -58, 89, 43, -101, -26, 97, -14, -96, 14, 89, -65, -78, 66, 43, -98, -41, 80, 5, -102, 20, 93, -44, -77, 70, 81, -71, -46, 100, 34, -82, 15, 115, -16, -84, 69, 89, -55, -40, 102, 42, -91, 3, 112, -13, -96, 51, 87, -55, -65, 72, 56, -103, -28, 92, -17, -103, 18, 85, -59, -76, 70, 53, -95, -33, 105, 23, -99, 25, 96, -36, -64, 77, 77, -58, -31, 115, 34, -89, 17, 104, -24, -85, 68, 74, -70, -52, 83, 36, -93, -5, 92, -19, -103, 32, 76, -92, -79, 73, 33, -99, -31, 91, -14, -94, 27, 85, -54, -72, 87, 55, -82, -18, 107, 16, -81, 37, 102, -30, -66, 79, 78, -74, -39, 92, 21, -95, 5, 101, -32, -87, 53, 71, -83, -65, 93, 18, -108, -17, 85, -35, -99, 54, 78, -78, -69, 85, 40, -89, -10, 111, -7, -86, 50]
5666E0M7j59RJ36k3j41O0J27q9r5J21N9j41l4J52j0j49M1J40r4j09J02R1j38n3
5691a00J54lj27J0J50n5j30R1J05j12p1J42K7j38%J53n7j22Q5J15j08q6J32M0
5715I5j44kJ43l7j31N5J20r8r5J28N4j35m0J58k5j31N1J23r1r6J01Q3j22n0J36
5740E0J5j45L1J48o5j21Q8J11j24o7J41K9j47KJ55m4j42Q1J23j24r1J47M3j45
5764e1j0J36k4j42O6J30j08r5J19O5j46k0J41nj44M1J31q4j08J18P0j29l4J51
5788F8Rj32K7J36p6j20J03Q7j17o4J34L6j50QJ49n4j33Q0J07j13p2J20O0j51o
5813f4J32l2j32O9J05q2j10J37N9j29l1J40j8j21M0J19p7q1J03P9j36l8J45qj36
5838f7M1J30p4r9Q8Q5j20o0J34K2j27oJ39n1j30Q9Q2j02p4J28M3j30j4J44k4j32
$$ y = [50, 97, -62, -53, 83, 60, -81, -21, 106, 17, -78, 43, 102, -39, -73, 79, 69, -80, -39, 101, 7, -102, 0, 91, -47, -100, 54, 51, -76, -66, 84, 29, -101, -10, 95, -17, -88, 54, 81, -57, -57, 96, 39, -83, 2, 117, 9, -77, 55, 95, -49, -51, 92, 55, -76, -21, 99, 1, -94, 34, 88, -47, -87, 71, 46, -85, -34, 89, -2, -98, 3, 86, -36, -86, 50, 65, -80, -49, 99, 34, -87, 1, 112, -12, -79, 62, 91, -56, -54, 101, 57, -85, -4, 119, -5, -96, 51, 94, -51, -61, 75, 51, -91, -25, 105, -3, -98, 21, 86, -60, -80, 61, 56, -88, -47, 84, 0, -108, 10, 80, -49, -83, 68, 77, -55, -28, 108, 32, -88, 15, 102, -15, -79, 55, 91, -59, -51, 98, 44, -89, -9, 98, -15, -87, 33, 93, -58, -64, 68, 36, -96, -27, 78, -4, -114, 23, 82, -47, -78, 62, 44, -77, -37, 82, 5, -76, 27, 106, -30, -68, 77, 69, -67, -26, 104, 30, -69, 19, 104, -16, -76, 58, 80, -47, -53, 86, 35, -95, -6, 76, -26, -100, 28, 71, -59, -73, 71, 47, -85]
5864h5N5J10q4q3J07N6j22j9J39j8j38N4J15p0j01R9R0j19m7J26Nj19J8J19o2
5889B6r9Q1Q1j09o6J29K2j26KJ22m6j07P9Q4r5o7J12M4j15qJ28k9j24N8J12p2
5915A7r0J00O3j16k6J18Pj24L0J09n4j01Q8P2j24k9J12J0j14LJ26n5j05O5Q9r1
5941b0o8J18L3j25lJ32k8j13N5R5o6r9J19M5j24j1J35l1j30Q2J00o7j08J02O3
5966H6j05m0J39k2j23L7J01m7j08Q0R3j03o3J16J6j10qJ25m1j25Q5R1q8o7R3P6
5992H8j32jJ55p6j17N6J15q2q8Q7L3p0k8J30J1j17L2O1n4m0O7O1j01n2J25K4k45
6019a58J03J39j01n6P9R2j63JR4mj8q0J27k4o5O0O2j09q5J63J3q7o9J45l5p6J6
6046c6J45j20o9J00R5j56mQ9J0j26K9J40m6q4L9ko4P6N9j5j57P3J36j32l3N5N3
$$ y = [-85, -30, 80, -4, -87, 20, 76, -46, -65, 74, 56, -82, -28, 87, 17, -84, 15, 105, -14, -61, 65, 70, -49, -31, 88, 26, -73, 8, 89, -20, -86, 43, 65, -61, -59, 63, 17, -90, -11, 73, -22, -89, 23, 67, -48, -56, 72, 43, -81, -23, 89, 17, -73, 27, 90, -26, -52, 66, 73, -51, -21, 88, 34, -67, 21, 93, -31, -60, 52, 62, -52, -49, 77, 22, -83, -18, 71, -20, -88, 30, 63, -62, -65, 67, 39, -74, -19, 76, 10, -89, 30, 75, -49, -60, 75, 44, -86, -4, 96, 29, -79, 23, 86, -19, -59, 80, 58, -65, -28, 73, 26, -82, -2, 91, -12, -75, 41, 57, -53, -61, 64, 23, -102, -17, 74, -14, -81, 12, 88, -44, -45, 110, 34, -83, -27, 88, 6, -82, 5, 38, -32, -60, 70, 81, -36, -4, 57, 3, -37, 30, 91, -10, -62, 63, 87, -158, -55, 84, -17, -73, 6, 98, -65, -64, 30, 26, 8, -72, 55, 31, -34, 26, 88, -21, -106, 57, 70, -17, -86, 59, 24, -52, -36, 109, -11, -80, 20, 115, -41, -45, 44, 54, -72, -43, 97, 51, -33, 6, 4, -60, 16, 75, 60, -97, -24, 112, -20, -53, 2, 55]
6073E5j38oJ35J6r3m5J56p8o0M3J41k28M3J24L2j04o9J57l2r0M7J09p9j18J01
6098A9O8j02m4J03J0j29L2J15n8p9N9R7r7p5J16L4j20j2J33k7j16P4R1q8p3R6
6124B7N0j14nJ14j1j37O5R0m9r0R5N6j12l6J24Lj46M3J05m5j11Q7P2j14m8J24
6150C7J3j19RJ20l5j19R3N9p9o9J35J4j07jJ04j9j09O1J00q6q1J10O8j42rJ23
6176G1oj30M7J09q3q3Q9P4j18m1J18Oj39K6J38o7j15J01Q2j04o6J25K3j18J6J13
6202F8l0j19P8R7r8o7J04O5j66QJ51l0j33N4J19n3j07O8R0j10m3J38j8j24OJ29
6228G7n6j03J21M0j22m8J47k2j16N2P2m6j01R1J06j19q1J58J1j40K1J68p0j17
6252g7P4R6q9p0J10L4j25mJ37l5j25N9J04q7q8J17N3j27k9J37j4j36M6J22q2r6
$$ y = [55, -83, -89, 46, 62, -31, -76, 80, 2, -58, -15, 126, -102, -59, 65, 97, -7, -76, 81, 49, -41, 6, 115, 36, -82, 19, 87, -15, -59, 44, 54, -75, -43, 72, 14, -65, -6, 91, -6, -81, 35, 69, -51, -63, 70, 43, -73, 1, 92, 4, -69, 27, 77, -37, -42, 72, 61, -76, -11, 79, 30, -60, 35, 91, -21, -57, 67, 70, -76, -33, 72, 27, -84, 3, 75, -39, -87, 37, 50, -69, -60, 60, 25, -94, -1, 58, -21, -90, 45, 59, -48, -49, 55, 36, -73, -12, 88, 2, -79, 31, 99, -43, -52, 71, 65, -65, -18, 91, 8, -75, 14, 88, -30, -71, 47, 53, -86, -60, 78, 11, -104, -3, 79, -25, -91, 34, 57, -61, -45, 68, 38, -81, -3, 94, -4, -71, 33, 98, -68, -60, 91, 61, -72, -18, 101, 48, -59, 9, 99, -11, -54, 84, 66, -58, -52, 77, 21, -82, 39, 79, -43, -91, 56, 34, -82, -30, 42, -4, -105, -14, 92, -27, -108, 50, 61, -79, -58, 110, 40, -77, -3, 93, 4, -66, 44, 78, -47, -51, 86, 51, -74, -15, 89, 2, -86, 31, 84, -43, -72, 65, 51, -85, -39, 83, 1, -95]
6278i5R8P7j13n0J40j1j22K9J27n2j20R6R4j24m9J23K9j24OJ35m6j26P5J07r4
6303A0q5J18N0j42oJ27k9j32N6J26j01q7J13N9j34k2J37j9j19M3J02o0q8Q9P1
6328G7j04m0J18J8j29J8J15m7j12R3P8j04m1J06K8j14jJ22m1j19O7P8p4o7J06
6353C1L6j21%R9Pj42M1J03o5r2J08P1j28j5J07%j13K4J13n3p9P6Q1j05n2J12K1
6380F5j16J8J27o7j03P8Q4q2p9J25K7j24NJ07l2j18Q2Q3q9q2J09N8j36j3J10K9
6406F6j43M1J06q8o2R5N4r7m0J13K7j44L9J08n2q9R5Q0j41j7J02K5j23%J08l0
6432C3r7N0Q7r2n3Q8N7j31JJ20l7j14N2J12q5o6R9M5j14j6R7%j03N2P8n5p5Q4
6460A7M8q8l9R3M4j46L8J08m6p3O1O9r1o0R1L0j11NJ15l2j01M4R1r3n3R5N5j24
$$ y = [-95, 3, 80, -33, -83, 57, 46, -76, -47, 80, 28, -92, 4, 98, -26, -75, 48, 77, -47, -41, 94, 48, -78, -3, 104, 10, -75, 43, 93, -49, -55, 72, 43, -89, -33, 93, -8, -95, 18, 77, -57, -79, 58, 39, -80, -37, 65, 5, -83, 6, 77, -27, -67, 51, 69, -60, -42, 73, 26, -86, 7, 85, -19, -60, 46, 74, -40, -41, 81, 40, -79, -12, 66, -8, -75, 31, 67, -54, -54, 45, 52, -90, -49, 54, -11, -103, 5, 76, -52, -67, 40, 40, -73, -49, 64, 11, -68, 8, 89, -16, -68, 44, 65, -51, -33, 94, 27, -76, 2, 86, 4, -75, 50, 77, -47, -42, 65, 33, -85, -3, 80, -9, -91, 18, 76, -60, -73, 37, 66, -77, -36, 70, -18, -80, 15, 69, -28, -68, 45, 72, -72, -33, 75, 23, -66, 29, 109, -32, -49, 53, 78, -45, -45, 63, 33, -64, -14, 73, -19, -72, 16, 73, -58, -57, 63, 26, -88, -36, 76, -9, -75, 24, 69, -45, -61, 36, 36, -67, -15, 63, 8, -67, 17, 65, -23, -62, 31, 75, -71, -33, 75, 29, -44, 17, 86, -5, -65, 26, 56, -55, -50, 65, 33, -68, -24, 67, -26, -79, 16, 71, -53]
6488e3j1J18l6q5M8R1o6p2Q7M5r1n0J33j2r5QJ33n5r4L6J19j09o5J46jj24K7J01
6516G3m9q5N0R4j22l5J09M4j15l5J06nj10M2P6o7m5P4O6j12j9J02Oj15K2J22n0
6543B2r1N5O5p5l5J56m8j03K0J00m5m6M1M3m6n8R9Jj06J9Q9k4j24P1J05r4p2O8
6571a3P5r2k5R6k0p8M0Q6q9o2J03N2r0m3J07J8j30L3J16p1r7J04O4r0n0J12jr5
6599d0J4J10p2p4P4N9r0n4J14K6j27J0J21j5j56J01R2j17m8Q1N8j20mJ03Jj08
6625f1L8R7l6r6J07M2j25n3J33N3j48M3J17n5j37J09Q6j46l1J06J8j04nJ11p2
6650in1P2M9p7o0R1M2r5l0J27k6j07M6R8q1p1J11L7j03qJ11lj24M8J04p5p8R8
6678C6M9j04k4J01Mj14J8J11n2r0O8P9j12m2R5K5j07j0J31m4j05P0R6j01m6R8
$$ y = [-53, -64, 54, 18, -67, -19, 72, 6, -66, 21, 66, -25, -75, 58, 46, -49, -41, 92, 37, -57, -21, 98, -11, -76, 70, 69, -55, -28, 73, 24, -61, -11, 83, -39, -74, 35, 79, -36, -71, 35, 30, -80, -38, 38, -29, -74, 0, 66, -46, -65, 37, 43, -72, -50, 72, 22, -69, -14, 51, -24, -59, 97, 49, -54, -34, 66, 21, -25, 16, 59, 13, -45, 54, 55, -51, -32, 57, 33, -91, -20, 85, -9, -81, -13, 62, -30, -55, 41, 21, -57, -17, 69, -20, -82, 21, 73, -17, -60, 47, 65, -65, -32, 84, 13, -84, 20, 84, -6, -56, 56, 55, -40, -26, 84, 12, -62, 12, 71, -19, -73, 41, 67, -60, -50, 71, 56, -100, 1, 93, -24, -72, 9, 67, -53, -57, 46, 47, -61, -23, 74, 38, -58, 49, 91, -34, -87, 46, 99, -49, -6, 111, 56, -81, 28, 114, -32, -63, 43, 61, -43, -48, 63, -9, -60, 12, 61, -16, -76, 15, 57, -38, -68, 59, 33, -74, -28, 70, -11, -82, 29, 66, -37, -45, 66, 63, -61, -13, 91, 16, -62, 36, 85, -19, -43, 58, 62, -52, -34, 77, 25, -65, 3, 82, -30, -72, 23, 48, -59, -69, 62, 18, -87, -17, 79, -22, -68, 30]
6704C0L2j12pJ16k4r4M1J02p8o7R4L2r5j7J11j7j16L2R3l9r3Q0P9j25pJ02Lj61
6732a05O4J06o3q3jJ42j05k3J02K2j98J08P1j7q2N5J21j43l3J07N4j75J9J35j0
6757F8j04jJ43j02o7J08L6j11nJ08k1j24M9R3l9r1O8N2j02j0J13k9j23N9R9o2
6783Eq3Q8M4p3m2R9Qj00K9R3m1p1N1P9j01m6J09J1r6JJ11l7r8O6P1q1o1R8L3j06
6813d0j7J11j3j05L9J05p4q4Q1O1j11k1J10oj04K1J17o0p9O0P5q6m1J09J6r6K
6840c0J04m8q8O6P1p7n0R6J8j02LR4k8r1N7P8p2o9Q3M3j06j0R7k7q1M3Q7p0o9
6869g8Q9M6j00j5J04qr0K6J06p1p7P7P5r8l0J02Nj06K6R1m5p6O9N2q6m1P8L4j04
6898d5J3R1l7r2O7P3q6m8R0J3q6j4J13l2r0N6P4o3o2Q5L9q2j9J04j8r5M1Q9n6
$$ y = [30, 62, -50, -57, 59, 35, -59, -18, 84, 6, -61, 33, 65, -30, -47, 64, 47, -69, -37, 56, 17, -76, 4, 83, -42, -49, 53, 56, -105, -41, 65, 2, -81, -82, 60, -45, -68, 34, 56, -142, -34, 37, 20, -62, -7, 114, -29, -62, 45, 99, -76, -57, 78, 68, -36, -37, 106, 4, -63, 45, 81, -30, -35, 73, 52, -72, -23, 70, 31, -60, 8, 60, -42, -52, 61, 32, -91, -32, 67, 5, -78, 10, 54, -19, -61, 38, 46, -54, -25, 68, 27, -44, 7, 86, -15, -61, 48, 59, -37, -36, 75, 38, -60, 6, 77, -4, -65, 33, 66, -40, -57, 54, 41, -64, -25, 80, 6, -78, 3, 64, -47, -68, 42, 36, -68, -47, 70, 10, -69, -9, 66, -20, -61, 48, 64, -32, -30, 74, 26, -62, 4, 75, -2, -52, 44, 62, -40, -37, 57, 29, -62, -5, 73, 1, -68, 15, 58, -48, -58, 39, 12, -69, -26, 61, -9, -78, 11, 57, -43, -58, 46, 38, -52, -26, 80, 9, -68, 9, 84, -14, -44, 58, 63, -43, -17, 74, 29, -47, 22, 74, -12, -53, 25, 59, -45, -32, 59, 22, -70, -3, 70, -16, -64, 26, 39, -47, -61, 52, 20, -70, -14, 60, -3, -65, 20, 59, -23, -42, 62, 44, -51, -10, 79, 23]
6927B3q9R5M6r0j4P8J3j12K8Q3l7p8N8P0r5m1R1K5j02J3Q8l8q9N4P4p1m5R4K0
6956E2r3MR7l3p3L6P7o9m9Q8K9r4nQ2rq8M2Q0n4o5O2N9r1k4Q1Kr7J7R2m1o7M8
6988dO2p7m9R0K2r0J2R1l3q6N5O3o6m3Q6J9p6nQ7j9q2L9P2n7n9Q4L8r8j3R4j4
7019D3q1L4N9m0p7Q1L2o9k7P1Mq2K3P2l2q1O4N0p0m5J01Op8J1Q3k9p7N5O1o6m0
7050d4R6J3r0PP0j4p2L1O6m8o0P3K9p5j5P8j4p5K7O5m5o3O6M1p6k2Q4Jp7J7Q3
7081E7m3o1M8N5p2k6Q3Pp5%R0l6o3N4M8o9k4O8K4r7%Q8k2q5M7O5o2m7O6L6p9k5
7113e0R0j8o9K5P5m8o0N5N3p6j0O9j5o7K1R2m6o1N3O4q5l1P5K1p9OP8l2o0L5O2
7144F7n5n9P9J8p8KQ2l2p2L4O6n9n1O9K9q2mR6k0q0M0O5n4m4N9M5q2k1R1qq1K5
$$ y = [23, -66, 29, 75, -15, -29, 49, 62, -50, -22, 61, 24, -54, 4, 74, -21, -62, 29, 54, -48, -35, 53, 15, -74, -20, 54, -17, -62, 32, 52, -41, -37, 60, 27, -46, -10, 67, -2, -51, 37, 66, -28, -33, 49, 40, -48, -6, 74, 20, -45, 17, 76, -15, -39, 42, 44, -53, -36, 56, 15, -52, -4, 58, -19, -68, 22, 44, -46, -34, 57, 24, -62, -7, 56, -10, -53, 33, 52, -24, -29, 58, 39, -43, -4, 68, 11, -48, 36, 74, -24, -37, 57, 43, -38, -4, 55, 15, -62, 19, 51, -18, -45, 26, 30, -52, -29, 43, 11, -70, -6, 44, -26, -71, 30, 36, -42, -31, 52, 23, -54, 1, 62, -4, -44, 52, 65, -25, -18, 52, 38, -34, -3, 63, 15, -45, 28, 57, -18, -33, 45, 31, -44, -17, 48, 3, -60, 6, 47, -29, -51, 33, 34, -43, -26, 57, 14, -47, 1, 56, -16, -42, 41, 48, -27, -27, 63, 27, -36, 18, 66, -3, -27, 41, 65, -32, -32, 56, 34, -51, -4, 61, -1, -48, 18, 54, -25, -50, 40, 22, -47, -22, 53, 5, -55, 0, 53, -23, -33, 36, 21, -46, -25, 67, 21, -40, 13, 77, -8, -39, 36, 57, -22, -16, 62, 30, -30, 5, 67, 12, -47, 32, 50, -28, -26, 56, 24, -48, -14, 52, -7, -58, 11, 40, -42, -46, 50, 30, -50, -10, 55, 1, -43, 16, 61, -21, -42, 49, 41, -40, -15]
7176a5Q1l3p6O1N0p3m2R4Mq0RQ5l3p9N2M7n8m6O9K3p7%Q3l7p2M1O6o1l7P3L7q3
7208b7k7R2%r6N1O9o4m9O6M9q4j3R0%q7J8Q4n0p0O3N6q3l8Q0J6r0J3Q8m5o4N3
7239AN3o9l5P4Rq2J1Q7l2o6L4Q2p3m5P8K2q0rQ3pp2L5P4o9n1P9L1q2j7R4nr8K6
7272a9Q5m7p3P0M3q4j5P2J2r1K7O2l3p2N6N8o3m4Q7J4q1J7P5l1p1L9O5n1n3P3
7302B7N0r7j2J00l5p4M5O8o7n6Q2L7q9j6Q4j3r0M1O9n7n9P7L7p9j5Q1j3p6K7P5
7332E2m3o7O8M9p2l3Q9J5r6OR2l4p3N3N9p0m0Q0Qo8OP6l0p7M5N1n5n0Q5K3q7p
7364d5R2k6p8L4P6n0n4O2L9q2k0Q2Mq3L4P3m6o5O7O1p9l4Q1Oq9L4O8l5p3N6M8
7395E8o9l1Q1Lq8J6Q2l1q7O0N9p0m4P3K3p3NP0k7p0L6O9m7o1P9L1q0kQ8k0p2L5
$$ y = [-15, 66, 33, -43, 18, 68, -5, -47, 47, 51, -29, -20, 65, 32, -47, 5, 52, -6, -52, 17, 40, -37, -37, 46, 9, -63, -22, 44, -17, -54, 19, 56, -27, -54, 38, 38, -58, -7, 62, -2, -51, 15, 64, -20, -33, 57, 57, -30, -12, 72, 22, -48, 15, 71, -12, -50, 30, 46, -44, -31, 57, 12, -52, 1, 54, -15, -50, 24, 33, -49, -38, 49, 17, -49, -15, 67, -6, -51, 27, 49, -31, -40, 43, 36, -36, -1, 73, 4, -47, 32, 63, -19, -36, 58, 53, -45, -19, 66, 19, -54, 16, 59, -25, -40, 32, 44, -47, -20, 42, 9, -63, -7, 51, -12, -56, 31, 45, -36, -19, 56, 25, -46, -7, 58, 7, -46, 27, 77, -20, -32, 68, 33, -41, 4, 72, 5, -51, 31, 68, -21, -37, 47, 34, -56, -15, 54, -3, -62, 15, 52, -27, -42, 39, 26, -50, -23, 52, 9, -58, 10, 59, -13, -46, 43, 58, -38, -32, 60, 26, -47, 6, 65, -5, -45, 35, 43, -25, -19, 57, 27, -50, -5, 46, -9, -59, 26, 49, -38, -45, 47, 21, -57, -23, 53, 3, -51, 11, 50, -32, -52, 30, 34, -49, -15, 58, 12, -53, 14, 75, -4, -38, 43, 49, -40, -6, 62, 27, -46, 10, 58, -11, -42, 39, 42, -46, -30, 52, 21, -66, -6, 53, -17, -61, 12, 35, -38, -33, 37, 10, -60, -24, 45, -2, -63, 16, 47, -33, -35, 53, 33, -39, -4]
7427dO6n7n3P0M3q4k1Q9nq1K5O3m2o3N9M5p4l5R6Kr8K4Q5m6p2O9M9o7m5R2Qp7
7459c9kQ9l1p4N3N9n7n1Q7J8p5mQ9k4p5L2O3o5m1O6L3p1j8Q9k9o0J9O4m7n1N3
7490@N0p6k4P1Op1K1P9m9o8O7M6p0l2P9J8q9K0P1k3o1M7N6o5m0O5J6o6KP9k3q5
7522d9M5N9o6k9O1J7p9J5O8j8p3L0N6m4n0O5L4p6oP2np2K2O7l8n8N7M6p0j8Q6
7553D9j1o5J5O9l1p1N8M5o4k5N8J1o7LP4l3n2L6M8n3m8Q6jo8oQ2l3o1L8N7m9l2
7585d1N5K7o4j3Q1ko2j2P3mp2L9N5l0n4P1j2q2K5M7mp4O5Pm8nP4J2r2J5R3p4k8
7618c4M2K7m5j02J36L4q9oP3j1n6j9P1j8k2M8jo1qQ7mo2J4M2r4OP9M5q6m8J19
7649E7Mj21Q4O2p2q3N9L7k2n8J06m1n5l1J10j8j49J43O7p2l6P4j3r3O7l2Q9p9
$$ y = [-4, 62, 5, -48, 22, 65, -19, -40, 49, 44, -37, -12, 51, 9, -54, 5, 50, -24, -59, 37, 39, -59, -35, 50, 4, -68, 1, 50, -17, -62, 30, 38, -39, -41, 48, 17, -57, -4, 55, -2, -53, 34, 52, -23, -27, 62, 38, -37, -5, 58, -7, -48, 18, 51, -20, -38, 51, 22, -38, -19, 45, -2, -53, 0, 50, -26, -50, 21, 27, -44, -23, 56, 7, -61, 6, 52, -18, -50, 29, 47, -42, -22, 49, 26, -35, 12, 68, 3, -37, 28, 44, -22, -20, 59, 36, -49, -4, 55, -11, -40, 21, 38, -41, -26, 42, 24, -49, -19, 37, -7, -57, 8, 42, -34, -40, 32, 27, -45, -23, 44, 6, -52, 5, 51, -19, -37, 49, 38, -27, -12, 57, 26, -45, 13, 58, -6, -31, 27, 38, -29, -26, 48, 15, -37, -1, 47, -6, -54, 32, 31, -37, -43, 39, 6, -55, -17, 40, -9, -41, 14, 41, -23, -36, 45, 43, -19, -31, 42, 38, -34, 5, 60, 30, -24, 47, 35, -47, -22, 25, 21, -53, 12, 19, -29, -34, 40, 52, -40, -25, 68, -6, -34, 8, 35, -10, -112, 24, 58, -31, -37, 36, 25, -31, -50, 21, 3, -19, 29, 28, -33, -41, 46, 42, -20, -6, 36, -58, -52, 27, 72, -14, -62, 57, 61, -60, 24, 86, 14, -69, -10, 27, 5, -53, 53, 12, -43, -74, 36, 18, -131, 12, 79, 7, -29, 45, 32, -61, 6, -26, 63, -16]
7677a6k4O7n2kJ4L2k4j6Q6j0p1l7J16n8K4ook1o4J15L2j34M9K6J7k8rL1j14Q1
7707bK3Qq4L3P6j7m5L5N1p5n4R6o4kj8J17mj35P5Pm1pM4L4j8q3J42m9o4qJ18p8
7739A1m9N3K4k5n4P5nl3M6Kn0o4J04J9p3l1Q3m1l3J8K0j3J1M0%n2lO8Nq1J0O5
7771D7j5o8M2N3n6m7M9L8p5j5R2k1m6J3M1k4o6N8L7o2j2P4Pn5k6J09o2k6K7O0
7801G1q9j9O5J3n8%O6m1n9O7K7m8l0O4Nn6mO6k5o1L6O4n6n2O0M5r0kN9N1q1J4
7833BM6m2n6N9L7n5j3O6%j03O5R3n8p8J08l1k8q1J09Q7j23K1N4r2rM7qK5l8N6
7863F0M0j16j2R0J9j10J5N3l4k8M7mo3k6J20j3r6M9J01j21qN9L2n2KM7J1o5k1
7892b4R6m8q2P9L6l7p4Q9J3p2lQ3m1o4M0M5n4m2P8L2r5J0O7j1o6N5J2l6l0O7j7
$$ y = [-16, -40, 27, -25, -27, -13, 19, -5, -21, 65, 55, -16, -53, 63, 5, 29, 23, 17, -4, -68, 47, 79, -55, -6, 20, 37, 9, 0, 31, -83, -2, 21, 29, -55, -22, 54, 37, -8, 27, 78, 3, -51, 45, -19, -21, -39, 78, 74, -61, 14, 21, -20, -27, 17, 51, 33, -50, 92, 43, -21, -29, 89, 11, -38, 15, 39, 14, -40, 35, 30, -3, 43, 45, -5, -69, 35, 54, -19, -50, 33, -8, -41, -23, -3, -16, -5, 35, 35, -17, -20, 48, 53, -28, -18, 47, 32, -36, 6, 59, 3, -44, 5, 43, -32, -47, 45, 24, -22, -9, 32, 8, -58, 0, 37, -25, -37, 37, 44, -11, -37, 72, 10, -16, 11, 71, -18, -37, 28, 41, -17, -17, 49, 8, -51, 16, 43, -5, -35, 29, 34, -22, -26, 40, 15, -46, -10, 54, -2, -54, 6, 51, -39, -41, 18, 69, -12, 2, 48, 6, -50, 9, 46, -9, -22, 44, 44, -59, 6, 99, 41, -37, 71, 40, 12, -69, 40, 127, 4, 25, 79, -13, -22, 25, 17, 42, 4, 60, 100, -16, -28, 62, 81, -29, -14, 39, 5, -23, 24, 20, -43, -69, 51, 38, -58, -9, 92, -29, -37, 22, 54, 2, 4, 51, 62, -3, -24, 72, 24, -58, 21, 57, 20, -54, 35, 48, -24, -27, 56, 15, -49, -9, 36, -18, -60, 18, 50, -45, -35, 32, 21, -45, 10, 22, -14, -44, 23, 6]
7923Fm3J9N8k5m2oR2p6j0J9O1p6qR7m6n7qR7j1n3KM7n9k4P7Lr8J6O2l7j6N4nk8
7957a8j1Q7k9o6j8R6k1r0M9P8l5k2KM8q4JR9j3o2K3N2o1l0M1K9o1j6P2l5m2K6
7988a1M1l5k5K0M0o1pM8Qm8RM7pn1J2N5n8j5P8Kq3j9R6k7n4N3M4p1RM2J5n7j4
8021b4L9j1m3O1N6p3l6M3K3p1j0P1j3o9J8Q2q2mO0K7j03N5LO1j14N8L6n1j9M0
8051A0L5k4l9K2M8q8K9N6qn5L9rok0PJ6k9K3N1l5p2L9Oj3OPO1j12M5M9k1q0N6
8084fK6m4J1j7P8n7k2Q4lj02N4M7m3m7M0M9p7lN8j2k6oQ0o9%J7M8p6nO1j9o5K9
8117a7N6l0n6P2rrp1O6K0o7O3L3k2n4L6M3o9J7M3qk2k1K2j1j3MO4n2l4N8%k4k1
8150a3J8L3m6j8P7o5k5M4K6m5k9O2j8k5l8R8n0k5N2Ol4j3N6L0q4K8L2lm3nN6n7
$$ y = [6, -37, -18, 40, 15, -27, -33, 59, -17, -27, -8, 53, -23, -31, 66, 20, -37, -45, 52, 41, -12, -10, 37, -22, -46, 31, 34, -64, -48, 14, -23, -39, 15, 10, -18, -29, 58, 29, -37, -55, 41, 20, -70, -21, 57, 22, 0, 2, 50, -34, -33, 66, 53, -9, 14, 66, 5, -25, 16, 45, -16, -32, 40, 5, -37, -11, 30, -5, -30, -10, 30, -31, -38, 10, 18, -30, -21, 26, 19, -32, -20, 35, -23, -38, 40, 42, -41, -60, 36, 9, -45, 8, 52, -19, -10, 32, 47, -10, -24, 15, 4, -39, 22, 78, 5, -31, 12, 35, -36, -46, 25, 12, -57, -39, 43, -39, -43, 17, 44, -59, -4, -1, 60, -54, 4, 40, -11, -30, 10, 45, 21, -18, 4, 52, -36, -7, 49, 41, -14, 25, 16, 10, -10, -3, 13, -16, 7, 58, 23, -49, -10, -4, -17, -11, -4, 57, -55, -10, 39, 18, -62, -6, 20, -24, -13, -30, 48, -9, -31, 53, 50, -52, 2, 49, 6, -41, -1, 48, -29, -32, 26, 14, -12, -18, 62, -7, -7, 10, 58, -18, -23, 38, 19, -46, -17, 39, 9, -47, 25, 16, 7, -64, 2, 22, -45, 18, 51, 29, -25, 11, 54, -15, 2, 45, 37, 15, -6, 16, 5, -8, -4, 60, 8, -26, 32, 32, 8, -13, 5, 38, -8, -26, 51, -14, -39, 5, 31, -14, -43, 19, 1, -24, -62, 36, -14, -39, 13, 19, -15, -28, 28, 58, -26, 2, 34, 31, -12, -17, 39, -18]
8182a8PN7L7q9mP6q3L6j3
$$ y = [-18, -11, 46, 83, -6, -10, 66, -17, 19, 6]
8191F
$$ Imaginary data points
##PAGE= N=2
##DATA TABLE= (X++(I..I)), XYDATA
0@%%%%%%%%%%%qJ6j6J6k4L2l8M6n6P2q1Q9j08J32j53J77k08K40k77L18l62M10
33B17m66N30n94O66p51Q42r39J046j163J292j432J584j751J935k136K352k589
50a357K852l143L464l818M215m663N169n746O409p187Q113r232J0619j2393J4751
65H053j8052K3041l1540M9729j52412J65807K20701m14551l2471L33756K2419
76A74480l90248J02754L61320k08075k90432K77498K01597l00039j53808L69018
86A44065L4533l70336P6355L21525j41508k77187J90170K53408k78249j69507
96b16731L26475O6711l23730J1937L09866p8888l00065J66042K52366k35394j80281
107b01692K72698J07730k91873l6886L02462m2689k91105J20599K55359j85698
$$ y = [0, 0, 0, 0, 0, 0, 0, 0, 0, 0, 0, 0, -8, 8, -8, 8, -16, 16, -22, 24, -32, 40, -41, 48, -60, 72, -81, 96, -112, 128, -149, 169, -193, 217, -249, 281, -313, 353, -398, 444, -495, 551, -612, 680, -752, 832, -919, 1016, -1120, 1232, -1357, 1495, -1648, 1816, -2002, 2213, -2450, 2719, -3027, 3382, -3805, 4308, -4924, 5695, -6698, 8053, -9999, 13042, -18498, 31231, -121181, 44626, 265327, -149224, -181695, 152061, 174480, -215768, -113014, 248306, 40231, -250201, 27297, 228894, -71145, -224953, 144065, 178598, -191738, -115383, 206142, 64634, -212553, -22383, 231025, -47224, -216731, 109744, 176455, -147275, -135338, 174528, 95640, -204425, -38383, 213983, -21411, -201692, 71006, 178736, -113137, -150023, 152439, 109750, -181355, -60756, 194603, 8905]
117H905k01402K32587J39862k66524o9625K83805q197k74197P7479K46761j33427
128C6027k15415J91199J65232k39851r0747K53712K1745k46203L2303K39439r2988
139E4453k17727J55107J69710j95501j14835K19118N9412k34244M817K28516o5016
150F3810k04628J10725J78684j55996j41483J99094Q2017k17353k0487K13811
160A08194k9710k06056Q1480J86533j33212j46937J68634J00898j90688n3202
170a14066K05059k186k02260N6328J82516j00339j55575J39534J18408j70905
180d3486o9460J84432K0751j84488K3445J78013o8874j60114J12293J28054j45470
191b4904q6927J65620M1130j71638L675J65941m3007j55252Q1357J37148j20186
$$ y = [8905, -192497, 40090, 179952, -86572, -156197, 127608, 119411, -154786, -77307, 169454, 36027, -179388, 11811, 177043, -62808, -153555, 100157, 121902, -124301, -91998, 147441, 54453, -163274, -8167, 161543, -33958, -148793, 70325, 129737, -104507, -99690, 128826, 63810, -140818, -30093, 148591, -7405, -148888, 50206, 132223, -85130, -105617, 108194, 78484, -127572, -46092, 140441, 7229, -139708, 28926, 129824, -60864, -114066, 90993, 88807, -113453, -57125, 125391, 25052, -130523, 9011, 127419, -43486, -112946, 71486, 92237, -92251, -68806, 109207, 40333, -119781, -7488, 120566, -24904, -111831, 53789, 94919, -76719, -73044, 92897, 49890, -105362, -24005, 113143, -7043]
202g043j03417J48224N9414j59334j7299J60597k2359j54381O1528J37472r5910
213G492j12430J24948Q0462j48294l8849J57449n305j50363M1909J36992p4142
224A9869j19831J06625R1696j31611n4250J42611J6191j43541K0147J37404n5625
235B9685j22271Q7237R7976j11337o7541J27220L3484j34601J972J32701l5894
246C8631j21983O6219J04235r2778p9916J14499M8536j26856j3507J27043j8417
257D5706j19786M6534J09444p5531r1190J02151O1808j17185k9133J21096r81
268E2933j20080L1532J12192o1219r4965Q4373P3088j02512m6997J16285J3908
279E8538j18393J8799J08925m3565r7151O6068Q2491q9810n7638J05721K6926
$$ y = [-7043, -110460, 37764, 97178, -62156, -79455, 81142, 58783, -95598, -34070, 103402, 7492, -104938, 20010, 100472, -47822, -86671, 70778, 65473, -84890, -42981, 94011, 19869, -99962, 6663, 98359, -33252, -87502, 55109, 71300, -72241, -52094, 85310, 29685, -92586, -5349, 92627, -18710, -86251, 40969, 74453, -60148, -58176, 74525, 38631, -83352, -17133, 87102, -5676, -85592, 28907, 77443, -49413, -62920, 64123, 45706, -74080, -27546, 81898, 6367, -84823, 17328, 79136, -38049, -67182, 53914, 52933, -67147, -35615, 76577, 15358, -79607, 4766, 77854, -24658, -71655, 44630, 58538, -59855, -41056, 67869, 24304, -72847, -6779, 75712, -14098, -71736, 33985, 60911]
290F0911j09413Q23J07194k6943j00606N3805Q5617p6194o4314R1211M1085j01420
302c8244j4842J05661j4272j00499M0848Q7891o1871p2016P9703N2073r4293k6132
314e5993J00883j829r8010K6192R0171m7768p9061O9273O0661q6362l5485R3496
326C6168J0824r3922J1502R1592l5511q2450N8254O5064p3700m5444Q3939K4730
338E1046r1129L16R0129k4968q0713M3596O9584o0237n5667P6511L4118q5257
350c2671r810Q4923j0883q1384L0558P4438n0712o0444O6471M1955p6135k2415
362d6109Q1566J194q1506K0441P4894l9220o4233N5194N0169o8354l1905P6287
374B8418J1438p8255Q820P5339k8251o7347M5289N5062n8766m0035O9229K1719
$$ y = [60911, -48502, -47679, 59515, 32572, -68034, -14229, 71388, -4806, -69120, 22091, 63176, -38244, -53086, 52575, 38303, -62196, -21348, 66543, 4672, -67344, 12359, 64432, -29861, -55993, 44890, 43061, -54949, -28757, 61414, 13646, -65415, 3858, 64519, -21843, -57328, 36168, 46992, -46930, -35428, 56164, 20653, -61797, -3543, 61521, -12179, -57623, 26316, 51046, -40083, -39767, 50362, 25394, -55319, -11723, 57861, -2376, -58043, 18468, 52586, -32671, -42481, 42442, 31559, -49825, -19267, 55171, 4459, -55985, 10486, 52441, -23694, -46109, 35457, 36651, -44855, -24414, 50480, 11260, -52973, 2221, 52390, -15964, -47869, 28418, 39856, -38399, -29579, 45760, 17509, -49838, -4549, 50513, -8253, -48288, 20941, 42660]
386D2660p5047r74P3877j8092o7840L4302N9402m9792m6504O2623K8746o8986
398b5625j0539P0412o729o9035K5008O2399m2063m9877N4003L5503o2129k0130
410c8802O7851J814o8076J6888O2015l2071n3325M4991M2435n6880k6780O3941
422B4001Q693o4492P475O1833k2459n6775L7853M6545n0490l2117N7836J7099
434C5002o1670j505O2305j5277n7702L0452M8830m2224l8138N1982K4893n9007
446b2059q588O0611p628n7494K1804N1810l4932m2928M6400L0257n3921j5836
458c2504N7363J066n7339J3805N3361k7584m5738L9138L5404m8150k2668N3824
470A9978Q310n5392O032N3390j9645m8184L2195L9494m2319k8132M9217J5345
$$ y = [42660, -32387, -33361, 40516, 22424, -45416, -11114, 48288, -1504, -48008, 14615, 43361, -25625, -36164, 34248, 27519, -41516, -16508, 45891, 3828, -46049, 7954, 43457, -18672, -38802, 29049, 30863, -37213, -20325, 41690, 9619, -43706, 1285, 43720, -13160, -39940, 24001, 32694, -31798, -24323, 37510, 15051, -41724, -3871, 42674, -7816, -39933, 17903, 35002, -26668, -28173, 34132, 18855, -38847, -8395, 40435, -1789, -39927, 12055, 36948, -22059, -30647, 29964, 22336, -35158, -13354, 38456, 3524, -39404, 6996, 37253, -16668, -32504, 24859, 25925, -31414, -17609, 35752, 8168, -37570, 1568, 36972, -11178, -33846, 19978, 28288, -27104, -21072, 32318, 12673, -35511, -3316, 36178, -6141, -34273, 14944, 30289]
482C0289n3076j443N3312j2700m9409K5327M2473l5966l3290M4728K1539n0447
494a8663p885N1962n765m9839J8357M5032k9960l7269L9775K6528m6360j4190
506b8277M9547J370m9716J1570M6514k3731l9802L3730L0661m1189k0025M6309
518A6961P936m8388M967M6557j7064m1478K7400L4291l6137k4993M2769J3555
530B6376m5974j399M5789j0302m3024K1506L7390l1359k8803L8451J8661m2871
542a5559p678M4980m283m3732J5853L9090k5595l2358L3832K3526m0142j2596
554b4662M3040J286m2816R414M0361j9968l4979K9302K6705l5765j7337L9783
566A4364P360m1795L801M0590j4781l6007K3742K9669l0977k1880L6840J1933
$$ y = [30289, -22787, -24230, 29082, 16382, -33027, -7700, 34773, -1193, -34483, 10245, 31784, -18663, -26548, 25414, 19649, -30190, -11833, 33199, 3239, -34030, 5745, 32273, -14087, -28277, 21270, 22640, -27076, -15506, 31008, 7277, -32525, 1205, 31866, -9323, -29348, 16961, 24897, -23491, -18524, 28033, 10969, -30509, -3109, 31182, -4955, -29948, 12821, 26376, -19598, -20997, 24792, 14490, -28534, -7028, 30362, -997, -29800, 8651, 27312, -15559, -23237, 21743, 17460, -26272, -10419, 28671, 3076, -29282, 4550, 28076, -12066, -24662, 18378, 19664, -23152, -13738, 26623, 6655, -28324, 978, 27683, -8082, -25419, 14364, 21724, -20071, -16270, 24320, 9539, -26468, -2726, 26943, -4034, -25914, 10926, 22859]
578B2859l9844j030L9435q937l6920J8167L2436k6913k5028L3492J5672l6973
590a3584o225L8354l411l7720J3604L3801k2602k7268K9196J9730l4093j1104
602b1322L7223R88l7169R000L4128j7400k9639K4879K3393l1268j4727L4811N310
615A8207l5506L489L4688j2407l1622K1036K5491k7331j8044L1428J0261l4281
627a4591j228L4629q212l1786J6115K7368k2793k1787K8714J4062l2330n201L3044
640A6004l130l2067J1230K9313j9125k3973K5252J6999k9114r650L1564J513l2102
653a7286P186K9845j4907k5609K1193K0248k6502j3318L0099N112l1060L013K9920
666A7934j0543k7197J7645K2526k3552j6169K7579Q927k9777j129K9994o828k7968
$$ y = [22859, -16985, -18015, 21420, 12483, -24437, -6270, 26166, -747, -25775, 7717, 23389, -13584, -19809, 18545, 15134, -22586, -8982, 24819, 2217, -25051, 4145, 23875, -10218, -21322, 15901, 16889, -20280, -11280, 22848, 5448, -24191, 688, 24081, -7187, -21914, 12897, 18207, -17299, -13810, 20878, 8471, -23151, -2115, 23376, -3955, -21999, 9429, 19690, -14591, -15819, 18810, 10598, -21188, -5073, 22295, -498, -22285, 6429, 20491, -11839, -17040, 16004, 12874, -19193, -7963, 21350, 2225, -21748, 3504, 20503, -8611, -18261, 13303, 14816, -17286, -10100, 19745, 4838, -20771, 422, 20670, -5832, -19150, 10949, 16061, -14999, -11986, 17934, 7391, -19806, -2161, 20365, -3187, -19356, 8223, 17150, -12627, -13756, 16238, 9410, -18558]
679a8558J4097K4022k0205j8578K4835J2021k7726m877K8871k602k8159J0088
691f771K5235j6629k0567K1673J4891k5401q242K7469R08k7360O154K5509j2508
704D361k2373J8414J7510k3096j1138K5740M358k6634K397K6090r273k3562J5453
717a753J9278k0210j4091K3815P939k6009r22K6014n896k4185J1962K1100j7470
730d28j6415K1675J0484k3960m394K4918j927k4502Q536K1925j4085j7930J8270
743B167J3366k1707p654K3709J095k3419M789K1861j0053j9476J5269J5376j9376
756d053r931K1540M463k2589J208K2527p395k0389J2842J6640j6806j2413J9974
769E618P378k2169j286K2336m689k0760R835J8237j4549j4492J8517R344k0754
$$ y = [-18558, -4461, 19561, -644, -19222, 5613, 17634, -10092, -14969, 13902, 11300, -16859, -6771, 18464, 1835, -18732, 2941, 17832, -7569, -15811, 11658, 12566, -14794, -8640, 16869, 4361, -18012, 402, 17912, -5184, -16322, 9418, 13776, -12858, -10461, 15629, 6356, -17206, -1753, 17525, -2685, -16776, 7039, 14978, -11031, -11953, 14061, 8165, -16020, -4058, 17042, -428, -16843, 4832, 15316, -8644, -13038, 11880, 9953, -14549, -6013, 15912, 1827, -16103, 2167, 15533, -6174, -13828, 9881, 10976, -12443, -7654, 14207, 4154, -15322, -53, 15323, -4053, -13984, 7556, 12019, -10570, -9362, 13165, 5770, -14619, -1777, 14863, -1943, -14356, 5618, 12996, -9173, -10459, 11877, 7188, -13572, -3737, 14500, -49, -14541, 3976, 13320, -7434]
782g434l784K1388j597k0913P000J8999j1968j5580J5795J1284j8390o563J9969
795H206J353k0210M018J8879q868j6292J2861J2894j6087q691J8359L732j9193
808i039J358J8627o090j7074J0528J4409j4491j0388J7119N768j8424j083J8767
821I987l848j7838Q717J5330j2636j1920J5559Q004j7730l248J8550j823j7699
834a0595O288J5871j0150j3330J3664R622j6069n214J7032R10j7095L420J6191
847A0545p778j3838J1249J0629j3623p268J5495L269j6453J269J5842n363j4237
860a0262Q856J2085j2167q845J4632M727j5611p35J5756l208j5176P434J3140
873A0626j1026r955J3421O493j5033k692J5882j625j5343N697J3582q982j1262
$$ y = [-7434, -11218, 10170, 8573, -12340, -5340, 13659, 1691, -13889, 1906, 13190, -5200, -11763, 8206, 9559, -10651, -6633, 12246, 3378, -12914, -53, 12841, -3246, -11937, 6422, 10154, -9039, -7681, 10946, 4856, -12218, -1690, 12719, -1772, -12160, 4959, 10727, -7697, -8780, 9987, 6139, -11699, -2982, 12348, -288, -12208, 3351, 11355, -6375, -9623, 8927, 7104, -10595, -4307, 11564, 1414, -11916, 1748, 11370, -4699, -9913, 7119, 8029, -9066, -5646, 10545, 2767, -11071, 178, 10807, -2816, -10084, 5411, 8680, -7773, -6504, 9338, 3975, -10262, -1406, 10679, -1488, -10333, 4299, 9026, -6585, -7320, 8436, 5228, -9948, -2514, 10626, -400, -10355, 3066, 9559, -5474, -8166, 7716, 6091, -9252, -3555, 10027, 1045, -10217]
886a0217J1795Q239j3991m430J4997L65j4749L326J3707o692j1958R728R344j2062
900b598o099J3475K604j4027J010J3731m623j2462P908J0249j0472p457J2287
913C526M367j3506p95J3798k971j2938O399J1182r265q815J1602N774j3154k232
927g028J3639j323j3233M725J2013p903r866J0449P015j2125l857J3031M67j3039
941g035K927J2099n950j0453Q505Q281j0664n406J1986K156j2287R32J1978l980
955C089j0938O890Q994r177o500J0720L815j1789p18J2084k620j1280N611R653
969G834p981p668J0019N120j1515j954J1969j269j1484M149J0447o876q696R258
983A353O095j0729l205J1345L79j1451K563J0826n481r236P837P038r452m613
$$ y = [-10217, 1578, 9817, -4174, -8604, 6393, 6758, -7991, -4665, 9042, 2350, -9608, 120, 9464, -2598, -8697, 4778, 7382, -6645, -5635, 8096, 3473, -8989, -1081, 9168, -1304, -8761, 3526, 7893, -5613, -6408, 7390, 4419, -8519, -2120, 9062, -203, -9018, 2584, 8358, -4796, -7028, 6611, 5288, -7945, -3220, 8793, 890, -8976, 1473, 8488, -3637, -7494, 5537, 6004, -7035, -4108, 7991, 2041, -8412, 93, 8374, -2290, -7696, 4290, 6446, -5841, -4909, 7069, 3089, -7849, -959, 8035, -1142, -7642, 3078, 6893, -4896, -5614, 6470, 3850, -7430, -1819, 7834, -147, -7815, 2204, 7324, -4191, -6145, 5824, 4555, -6929, -2780, 7667, 791, -7905, 1353, 7448, -3281, -6486, 4859, 5238, -6213, -3650, 7176, 1695, -7541, 296, 7334, -2118, -6731]
997f731J0542J929j1034J016J0645l769r537O136P934q138n838R703L225j0525
1011d442l70J0475k325r806M787Q641p100o796Q970M309j0046j625J0339r66j0147
1026f102L635R235o182p458Q072N256r242l006J0114L49j0272K537R389m938p929
1041f542O769O289q428m108R595J428r797J109R345l354q594N673P093p646m874
1056f042Q762K538r253k74R400k208q878M673P492o574n701P958L690q954j344
1071d715R341j197q925L538P897n488o499P149M689q451k354R000o8q831K299
1086b615Q190m381p075O242N416p647l374Q484J158q779J151Q441l358p523N324
1101c46O082o905m228P932K184q466l1Q532k237p957M420O663o107m992P288L165
$$ y = [-6731, 3811, 5740, -5294, -4278, 6367, 2598, -6939, -803, 7131, -1007, -6845, 2858, 6083, -4442, -4812, 5663, 3338, -6468, -1681, 6960, -140, -6936, 2034, 6343, -3703, -5328, 5011, 4045, -6102, -2467, 6768, 586, -6872, 1200, 6456, -2786, -5792, 4322, 4671, -5601, -3064, 6325, 1387, -6542, 227, 6516, -1912, -6020, 3575, 5003, -4794, -3685, 5660, 2306, -6288, -615, 6478, -1168, -6042, 2720, 5258, -3995, -4269, 5131, 2923, -5955, -1282, 6210, -364, -6065, 1893, 5583, -3371, -4715, 4626, 3429, -5496, -1958, 5939, 451, -6048, 1101, 5790, -2661, -5015, 3985, 3917, -4914, -2615, 5575, 1194, -5881, 361, 5777, -1870, -5244, 3240, 4398, -4381, -3230, 5211, 1853, -5670, -346, 5736, -1169, -5397, 2535, 4719, -3747, -3778, 4754, 2517, -5440, -1020, 5643, -464, -5456, 1832, 4997]
1117D997q127j074Q455j220q033L305P049m994n798O477M153p633k015Q043j34
1132C451p800J998P333l878o411N691M768o903k846P470J031p781R40P669l124
1147A608o746M915N319o151l797P140K014p816J79P731k274p001L980O007n523
1162d15m636O852K718p499o81P523j163p227K994O478m707n193O052L515o826
1177b215j767P198m5p181J931O632l672n598N055M239o085k686O796Q95p057J020
1193b540O717k755n960M264M931n653l428O645J557o970K58O871j988o419L724
1208g46N454n227l993O229K370o811o18O982j272o571K974N729m379m623N542
1223A040L185o372j445O646l06o460J901N944l395n031M670L776n623k297O221
$$ y = [4997, -3130, -4204, 4251, 3031, -5002, -1697, 5352, 358, -5440, 1037, 5190, -2443, -4458, 3585, 3451, -4349, -2351, 4982, 1104, -5307, 384, 5152, -1751, -4597, 2873, 3904, -3877, -2937, 4732, 1608, -5138, -223, 5096, -1055, -4852, 2288, 4302, -3514, -3335, 4396, 2122, -4879, -899, 5108, -415, -5051, 1801, 4519, -2980, -3661, 3862, 2699, -4528, -1534, 4944, 237, -4956, 1096, 4611, -2215, -3982, 3216, 3171, -4010, -2079, 4553, 881, -4717, 338, 4577, -1508, -4194, 2602, 3497, -3560, -2540, 4177, 1422, -4538, -274, 4657, -996, -4424, 2221, 3778, -3192, -2934, 3937, 1949, -4470, -746, 4708, -519, -4512, 1717, 4087, -2724, -3342, 3640, 2368, -4203, -1229, 4500, 121, -4502, 1040, 4225, -2147, -3592, 3054, 2748, -3712, -1811, 4133, 738, -4293, 377, 4153, -1470, -3767, 2454]
1238B454O54o372J033O051k618n323L999M301n181k931N992J332o339L60O252
1253C664k057n720L613M758m883l451N757J973o314k68O389j454n975K999N143
1268D174m273m017N278K631n949j052O159n26n940J992N376l349m474M495L268
1283C793n285j901N716M49n808J075N505k559m777L773L794m710k599N410J171
1298C047n774M31N670j967n136L302M267m411l131N281J712n749j86N807j342
1313A821n449K769M712m034l589M917K270n416r36N634m74n535J957M971l273
1328C45l991M190K924m860j704N278L30n314J051M977k288m363L371L548m379
1343h85k315M962R18n075L15N019j577m746K970L921m083k694M655J536n066k74
$$ y = [2454, 3108, -3264, -2231, 3820, 1202, -4121, -122, 4179, -1002, -3933, 2059, 3391, -2948, -2588, 3664, 1607, -4113, -500, 4258, -625, -4076, 1681, 3654, -2660, -2928, 3461, 2007, -3968, -969, 4174, -99, -4116, 1162, 3793, -2156, -3208, 2951, 2425, -3515, -1523, 3853, 504, -3970, 525, 3793, -1492, -3393, 2323, 2772, -3036, -1961, 3544, 985, -3792, -19, 3775, -935, -3534, 1876, 3047, -2727, -2296, 3374, 1407, -3729, -427, 3840, -571, -3702, 1579, 3291, -2458, -2644, 3163, 1821, -3628, -859, 3853, -181, -3770, 1147, 3417, -1999, -2935, 2699, 2225, -3310, -1353, 3618, 345, -3646, 544, 3468, -1392, -3096, 2182, 2512, -2802, -1751, 3226, 938, -3425, -54, 3494, -885, -3200, 1762, 2680, -2395, -2080, 2939, 1362, -3384, -414, 3507, -576, -3270, 1385, 2921, -2145, -2419]
1359b419N249j192m900K503M142l496l278M364K188n005q06N164n88m840J723
1374a191M400k806l755L860K707m554j421M751K22m704Q89M531k052m045L155
1389a3L138l916k043M342R46m598K27M586j466m134K517L400l352k579M073J598
1405B726m659k34M641j059m159J998L698k921l111L898K048m471p07M465m23m301
1421b571J461M032k552l360L429K362l924j367M280L23m487R25M194k079l439
1436b773K798K693l374j984M019R52m374L35M131j423l599K222L094l031k389
1451b703L737J330m004k51M001p17l921J780L512k797k607L362J684l671q66M016
1467A885j83m085J397L591k305k879K933K189l568j263L944J86l947Q26L691j755
$$ y = [-2419, 2830, 1638, -3262, -759, 3383, -113, -3391, 973, 3161, -1844, -2650, 2514, 1926, -2914, -1191, 3209, 403, -3352, 508, 3215, -1339, -2760, 1991, 2213, -2491, -1602, 2929, 877, -3168, -13, 3125, -791, -2834, 1508, 2454, -2144, -1917, 2669, 1203, -2931, -414, 2986, -366, -2945, 1128, 2726, -1933, -2167, 2474, 1415, -2744, -746, 2952, 31, -3080, 818, 2866, -1605, -2312, 2153, 1730, -2571, -1110, 2922, 370, -2990, 439, 2801, -1123, -2490, 1790, 2113, -2374, -1449, 2745, 666, -2773, 25, 2718, -656, -2640, 1379, 2331, -2043, -1708, 2423, 1000, -2599, -377, 2717, -314, -2703, 1034, 2364, -1640, -1891, 2110, 1393, -2528, -748, 2764, -33, -2640, 722, 2406, -1265, -2131, 1885, 1702, -2383, -986, 2605, 300, -2579, 354, 2543, -1025, -2288, 1656, 1842, -2105, -1279, 2412, 657]
1483F57l277K672K535l320j615L600P66l797J92L820j254l487K189K867k881k075
1499b408L378J173l623k45L637o16l523J506L199k443k473L094J570l385p57L547
1515A631r6l560J025L310j947k768K690K042l243j175L556K05l571P11L363j535
1531F38l022K369K445l112j550L520N28l518L15L406j104l192J955K721k725j939
1547b265L186J070l367k28L411o45l241J459K811k083k315K649J686l179p74L358
1563A533j87l156R01K898j546k618K334J973k889j156L133L75l257M96L167j445
1579E56k701K122K141k599j574L124P18l386L25L181j111k839J726K497k443j826
1595b089K939R81l086k73L166m94l084J361K612k002j988K347J506k729r03L053
$$ y = [657, -2620, 52, 2587, -733, -2348, 1252, 2018, -1779, -1587, 2233, 979, -2508, -319, 2548, -333, -2408, 970, 2143, -1480, -1725, 1912, 1296, -2227, -721, 2478, 35, -2438, 656, 2226, -1159, -1916, 1631, 1535, -2025, -1000, 2310, 363, -2405, 285, 2327, -916, -2091, 1465, 1670, -1901, -1190, 2173, 638, -2384, -15, 2430, -682, -2232, 1288, 1816, -1702, -1387, 2019, 915, -2277, -322, 2399, -326, -2265, 921, 1991, -1376, -1604, 1807, 1162, -2079, -620, 2191, 108, -2207, 442, 2128, -1051, -1825, 1533, 1346, -1810, -909, 1989, 443, -2175, 159, 2132, -757, -1913, 1220, 1595, -1662, -1166, 2001, 556, -2145, -23, 2118, -481, -2055, 1069, 1787, -1599, -1274, 1907, 796, -2043, -317, 2180, -263, -2089, 850, 1831, -1255, -1528, 1638, 1144, -1940, -579, 2033, 31, -1957, 390, 1896, -833, -1736, 1317]
1611A317Kk969P76K688j385k371J992J876k506j176K781M38k898L04K891j107
1627F53k602J869K031k403j343K736O59k933P1L006r47k756J732K230k278j641
1643a916K691R55k935j82K920n55k749J195K495j851k000K367J286k563o62K656
1659A152R5k754O27K594j322k156J800J722k229j168K584M32k644K71K494q05
1675F93k405J521K060k263j293K557N57k585oK682p45k597J617K049k109j472
1691a739K401R66k781j61K851p02k506J193K207j628j916K241J258k590m61K525
1707A158o3k479N65K437j255k048J795J501k067j053K355M76k534K73K398r19
1723E40k101J380J828j910j343K358N91k475J05K440p23k309J372J938j944j354
$$ y = [1317, 1319, -1650, -874, 1814, 429, -1942, 50, 1926, -580, -1756, 1025, 1463, -1435, -1131, 1760, 653, -1949, -80, 1951, -452, -1795, 941, 1600, -1333, -1262, 1744, 797, -1959, -227, 2003, -275, -1916, 775, 1730, -1205, -1387, 1533, 978, -1771, -576, 1919, 68, -1932, 435, 1721, -842, -1504, 1152, 1247, -1507, -880, 1714, 392, -1764, 36, 1758, -471, -1639, 945, 1377, -1267, -996, 1498, 693, -1712, -191, 1869, -394, -1687, 870, 1427, -1158, -1164, 1518, 773, -1824, -207, 1842, -267, -1739, 662, 1628, -1153, -1314, 1537, 835, -1671, -478, 1729, 101, -1815, 426, 1684, -906, -1367, 1158, 1095, -1384, -819, 1618, 363, -1685, 110, 1611, -456, -1509, 846, 1322, -1212, -939, 1459, 540, -1561, -181, 1647, -263, -1606, 752, 1343, -1132, -1027, 1413, 690, -1619, -247, 1691, -253, -1607]
1739a607K274P77k525j20K595n92k401J223K029j702j618K128J090k402m54K456
1755A151j51k362P21K172j243j888J719J418k027q73K196L32k289K38K261q52
1771E23j996J354J589j726j171K094O19k316N2K243o43k058J185J787j742j305
1787a511K150O64k275o7K267m85k208J134J912j664j405J939R23k156m02K303
1803A119k35k208Q13J917j191j651J585J283j993o87K098J48k039K74K016p99
1819D50j855J356J427j689r68J866N48k061K0K105o82j837J132J541j501j203
1835a351J918O40k123jK068n14j917R65J730j493j310J882P50j994k72K037k21
1852G94k010P62J798j243j432J541J045j761o24J942R6j964M28J797q18j594J192
$$ y = [-1607, 667, 1444, -1081, -1201, 1394, 802, -1599, -376, 1653, -49, -1667, 461, 1551, -851, -1305, 1151, 1000, -1362, -641, 1531, 288, -1600, 119, 1537, -490, -1363, 833, 1165, -1124, -886, 1375, 523, -1473, -119, 1470, -256, -1427, 667, 1286, -1030, -978, 1265, 622, -1436, -251, 1536, -206, -1511, 639, 1303, -972, -1039, 1228, 743, -1465, -331, 1581, -83, -1488, 451, 1374, -782, -1184, 1119, 884, -1324, -511, 1406, 215, -1436, 149, 1432, -561, -1248, 850, 998, -1041, -767, 1249, 450, -1405, -49, 1378, -311, -1279, 587, 1135, -926, -906, 1199, 517, -1320, -188, 1353, -148, -1351, 567, 1207, -916, -917, 1151, 637, -1280, -315, 1415, -78, -1388, 494, 1244, -750, -1022, 1015, 794, -1216, -454, 1344, 101, -1331, 210, 1255, -506, -1130, 812, 908, -1056, -628, 1169, 351, -1243, -51]
1869e1J313j577q65J807L76j845N6J841n39j724J053J419j444j004J671O07j856
1886g62r9J905m53j776R43J505j296j211J639P47j857k07J872k56j813O94J638
1903A213j123j330J477R11j675n07J786R6j836M15J675q52j419J197J137j463
1919b98p98J689L36j765J79J667n81j544R56J338j337r40J588M70j676n5J699
1936I28l62j661Q44J394j221j038J467O81j660k57J734k14j656O55J462j035j214
1953a153J362Q60j560m43J644K5j648M08J564q27j321J144R91j339o79J551K73
1970H52j659K01J539n64j362Q58J200j236q64J507L82j499k4J458k63j510P54
1987b30J300j184q60J280N70j371l27J585j80j534O70J221q69j036J097Q61j453
$$ y = [-51, 1262, -315, -1180, 627, 1003, -842, -786, 1055, 516, -1208, -155, 1264, -180, -1184, 487, 1094, -762, -861, 1044, 591, -1185, -242, 1263, -33, -1244, 395, 1142, -715, -922, 950, 694, -1119, -425, 1213, 90, -1240, 237, 1148, -527, -1034, 752, 848, -988, -573, 1102, 250, -1169, 28, 1165, -298, -1096, 593, 929, -836, -657, 1010, 429, -1115, -159, 1179, -158, -1098, 490, 960, -716, -771, 928, 566, -1095, -251, 1143, -78, -1116, 351, 1032, -628, -885, 849, 635, -1021, -366, 1096, 61, -1153, 209, 1069, -491, -934, 710, 735, -913, -505, 1059, 232, -1089, 55, 1046, -293, -972, 579, 852, -807, -606, 933, 369, -993, -135, 1065, -171, -1035, 472, 854, -645, -669, 789, 526, -984, -230, 1070, -114, -974, 306, 876, -495, -822, 763, 583, -951, -281, 940, 71, -965, 132, 993, -460]
2004d60l76J554j15j379L55J306o32j252J083R04j352m45J322J98j387J04J469
2021H97o03j247R45Q93j061o83J230M40j468N5J386m45j165O43J051r04q73J225
2039C16M85j341q5J267j54j260M80J177q52r02J091N73j160l24J259J6j322M03
2057c33J170p05r40Q78P42j080m78J252R8j250K20J171n20j036P97Q24j015n60
2075g65J146K56j190M3J188l55j105O80Q94q92o54J033L88j098j19J166k04j113
2093g01N07R63p62p41R26N06j054k39J141q2j106L57J003o18q28Q16O33j020l38
2112f37J096L3j054K04J019m81r27P80O78r39m04R85J99j066P9J092m25r32O57
2131d3P28p62o03R70L40j098K5J009k62r16M27Q80p07o82R23L79r75j48R90o1
$$ y = [-460, -836, 718, 603, -776, -421, 885, 253, -999, 84, 988, -364, -809, 513, 711, -676, -572, 897, 294, -953, -8, 885, -176, -859, 371, 811, -657, -602, 784, 339, -826, -183, 868, -36, -909, 316, 801, -540, -625, 642, 488, -772, -292, 885, 33, -869, 222, 795, -365, -689, 570, 586, -736, -333, 837, 132, -808, 70, 812, -268, -746, 506, 604, -646, -426, 745, 225, -811, -14, 810, -205, -765, 381, 637, -553, -510, 678, 323, -782, -102, 792, -100, -754, 279, 667, -431, -550, 616, 412, -701, -194, 769, 7, -734, 192, 698, -356, -595, 546, 464, -642, -285, 718, 100, -728, 88, 721, -299, -637, 459, 492, -562, -358, 661, 180, -747, 33, 711, -228, -632, 353, 552, -514, -435, 657, 232, -700, -43, 685, -77, -680, 290, 630, -468, -443, 566, 304, -612, -185, 695, -12, -694, 229, 608, -367, -515, 475, 414]
2151D14j027L73R12o50o75P49N19q79l40J032J2j017K99Q80m63p79O50O39q66
2170b17l79R67R6r44J11R48l58q58O35O43p87m29Q46K60r41qR76l00q67N28O86
2191F08o62n47Q10L38r30p0R33j82q68L98P78o06o22P75L91q49j74Q93l6q95K79
2212b38Q27n27o54O81M68p72k90Q63O6q86J98Q09m03p03N84N55p48l40Q22J27
2232D39q55R6Q21l10p48N27N83o85l92P70K00q29J9Q45k64p71M85O16o24m51P29
2253B01K87q31l2Q22j77p61L61O74n41n33O97L16p44j36P75n0p76K69O93m47n68
2274e01N79M21p13k19P51J8p42J58P26l74o38N64M56o71k61P31Q3p56J00P75l52
2295A35o56N34M94o40l36P45J38p90Q4P58k80o75M40N73o01m07P08K03p39j4P14
$$ y = [414, -613, -240, 672, 22, -653, 96, 615, -264, -604, 428, 440, -577, -278, 602, 139, -640, 10, 649, -217, -596, 371, 467, -477, -366, 582, 224, -634, 1, 644, -143, -572, 274, 534, -407, -415, 561, 261, -606, -78, 608, -54, -601, 209, 547, -383, -453, 480, 298, -570, -172, 606, 0, -622, 153, 544, -305, -479, 414, 378, -517, -238, 589, 62, -592, 89, 557, -215, -505, 358, 424, -462, -264, 545, 142, -561, 23, 578, -170, -510, 312, 439, -416, -320, 501, 191, -557, -30, 553, -132, -524, 246, 446, -383, -364, 481, 217, -554, -69, 547, -77, -528, 201, 488, -343, -375, 447, 270, -491, -130, 544, 3, -530, 167, 483, -261, -397, 378, 328, -448, -179, 514, 67, -501, 78, 499, -214, -433, 318, 336, -406, -248, 478, 104, -534, 30, 486, -185, -446, 285, 368, -388, -288, 487, 135, -521, 13, 507, -133, -469, 276, 414, -376, -292, 466, 186, -489, -49, 524, -77, -484, 224, 427, -312, -326, 388]
2316C88j55o79L09O23m96m58O08K84o55j37O73k1o90K17O43m21n04N53L55o41
2336b04j87P02Op20K11O51l78n64N36M38o86k28P50Jp25J76O89l30o47N39M87
2357E17o99k55P12R4p22N2P45k82o32M18N06n31l87O38K18o79l2O65j23o22K67
2378a32N87m36m76N80K83o22j27O61m5o61K33O13m14n05N68L50o72j73P42n8p05
2399d09K31O56m23n60N79L98o95k00P22L7p49J60P01l48n87M72M70n69l21O63
2419B28J50p14N5O52j86n93L19N35m75m03O06K13o36n9O51j05o46K99N56m55m32
2440d40N74K79o58j19P18j07o94L08O10m82m80N99L50p15j54P85r8p19K63O59
2460D79m17n65N68M17o91k11P22L8p06J25O73k90n83M48M44n46l09O18J67o84
$$ y = [388, 233, -446, -137, 486, -10, -468, 140, 424, -231, -368, 305, 284, -406, -189, 454, 33, -471, 82, 437, -204, -391, 311, 317, -403, -192, 459, 81, -483, 53, 491, -195, -423, 327, 328, -397, -221, 468, 138, -509, 30, 517, -182, -437, 275, 369, -353, -301, 444, 162, -470, -52, 454, -77, -464, 174, 392, -287, -319, 346, 223, -399, -132, 455, 19, -457, 123, 406, -216, -343, 318, 273, -388, -155, 458, 44, -461, 107, 457, -215, -388, 354, 296, -409, -178, 478, 55, -505, 74, 472, -223, -423, 299, 336, -413, -253, 448, 100, -487, -15, 455, -114, -435, 228, 378, -336, -281, 371, 185, -408, -89, 446, -29, -432, 174, 387, -249, -308, 343, 238, -408, -109, 447, -8, -440, 134, 413, -245, -364, 354, 247, -447, -139, 471, -11, -491, 108, 458, -257, -411, 374, 276, -443, -180, 479, 62, -503, 65, 482, -209, -420, 302, 340, -366, -241, 432, 142, -441, 7, 451, -95, -404, 214, 381, -303]
2480c03K8O52k02n94L43N21m87m18O38K22p04j1O89j57o69L42O07n40m43O52K76
2501D42p35r4P92j35p50L56O30m91n08O25L66p43j51P54m3p19K09O57l58n78N21
2522D7M19o13k50O38J15o93P8O67k73n68L97M72n06l70O31J87o97L0O78j97o35
2543d43L59N61n33m14O69K16p13m3P41j56p11L64O04n31m45O27L07p07j48P70
2563C74q0p36K80O28m17n34N47L99o50k17O88K7o72J28O37k80n73M32M58n51k93
2584d05O16J42o53J0O82k21o00L78N07n08l95O35K28p14j4P11j71o63L38N85n01
2605a3m58O41K75p19q4P18q5p09K80O27m46m96N44L55o31j97O81K5o81J51O43
2626D21l18n63M65M29n64k66O14J29o67O4O64k49n87L87M96n14l67O33J88o76
$$ y = [-303, -275, 377, 175, -419, -76, 445, -42, -460, 178, 400, -304, -315, 374, 217, -452, -110, 497, -43, -486, 166, 442, -293, -387, 405, 270, -480, -124, 506, 15, -493, 132, 498, -245, -396, 358, 315, -404, -195, 462, 104, -474, 47, 466, -147, -397, 241, 356, -337, -259, 408, 135, -433, -36, 436, -70, -440, 191, 378, -319, -289, 389, 192, -443, -84, 477, -56, -470, 199, 415, -298, -341, 400, 244, -467, -103, 501, -30, -475, 152, 459, -248, -396, 374, 294, -442, -162, 466, 49, -485, 62, 461, -189, -406, 282, 309, -363, -235, 402, 122, -451, -19, 439, -112, -405, 211, 353, -300, -290, 392, 171, -429, -51, 456, -52, -447, 188, 416, -298, -312, 399, 228, -435, -97, 488, -13, -471, 170, 445, -274, -358, 360, 275, -434, -154, 473, 27, -469, 75, 430, -201, -398, 283, 308, -373, -222, 421, 103, -460, 5, 434, -130, -396, 218, 347, -320, -256, 408, 159, -428, -41, 455, -59, -426, 207, 395, -281]
2646b81pO67j64o45L41N59n07m20O11K60o88q3P04j01o80K93O05m51m93N70L43
$$ y = [-281, -288, 379, 215, -430, -89, 470, -37, -457, 154, 414, -274, -357, 347, 246, -434, -141, 464, 13, -480, 90, 433]
$$ [...]
8191A
##END NTUPLES=NMR FID
##END=
