##TITLE=1H_AM_NV36
 
 8 sc, 
 14.4.2023
##JCAMPDX= 6.0         $$ Bruker NMR JCAMP-DX V2.0
##DATA TYPE= NMR FID
##DATA CLASS= NTUPLES
##ORIGIN= UXNMR, Bruker Analytische Messtechnik GmbH
##OWNER= root
$$ XWIN-NMR		Version 3.5
$$ Fri Apr 14 14:14:23 2023 Russian Standard Time (UT+4h)  she@DPX200
##.OBSERVE FREQUENCY= 200.13135
##.OBSERVE NUCLEUS= ^1H
##.DELAY= (6, 6)
##.ACQUISITION MODE= SIMULTANEOUS
##.ACQUISITION SCHEME= undefined
##.AVERAGES= 8
##.DIGITISER RES= 18
##SPECTROMETER/DATA SYSTEM= spect
##.PULSE SEQUENCE= zg30
##.SOLVENT NAME= D2O
##.SHIFT REFERENCE= (INTERNAL, D2O, 0, 15.7039)
##AUDIT TRAIL= $$ (NUMBER, WHEN, WHO, WHERE, WHAT)
$$ ##TITLE= Audit trail, XWIN-NMR		Version 3.5
$$ ##JCAMPDX= 5.01
$$ ##ORIGIN= Bruker BioSpin GmbH
$$ ##OWNER= she
$$ F:/spectra/data/she/nmr/H-F/1/audita.txt
$$ ##AUDIT TRAIL=  $$ (NUMBER, WHEN, WHO, WHERE, WHAT)
(   1,<2023-04-14 14:13:04.85 +0400>,<she>,<DPX200>,
      <created by zg, POWCHK disabled, PULCHK disabled
       configuration hash MD5:
       00 E9 B6 7A A2 85 ED C7 34 08 36 98 17 FE 4E 26
       data hash MD5: 16K
       B3 77 61 FE A7 71 CD F0 A0 01 CE 7C B1 77 A3 A1>)
$$ ##END=
$$ 
$$ hash MD5
$$ 24 14 DF D7 68 21 2A F5 EA 90 9F DB 10 D3 8E EC
##$RELAX= 
##$RELAX= 
##$RELAX= 
##$RELAX= 
##$RELAX= 
##$RELAX= 
$$ Bruker specific parameters
$$ --------------------------
##$DU= <F:/spectra>
##$EXPNO= 1
##$NAME= <H-F>
##$PROCNO= 1
##$TYPE= <nmr>
##$USER= <she>
##$AMP= (0..31)
100 100 100 100 100 100 100 100 100 100 100 100 100 100 100 100 100 100 
100 100 100 100 100 100 100 100 100 100 100 100 100 100 
##$AQSEQ= 0
##$AQ_mod= 1
##$AUNM= <au_zg>
##$AUTOPOS= <>
##$BF1= 200.13
##$BF2= 200.13
##$BF3= 200.13
##$BF4= 200.13
##$BF5= 200.13
##$BF6= 200.13
##$BF7= 200.13
##$BF8= 200.13
##$BYTORDA= 1
##$CFDGTYP= 0
##$CFRGTYP= 5
##$CHEMSTR= <none>
##$CNST= (0..31)
1 1 145 1 1 1 1 1 1 1 1 1 1 1 1 1 1 1 1 1 1 1 1 1 1 1 1 1 1 1 1 1 
##$CPDPRG= <>
##$CPDPRG1= <>
##$CPDPRG2= <>
##$CPDPRG3= <>
##$CPDPRG4= <mlev>
##$CPDPRG5= <mlev>
##$CPDPRG6= <mlev>
##$CPDPRG7= <mlev>
##$CPDPRG8= <mlev>
##$CPDPRGB= <>
##$CPDPRGT= <>
##$D= (0..31)
0 1.2 0 0 0 0 0 0 0 0.06 0 0.03 0 0 0 0 0.0002 0 0 0 0 0 0 0 0 0 0 0 0 
0 0 0 
##$DATE= 1681467184
##$DBL= (0..7)
120 120 120 120 120 120 120 120 
##$DBP= (0..7)
150 150 150 150 150 150 150 150 
##$DBP07= 0
##$DBPNAM0= <>
##$DBPNAM1= <>
##$DBPNAM2= <>
##$DBPNAM3= <>
##$DBPNAM4= <>
##$DBPNAM5= <>
##$DBPNAM6= <>
##$DBPNAM7= <>
##$DBPOAL= (0..7)
0.5 0.5 0.5 0.5 0.5 0.5 0.5 0.5 
##$DBPOFFS= (0..7)
0 0 0 0 0 0 0 0 
##$DE= 6
##$DECBNUC= <off>
##$DECIM= 32
##$DECNUC= <off>
##$DECSTAT= 4
##$DIGMOD= 1
##$DIGTYP= 9
##$DL= (0..7)
0 120 120 120 120 120 120 120 
##$DP= (0..7)
150 150 150 150 150 150 150 150 
##$DP07= 0
##$DPNAME0= <>
##$DPNAME1= <>
##$DPNAME2= <>
##$DPNAME3= <>
##$DPNAME4= <>
##$DPNAME5= <>
##$DPNAME6= <>
##$DPNAME7= <>
##$DPOAL= (0..7)
0.5 0.5 0.5 0.5 0.5 0.5 0.5 0.5 
##$DPOFFS= (0..7)
0 0 0 0 0 0 0 0 
##$DQDMODE= 0
##$DR= 18
##$DS= 0
##$DSLIST= <SSSSSSSSSSSSSSS>
##$DSPFIRM= 0
$$ [...]
##$SUBNAM2= <"">
##$SUBNAM3= <"">
##$SUBNAM4= <"">
##$SUBNAM5= <"">
##$SUBNAM6= <"">
##$SUBNAM7= <"">
##$SUBNAM8= <"">
##$SUBNAM9= <"">
##$SW= 18.05172834244
##$SWIBOX= (0..15)
0 0 2 0 0 0 0 0 0 0 0 0 0 0 0 0 
##$SW_h= 3612.71676300578
##$TD= 16384
##$TD0= 1
##$TE= 0
##$TE2= 300
##$TE3= 300
##$TEG= 300
##$TL= (0..7)
0 120 120 120 120 120 120 120 
##$TP= (0..7)
150 150 150 150 150 150 150 150 
##$TP07= 0
##$TPNAME0= <>
##$TPNAME1= <>
##$TPNAME2= <>
##$TPNAME3= <>
##$TPNAME4= <>
##$TPNAME5= <>
##$TPNAME6= <>
##$TPNAME7= <>
##$TPOAL= (0..7)
0.5 0.5 0.5 0.5 0.5 0.5 0.5 0.5 
##$TPOFFS= (0..7)
0 0 0 0 0 0 0 0 
##$TUNHIN= 0
##$TUNHOUT= 0
##$TUNXOUT= 0
##$USERA1= <user>
##$USERA2= <user>
##$USERA3= <user>
##$USERA4= <user>
##$USERA5= <user>
##$V9= 5
##$VALIST= <valist>
##$VCLIST= <CCCCCCCCCCCCCCC>
##$VD= 0
##$VDLIST= <DDDDDDDDDDDDDDD>
##$VPLIST= <PPPPPPPPPPPPPPP>
##$VTLIST= <TTTTTTTTTTTTTTT>
##$WBST= 1024
##$WBSW= 4
##$XGAIN= (0..3)
0 0 0 0 
##$XL= 0
##$YL= 0
##$YMAX_a= 200832
##$YMIN_a= -172162
##$ZGOPTNS= <>
##$ZL1= 120
##$ZL2= 120
##$ZL3= 120
##$ZL4= 120
##$ABSF1= 10
##$ABSF2= 0
##$ABSG= 5
##$ABSL= 3
##$ALPHA= 0
##$AQORDER= 0
##$ASSFAC= 0
##$ASSFACI= 0
##$ASSFACX= 0
##$ASSWID= 0
##$AUNMP= <proc_1d>
##$AZFE= 0.1
##$AZFW= 0.1
##$BCFW= 1
##$BC_mod= 2
##$BYTORDP= 1
##$COROFFS= 0
##$CY= 11.3945322036743
##$DATMOD= 1
##$DC= 2
##$DFILT= <>
##$DTYPP= 0
##$F1P= 15.7292609196834
##$F2P= 12.9074282941183
##$FCOR= 0.5
##$FTSIZE= 0
##$FT_mod= 4
##$GAMMA= 1
##$GB= 0.15
##$INTBC= 1
##$INTSCL= 1
##$ISEN= 128
##$LB= 0.24
##$LEV0= 0
##$LPBIN= 0
##$MAXI= 10000
##$MC2= 0
##$MEAN= 0
##$ME_mod= 0
##$MI= 1.114404
##$NCOEF= 0
##$NC_proc= 0
##$NLEV= 6
##$NOISF1= 3.799351
##$NOISF2= 2.8
##$NSP= 1
##$NTH_PI= 0
##$NZP= 0
##$OFFSET= 15.70392
##$PC= 1
##$PHC0= -19915.29
##$PHC1= 17.20081
##$PH_mod= 1
##$PKNL= yes
##$PPARMOD= 0
##$PSCAL= 0
##$PSIGN= 0
##$REVERSE= no
##$SF= 200.130013532006
##$SI= 16384
##$SIGF1= 3
##$SIGF2= 2
##$SINO= 400
##$SIOLD= 16384
##$SREGLST= <1H.CDCl3>
##$SSB= 0
##$STSI= 0
##$STSR= 0
##$SW_p= 3612.71676300578
##$SYMM= 0
##$S_DEV= 0
##$TDeff= 0
##$TDoff= 0
##$TI= <>
##$TILT= no
##$TM1= 0
##$TM2= 0
##$TOPLEV= 0
##$USERP1= <user>
##$USERP2= <user>
##$USERP3= <user>
##$USERP4= <user>
##$USERP5= <user>
##$WDW= 1
##$XDIM= 8192
##$YMAX_p= 0
##$YMIN_p= 0
$$ End of Bruker specific parameters
$$ ---------------------------------
##NTUPLES= NMR FID
##VAR_NAME=  TIME,          FID/REAL,        FID/IMAG
##SYMBOL=    X,             R,               I
##VAR_TYPE=  INDEPENDENT,   DEPENDENT,       DEPENDENT
##VAR_FORM=  AFFN,          ASDF,            ASDF
##VAR_DIM=   8192,          8192,            8192
##UNITS=     SECONDS,       ARBITRARY UNITS, ARBITRARY UNITS
##FACTOR=    0.0002768,     1,               1
##FIRST=     0,             0,               0
##LAST=      2.2672688,     0,               0
##MIN=       0,             -172162,         0
##MAX=       2.2672688,     200832,          0
$$ Real data points
##PAGE= N=1
##DATA TABLE= (X++(R..R)), XYDATA
$$ [...]
552A776q99l753P592q790N382J83m625O220m971K514o17J51K96k562N143o168
568c128M861k56n389Q099p148L222J831m749M764l706K701j840Q51J444m703O737
584C591o065K462K609o661P688n291J186K465m589N287m798L359r74k199N076
599C146o409N148j698k238N142n697L930j284q94K250l017L231k976J992j64k042
615a580L848m413L252q85j559L410m003L467k435N63K048m156N057m227J338K229
631A954m790N513l863Q12J938l627L748k823J607O4j622K662l270K656j281j83
647e05K037l038K769k209P43R68k007L179l347J874j10k014L641l484K397m06
663D88j848K950l114K194n64o15K008k808K021j300Q1J642j776J677j658M23K13
$$ y = [1776, 877, -2876, 4716, -4074, 1308, 1491, -3134, 3086, -1885, 629, 12, 163, 459, -2103, 3040, -3128, 1733, 1477, -3912, 4187, -2961, 261, 2092, -2657, 2107, -1599, 1102, -738, 113, 1557, -3146, 3591, -2474, -12, 2597, -4064, 3624, -1667, -481, 1984, -2605, 2682, -2116, 1243, 269, -1930, 3146, -3263, 1885, 187, -2051, 3091, -2606, 1324, 40, -854, 1396, -1621, 1610, -1366, 626, 462, -1580, 2268, -2145, 1107, 222, -1337, 2073, -1930, 1537, -898, -335, 1713, -2443, 2614, -1613, -275, 1954, -2836, 2677, -1186, -374, 1564, -2063, 1685, -1138, 469, 533, -1089, 1573, -1697, 959, -322, -505, 1532, -1506, 1263, -946, -203, 765, -1242, 1937, -1410, 464, 354, -1660, 1981, -1503, 894, 488, -1360, 1590, -1524, 670, 106, -509, 1499, -1309, 712, -588, -507, 1135, -641, 1036, -622, -199, 14]
680A4n45J523j766J738j333j82J535k594K790j343r1J635l012K248j200L46J569
697A332k141J792j859L70J222j550K047j481J21N76j212J154o13M14R6n2j03p91
715f78R16p71J084K7j080J074j601J129L30q43J307j567Q84j46p61J451j340J093
733E08j84q63J028j319Q64L71n05P04r90J89O9P6L96k97P0l75M45k52j20N34o83
754c34P90m19l50O04r16R93j25l32M99r90O33k3j43N90q51M98o4l30N72n27K67
775D2J11k61K59k24o4J38J33q5O7j85j77M95k88J56M2m67N94m16J46K09n61O33
797B97m81J90K63o84O63l31k5M75p15M94j77j48M95n44K27L0j53L07l18J40o5
818f0m7J57k6k9pN4k7M5r2J1J33k14K12j11j56L16l02K49J8k16J75j21R2mp4Q6
$$ y = [14, -531, 992, -774, 964, -369, -551, 984, -1610, 1180, -163, -254, 1381, -1631, 617, -583, -237, 1332, -809, 983, -876, -506, 716, -834, 1213, -268, -147, 429, -783, 371, -242, 172, 268, 216, 113, -678, 238, -533, 551, 578, -502, 572, -1029, 100, 430, -413, 894, -673, 211, 65, -696, 755, -585, 508, 324, -539, 489, -830, 34, 405, -100, 604, -386, -197, -128, -52, 344, 47, 117, -258, 187, -65, -185, 349, -334, 456, 37, -313, 291, -625, 368, 243, -89, 410, -580, 53, 30, -113, 477, -374, 124, 60, -270, 302, -225, 42, 153, -108, 151, -73, -137, 1, 134, 49, 116, -69, -246, 249, -39, 117, 159, -308, 286, -130, 16, 225, -336, 297, -184, 6, 269, -415, 248, -83, -108, 367, -348, 146, -31, -179, 316, -228, -1, 29, -124, 183, -135, 5, -60, -107, 50, 24, -5, -12, 42, 15, 60, -32, -21, 112, -102, 110, -1, -157, 159, -143, 106, 124, -92, 83, -38, 54, 50, -24, 62]
844F2j50K09j74M2J23l26L71k01m6K08l15L04o9j29K07j93J16%j06J21j03O4o
867Ir2J49r7K4J21j86J96j18j11L31l40J33J61m18M69k47j37M49n31K87R4m21
889b75M65j91j75M31m65K27J25m47M69j85j37L83m14J94R0l56M94l29L9K27m00
910b30M14k83L2K79m59N58l32j98O15p31N06q2m05O46m30Q4K16m59L08Q7l17L63
932A82j14k44M81m05Q3L45p29O69k87l20Q10p77M11J24n27O30n57K49J13m10O09
953C36o25M35ql83O01o71M33Q9n85P62n15j1M61n40K23K37m29K80J87o06N34o7
975A38n77J012p95O1N24q74R53n67k3M61p18O63m04J94J29n67Q11p15L55J60n61
996c40P93o67K21J44m87P37o24K41J31m01M56k67l0J29N7k66K75M5n51P48n32
$$ y = [62, -88, 121, -53, -11, 112, -214, 157, -44, -90, 118, -197, 107, 38, -91, 116, -77, 39, 39, -67, 54, -49, 15, 9, -83, 66, -31, -7, 114, -72, 124, 6, -105, 226, -114, 19, 180, -238, 231, -16, -153, 296, -235, 52, 146, -275, 190, -1, -176, 255, -210, 17, 142, -305, 164, -21, -158, 225, -189, 5, 95, -261, 233, -96, -57, 170, -230, 184, -99, -67, 212, -247, 311, -21, -219, 396, -335, 171, 89, -316, 330, -100, -16, 200, -259, 49, 136, -181, 182, 68, -176, 305, -100, -17, 328, -401, 268, -19, -339, 471, -306, 105, 229, -298, 332, -225, 24, 137, -273, 336, -289, 146, 138, -245, 356, -315, 118, 207, -378, 384, -131, -142, 319, -221, 2, 239, -190, 90, 277, -329, 205, 138, -439, 573, -222, -161, 363, -511, 442, -125, -148, 313, -405, 258, -146, 48, 177, -390, 421, -294, 61, 221, -340, 453, -214, 7, 151, -336, 401, -223, 18, 149, -252, 204, -63, -93, 36, 93, -173, 102, 147, -404, 344, -188]
1017a88o5Q45j179P67p8n23Q03n75J66J55k15L6q4N31r21Q11k80n19J274j288
1037e27O01L10j081J248o91j8M89o16N59m73L13j51m9M15p51O54k50j26M46m49
1057a47L27k04p8N3k4K72l07L23l37J04qj04M35o36P48n01l73J195j629J300J24
1078E33j493K085j721J30J377j785J364j83q47R33n52M9K77n7q3j10K94o91N22
1097D2K77n51N34j51o07M36R9o76J179n37o28J468j723O65Q33j577J905j099m51
1116e62J260j585J326k96m32J037j380P63j02n21J177q57J89L22p46K61L11k89
1134a24L21K39q28L81Q9n58R28l29j32Mj51L2%O90q83M76M03j552J741q69n95
1155g17J855j795N88O21j558J385o8q14J012n06n12O85l49r3P57o29j12N98q40
$$ y = [-188, -253, 592, -587, 180, 102, -421, 382, -193, -27, 128, -87, -51, -135, 396, -525, 286, 6, -513, 761, -527, 74, 384, -697, 551, -140, -158, 331, -285, 274, -199, 114, -37, -86, 329, -422, 232, -18, -144, 302, -147, 180, -24, -102, -49, -73, 199, -108, 215, -122, -18, -26, -130, 305, -331, 417, -84, -457, 738, -891, 409, 533, -960, 1125, -596, -466, 911, -874, 490, 307, -540, 393, -159, -110, 167, 110, 27, -83, 211, -480, 42, 319, -232, 302, 151, -456, -20, 79, -597, 582, 45, -583, 885, -838, -173, 660, -917, 988, -111, -562, 698, -887, 439, 143, -289, 748, -632, 131, 29, -492, 685, -172, 17, 339, -407, -146, 165, -124, 197, 436, -392, -11, 78, -480, 448, 119, -13, -9, -160, -128, -128, 562, -321, 155, 558, -994, 747, -122, -717, 1138, -657, -69, 552, -1006, 379, 311, -503, 509, 3, -509, 176, -173, -266, 491, -138, -250, 348, -492]
1174d92O52j25j78N09m47K50n31K01N20n90O69n97j65O48p06N39k62R0J71m90
1194c34M99l47J74K77p02O47k69m16P83m05k32Q58p33r4R73j217M10Q60j627J381
1214D86k27j085J702j192Q0Q46j093N40J53m61M28k3l23J58L76p55L42K97n89
1233c40N43n9m22L73j60k29L94j03k16M23k49p6M65o36M47Ko01Q64o25R9M33p35
1255d08P89l48l14Q53r44K84N06r37P54n2n82P65l20m36P17m99j82Q09q45L10
1275h0M25r06P20m2n32N60n3k44K35J9k52L17N1o07Q90n22l59R65r15L69L42q64
1297d83P70k19m78P36m34p5N01n02M0N31n80J98J56m26M21k83RM29n39J89J83
1318A44m00N01k64k09L32k49j7K80k35n7L76m43J68M17p13N21J59p17P45m14j40
$$ y = [-492, 160, 35, -143, 366, -81, 169, -362, -161, 359, -231, 438, -159, -324, 324, -382, 157, -105, -15, 156, -334, 165, -182, -8, 269, -433, 214, -55, -471, 312, -93, -325, 533, -200, -294, 679, -538, -128, 732, -895, 486, 259, -826, 876, -316, -236, 610, -483, 57, 210, -251, 177, 154, -169, -11, 365, -390, -48, 249, -340, 203, 144, -278, 95, -65, -294, 100, -3, -219, 204, -45, -121, 344, -292, 155, 157, -444, 420, -205, -106, 327, -408, 381, 33, -281, 572, -372, -88, 418, -519, 235, 183, -399, 366, 46, -390, 327, -172, -354, 455, -390, -80, 345, -561, 159, 117, -415, 145, 92, -152, 83, 102, -150, 167, 218, -389, 501, -21, -380, 585, -330, 39, 381, -483, 287, 68, -410, 326, -108, -183, 318, -184, -144, 387, -193, 5, 161, -265, 156, -127, -118, 311, -228, -39, 144, -256, 245, -19, -228, 104, -145, -162, 118, -117, -174, 202, -241, -73, 344, -369, 152, 311, -406, 339, -75, -215]
1339b15O34n84PM05m18R9L79o09L29K46o24O80k65l88O88m21j83N69n60J88K71
1360B28m98K77J78l89K50N2l81O19l80k00O38o36J78K76n33M97j37k55M27l02
1380i1lL19k83j1L41m05J17K88o35N54j23m11O34m99J23L48n67M12Ml05K64K2
1402I3k93L05l7l86N98k93k96O60n93J96L31o17M60L5l23L22r5k24L42j60k50
1423b25N91m98k3O39q48M92N0n24P35n13L8L07l19R8j4o4L1K31k74Q4R5l21M53
1446B21l40p9N42o43K98J74m76M73j99j06L06j57j68L13p7l28N42m50L6N39q11
1467c90O28j1o25P00l33j32L43l64R5J38m5j86L66k95p4M05n37N04r7l92O07n17
1489b12J72K49m44M81k93JP0q4N9o8K23k67K93k22k4L50n46M33o3l22N68n23J22
$$ y = [-215, 419, -165, -158, 247, -171, -72, 307, -302, 27, 273, -351, 329, 64, -324, 364, -57, -240, 329, -231, -43, 228, -270, 7, 185, -204, 46, 98, -283, 336, -44, -244, 394, -242, -64, 212, -321, 176, 39, -216, 211, -91, -94, 225, -58, -69, 272, -133, -16, 272, -363, 191, 68, -343, 291, -208, -85, 263, -304, 108, 112, -193, 71, 93, -200, 105, 68, -318, 280, -13, -309, 351, -242, -46, 285, -332, 128, 163, -160, 162, 67, -157, 185, 25, -225, 366, -132, -155, 484, -364, 128, 178, -346, 389, -124, -86, 221, -98, 0, -14, -78, -47, 184, -90, -6, 89, -232, 221, -119, -198, 344, -299, -1, 173, -303, 170, -29, -135, 171, 14, -154, 159, 82, -246, 296, -154, -118, 421, -390, 238, 227, -398, 302, -31, -163, 180, -184, -89, 49, 4, -182, 184, -111, -185, 220, -317, 187, 90, -302, 305, -212, -40, 209, -235, 246, -47, -46, 24, -60, -1, -69, 154, -113, 180, -42, -66, 284, -262, 171, 108, -214, 354, -169, -47]
1512d7J61j74J31L3q1k26M85m15pN86r27P05j39n76Q84n88Q2M55p62N67j12k50
1534b15K57J24k50O2J91l73K93kk81M81m19J08R1k55K87j01J59j46L1o1k26M94
1556B49m18K39J29m75N66n57L57N8n10O09m88L01J00n18N90k57j41K48k08n1K48
1577G1l5j67K87k44k01N46n12L36J51n99N27r1j38J07n3q1Q1J92m53L66K2m53
1599c41P54n25PL92o38M82j61j00K72k02L9m8Q8l8n3K29l60L89k39J2J54k17L04
1622B00l08R4J25l23M16l01N0K15k91K15m3j19J15N4j34m1L31m34K85N6m81N92
1644B73l96rL93m40J93K3l3o2R9M3k63M43m17Q0L80o06M58j31k54M96m08R8J34
1667I4j99J02M6j9j10J87j32K8J03k12K45j71jJ15j87K50k04P8R9k53L08k63R0
$$ y = [-47, 114, -60, 71, 104, 23, -203, 282, -133, -140, 446, -481, 224, 85, -491, 393, -195, -113, 342, -420, 147, 35, -215, 42, 166, -84, -22, 169, -204, 89, 87, -194, 287, -132, -24, 67, -188, 99, -2, 157, 11, 42, -19, -245, 249, -169, 70, 199, -276, 290, -267, 90, 148, -362, 247, -241, 60, 160, -358, 232, -25, -166, 82, -126, -177, 71, 36, -131, 156, -88, -289, 257, -255, 81, 232, -367, 160, 69, -69, 38, -15, -96, -15, 177, -276, 90, 112, -341, 413, -112, -105, 287, -351, 131, -30, -130, 142, -60, -21, -69, 19, -19, -72, 157, -203, 186, -53, -41, 113, -104, 200, -108, -14, 111, -212, 204, -97, -47, 168, -123, 92, 49, -70, 45, 99, -35, -76, 255, -179, 106, 162, -319, 273, -123, -132, 261, -179, 14, 37, 4, -58, 41, 84, -179, 264, -153, -73, 307, -299, 159, 28, -226, 270, -138, -40, 94, -105, -3, 43, 24, -86, 101, -31, -3, 100, -112, 133, -38, -39, 76, -111, 139, -65, 13, 112, -141, 167, -96, -6]
1690fJ23k36J89j00J05q8n0J94l14L55k22j52L83l50J94P5k36J44Nj56J64k8j00
1713a07J57K2k78M38l22K6K57l75L34j60q6J17O8l3p1O1m2o9J60j11J23j6j77
1736h4J89j45j1J32j68J31j1J8j27M0N6q3J71j27J3j9q5J70o7M6k7p7K04l32K36
1761D3j8o0J95j67J2%j51K08n9P7j32J14j17j8K29l32K50m3r9J95k00J8M6r6J03
1786bP5n2K4Nn6n4Q9r2K7J51k07J47k19J48P6p6O9p9Pn2J46J6j30Nk5J1J27r4
1814a5J23k61J49j2kJ17j41O1P6m9P1j35k1J9J1O2j33P1k4R9m4j05J52j06N0P9
1840I2j43J58j17k2L2j7J3oN2k4m2J8n4J41j13M9L9j28J52j59R0OK2l9k8J21j36
1867d3P2L8j46J17j00N4L1o1Q8j15O2%m2N2m5N2Jj1Q4j09Q4j23N8K9K5lj14J20
$$ y = [-6, 117, -119, 70, -30, 75, -13, -63, 131, -183, 172, -50, -202, 181, -169, 25, 100, -136, 8, 13, -143, 21, -7, -107, 50, 72, -206, 232, -90, -64, 193, -182, 152, -8, -94, 23, 91, 58, -13, 48, 6, -63, 97, -14, 109, 93, -84, 105, -40, -51, 81, -87, 44, 33, 51, -76, -36, 20, -63, 108, -19, -6, -25, -110, 60, -7, 39, 12, -65, 139, -193, 43, 25, -35, 160, -7, 5, 5, -146, 62, 3, 80, -52, 62, -55, -73, 156, -176, 74, 31, -68, 127, -73, -55, -9, -105, -2, 73, 21, 45, 50, -6, -60, 29, -63, -36, 115, -92, 55, -164, -16, 60, -16, 53, -26, -19, -71, 75, 91, -39, -34, -59, -48, 79, -15, 108, -153, -4, -16, -18, 99, -42, 19, 95, 46, 117, -18, -39, -20, -9, 53, -80, -9, -33, 66, 22, -83, 69, -37, 13, 92, -51, 107, -10, -32, 0, -17, -4, -10, 42, 18, -24, -6, -60, 81, -32, 17, 56, -72, 80, -79, 11, 17, 39, 0, -28, 93, -43, 29, 67, -79, 38, -62, -8, 23, -38, 50, -65, -3, -3, -45, 7, -38, 14, 15, 4, 88, -21, 63, -60, -2, 27, 52, 49, -65, 55]
1895E5o5n2J30j12j2J0K6K7p7R8o9L1M0l2J5l3l9J04r0R9r5P6rp6R0j46K17q0
1923C1k1L7l5R3r6R7p0q4R0j08J60o6MN3j88J83N3j20Mp0K8M0J7r3m6J35j4Pr7
1952g6Q8pn2J38j08j4K1pP9n3m2J34j80J13p8lJ08o7R7j20P2k3j02Q0k4Q5j6p
1980C6m0LJ7r0P1op3J60j08K1m2J3J47j50L0J5l3P4j13J02J2j02J47j29J14j5
2006F1j54J51j21J36j20P7m7PN7r8N3Om0O5r6R2n2ML6m2O9n3j9O4j25J41q7J7
2034a8Nl6J13j56R9N0j24J25j14J09j13rJ51q3K9k9K0K5o8J07l9l3N5j17J89j45
2060gjK5k3J02p8K0l6m6P9o2M1l4QM1n8L0l9N1o1L3O4j33R6jp0J73k41K23j08
2089a2J4L1J2Q5j54O2l9M5n8n1J16J6p5J5J6M9j03nO2j6L5p2NO1j21N4RL7pj6
$$ y = [55, -10, -62, 68, -44, -56, -46, -20, 7, -70, 28, -41, -10, 30, -2, 13, -20, -59, 45, -45, 54, -41, 35, 26, -50, 40, -106, 111, 31, 10, 47, 12, 105, 9, 106, 36, -48, 42, -66, 94, 28, 32, 85, -103, 80, 133, 13, 17, -53, -25, 15, 32, -61, -107, 28, 14, 21, -76, 12, 5, -47, 91, -17, -31, -10, -17, 62, 9, -33, 101, -79, 34, -44, -47, 61, -6, 91, -29, 43, 20, -82, -2, -26, 59, 43, 36, -4, -1, 16, -74, -3, -9, -82, 78, -30, -9, -51, -38, 109, -41, -11, 4, -29, 45, -68, 34, 46, -56, 91, -38, 76, 61, -93, 58, -63, 73, -47, 30, -17, -10, 47, -51, 2, 8, -32, 33, -63, 29, -23, -19, 17, -25, 44, -9, -28, 36, -89, 52, -35, -18, -13, -49, 64, -92, 7, 57, -67, 58, -56, 53, -60, -69, 82, -1, 28, -1, 19, 44, -24, 83, 44, 11, 66, -51, 138, -7, -8, 17, -6, 96, 18, 38, 2, -44, 35, -27, 14, -20, -12, 29, -29, 1, -38, 13, -48, -15, 49, -84, 12, 11, -59, 114, -127, 96, -12, 2, 33, 45, 130, -24, 38, -1, 44, -14, -65, 51, 67, -8, 7, 23, 72, -31, -36, 26, 10, 45, -27, -22, 39, -82, -28, -19, 18, 11, -5]
2119eJ47j51M9m7p4J91j18O7o4qK1m3J61j18o5R0o8Q7o5n1O3m1L4J5k0K1N6m8
2147A6m9J72j00j7L9j73J28n8K7L5q6J24o9J2Qr7K42k10N6m1k2Q0L9n0n5N9k1
2174a1K1lq6R2L6l7J9l3m9J22p3M2jJK5j02Q1n7N8J8j12N7J6L8j06j3J87j38P
2203aJ4o1k7jJ01K2m8O7n1o7L0M2l6P9kk1m4k5P2J3o3Q0j47J60j73P6M7nOl5k2
2234b0O5j05J10o6m1P6j59K01r4j9J21r4o5PK8J04k9O6j44N3P6m3o4LP5j5P4n7
2262D4K1o1j63K92j23n2O7j14J03KpL3j69J61J5j33J79p8R1j53P0O9j84J16k9
2287cN7l6mm4l1J00o1J11o0l6J00r8qJ09j46J90j15m4N8o4Q8n8oqm5J09o6Lom7
2317f1J37p6%l8LJ9j6j3Q2l1j3l1M3PL2m6k8L5m2J09o0j6Q0j35J12j22Q5L2j20
$$ y = [-5, 142, -9, 40, -7, -81, 110, -8, 59, -5, -13, 8, -35, 126, 8, -57, 33, -35, 52, -13, -64, -1, -42, -8, 7, -13, 8, 64, 16, -33, 139, 39, 22, 61, -112, 16, -42, -15, 20, -66, 58, -11, 1, 9, -88, 154, -56, 0, -41, -63, 17, 56, 6, -49, 10, -11, 10, 7, -79, 13, 49, 12, 31, -2, -51, 71, -2, 40, 39, 40, 65, -37, 44, -13, 45, 63, -49, 8, 24, 62, -44, -57, 130, -8, -1, 13, -48, -75, -76, 25, 47, -1, 66, 15, -52, -22, 20, -16, 63, 61, 40, -4, -29, 43, 56, -7, 73, -74, 86, -87, -11, 36, 31, 37, 2, -20, 45, -60, 50, -16, -57, 19, -140, 61, -33, -52, 69, -25, -90, -83, -55, 49, 20, 86, -58, -5, 71, 28, -36, -33, 42, 27, 101, 44, 65, 4, -159, 133, 10, -42, 25, -89, 14, 16, 9, 42, -127, 34, 49, -84, 95, 17, 108, -45, 25, 94, -90, 26, -3, 54, 18, 14, -30, -61, 39, -22, 89, 29, -7, 93, -5, -13, 96, -50, 140, 25, -19, 39, -25, 63, 5, -1, -9, -54, 55, -11, -8, -14, -61, 76, 0, 0, -38, -35, -16, -32, -45, 37, 6, -7, -38, 5, 12, 44, -2, -30, 5, -37, 72, 12, -4, 76, -59, 53, -69, 16, 48, -72]
2346g2R7M0pl2n3Q4l5Qn5J6N3p1K6O1n0P5j14J09p1l5J2n8K9JJ18m7l3J1n9K6
2376b6qj1P9k1M3o8K1j0K1J2j3j7lRL7o3N7o1RP3p9O3rp3O8q0R3j14Q7Ln3R8j23
2409e9J12p2pJ7o8J27m1l9N3o8P0l5J5kp4J06oK0o4L8K0o3P9r5M2N3j49K02j27
2438a5kJ28k36J70lj06N2n2J9j6k8R2j2K5l8O0j52Q0N3k1N7q4lO6l1lp7J63m9
2467C7k3K3q8R1Nj05J15j37J79n1n1J43k02J34Mm1n6M5k9j3J6m6Q4P9k02J24j4
2494B1p0Q7q6J09p0MJ3k6P4n0J7Lp4R6q3N5k8JL4l6J5j7k6P2n8O8n5JR6r3N5r4
2526d5J12j06N0J09k23J41j1j00J87k11J02L7j01R9n2M3o3L9l9PO6j10J68j46
2550d7K7R5j00K4M0p9J48j43R9j11N2l1j4J62k08J90j80nK38j84pO5q5Q4k2l9
$$ y = [-72, 25, 65, 58, 26, -27, 57, 22, 30, -25, -9, 44, -27, -1, 60, 10, 85, -29, 80, 9, -26, -14, -72, -43, -42, 76, 29, -4, 7, -52, -26, -34, -45, 34, 13, 56, -12, 9, -1, 20, 32, 19, 2, -1, 8, 45, -18, 39, -22, -13, 60, -19, 44, 35, -38, 30, -50, 43, -71, 16, 19, -34, 64, -59, 53, -19, -26, -9, -77, 50, 9, -30, 23, -45, 25, -10, 5, 3, -71, 35, 29, 49, -15, 23, 43, -20, 59, -36, 6, 59, -90, 112, -15, -17, 111, -125, 45, 42, -64, -12, -64, -45, -61, -89, 3, -9, 16, -22, 38, -114, -34, 19, -2, 55, -29, -32, 34, 3, 0, -77, 86, 37, 14, 37, -51, 40, 45, -60, 55, -82, 97, 46, -5, 138, -64, 70, 74, 33, -23, 22, -7, -20, -4, -50, 34, 113, -89, 35, 21, -49, 38, -48, 61, -9, -5, 8, -18, 56, 6, 23, 26, -48, 48, -35, 20, -8, -7, 27, -9, 6, -11, -37, 35, -23, 45, -10, -9, 87, -6, 49, -45, 67, -39, 11, 120, -103, 38, 27, -73, 114, -97, 5, 42, -59, 40, -12, 31, -32, 7, -32, -25, 41, -69, 99, -47, -20, 75, -25, -1, 39, -40, 108, -35, 64, -47, 5, -26, -40, 122, -86, 104, -76, -81, 157, -27, -34, 31, -54, 30, 8, -31]
2576c1M6l1M1j51J30Ml2J7l2P0kK5l7m9J33j74J31j01l8K04j56L0K0k2J6l0R5
2603G6j09O3j6p8J81j37LR5j80J55l1m8P4n6j4J1L0q3R1k6n3J33j38N6K9r3J15
2630E0o7K1Rm5P0p1P6l9j6O2o2M3j2j7M0l1K8o9N1mo3J25j11K5L6j03Q7m4PK1
2660cQm7QN6p6J06K6j95K26j25JQ5j21M5K1q4P4J8o2J34oq6L6k7j18J98n6k5N1
2689F2q0K9K3q6O0J23j62n0J31l5k5M2m9M8k22J89j7j2M3n9P7m8nP6rM1m7p7O8
2718B9p4R3j47K02j40R0J08j63N3L3j61J46m2o8K7k7L5j02J59r6K1P5j10J32r8
2743b5J9j1oN9r6Q4kq2J13l3k9m4N7M2nK0o4L2j4p9J46j83J19O7j58j1R8o8R4
2772D0n5O1J2j26Q0%P1m3L6j63R9M0j37M1M1k5L8kLn2N6K3j12K3l7J16o7J8J00
$$ y = [-31, 15, -16, 25, -126, 4, 8, -24, -7, -39, 31, 29, 54, 17, -32, 101, -73, 58, -43, -81, 123, -33, -3, 17, -5, 11, -19, 76, -33, 30, 14, -64, 117, -20, -17, 78, -102, 53, 22, -26, 48, -8, -22, -11, 19, -64, 27, 1, -52, 81, -57, -1, 28, -65, 50, -17, 4, 13, -32, 38, -33, 43, 4, -12, 50, -12, 31, 19, 2, 42, 11, 39, -30, 21, 17, -46, 79, -32, -7, 29, -74, 13, -31, -24, -3, 5, -42, -34, 22, -54, 52, 78, -117, 109, -16, -15, 70, -51, -6, 15, -69, 5, 23, -39, 95, 89, 3, 39, 12, -106, 92, 36, 11, 62, -18, 11, 34, -52, 8, 131, -31, -81, 50, 15, -10, 32, -17, 31, -191, -2, -19, -31, 12, -47, 30, -18, -23, 53, 44, 85, 38, -39, 29, -45, 48, -99, 103, -37, 53, 161, -2, 51, 84, -77, 69, 27, -41, -14, -41, -6, -108, 51, -45, -24, 51, -59, 73, -25, -6, -17, -23, 36, -60, 24, 22, -60, 53, 20, -9, -53, 4, 46, 41, 61, -3, 29, 15, -64, 82, -101, 18, 85, -73, -84, 14, -54, 40, -15, 46, 58, -68, 12, 12, 83, 40, 76, -87, 12, 52, -85, -44, -3, -28, 10, 8, 11, -41, 15, 38, -74, -51, -88, 28, -39, -21, 79]
2801G9j52J25K4j00M2o9M7L4m8O1l1lp4J00Okl8n8J10m9j1J7k1kk2J5N2j6k6K
2831hj4L%%mN8k7L0m5l1O7ol7Q4o9L9OlOp7K4j8L0L%n5J9J4J7l9N3NM6l5q9O4
2867A1o4L0k5O3n8J00p0o8J24q1p4J04N8o9J09q5j5M1Qj04jJ20l9M4o8pm7J81
2895A18o7k0l6l6O8JK7q8np1J97k5r3R5j14M1r1R5LL5p3J20m5j05J0K5MR7k3p7
2925c3L6QJ6O1j56J54O2j78J4O8r6J47l8q8P3k1k6L4JO7n9j06qM7K1P5j05L8L7
2954D5r6K2l8jR7j0o2Q2m0JL4j26R3k1Q6m9J5m7n1J80k15J36p3QJ00m6j9O6k37
2983a66J35M8o1N2q2M7K1J8r1J52j47P9J0N2ko0j1q9J4L3p0L3J40J6m9JR8o7j11
3012e7N3m1O1j2P6kO2r7l9L1J2M5k1l4L4r5J3N5j19J29p3n0J44j56N3P4q6k5Q8
$$ y = [79, -73, 52, 76, -24, 18, -51, -4, 30, -18, 43, 12, 9, -65, 35, 41, 39, 1, -57, 53, 4, -7, 10, -11, -13, -35, -20, 32, 16, -10, -8, -22, -19, -19, -19, -23, 35, 8, 38, -7, -38, 29, 23, -14, 70, 1, 40, 46, 43, 49, -28, -4, -22, 8, 11, 11, -44, -25, -11, 6, -33, 20, 25, 71, 36, -53, 11, -53, -23, -48, 15, -43, 57, -13, -81, 43, -38, -112, -8, 50, -19, 90, 5, -10, 31, 39, -65, -66, 54, 15, 59, -9, -16, -63, 118, 51, 31, -5, -41, 27, 28, 55, -33, -38, -109, 88, 63, -30, 65, -49, -8, -99, -4, -1, 34, -39, 81, 36, -69, -59, -34, -30, 67, 44, -33, 3, 11, 27, 88, -68, 86, 148, -30, -16, 52, -44, 103, 65, -23, 50, 29, 3, 37, 38, 105, 46, -60, -68, -21, 0, 75, -30, 8, 45, -51, -29, -67, -68, 29, 19, -43, 39, -1, 0, 34, -92, 1, -20, 66, 17, 32, -15, -66, 114, -101, 35, -38, -30, 70, 24, 5, 71, -166, -31, 17, -44, 8, -74, -27, -6, 12, -79, 73, -74, 5, 15, 67, 65, 5, -6, -95, -81, -48, -118, -85, 55, 71, 22, 23, 121, 54, -57, -4, -45, 16, 4, 80, 78, 140, 43, 4, 35, 47, 92, 71, 37, 71, -24, -11, 44, -75, 54, -19, -69, 75, -81, -28, 46, -40, -65, 23]
3041B3l0N4o6k7J1K8L0P3j68Q6q6J4L5K0mJ5O3l5r3O8O4j03K3Q3j00L7LN4q2k4
3071c4K2o1Qj6J28q3k8R5m9j2K2l7J13j21O8Lj9%kJ4%J4m3L4%k4L8ml3K8j5nM
3104EJ5l4K6K6j7k8L0l8K8m1K2N1p7P4r1N5J1Jl0Jo1R6l5k9K7Rml0R5n9J6j0o1
3137e7P8m3k8N5j8N0k6J0J7j8l6%M5j7k8L2jk6kK2nN9r0NP5n6K0rp1N6j4N0k3
3170Fl9O7p4Q5q9%N7M2m1k5K6J9j0m8N4j6J2l1M0n3R5j25L8LP9p2Pn7P1J2lqq7
3203f5Q8l9K3j3J2Pnl8k5NO8q1J42j99J61k5qJ7n5lj5N8K4l2Q9q3o9J16j7N8r2
3234DM6j8l3k3L5M9k5o2pM0K0l5Nm5m8J22k2N0j8lk6p5Q5n7L2K7j9K4J0N8o0q4
3266e3M8J0Pj2NMK1Ll1K7l6M9Lk8o5Q3l1j4K7n5O9l8l4K6rm7Q1L6j1J1m9j7k7
$$ y = [23, -7, 47, -19, -46, -35, -7, 23, 96, -72, 14, -72, -58, -23, -3, -7, 8, 71, 36, -57, 11, 75, -28, -5, 78, -22, 15, 18, 72, -10, -34, -12, -73, -65, -81, 47, -36, -64, 31, -18, -30, -8, -45, 68, -53, 15, 18, -1, -1, -3, 11, 11, 25, -18, 16, 16, -8, 30, 26, -7, 21, 6, 1, 5, 20, -14, 12, 38, 21, -7, 23, -15, 13, -28, -6, 45, -32, 42, -49, 6, 17, 18, -12, -11, -72, 24, -11, -40, -13, -4, -8, -38, 57, -2, 14, 4, -57, 21, -22, -50, 5, -13, 37, 11, 21, 38, 20, -16, -16, 29, 12, -16, 16, 15, -11, -13, 9, 4, 63, -27, -22, 53, -3, 17, 8, -63, -7, -21, 29, 6, -33, 34, -40, 45, -44, -44, 13, 55, 14, -11, 15, 34, 24, -24, 30, 14, 26, -5, 35, -18, 77, -48, -10, -7, 72, 0, 7, -50, 21, 33, 30, 22, -65, 23, -16, 7, -6, 6, 13, 8, -30, -55, -50, 18, -63, 79, -120, 41, 16, 8, 25, -30, -33, -48, 10, 34, 2, 91, 8, -61, 55, 38, 96, 4, 50, 32, -1, -24, 11, 60, 35, -27, -34, 6, 26, -9, -4, -49, -97, 25, 3, 53, 35, 32, 6, -69, 16, -41, -9, 18, -1, 23, 33, 91, 31, -53, -5, 5, 12, 0, 5, 9, 30, 33, 2, 29, -7, 42, 45, 17, -48, 35, 4, -10, 17, -38, 31, -7, -41, -15, -24, -71, 10, 46, 35, 46, -3, -20, -47]
3299d7Pk4M8L4r3J06%n9N4j3O9r9J22j05L5l4%k5LO2Ol9MK%J8p6J4N9p6R8o7l5
3332e1Q2p0rO8Jm6P5q7j5M3j0R2n2LK6p0R5q6M6o2O3j9j9j1lM4l4JK1pJ5n5K8
3365cJ8jj2K8m6M6n3K6k8K9n3P6o9LjN9M5Onn2Q1k6j9p8J8L6Mo3N1j3j3mmmK4
3400CL3J2j3k6K4j1l1L0o4L6J3K3n4J1J1LNrMkj9J5j2PPJJ5Qj8pK2mNQj5RRl%
3439B6qPmrMkNlp%pQj8NlMNJPk1MnJ0%j6L0k3%MRpK3j4j2k5N1K3k9M1k2k9J8K3
3482D4l1m2M5m2L9Nj9Nj6jRQK5n2L2K7k3L2m1J3m0J6LN2q9P9Qn0k0K3N6n7NO5
3516F8r4qj4M6J4K8l9N0l9j8K9l7L7qj8Nm5M3M9k9Jj0o5l7P9NN1ln5jO4n8k8m
3550d1O9Om6j30R5R3l5l0k1P3l8J4l9M3kK1K3j13J15lm7L6N2q5n6M0j0O4o8o7
$$ y = [-47, -40, -64, -16, 18, -75, 31, 31, -28, 26, 13, 82, -17, 105, 0, 35, 1, 1, -24, -21, 41, 47, 8, 12, 14, 14, 32, -44, -30, 29, -47, 51, -16, -51, 31, -39, -48, 20, 21, -25, 50, -37, -52, -9, -19, 73, 21, 24, 50, -20, 75, -11, 35, -27, 36, 17, -2, -13, -16, 28, -6, -5, 16, 9, 24, -31, -3, 15, 14, 2, 30, -16, 30, -23, 3, -25, 4, -49, 27, -42, -39, -40, 19, 64, 70, 65, 13, 94, 68, 49, -29, -11, 25, 29, -34, 17, 4, -9, -13, -17, -21, 3, 36, 48, 35, 9, 33, 22, -9, 21, -43, -7, 6, 29, -25, -14, -3, 0, 5, -4, 0, -2, -21, -6, -18, -11, -4, -3, 12, 20, 2, -5, 17, 13, 18, 26, 11, 20, 29, 26, 26, 18, 25, 21, 12, 16, 14, 19, 16, 9, 9, 2, 10, -8, -3, -6, -2, 3, 4, 11, -10, -6, -11, -1, -1, -17, 13, -10, -10, -6, 3, -4, 19, 5, -7, -32, 19, 42, 13, 54, 32, 3, 21, 44, 13, -29, 16, -26, 13, 18, -1, 4, -12, -13, -4, 4, 29, -23, 9, 36, 13, 45, 4, 17, -23, -7, -4, 48, -41, 38, 46, -4, -24, -1, 55, -2, 3, 68, -26, -34, -48, -2, 12, 40, 1, 51, 12, -6, 23, -14, 23, 15, -3, 2, -43, 0, 49, 20, 21, 11, -54, -91, -12, -7, 44, 41, -14, -15, 49, -9, -37, -41, 28, 34, -12, -142, -47, 46, 11, -19, -40, 33, -5, 9, -30, 13, 11, 32, 55, -58, 57, 54, 7, 43, 95, 10, -46, -6, -16, 48, -20, -87]
3580h7J2P6lOk7J2OK9p0M0kk5K3J7Kp1O5P8n3j1J7l0p3K6N1%mP2r1m1M7L2L6p1
3614a2O9l3m6k2N7l3m6P9k6M5l7O6oj01N7K5j7l4n4N7l2L5L5k5L4j5L8l4n3L7
3644HK1k8OM6p9M3k0j7K3K1n0N7m4LL3l7K0J2l6oKNJ4KpM4n6K0k5OK3l4%M5L2
3679D7j5p4L9O2o6K7Ol1L1Jj4JL2m2j3M3n0N2rk8J7n0M9l7NJ3MK9j5K5l1Qm6J6
3713a4MMj7M5j5l3l1L3Q5o0oKM3lpJ2m3M5l6J0kO1n5KJ2Qj12J10l8K5o3J0K3m7
3747d8K3j6L1m0L5j4j0M1LRl3L3m8J8L0l6N4p4N9l5P1l5R2r7nl1n8P3K4j6J7Q0
3779I7p1l4k9M8p2Q4l6j0K4n5M1K4qk7nK5%k0K8j5k1O5p7O8k9On8R4j8m6n6P5
3811hN6j16J35m0n7N7J4k7m8M0L2Ql0j1N4J3o4P4q9jM0n0P5m6n6J0J1M2o5J4N
$$ y = [-87, -75, 1, -2, 4, -23, -11, -5, 24, -46, -6, -8, -33, -10, 7, 9, -62, 3, 81, 28, 17, 34, 4, -69, -43, 8, 8, 4, 76, -15, -56, -9, 23, 59, -12, 57, 24, -22, -44, 13, -20, -66, 13, -13, 32, -5, 61, 55, -46, 11, 36, 19, -15, -69, -12, -44, -9, 26, 1, 35, 20, 58, 24, -29, 8, 29, 1, 7, 53, -26, 17, -3, -20, 3, 24, -26, 31, -13, -10, 23, -14, 6, 18, -18, -24, -22, -17, -3, -1, -8, 36, -20, 0, -25, -19, 4, -30, -30, 15, 47, 32, -42, -3, 59, -7, 20, 26, -5, 26, 27, 13, 14, 46, 4, -9, 34, -16, 36, 27, -1, 16, -34, 15, -22, -17, -4, 0, 29, 14, 39, 8, 16, -30, -14, -10, -6, -23, 22, 7, -26, -57, -24, 61, 1, -5, -3, 40, 37, 30, 42, -1, 44, 8, 18, 16, 77, 22, 24, 36, 44, -68, 42, 4, 29, -34, -24, -1, -48, -25, -41, -10, -50, -15, -29, -39, 2, 5, 14, -19, 14, -34, -16, 14, -22, 32, -42, 17, -18, 53, 18, 110, 13, 8, -23, -81, -8, 16, 0, 17, 97, 26, -8, -37, 11, -61, 23, -13, -23, 1, -54, -13, 11, 3, -24, -29, -4, -4, -24, 4, -11, -32, 33, -44, 24, -5, 1, -57, 37, 19, -27, -83, -8, 48, -68, 67, 27, -30, 27, 41, 14, -34, 6, 38, 46, 16, 5, 59, 72, 8, 82, -7, -8, 32, -18, 57, 11, -45, -35, -24, 18, -47, -33, -28]
3842b8LP6p2O3r3O0q4J08qn5J1K9j2J14j38L8M3q3N8l8QmO3j5o8jML6k8kmk3M4
3875BN9k1m9K4k4M6l5mjK0Nm7M2p9J05n8M3k0J3K9n3M3k9pLM1l7m0K8rPm6L2M3
3909B6m3L0L9n1k4J5k7L2%J6pk5j7PN5m8M5k9j0N7lJ2p4K1KP0k6n1lMJ4L6l3L5
3943D5o7O7n7QN0n5o5M9K0R5r4k1K3M1n2l1M6J53j51n6pJ8P7p8P9k9OJ3Kk4p8
3974g3R4Nk7k9M7K5n2LM5k0K2p5J20m8lon3l1M6N8k0jm1J4k2K9k1npj8M1l3N2
4007A6l6oN0KRK9j41N7P6j7k1M3j7J5p3qL7p8O2l6J8j0L2rJ9O5j2J2o3m4L9J8
4039B8J3r7J17m0R4p2J1j08K1l5O0JLk5J4K3rL2l0q4M3P5o4O0l9Lj5mJ7L5k8j8
4071a8l3M0j4KR7M8j45L7O2j24m9J16LK1j09M9Kk4K3K0L4Ljj63Q0O9Nm6k4J11
$$ y = [-28, -25, 51, -21, 42, -51, 9, -75, 33, 25, -30, -19, 10, -2, 112, -26, 12, 55, -28, 30, -8, 0, -4, 59, 44, -24, -25, -21, 15, -13, -15, -19, -42, 2, 61, 40, -9, 15, -9, 37, 2, -2, -3, 17, 22, -25, 17, -62, 43, -15, 28, 8, 21, 50, -3, 40, 11, 4, 7, 48, 11, -29, -1, -10, -3, -49, -17, 26, -17, 13, 52, 1, -23, -8, -35, -3, -3, 13, 6, -19, -36, -29, 26, -22, 23, -6, -16, 41, 38, 50, -24, -3, -1, 69, 43, -8, -11, -7, 7, 43, 10, 45, -22, 45, -12, -4, 46, -9, -74, -25, -5, 90, -4, -25, -2, 39, -13, -44, 2, 155, 4, -52, -59, -41, 36, -42, 37, 8, 14, 27, 29, 5, -73, 21, 26, -1, -30, 17, 42, -10, -7, 38, 18, 40, -35, 85, 37, 34, 28, -25, -56, -10, 48, 28, 27, -14, 0, -22, 7, -14, -19, -26, -44, -3, -36, 16, -20, -26, 24, 26, 35, 64, -77, -20, 56, 39, 18, 61, 44, 59, -14, -22, 15, -63, -1, -37, -19, -29, 3, -6, 13, 78, 66, 78, 15, -29, 10, 28, 41, -56, 61, 21, 115, 43, 54, -54, -33, -68, -8, -7, -4, -29, -15, 8, -1, 31, 1, -83, -40, 35, -29, 31, -8, -5, -20, -24, -7, 28, 0, -18, -51, -11, -25, -23, 74, 122, -23, 14, 76, -48, -97, 19, 22, 43, -66, -17, -15, -39, -16, 4, 38, 41, 40, -123, -43, 26, 31, -15, -39, 72]
4101G2j55Q0R4r0l1m3J44o3R8o0o2rl9J7l0N2lm2J03J8o8r6K6J21J2Q4j63jJ19
4130H5r5L4j1p2J61j25j9J12p5j34K18j36J88k15J04m0j33K03N0m9k0j69K52m2
4154G2o2nL1m8J7P4j3j01P3l7Jq6Q0R5l6r7l7K8j7Q9Qj31Q5P3q1R4r4L0m0Q1m2
4185DJ8nj13R9q6KJ32k7o3J2K8J10k49J42%J06p1k1K3N6j29L9Q0l7j36J52o8o1
4213f3J18n5mM7n3q2J98r4M3r0K6O0P1l4k5o4Q7k2p4qJ37o5K4pr1Lj2R5j45P8
4243aK6j19J58o9m2J20j76P3O0j69P4J22lr5o9lJ87r5r9N3R7K0M9j52K0J06Qj8
4271F3p9NO7p7R8k8j51K71j08K7j13J53j60j9K1L2kK2Mr8N8Pl2J8M3L8q6rM6l8
4301b7J2J0oN2o9K8k5M2k3NJ2K7k1o5P3j7M1j09K5J01o0N3k3J4p3K8k4Q0n8q1
$$ y = [72, -83, -3, 91, 1, -30, -73, 71, 8, 106, 46, -16, -25, -64, -47, -77, -25, -28, -70, 33, 51, -17, -113, -87, 34, 46, 130, -33, -34, 85, -10, 24, 13, -59, 102, -23, -42, 70, -5, -139, 79, -57, 131, -84, 20, -20, -153, 50, 100, 51, 31, -138, 114, 72, 10, 5, 36, -12, 5, 79, 66, -35, 38, 1, 2, -84, -4, 91, 55, -42, -79, -51, -68, 21, 29, -102, -17, 56, -25, 69, -25, 5, -35, 46, 4, 22, 17, -96, 3, -83, -81, 51, 24, -39, -27, 1, 111, -138, 4, 4, 110, 39, 18, 41, 97, -32, 7, 87, 50, -86, 66, -2, -63, 55, 0, -4, 43, -10, -92, 106, 12, 55, -35, -9, 51, 122, 88, 63, -1, 86, 64, -10, -18, 119, 54, 78, 71, -20, -17, -29, 66, -79, -1, 25, -94, 64, -5, -47, 73, -103, -30, 30, -139, -65, 57, 54, -41, -110, -113, 74, -21, -120, -67, 30, 50, 99, -53, -33, 73, 81, 63, -16, -11, 56, -21, 77, 49, -102, 169, 61, 88, -25, 128, -32, -51, -30, 2, 0, 22, 26, -72, -14, -7, -39, -21, 22, 60, -26, -35, 11, -27, -15, -5, -11, 41, -28, 0, -25, 17, -6, -1, 11, 38, 17, -48, 25, 8, 49, -60, -35, 66, 6, 59, 36, 50, -23, 5, -19, 61, 3, -78]
4331g8J19n1O1p5j2J0oM9l6k0M9k4J2O7n7m4J3M5k6Rp%J5l7NRK8K5n4J0pL6Qj9
4365A7Lj2m2N7j4J5j6l5K2L7l3O5p2KM3k8Pm4%K4p9J01j1K0l9JK4j2j5N8Ko8K4
4398BM5m2j7K5K6j6nK4lp2L1J6NOnj5l4K1j0Q6q9j6J5NJ1l0K9j8j8m8Q8k0L3n4
4432d4O2Mj6Q0n6j7j0J3j4m0O7k2%nl9K9O0m0N6n7o2O4L2j00J00n7K5M1n4j1n
4463a6nJ1Mk2L5k9K6k2k6O4k0Jj8Q3n6M6j24M0O2m5O8mrm3M8l9O1m7Mn7O9m2N8
4496E6r1K1K0Ll3j0Ol3L5OJ7M4p4N2j2j5Km5N3K5j8O4p1J6k0m5O0K3l2nk4j1P2
4529C6m8K5OMl0OKk9M0oJ2n7J9K8k5P2k4m7kM0n7L9K0l7J6L6l3Rj0L0l7m0M5L1
4563C4q7j0J05l4rM0J2l1n4Q6M7j30P0n3J01j56R4JolRj7j2L5n7k0M0j5M1Oj4
$$ y = [-78, 41, -10, 51, -24, -36, -26, -32, 17, -19, -39, 10, -14, -2, 65, 8, -36, -23, 22, -4, 5, -2, -2, 13, -24, -19, -10, 18, 43, -11, -1, -8, 28, 36, 17, 20, 8, -34, 23, 9, 24, 8, -27, -5, 32, -1, 64, -8, -6, 37, 9, 16, -28, -28, -4, -83, 18, 7, 27, -12, -11, 13, 1, -14, 44, 46, -22, 2, 47, 5, -12, 13, 39, 23, 18, 42, 39, -33, -2, 14, 19, 25, 20, 5, -29, -8, -18, 68, -21, -37, -22, -17, -6, -36, -7, -25, -43, -91, -3, -23, 10, -44, 18, 22, 6, 86, 30, 13, 3, 16, 2, -38, 29, 7, 7, 2, -37, -8, 52, 12, 68, 11, -51, 13, 45, -55, 45, -12, 13, 54, 0, -11, -16, -21, -10, -6, -28, 7, -22, 4, -18, -44, 20, 0, 1, -17, 66, 10, 56, -68, -28, 34, -11, 57, 53, 44, 1, 49, 10, 71, 24, 28, -29, 40, -2, 56, -35, -14, 6, 9, -24, -34, -28, -61, -26, -20, -3, 41, -33, 19, 7, -8, -6, -51, 2, 27, 9, 73, 2, 18, -2, -47, 13, 36, 4, -1, -25, -36, 36, -12, 13, 19, 23, -7, -1, 1, -28, 12, 6, 18, -39, -20, 8, -17, 55, 31, -16, -18, 22, -35, 4, 24, -13, 3, 39, 6, 15, 5, 35, -2, -42, 3, 34, -53, -63, 42, 8, -1, 39, 51, 20, -34, 52, 99, -31, 39, -14, 87, -69, 25, 26, 20, 17, 26, 9, -3, 32, -25, -45, -5, -20, 21, 27, 13]
4594A3k8m5M2MoK4%j6k3O7k4K7p2Q8n4k3L9M8j9p1O7k8l2J4j6K5L5k9kqj3J0%
4627fJ6n5O6J2j9j1K5k4QJ1k2OJj7L7J2n9l1K7P9j8k5k1L0q4J30m8N4q3M1K8o7
4659gM2rM1m8lo7M0K5q0Q6m2lL0n3O5k7J0J1Ln7O5K5km9PK2KJ8j9J3l0N3q1M6
4693B7J5L4l3ro6M2J8N2p2J1OrJ1l4j2l1J4M3ml8k7R8k5M9q4rN1j8M7k4o3r%L
4727d6L6l2M3l2O1J9o0jJ9oQ9n6j9k6kkP9r2P2rk0k8K8k5N9j22Q7q2k9J9J3P0
4759EJ0m7MK9pj8K1LJl6O6l5k5N7j9R%ko0P8k4Pk3M2k6ol0K5L5J1n0lM3rp1L8
4795gO9k0j38J30m1o0K4m3J14o5J9Lm4J4J7N0n2K0KmK4J4J5l7%J9l3K2J3k9L9
4826C5l2J0l5J8jK2k0j9M4l2j7RkJ4ll4nK5J3OPJ3l4L1k4nK7JJ3k2J7j9kKKK5
$$ y = [13, -15, -60, -18, -14, -20, 4, 4, -12, -35, 32, 8, 35, -37, 51, -3, -26, 13, 61, 42, -29, 38, 10, -22, -8, -24, 1, 36, 7, 5, -3, -16, -6, -6, 10, -45, 21, 33, 14, 3, 28, 4, 12, 23, 1, 7, 8, -9, 28, 40, -19, -50, -23, 56, 38, 13, -8, 22, -62, 68, 20, 74, -9, 32, 60, -7, 35, 26, 67, 19, 16, -51, -11, 14, -66, 20, -22, -25, 5, -48, 17, -10, 0, 11, 14, -43, 22, 47, 45, -4, 3, 25, 27, 45, 26, 39, 9, 62, -19, 27, 42, 76, 43, 34, -32, 10, 28, 80, 8, 19, 25, 16, 27, -7, -19, -50, -36, 7, 3, -35, -62, 36, 11, 60, -24, -33, 18, 0, 47, 23, -40, -49, -49, -46, -10, -42, 1, -31, 30, 49, -11, -12, 7, 1, 90, 34, 15, -11, -13, -15, 64, -28, 44, 35, 15, -13, 15, -10, 49, -73, 14, -68, -97, -78, -65, 5, 15, -32, -28, 1, -6, -24, -3, 0, 1, -35, 31, -4, -29, 28, 9, 18, 18, 16, -44, 34, 10, 17, -6, 36, 10, 4, -26, -1, 34, 45, -5, -8, 35, 26, -45, -7, 62, 42, -96, 34, -7, -67, -43, -86, 28, -37, -18, -15, -59, -45, -28, 22, -30, -10, -8, -12, 12, 26, 41, 4, 4, 23, -10, 12, 25, -4, 35, 3, 13, -22, -4, -5, 17, -3, -22, 22, -10, -27, -18, -20, -6, -9, -43, -48, -23, -10, -4, 3, 16, -18, 13, -11, -16, 11, 12, 25, 3, 20, 1, -1, 1, 3, 28]
4862B8l4N0k6qk8j0M0j0K2PK1k5l9k0J23m1k8J8k9J9q6O9k0J4j3Kk4N2n4L6n6
4893e0M6KJ5k3J9j7J3j9k7R9j24N9P9om4mLNl3p7J19n8k6N2m7R4j7p0J07m9l5
4924a4L0K3j37N2P1l8p0P8n9J41o1m6N5O3l9R2j36O2n7NPm1J0L0j2l6RrO0m3Q
4955bL1Pq8O0M9n3m3J56j15l6N6m6J31r1j22J19l9K9R9j77O7JN2N5r5k0P1k7j
4984B8rP4o4m0N2m4J2N5q8P3p8L2M6j0n5N6K1j47Q0M2n8N6J2m3J1J2Mo5nJ3j2
5015c9P1n7P9m3p0J38p8K0L1q9L8PLJ4J1k9kK2k3L2j0Jj8k8P2n8Oj5%J3J2k2P
5048doMj2KJ8j4n%QJ1j1K2lnj1KLL%MK%pK9k7J7l0nM4k9loRJ1%rk4J6Mojj4Np
5092b5NKQmoJ6oJ2k5J3Pj1L3k2l1N2lmQj7k0M9m4J8j0nK0j4K0m4L5m5L2j3M6j2
$$ y = [28, -6, 44, 18, 10, -18, -28, 12, 2, 24, 31, 52, 27, -12, -32, 91, 50, 22, 40, 11, 30, -56, 13, -7, 7, -6, -4, -28, 24, -30, 6, -50, -4, -2, 13, -10, 9, -8, 5, -14, -41, 58, -66, -7, 72, 66, 22, 18, 21, 26, -7, -84, 35, -23, -49, 3, -44, 50, 33, -37, 70, 21, -14, 16, 39, -98, -46, 25, -13, -83, -5, -64, 77, 16, -30, 25, 88, 49, 141, 5, 67, 10, 15, 22, -19, -9, 21, 9, -27, -18, -27, 33, -10, -2, 29, 36, -52, 8, 57, 4, -39, 117, 2, -34, 22, -24, 107, 16, -106, 13, -26, 3, 102, -75, -8, -7, 45, 100, 5, -15, 56, 29, 28, 19, 93, 29, -11, 41, -3, 9, 64, -24, 49, -29, 3, 49, 39, -16, 40, 61, -86, -6, 36, -22, 34, 46, 3, 14, 26, 30, -35, -40, -27, -39, 32, -25, 54, 11, -59, 79, 1, 21, 52, -37, 1, 8, 11, 25, 36, 7, 5, 27, 4, 36, 26, 27, 9, -19, 53, -5, 1, -14, -14, -1, 11, -11, -4, -10, -6, -18, -16, 2, -12, -17, -17, -9, 2, -9, 13, 10, 5, -6, -4, -1, 2, 2, 6, 8, 8, 1, 30, 3, 20, -10, -15, 29, 0, -3, -9, 0, 11, 11, 2, -22, -6, -2, -8, -9, -23, -18, -25, -20, -18, -10, -14, -20, -4, -10, 2, -23, -10, -3, -14, 19, -3, -34, 18, 15, 11, 19, 2, -18, 31, -13, 5, -5, -10, 10, -4, 16, -28, 7, -38, -6, -19, 27, 15]
5128A5mj4k5L8k8m0K4J0N1m7M0j9o8M4Pj4J0K2pk6L3Nml3O1k7JOJ0kMm9J0M1k6
5163aj3LK4K0K2r8L6J0j1LJ9j1J3j6O5j41M7J0J7m5K8J8K0j4K3k2J8L0j00M7m0
5194c9k0O1%M5l2J9jr6J20n5K7M0Kp8ML2L%r5O4OqL6o4Q7p1KJ7m5Ok8O1MM2l9
5229GOj1J6l9M3j9L5j9MKk9J4L2l5K3j6k7oL0nk2K5p5L7L7j1j2J3m5N8l0LqoO9
5264C9q9J9M6o7K1K8K0m2J6OJ4j5lPN8j9mm6MJ9J8n6P8r0O7J6m0J5J8J5p2J0K3
5297A4j6K3j7o2O9pp3J24m0k8N5M3j21O0Mp6j1J01Jk4k1j19P9j1J09r0N4j2l1
5326b3K5L9k3L4j3j4p8M5l9J6O9o4L9j5Kn4L5J6n5K6K8l0J1p1J05n2Q9m3o9N3
5356a1k2N1m4RJ6M3j7k1L6k8j3L9k7J4j0nl4Q7p5Km7P3m3n4J16M0q2K7N1o5o9
$$ y = [15, 11, -3, -28, 10, -18, -58, -34, -24, 27, -20, 20, 1, -67, -23, -16, -30, -20, 2, -5, -31, 2, 7, 3, -30, 31, 4, 5, 11, 21, 19, 23, -26, -16, 25, -1, -14, -11, 13, 33, 55, -43, -7, 3, -8, -5, 14, 3, 16, 0, 65, -76, -29, -19, -2, -47, -19, -1, 19, 5, 28, 6, 24, 54, -46, 1, -39, -59, 2, 2, 47, 15, 34, 33, -63, 57, 2, 29, 69, 71, -7, -3, 29, 32, 32, -63, 1, 7, -1, 35, -29, 58, -13, -11, 6, -39, -33, -61, 0, 4, 46, 7, 13, 2, 18, -21, 22, 3, 38, 19, 23, 25, -4, 10, 42, 7, 30, 14, -13, -19, 11, 6, -16, 9, -66, -29, 8, -3, -15, -2, -47, 11, -19, -16, -24, -30, 39, -50, -31, 15, -52, -31, -3, 17, -25, -9, -3, 11, -4, -7, 0, 58, 39, 35, -11, -7, 12, 30, -26, 52, -38, 29, 45, 5, 20, 38, 53, -19, -9, 14, -2, 21, 4, -58, 11, 4, -69, 55, 15, -13, 42, 85, -36, 24, 28, -48, -59, 42, 43, 19, -2, -121, -42, -53, 56, -34, 20, 8, -23, 2, 41, 18, 52, 39, 25, -53, -8, -47, -31, 38, -26, 13, -2, 0, -54, -19, -3, -58, -32, -4, -34, -23, -94, 11, -41, 48, 5, -64, -11, -33, 18, -26, -17, -1, 42, 25, 4, 40, 12, -1, 38, 11, 25, 15, 10, -24, 63, -12, -10, -57, 16, -27, -81, 35, 75, -7, 20, 71, 6, -63]
5387f3L2J7L1m2mj8Q8o1K3j3K3k2JJ8o2Q8L8k0j09N9J4l6n1N0J8KNQQJ0kp5L8
5420gn0L3O3N4j60J17k0m2joL7l4m2kJ64j49j2P6m3J7JrM2n5P5m6kP5n9J1M5l9
5452C2ok8K3K1n4Ql5M3J4qLk3jl1N1l7N4j1l3qL%l2L8O0m8oj2M4k8N0l7k9J7j5
5487b1O2o3M1LRp2L7K7oOj1J4jl0L8J7o3%j7J12j10N0n5L1L3n8j8N9k2no6O1j7
5520c5L9L0n7MJ8L7q8L2K5p0J1P9k7J6Ml0k0L9J6k2kJ4N9l9K7p8j6j9L2N8j21
5551h4M7M6j03J27nl8N6j25K7J55j24Ln0M8j6R7j0q5M0K5qm1O8n2j5k7P0o3N0
5580A3K4j6Kmmk7kP2q0N5oo1j9K4J5%L2r0M6R6o5qj7mN8n5K6Rl1JJ5M0l4qM2k1
5616A8J3j7M4l4k1M6q3K2k5N6l6Nj6J2L3l6K1J0%l9J8k3K4mK5k3LPK5j9l1l4R9
$$ y = [-63, -31, -14, 17, -25, -29, -47, 41, -20, 3, -10, 13, -9, -8, 10, -52, 36, 74, 54, -55, 4, 18, -18, -69, -19, -1, 1, 6, 14, 22, 32, 30, -45, -7, -57, -24, 39, 93, -67, 50, 30, -12, -13, -19, 18, -16, -58, -60, 104, -45, -57, 19, -24, -7, -6, -15, 27, -28, 47, 1, -1, 74, 15, 26, 71, 32, 26, -2, 21, 42, -12, -4, -39, 4, 18, 10, 13, -10, -11, -42, 9, -28, 26, 15, -18, -26, -23, -23, -55, -17, 43, -5, -11, -23, 21, -7, 43, 6, -23, -6, -21, 41, -22, 19, 22, 31, -41, -4, 23, 17, 23, 12, 26, 25, -5, 33, 50, -13, -13, -30, 82, -28, 22, -33, -2, 31, -27, -45, 14, -8, -13, -79, -18, -35, 4, 34, -23, -19, -1, 36, -52, -20, 5, -65, -54, 25, -2, 14, 18, -12, -32, 7, 23, 1, -1, 13, 72, 33, 60, -18, -34, -53, -21, 37, -84, -37, 9, -94, 33, 28, -10, 46, -79, -52, 103, -21, -18, -68, -20, -36, 61, 51, -34, 6, 31, 23, -18, 50, -2, -17, -44, 26, -37, 13, 37, 21, 23, 19, 15, -12, -14, 58, -22, 33, 27, -34, -53, -29, -14, -14, 18, -72, -26, 70, 5, -3, -20, -24, 34, -21, 5, 14, -17, -16, -1, 39, 5, -3, 39, 18, 31, 14, 58, 24, 3, 49, -34, -12, -37, 19, -17, -12, -28, -16, 17, -19, 2, 12, 12, -27, -9, -32, -8, -12, 13, -10, -7, 0, 25, 6, -25, -59, 40]
5649D0l7J4K4k2Jj4m0O4L0l1lmj7J3j5L5jn2k5K0K8l2O4l4o1O2k5k8R2k0n0PM3
5682B6O7j17k9lN0Om4rM2J09j58R5j15K7L2J0P3n1m4M9L4o1P2p9M2k3L3n4l6O3
5712Gj9K6j5m1K5K3m0L3j0p7kM2J11j40J07r7oOJ16Q8k31O2K4J1n7Q6J5l4K4m0
5742cK3M3o7M4q6N9k7J9n6Q1km0J8J7L5q6k7P1L0m7j9KL8m0J4Qp6N5%RN7ml3k9
5776a9L2Oo7K2J9JM7m2J4k5J9j6k0NJ8l7K5nJ6o0J28l8m2M5o4N3Rl6p0R5J6p9
5808e0O3m9N9l3K7l6j0K8Jk8l0M7K5k7J4j2k3K8M3o1M5J2l4N0n6mO0l1J1l4J4
5839Io9N5n2j9M1N1k9M6n0M0l0Mll9N8K7q4K8j5ON4l3K0k8K5k3O2%k2n5O2j0n5
5872b8J00q4J1K7o9K8nQ7k5qo2L1m4M7J7o6N2lkj7K7m1oJ8Llj9k1JN9l5R1p7K7
$$ y = [40, 3, 17, 41, 19, 20, 6, -34, 30, 60, 29, 26, 22, 5, 18, 3, 38, 37, -15, -40, -20, 8, -24, 40, 6, -55, 7, -18, -46, 46, 26, -24, -17, 26, 93, -24, -53, -56, -6, 0, -44, -53, -11, 98, -60, 35, -80, -53, -21, -11, 62, 11, -33, 16, 50, -11, 61, -18, 24, 1, 34, -20, -56, 7, -12, 14, -1, -42, -17, 6, -34, -1, -11, -88, -90, -48, 63, -77, 30, -67, -73, -67, 49, 137, -94, -32, -8, 3, -54, 32, 47, 13, 37, -3, 20, 63, -4, 40, -46, 13, -14, 5, -51, 30, 28, -12, 6, 23, 58, -28, -55, 16, 46, -1, -20, -18, 20, -20, -6, 2, -74, -19, -19, -10, 47, 43, 10, -19, 13, 19, -48, -26, -7, -6, 41, -1, 13, -12, 7, -9, -29, -24, -6, -43, -18, -23, -7, -67, 61, 23, -19, 26, -38, 15, 24, -12, -82, 13, 29, -50, 13, -36, 23, -10, 17, -19, -29, -1, 0, -28, -58, -11, 14, -13, 1, -11, -34, -6, 37, -24, 21, 33, -1, 49, -7, -11, 49, 18, 29, -5, 9, -60, -5, -57, -76, -35, 16, -13, 33, -17, 23, -7, -3, -6, -45, 13, 40, -44, -16, -31, -25, 29, -4, 16, -12, 13, -10, 52, 52, 30, -25, 37, 27, -28, 72, -12, -1, 26, -43, -15, -20, 67, 42, 34, -28, 3, -41, 6, 23, -43, 9, 6, 4, -13, 14, -27, -33, -15, -12, -15, -34, -55, -54, 5, -30, 61, -16, 11]
5906A1%J7m0NJ6R3j50L1J13j01k5M3J3N1k2po8oM8k9Q6q2l2M0pjj9L1m9J9NL4
5938A8k6Nl3K9J5L0rk0PNqnlJ7rm7M1L0pk3mn8J33o9J1m1J4k7K0LkML1n2J1L9
5974B0k2k4M0q6N2k4L8j8j4M5k7K7l9M0l8L3l5M2L5o6J9qN0J8k4l4J1l1L0j2L5
6005C3M6r9j8O7j4ml7L3K9m4k6N5k6k9K0L6m1K8L7r1K7P6p0q6J30l7L1o4kP1k3
6036Hmk6M4n8L0N7q2N2Jl2J7l3n9M0j2N0j2J4k3J8L0q2J20j17N6l1k1K7P6j23
6066g5L0P3L8m9j2m8MJ31m1M0p7P0n6kk1O6l7N0K2j18L0nkn6k6O3K8%n2j03R9
6097c6J10M3j79P6q5J20k8m9l2nJ00n6L5K2n4J3j5R3j0J9k8Kj19J64q9K0j9l5
6125b2O0qj1o8L9m8oJ2N9r5O5j5LM3J0l7nL7p7N3M8q1M5J3oo5nJ20m6M2k5o9Q4
$$ y = [11, 11, 28, -12, -7, 9, 102, -48, -17, 96, -5, -30, 13, 26, 77, 55, 48, -20, -26, 22, -7, 79, -3, -35, 5, -2, -3, -22, 9, -40, -21, -16, 18, -8, -3, -36, -7, 8, 38, 29, 9, 16, 21, 13, 8, 5, 22, 13, -34, 7, 37, 30, 7, 3, -55, 78, 9, 20, -21, -7, -34, -14, -11, -13, -9, 22, -30, -19, 20, -2, -26, 14, -72, -20, -44, -6, -24, -38, 7, -20, 7, -32, 8, -30, 3, -32, 10, 45, -21, -2, -10, 40, 58, 34, 0, 11, -20, 10, -2, 33, 79, -20, -38, 29, 15, 11, -26, 7, 36, -8, -34, 21, -5, -34, -14, 22, -19, 9, 46, -45, -18, 58, -12, -98, 32, -5, 26, -38, -40, 31, 8, 4, -22, 22, -36, -6, 51, -31, 21, 22, -10, 7, -26, -85, -45, -57, -7, -19, -5, -28, -10, 20, -62, 58, -59, -3, -34, -55, -28, 48, -75, -45, 28, 66, 17, 5, -43, -39, 92, 51, 91, 14, 84, 28, 26, 5, 71, 34, 84, 106, -12, 18, 13, 11, -45, -71, -8, 20, 20, -32, -135, -36, 74, 117, -62, 14, -71, 49, 21, -28, -60, -65, 35, -21, 14, 36, -18, -5, -20, 73, 63, 82, 54, 56, -63, 101, 12, 32, 13, -22, 38, 30, 19, -49, -10, -58, -64, -52, 7, -88, -23, -38, -35, 8, 18, -19, -24, 13, -64, -11, 37, -44, 1, 14, 8, -57, -62, 58, 12, 54, 29, -40, 44]
6158D4n2l0J18l3l1N7l9L1n8K9l0j9R5j68O1J9O1o8lj13K3K18k10m0Q6LMM8o5
6187f2M7mk3mM9l4O4Jj00N6l6j8J52o2j9K2n4M0oN8o5M0n9j8R3l5kj3KK7m8p3
6219h4J20O5q4j6m3J6P8k6n3mK1o1J47j02Q8Kr6N1o9P9L2l4L9n4p6J08l9J0j8
6248cJ9K9J7n0J8l1L0PM3j31R3k3J2j9r7K0R0m4o7J10l9L6l8rjo3M9O0l3P3j1
6279D7K8j9m5m3N5j4l4kRj7N9k4L1N4j11K9R4q2n8K3LQ6n1l6J1p6L1N9j6M6m8
6310a1R2j34M3QJ8L7J2r4Q0n4j2O8j05Q9q6M9j4PN3q4O4M6r6J35j64K2J7k0k3
6339e7O4J7q3J19m4j0J4j0o0L2L0%Mql3J23j48O5j5K4o5l7O9l4O4j9K3n4N5J2
6369C8o4L1l3L8K5kL1j23J5L5J9m9M8p0J8PO0j6j4M6p4K6j2J5j1j08J25j70J23
$$ y = [44, -8, -38, 80, 47, 16, 73, 34, 65, 7, 36, 6, -13, 82, -86, -25, -6, 55, -13, -16, -129, -106, 112, -98, -138, -52, -49, -45, 3, -62, -15, -19, -42, -46, 3, -31, 33, 34, -66, -10, -46, -64, 88, 26, 7, 29, -25, 15, 9, 67, 2, 42, -17, -35, 58, 23, 21, 8, 10, 37, -11, -84, 36, 101, 17, 1, -42, -26, 52, 26, -27, -31, -10, -71, 76, -26, 62, 64, -32, 19, -50, 29, 61, 27, 66, 12, -64, 44, 5, 15, -3, 16, 45, 62, 12, 30, -1, 29, 36, 79, -52, 41, 18, 30, 11, -86, -66, 24, -20, -87, 23, -16, 20, -18, -27, -28, -91, -42, 18, -15, 58, 47, 75, 56, 11, -32, 23, 9, -25, -27, -18, -35, 24, 0, 31, 85, -26, 3, 97, 15, -43, -20, -17, 69, 18, -18, -7, -83, -52, 7, -9, 37, -11, 81, -53, -10, -2, 16, 53, 65, -29, 51, -3, -15, 53, -52, 37, -49, 0, -14, -7, 46, -38, 26, 72, -24, 111, -53, -31, -14, -34, -57, 7, 24, -59, 60, 16, 6, 20, 10, -50, -18, 12, 12, 16, 8, -25, 98, -50, 15, 0, 24, -41, -78, -9, -43, 21, 2, 25, -29, 26, 38, -26, 5, -28, 10, 35, 33, 64, -59, -44, -9, 10, -39, 9, -61, -43, -36, 24, 8, -6, 40, -34, -8, -20, -5, -16, -124, 1, -169, -46]
6398d6Mk8K6m0N4J30j13k9L1q8R0M3j17J02j3m6K8l6P9J3m3NkJk6pn9Q3l8p5J33
6429A6j1j9o9K0J1Q5n5Q1j64R0O2m7l1O6n4KK3k8M6n0N5p1K4K2K5m8N8o6J30r
6459I4j48P7j33R9M0J1l2J2nN2j38q9J19l8Q1j49R6k4Q7l0J62j61q8J17q2J0J6
6486d4L3o4R8L9j15P7JP0k00J39j4n4P5j4N5j06L0o9O1J5P9j78J68n8o3L7j7O3
6514D4n2qQ3m6n3N0m8%m2L8J3K8k5K4Q1j17J2j8N6K4l6j0K2knn9Q2j1k7j7pK7
6546Ao1J16o0L1l2K8q1J5N7o4K7Mk3N3k2j7J6k6L4j9K8j0j6K7k4K8j5M1m2lL9
6577C0k4pJ9k1j1OJ8qJj%J7j4J8j9lj0JlNqLnkQnnJ3jKJ3k4JNMJ1rJkKJ2qKMm
6622BMK3k1KJoj5K3lnpJ6p1N6L4J3o6M3J2o8M5m7P9o2j0N3o4J4N9j07J29k9k2
$$ y = [-46, -42, -70, -44, -84, -30, 100, -13, -42, -11, -99, -9, 34, -83, 19, 6, -40, -12, -48, 31, 44, 1, 6, 4, 5, -21, -28, -87, -4, -42, -117, 16, 5, -14, -83, -63, -52, 33, -22, 59, -105, -15, 47, 0, -31, 35, -19, -17, 6, -22, 24, -26, 29, -42, -18, 4, 29, -19, 39, -27, 103, 94, -54, 23, -110, -11, 29, 40, 8, 20, 15, 67, -71, -160, -41, -79, 2, -147, -51, -75, 12, -18, 144, -17, -105, 12, -70, -60, -44, -11, -75, 23, 62, -53, 24, 25, 95, -105, 34, 20, -34, 41, 27, 82, -24, 6, -63, -2, 13, 92, -86, 82, 24, -39, -2, -19, 44, -8, -16, 67, 21, -32, 18, -30, -30, -72, -34, -21, 7, -18, 6, 87, -30, -18, -36, 20, 44, 8, -2, 20, 18, 13, -46, 36, 25, -2, -19, -26, 1, -60, 56, -4, 27, -5, 23, -58, -43, 14, -50, -23, -19, -42, 11, -11, -28, -12, -38, -4, -23, 5, -5, -21, 6, -18, 10, -5, 36, -6, -9, 30, 6, -1, 18, -3, -14, -8, 10, 2, 3, 2, 2, 19, 5, 23, 4, 1, -9, -8, -11, -6, -14, -11, -16, -18, -10, -15, -20, -7, -8, -6, 7, -17, -16, -11, -7, 4, -5, -4, -6, -4, 8, 0, 2, 6, 2, 6, 29, 8, 10, 11, 5, -10, 13, 10, 5, -2, 14, -57, -1, 33, 46, -20, 23, 35, -33, 12, -35, 44, -18, -28, 25, -39, -25, 34, -73, 56, 27, 5]
6655El9O5o5j04J28N6m5MMn6N6K0l5ll9L6K4l1Rl2L9KM6l2n8K8M1m4mNJ2J9Kl5
6689b1P%JRj2J5K0Ko0J8N7n4L6l1L6k9J1j0j6J8jK3l6LL3kp%k5J5oj6k7N8L0l5
6725Dk2J1J9m1KK8Kl4l3Q8j1l9K8l7L7j1pM6m6M5j9K7k5j4KkJ0KM5k2m5L6llm1
6760b3K4kJ1k7k9L0J7Oj1l8L2j2pNl1N3J6m0PJ0j3K9l0M1mj6k5k3K4O4ml1qK7
6794B2rj1j3j3mQ3m8k4J0j7m6J9%J0L7l9k7N9N4l5J3k5m7L2L5m1o0M5N4oM1j2
6826C7j5n4n9R0M2J0p6m6O5KM2p1O2j0n6Q1Ko3M6n5J3l1qM3K7m7M6p0O2K5l6n1
6858e3K5k2M8k2qJ7m5N3l7PK2j0K2n0NM6pJ0J3j7J0%j0J3j7oK3mkk1J1j3Pj5J3
6893a4J8k0lK1k2j2jK9m9K5L0Ol3J0MJ4k8J0J7J9j2Rm3O8m4%K2qOk0rK0qnkL1
$$ y = [5, -34, 31, -34, -138, -10, 46, 1, 5, 9, -47, 9, 29, -6, -9, -48, -12, 12, -19, -10, -42, -3, -1, 45, 13, -45, -17, 24, -20, -24, -19, -7, 12, 14, -21, -14, -14, -13, -4, -16, -1, 19, 21, -39, -21, 36, -18, 18, -13, 23, -6, 5, -5, -21, -3, -4, 19, -17, -14, 19, 17, 10, 10, -15, 0, -6, -22, -49, 9, 39, 4, -18, -7, 12, -29, -27, 1, 3, -31, -64, 24, 13, -26, 2, -35, 2, -9, -16, 30, -16, 29, 10, 37, 12, -2, 0, -2, 8, 10, 55, 33, -12, 24, 21, 18, -23, 1, -1, 10, -17, -46, -16, 1, 7, -4, -42, -10, -22, -29, -24, -55, -2, 14, -26, -19, -9, -22, 7, -23, 18, 14, -2, -27, -50, -26, 38, 34, 3, -5, 22, 13, 2, -11, -24, -28, 55, 7, -17, -7, -24, -70, -51, -51, -41, -4, -43, -70, -11, 43, 8, 21, -4, -51, -19, 16, -25, -85, -40, 14, 8, 49, 37, 22, -32, -91, -1, 41, 51, -25, -71, -6, -4, 38, -33, 29, 19, -37, 44, 46, -17, 29, -26, -13, -44, -52, -9, 18, -29, 17, -53, 9, 34, -2, -53, -28, -50, -2, -24, -32, -15, -60, -7, -44, -37, -15, -25, -3, -53, -48, -2, -9, 1, 14, -3, 7, 7, -3, 10, -7, -13, 10, 6, 4, -17, -6, -19, -12, -27, -14, 4, -16, -19, 2, -20, -32, -33, -4, -53, -28, 2, 8, -25, -15, -11, 3, -25, -15, 2, 21, 9, 18, -25, 43, -1, -1, 21, 13, 19, -1, -10, 10, 2, -3, -5, 26]
6929B6Jj4Kl8lOL2n4M0l1L5mn1M2L3m7J8qK3j3j4M5j6k5nK9K0k7K7k0k9O6m0Q
6963A4k2j3L3j2L2l3J5k4k4K0Nj4N4o0lLL3k1Nk2m3K9O1lk3%j9NJK4N5p5L7lk0
6998hK8j1k6K6K4Qj2n1L2J3n0k3N0oJ6k3K8pK4k2pj8J6k0Pj2O0J6q8J7k4NL9L
7032Dj5l7M0KL4Pm1MRJ9j1l5J6L0j9J7k9J8j7J4Rk1lKJ3j2JlpoOjj1K0j0J%mQ
7071h%mJ5pRqJKNj1nK1j3J3LnJjJnRmNj4LoNmj2RNj1oNNqKlkJNJ0lpQJmJ0kNj1
7122eJ4rMlMNkNrLJmRj6J1lj0MJLokj3MjjNkoJ2Qj7Oj1J5Rj3L%J1MPlkoR%j1J3
7171A5nMlpkOjj4M%rJ4Onmnk4M3j7j6K3l1QkJ3j1L4o5Q0n3M7m9l8P3j6N9n8j1
7209a7KN3o2M7k8mK8nlNm4J4NkL2j8L0q2L8l8N3p6J5N0oj7K6M0k5m0K2KkJ5l3
$$ y = [26, 27, 13, 15, -23, -26, -20, 12, -42, -2, -33, 2, -2, -53, -11, 22, -25, -7, -15, 8, -5, -19, 26, 10, -15, -20, 9, 29, 2, 29, 9, -20, 46, 6, 14, -8, -21, 12, 0, 32, -1, 14, -10, -34, -14, -9, -23, 31, -29, -32, -29, 4, -17, -12, -34, -77, -48, 13, 10, -13, -13, -32, -27, -26, -2, 53, -22, 15, 12, -8, 20, 9, -17, 9, 33, 41, 29, -22, 10, 23, -27, -50, 0, -6, 10, -13, 15, 8, 32, 10, 3, -15, 1, -19, -12, -24, 36, 52, -36, -19, -43, -38, 1, 4, -11, -48, -8, -6, 28, 35, -6, -2, 7, 26, 15, -20, -4, 26, 7, 24, -5, 13, -4, 10, 19, -2, -5, -3, 10, -2, -1, -4, -11, -17, -11, -12, -23, -3, -13, -12, -12, -16, -8, -8, -12, 3, -4, 5, -3, -2, 0, 5, -6, -11, 10, -3, 10, 13, 8, 9, 8, 9, 4, 13, 9, 14, 0, 3, -3, 2, -2, -14, -5, 0, -11, -17, -12, -7, -15, -13, -16, -18, -17, -12, -2, -5, -12, -4, -3, -7, 3, 1, 6, -5, 9, 0, 4, 1, 5, 10, 8, 13, 4, 7, 8, 4, 13, -3, 8, 5, -5, -1, 0, 3, -3, -5, -18, -14, -15, -16, -11, -13, -19, -7, 1, -16, -10, -21, -6, 3, -10, -7, -7, 4, 8, 15, 12, 10, 4, 13, 13, 2, 15, 10, 14, 11, 4, 2, 8, 7, -7, -3, -3, -12, 2, 8, 3, -1, -6, -30, 13, -4, -20, 3, -28, -20, -22, -9, -20, 14, -51, 29, -24, 23, -26, -64, 9, -7, 52, -6, -17, -15, 38, -24, 23, -5, -9, 19, 14, 11, 16, -28, -14, -9, -11, 21, 3, 33, -49, -11, -49, 4, -72, -57, -7, -13, -30, -4, 36, 11, -29, -7, -5, -7, 8, -25]
7244b5L3p9P3Ok3M7o6L6L2k9j4L9p2R6k0j8n1j8K8N9j29J04m8L8m2k3L6k6Q1n6
7274c1kO6om0K6l9l8K5O5o5j3J17L9o2J6j25J37l4m1K2Mj9k7O9j02R5n7J1L8l
7304B6N0k3j34LJ84j97Q2J12j51L5m0P0k3RN6o8l7R0l8j1O9j13oN7n7j3O2k4Q6
7333E6o3rkl6J10J5m4Ml9Pn5J52j44P0m4J2L2qK0k1j8mKm7M8m5L0n3K09j44j1
7364b0J1k7L1L1o2J3NO1r8l3J50j28O4K2l5j6N0K3l9L3Nm7k1L0K9%r9Q2ql3jP
7396b0m7O8l3r3J51nl8J5Jpj0k8P6L0n6J9o4Jl1N1N4p0O2l4J9n0K3M2l4L2M3m9
7428A8l2mJ4N6k5j7o0M5k6K7J3J4o3M2j0l0K8K6J9p8k5K4o4P8RO3p8O6m5J51j20
7459A6ql0K2R6q5j6M7M0j29O9o2L9q5O0ON8j25R0RNj8O1j35N5R3l1o2j7J9M5P4
$$ y = [-25, 8, -71, 2, 8, -15, 32, -34, 2, 34, 5, -9, 30, -42, 54, 34, 16, -35, -53, -25, 34, -95, 9, -39, -1, -43, -66, -30, -56, 25, -31, -33, 33, 27, -13, 13, -26, -64, -39, 26, -39, -52, 65, 104, 42, 58, -67, 70, 36, -5, 17, 21, 2, -25, 44, -58, 37, -20, -9, 29, 26, 76, 53, -81, -78, 106, -91, -9, 103, -48, -13, -53, 17, -6, 3, 59, -9, -46, 44, 6, -5, 64, -49, -55, 2, -55, -68, -6, -30, 56, -7, -16, -18, -54, 56, 71, 27, 31, -8, -1, -56, 96, -48, 22, -22, -10, 22, 14, 34, 13, -5, -9, -7, -54, -6, -51, -21, -74, 135, -9, -20, -9, -36, -5, 26, -36, -23, -18, 43, -55, -88, 62, -66, -2, 20, -15, -31, 19, 42, 3, 36, 41, -6, -27, 3, 32, 32, -67, 15, 7, -26, -27, -20, -67, 1, -32, -125, 26, 21, -17, -2, -1, -8, -18, -46, 30, 60, 4, 23, -41, -40, -71, -20, 34, -36, 26, -8, 11, -39, -16, 26, -8, 24, 67, 18, -14, -18, -4, 52, 27, 10, -50, -5, -31, -4, 9, 23, -40, 2, -8, -38, -10, 16, 35, -43, -68, -44, -108, -30, -21, 42, -36, 30, -15, 136, 16, 8, -22, 0, 96, 11, -5, 42, 82, -47, 22, -40, -1, -86, -26, -20, 38, -87, 3, 12, 17, -1, 60, -75, -20, 73, 42, -20, -37, -18, 27, 101]
7490A01j3j73J84m7ko9O0j04R7l7N9j21J23q2N3p2K1j4n7J09j19O4P2l8kPk4P0
7518D6j34P0l3N1qq5R1jk0N4p7NQ1p5M8Mm9R1j07Q5p2R1p7M9j9N4k3k3J9qq9R8
7550C7M9j11O1m8K5rjJ4m5O3m4k7kM5n3M4op5J56j62N9K7K0okJo5N7p0RM4l2K8
7583a9LN3n2L6K8l3l3J30j43n1J04j7kpK4n3M2l6M6o9P2m7J9p4J5k6L9L2l5N2
7613bJm4N7m4K7L0l1p6R2K7n5j2Q3n9k7Q2O5q8j5M6j14J10o4J7k9M1l3j0l5J03
7643D3n8k7O4k1r8J29p4J1L0o1M6m8P2k1oK4l4o9J11k9N8J7q6N3o2L5L8o5K5L0
7673B7J4p7O6l1L4k1Qm0J1J4lj2RqmLr%jJ3Oj9jPlQnJ0nkLjPMnOMjlJ4oLrOoK
7719GK%qkj0%J1j6K0nj0P%k1K0rL4k5lk1nOJ7K3MNqj4k6N4p1P4k8L8j3k9J6k9
$$ y = [101, 88, -85, 99, 52, 50, -19, 41, -63, 34, -3, 56, -65, 58, -24, 29, -43, -22, -36, -93, 16, -103, -39, 33, -5, -7, 0, -24, 46, -88, -18, -51, 0, -8, -93, -2, -3, -23, 31, -46, -41, 40, -35, 13, 17, -32, 59, -48, 37, -35, 56, -21, 28, 9, 63, 40, 17, 36, 28, -61, 37, 86, -25, 36, -12, 13, 4, 3, 17, -28, 35, -9, -36, -38, 7, -46, -2, -8, -83, 73, -89, -30, -3, 17, 11, 9, 10, -55, 2, -68, -59, -15, -47, -19, -16, 37, -15, 21, 49, 16, -17, 113, -30, -81, 23, 6, 4, -3, 21, -32, 10, -26, 20, -49, 23, -24, -5, -79, -64, -90, -51, -19, -54, -2, -1, -45, 12, -32, -5, 25, -6, -82, 10, 37, -18, -30, 53, -6, -33, 49, 114, 26, 11, 57, -57, 53, -11, 6, -23, 18, -15, -25, -60, 43, -15, -42, 22, 1, -97, 32, -42, -31, -1, -62, -16, -64, 8, -13, -19, 5, -29, -98, 13, -16, 42, 59, -27, 26, -36, -1, 37, -28, -3, 27, 41, -36, 30, -1, 33, 12, 20, -20, -9, 5, 2, -10, -1, -9, -13, -10, -19, -19, -20, -7, -1, -20, -21, -14, -17, -9, -14, -4, -9, -11, -8, -9, -2, 2, -3, 3, 7, 6, 3, 17, 11, 14, 5, 11, 5, 7, 9, 9, 1, -1, -11, -11, 0, -16, 4, -1, -11, -4, -4, -25, -5, -14, 20, -5, -8, -29, -34, -28, -11, 12, 16, 21, 13, -1, -27, 27, -44, 30, 2, 40, 27, -2, 14, -15]
7757a5M3l5Rj8K0L1po8K2%J7Mj2l7KQ2o3LJ4nJ6Njl7%L1l1QLK9k8kJ5K5ql1N1
7794C2m0N4nro6M5oK2j4k3Mrj3J3kJ2O8n2k7J1J2l0J5L9p8L2J2j0J07j30M3j7
7826a0q1J4K0J4L4L3J0q2J1J5qk1R0on7l5P7K8l5q1L6JM3p6P4L5l5m8L8Qj13J18
7858A1M3j37J29r7J7P2p3N2N1j18j4P8m8L6l9R1l9OK8l7J8m3j4O4L3k6M9o8O7
7887I2K6j24K6j12J59q3L1NkJ6l5j3l6P8Mj07R2rm2J5J6j6n0Q3m8P2n9k7PMoN3
7919A0k9L7m2J9RQPk4L0j9J1n7QN0m4N0n5K0K7m1kM0m2K7J0l6L4j2Nk4K3K2n7
7952c7O5p7K4j4j0N5J9l6M9n9O3o5K8Q5j19Q3Rp1J8ln5J0l1L3P6k3l2j23J48j76
7982a66K41j44K5J00o4m5J51j22o3J23n4k7J3Q8p7p9l7J13R7k6o5n9%Q0n3O3J
$$ y = [-15, 28, -7, 2, -16, 4, 35, 28, -40, -18, -18, -1, 3, -9, -46, -44, 38, -25, -22, -8, -13, 3, 8, 7, -30, -30, 1, -30, -22, -19, 10, -18, -20, -5, 20, 12, -19, 32, -8, 46, 41, 32, -34, 11, 5, 27, 13, -10, -6, -15, -28, -15, -17, -5, 63, 11, -16, -5, 7, -23, -8, 31, -47, -15, -3, -13, 94, -36, 7, -10, -91, -77, -57, -43, -9, 24, 34, -48, -37, -22, -30, -51, 39, 33, -24, -59, 18, 46, 11, -70, -34, -33, 10, -66, 8, 43, 8, -40, -2, 6, -107, 11, 54, -83, 46, -51, -34, 38, -35, 17, 68, -50, -64, 14, -34, 2, -37, 54, 15, 21, 49, 12, 30, -13, -27, 37, 70, 44, 93, 25, 92, 118, -6, 20, -92, 67, -16, 15, 20, 18, 34, -1, -14, -50, 28, 32, -75, 17, 8, -34, -19, -3, -19, -69, 14, -34, 38, -21, -48, -41, -37, -43, 10, -19, 18, -24, -5, 4, 12, 19, -5, 25, 6, 17, -40, -32, 18, -26, 24, -31, -11, 16, -25, -27, 13, -29, -2, 8, -28, 6, -6, -1, -25, -2, 20, -37, 28, -49, -25, -39, -49, 6, 25, -11, 38, -21, 42, -23, 5, 90, -29, 54, 63, -8, 10, 7, -48, -38, -69, -36, 40, 17, -15, -138, 10, -166, 75, -69, -44, 56, -8, -53, 98, -24, -87, 36, -18, -45, -32, 56, -21, -100, -137, -24, 73, 47, -18, -77, -77, 3, -50, 13, 14]
8009A4m6k2K5J10o3k8n1J00j9o9Q6j8n2K4l0RM0K8Mp1N2q4MO2l3p2O8J00l6q4
8039e2OJ2QJ9oj1p7P5l4Q2l3qL8km6K0K2n8M5l2J10j22L7k9QO8m0K9KRj03NM8
8072a0j8J38p7P4j21M5O0qq1m0L9Qj6Po3J39o6rJ7j3M5j8l7j6K9M9j24n8R6K1
8102hl4M2k5J05o4j67K15j01N1j04J14J2m9M7j4q3L2K3L7m7K8lpn6O6K7o3J7K2
8131A3kk0N6ll6Nl7J0O8j02K7K7Kp1R9j14J20Lj11J05Qk3o8N7J4p5K7K8J8m1k6
8162d2P6Jj5m3M2k5Lj7J5j6Q9k8km5j1m5R0j9MOJ2o2K3lJ4l3OL0n
$$ y = [14, -32, -54, -29, 81, 18, -10, -61, 39, 20, -49, 37, 19, -33, -9, -39, -30, 10, 38, 42, -29, 23, -61, -57, 5, -28, -100, -32, 68, 32, -52, -46, -34, -26, -7, -13, -24, -101, -26, -60, 22, -11, -19, 19, 17, -29, -9, 13, -45, 0, -32, 78, -44, -7, -36, -28, 40, 0, 29, 31, 40, -63, -58, -10, -28, 110, 33, 107, -14, 31, 91, 83, 2, -38, 1, 9, -7, 0, -63, 76, 10, 1, 18, 5, 50, 32, -5, -21, 8, 57, -67, -125, -29, -8, -42, 0, -25, 80, 16, -151, 64, -37, 14, -90, 24, 36, -13, 34, 20, -63, -31, -8, 29, -18, 10, 7, 0, -56, 10, 37, -26, -9, 13, 11, -9, 47, 44, 8, 13, -24, -14, 54, -48, -21, 6, 8, -63, 36, -78, 42, 45, -66, 39, 47, 24, -44, 13, 27, -48, -21, 7, 25, -16, -42, 34, 35, 20, -23, 19, -6, -3, -20, -5, -21, 68, 40, 38, -7, -18, -63, 27, 8, 12, 18, 30, -32, -9, -12, 2, -31, -25, 5, 0]
8191@
$$ Imaginary data points
##PAGE= N=2
##DATA TABLE= (X++(I..I)), XYDATA
0@%%%%%%%%%%Qj6J6j6K4l2M0m9N7p2Q8j05J27j51J78k10K42k80L26l75M27m87
32b60N57o35P18q10R13j024J146j282J429j590J768j961K170k399K649k922L222
49A689l550L910m307M743n226N766o369P047p817Q704r735J0945j2394J4166j6388
64h816J9272k3183K8827l7797N4998j36948K43302j40972j11985L14134l72994
75a72162K26025k6367r2973J38483j18498O0860j9360L787K8481q0117Q4623n0894
87a8112K2749K1963l0929l1113M9903j881n4341J29573j50703L9959J08821k04736
99a18847K18675j16238n3858J79973k07610J56508n8518o0309J37683j51768J42901
110F8592q3684l0213J12451j50094J42523m8959n8564R6797q7225M3577J0488
$$ y = [0, 0, 0, 0, 0, 0, 0, 0, 0, 0, 0, 8, -8, 8, -8, 16, -16, 24, -25, 32, -40, 48, -57, 70, -81, 97, -113, 129, -151, 175, -200, 227, -260, 297, -338, 380, -430, 483, -541, 605, -677, 752, -838, 930, -1031, 1139, -1260, 1389, -1533, 1689, -1861, 2049, -2258, 2485, -2741, 3025, -3344, 3703, -4114, 4590, -5145, 5800, -6594, 7572, -8816, 10456, -12727, 16100, -21697, 33301, -103647, 139655, -1317, -113302, 200832, -172162, 53863, 27496, -65477, 73006, -45492, 15368, -3992, -205, 28276, -51841, 32782, -18112, 4637, 26600, -4329, -35442, 14461, 12580, -41761, 87812, -62891, -22932, 85889, -118847, 99828, -16410, -70268, 109705, -97905, 58603, 85, -60224, 77459, -74309, 68592, -15092, -45305, 67146, -82948, 59575, 10616, -47948, 48849, -38376, 5201, 15689]
121A5689j5303j9656L4218n400m9434J00566j08656M2400N7288j13963J16172
132E3921p3731k798N4375o1454O3912n9459L9333j7520k1516P6209j02181P8833
144B7924k1079m6506R1091q5605M1168J794k5547L4693k8926K4452l5420L7174
156A5213j4280j8742N3875p5721O1023j8845k5522O1303p8316O4969k7337j7804
168b0184N9385q2250O7949k2971k6077O0175o4611L5054K021j8659J8037j1097
180c228N477j4901L2143k9506M688K5557n0272N1483k1945j2520L0004l3182K6312
193A0110j5240J1788r579r041L5919n0638M6841j7248l2751O6005o0993L0261
205E434J3578m8757M8663k4392J927J4372j9131Q966k633P811r943P562n254m927
$$ y = [15689, 386, -19270, 14948, 9548, -39886, 60680, -47976, -5576, 51712, -62251, 53921, -19810, -22608, 31767, -29687, 34225, -25234, 14099, -3421, -24937, 51272, -50909, 27924, 6845, -39661, 51430, -34175, 6993, 8787, -16760, 17933, -10993, 13459, -21961, 15213, 933, -17809, 36066, -39655, 21368, 2523, -22999, 38304, -40012, 24957, -2380, -20184, 39201, -43049, 24900, 1929, -24148, 36027, -28584, 6470, 8491, -10168, 7869, -3228, 2249, -12652, 19491, -10015, -5327, 20230, -30042, 21441, -504, -13024, 16980, -16202, 10110, -5130, 6658, -2921, -11962, 23957, -26681, 20160, 2912, -29839, 36166, -24827, 5434, 19012, -29745, 18918, -5474, -3547, 10825, -8306, 660, -1973, 5838, -4105, 3457, -1797, -6724]
219f724J7572j8076J4509j2589L32J5583k2609K7169k2914J13K2061l0443L0023
232A4007j5308r061K0708j9003J6273r181J93J755p000J9087k0793J1219O97j7098
246a3505K6546j4624l753J2710j4250M607J1753j2253k880J4551j9632J3023J0751
259A3044k9348K5980j1316r032K8068k6741R114M807j3895J7501q445r87P21k182
273b711N457l232M571p993J497N609n607P295o207k879O242k782L148n92n568
288c752K277L512k652M176m258n310J0957p272M028L184j4819J4138l205l926
302b922J1256j5355M660O810p431P200l647o033O193K037l555K732k721m787R998
317D435k824l341M675q120M412N839o455J778p39l700O789O69o210L654k847k65
$$ y = [-6724, 10848, -7228, 7281, -5308, -4976, 10607, -12002, 15167, -7747, -7634, 14427, -16016, 14007, -1301, -10362, 10346, -8657, 7616, -1565, -1372, 383, -6617, 12470, -8323, 2896, 3593, -13505, 13041, -1583, -5336, 7374, -6876, -2269, 9484, -2769, -5649, 8902, -10730, 2293, 13044, -16304, 9676, -1640, -10672, 17396, -9345, -231, 4576, -9319, 8182, -263, -1250, -529, -2711, 2746, -486, 4085, -3908, -2411, 3198, -2409, 4886, -1321, -4200, 2042, -740, 2408, 1816, -3752, -1475, 2037, -615, 3561, -697, -6007, 4950, -2322, 1706, 4890, -9929, 4209, 1004, -2922, 8334, -7021, -2361, 4449, -2982, 4218, 571, -5462, 731, 2768, -787, 1945, -776, -5563, 4435, 1611, -1730, 2945, -5175, -763, 5076, -1379, 399, -340, -4040, 2749, 3418, -2792, 862, -1985, -2250]
333b250Q281p555K16K080m896Q221k392m217K953k866L292K197l138k291J983
348c82J78O30L701p844K439L650n596Q469o160l864Q837o715M496J244q100N801
364G84L62k040L342k886l051N378n37k801M266n812J351N723o166L402j109l389
380c183N522j486j520L34j3p09K858j73n176N599l283L77N601r184N394l1l612
397b685P311p145J787J733k658M437l708N43l85Q48J409k508K080l660L746M81
413A626l394M330o360M512J730m642N139n730J868L047k706J843k478Q39l49K851
429B126j989k656N131o084O312m38p277P958o156L833L246p091L940l083K740
444E12N88m65j62m140O784m715K249J523p644R418m417K93K594p273O457j990
$$ y = [-2250, 6031, -1524, -1308, 772, -4124, 4097, 1705, -2512, 441, -2425, 867, 3064, -74, -2365, -382, -204, 426, 4127, -3717, -1278, 2372, -3224, 5245, -915, -4779, 4058, -2657, 1839, 3083, -5017, 784, 1146, -894, 2448, -438, -3489, 1889, 1352, -1449, 2817, -2995, -1644, 4079, -2087, 1315, 206, -3183, 2339, 853, -667, -333, -346, -1055, 1803, 1630, -3546, 2053, -1230, -853, 4748, -4436, 958, 927, -2685, 4626, -2519, -732, 1001, -1657, 2780, -928, -385, -770, 78, 1487, -1021, 1059, -2601, 1145, 1626, -1768, 2562, -3798, 714, 2444, -2198, 2941, -2789, -921, 2126, -580, 1263, -1215, -376, -725, 2126, 137, -2519, 2612, -3472, 2840, 2402, -4875, 3083, -3073, 760, 4006, -3085, 855, -2228, 512, 1100, 635, 473, -3667, 3117, -1598, 651, 2174, -5470, 3948, -469, -176, 2418, -4855, 1602, -388]
460c88K337n47m162L663l993O374k808j976L616o344P812m202n05L098o257Q937
476D655n503K80K189o992R111l480K25Q13m804M041j120L367l907J007R70m634
492c782Q778p702J819L780p030Q976o357P4J958l062O465n493M175m715j281Q236
508D839r442R122m399m785J0088r828O148m12m595O046l868K718l052J103K85
523c2j335N498o663L530j578j734N542n001M043m079J621J897n234Q171q221L900
539C25L027q172R517p631J909L863n597O071n644L132j420q33N358p915P062l825
555g73j868O971q146N692j507k006L515l229K616l294L860k083j355N424q183
570d366O585j603l539O982o836L618m04j506K390k927L866m737L769l38m175P346
$$ y = [-388, 1949, 1402, -2760, 903, -3090, 3284, 476, -1500, 2116, -4228, 3584, -618, -1123, 1975, -4282, 4655, -848, -568, 1621, -5371, 3740, 260, 485, 1298, -3506, 535, -585, 2782, -1125, -118, 852, -3782, 4996, -2706, -887, 2893, -4137, 4839, -1518, -1444, 514, -2548, 3917, -1576, 2599, -2116, -3397, 4839, -4603, 4519, 120, -4665, 5423, -4405, 1743, 1331, -3264, 2782, -1086, 1632, -1420, -317, -32, -1367, 4131, -2532, 998, -580, -2314, 3228, -1773, 2270, -1809, -188, 1709, -3525, 4646, -3575, 325, 3352, -4820, 4697, -2934, -1025, 2838, -2759, 3312, -2332, 800, -620, -1453, 3905, -4010, 3052, -773, -2641, 4330, -3816, 1876, 369, -1637, 1878, -1351, 1265, -2029, 1831, -252, -1607, 3817, -4366, 2219, 616, -2923, 4059, -2777, 841, 437, -1069, 1321, -1606, 2260, -2477, 1292, 954, -3221, 4125]
586D125p405M187Q00n035O677n672L204n98j793L979n371N378l467j39L976o324
602c478N944l154m65L348m378L757k489J219Q3j532L036l967L605j994o63L262
618B134m408L985k462L30J624l162M304m165K426L07l402N440n150K879N44l682
634b458M865m093K191J09j813K796l182K696j602o6J843k747L141k585P90P06
650E91k001L057k796K069r02j336K919l406L160j299r75K611l650L044j414l70
666f98K164k702K500k053K95J195j834K558j804M35N4j135J788j320J422j078
682b13Q6O20j871K545j979R11J096k456K551k423O94J360j810K411k110M77K00
699H9j326K525j766Q76L9j460J688j318P66J82m51O58p20K76p10P54O2j66Q63
$$ y = [4125, -3280, 907, 1707, -3328, 3349, -2323, 881, 283, -1510, 2469, -2902, 2476, -991, -1130, 2846, -3478, 2466, -688, -1153, 2195, -2183, 1574, -915, 304, 387, -1145, 1891, -2076, 1529, -465, -1128, 2134, -2274, 1711, -751, -421, 1203, -1959, 2345, -1820, 606, 913, -2489, 2951, -2199, 680, 1224, -2458, 2407, -1686, 505, 614, -1199, 1597, -1585, 1111, -491, -557, 1286, -1461, 1680, -905, -115, 591, -1410, 1647, -1149, 920, 18, -1318, 1601, -1805, 1355, 56, -919, 1692, -1958, 1086, -328, -698, 1466, -1236, 1264, -789, -494, 701, -1133, 1425, -379, 56, 110, -1025, 763, -557, 865, -213, -127, 493, -1378, 1167, -812, 99, 1195, -1261, 1290, -1133, -439, 921, -889, 1522, -588, -111, 89, -1237, 1288, -478, 398, 437, -1023, 665, -653, 113, 295, -156, 502, -218, 58, -652, 102, 164, -2, 861]
718H61j714R43m07r7J523j597R35n97m62J290j437J297m81l46J066j530R95m50
736b08o5J202j169N00m94k23P01k03L14l89%j12O5K26l72O03n26K14K49q92Q54
757B75n44K81N89r91N74n16J14O37o59O13n43j16O04o53N79k31j55M06m01J64
777B7kj85K10J48k10n7Q6k16L69p2k11L71n98M76Pl86N78o33L72O3m43O58o40
800b88K63K56n56O74n12K9M13n15M68k67j62L36k48K27j12r9J06r1J61q6m1N0
822FLJN9k4j37K09j38kJ34l28L80j35r2K07l23J79K2o5J28j53J32j12P8nj58K75
848A41k41J50Q1l51L96k28LJ89l18K90j40n1K41k05L4pp1J62j54M7O7j16J90k04
872i5O2J26k78L35j42j48L47l81K02J53m94N53k89j31M70n31K59J90m59M47k59
$$ y = [861, -853, 90, -317, -414, 1109, -488, 447, -150, -612, 678, -759, 538, 57, -289, 777, -753, 242, -208, -273, 929, -240, 260, -234, -457, 244, 41, 355, -34, -34, -146, -81, 145, -227, 376, -150, 64, 313, -579, 275, -269, 12, 601, -390, 184, -332, -218, 419, -240, 373, -170, -286, 318, -335, 244, 13, -142, 264, -137, 27, 25, -160, 50, 198, -12, -69, 17, -199, 170, 98, -113, 258, -340, 136, 143, -243, 335, -298, 74, 137, -306, 352, -288, -25, 231, -325, 349, -163, -134, 279, -236, 232, -35, -197, 139, -109, 118, 6, -93, 13, -78, 83, -3, -44, 6, 9, 10, 69, 45, -92, 117, -21, -23, 111, -217, 163, 28, -64, 143, -180, -1, 21, -44, 84, -69, 63, -49, 29, 24, -134, 141, -100, 50, 131, -220, 176, -52, -49, 140, -178, 112, -28, -79, 162, -43, -9, -16, -87, 75, -79, -32, 35, -81, 109, -95, -33, 93, -185, 150, 8, -140, 207, -174, 28, 181, -313, 240, -49, -180, 290, -241, 18, 208, -251, 196, -63]
893f3j08M03m23K38J36m00M23k73q3L83l89K31K6k89M32l85J99N4l23M40m13J70
915a4K11n09O09l63j29N54p15N28n0m62N96l87P4L19n50K89J98n01L84J0l81N86
937B97m59R4M04q11P41k65k37O42p28N21o7k73M23n96M48k04j04N04p21O95l62
958e8j32N41p21N13J7m60O19l15k40M86m06N5M43n30M4M03o68O05l7o48R99q40
980c30L30K64p00P70n99L36J32m98O51p08N14o2m46P49p83O25j26n02P68p93O24
1001B16j08l60N73n84L04K7j78J67m0q0L0K42m74L71J36p73R88p39M3Q06j099
1022e32Q08k60l28N76k86pq8L65m26K7O44j114J135m71o62J327j291O75K87r11
1042e32R67o29J82R0k04L77m92N19m52Q8L53o56O93k65j64J72k58L47k42K63j58
$$ y = [-63, -171, 232, -191, 47, 183, -217, 206, -67, -150, 233, -156, 75, 101, -188, 244, -141, 58, 112, -211, 229, -184, -14, 197, -312, 297, -66, -195, 359, -356, 172, 122, -340, 256, -131, -57, 262, -288, 1, 199, -302, 82, 92, -289, 297, -162, -68, 336, -475, 266, 1, -236, 406, -322, 199, 132, -141, 282, -314, 134, -70, -174, 330, -391, 304, -58, -190, 351, -370, 143, 160, -300, 319, 4, -236, 250, -156, -101, 342, -188, -144, 259, -409, 196, 159, -489, 510, -330, 0, 264, -436, 334, -265, 71, 203, -295, 356, -352, 162, 100, -346, 403, -380, 245, 119, -383, 385, -408, 216, 108, -252, 321, -263, 41, 68, -110, 57, 17, -63, -33, 209, -265, 106, 242, -531, 457, -282, -239, 567, -532, 276, 16, -312, 264, -22, -29, -117, 248, -178, -151, 493, -621, 514, 43, -619, 708, -583, 92, 379, -532, 435, -194, -12, 78, -126, 251, -241, 278, -174, -86, 267, -389, 304, 39, -125, 47, -211, 136, -106, 157, -1]
1063aO7k9k63M00l01M54l90M3L38j019J279p77k21J553k162J390n1j443K254j491
1083c70R1J028j487Q41nl36N12j48p1k19K69m29J68O05o02K09J11o39L58M42o45
1104c17O01J91j323J294n34o96J859j648P44N05j811J742r96J77J071j444J070
1121D85q44o1R58r82Q22j57o77P32n57l6O18k74p8M03p05P4O30p22O42Mn57L48
1143F6l02K33M8L43k68m42Q81j352P14P07j566J827q00r01J658j570O36R66j544
1162f66Q82K6p90O72K07p81P37k08n59Q83o11J14M49m98M21m33J58L8k24N81m91
1183i3K21J02o76P06l98K17L24o38L37j47J4O0r9M30n16K48M1o87O50J30n15O13
1205C24j54q56J130n25m90J404j429M06R91j716J288l7j135J472p89k99Q84p05
$$ y = [-1, 66, 37, -226, 174, -127, 327, -63, -20, 318, -701, 578, -199, -420, 1133, -1029, 361, 310, -1133, 1121, -370, -279, 749, -738, 103, 98, -238, 274, 126, 55, -164, 105, -324, -156, 449, -153, 56, 167, -472, -114, 328, -317, 284, 475, -848, 446, -88, -784, 1075, -573, 171, 676, -1135, 607, -389, -212, 859, -585, 485, -359, -420, 538, -444, 378, 221, -456, 276, -281, -317, 301, 27, -51, 352, -353, -279, 351, -371, 271, 275, -282, 66, -236, -3, 45, 388, 120, -322, 559, -793, -79, 628, -938, 889, 89, -812, 846, -724, -88, 878, -666, 216, 242, -548, 124, 331, -450, 287, 79, -480, 403, -208, -94, 355, -143, 278, -155, 3, 41, -183, 398, -93, 128, 230, -446, 260, -138, 79, 403, -235, 102, -45, -31, 29, -70, 360, -156, 92, 133, -554, 96, 226, -289, 324, 170, -686, 444, -81, -571, 833, -596, -190, 801, -915, 373, 336, -799, 673, -116, -415, 469, -236]
1223b36J98L51m24n3M60n00J9N88o37R4M48n78M32m9l70M19j22k19K19Q1m09M93
1245B05k78j21O41p55M68P2m65N98p75L86L52q03Q48l81l09Q60p74Q5N53q29M73
1266E1K72p15O56j12n68Q29m78m19J036q38J70N79p61L50J48m00J94J99m85L70
1286G8J92p36N67J45p61R10l90m65R18p47J99M96p22M80M7n11O25k87l28N71l44
1307f3o2M07o05M93m5m06N80l10k08O33p41L30J47m22M93j92k24K98l1k38M16
1328B50k96k44N89l56l4M76p54M41J53o17O54l07j64L77j79k64N67l09k04N76
1348C55n77J59M51q20N56lm93P38l82k05N03l95k9L96l95Q1L17n52L24J88n88
1369c71O41j70m37N77m26K47J41m94L60J8k66K69r5j45L62k84q2M92n44J46L97
$$ y = [-236, -38, 313, -111, -164, 296, -204, -185, 403, -234, -140, 308, -270, 162, 113, -257, 162, 40, -179, 40, 121, -288, 205, -73, -194, 447, -308, 160, 232, -233, 365, -410, -24, 328, -475, 373, -8, -317, 543, -231, -146, 407, -422, 51, 323, -392, 264, 152, -416, 413, -65, -484, 552, -286, -116, 463, -298, 52, 200, -200, -6, 193, -292, 78, 270, -466, 101, 246, -515, 395, 5, -460, 458, -289, -90, 406, -316, 164, 211, -300, 325, 38, -290, 281, -63, -125, 282, -323, 170, 125, -281, 299, -11, -219, 414, -327, 3, 150, -272, 221, 29, -195, 103, 72, -166, 250, -46, -290, 299, -57, -91, 385, -369, 72, 225, -392, 262, -45, -209, 168, -11, -275, 292, -17, -221, 355, -222, -63, 388, -432, 124, 121, -372, 366, -16, -221, 282, -113, -142, 254, -141, -60, 257, -295, 29, 217, -371, 270, 100, -337, 240, -186, 61, 202, -292, 68, 86, -180, 89, -6, -151, 211, -73, -155, 337, -207, -61, 336]
1390C36o93N50j13l79O16m13QK94l62J34J91l09J06K97n66L54J48o00O35l15j59
1411b40O14n93K02L02n22K69J39l39J23K09m08M36n9n34Q11n35p6N40o35M11k5
1432I0l72N37l40M4J36j31k4J71m9j46K50k83J81J78n50N77k87k03M31n18L27
1453A9J08l23K04J18k86J91R5l31L28N3n67O51l89j28O87p83M45J91n46M31j71
1474cj63K00K6k35L01o1l13O23n14q1O30q01N96j01m13N63l63J54Q2l05L38k06
1496d6J58r1l3l5pJ97m57N49l34J5M39n98M12n4l75N07l24N1j13J65k54K91j9
1519D4l30O57n37J8O24q96O56o4o44R65n57q5M42n46L51N9k19l3K67k06n2K96
1541B10m25K76M2l12L81k48J14L7q3O2j44J98k70K08n5j63L59m73N56j66k93L92
$$ y = [336, -357, 193, 80, -299, 317, -96, -88, 206, -156, -22, 169, -140, -34, 263, -303, 51, 199, -401, 234, -81, -240, 374, -219, -17, 285, -237, 32, 171, -168, -45, 164, -244, 192, 133, -401, 410, -125, -201, 339, -296, 115, 90, -282, 255, -85, -41, 95, -36, -60, 111, 62, -84, 166, -117, 64, 242, -308, 269, -18, -221, 210, -308, 19, 127, -196, 8, 126, -160, 31, 126, -205, 123, 176, -391, 260, -129, -257, 430, -353, 92, 283, -263, 168, -3, -166, 34, 60, -175, 126, 65, -248, 375, -139, -220, 410, -391, 205, 104, -309, 254, -109, 45, 127, -178, 160, -46, 112, 21, -12, -47, -54, 143, -314, 235, -99, -84, 355, -243, 169, 115, -260, 247, -77, -26, -139, 26, -228, 63, 44, -286, 371, -166, -148, 476, -420, 236, 172, -472, 493, -64, -149, 293, -253, 98, 157, -62, -95, 172, -34, -86, 210, -215, 61, 103, -209, 172, -76, 38, 75, -8, 54, -90, 108, -162, 46, -9, -172, 187, -286, 270, 104, -189, 203]
1563B03m66M54j63m08O68n07J23L52m49L64q4k20K09O6k99K41k3m30O24k16k68
1584b29N18n95K19K53m19L09o9l4P5L7k25R5L66o59N52o8n61Q00n05N7K13l43
1606b13L00j18LP1o6Q6j73K43k45P8J66l08L36j99P0O0k51L33l06J75N8k70L61
1629A91k84P2J32j94O6M4Oj54K82k56rL78n81L93N3l95N34l13j4K17k19M5l4J42
1653A02k53K31Ol47N87m84P8L35n46M44q1k48L61k86Q0N3k4p2J01m5j05K54k44
1676a03J21M5k00K42k24J62l3j42L49l71K61l3j94K94k63Q5N0r2J08k12K87j92
1698e5L5J34l12L28j38p5K91l31J60N0j65J08Or9O9J32l21K92M9m34M75k80oJ59
1722G2k29J72l1l8J19r5P4r8K02j58k2J48k49K30j11j74L16k45J64O5j45Q6j51
$$ y = [203, -263, 191, 28, -380, 288, -219, -96, 256, -193, 171, 87, -133, 76, 142, -157, 84, 61, -369, 255, 39, -229, 289, -306, -87, 166, -253, 56, -13, -47, 28, 65, -160, -65, 301, -358, 194, 126, -435, 365, -140, -83, 130, -213, 87, -31, -28, 43, -23, 63, -110, 133, -112, -34, 132, -176, 160, -39, 31, 91, -160, 173, -133, 42, 100, -170, 191, -93, -21, 111, -83, -17, 27, 33, -121, 161, -95, -104, 274, -307, 86, 139, -256, 278, -35, -49, 168, -51, -6, -40, 102, -151, 80, 86, -261, 326, -158, -80, 255, -291, 153, 72, -176, 185, -101, -21, 32, 8, -64, 37, -8, -113, 141, -103, 18, 63, -137, 105, -119, 43, 10, -132, 217, -154, 107, 74, -120, 174, -89, -4, 46, -46, 62, -150, 137, -55, -20, 114, -198, 130, -8, -83, 208, -123, 37, 87, -78, 30, 36, -63, 6, 138, -183, 109, 158, -276, 199, -81, -87, 72, -157, 15, -16, -54, 65, -30, 44, -54, 148, -10, -32, 116, -133, 97, -14, -188, 128, -117, 47, 112, -33, 53, -98]
1745i8L14j99R1j38n2J82j27J1J3Pk3r2K13k32J76J01k94K17j2j86J88j61J68
1768F7m1M2m3n6j6l2K40k08q5J95j82J72L2j78K71j19Pq4k8j2J42J3j27J18j70
1793h2k9J71j17J04R3j74R8j30P1l2L0J6o7M3n1j7M3J7P6j39J36j16N9J02j62
1818e7P8lm0Q2n6L2p8RP4j2n3n8P5L7q2J45j48Q3J1o9J57j89P2M1p7npL1j4P1
1848E0n8l2J04j42P9R3j31R6j62J04M9l6J7q7J34o7M9j0j09J14n6%Ko2J46r1O0
1875E4l4o1Q1o0N6r5J9JO9mr3J20n4j5Q5j21Q4rn7J32j37P4l0n5Q2j21J39o3j9
1904c2L6o9J57j22K4l8M8j8q8P8K2LO5j06J04q7j3KJ4R2k11K02n4k8J14j88J07
1931A4L8m6R1j30J1J5LQ9j08M4n2o1R5LJ2n6R9n7Jjo9Q3rN7J3o9J15j75J30m9
$$ y = [-98, 216, 17, 108, -30, -82, 100, -27, -16, -3, 4, -19, -111, 102, -130, 46, 147, -147, 70, 58, -128, 60, -101, 67, 26, 68, 25, -31, -47, -79, 161, -47, -132, 63, -119, 53, 85, -93, 178, 59, 66, -18, -46, -58, 84, 97, -30, 88, -82, -111, 60, -57, 47, 140, -34, 64, -66, 5, -27, 3, 19, -48, -5, -56, -73, -30, -13, 63, -76, 60, -56, 3, 105, -57, 21, 18, -22, 60, 4, 36, -42, -33, 41, 29, -24, -82, -7, 30, -52, 93, -55, 28, 39, -30, 127, -62, 10, 51, -26, -31, -38, -7, -21, 50, -8, -40, 64, -78, 1, 94, -37, 59, -103, 1, 50, 14, 31, -56, 78, 11, 60, 50, -59, 55, -1, -1, 1, -61, 85, -6, 54, 20, -41, 40, -20, 36, -59, -40, -39, 30, 26, -67, 53, -1, -16, 69, -52, 32, 23, -34, 98, -39, 35, 5, -50, 32, -89, 50, -13, -32, 4, -65, 92, -30, -6, -44, 4, -14, -102, -24, -2, 1, 66, -40, 64, -23, -36, -34, -20, 72, -139, 63, 9, -19, 95, -93, 14, 52, 6, 97, -33, -22, -7, -4, 85, -23, 21, -31, -92, 3, 6, 18, -38, 61, 4, 5, 4, -65, 18, 9, 66, 79, 10, 125, -50, 80, 31]
1961C1j52J12l2Q9j7j17J23j25J51m3n7J97j44RK4m6K8r1J25o8oLk4Q0m5K1l6
1988a0k0K8o0J45j02N3L3j21J20n5J4P5k22J69k7q0J10j60J35m8J4P8j44J03m5
2013a7O0p7m5J18j05R9J0Pp6n3J49j10O6j6o9J32j22Q6n8k8L4m1J11m5o7J15r2
2040c4K7Pp5J52j58J42p6oJl2J22j40O3j7j8L8o2O0qm2R1o9L0OMJn6O3m4M6j9
2071cpQ1j28J18o7l0O2o8O6k8oM6r1J12q6JQ1j04M5p8J02M2p4O9q6O0m6j42J77
2100A8m9N4l4m2M1k6Rl8L3O0o7P0r6J03n6n6R5p1O2ll3M1n7R5qr7O6r5J25o1k7
2131d4Jo9J13Q3j15P3p2J0l0O1Qo9M7q0P3m7L5Q3m7K9p4mJ76j19R6j52J26p9j18
2160a05J63o6L6l9prKL9Nk3Q7j19k5L7q3J07k9J49j67J32j27n3P0l1J30o9m4K1
$$ y = [31, -121, -9, -41, 48, 31, -86, 37, -88, 63, 20, -37, 160, 16, 25, 49, 3, 31, -60, 65, -3, -9, -6, -30, 50, 5, 26, -10, -30, -2, -62, 83, -19, 34, 67, -54, 66, 11, 25, 100, -122, 47, 20, -60, 50, -110, 25, -23, -9, 69, -75, 28, -17, 43, -34, -79, 39, -66, 33, 43, 50, -26, -79, 70, -40, 26, 10, -59, 73, -49, 37, -21, -49, -15, -56, 55, 10, -57, 58, -34, -7, 0, -75, 77, -81, 61, -15, -21, -20, -52, 70, -70, -7, -24, -42, -4, -66, -6, -14, -56, 35, -34, -4, 2, 6, 7, -49, 14, -30, 16, -3, -10, 71, -57, 61, -6, -36, 26, -42, 24, -4, -10, 36, -55, 57, -29, -28, 53, -51, -6, -84, 18, 60, -14, 55, -31, 29, -17, -159, 18, -31, 23, -11, -53, -12, -38, -29, -67, -34, 26, -41, 29, -67, 36, -20, -76, 19, -52, 10, 7, -26, 15, -42, 53, 45, -52, 14, -81, 44, -17, -44, -43, -112, 1, 84, -31, 42, -30, -20, -50, 11, 19, -50, -3, -83, -10, -57, -22, 61, 14, 43, -31, -35, 141, 22, 118, -34, 92, 13, -105, 58, -8, 28, -11, -18, -27, -25, 14, 19, -4, 83, -36, -61, -24, -107, 0, -29, 120, -47, 85, -42, -95, -25, -56, 74, 5, -39, -18]
2188a8o5J34p8L5M7j89K15p7m0R8j9P0j76m9J64l3Q9j9k6o4j18J47r2J09m3m9
2214d7K1j3J02j04j9J15r4R4j58J76q1K3%n8N1k4L0J33j77O0l2o7J09q9Q9o3p7
2241a00J96m6n1J15j78K7K7K2p6J01j45N8kj29K21j9o1P9k9O3j44J16j37P5O9
2266E2j57J04M2p1J8n0M7l4N6j3o9J28r5Q6J1j03J20j66J34Lj08J26n1O7j45l
2292g1J47j32J04j0j0n1l7J55k07O1M0l7M0k1J6O0j21O5l0P0j19R4O0o2J02j10
2318dJ7Nl9P3j44Q6N8j23J01q7O1n1M4N8j9qrp2N2l1Q1n0Kk2n7J43r1j8M2o7M5
2349b4K3L8j02R9jq2Q5j07M9P3o8L5o5Q4l2j6O0n6l3N3K3l1k1N6q2O3L6q8M4m6
2379c3j7L8o0Q4J0k4Oj7K9p9J02m1K9L4r1Q4r0M5K8o2M0j6j6J4N3k5m4M8j8n%
$$ y = [-18, -83, 51, -27, 8, 55, -134, 81, 4, -36, 62, 43, 113, -63, -112, 52, 19, 108, 89, 63, -1, -119, 28, -64, 45, 2, -47, -26, -39, 63, -41, -60, 55, -39, 55, -103, 73, -8, 15, 15, -43, 8, -16, 14, 147, -30, 30, -2, -69, 40, -49, 40, -23, -100, 96, 50, -1, 114, -64, -37, -10, 12, -64, 37, -108, -50, -52, -181, 40, 21, -40, 39, 10, 73, -71, 45, -92, -17, 52, -105, -1, 41, -30, -12, -62, -15, -49, 7, -6, -75, 53, -42, 44, 55, -48, 72, -94, 40, 43, -65, 61, 10, 77, -68, -71, 76, -56, 48, 38, 28, -23, -60, 95, -112, -51, -11, -48, -8, -29, -13, 47, -74, -9, -39, 31, -88, 6, 66, 4, 106, -4, 13, 18, -21, 52, -92, -6, 52, -71, 30, -57, 4, -47, -3, 55, 36, 28, 19, -53, -1, -32, 49, -1, 1, -21, -78, 65, -26, -44, -2, -69, -24, -1, 37, -65, 34, 33, -49, 36, -71, -22, 51, -17, 18, -47, 37, 5, -11, 49, -7, -40, 13, 36, 5, -16, 40, -42, 21, 57, -31, 13, -33, -50, -12, -72, 12, 22, -2, 4, -13, 16, -63, 39, -2, 27, 61, -30, 54, -36, 9, 37, -25, 15, -1, -17, -3, 50, 25, -19, 29, 11, 6, 6]
2410FJ8k3k3KN1p5J34r1rQ8j55Q6j0n6R0m1l4L8M2j05N1M3j15J80j00j3jn0M6
2439b6K2m6R4p6O3j01L0Q1rn7O0m0k8l0O9q7Q9l5M5L3j18K8K0ml0P5Rq0J48j27
2469b8M4K9r3O8Jk2J13j57J15k4p5L6k4O3k3L9n5MJ6j12J44l0p3J26j48R2l7k5
2497c6P6r1R0p6L6rl7Q9j09P3Lj20K11j15P2k3p5R4o2R1l3o1J7Qj2K2j2j3m1N9
2527A6k9P9r1K1N7j30K04j71rJ94k29Q6L6o3R7r1J0JQk8L9L6j42J31nj23J69j02
2555b9K9j5L6J1r0J17j26J21q3m3K46k32J28j10o5K39k14J29q1m8J72j45J24n5
2579A6J8Rr5k9N2J3N7k7K4r9J66j16m5J35j54Q8j0J1N6q5M3l6N2m0k1O1j12J28
2607F0l5q3J51j49N1Q8j56J28k4k8JM5m0j1N6j18J16n1n1J19j19O5J4n4O4p4M6
$$ y = [6, 24, 1, -22, -20, 31, -44, 90, -1, -10, 78, -77, 9, -1, -57, 33, -8, -42, -4, 38, -67, -16, 27, -88, 92, -8, -21, -22, -72, -26, -4, -50, 44, -32, 31, -70, -40, 41, 32, -25, 35, -5, -33, -63, 6, -81, 8, -27, 18, 51, -67, -39, -19, -23, -53, 22, 31, -49, 99, -28, 16, 45, -48, 20, 21, -1, 112, -45, 70, 46, -29, 7, -17, 46, 23, 62, 7, 11, 27, -85, 59, 29, -44, 82, -66, 26, -11, -36, 40, -51, 39, -37, -1, -10, -47, 42, -67, 6, 9, -111, 100, -15, 57, 34, -41, 53, -9, 82, 49, -12, 5, 13, 1, 23, 11, -2, -43, 16, -13, 66, -25, -4, 53, -77, 127, -44, -53, 141, -88, -2, 34, -29, 68, -23, -13, -12, -4, -32, 7, 43, -99, 32, 27, -96, 73, -29, 0, -15, 21, 32, -58, 59, -67, 54, -29, -72, 174, -58, 70, -40, -105, 134, -80, 49, -32, -80, 92, -53, 71, 16, 34, 43, -52, -81, -29, -16, 41, 14, 38, -61, 105, -11, -56, 79, -75, 13, 3, 14, 70, -15, 28, -8, 44, 4, -17, 44, -68, 60, 25, -58, 93, -56, -5, 83, -73, 55, 31, 3, 4, 49, 9, -2, 54, -64, 52, 1, -50, 69, -50, 15, 29, -25, 39, -35, 11]
2634A1j3oM0p2P1m8j1M4o3R1o2M0l6nN9o4O1j7m2P3q4L2M4o4j4L1Rm7O4q2R5R4
2666A29k22J12L1j06J79j58qJ55o9o2L2on7N2j7jJ25n4j9j1o0J52j72N5L9r1N6
2693Dm4M5N9n8j8m4J03m3J7k2j06J80p7k2LJ4O8j25O8K8l4jOj8l3J40j19jJ25
2722I5j32nM9r0J84o4kR4l08K00l2n2J29n7q6J16p8l7N9K8N0j09J2J16jq5J4q1
2750g3L9N6m6M3p9J40j48kM4O2L8r7M5o5K4mm9J8J10l6P1r3l0J1L0qK8n4m9N4
2780b0L9j0M7r8LL4K1N4Mj42J52r3j6jj6k9P8ln5J24q0l2O7j05P2K4k3N3k9j7
2810CO0k2m9LpkOJ8K6j6m2L7n0O4K7q3R9q0mK7k5RpM2K7r5M6l3j0O4pJ1r3M8l4
2845d2K7K3MPj6m1M3j0Pr1J27r7M9J5p3J08j30J01O1j17O3l7k6M2J2k7M8K3p4
$$ y = [11, -2, -8, 32, -40, 31, -17, -28, 16, -47, 44, -18, 22, -14, -19, 40, -24, 37, 20, -22, 51, -33, -1, 43, -21, -35, -4, 5, -42, 22, -60, 35, 129, -93, 19, 50, -56, 123, -35, -43, 112, 43, -19, 13, 7, -50, 2, -15, -16, 109, 55, 36, 25, -35, 117, -55, 0, 39, -52, 4, -40, 5, 64, 6, -12, -56, 47, 4, 21, -1, -107, 73, -4, -26, -23, -9, 59, -66, 2, 30, -4, -5, 1, -17, -50, 90, -29, -30, 95, -37, -42, 7, -83, 101, 37, 35, 129, -179, 21, -11, -63, 66, 9, -77, 39, -39, -76, -17, 11, 61, -48, -36, 80, 79, -6, 8, -73, -34, 22, -24, 19, -60, 80, -68, -70, -26, 36, 74, -23, 22, -43, -19, -23, -72, -54, 56, 20, 91, -2, -32, -21, 9, 1, 29, -25, -74, -20, 19, 9, 56, -42, -39, -5, 16, 70, 74, -68, 84, -9, -25, -26, -42, -71, 7, 4, -51, 73, -7, -39, 28, -77, -5, 19, -4, 49, 20, 3, 63, 41, -8, -5, -12, -14, -8, 10, 36, 20, -22, 15, -35, 29, 56, -27, 72, -8, -12, 15, -10, -1, -8, 34, 61, -34, 12, -21, -31, 33, 26, 37, -56, -8, -42, -15, 8, 12, 19, 3, -38, 5, -5, 2, -89, 38, -59, -10, 5, -68, 40, -90, 11, 72, -45, 18, -19, -45, -3, 9, -18, 30, 53, -21]
2874b1O5qoN0m2q8N0q2J0N6O4p6q3J24rnN1j5p6P9m0nj2Q6l7m2qM8Qq2N5o0LN9
2908A1j7j2k8J20p7Q3p5j4Q1j98J66Rk8k8o9lJ45r9Q1Oj9j06J71j58R0j24J10
2935A8l7O2m9O0m6m0pp6J59l8j6R8j48L2O1q2N4J49k29m0J10p6R4n0j16J97p3
2962b9o0K09o1j02P0k1J8J1pp7K11r1j31lO4J5J8n3L0L1n3M4L1j13N2J8o1J17
2990G7r7N1J5ook4m7kK0M2rjm1j6N5l7P0o2m8k0L4M5k6Q7p1k7K7l7lK0j2J1R4
3023E6j30M7L0J0j5J0o9J5J61m0p8o8P2M3j56P9M5k2O0k2K2r9n6J34k7k0P3m3
3051A2P6j14P7j8n5K4%K0k6l6R5m3q7O2Mk6K5J5ml0l3J07m4M9l7j3J3qm5P5j3
3082B2J2l8M7J4p9L0jlK1k6J1%J2J1n0L1l2njMj8K6K3KL0q0J2L4k5K3J2m3K1K3
$$ y = [-21, 44, 36, 30, 80, 38, -50, 0, -82, -72, -16, 48, -28, -111, 13, 4, -1, 50, 35, -41, 38, -2, -7, -19, 67, 30, -12, -20, 28, 36, -46, 9, -51, -48, 11, -6, -18, -46, 74, -3, 80, 5, -9, 72, -126, 40, 49, 21, -7, -76, -79, 66, -33, 48, 54, 35, -71, 100, -58, 32, -92, 18, -19, 43, -6, 54, 8, -32, -39, -115, 44, 6, -10, 88, -60, -28, 33, -49, 5, 154, -75, -115, -5, -81, 13, -37, -153, 44, -29, -89, 120, 59, -43, 27, 6, 24, 35, 28, -49, 162, 71, -60, -63, 1, 16, 34, -19, 11, 42, -11, 33, 64, -49, 3, 21, -40, 77, -20, 31, 46, 40, 34, 10, -37, -39, -19, 23, 14, 13, -28, -44, 11, -26, 44, -18, -66, -86, -52, -7, -33, 54, -17, -44, -17, -54, -57, -37, -49, -38, 56, -74, -27, 3, 13, -2, 8, -61, -46, 115, 75, -3, -71, 1, 44, -112, -33, 12, -10, 50, 28, 50, -49, -105, 29, 2, -18, 55, 12, 88, -26, 51, 33, -22, 2, 2, 22, -4, -40, 55, 12, -75, -13, -9, -35, -10, 5, 1, -29, -62, 45, 1, 50, 13, 0, 13, 5, -40, 35, 22, 34, -4, 43, 57, -22, 8, 7, 4, 25, -1, 10, 10, 22, 33, -17, 14, -18, -23, -24, -20, -38, -12, 11, 13, 43, -37, -25, 9, -16, 7, 19, -24, -3, 20]
3116B0j1l1J1K9L9j00J5J3L1o1L0j8L8L1l0nM4q4ON3j3k5O3k2n2K7k7K0J7l4L2
3147FJ5Jk8K4K0n4K1kmj8J1N2n6M4k0K0r5M0LJ1J6M4k5Mq5J2M2l6R6m4J3n2L9
3180A5k5K3L2mq3R0m8o3L4P7m1J5R0j17J8n7L5m4L8k0K7j3j2j7O1m2j2O2p9K8
3210c2J9q4J43j2L2j07Q4q5Q1mr2K2M2n8Q6o5M4m2JJ36q8N8l3l8k1L9l5K2j5p
3240iNp4J09l9L0L0m5Q7j21R5q9M4o7R3l4Mj0N2m0q2kM1l2O3k7k3JK4M7mk6L7
3272C8l7n4O7J1Mk0L3p9lQ4m5k0L4j3J1j4k4k6P2n5K7M8pJ9q3O7N8p2N7o9M7K5
3304H1p0J4k1j1L3j7m5k5Q8Ko7P2o1k9LJ05j9m1N5MJ6o4Prl0N7l7O6k8k7k9O4
3336C7p6K6o8O4mO9l5mj1rj0J6qnJ9Jlk3P7o8mLN5n5N0m5K5j6M6m6L0m4KOK7l0
$$ y = [20, 9, -22, -11, 18, 57, -43, -28, -15, 16, -45, -15, -33, 5, 36, 6, 1, 45, -39, -33, 20, 7, -18, 45, 23, -29, -2, -29, -9, 8, -26, 6, 21, 22, -6, 18, 38, -16, 5, 3, -1, -19, -8, 44, -12, 32, 12, 32, -63, -23, -20, -9, 7, 51, 26, 30, -55, -43, -1, -37, 59, 15, 28, -24, 15, -10, 13, 45, 41, -42, 48, 0, -63, -29, 48, 7, 22, 112, -5, 13, -44, -9, -53, -15, -35, -8, -21, -33, -50, 11, -31, -43, 19, -60, -32, -13, -97, 46, 34, 66, -41, 43, -42, 39, 35, -57, -35, 7, -51, 35, -30, 14, -28, -27, 109, 21, 79, 46, 8, -13, 26, -9, 13, -2, -9, -4, -78, 31, -8, 22, 52, 7, 94, -27, 68, -21, 23, -44, 49, 15, 19, 9, 61, 21, -61, -63, -22, -54, 9, -18, -41, -40, -16, 31, 27, 1, 38, 1, -53, 14, 25, 29, 9, 42, -37, -40, 44, -1, -21, 13, 0, 11, -3, -27, -53, 19, -36, -9, 39, 32, 51, -32, 35, 93, 21, 78, 9, 56, 81, 11, 25, 4, -7, 26, 9, -36, -61, 27, 29, -38, 34, -27, -56, -53, 52, 33, -8, 47, 51, 67, 3, 10, 1, -29, 28, -9, 57, 29, 2, -27, 37, -39, -13, -81, -17, -21, 48, 13, 9, -2, -11, -21, -5, -13, -18, 1, 2, -1, -24, 53, -15, -19, -16, 39, -16, 34, -11, 14, -2, 44, -2, 28, -16, -14, -8, 19, -11]
3372a1J1l2K7m1R4o5M8K0r2O8r7O7l7L2n4Q3m8N9k3J1oLKk9L0qJ2k8J7J7n6J3
3404a3J7%LJ2k3qnL5k6j3K4%j2J8%pj9K6j5J1mJ3mmk2nL8rpKj0K4qj2j6J9J%k
3443aJrlRJ1poKJJ3p%RjqoJolJ4j9N6k5j7Ql0J0J2K7j5l6M5nK8m7k3M3L5Rj38
3483g8J49j03jMJ7QK9o5L2J9j5J5l6LM2k8K4J1m7K3N4l0Npk6J4Jn2R6l5o4Q8J6
3516F3r5M6Nm1N3k7K0j1j3PN2k4j01R8l1m6M4%n1P2J3q9L7O0l8J0L2k5rk1l7N
3548d2M7jkl6O2m7R1m9j28J42j13P7J8L3l6q5J3R7o1M3o1M2oj2K3o7M3L9j04R9
3578A9l8J2Kn4L4M5l9%N2j5J4J4r3k0Q9J2n%j04N2K0K9o2P7j00M1L3j4J2j5o5
3609f7Q2n6L8J3L4KNr7K7N0j07Q7j2K8k1K2Mqr8J19p8k6J7J1k8M6L0QMm2lL6j9
$$ y = [-11, 0, -32, -5, -46, 48, -17, 31, 51, -41, 27, -70, -3, -40, -8, -62, 21, -27, 32, 9, 20, 14, 17, 19, -10, 20, 12, 24, -4, 13, 30, -26, -13, 4, 4, 7, 19, -4, -12, -17, 18, -8, -21, 3, 3, -9, 9, 9, 2, -17, 9, -6, 5, 1, 14, 10, 6, -16, -21, 17, 8, 1, 3, -7, 17, 9, -3, -19, 0, 1, 1, -1, 0, -9, -12, -3, 8, 1, -5, -3, -2, 11, 4, 4, 13, 12, 4, -2, -1, -7, -10, 4, -15, 41, 16, -1, 7, -23, -13, -1, 26, 11, -25, 20, 15, 43, -4, -27, 16, 51, 60, -78, 71, -32, -33, -29, -12, -4, 25, -40, -8, 11, -4, 11, -25, -22, 20, -8, 16, 27, -20, 3, 57, 27, 32, 25, -1, 13, 14, -38, 58, 23, -41, 47, 63, -32, 14, 19, -22, 31, 4, 24, 13, 0, 7, 59, 35, -66, 32, 1, -45, -1, -1, -52, 20, 33, -56, -19, 41, 3, 13, 45, 20, 11, -10, -47, -42, 5, 4, 2, -34, 28, -19, 72, 23, -105, 37, -76, 1, 19, 52, 16, -69, -56, 41, -20, 23, -38, 4, -2, -14, 9, -58, -15, 24, -80, 19, -19, -7, -5, -59, -25, 20, -19, -19, 33, 18, 32, 46, -47, -67, 22, 34, 29, 29, -75, -23, -3, 26, -36, 41, -59, -18, 15, 1, 13, -2, -67, 15, -41, -3, 10, 44, 46, 51, -46, -19, 31, -76, 11, -1, 27, 6, 28, 32, 24, -74, 45, -33, -59, -42, -31, -59, -13, 17, 25, 29, -13, -16, 20, 1]
3642Aj0O3j02N1L9l4j7RK3j0j4NK1l2k9M3j6K1j4J3j9L8m0j0jK3K9m8M4Ml6L3
3674B8k2mL3o8K9KPK6romm5J2L1j4L0l3l4K9M1m8LOLM0q1R0j8m6L2J6l7J7l8N0
3709A8pj1l1N0nl9Qk7l0L9M6l6J8K4L3o2j5J7M7l5j3J4Pk6N1m0K6J0J3q0J3pk3
3742e3N0mk1J5n7O9kN0J7j9rn3j2J5j7pJ5M8L6p6M3m5L7n5P1n0M5n4l1Q9j32J07
3774A0l9N1k1K8o3P0j3J2n2O1k7m3N0J7o%k2rl3O7k3j1N4q6M5n6O7o1M4l3n0Q2
3806A0M9n8M7q5J5r3R3L6r6N5K8j8J2J06j03K5Mn5J11n4n9O0nm7Lk5Q7m7k0Q1
3836E7r1OK4p5R3k5P5j37L0Q0L7l4j3l9j9k3K4M0rj4M0k5m9K5K0o7O4Q6j26N5
3866A0K9m6%m3Q4o2j9J8Q8r6J4PJ0Nj2N2m5j8OK1K3r5Q9q%j1Rm1M6K6m0J0k7J5
$$ y = [1, -9, 54, -48, 3, 42, 8, -9, 0, 23, 13, -1, 4, 25, -7, -36, 7, -9, 12, -2, 11, -8, 30, -10, -20, -21, 2, 31, -17, 27, 31, -5, 28, 6, 2, 35, -33, -4, -2, 5, 31, 22, 16, 12, -33, -21, 10, -4, 26, -7, -41, -12, 29, -19, -16, -10, -7, 33, -48, 42, 24, -22, 10, 26, -11, 6, -32, 18, 11, 0, -31, 19, 14, -25, -17, -44, -74, -35, 11, -25, -7, 17, 50, -12, -27, -10, 37, 2, -11, 3, 10, -16, 35, -5, 21, 31, 44, -36, -23, -30, -53, -3, -7, -28, -13, -70, -1, -3, 47, 64, 45, 36, -17, -29, -14, -31, -38, -23, 25, 61, -15, 28, -17, 20, -35, 36, -14, 31, -23, -54, 35, -97, 10, -29, 22, 1, 29, -34, 36, 23, 35, -17, 44, 17, -26, 24, 41, 35, 35, 13, 4, -29, 38, 15, 4, 58, -28, 17, -39, 28, -33, 11, -22, -72, 10, 59, 1, 48, -37, -22, -115, -22, 14, -82, -27, 1, -17, -5, 101, -2, 23, 27, -28, 83, 29, -30, 30, 25, -22, -19, -44, 43, -4, -24, 57, -34, -28, -4, -79, 14, -11, 64, -73, -43, 37, 74, 40, 27, -12, -31, -54, -30, 10, 1, -13, 27, 2, -47, -22, -2, -69, -5, 81, -45, 10, 39, -7, -7, -50, 34, -28, -47, -29, 59, -37, -23, -16, -6, -1, -13, 39, -6, -24, -18, 3, 26, -69, 20, 12, 12, 1, 10, -31, 15, 41, 1, 11, -16, -1]
3900aLJnK8o6L9%k3O0p4N5j2J5k6K1m2L9Pj0J2J0l2K0LK1o7M8K2p4nN6k5OJ8p1
3935d9M8Ppk1j6O1J2p2L1l7O9n2k1k4P4K8m5N4p5K4M8j5k3N3p4J7J7J1Qo2m5J0
3967f6J04m1n9O5n2R2p4m2k8P4M7K0o9J1J12r9MN3j30J12k0o3J24o2l5k5L5M2
3995C0K8n5O5j50O2L5J9r0J04n8K4pj5L1Ll4L1K5j03O7m1M5%l7O2r6J6O0m3j3
4025c5N6pl7L9o1R0j15J82j05Pp6M0M9r0N8L7Kj0m3n5lj0J02M2r7K5K8L8m3LK
4056A3O0o1j62J73N9pk9o5O8j0p5K7p5J64p2M2q2Q3K0o9O8m3m2j3k6M0j0m7k8
4085i9Q6kJ1k0M6J8p3M4M8j30K8R9o4NL4q7J03q1P5l8J3K8l1qq7P4n0o0N9J07
4115D8j66R5M1l1J09j02j9q5J07K4j33P5P0l9j19J03L6O0k00L12k18J28mj14j8
$$ y = [-1, 2, 3, -2, 26, -40, -1, -1, -24, 36, -38, 17, 5, 20, -6, 15, -27, 12, 19, 9, 21, 31, -1, 19, 22, 43, -24, 24, 46, -28, -33, 23, -2, 4, 22, -49, -1, 6, -1, -22, -38, 23, 35, -37, -6, -43, 26, -26, -47, -71, 3, 31, -14, 40, -35, -11, 37, 22, -1, 52, -22, -5, 12, 23, 31, -31, -76, -66, 38, -3, -62, 3, -49, 43, -31, -73, -101, -27, 20, 40, -29, -18, 94, -5, -1, 52, -78, 34, 14, -49, 75, 13, -22, -47, -12, 30, 58, 3, 68, -82, -20, 15, 34, -56, 48, -10, 14, 7, -8, 23, 26, -8, 23, 48, -55, 12, -29, 16, 16, -21, 41, -55, -39, 21, -22, -35, 21, 14, -23, 16, -45, 45, -70, 112, 7, 14, -62, -22, 27, -63, -5, 32, 34, 24, -19, -74, -77, -87, 15, 57, -40, -15, 13, 51, 8, 11, 13, 73, 12, -150, 23, 82, 75, 46, -19, 49, 39, -36, -9, -84, 80, 8, 50, -32, 51, 71, 2, 70, 27, -15, -28, -54, -14, -24, -71, -99, -13, -15, -4, -24, 22, 40, -33, 11, 59, -71, -43, 56, -8, -3, 31, -56, 47, -34, 41, 3, 16, 44, 13, 5, -82, -8, -58, -118, -59, 48, -118, -23, 18, -13, 96, -6, -25, -110, -3, 21, -112, -37, 33, -6, -125, -22, 14, 74, -126, 186, -32, 96, 92, -22, -40]
4140d0j3J9J35o5p3oJ22k2M3o3n1M4J6M5o0k9n8R3J7Pp5M6KMk9m6rQ3Kj60K64
4171A43j22r2O6j2Q9k1j7l5r2R6qj42J79m1j2K0mm4K4N9l1M7r0J68p7m3k3jo9
4200h5M7M3l4K1m7J33L9j60R2j13K03k94J04N3r0K9NRN8J0m6Q9jNr5j5j6J02j15
4229f9N2j3L4J45j28N0r8P6j18K8N4o1J44k7j02p2N5L5k8K6qo7J63j19N8J3R4
4256A17n4j16N0q5J58r8lJ16j11N9k5j4n5K45j58Om6M3Kl3K2N0j78J53j55M9k3
4283h4K4P3Lj1jj2jN8o1l9j0P7l7M4l7J3RKN2j05J21o7OJ2k6J0k7JQ1j33N7K4
4315A6l8N3n5M1N1o7l9J3M8p1RN3k1R2r5K7k6n0M3K8L4m4Qq3P8l3K2O4l9pKj1
4347CL2r1K6J5M8m7RKl4K9J5l4L1j8NJ3J2k8K3j0QJ2n5N1k5qoM1j1k8pJ3j8M3
$$ y = [-40, -53, -34, 101, 36, -37, -43, 79, 57, 100, 37, -14, 30, 46, 91, 31, 2, -56, 37, 54, 61, -14, 32, 34, 38, 9, -37, -46, 37, 39, -121, 143, 21, -71, -5, -17, 72, 51, 34, -1, -93, 3, -5, -147, 32, -9, -21, -1, -5, -49, -25, 34, 3, 50, -40, 128, 51, 8, -15, -16, -85, -38, 5, -29, -8, -55, 78, 117, -43, 49, -64, 139, -155, -51, 2, -88, -59, -54, -45, 13, 23, -23, 66, 65, 70, -25, -40, -56, 46, -69, -17, -30, 4, 149, 21, 71, -27, 49, -69, -41, 13, -48, 96, 69, -33, -105, -50, -15, -43, -17, -25, -92, 71, -48, 10, 23, 117, 63, -53, -3, -88, 70, -28, -31, 85, -26, 33, 8, -6, -61, 184, 26, 32, -14, 29, 31, -2, 20, 70, -108, 45, -110, -61, -84, -60, 13, 16, 5, 4, -8, -9, 49, -12, -51, -61, 16, -21, 23, -14, -1, 8, 10, 62, -43, 78, 11, 17, 29, 3, 13, -14, -13, 68, -65, -8, 16, -22, 31, -24, 17, 68, 1, -38, -25, 23, -48, -39, 14, -7, 85, -10, 17, -9, -59, -16, 12, 46, 2, 10, -73, 5, -28, -6, 58, 19, 12, 14, 3, 35, -56, -30, -15, 33, -14, -5, -3, -37, -8, 7, -27, 4, -14, -9, 4, 16, -12, 11, 1, 9, 21, -34, 17, -8, -16, -22, 19, 8, -20, -27, -14, -32, 11]
4381A1K3n5O0m0m1M4LK4k8Kk3KJ6MmJ1l9k1N4K8p2KJ7OJ2pKM0j0JK0K3nr1K3l8
4417d6P3o0J24p5m1J6L4k7OJ5o8P6j8K5p4N1L1l5pN2o1n0R2m4K4pqk7R4l1r6N5
4449gj3j7j9M1j0K7lo5kJ26j8l3k5N3M2m7n1J5m6P3l9L6J1m0Rj1L5m9L5oP0n4
4481A8J9o1k1K6L3l1n9J42j13L7n2N8J4j1K1K7l6n1K2K1M3q7O1k2M9n6L6o0RJ01
4511G7l3o2j5M0lO4m3q8N3j6K2L5om0Qm5Q0j02O5J9L7p7J7qK0J0jL0m3k8M7K6
4543D0q5Q2l9j5J3J0m2m6P6kj4RO8k3n2K5N8l7q3J8P3j3J2p9O8J9l2m3P5o5oL
4575b7rK0K1PM2k6k8L8o4QN3m0K9j7Rn0L3rK7rk1J0P0m2p1N8J7l0rK3j1kL7j2
4609B5J0p8J9L3L6p4O7l7m0M1J5J1j1m0K9k7OK3l3L4j4j4LkK7MnLl0j1L7k0K2
$$ y = [11, 34, -21, 39, -1, -42, 2, 5, 29, 1, 3, -20, -18, -2, 2, -2, 9, -30, -51, 3, 31, -41, -39, -22, -16, -4, -11, -9, 31, 21, 22, 42, 65, 60, -31, -8, -46, 27, -33, 91, 16, -25, -9, 25, -2, 4, 19, -49, 27, 9, 34, -40, 11, 42, 7, 0, 52, -9, -59, 33, -11, 13, 6, -2, -29, 65, 34, -62, -7, -20, -37, -56, -15, -25, 2, -1, -66, -68, 58, 40, 7, -18, 35, 77, 30, -21, -6, -52, 21, -18, 18, 29, -11, -2, -13, 22, -27, 8, 2, 72, 18, 37, -24, -45, -19, 14, -17, -76, 66, -47, -10, -62, -4, 10, -1, 20, 47, 11, -40, -18, 3, 46, -41, 20, -2, 47, -9, 27, -33, -24, 77, 44, -18, -33, 7, 4, 68, 25, -63, -10, -26, -4, 31, 25, -15, -7, -52, 28, -74, -9, 10, 47, -30, -13, -21, -1, 9, 8, 38, -5, -33, 14, 40, -45, 37, -2, -17, -4, 6, -36, -82, -6, -8, -22, -13, 55, 32, -20, 5, 63, 26, -57, -39, 34, 21, 33, -46, 22, 41, 9, -34, 41, -24, -30, -27, -36, -16, 5, 12, 54, 28, 0, 38, -26, -18, 35, -5, 24, 7, 16, -34, -1, -10, 17, 8, -13, -3, 67, 25, -46, 12, 29, -1, -10, 13, 2, 0, 37, 25, 35, -43, -24, 9, 45, -29, 38, 1, -39, 2, 17, 28, 17, -23, 6, -21, -15, 8, -25, 9, -5, -19, -16, -18, 9, 13, 8, 11, -19, -30, 7, -13, 9]
4642IQlLn2L4PL3o6lO0k3jl1J6O9p7K5n3j3O0OL9p5K8k5L9Mm7L4J7J5j5P3q8k0
4677a3j7Q0n7lMM5m3qQ4j16L6Pk8lN4n4P7l0p0M1K9n6LL7%qrKL7o3O2j2jm5N7
4712A9N8j01K5n0J8P7m1m2L5k8K4J1J7j0L5n1l8L2pM6r0N8ko8M1R6q9P3l7p1O1
4743Aj02J23l8J5l0l1l4J03J8K5j06Q0k8mQ5r1Mp2R3J1L3l6L2m2j6J1MPn2L2j7
4774b2K0LK3L8n9M3j21R6n8k1M3MM0k1n6M9o2R6k2ok4K5J7jn6K6k0M6M2p0M6J1
4806D9o7K6j5j9jj7Q7k1j0k4l8Q0k0Lj1j1NK5ml5jK6j0Qj8K7k8qK7NOk3rJ2Nj0
4842iJ9k1M8j4j2j2J2nm0N6m6M7l1K6j8L1m3J5nj5k3L5l0L7r3k0J66n2N5r3m3
4873g8P9rL6j03J09Np2J2M3k9J3k4pk5P3k0L8m6nk8J4oL1K3K0l2l6L8l0l3R8n0
$$ y = [9, 17, 14, 17, -35, -1, 6, 39, -27, -30, 30, 7, 6, -25, -9, 60, -17, 8, -45, -58, 2, 8, 47, -28, 0, -25, 14, 18, -29, 5, 22, 37, 22, 95, 7, -13, -30, 50, -7, -10, -6, 39, -4, -12, 72, -44, -8, -1, -29, -32, 22, -32, 45, 15, -55, -14, 15, -41, -38, -1, -1, -9, -18, -16, 21, -42, 20, 8, 7, -38, 19, 77, -24, 1, -49, -31, 46, 5, -37, -2, -30, -6, 5, 22, 12, 47, -4, -42, -10, -17, 29, -61, -3, -5, -73, -32, 64, -25, 48, 11, -60, 1, -101, 22, -16, -1, -31, -62, -96, 7, 25, 50, -56, 24, -4, -8, 77, -14, -10, -82, 11, 22, 55, 19, 51, 9, -7, 4, 8, 15, -37, -5, -22, -2, 1, 24, 62, 3, 46, -75, 21, -37, -58, -15, -11, 29, 8, -48, 1, -61, 35, 13, 7, -17, 8, 25, 24, -32, -6, -26, 20, 62, -8, 38, 49, -18, 8, -7, -26, -27, -44, 43, 22, 12, -12, -50, 30, 10, 13, 2, -9, -4, 21, 17, -18, -19, 7, -3, 5, -13, 14, -14, -22, 5, 10, 16, -7, -16, -4, 1, -9, 10, -11, 37, 23, 11, -1, 11, 6, -34, 22, -24, 23, -8, 18, 0, 31, -12, 3, -2, -17, -40, -5, -35, 2, -91, -111, 55, 3, 58, -35, -78, 1, -8, 28, -75, 34, 39, -33, -21, 22, -7, 6, -18, -25, -50, 23, 3, 41, -5, -10, -38, -24, -30, 1, 24, 44, 12, -24, 14, -16, -49, 49, -1]
4905al2Q7j11J05l2l6OJ6qK7n4N3o1lN6P4op7m6L4P2m9pLKrm9P2j9k2J2M5o3P6
4939E5o7M5m1J3J8O0r1N9j6l1K0j0M3m7O0r4Q1j19J06k4j26P5J9Qj5j7R0l5p9
4968f0M5o7M3R5p1N6J4o8M4J8r0P9l2p6J18Kj0j35M2n6J03K3L7k3r2oL2N3l1P
4998fk2m4K4O1k8K1JL4j0p7J4L9kJ7j6NJJ5kk1J2n8L0J8%k0K6j5pK7m6MnK5l1
5033c6J3J9mL0l2L0j6KJQpj3J2JLk3J6j1%J1j5J8mRppJ7j4J2j9J4k2K5nj6J2j9
5070a7RlJ3q%Prj5L2j3RMk5PK9j6rK0j3j1K7j5K1k1j4L0j7Lll1J4K1Pk7Noj3K0
5108hJ3nJ8m1J8J9n7L4J5j1J7K2m9KJ0J9pl1K9mk1L9l7RnJ8%l2L4M0Mp0K4n2J6
5143c0N1K6m0K0o4QO3J1m1J2J6J1o1QQ5m4N4p3K6n2m0Q2m9k3O3p8O0kkJ1N3o5
$$ y = [-1, -33, 54, -57, 48, 16, -20, -14, 2, -6, 21, -33, 20, -41, -44, 12, 86, 80, 3, -43, -9, 63, 14, 7, 10, 12, 3, -46, 26, 7, -15, -3, 42, -21, 55, -12, 33, -8, 5, 23, 83, -8, 51, 35, 4, 24, 14, 57, 10, 70, -24, 57, -62, 44, 20, -106, -31, -12, -4, -19, -36, 54, 19, -60, -15, -82, -39, 56, -15, 41, 55, -13, 31, 49, -41, 38, 6, -70, 48, 50, 40, -95, -53, -109, -6, 17, 54, 31, -61, -67, -35, 18, -13, -6, -28, -72, -48, 13, -15, 6, 7, 41, 31, -46, -32, 7, 5, 22, 6, 11, 12, 27, 25, 4, 16, -42, -12, 6, 6, -14, 12, -3, -10, 17, -29, -25, -30, -5, -36, -23, -4, -8, 22, -10, 20, 4, 6, 7, 15, 8, -5, 7, 8, 11, -12, 4, -7, -7, 4, -11, 7, 3, 12, 5, -2, 15, 1, 13, -6, 8, -14, 11, 6, -10, 2, -17, -8, -11, 2, -6, -6, 1, -8, -23, 9, -4, 5, 9, -16, -9, 20, 4, -5, 15, 2, -9, 18, 3, 24, 3, -11, 19, 2, 5, 2, -29, -15, 6, 13, -14, -9, -15, -28, -8, 5, 0, 18, -23, -5, 14, -43, -9, 6, -5, 12, 34, -15, -13, -3, 16, 9, -22, 7, 3, -18, 21, -16, -7, -12, 6, 6, -26, 8, 48, 52, -18, 6, -46, -30, 21, 47, 7, 27, -37, -29, 34, 45, 4, 16, 32, 43, -18, -10, 75, 31, 85, 12, 38, -14, -54, 28, -21, -44, 19, -59, 1, -1, -3, 8, 61, -4]
5175dOO1q1J9k5QJ7p6R7l2PJ7N7j00k2P8J4l5oJ7l2J3k9J8Ll0K3R1p3MJ8m9L5
5208Ij3kj8j7J01qk3l2L2n5J9K1pMq1K2J21l2j00M9L9j9k1O6q0J3L0j1k1L0oJ2
5240B2jp2J3K1J6L8m2k0N9J1m2pJ7k5JNJ7K0j1m5%j3M9rJ3Ln6N9n2k9R8j5q4O4
5274CK6j7M8p6lQn0kO3l7P9o0%L1m5l3Q8M1p5j5M3n2Q5j0n8M4ok0MK3pL8o4O6
5308F0j30R5m8N3j6n7P0rl3j4k1k4L8L3Q8r9Q1l4p4k1M7J0k8N2m9N0o5L2K0l5
5338b8Q1r4nM1J12q6l9N7K4q2NNL7q4Q9p6N6N8r8k5M3O4m9%K9j7MO2l8Mp6O1J8
5371E3q4L6prm7O8oK2j9N0j72N9P4J6j03N9j1j7P0l7J7l4n0J04j04J3Q7r3J06
5400D1m7K9o9l4M7J5k3qQ6J4m0Mm2Q1l3k9k6N4k5K6j06N9O5m5j5L0j7k5M2J4J0
$$ y = [-4, 2, 63, -18, 1, -24, -16, 1, -75, 22, -10, -3, 14, 71, -29, -51, 27, 41, 6, 0, 17, -15, -2, -31, -13, -10, -40, -17, 74, 1, 5, 23, -26, 9, -4, -6, -24, -41, 60, 52, 29, -3, 29, -26, -7, 14, 7, 11, -70, -48, 73, 41, -59, -10, 29, 10, -11, 55, -25, -12, 18, 7, -14, 16, 10, 22, 21, -51, -38, -17, -1, 37, -5, -25, 34, 45, 3, -4, 13, -12, -11, -6, 11, 31, 20, -25, -25, -38, 11, 2, 15, 18, -38, 21, -31, -60, 38, 23, -61, 3, 29, 12, 60, -16, -19, -11, -61, -63, 0, -37, 42, -18, -18, 13, -32, -65, 23, 64, -11, -26, 17, -35, 50, 40, -18, 26, 20, 0, 4, 27, 20, 58, -6, 60, -70, 25, -23, 30, 14, -43, 27, 18, -15, -29, -50, -74, -36, -3, 85, -14, 67, 33, -41, -62, -15, -5, -33, 19, -30, 20, -45, -13, 7, -28, 53, -41, -46, -5, 107, 21, -18, 39, 63, -19, -14, -9, 28, -56, 33, -43, 13, 71, -27, -52, -9, 55, 6, 6, 35, 18, 22, 84, 46, 50, -26, 35, 53, -31, 5, -2, -11, -58, 10, 4, 26, 7, 57, -115, -56, 18, 34, -69, -10, -21, -38, 32, -5, 12, -22, -72, 32, -72, -59, 28, -65, 41, -6, 23, -46, -80, -33, -18, -41, -49, 37, 51, 11, 15, -27, 54, 21, -8, -34, 20, -5, 21, -85, -26, 39, -6, -21, 9, -8, -33, 9, 23, 33]
5431C3n6M2K6o2J7M4rr9L4NQ3j06K9kK3j3j4K6J9j04M9N1K7r9M3J9K4M1o4j9N2
5462D0m9l1O5j5LNl6O5l0k0L6k1j9O5q0L1Rk2L7n7L2krkll5rL4NM9l5j7L6m2M8
5497B6j2l0jL5k3LM9r8P6l4L4M1q5J6J9n1OL4k1K3L6j0q5O9n9M7K5m6L3o0K9m
5529a8L9n8O0m4M7J3k0k7J3o1lJ20k0m8K0m0J2m9Q1k0J4l5N8J9l3K7o3J3M3k0
5559B0M2k6l0L7q2n9R5k3LJ1M7l5m5M0L8l0o2L5J08n4nk7m3L6j3L2PJ5n6R2n2
5590A6l2K2OkL7o3J0N4m2Ol3J9m9k5R7r9J00l5oK0L8o3N7p5O8j2j4n2P2l5k4M8
5622Il5qK0p0J00M1j3l2Pk9n0P3j2j0Pj4K4jQJ1m3N4n6O8k0J3l2m2L4Mk8K2k8
5655b8O3n6M4l3J1J2l0J1k7M7n6L4J1KK5l3nQJ3m8M4%qj4M6lRj0J0K4k3j4r9J07
$$ y = [33, -23, 19, 45, -17, 0, 44, 35, -64, -30, -25, 58, -48, -19, -21, 2, -11, -25, 1, 20, -84, -35, 16, 43, -56, -13, 6, 30, 71, 7, -12, 40, -9, -40, 25, 10, 13, 18, -18, 47, 17, -3, 33, 12, -7, 58, -22, 9, 18, -4, 33, -24, 8, 6, -3, -5, -8, -43, -52, -18, -13, 36, 1, -16, 20, -22, 26, 14, -16, -17, 18, -5, -2, 47, -51, 25, -9, 25, 66, -19, -3, 16, -35, -29, 5, -16, 7, 43, 33, -52, 17, -42, 5, 30, -16, 17, -43, -14, -18, 21, -37, 23, -21, 26, 39, 19, -8, 5, -56, -59, 61, 41, -7, 13, -27, -15, -64, 17, -3, 11, -24, 34, 53, 20, 47, -16, -3, 40, 20, 62, 36, 6, 43, -39, -98, -3, -26, -23, -12, 35, 0, -45, -5, 33, 3, -59, -24, 84, 30, 25, -2, -45, -9, -22, 10, 17, 32, -24, 68, 16, -16, 6, 12, 10, 47, -16, -6, 48, 6, 12, -21, -2, -51, -76, 21, -78, 22, -13, -19, 1, 39, -24, 33, -42, 26, 14, 0, -52, 20, -15, -39, 9, -26, -34, -14, -84, 16, 57, 44, 12, 19, -10, -60, 13, 1, -9, -2, -16, 8, 7, 15, 26, -17, 37, -19, 49, 29, 42, 10, -32, 2, 6, -22, 0, -28, 35, -21, 23, -10, 1, 13, -17, -6, -33, 14, -42, -8, 3, 5, 30, -3, -8, 0, 13, -35, 9, 9, 1, -13, 33, 30, 39, 29, 39, 63, 40, 26, -73, 34]
5689C4l1O7m9k6k4PJL7j6P3p0j5L6o4P7p7O0l2N5l0n1O6o6J6m3n8Q1M8j0K8j8
5720FL8j31Q4Q5n8m6P4J2o1m4L0o4J04j2o6J16q4K9j1n0J46r5l9Q5lo6j8K6M2
5749B9jn5O1o0k6M3L1J0n2L5p9J23m2j4k1j4K7M1p3R4k8l7Oqk1N4j5n0J5L4N0
5780E7m1rl7L1m0K0M0l9J8M3p0nJ8K8m5L7j8M2n2M8k2j3Q1n6k5jM6l0K0m7L0k3
5812a4O5l6Ko3P7Kl1L5o1mO3o4L0J9Jm4K9j1Rm6K2K9l0nK8jN8p3PNJ0l3L2mlJ9
5848A9L1k9k4K4o0M9oM5l5K8po9M3o0J9J2O5m3j4m0N1j5M4n1P8k6j4Kl8M4m1j1
5880b9j7L9l1N5k0l2M9Jj4Rj8M8J0p9Kj0M3j8j8L1Q2o4K2k4O0p4l7NN5N4p8l2
5912c0P4n5jj5J0L9n2Q3o2M2k4k0J9K5l8K8jl1K2k5L4m2O4k2k6l5Q0j4%n4k9P6
$$ y = [34, 3, 70, 21, -5, -29, -22, -21, 16, 0, 73, 3, -12, 24, -40, 37, -40, 20, -12, 43, 13, -38, 28, -38, -22, -65, -123, -42, 6, -4, 24, 6, 44, -87, -3, 82, 24, -22, 52, 64, 3, -41, -11, -75, 29, 17, -49, 67, -17, 12, 1, -49, 97, 2, -37, 48, 45, -21, -39, -13, 29, 28, -27, 34, -26, -52, -9, 22, 32, -20, 15, -64, 59, 17, 3, -18, -32, -5, 36, -37, 57, 29, -8, -2, -10, -31, 23, 8, -42, -27, 7, 57, 16, 7, -30, 1, -39, -19, 21, -18, 0, 43, -27, -32, -14, 14, -31, 6, -12, 30, -22, 26, 4, -9, 72, 16, -9, -10, 36, 6, 26, -21, 9, -14, 51, 15, 17, -46, 31, 33, 2, 37, -24, -28, 35, -29, 1, 20, 21, -23, 6, -5, 4, -42, -20, 9, -21, -26, 2, 1, 59, -14, -7, -2, 8, -25, 7, 3, 0, 19, 50, 21, -3, 21, -39, 10, 4, 49, 14, 42, 35, -34, 9, -51, -32, -20, 45, 2, -12, -52, -1, -16, 28, -23, 55, 29, 15, 17, -21, 23, -18, -29, -46, -7, -38, 17, -3, -35, 14, 15, 1, 10, -8, 40, 50, -29, -27, -37, 6, -12, -30, 1, 83, 19, 41, 17, 77, 3, -34, -29, 26, 80, 2, -30, 44, -11, -12, -27, -17, 22, -30, 53, -9, 33, 9, -11, 8, 33, -5, 23, 22, -9, 13, -12, 22, -20, 44, 22, -4, -39, 41, 27, 27, -27, -56, 20]
5944B0j9k4N%L9qk3oJpJ3K8l1j6N9m4K9k0K3j8m3MO5k8Pj5j7K4oK3j3k6P0j2n
5979B9j5l1NrprO0l6m3L5JM1k8m7NM0L8n9J9j3JJ9J5k9N1n4jjPM2j4Pm2J2Kk0
6015b9K2J9l3M4k9j8N7m0k0L4NJ6p9QN6m3J5K8J4MJ6p1O5o9k5o5R4j3lM1qN4m7
6048@m4M1J5k4Q%P2o6j1K1j2j8j01J44K2m7L9K2n9L2q6lL8rL0Qp3K5L0K1j38J24
6080Al2N3jm0P5m6Rj07R5rk9R0m5ok1L1L5o0M2p2Rl6R5J1l6ooN6k7J4m7L4q4L7
6114b3Jj7LM3J5n8M3o0Q3o0M8p0oJ02J3M7p5k7NJ4n5J6Q7m2J4k6L7l0j1qj9q0
6146i6J19l2NL2j2m5j1N3jQM7n5%M9m7n7J27l8p0QL0K5m5L6QK9K0o7p4J02J2j50
6178i0L0Nk0O1n7O5R3j8K2o7lQ8j20J0M9j29L5J7O1K7p4N7ml4plrl9J34q4o5Q5
$$ y = [20, 1, -23, -18, -18, 21, 13, -10, -16, -15, -22, -9, 19, -12, -28, 31, -13, 16, -4, 19, 1, -42, -38, 27, -1, 6, -9, -26, -2, -8, 15, 2, -24, 46, 34, 29, 14, -17, -12, -21, -28, -37, 23, -13, -56, -21, -20, 21, -7, -54, -49, -9, 29, -30, -11, -24, -23, -4, 11, -18, 33, -21, -22, -23, -16, 26, 12, 19, -23, -11, -9, -29, -7, 12, -21, 23, -6, -24, 33, -7, -27, 7, 12, 28, -51, -43, 13, -30, -15, 13, 27, 31, 47, -24, 41, -28, -53, -118, -24, -37, -40, 1, -7, 47, 0, -44, -3, 12, -12, -4, -4, 68, 2, -9, 12, 0, -18, -119, 25, 47, 0, 39, 61, 2, 34, -52, -55, -17, -26, 4, 12, -61, -36, -6, 15, -123, 1, -31, 22, 21, -19, 56, 10, 19, -88, 7, -2, -31, 59, 14, 8, -13, 18, 53, -7, 35, -37, -28, -64, 31, 42, 6, 0, -6, 50, 23, 37, -10, 24, -60, -23, -22, -39, -36, 7, 22, -36, 7, -53, 30, -30, 18, -52, -58, 44, 57, 104, 29, 2, 7, 21, -34, -18, 69, 27, 41, 15, 52, 22, 11, 3, -16, -96, 23, -9, -4, 28, 16, -29, -40, 13, 12, 20, 67, 12, 12, 61, 14, -43, 84, 46, -24, -16, 14, 39, -6, 30, 38, 67, 87, 20, -54, 48, 60, -90, -60, -55, -75, -14, -71, -6, 87, 69, 91, 24, 21, 109, -11, -1, 48, -81, -46, -29, 32, 59, -15, 42, 38, 4, -3, -6, -15, -54, 80, -4, -69, 16]
6210A6n3oQ8m9K4LJ4r6Q7mOJ1m2L8o5N9m1n2R9l2RK5j4Pj3p9P8qpl5L4L8j04Q8
6244B4q3M0M4m7M5n2p0J76mr2J26j06n1L3Pj1M3p5J64l9n0l1K4J6P1n8J1j15K1
6273c9j3l4J76l2rm3P1k9r5O3L8j47P0K7L8j22J45r7n9Q2K7M0j2o2JJ5j8R3j09
6302c4L6JL6P8k10K16j13l9L9l8l4M7k5J25j10M6K2n8Kj3J08j56R2J8n6N3r8n
6330g0J56q6m9MQ1m3J24j45j6j7P0J7p1L3L1l3p0N9K9m1M9l1O3m7J1O1j2m6Jl
6360In2j3q7J24J8RK2J3L3q9J2l7M1N3j3q5O0J3j20J24o2L5J3P2j13j5J00k6p9
6389d0K3NL0M3Mj00O1r3R1l2P2j10P0qN5n9k0Q2p8m5N3m8R7o8P4N5j78J23k5Q8
6419A22j53M7k2p2n7J22l3L1N3Qj01J32j11L5p7KR8n2m4R2q6P9o5J6%k0N6n7J31
$$ y = [16, -37, -43, 45, -4, 20, 23, 37, -59, 28, 24, 30, 41, -1, 37, -28, 31, -10, -62, 37, 5, 14, 39, 25, 32, 19, -60, 18, 10, 3, -32, 2, 40, -64, 24, -59, -19, 25, -22, 23, -29, -99, 77, 73, -19, 107, 1, -50, -17, -10, -21, 22, -53, 111, 72, 22, -9, 15, 31, 102, 44, 55, -60, -39, -52, -86, 90, 58, 49, 6, 77, 48, -47, 16, 54, -93, -23, 4, 42, -80, 65, -32, -91, -9, 18, 58, 46, -16, -15, 0, -18, 75, -34, 2, 3, 39, 117, -93, 123, 10, -29, 10, -28, -62, -15, -40, 85, -25, 21, 43, -15, -13, -26, 82, -74, 18, 36, -20, 33, -65, -70, 86, 0, -49, -45, 36, -7, 117, -28, -44, -61, 9, 26, -45, -12, 19, -14, -84, -25, 4, -37, 12, -19, 44, -3, 8, 69, 57, 11, 12, 9, -43, -56, -143, -19, -1, 8, 30, 43, 76, -13, -1, -38, 3, 56, 43, -42, 18, 31, -89, 35, -27, 8, 21, 93, -20, -35, 65, 39, -40, -17, -12, 18, 61, 65, -35, 26, -67, 24, -8, 64, -46, 24, 16, 71, 12, -8, 74, -4, -49, 4, -44, 53, -15, 59, 114, -64, 59, 34, 122, -31, 16, -6, -78, -135, -13, -46, -15, 38, 46, -55, 77, -34, 1, -76, -74, 24, -28, -72, 20, -66, 13, -52, -36, -36, -56, 0, -57, 74]
6448G4p5R3j00OO8O7j88N3jl7O2K6p4l5P6L4m7NO1j22J93o8r8J37j36m1R5k8O7
6477F7j05J0L2q0J66o2q0L1N2o3j1O6j03J17qp6p6J35j2JJ0o5r3P0kO3j4KK4j2
6507a6r6K0N2M2P8r8k3Q0K2p0o4J27o6m3R1j15L8Q6J3n8K3Nm4j7N3r1M4j2P3n0
6537a6O1M8q0j5R6j11l4M0LJN7p4Lj2j7N2QK2k4K6m2k7L4j3NO1n6J5KJm9N6l0
6570iK4oj0p%kj5PL7k1okJ1j1MPJPlj6J4j4J6j2J3noJ3Kj0Pj0jRjkO%j4%jLPJ
6614Ej0LoLPj1KJ1j1OmjjOK2l3Qk%JJO3l1J3k8j4n6O9O1o8m8J8J5j0L6o2N9Mj
6653A6K6jk7KK0j3o1pL7kj0K9j5l6RO8m8j1K7k6O6n7K9k9K1Nj4J1K6k4j4J0j3
6686fK5j1j3pN6q0mM5j4Kj7M8%l3QnL7n7qKj5R0m3K4k8K0jl8J4J2K1J0n7OL0Q
$$ y = [74, -1, 92, -8, -2, 66, 133, -55, -2, -3, -40, 22, 48, -26, -61, 15, 49, 2, 7, 68, -54, 139, 71, -27, 110, -26, -67, 28, 0, 67, -38, -28, 4, -76, 90, 28, -52, -21, 31, -32, -43, 23, -80, 37, 29, -47, -123, 12, 0, 1, 11, -54, -147, -77, -79, -16, -30, -28, -4, -16, -112, -92, -40, 2, 80, -18, -41, 39, 61, -9, -73, 54, -12, -55, 36, -79, -41, 45, 58, 0, 23, 28, -16, -33, 20, -71, -27, -39, 34, -16, 45, 93, 13, -2, 94, -17, -51, -11, -8, -7, 50, -24, -21, -33, -50, 2, 10, 32, 8, 34, -8, -35, -1, -14, -9, 52, -4, 11, 13, 14, -35, 21, -9, 15, 9, -1, -8, -8, -10, -25, -18, 19, -2, -8, -10, 1, -10, -6, 1, 2, 9, 6, -10, 4, -10, 6, -6, 7, 2, -4, 9, 11, 1, 8, -2, -3, 6, 5, 3, 9, 9, -5, -5, -6, -3, 4, 5, -5, -2, -8, -5, 2, -9, -7, 4, -7, -1, -5, -6, -7, -1, 21, -12, -4, -6, -6, -5, -4, 59, 28, 41, 13, -1, -57, 12, 73, 5, -43, -25, -10, -20, 16, -46, 13, 17, 16, 42, 41, 14, 16, 36, 23, -38, -45, -8, -10, -20, 9, -6, -42, -33, 35, -13, -24, 3, -23, 43, -14, 15, -14, 7, 12, -2, 9, 35, 11, -3, 7, -6, 19, 8, -5, -12, 44, -36, -40, 5, -9, -7, -24, 24, 24, -9, -1, -6, 31, -26, -34, -32, -47, 43, 0, 24, -4, 16, 15, -23, -9, 3, 24, 34, -23, -17, 13, 21]
6722B1j5l3N0m0N3j1J7j7j6J6k4n7Q5J0k4k6k4K5j4N0n0J3k4L2k5N2n7K0M1ko8
6753d2J7J3K3n0L3j7j3ML3j4K8Ol6J2jK6kk6J3Mrj8K9K1n4M8n1M1J6l9k6K6%l
6787hl1R5o2L6m1kl2O6j2l3M0l5L2j4n2N7r4R2n8R0m8K9lk2L7n1K2rM9n5J7j0
6819a0k9N1M5p7L1j7qj0MlO3o1K1k5K4M9k3K2q5k1N3K8m5J3K9J1m3M2o9MO4l2
6851djj1M5m7K9k4PK4k9K4m8J4K7oKj5J4j5M8m6nK3k8L2J6L0p0KK1J7j4l7L1l9
6885c3L8KJ0m2J1nL1J8k7ljm8M7mK0K7n1J0lpJ9RnK5o2O5m7J4kk7M7k3m0M6j9
6920a0j2M1J3jq4O0Oj6l0M3j8rlM0K9k1Qk6j5K5j0J1m7L1j6MJ7Jpl0J1mK9J0J3
6955C3k2k0mK9m0K0rj4J7LK8J5m5J2m1K7K2l9M0k5K5k6j4P3m4M4k6rK6k5pL7p6
$$ y = [21, 6, -27, 23, -17, 36, 25, 42, 25, 9, 25, 1, -56, 29, 39, 15, -11, -35, -10, -24, 26, -24, -11, -35, -3, -28, 24, -33, -13, 28, 26, -42, -25, -12, 11, -39, -6, -23, -36, -32, 1, -13, 15, 21, -15, -3, -4, 22, 20, -6, 7, 11, 2, -16, 13, 34, -20, 28, -23, 18, 34, -5, -31, -5, -5, -8, -39, 56, -6, 30, -11, -13, -45, 21, 9, -24, 16, -19, 13, -1, -53, 4, -90, 2, -56, 34, -14, 15, 12, -10, 27, -24, -2, -11, 38, -17, 0, -10, -39, 12, 57, -20, 11, -6, -14, -24, -20, -23, 40, -21, 0, -25, -1, 48, 25, 47, -38, -59, -6, 22, -23, -10, 19, 30, -13, 29, -40, -36, 28, -4, -5, -16, 29, -18, 11, -13, -6, 18, -11, 13, -35, -21, 6, 0, 2, -13, 1, -14, 34, -12, -17, 6, -22, 10, 26, 56, -14, -12, 9, 26, 12, -25, 6, -33, 5, 7, 17, -25, -14, -19, 12, 30, 3, 0, -1, -49, -2, -6, 14, 41, -10, 0, -3, -10, 9, 18, 13, 38, -24, 41, -6, 8, 6, -21, 26, 3, -37, 9, -10, -22, 19, 32, 31, -53, 7, 13, -3, -33, 10, -8, -17, -20, 20, 49, 28, 36, 10, -5, 20, 10, 21, -26, 5, -11, -7, 10, 11, 4, -26, -15, -19, 10, 20, 33, 11, -9, -13, 16, -24, -4, -13, -27, -10, -7, 21, 36, -9, 3, -38, -11, 11, -28, 12, -13, 12, -14, -28, 45, 1, 45, 19, 10, 36, 11, 4, 41, -35]
6988c5L0O7k1l0J7l1Nl1K1n5J06o3K2p7J07Nm6K6K3Ko0R1m0j1J6j1j3K2p4P0L7
7019F9q2M1o7M2l8j4PM5k2L5j3k9L4L8j7m7OJ4k0K9m7J8J4j5R4o1j5j0mJ3J7j0
7051Ej2QnJ3j2NlMJ1j0jJ0j4J3qMqQj1%RJopO%J%KplJ1j5MNjJ0j9J6orQMkJ1j4
7097dJ0rRljKJ0j0o%klJ8opPplRJj1PJ3j6%mmRmJ0mrPnNj0OJ3nRj6jnJ6m%J0j3
7145aNnKJOoJoJJJ1kj8J9j6NrJ5j1NoNoONmj9J6MLjPJ4k4oJJ0K2rj1kM%J3kk7
7191iMQL7n0L8j4Km5RJ4J8J3n6K9l9O2j7ORrl8oN3O9m1n3K1n7L0J5K7ll7N8q8
7226d0M7%l4K2j2JQ0n7k1Ol1OR0m6J5l2M5l7n%MM3K2m0LPj04O0K2j3K0o8K6Q4
7260F3q0l1L6JRJ6J0L9j09K6O9k0m2L8n6N7mk9L3l8j1l0M2LN0j1k0j6o7Q3q0K1
$$ y = [-35, -5, 62, 41, 11, 28, -3, 2, -29, -8, -63, 43, -20, 2, -75, 32, 37, -9, 17, 40, 42, -18, 73, 33, 22, 38, 27, 14, 36, -38, 32, 69, -13, 28, -39, 3, -35, -49, -42, 3, -19, 16, 3, -26, 8, 46, 29, -18, -12, 2, -18, 11, -36, -18, -4, -19, 75, 14, -1, -11, -15, -2, 15, 5, -7, 1, -4, 9, -3, 2, -1, 3, 14, 4, 3, 13, -1, 12, 4, 8, 0, 8, -3, -3, 6, 7, 1, -6, 0, 0, 1, 1, 3, -4, -7, 4, -11, -7, -2, -3, 7, -12, 4, -2, -11, -3, 1, -1, 10, -4, 6, -3, 6, 3, 2, 4, 14, 4, -2, -2, -4, -7, 11, 5, -2, 5, -2, -5, 4, 5, -6, 1, 14, -2, -2, -6, -10, -1, -5, 5, 1, -8, -1, -6, -1, -11, -5, 8, 3, 12, -4, -5, -10, 6, 2, 2, 12, -1, 4, -1, 1, 2, 8, 2, 3, -3, -2, -1, 10, 8, -10, 9, -7, -2, -11, 4, -7, -2, -8, -3, -9, -3, 2, -2, -21, -5, -1, 2, 1, 8, 22, -2, -8, -7, 3, 25, 16, 5, 3, 7, 7, 20, 18, -9, -5, 3, 40, -10, 28, 14, 16, -29, -20, -6, 12, 25, -31, -2, -41, 21, 4, 10, 19, 10, -28, -34, 19, 88, 47, -6, 15, -42, -12, 3, 30, 27, -10, 48, -40, 7, 7, -27, -5, -17, -16, 64, 7, -14, -8, -39, -33, 57, 11, 26, -6, 39, 2, -3, -3, 1, 44, 66, 26, 29, 36, -68, -8, 14, 1, 21, -47, -21, 63, -17, -48, -12, -11, -2, 14, 24, 63, -46, -20, 49, 29, -13, 25, -31, 26, 22, -7, 26, -12, -23, -53, -11, -8, 42, 31, 11, -5, -72, 11, -69, -48]
7292d8NK2N9m6K7J2j15N5L7q2J11p3Q3l2Qpm3M1j03K5L0M2L9k5p1O8j9j5MP5q8
7323b4L9j5o7Q4p6J03k9J1LRk3q%Pn3P2m5j3Qpj0Pq7Q5O7l6J7n8O6k3L1m2oj3
7357b6M6J6l4L7o0j2O0m6Kn9O1L2k9l6N8Q0K0p7r3N7m1L3L1m4K0K9l6P3m6LL1
$$ y = [-48, -43, -21, 38, -8, 19, 31, -84, -29, 8, -74, 37, -36, 47, 15, 23, 16, -27, 14, -89, -64, -34, 8, 47, 22, -49, 19, 0, -15, -11, 64, -24, 15, 0, -67, 17, -59, 44, 15, 26, 29, 38, 15, 7, 7, 14, -39, 33, -12, -25, -17, -24, -34, -27, -114, -29, 38, 2, 19, -39, 27, 4, 35, -7, -13, -26, 20, 36, 2, 39, -21, -33, 27, -19, -17, -76, -15, 17, -12, -48, 10, 90, 110, 33, -60, -3, -44, -11, 20, -24, -4, 25, -11, 62, 16, 19, 50]
$$ [...]
8191C4
##END NTUPLES=NMR FID
##END=
