##TITLE=1H_AM_NV35
 
 8 sc, 
 12.4.2023
##JCAMPDX= 6.0         $$ Bruker NMR JCAMP-DX V2.0
##DATA TYPE= NMR FID
##DATA CLASS= NTUPLES
##ORIGIN= UXNMR, Bruker Analytische Messtechnik GmbH
##OWNER= root
$$ XWIN-NMR		Version 3.5
$$ Wed Apr 12 14:09:26 2023 Russian Standard Time (UT+4h)  she@DPX200
##.OBSERVE FREQUENCY= 200.13135
##.OBSERVE NUCLEUS= ^1H
##.DELAY= (6, 6)
##.ACQUISITION MODE= SIMULTANEOUS
##.ACQUISITION SCHEME= undefined
##.AVERAGES= 8
##.DIGITISER RES= 18
##SPECTROMETER/DATA SYSTEM= spect
##.PULSE SEQUENCE= zg30
##.SOLVENT NAME= D2O
##.SHIFT REFERENCE= (INTERNAL, D2O, 0, 15.7039)
##AUDIT TRAIL= $$ (NUMBER, WHEN, WHO, WHERE, WHAT)
$$ ##TITLE= Audit trail, XWIN-NMR		Version 3.5
$$ ##JCAMPDX= 5.01
$$ ##ORIGIN= Bruker BioSpin GmbH
$$ ##OWNER= she
$$ F:/spectra/data/she/nmr/H-F/1/audita.txt
$$ ##AUDIT TRAIL=  $$ (NUMBER, WHEN, WHO, WHERE, WHAT)
(   1,<2023-04-12 14:07:50.23 +0400>,<she>,<DPX200>,
      <created by zg, POWCHK disabled, PULCHK disabled
       configuration hash MD5:
       00 E9 B6 7A A2 85 ED C7 34 08 36 98 17 FE 4E 26
       data hash MD5: 16K
       F9 9E E7 16 4B 91 DB 1F 05 4E 4E 93 8B 56 54 49>)
$$ ##END=
$$ 
$$ hash MD5
$$ 67 17 17 04 69 5E CB ED AC F5 D6 4E 8D D4 09 87
##$RELAX= 
##$RELAX= 
##$RELAX= 
##$RELAX= 
##$RELAX= 
##$RELAX= 
$$ Bruker specific parameters
$$ --------------------------
##$DU= <F:/spectra>
##$EXPNO= 1
##$NAME= <H-F>
##$PROCNO= 1
##$TYPE= <nmr>
##$USER= <she>
##$AMP= (0..31)
100 100 100 100 100 100 100 100 100 100 100 100 100 100 100 100 100 100 
100 100 100 100 100 100 100 100 100 100 100 100 100 100 
##$AQSEQ= 0
##$AQ_mod= 1
##$AUNM= <au_zg>
##$AUTOPOS= <>
##$BF1= 200.13
##$BF2= 200.13
##$BF3= 200.13
##$BF4= 200.13
##$BF5= 200.13
##$BF6= 200.13
##$BF7= 200.13
##$BF8= 200.13
##$BYTORDA= 1
##$CFDGTYP= 0
##$CFRGTYP= 5
##$CHEMSTR= <none>
##$CNST= (0..31)
1 1 145 1 1 1 1 1 1 1 1 1 1 1 1 1 1 1 1 1 1 1 1 1 1 1 1 1 1 1 1 1 
##$CPDPRG= <>
##$CPDPRG1= <>
##$CPDPRG2= <>
##$CPDPRG3= <>
##$CPDPRG4= <mlev>
##$CPDPRG5= <mlev>
##$CPDPRG6= <mlev>
##$CPDPRG7= <mlev>
##$CPDPRG8= <mlev>
##$CPDPRGB= <>
##$CPDPRGT= <>
##$D= (0..31)
0 1.2 0 0 0 0 0 0 0 0.06 0 0.03 0 0 0 0 0.0002 0 0 0 0 0 0 0 0 0 0 0 0 
0 0 0 
##$DATE= 1681294069
##$DBL= (0..7)
120 120 120 120 120 120 120 120 
##$DBP= (0..7)
150 150 150 150 150 150 150 150 
##$DBP07= 0
##$DBPNAM0= <>
##$DBPNAM1= <>
##$DBPNAM2= <>
##$DBPNAM3= <>
##$DBPNAM4= <>
##$DBPNAM5= <>
##$DBPNAM6= <>
##$DBPNAM7= <>
##$DBPOAL= (0..7)
0.5 0.5 0.5 0.5 0.5 0.5 0.5 0.5 
##$DBPOFFS= (0..7)
0 0 0 0 0 0 0 0 
##$DE= 6
##$DECBNUC= <off>
##$DECIM= 32
##$DECNUC= <off>
##$DECSTAT= 4
##$DIGMOD= 1
##$DIGTYP= 9
##$DL= (0..7)
0 120 120 120 120 120 120 120 
##$DP= (0..7)
150 150 150 150 150 150 150 150 
##$DP07= 0
##$DPNAME0= <>
##$DPNAME1= <>
##$DPNAME2= <>
##$DPNAME3= <>
##$DPNAME4= <>
##$DPNAME5= <>
##$DPNAME6= <>
##$DPNAME7= <>
##$DPOAL= (0..7)
0.5 0.5 0.5 0.5 0.5 0.5 0.5 0.5 
##$DPOFFS= (0..7)
0 0 0 0 0 0 0 0 
##$DQDMODE= 0
##$DR= 18
##$DS= 0
##$DSLIST= <SSSSSSSSSSSSSSS>
##$DSPFIRM= 0
$$ [...]
##$SUBNAM2= <"">
##$SUBNAM3= <"">
##$SUBNAM4= <"">
##$SUBNAM5= <"">
##$SUBNAM6= <"">
##$SUBNAM7= <"">
##$SUBNAM8= <"">
##$SUBNAM9= <"">
##$SW= 18.05172834244
##$SWIBOX= (0..15)
0 0 2 0 0 0 0 0 0 0 0 0 0 0 0 0 
##$SW_h= 3612.71676300578
##$TD= 16384
##$TD0= 1
##$TE= 0
##$TE2= 300
##$TE3= 300
##$TEG= 300
##$TL= (0..7)
0 120 120 120 120 120 120 120 
##$TP= (0..7)
150 150 150 150 150 150 150 150 
##$TP07= 0
##$TPNAME0= <>
##$TPNAME1= <>
##$TPNAME2= <>
##$TPNAME3= <>
##$TPNAME4= <>
##$TPNAME5= <>
##$TPNAME6= <>
##$TPNAME7= <>
##$TPOAL= (0..7)
0.5 0.5 0.5 0.5 0.5 0.5 0.5 0.5 
##$TPOFFS= (0..7)
0 0 0 0 0 0 0 0 
##$TUNHIN= 0
##$TUNHOUT= 0
##$TUNXOUT= 0
##$USERA1= <user>
##$USERA2= <user>
##$USERA3= <user>
##$USERA4= <user>
##$USERA5= <user>
##$V9= 5
##$VALIST= <valist>
##$VCLIST= <CCCCCCCCCCCCCCC>
##$VD= 0
##$VDLIST= <DDDDDDDDDDDDDDD>
##$VPLIST= <PPPPPPPPPPPPPPP>
##$VTLIST= <TTTTTTTTTTTTTTT>
##$WBST= 1024
##$WBSW= 4
##$XGAIN= (0..3)
0 0 0 0 
##$XL= 0
##$YL= 0
##$YMAX_a= 246032
##$YMIN_a= -193548
##$ZGOPTNS= <>
##$ZL1= 120
##$ZL2= 120
##$ZL3= 120
##$ZL4= 120
##$ABSF1= 10
##$ABSF2= 0
##$ABSG= 5
##$ABSL= 3
##$ALPHA= 0
##$AQORDER= 0
##$ASSFAC= 0
##$ASSFACI= 0
##$ASSFACX= 0
##$ASSWID= 0
##$AUNMP= <proc_1d>
##$AZFE= 0.1
##$AZFW= 0.1
##$BCFW= 1
##$BC_mod= 2
##$BYTORDP= 1
##$COROFFS= 0
##$CY= 11.3945322036743
##$DATMOD= 1
##$DC= 2
##$DFILT= <>
##$DTYPP= 0
##$F1P= 2.36226072786647
##$F2P= -0.459571619588291
##$FCOR= 0.5
##$FTSIZE= 0
##$FT_mod= 4
##$GAMMA= 1
##$GB= 0.15
##$INTBC= 1
##$INTSCL= 1
##$ISEN= 128
##$LB= 0.24
##$LEV0= 0
##$LPBIN= 0
##$MAXI= 10000
##$MC2= 0
##$MEAN= 0
##$ME_mod= 0
##$MI= 1.114404
##$NCOEF= 0
##$NC_proc= 0
##$NLEV= 6
##$NOISF1= 3.799351
##$NOISF2= 2.8
##$NSP= 1
##$NTH_PI= 0
##$NZP= 0
##$OFFSET= 15.70392
##$PC= 1
##$PHC0= -19544.96
##$PHC1= 5.600805
##$PH_mod= 1
##$PKNL= yes
##$PPARMOD= 0
##$PSCAL= 0
##$PSIGN= 0
##$REVERSE= no
##$SF= 200.130013532006
##$SI= 16384
##$SIGF1= 3
##$SIGF2= 2
##$SINO= 400
##$SIOLD= 16384
##$SREGLST= <1H.CDCl3>
##$SSB= 0
##$STSI= 0
##$STSR= 0
##$SW_p= 3612.71676300578
##$SYMM= 0
##$S_DEV= 0
##$TDeff= 0
##$TDoff= 0
##$TI= <>
##$TILT= no
##$TM1= 0
##$TM2= 0
##$TOPLEV= 0
##$USERP1= <user>
##$USERP2= <user>
##$USERP3= <user>
##$USERP4= <user>
##$USERP5= <user>
##$WDW= 1
##$XDIM= 8192
##$YMAX_p= 0
##$YMIN_p= 0
$$ End of Bruker specific parameters
$$ ---------------------------------
##NTUPLES= NMR FID
##VAR_NAME=  TIME,          FID/REAL,        FID/IMAG
##SYMBOL=    X,             R,               I
##VAR_TYPE=  INDEPENDENT,   DEPENDENT,       DEPENDENT
##VAR_FORM=  AFFN,          ASDF,            ASDF
##VAR_DIM=   8192,          8192,            8192
##UNITS=     SECONDS,       ARBITRARY UNITS, ARBITRARY UNITS
##FACTOR=    0.0002768,     1,               1
##FIRST=     0,             0,               0
##LAST=      2.2672688,     0,               0
##MIN=       0,             -193548,         0
##MAX=       2.2672688,     246032,          0
$$ Real data points
##PAGE= N=1
##DATA TABLE= (X++(R..R)), XYDATA
0 0 0 0 0 0 0 0 0 0 0 0 0 0 0 -8 8 -8 8 -8 16 -16 16 -21 24 -25 32 -37 40 -48 53 -60 67 -76 85 -93 103 -116
36 -116 128 -141 157 -173 192 -209 230 -254 278 -304 334 -367 402 -441 487 -537 591 -656 730
55 730 -816 917 -1038 1183 -1365 1595 -1892 2294 -2856 3678 -4965 7181 -11566 22896 -96881
70 -96881 -151063 246032 -193548 47142 95864 -155716 123763 -48468 -11003 31749 -26399
81 -26399 23311 -31366 38771 -25703 -3567 26144 -23728 2046 12574 4338 -45255 73608
93 73608 -54232 -18132 103736 -144144 104689 -3306 -104607 156897 -130620 48035
103 48035 42458 -101858 114770 -88787 39274 18135 -70352 99471 -88077 37324 30350
114 30350 -77972 76356 -29022 -24315 43728 -16515 -30000 51020 -19998 -43456 91012
125 91012 -82611 19044 60285 -104383 88607 -31744 -25709 54857 -54766 42806 -34652
136 -34652 25542 -1626 -40531 80303 -87386 45477 26967 -87609 97153 -50856 -17694
147 -17694 61674 -56818 16606 21826 -27867 1023 31559 -37981 10302 32344 -59230 52282
159 52282 -16356 -24561 48907 -49948 34742 -12920 -9177 29744 -45760 49193 -32304 -2321
171 -2321 38640 -57370 47841 -17050 -16005 33228 -31495 19326 -8373 2971 534 -8584 19683
184 19683 -25356 18581 -1770 -14312 18748 -10575 623 -177 10166 -18617 12167 12063 -39504
197 -39504 48397 -26885 -14846 51076 -57681 30781 10805 -39708 40260 -18276 -5829 14835
209 14835 -7774 -3203 4431 6832 -20176 20988 -5603 -16125 28557 -23183 4695 12197 -16332
222 -16332 8717 648 -2814 -3790 11655 -10575 -1836 17913 -26127 19627 -1210 -17921 27138
235 27138 -22759 8851 7151 -17786 19659 -13538 3032 7097 -12298 10966 -4701 -2556 5908
248 5908 -3267 -2663 6157 -3409 -4832 12346 -12370 3561 8424 -15915 13843 -3916 -6406 10496
262 10496 -7480 1628 1344 935 -4409 3113 4322 -12727 14804 -6382 -8326 19183 -18114 5566
276 5566 10429 -18831 13963 -73 -11982 13842 -5075 -6887 12484 -7939 -2524 11054 -11792
289 -11792 4266 5603 -11042 9168 -2235 -4764 7181 -4620 257 2494 -2223 -405 2603
302 2603 -1826 -1436 4804 -5666 2538 3223 -7455 7161 -2389 -3957 7729 -5962 250 5107
316 5107 -6441 2626 3720 -7281 4865 1807 -7934 8790 -3106 -5248 10089 -8249 1001
329 1001 6780 -9491 5152 2293 -7137 5955 66 -5834 6387 -1416 -4994 8044 -5179 -1833
343 -1833 7705 -8134 3268 3331 -6988 5434 -597 -3260 3657 -930 -2289 2962 -186 -3597 5284
358 5284 -3267 -1780 6623 -7610 3853 2244 -7123 7828 -3968 -1764 5672 -5834 2512 1777
372 1777 -3798 2270 1007 -3075 2086 1417 -4722 4955 -1551 -3526 7091 -6443 1625 4095 -6894
387 -6894 5305 -804 -3163 3872 -1413 -1588 2249 275 -4057 5530 -2390 -3860 8895 -8853 3010
402 3010 5094 -10147 9060 -3100 -3656 6924 -5338 1280 1397 -884 -1434 2466 -45 -4704 7841
417 7841 -6237 317 6496 -9996 7865 -1715 -4293 6996 -5583 2026 616 -824 -171 186
431 186 1666 -4317 5748 -4176 -98 4926 -8015 7702 -3952 -1187 5445 -7628 7109 -4250
445 -4250 192 3842 -6535 6674 -4461 1316 1437 -3330 4309 -4752 4939 -3898 586 4225 -8544
460 -8544 9909 -6447 -525 6957 -9606 7715 -3158 -658 2087 -2376 3628 -6167 8086 -6529
474 -6529 104 8813 -14714 13320 -4868 -6173 13293 -12727 6369 873 -4946 4750 -2803 2294
488 2294 -3867 5525 -4384 -777 7468 -11331 9661 -3470 -3543 8025 -8602 6659 -4418 2158
502 2158 1083 -5357 9902 -12054 8777 -458 -8915 14652 -13845 7187 1449 -8015 10760
515 10760 -10174 7262 -2854 -2265 7213 -10408 9934 -5647 -509 5787 -7894 6822 -4667
528 -4667 3055 -1888 -262 4523 -9527 11860 -8910 884 8605 -14538 13703 -6946 -1614 7633
542 7633 -9373 8039 -6076 4467 -1825 -2954 8952 -13231 12273 -5025 -5236 13071 -14535
555 -14535 9606 -1812 -4331 6800 -6882 6748 -6767 5427 -1128 -5829 12218 -13789 8884
568 8884 111 -8501 12394 -10827 5904 -774 -2796 5144 -7097 8371 -7742 4064 2215
581 2215 -8494 11619 -10086 5031 1113 -6064 8594 -8893 7603 -4720 -90 6193 -11438
594 -11438 12998 -9160 966 7732 -12777 12260 -7254 711 4520 -7285 8027 -7529 5686
607 5686 -2023 -3196 8295 -10655 8573 -2994 -3063 6786 -7357 5872 -4010 2430 -384 -3060
621 -3060 7301 -10163 9220 -3653 -4612 11287 -12878 8885 -1817 -4898 8783 -9198 7041
634 7041 -3621 -271 4017 -6940 8245 -7025 3022 2383 -6608 7813 -6091 2990 13 -2133
648 -2133 3511 -4729 5703 -5437 3088 1357 -6493 9637 -8722 4051 2121 -7021 9037 -7939
662 -7939 4432 107 -4416 7431 -8100 6119 -2006 -3007 6888 -7874 5697 -1585 -2212 4222
676 4222 -4410 3512 -2366 1336 -128 -1457 3175 -4528 4636 -2882 -271 3556 -5549 5618 -3969
691 -3969 1040 2279 -4997 6337 -5540 2601 1285 -4869 6831 -6089 2924 1260 -4526 5611
705 5611 -4529 2165 352 -2112 3000 -3072 2433 -1512 387 1007 -2288 3024 -2906 1838 -281
720 -281 -1388 2811 -3465 3104 -1733 -444 2661 -4070 4086 -2471 -175 2819 -4353 4009 -2112
735 -2112 -438 2627 -3429 2747 -1293 -287 1341 -1615 1405 -1016 642 -318 -132 731 -1274 1514
751 1514 -1272 611 227 -1111 1759 -1924 1531 -497 -942 2205 -2783 2227 -608 -1407 2892 -3075
767 -3075 1826 175 -1896 2584 -2103 857 478 -1371 1543 -1144 473 161 -559 767 -800 504
783 504 -31 -327 422 -255 45 -44 219 -355 305 -14 -517 992 -995 341 568 -1177 1171 -635 -72
802 -72 641 -951 895 -531 28 382 -678 799 -732 344 220 -733 877 -660 287 63 -397 634
820 634 -760 634 -296 -247 728 -1019 914 -392 -399 995 -1127 701 -43 -521 772 -755 478 -48
838 -48 -387 593 -547 305 21 -333 506 -394 -36 487 -558 134 477 -840 655 7 -814 1261 -1025
857 -1025 61 1016 -1563 1188 -202 -804 1290 -1134 467 323 -864 904 -551 27 367 -569 550
874 550 -362 -23 439 -721 617 -151 -515 978 -945 356 547 -1287 1363 -635 -538 1456 -1512
891 -1512 720 410 -1209 1249 -604 -322 901 -781 67 605 -714 206 547 -1003 846 -152 -741
908 -741 1309 -1234 517 405 -1063 1197 -921 478 26 -546 1051 -1356 1246 -581 -511 1600 -2081
925 -2081 1594 -263 -1191 1915 -1583 523 457 -778 416 87 -182 -313 1103 -1497 925 484 -2050
942 -2050 2761 -2128 410 1501 -2755 2853 -1815 170 1398 -2284 2337 -1738 788 343 -1476
957 -1476 2250 -2343 1649 -366 -1067 2224 -2618 2052 -699 -857 1936 -2112 1515 -620 -91 373
973 373 -444 702 -1422 2224 -2286 916 1626 -4023 4696 -2948 -427 3605 -4893 3781 -1183 -1337
989 -1337 2564 -2367 1622 -1205 1182 -849 -452 2388 -3764 3499 -1456 -1401 3532 -3852 2441 -385
1005 -385 -1001 1283 -1076 1340 -2206 2766 -1929 -544 3568 -5401 4756 -1705 -2260 5126 -5560
1020 -5560 3645 -612 -2167 3758 -3961 2959 -1129 -887 2333 -2724 2112 -1080 299 -40 -104 730
1036 730 -1967 3192 -3299 1592 1448 -4273 5225 -3774 802 2060 -3670 3864 -3248 2269 -819
1051 -819 -1365 4035 -6045 5672 -2225 -3073 7342 -7812 4010 1686 -5753 5824 -2485 -1371
1065 -1371 2883 -1292 -1564 2726 -837 -2801 5312 -4513 730 3600 -5890 5080 -2221 -722 2615
1080 2615 -3470 3722 -3603 2497 100 -3600 6331 -6378 3202 1678 -5752 6821 -4566 725
1094 725 2601 -4024 3498 -1964 426 634 -1047 1067 -868 619 -654 1131 -1703 1654 -42
1109 -42 -2936 5617 -5868 2501 3250 -8056 8791 -4722 -1982 7188 -8036 4690 215 -3390
1123 -3390 3577 -2126 1072 -1345 1927 -1048 -1587 4364 -4976 2387 1791 -4514 3949 -603 -2578
1138 -2578 2692 295 -3648 4110 -535 -4753 7746 -5847 -186 6539 -9174 6701 -801 -4795
1152 -4795 7076 -5682 2320 870 -2641 3264 -3199 2567 -1221 -781 2671 -3290 2354 -446 -1195
1167 -1195 1521 -670 -175 67 1007 -1921 1585 -28 -1784 2697 -2333 1329 -297 -636 1766 -3171
1183 -3171 4058 -3104 -188 4571 -7347 6164 -1065 -5065 8276 -6375 770 4606 -6268 3494
1197 3494 1087 -3747 2698 790 -3486 2904 561 -4049 4666 -1853 -2098 4264 -3389 676 1516
1212 1516 -1539 83 860 123 -2380 3742 -2313 -1504 5230 -5993 3008 1865 -5502 5766 -2765
1227 -2765 -1274 3831 -3743 1656 732 -1855 1413 -150 -821 967 -270 -820 1712 -1787 761 1093
1243 1093 -2812 3305 -1934 -693 3168 -4007 2635 144 -2528 3152 -1842 -23 983 -580 -255
1258 -255 229 1025 -2383 2322 -309 -2553 4171 -3087 -231 3410 -4060 1709 1756 -3513 2120 1219
1274 1219 -3604 2952 415 -4001 4937 -2230 -2295 5396 -4908 1262 2858 -4689 3318 -139 -2340
1289 -2340 2552 -833 -1062 1498 -207 -1531 2104 -869 -1271 2757 -2474 611 1528 -2534 1949 -395
1305 -395 -1002 1398 -751 -201 629 -200 -698 1274 -928 -332 1781 -2455 1789 98 -2192 3245 -2444
1322 -2444 197 2173 -3106 2080 145 -1967 2078 -565 -1278 1897 -666 -1491 2763 -1918 -603
1337 -603 3065 -3539 1622 1413 -3390 2981 -608 -1831 2547 -1112 -1116 2174 -1065 -1350 3010 -2370
1353 -2370 -382 3223 -4036 2091 1263 -3731 3652 -1247 -1682 2987 -1935 -315 1856 -1482 -319
1368 -319 1918 -1914 226 1910 -2921 1977 333 -2426 2917 -1564 -559 2000 -1848 494 943
1383 943 -1338 430 1053 -1843 1146 734 -2536 2886 -1357 -1197 3174 -3304 1519 1078 -2817 2724
1399 2724 -998 -1024 1910 -1140 -475 1480 -935 -760 2237 -2146 325 2093 -3320 2405 148 -2503
1415 -2503 3017 -1414 -875 2013 -1235 -621 1813 -1152 -925 2823 -2792 587 2421 -4071 3171 -276
1431 -276 -2634 3729 -2505 10 1959 -2199 907 716 -1280 413 1101 -1895 1186 668 -2410 2814
1447 2814 -1542 -638 2433 -2794 1674 114 -1428 1583 -800 -37 202 387 -1009 848 405 -2067
1463 -2067 2977 -2162 -231 2873 -4017 2803 95 -2757 3463 -1885 -634 2142 -1594 -389 1995
1478 1995 -1689 -518 2907 -3468 1501 1757 -4062 3881 -1414 -1608 3266 -2770 932 667 -1002 299
1494 299 275 157 -1381 2270 -1732 -213 2480 -3541 2655 -314 -1990 3022 -2349 683 835 -1359
1510 -1359 880 -51 -296 -85 863 -1416 1100 147 -1846 3056 -2841 960 1746 -3836 3979 -2032
1526 -2032 -942 3213 -3512 1857 357 -1589 1219 -56 -472 -327 1755 -2299 1011 1549 -3596 3546
1542 3546 -1235 -1807 3468 -2728 383 1545 -1536 -109 1608 -1271 -955 3327 -3654 1308 2429
1557 2429 -5015 4612 -1446 -2339 4375 -3644 1142 1201 -1932 1196 -214 -7 -556 1174 -1021 -106
1573 -106 1478 -2194 1858 -709 -555 1394 -1665 1598 -1186 395 709 -1625 1950 -1533 599 334
1589 334 -927 1239 -1432 1587 -1360 309 1467 -3142 3489 -1784 -1151 3554 -3831 1841 1037 -2720
1605 -2720 2157 -93 -1523 1257 687 -2534 2416 25 -2995 4261 -2724 -588 3379 -3819 1990
1620 1990 517 -1837 1368 -142 -328 -561 1882 -2025 303 2301 -3881 3160 -438 -2492 3766
1635 3766 -2731 395 1566 -1999 1034 173 -489 -97 821 -923 192 868 -1605 1571 -934 1
1651 1 967 -1745 2053 -1642 423 1260 -2608 2721 -1416 -530 2000 -2196 1270 -97 -432 256 -26
1668 -26 402 -1286 1843 -1253 -446 2220 -2708 1488 635 -2079 1841 -219 -1244 1195 346 -1951
1684 -1951 2081 -215 -2391 3734 -2623 -317 3151 -3988 2394 411 -2436 2561 -1215 -238 746
1699 746 -259 -313 126 782 -1526 1333 -176 -1247 1915 -1398 194 799 -943 487 -3 -9 -408 721
1717 721 -454 -260 1011 -1408 1164 -358 -594 1307 -1583 1347 -575 -521 1581 -2054 1544 -176
1733 -176 -1253 1891 -1434 263 761 -974 362 406 -549 -171 1121 -1391 545 956 -1993 1769 -473
1750 -473 -981 1634 -1174 179 501 -327 -267 457 141 -1174 1751 -1069 -577 2037 -2331 1213 581
1767 581 -1849 1862 -788 -453 1008 -673 -87 492 -171 -524 891 -664 -82 861 -1188 911 -251
1784 -251 -436 820 -848 655 -341 29 321 -698 887 -724 340 165 -614 924 -924 623 -95
1801 -95 -538 1046 -1139 772 -39 -756 1162 -867 158 461 -589 209 290 -374 -88 729 -974 553
1819 553 418 -1297 1453 -765 -310 1110 -1157 666 -64 -209 222 -192 392 -694 834 -500 -310
1836 -310 1169 -1475 964 54 -994 1295 -873 120 448 -546 271 48 -106 -189 530 -547 161 433
1854 433 -901 949 -564 -42 609 -914 905 -589 97 412 -761 884 -705 308 174 -554 779
1871 779 -746 531 -150 -284 694 -877 741 -282 -258 636 -677 478 -177 -12 71 -60 205 -483
1889 -483 759 -707 231 530 -1141 1272 -771 -64 828 -1170 971 -453 -89 443 -565 609 -602
1906 -602 499 -196 -284 779 -974 759 -201 -331 680 -703 505 -243 86 55 -233 502 -706 737
1924 737 -418 -143 707 -1031 1026 -608 -38 702 -1117 1126 -723 81 582 -1022 1080 -739 153
1941 153 374 -710 776 -622 387 -63 -249 511 -647 661 -453 81 324 -634 739 -611 339
1958 339 -38 -302 638 -886 906 -560 -84 822 -1281 1236 -646 -208 934 -1188 961 -467 -75
1975 -75 450 -655 732 -658 417 -45 -364 697 -819 647 -292 -125 460 -645 720 -664 398
1992 398 67 -600 1014 -1065 686 -22 -664 1089 -1078 660 -69 -438 766 -836 688 -380 -2
2009 -2 431 -712 785 -638 304 123 -501 735 -766 605 -283 -165 625 -965 978 -618 -14 657
2027 657 -1048 1025 -646 83 464 -774 825 -651 327 42 -396 670 -753 579 -216 -171 448
2044 448 -590 612 -492 302 21 -438 786 -962 786 -197 -552 1093 -1167 783 -97 -555 943
2061 943 -961 657 -175 -271 593 -699 630 -371 44 300 -492 536 -441 263 -59 -145 321 -480 569
2080 569 -513 282 124 -608 952 -936 522 153 -799 1123 -1009 511 169 -734 1005 -873 440
2097 440 76 -506 716 -666 401 -56 -213 368 -404 366 -312 160 43 -257 402 -461 405 -216 -54
2116 -54 348 -557 630 -468 127 307 -666 777 -603 188 265 -624 754 -634 317 108 -503 707
2134 707 -658 371 8 -356 535 -557 376 -149 -108 303 -417 442 -353 120 109 -368 449 -380 210 -9
2154 -9 -187 293 -325 300 -244 136 55 -337 572 -608 339 114 -524 730 -637 253 147 -476 595 -503
2174 -503 292 -40 -271 514 -605 462 -75 -323 526 -481 234 43 -194 191 -86 35 -106 234 -274
2193 -274 126 188 -459 515 -386 62 264 -491 548 -423 159 139 -428 609 -603 341 148 -578 732
2212 732 -556 124 331 -525 454 -186 -93 170 -110 16 1 113 -214 195 -95 -62 199 -306 340 -262 88
2233 88 179 -486 612 -469 102 381 -727 700 -352 -122 474 -578 422 -162 -42 188 -274 302
2251 302 -263 186 -4 -219 331 -284 110 75 -114 31 64 -1 -201 411 -400 94 341 -691 665 -268
2271 -268 -275 623 -625 320 37 -257 264 -194 167 -177 186 -56 -170 407 -452 291 21 -295 419 -325
2291 -325 135 5 -76 123 -170 227 -241 171 -19 -182 355 -391 275 -46 -181 335 -374 312 -140 -87 278
2312 278 -354 300 -143 -10 111 -161 189 -224 242 -216 55 259 -524 577 -323 -150 530 -624 387
2331 387 -12 -269 319 -169 19 -7 155 -259 142 185 -513 593 -318 -159 514 -570 348 -4 -253 246
2351 246 -90 9 -100 288 -322 114 296 -614 626 -321 -183 583 -667 414 -17 -268 327 -235 112
2370 112 -116 134 -112 -7 209 -405 466 -316 -9 376 -578 521 -265 -86 377 -473 370 -152 -59 150
2390 150 -124 98 -171 288 -342 202 158 -543 713 -539 56 478 -741 592 -179 -204 328 -229 74
2409 74 -75 249 -370 254 147 -657 866 -591 -70 684 -893 603 -18 -403 461 -220 -55 91 122
2428 122 -353 344 0 -491 791 -671 184 424 -791 771 -415 -45 402 -516 429 -276 111 -12
2446 -12 -130 285 -427 497 -343 44 354 -646 677 -412 -64 476 -646 462 -107 -188 223 -69 -82
2465 -82 16 280 -591 572 -98 -624 1119 -1014 285 613 -1149 1011 -367 -337 633 -491 136 38 56
2484 56 -281 288 57 -574 849 -665 53 575 -857 668 -171 -263 386 -233 36 -51 256 -425 336 88
2504 88 -593 909 -748 214 454 -919 973 -586 -42 578 -798 662 -277 -154 386 -354 141 16
2522 16 64 -274 386 -164 -331 804 -889 442 302 -898 968 -501 -135 512 -440 116 33 155 -467
2541 -467 533 -89 -673 1212 -1073 230 816 -1403 1125 -201 -681 951 -537 -119 439 -212 -293
2558 -293 564 -341 -310 891 -936 402 377 -903 915 -480 -38 374 -487 451 -358 251 -75 -162 388
2577 388 -548 527 -295 -44 371 -597 657 -471 67 421 -754 715 -314 -234 564 -447 67 252
2595 252 -182 -210 603 -512 -96 903 -1287 829 231 -1234 1478 -817 -261 1019 -992 352 282 -417
2613 -417 40 397 -369 -211 857 -979 375 574 -1189 1029 -231 -575 849 -500 -120 394 -173
2630 -173 -319 555 -283 -377 915 -898 321 459 -982 966 -499 -123 592 -727 570 -254 -99 325
2648 325 -415 338 -152 -31 79 10 -71 -56 325 -561 497 -52 -559 903 -736 123 542 -762 464
2667 464 61 -325 137 295 -418 18 674 -1070 739 236 -1194 1438 -728 -438 1242 -1119 263
2684 263 604 -838 330 414 -713 303 475 -999 769 60 -883 1125 -646 -162 736 -736 327
2701 327 98 -214 65 79 -31 -246 482 -443 108 369 -664 625 -289 -151 457 -550 426 -163 -142 367
2721 367 -373 199 59 -196 91 140 -293 154 276 -697 707 -215 -576 1073 -943 177 661 -1050 699
2740 699 35 -573 553 -90 -374 373 111 -631 695 -138 -657 1061 -745 -99 830 -942 406 327
2758 327 -667 390 190 -567 358 260 -783 735 -103 -678 1044 -739 25 645 -867 565 -24 -391
2776 -391 421 -206 -14 77 15 -151 154 -16 -198 365 -377 175 113 -390 499 -359 46 274 -429 324 -65
2797 -65 -177 166 6 -208 152 157 -506 572 -203 -417 862 -819 215 530 -921 709 -58 -536 625
2816 625 -218 -285 448 -143 -387 653 -384 -273 810 -820 272 473 -832 634 -66 -414 491 -165
2834 -165 -226 306 -35 -372 520 -261 -285 706 -711 255 332 -698 626 -239 -208 426 -371 103 104 -131 4
2855 4 146 -160 -19 268 -421 339 -47 -336 567 -513 162 251 -518 468 -154 -181 287 -150 -96 176 -12
2876 -12 -287 456 -276 -197 660 -746 360 275 -740 730 -268 -275 535 -369 -44 296 -215 -159 428 -357 -81
2897 -81 550 -717 392 185 -635 676 -300 -187 439 -341 28 182 -132 -138 330 -252 -101 464 -593 374
2917 374 94 -533 673 -438 16 356 -491 333 -75 -134 192 -103 -45 62 37 -209 274 -162 -146 406 -481
2938 -481 278 85 -407 492 -287 -20 245 -228 41 78 -10 -203 347 -243 -137 553 -696 393 190 -682
2958 -682 770 -390 -188 549 -503 140 222 -293 55 236 -317 98 287 -538 432 -47 -391 572 -427
2977 -427 68 216 -324 255 -119 24 -33 46 34 -189 343 -337 146 159 -407 491 -326 20 293 -451 361
2998 361 -123 -136 276 -203 19 126 -113 -68 272 -308 72 308 -590 532 -131 -394 696 -599 154 304
3018 304 -498 380 -112 -97 89 20 -71 -77 313 -410 229 138 -487 535 -252 -166 413 -368 63 192 -205 -10
3040 -10 248 -275 18 331 -515 368 4 -402 585 -455 116 225 -410 394 -237 45 107 -210 240 -215
3060 -215 110 -10 -105 126 -135 148 -159 105 1 -168 296 -288 132 75 -243 233 -119 -10 15 65 -95
3081 -95 -11 248 -429 353 -32 -378 617 -497 76 377 -549 363 4 -257 218 -21 -152 109 127 -325 314
3102 314 -42 -302 484 -353 40 246 -348 219 -51 -35 -8 24 22 -166 283 -275 86 196 -382 351 -172 -68
3124 -68 216 -240 198 -121 43 46 -114 177 -161 108 -23 -47 75 -85 131 -167 190 -81 -122 350 -407 240
3146 240 81 -338 412 -251 -12 187 -191 64 9 25 -143 183 -62 -183 361 -340 109 191 -350 270 -60
3167 -60 -100 123 -17 -68 21 165 -296 233 17 -310 438 -335 32 247 -362 276 -94 -67 106 -91 83 -111
3189 -111 150 -105 -9 146 -212 182 -95 -24 79 -109 117 -135 135 -59 -48 173 -247 192 -67 -85 175
3210 175 -169 136 -101 42 37 -157 248 -241 131 74 -239 299 -196 12 134 -168 92 -21 15 -64 99 -38
3232 -38 -91 231 -248 124 71 -234 248 -141 6 72 -77 71 -84 132 -140 77 65 -215 284 -206 28 155
3254 155 -232 199 -100 -5 63 -82 101 -108 102 -67 -21 104 -175 155 -95 -13 88 -115 117 -109 61
3275 61 -10 -66 132 -155 125 -55 -57 137 -179 138 -69 -2 88 -133 180 -146 69 63 -156 195 -154 52 57 -118
3299 -118 136 -91 44 -15 -5 51 -96 113 -107 51 19 -107 138 -133 83 -5 -73 104 -126 111 -81 9
3321 9 92 -174 199 -131 8 112 -193 179 -85 -21 90 -122 96 -64 45 -15 -28 87 -105 104 -66 6
3343 6 68 -105 117 -77 38 7 -58 101 -126 107 -49 -36 115 -165 152 -74 -41 131 -174 135 -62 -33 87
3366 87 -106 110 -77 40 13 -60 101 -125 100 -15 -48 100 -108 91 -51 8 43 -93 112 -94 52 -2
3388 -2 -55 105 -129 99 -40 -28 100 -155 144 -78 -18 113 -157 129 -74 -9 70 -110 101 -74 40 5 -56
3411 -56 90 -105 96 -44 -27 81 -118 112 -57 -1 66 -93 76 -80 60 -24 -25 99 -154 141 -64 -50 161
3434 161 -184 130 -35 -52 105 -122 75 -40 -11 34 -66 82 -87 58 -23 -39 79 -115 98 -69 -3 68
3456 68 -111 95 -89 41 32 -86 126 -133 84 2 -78 143 -147 95 -12 -75 124 -122 88 -25 -40 67
3478 67 -89 60 -48 27 -18 -26 69 -112 110 -80 -10 83 -157 148 -80 -19 94 -141 121 -91 9 47 -109
3501 -109 109 -111 42 -3 -78 108 -117 67 -18 -51 67 -86 66 -45 20 1 -58 82 -107 104 -54 -51 126
3524 126 -161 111 -48 -51 125 -154 116 -56 -37 94 -126 110 -64 3 53 -86 81 -61 51 -21 -16 45 -80
3547 -80 84 -69 31 16 -84 127 -135 73 8 -91 141 -148 104 -17 -81 142 -147 106 -25 -75 112 -133
3569 -133 84 -17 -43 60 -61 51 -52 28 -27 -22 55 -104 95 -62 3 58 -96 125 -108 50 21 -105 164
3592 164 -162 61 43 -143 155 -121 38 39 -88 98 -74 35 -13 -13 26 -63 77 -75 44 -4 -59 75 -87
3615 -87 66 -32 -9 40 -91 121 -111 39 70 -136 165 -123 12 97 -148 127 -68 -10 63 -67 71 -49 40
3638 40 -10 -21 33 -57 53 -62 42 -18 -32 85 -111 103 -40 -44 134 -154 100 -13 -66 92 -83 71 -44
3661 -44 14 39 -79 114 -103 43 54 -126 125 -67 -10 53 -55 6 11 1 -60 83 -47 -39 138 -171 100 28 -140
3686 -140 174 -104 6 62 -86 51 -45 31 -31 19 24 -91 114 -80 8 77 -96 80 -30 -1 25 -20 43 -40 51
3711 51 -38 6 21 -55 80 -59 44 -6 -51 104 -111 74 18 -113 152 -113 8 68 -111 68 -14 -38 21 25 -49
3736 -49 18 62 -131 100 -2 -106 156 -104 -8 87 -103 46 24 -33 -31 90 -67 -19 138 -178 103 38 -178 184
3760 184 -105 -48 127 -130 41 24 -61 7 23 -34 -14 51 -93 48 5 -82 99 -72 21 28 -55 68 -61 34 -5
3785 -5 -41 51 -60 32 -32 8 3 -36 78 -106 68 26 -117 148 -107 -1 100 -142 70 24 -94 52 26 -99
3809 -99 72 42 -150 152 -53 -106 195 -190 24 124 -187 103 12 -87 62 7 -66 40 57 -129 106 3 -130
3832 -130 180 -114 -34 129 -157 70 31 -93 69 6 -64 49 29 -97 72 -26 -81 130 -123 45 43 -118 140
3855 140 -78 -3 67 -100 58 -20 -28 36 -29 -7 -1 31 -80 84 -14 -83 166 -142 21 108 -167 118 4 -116 108
3880 108 -16 -77 100 -14 -120 155 -86 -74 202 -206 68 111 -204 173 -24 -104 126 -63 -40 80 -13 -76
3902 -76 114 -49 -80 187 -157 41 121 -203 153 -9 -97 123 -76 -16 61 -45 -15 73 -53 -9 80 -138 104
3925 104 3 -93 166 -126 44 85 -144 120 -43 -40 75 -42 -15 34 12 -72 93 -34 -81 162 -153 50 108
3948 108 -189 155 -22 -102 151 -64 -55 125 -65 -62 176 -134 -23 193 -247 138 65 -226 234 -100 -80 169
3970 169 -130 15 65 -51 -14 83 -63 -24 132 -152 67 69 -153 158 -67 -54 126 -96 22 55 -65 13 64
3993 64 -75 35 72 -147 156 -39 -89 204 -191 86 82 -191 193 -86 -54 150 -128 37 69 -76 1 78 -100
4016 -100 15 108 -169 107 25 -149 179 -73 -52 129 -101 -37 98 -76 -60 168 -152 7 171 -260 183 40
4038 40 -225 283 -167 -40 197 -193 87 56 -118 73 29 -90 58 33 -103 125 -33 -63 132 -111 43 33
4060 33 -77 62 -32 -3 1 17 -24 12 59 -111 124 -38 -75 179 -208 98 70 -203 227 -102 -78 201 -160 28
4084 28 123 -145 62 102 -177 123 48 -197 220 -79 -106 213 -181 40 89 -136 66 26 -49 -2 80 -101 4
4107 4 124 -203 132 20 -180 221 -124 -50 161 -173 57 64 -124 87 29 -109 95 -2 -110 156 -106 -19 128
4130 128 -173 123 -18 -107 153 -128 27 56 -94 53 3 -41 11 50 -70 32 72 -142 135 -34 -121 183 -149
4153 -149 2 128 -155 72 67 -118 64 69 -142 114 53 -194 217 -76 -101 232 -195 34 131 -186 103 42 -124
4176 -124 81 20 -109 94 20 -150 159 -75 -74 169 -166 63 63 -117 106 -43 -40 59 -27 -4 25 -8 -29 51 -49
4201 -49 1 60 -103 90 -18 -78 114 -84 10 70 -91 48 25 -73 39 39 -102 83 29 -155 174 -97 -77 205
4225 205 -207 76 106 -205 151 1 -127 135 -39 -81 125 -59 -70 141 -106 -32 137 -160 47 74 -128 85
4247 85 23 -74 63 12 -73 57 20 -99 131 -62 -66 155 -149 60 74 -148 117 -59 -50 91 -95 33 37 -66
4271 -66 32 14 -56 46 -4 -58 89 -70 -6 93 -122 65 24 -93 107 -35 -33 74 -28 -34 57 -17 -74 113 -84
4296 -84 -35 152 -166 75 78 -175 146 -14 -111 133 -60 -58 98 -76 -47 118 -115 -19 117 -156 72 45 -139
4319 -139 116 -40 -68 85 -58 -13 39 -22 -24 47 -56 -9 75 -92 53 19 -83 93 -71 5 58 -80 74 -28
4343 -28 -24 38 -36 -6 9 -8 -17 44 -30 -16 69 -103 61 34 -100 106 -43 -36 80 -60 -22 59 -51 -30 78 -83 -1
4370 -1 104 -149 91 30 -139 149 -61 -47 117 -99 20 45 -60 8 48 -59 -11 59 -103 49 27 -86 79
4393 79 -45 -27 53 -54 22 6 -6 -3 18 -11 -17 52 -61 32 0 -76 90 -77 17 54 -86 88 -34 -19 66 -57 22
4420 22 25 -32 2 35 -41 16 49 -87 75 -4 -67 116 -80 13 53 -85 31 0 -21 0 28 -29 -15 80 -101 58 41
4447 41 -110 125 -64 -31 91 -81 26 27 -42 24 23 -42 -1 45 -72 50 -6 -52 82 -76 15 16 -49 57 -36 25
4473 25 -4 -15 38 -48 46 -29 -4 29 -50 53 -42 15 18 -59 62 -38 -14 51 -52 20 22 -17 -4 35 -46 14 33 -99 87
4502 87 -26 -55 119 -100 35 37 -70 56 -39 8 1 2 6 -41 60 -54 17 35 -69 76 -26 -29 48 -38 6 19 -13
4529 -13 -18 36 -35 -23 41 -67 49 -11 -48 77 -70 49 -11 -40 73 -77 46 -3 -39 67 -58 28 2 -30 33 -30
4555 -30 13 -25 -3 -7 -30 44 -42 16 -6 -26 9 -12 6 -32 37 -27 -13 66 -93 67 -9 -71 102 -101 19 36 -70 56
4583 56 -29 -2 14 -12 6 -8 27 -33 11 9 -27 26 -19 13 7 -3 8 -19 40 -49 26 12 -55 76 -57 21 28 -56 53 -41
4613 -41 3 24 -33 43 -36 22 12 -26 24 -27 7 -1 -6 -3 -8 13 -28 34 -25 -4 35 -59 34 -17 -22 33 -39 20 -10 -1 17 -32 37
4646 37 -47 17 22 -50 51 -21 -18 26 -38 -4 4 -10 -15 15 -27 -18 45 -55 30 1 -39 46 -31 8 12 -28 26 -32 17 -21 -9 22
4678 22 -52 39 -22 -20 42 -33 17 -3 -16 17 -15 5 -1 15 -20 -5 11 -15 29 -16 4 6 -19 31 -31 8 9 -30 38 -29 9 24
4710 24 -29 25 -19 8 8 -6 26 -9 29 -9 -4 17 -20 30 -7 -16 22 -16 6 -4 -2 -17 1 1 -17 26 -23 0 11 -40 28 -12 -14
4743 -14 29 -21 22 1 -8 13 -2 16 -15 18 -7 -8 26 -40 9 -8 -15 29 -27 -2 14 -18 12 -3 -5 -4 -2 -15 0 16 -21 33 -20
4776 -20 -21 30 -38 24 16 -25 24 -19 8 0 8 12 -1 28 -17 20 13 -22 42 -18 5 4 -18 26 -12 -11 7 -8 -1 6 5 -3 20 -7 1 15 -31
4813 -31 28 -10 -17 33 -41 18 -7 -23 28 -34 5 2 -11 11 -18 20 -19 -2 5 -24 48 -20 3 11 -18 27 1 -5 11 1 -9 10 12
4846 12 -39 36 -14 -23 35 -51 22 1 -48 37 -33 6 7 -14 23 -26 25 -8 -8 19 -12 23 -2 -10 6 -12 4 -11 8 -9 4 15
4878 15 -23 21 -28 3 12 -33 32 -32 16 -11 -29 38 -38 26 3 -37 49 -43 4 19 -32 14 -9 -10 -5 4 -15 10 19 -40 26 -7 -14
4911 -14 30 -26 14 -15 -14 -1 -15 22 -30 21 8 -38 43 -32 3 19 -42 29 -13 3 14 -2 2 -11 14 -9 6 10 -8 21 -10 4
4943 4 7 -2 -3 -17 32 -25 6 27 -38 48 -19 -19 40 -40 20 -4 -11 3 -9 7 -11 13 -19 -7 15 -21 14 -3 -9 1 -9 5 -17 19
4977 19 -11 -3 27 -41 22 -24 -16 32 -43 22 -11 -3 10 -20 12 -11 7 5 -25 20 -17 -7 -4 -11 -9 -3 -1 -24 21 -16 -9 40 -37 27 4
5012 4 -31 31 -30 2 10 -1 4 0 19 -29 15 5 -28 37 -19 -4 11 -30 14 -1 -9 1 15 -16 -6 25 -36 29 -6 -32 47 -38 10
5045 10 11 -24 22 -9 8 3 -5 6 -2 11 -6 -4 6 -14 8 -14 0 -5 -4 11 -18 3 -1 -3 10 -1 0 -7 27 -22 -3 26 -43 52 -19 -23
5081 -23 47 -55 23 19 -44 40 -22 -15 21 -15 -6 12 -6 -25 30 -21 -1 12 -31 9 2 -35 8 -1 -16 -1 12 -28 4 14 -35 36
5113 36 -22 -25 38 -46 21 16 -35 47 -15 -5 23 -22 11 -7 -9 9 -7 -20 4 -5 -8 21 -23 7 22 -14 10 0 -17 12 5 -13 6
5146 6 10 -26 17 3 -41 51 -30 -12 54 -60 19 14 -66 44 -13 -37 33 -30 -10 36 -39 4 36 -32 13 17 -35 26 -1 -28 20
5177 20 -13 -20 17 -6 -11 14 -12 -20 33 -36 0 29 -46 31 0 -32 47 -25 -3 39 -45 19 11 -30 37 -17 -29 28 -35 -11 34 -19
5209 -19 11 16 -29 27 -4 -37 36 -16 -18 33 -14 -11 24 -20 -9 38 -33 5 25 -49 28 19 -59 46 -21 -45 49 -53 -8 43 -40
5240 -40 18 13 -42 23 2 -38 38 -1 -27 34 -25 -8 40 -44 17 21 -28 20 4 -18 18 0 -28 14 -14 -16 46 -27 -1 29 -44 37
5272 37 1 -34 49 -33 -1 37 -43 7 19 -38 13 11 -41 21 9 -42 53 -33 -26 59 -42 10 30 -52 26 24 -33 21 6 -42 41
5303 41 -2 -47 52 -37 -30 60 -62 18 32 -64 45 5 -36 37 -13 -41 35 -20 -26 48 -40 3 38 -65 38 -3 -39 32 -37
5332 -37 -13 17 -24 -5 9 -21 2 23 -31 20 8 -47 46 -18 -28 61 -53 4 28 -51 21 2 -41 23 3 -49 34 -15 -47 65
5362 65 -50 -17 64 -71 32 23 -54 46 -5 -41 41 -6 -41 42 -10 -41 58 -39 -11 57 -68 36 15 -41 46 -19 -23 30
5390 30 -24 -9 35 -19 -12 37 -48 16 23 -59 46 -18 -29 49 -39 1 21 -34 15 5 -32 23 5 -32 34 -17 -32 54 -44 9 42
5421 42 -66 38 12 -61 44 -13 -34 31 -20 -27 36 -29 -28 48 -62 6 44 -71 33 7 -52 54 -15 -22 45 -29 -27 47 -32
5450 -32 -18 57 -64 21 25 -61 48 -18 -29 46 -25 -3 32 -33 1 9 -32 8 14 -38 32 3 -43 42 -33 -7 27 -49 19 0 -43
5481 -43 17 -1 -30 23 3 -29 50 -40 -23 56 -57 24 30 -80 66 -11 -47 47 -26 -24 47 -34 -14 42 -47 -1 36 -56 33 16
5511 16 -49 51 -5 -25 29 -11 -15 30 -16 -21 37 -37 1 40 -56 29 7 -42 49 -22 -14 37 -36 11 17 -30 15 4 -29 31 1 -20
5543 -20 34 -26 1 32 -56 26 4 -43 38 -18 -14 43 -14 -17 36 -19 -20 43 -45 0 41 -73 31 14 -63 50 -14 -29 52 -22
5573 -22 -23 53 -26 -12 55 -59 21 32 -61 56 -2 -28 51 -21 -6 37 -28 -3 25 -23 -3 21 -26 15 7 -34 36 -6 -22 27
5603 27 -28 11 15 -17 21 -6 -22 18 -8 -23 28 -16 -9 33 -43 16 26 -51 35 -9 -36 44 -32 -10 50 -36 1 29 -28 2 34
5634 34 -52 16 17 -56 48 -9 -23 42 -11 -5 33 -15 -2 34 -40 9 35 -54 20 14 -52 34 -6 -29 41 -28 3 26 -31 12 -3
5665 -3 -22 9 -4 -18 13 -6 -20 12 -14 7 14 -24 13 -5 -32 22 -11 -16 15 -17 -10 19 -26 0 21 -35 19 6 -37 27 -10 -34
5697 -34 35 -46 -7 31 -28 5 13 -30 18 10 -24 11 -10 -34 31 -17 -25 39 -34 -15 24 -39 8 -3 -43 18 -7 -35 10 -22 -23 17
5729 17 -16 -19 38 -29 -2 19 -33 11 -9 -20 11 -14 -13 8 -19 1 4 -20 1 3 -16 9 10 -31 31 -7 0 20 -26 18 7 -17 18
5762 18 -5 -13 11 -2 -16 4 -9 -19 19 -26 -4 29 -26 11 5 -32 14 -11 -16 13 -11 -13 21 -16 -25 33 -14 -2 19 -43 16 3 -18
5795 -18 24 -23 1 -4 -15 6 1 -2 -10 12 -6 -4 7 -34 14 -15 -18 10 -31 11 5 -12 10 -4 2 -14 -2 -13 7 7 -26 25 -16 -16 17
5830 17 -27 14 -3 -18 25 -16 -3 16 -7 -13 13 -10 -10 14 -19 -5 15 -31 20 -14 -17 12 -26 -5 -8 -9 0 -6 -4 -30 10 -6 -10 17 -32
5865 -32 15 -10 -11 5 -16 5 7 1 -4 -3 5 -8 19 -8 11 15 -24 21 -9 -9 21 -33 -3 -4 -3 10 -11 -3 -7 6 1 1 7 -1 25 -16 -10 17 -23
5904 -23 13 -8 -5 6 -5 8 -7 9 -1 3 2 -25 14 -12 -14 14 -27 20 -6 -5 10 -16 -2 -4 -9 -2 -9 -2 -10 0 -18 -6 2 -16 10 -14
5940 -14 -8 4 -11 5 -13 -12 -4 -8 4 -10 12 -9 -3 2 -12 7 1 -5 9 -14 12 4 10 1 0 9 -12 0 -9 -7 1 -16 4 -11 -10 4 -13 12 -11
5979 -11 -7 -9 -8 -14 -1 -1 -17 0 0 -9 14 -4 -4 1 -8 3 -5 -1 3 -2 -9 -11 11 -17 6 -5 -9 16 -18 -1 4 -4 2 -5 -1 4 -9 -9 -5 0 -12 0 -2 -9
6023 -9 3 -18 10 -1 -15 0 -9 -4 0 -8 9 -8 -9 -6 7 -4 -6 1 -19 3 3 -3 0 -20 -3 -1 -7 0 16 -8 -6 1 -10 -5 9 -24 14 -5 -15
6062 -15 23 -22 5 6 -14 8 -1 -2 0 -2 -4 5 10 -8 12 -2 -8 8 -10 17 -6 7 -2 -12 10 -10 4 -5 -7 11 -6 12 0 -6 3 -20 -6
6099 -6 10 -14 10 -8 -6 -3 -11 -10 9 -8 -3 5 -4 4 -7 -13 17 -8 -7 7 -16 6 -4 -9 -7 2 2 -3 4 -8 -6 10 -16 5 3 -13 4 -15 -6 1 -9
6140 -9 -5 7 -6 1 6 -6 -4 5 -18 8 -6 3 -1 -18 -7 -9 -14 0 1 -11 -1 0 -3 4 1 0 -4 -4 -1 5 -9 0 -4 1 3 -13 -9 7 -3 7 -3 -8 -1 6
6184 6 -10 6 -7 -13 4 -11 7 5 -5 10 12 1 5 -9 -3 -3 -1 -1 -7 2 1 9 3 -11 4 8 -12 4 -11 1 -5 -13 9 -2 -11 11 -6 0 8 -15
6224 -15 2 -8 -15 0 -5 -15 -2 -6 -1 2 -13 12 -7 -16 4 -8 6 -17 -1 6 -1 1 -12 -6 -1 -10 9 -9 7 15 -11 6 -10 -17 -1 -11 -8 -6
6262 -6 -19 -9 0 -15 -2 1 -27 -9 -14 -4 4 -17 8 -10 -5 1 -6 1 1 0 10 -8 4 -2 1 9 -10 15 -3 -3 3 -8 3 5 -4 8 10 2 -6 7 -6
6303 -6 2 1 -7 10 -8 6 -9 -5 15 -15 4 -4 -21 10 -14 -6 -1 -3 7 -7 5 -10 -7 9 0 15 9 11 -3 -2 -1 -10 11 1 -1 6 -2 -1 -9 -7 -3 -2
6345 -2 8 -14 -6 1 -16 8 -3 8 -6 -17 -2 -1 -3 -3 1 -4 0 7 -8 10 -5 2 11 -8 13 -1 -7 -3 0 5 -3 -7 -1 -2 -4 3 -3 -4 3 2 -10 1 -6 -2
6389 -2 4 -17 5 -10 -5 -2 -11 5 -2 4 -9 -2 -2 -3 9 1 12 13 -11 2 7 -2 6 -9 7 -6 4 7 10 2 -13 5 -6 19 -2 -14 12 -6 5
6428 5 10 -7 11 2 -11 -5 -2 -8 -8 1 -19 -3 1 -4 3 -17 -7 16 -18 -15 -12 -13 0 0 -4 -3 2 -2 5 -10 -4 7 -12 -6 5 -15 4 3 -1 2 -8 -1 2 2
6472 2 -6 7 -12 3 2 -16 4 -13 -10 9 -7 4 3 -16 7 -9 -5 3 -6 -1 0 4 -9 28 -4 0 9 -15 -7 3 -1 5 -6 -9 -11 -2 -16 8 13 -16
6512 -16 9 -7 -13 16 -9 2 -9 -16 9 -4 -3 0 -4 5 -2 -2 -2 -2 -5 1 -4 -17 6 -11 -10 -2 -12 4 5 -4 -4 6 -5 1 0 -11 3 -1 -1 18 -16
6553 -16 -2 7 -12 4 5 -13 -9 -12 -21 8 2 -12 10 -6 -15 12 -19 -8 16 -11 12 1 -14 18 -3 -13 4 4 -7 0 -7 -13 19 -8 8 5
6589 5 -9 6 -12 -4 1 -6 -3 -5 -16 -6 -7 -11 3 -2 -20 -6 -4 -20 12 -16 -3 6 -14 12 -2 -19 8 -8 -11 -1 -7 -21 16 -11 -11 21 -14
6626 -14 -11 7 -22 3 6 -16 5 -12 -13 10 -21 -14 5 -13 -11 5 -18 -6 9 -19 0 -11 -15 -11 -3 -16 -3 -2 -9 1 -1 3 14 -10 -4 -1 -22
6663 -22 1 -3 -10 14 -8 -2 4 -10 13 -9 -8 10 -13 -22 5 -10 -12 3 -21 -8 1 -18 6 2 -20 2 -4 -12 6 -12 0 7 -14 -3 0 -22 6
6700 6 -3 -19 5 2 -15 17 6 -7 11 -25 3 1 -24 -4 3 -23 5 -1 -11 8 -1 -20 4 -10 -13 9 -16 2 5 -11 3 -1 -11 18 -12
6735 -12 -21 -10 -10 -10 3 -5 9 8 -16 10 -3 -7 9 1 -8 1 -5 -1 -4 -11 10 0 -21 9 2 -11 19 -11 -6 17 -17 -3 -3 -17 7 3 -11 9 -7
6774 -7 -8 3 -8 -18 9 -14 -10 11 -19 3 10 -9 -1 -1 -14 1 3 -9 3 -7 -1 0 -16 -4 0 -14 8 -2 -16 4 -9 -1 10 -18 -9 -1 -17
6811 -17 -1 6 -10 0 -9 -19 14 -12 -7 13 -18 3 5 -20 16 -5 -19 -11 -7 -5 1 -1 -8 15 -16 -13 2 -5 4 7 -12 8 -13 -1 10 -10 -9 -2
6849 -2 -10 1 11 -22 -1 0 -23 12 -3 -5 0 -1 -12 8 -9 -3 9 -6 -7 -14 -12 10 -2 -24 3 -11 -11 5 -16 -7 -1 -6 -11 -5 -5 -6 -3 -19 6 -22
6889 -22 -12 5 -13 -10 -9 -23 -1 -8 -18 9 -13 -11 15 -10 -9 3 -24 -7 0 -11 8 6 -15 2 -6 -3 4 1 -7 -1 -7 -5 4 -5 -9 0 -23 3 -7 -17
6929 -17 2 -5 -7 -9 -11 -3 4 -9 -11 -7 -5 0 -16 -6 6 -19 -10 2 -17 -7 -7 -20 7 -8 -12 7 0 -4 13 -6 -4 14 -12 3 3 -21 -2 -9 -10 -4
6969 -4 -8 -13 -1 -2 -5 9 -5 -2 8 -12 8 -5 -20 5 -13 -9 -1 -20 -3 -3 -18 -11 5 -15 1 -4 -11 -10 -14 -11 3 -14 6 6 2 -11 -1 -5 3 14
7009 14 -7 -2 -1 -10 -6 -10 -13 7 -18 9 2 -16 6 -12 -1 9 6 1 6 -8 -13 6 1 7 1 -15 9 2 -11 6 -13 -4 -1 -14 0 1 -6 2 7 -5 -1
7050 -1 3 -11 -1 -3 -17 12 -15 -9 6 -19 -2 2 -12 -16 1 -9 -4 -4 -18 -1 -12 -5 2 -6 3 3 -14 -8 3 -5 0 -2 -8 -8 2 -6 -5 -12 -12 1 -16 2
7092 2 -10 -17 4 -6 -13 9 -14 -11 2 -6 -4 0 -13 6 2 -18 1 -11 -20 -1 -21 -17 1 -20 -4 -4 -16 -2 6 -18 6 1 3 8 -12 -13 5 -21
7130 -21 1 5 -16 -9 3 -6 -11 -7 -15 -9 -4 -7 -3 -9 -6 -2 -19 -5 -3 -11 2 -7 -3 -4 -18 -8 -5 -11 -16 -2 -5 2 0 -10 -3 -16 -6 0 -8 -6 -5 -8 1 2 -10 -3 -5
7177 -5 -9 -9 -5 -2 -3 -10 11 -3 -10 -12 0 -11 -4 -9 -10 -7 -4 -15 -11 -15 -16 -1 -3 -3 -2 -9 -11 0 -9 3 -5 -17 -7 -2 -6 -11 -13 -13 -8 -2 -9 -6 -22 3 -14 -9 -9 -12
7225 -12 -9 1 -18 -7 -10 -11 -6 -19 -3 -1 -12 -16 1 -10 -8 -15 -13 -3 -9 -14 -11 -10 -10 -4 -10 -9 -1 -15 -24 -14 -19 -13 -4 -8 -13 -7 -16 -10 1 -17 -4 -12 -8 -6 -10 -7
7271 -7 -8 -11 -6 -13 0 -5 4 -4 1 0 -7 -5 -6 -2 -11 -4 -5 2 -6 -2 1 -1 0 -5 -7 -4 -13 -7 -3 -8 4 -3 -15 -5 -16 -8 -12 -10 0 2 -9 -1 -12 -18 0 -2 -3 -12 1 -3 -9
7322 -9 -1 9 -12 -16 -11 -7 -7 -18 3 -13 -8 0 -13 -6 -1 1 -6 -13 -11 -5 -1 1 -8 -6 2 -8 -6 6 6 -5 -12 -18 -6 -12 -5 -5 -10 -9 -1 -13 -1 -7 -4 -2 -6 -1 -15 -7
7370 -7 0 0 0 -5 -16 -6 -10 -6 0 -4 -5 0 -3 7 -10 -11 -11 -11 -5 1 -17 -7 -12 -8 -6 -9 -11 -9 -13 -11 -8 -2 -12 -2 -9 -9 -2 -9 -6 3 -6 -11 -6 -2 -6 0 -1 1 -6 -6 -6 -6 -7
7423 -7 6 -11 -6 -3 -13 -11 -7 -20 -9 -11 -2 1 -6 -8 3 -14 5 -3 -14 -2 -5 -5 -6 -4 -4 -7 -9 -11 3 1 -6 5 -5 -5 -3 -1 -3 -4 -17 -3 -5 4 -2 -15 -10
7468 -10 -4 -13 -2 -7 -19 -8 -5 -12 0 -12 -5 -10 -9 -11 -1 -14 -9 -9 -8 -3 -3 0 5 -8 -8 5 -3 2 -9 -18 0 -12 2 -2 -10 -8 -8 -1 -4 -12 -17 -6 -3 -9 -9 0
7514 0 -4 -7 -12 -12 -8 -16 -19 -22 -6 -13 0 -11 -10 5 -7 -15 -14 -15 0 -16 -1 0 -15 -8 -9 -3 -8 -6 -4 -9 -6 -16 4 1 -3 8 -15 -11 -4 -9 5 -11 -3 -10 -1 -15
7560 -15 0 -9 -10 -6 -5 3 -6 -12 -9 -7 -12 -3 -8 -10 -10 -4 1 -5 -5 6 6 3 -2 19 5 8 0 1 4 -10 1 -8 -12 1 -6 -9 -4 -9 -11 -2 2 -8 1 -11 -9 0 -8 1 -2 -2 -6
7611 -6 -8 -2 -1 -1 -5 -4 -1 -3 -9 -3 -6 0 7 -4 -1 0 -7 -7 0 2 -1 -1 -4 8 -3 10 3 -12 3 -4 -2 -4 -18 -10 -15 -5 -6 -20 -6 -10 -6 2 -1 -6 -8 -1 0 -3 -3 6 7
7662 7 -1 -6 6 -10 -5 -2 0 -1 -4 -5 -3 0 -8 -3 -10 -9 -3 -7 -4 1 -9 -1 -2 -6 -3 -11 -12 -4 -7 -18 -10 -7 -4 -11 2 3 5 -8 -1 3 -6 -1 -7 -10 -1 2 -3 -5 6 -14 -3 -2
7714 -2 8 6 -8 -2 -9 -3 -5 -4 -12 -5 -8 4 -4 3 3 -1 -2 -1 -13 -10 -6 -4 -6 -8 6 -3 -2 -4 -1 0 -1 -6 -8 -1 -4 0 -6 -1 14 -13 -3 -3 1 -5 -4 -6 -6 1 -3 -4 3 -14
7766 -14 -8 3 -9 -15 -6 -4 -5 -2 -3 3 -5 -2 -4 -4 -3 -9 -11 2 -14 -6 5 -14 8 -3 -10 -2 -13 -6 -3 -6 -11 -1 -3 -13 -3 -14 -5 10 -13 1 11 -15
7808 -15 0 -13 -15 -3 -6 -3 -9 -12 -10 -15 -3 -6 5 -9 0 -10 -3 10 -5 -10 -2 -20 -6 -2 -7 -4 -18 -11 -15 -1 -6 -3 -8 -8 -4 -5 -11 2 -14 4 -1 -15 -14
7851 -14 -9 -14 3 -18 0 4 -2 -8 3 -13 -2 -3 -11 2 -12 -1 -7 -4 10 -12 -2 -5 -3 2 1 -2 3 -7 -8 -3 10 -9 -7 1 -4 1 -8 -18 -5 -5 -9 -3 -18
7894 -18 -4 -8 -14 -5 4 -16 -4 2 -1 0 -7 -5 -7 -10 1 -6 -21 -5 4 1 0 -4 -13 -6 -6 -12 -12 -3 -12 -3 -8 0 -14 -4 3 -1 -8 -8 3 -8 -5 -7 3 -9 -12 -5 5
7941 5 -6 5 -12 -9 -1 -3 0 5 -10 -8 3 -3 -1 2 -9 -4 -6 -5 8 -9 -1 1 -11 -9 7 1 3 -1 -12 -3 7 -11 4 2 -12 -5 -18 -19 -8 -9 -9 -2 -4 -10
7985 -10 -7 -10 -4 1 -5 5 -1 -1 -2 -7 -8 7 -6 -1 7 -3 0 5 -3 -5 0 -8 -4 -1 -10 1 -6 -4 -7 -8 6 -4 -11 -10 -7 1 -1 -11 -20 -9 -11 -10 -5 -7 1 -17 2 10 0
8034 0 4 -5 -10 0 0 -16 -4 -3 -12 12 -4 -6 -1 -1 3 -2 -3 -3 5 -14 -6 -1 -15 -7 -4 -9 4 -17 -6 0 -16 -6 2 1 2 -4 2 1 5 -12 -6 5 -2 12 -8
8079 -8 -16 4 -13 7 6 -1 14 2 -6 4 -9 3 5 -18 5 -3 0 3 1 -5 0 -6 -11 12 -18 -3 6 -11 -15 -15 -11 -3 -2 -19 6 -11 -3 12 -3 -13 -2
8120 -2 -14 0 -6 -9 1 -1 -1 -3 1 -8 1 6 -9 -1 -11 4 -8 -10 -3 -13 -8 -4 -2 -7 -7 -7 -21 -2 -12 -15 0 -4 -5 1 -11 -11 -1 -8 -3 -11 -9 -4 2 -16 8
8165 8 -7 -9 -1 -11 -9 -7 -10 10 -6 -7 11 -12 -3 -9 -14 -13 -7 -10 -9 -11 -16 -3 -5 -9 -8 -10
8191a0
$$ Imaginary data points
##PAGE= N=2
##DATA TABLE= (X++(I..I)), XYDATA
0 0 0 0 0 0 0 0 0 0 0 -8 8 -8 8 -9 16 -17 24 -32 36 -42 56 -64 74 -89 105 -122 145 -168 193 -221 252 -290
32 -290 330 -373 423 -475 535 -602 670 -748 835 -927 1030 -1143 1264 -1394 1539 -1698 1870
49 1870 -2061 2269 -2499 2752 -3033 3347 -3701 4100 -4555 5080 -5692 6418 -7294 8375
63 8375 -9748 11555 -14055 17750 -23860 36393 -110763 169776 -12137 -153529 226640
74 226640 -179806 62293 41959 -83194 66546 -31768 11305 -8313 4515 14311 -38174
85 -38174 44433 -25404 -471 9284 9940 -34821 31712 13917 -77563 112470 -79501 -13158
97 -13158 113599 -160375 123723 -24764 -79095 135543 -127132 70669 685 -60759 94438
108 94438 -98601 71202 -16407 -47953 90900 -89888 42195 22934 -61329 49278 -3557
119 -3557 -34464 29702 16657 -64309 68256 -16383 -58400 105347 -90865 24802 49105
130 49105 -86108 75981 -38820 3820 15680 -27116 43560 -61595 61604 -27137 -34388
141 -34388 88961 -99492 53974 20918 -77702 81483 -37391 -17802 43762 -28388 -7833
152 -7833 29284 -16178 -20605 49517 -46241 11012 33506 -59223 53494 -25039 -7525 31187
164 31187 -41900 42122 -33021 13545 15842 -44826 57721 -44122 9341 28480 -48700 42962
176 42962 -20194 -2767 14837 -16419 14770 -16035 17451 -11980 -2658 18714 -25675 18243
188 18243 -2930 -7619 5776 2600 -4654 -7126 26038 -34983 20207 14702 -48193 56405 -30850
201 -30850 -13300 47977 -51924 26443 8119 -27989 24542 -7857 -4364 2881 7731 -13622 5072
214 5072 13495 -27219 24270 -5827 -15453 24694 -17420 2425 7192 -6197 -1239 5340 284
227 284 -12509 20290 -15477 -1090 19710 -28514 22012 -4763 -13099 23199 -22027 11932 1348
240 1348 -11944 16311 -13164 5057 3685 -8609 7602 -1837 -3634 4082 1093 -7661 9542
253 9542 -3354 -7558 15170 -13912 4070 8021 -14389 11476 -3192 -3907 5306 -1999 -858 -1581
267 -1581 7347 -10124 5081 6433 -16922 17591 -6412 -9489 19612 -16987 3397 11424 -16681
280 -16681 9668 3421 -12392 10852 -676 -9481 12154 -5902 -4595 11745 -10697 3074 5420
293 5420 -9489 7180 -1207 -3631 4464 -2161 -934 2064 -149 -2931 4045 -2092 -2352 6481 -6857
308 -6857 2526 3633 -7710 7016 -1655 -4564 7104 -4379 -1368 6163 -5828 318 6036 -8077
322 -8077 4073 3677 -9485 8808 -1975 -6077 10072 -7237 -558 7209 -7884 2687 3995
335 3995 -6979 3664 2855 -7111 5706 280 -6734 8553 -4255 -2855 7649 -7174 2081 3538
349 3538 -5485 3170 734 -3001 1934 1491 -3902 2900 1027 -5241 6729 -3618 -2300 7181 -7922
364 -7922 4144 2020 -6650 7020 -3432 -1520 4735 -4295 868 2370 -2795 304 2900 -4042
378 -4042 1646 2741 -6084 5820 -1742 -4029 7451 -6218 1347 3684 -5674 3671 202 -2604
392 -2604 1793 1199 -3400 2256 2255 -6816 7382 -2672 -4768 10153 -9481 3148 4614 -8959 7756
407 7756 -2518 -2560 4060 -2124 -375 504 2127 -4995 4571 118 -6212 9465 -7506 1067 5866
422 5866 -9069 7173 -2242 -2441 4153 -2962 1138 -941 2208 -3143 2067 1307 -5328 7412 -6139
437 -6139 1931 3502 -7429 8118 -5818 1706 2821 -6126 7318 -6151 2837 1340 -4465 5585
451 5585 -5057 3563 -1775 10 2145 -5088 7405 -7260 3768 2438 -8614 10773 -7767
464 -7767 1639 4137 -6687 5744 -3845 3086 -3125 1839 2201 -8074 12274 -10657 2529 8028
478 8028 -14999 14249 -6187 -3673 9538 -9411 5300 -1160 -143 -556 535 2053 -6500 9462
492 9462 -7645 1172 6386 -10755 10071 -5567 203 3396 -5316 6825 -7893 7402 -4116
505 -4116 -2725 10501 -14560 12132 -4083 -5708 12396 -13296 9294 -3249 -2510 6937 -9456
518 -9456 9725 -7360 2277 4112 -8907 10103 -7386 2543 1547 -3537 4335 -5362 6966 -7467
532 -7467 4424 2324 -10022 14397 -12285 4241 5584 -12173 12683 -8363 2533 1783 -4168
545 -4168 6106 -8482 9694 -7594 1135 7783 -14495 14681 -8057 -1726 9475 -11789 9139
558 9139 -4783 1520 668 -3319 7099 -10478 10646 -5497 -3402 11473 -14338 10824 -3291
571 -3291 -4125 8308 -8779 7258 -5298 2898 633 -5263 9489 -10901 7881 -1408 -5480 9813
585 9813 -10428 7764 -3497 -919 4865 -8350 10445 -9640 4911 2821 -10487 14143 -11729
598 -11729 4545 3674 -9354 10706 -8468 4675 -840 -2717 6150 -8767 9163 -6105 85
611 85 6307 -9772 8958 -5081 658 2448 -4048 5134 -6414 6921 -5039 83 6566 -11752
625 -11752 12071 -6742 -1642 8766 -11656 9801 -4955 -515 4724 -7142 7773 -6657 3862
638 3862 308 -4963 8289 -8443 5223 -438 -3549 5509 -5539 4523 -3244 1825 459 -3625
652 -3625 6767 -8228 6449 -1330 -4888 9166 -9590 6388 -1273 -3801 7237 -8254 6868
665 6868 -3415 -1215 5465 -8052 7741 -4444 -503 4789 -6634 5589 -3005 396 1412 -2361
679 -2361 2928 -3386 3388 -2587 722 2045 -4612 5694 -4639 1844 1487 -4282 5837 -5526
693 -5526 3540 -235 -3474 6104 -6565 4758 -1019 -3217 6081 -6382 4121 -642 -2445 4103
707 4103 -4111 2980 -1441 -177 1435 -2260 2723 -2717 1879 -497 -1218 2562 -3159 2935 -1863
722 -1863 88 1798 -3343 3926 -3098 1086 1499 -3682 4483 -3526 1112 1701 -3591 3994 -2732 541
738 541 1422 -2422 2420 -1568 545 212 -660 887 -1054 1175 -1097 643 109 -974 1483 -1677
754 -1677 1373 -623 -411 1461 -2264 2279 -1416 -173 1919 -3005 2799 -1329 -800 2517 -2957 2084
770 2084 -402 -1167 2011 -1899 1104 -61 -709 1085 -986 694 -297 -142 580 -685 456 -107 -118
787 -118 101 57 -83 -120 395 -670 667 -200 -598 1185 -1152 471 367 -981 1076 -798 269 312
805 312 -734 844 -690 403 -5 -447 835 -900 580 -4 -445 677 -675 576 -309 -48 498
822 498 -803 883 -610 89 570 -1078 1102 -589 -192 815 -1004 735 -289 -203 573 -737 554
839 554 -197 -193 431 -513 380 -55 -356 543 -292 -245 663 -554 15 660 -1032 825 -10 -944 1474 -1144
859 -1144 128 982 -1474 1173 -341 -551 1090 -1046 545 128 -624 732 -538 192 156 -464 603
876 603 -506 85 458 -864 761 -226 -543 1132 -1160 494 549 -1419 1487 -703 -498 1371 -1417
893 -1417 710 332 -1025 1054 -385 -431 810 -452 -266 819 -727 108 699 -1180 1044 -305 -652
910 -652 1298 -1294 721 19 -619 951 -1075 973 -623 -29 852 -1585 1751 -1172 -110 1457
926 1457 -2157 1751 -491 -834 1415 -1111 337 213 -144 -348 727 -434 -531 1730 -2236 1549 168
943 168 -1976 2956 -2581 1146 736 -2230 2779 -2258 1037 341 -1403 2052 -2185 1746 -737 -628
959 -628 1837 -2486 2309 -1355 -154 1625 -2493 2335 -1300 -43 1049 -1414 1240 -915 794
974 794 -906 808 55 -1710 3357 -3671 1996 1176 -4111 5137 -3603 430 2617 -3997 3397 -1618
990 -1618 5 722 -853 1208 -2047 2795 -2390 484 2121 -4000 4041 -2184 -502 2484 -2919
1005 -2919 2053 -1049 675 -782 331 1184 -3245 4384 -3475 489 3207 -5660 5506 -2829 -907
1020 -907 3888 -4922 4071 -2005 -356 2331 -3378 3226 -1986 321 1027 -1558 1442 -1211 1375
1035 1375 -1735 1588 -305 -1993 4099 -4612 2859 458 -3563 4902 -4157 2121 -4 -1640 2897
1050 2897 -3921 4360 -3408 476 3708 -7060 7236 -3491 -2346 6840 -7299 3680 1334 -4306
1064 -4306 3702 -651 -1884 1669 1053 -3669 3684 -518 -3718 6081 -5038 1384 2558 -4659 4531
1079 4531 -3129 1448 110 -1891 3927 -5315 4754 -1715 -2847 6448 -7069 4238 462 -4386
1093 -4386 5650 -4319 1589 895 -2196 2348 -1780 1023 -426 43 43 140 -83 -622 2129 -3703 3710
1110 3710 -1141 -3280 7210 -7695 3751 2736 -8061 8989 -5022 -1049 5545 -6201 3593
1123 3593 -535 -951 751 -435 1408 -3242 3891 -2111 -1656 4826 -4933 1888 2006 -3816 2083 1412
1139 1412 -3247 1518 2686 -5917 5005 64 -6082 8915 -6417 165 6023 -8592 6440 -1538
1153 -1538 -2908 5006 -4568 2897 -1118 -477 1951 -3087 3347 -2176 20 1915 -2644 1804 -319
1168 -319 -538 176 667 -903 -160 1733 -2635 2108 -531 -1094 1955 -2254 2267 -2084 1175 1031 -3982
1185 -3982 5881 -4877 600 4947 -8166 6717 -1137 -4964 7566 -5225 30 4221 -4558 1379
1199 1379 2293 -3335 941 2712 -4339 2423 1612 -4606 4314 -1294 -1997 3193 -1938 -91 720 422
1215 422 -1896 1641 909 -4060 5163 -2796 -1863 5704 -6159 3006 1615 -4824 4899 -2283 -909
1230 -909 2794 -2521 903 701 -1195 610 421 -1182 1211 -346 -1050 2309 -2543 1343 954 -3126
1246 -3126 3806 -2417 -384 2968 -3814 2456 15 -1874 2009 -897 -119 -31 970 -1396 281 1869
1262 1869 -3477 2925 -182 -3068 4381 -2663 -888 3553 -3263 356 2719 -3279 817 2723 -4353
1277 -4353 2634 1478 -4954 5135 -1765 -2736 5290 -4279 734 2701 -3735 2125 452 -1925 1337
1292 1337 418 -1651 1128 688 -2331 2382 -726 -1555 2805 -2320 499 1302 -2015 1419 -175 -760
1308 -760 741 -10 -688 689 174 -1313 1909 -1305 -273 2065 -2926 2208 -83 -2218 3317 -2412
1324 -2412 132 2062 -2680 1443 644 -1899 1389 447 -2043 1915 7 -2396 3293 -1851 -1075 3401
1340 3401 -3459 1209 1659 -3091 2185 169 -2026 1846 116 -2103 2303 -296 -2432 3706 -2278
1355 -2278 -904 3664 -4006 1773 1510 -3480 2961 -507 -1797 2259 -791 -1155 1881 -767 -1243 2510
1371 2510 -1960 -111 2313 -3077 1858 465 -2306 2482 -1106 -718 1633 -1142 -249 1319 -1180
1386 -1180 -220 1858 -2407 1221 1068 -2995 3208 -1478 -1168 3107 -3141 1389 1014 -2399 2040 -355
1402 -355 -1184 1414 -163 -1382 1829 -587 -1533 2919 -2385 102 2408 -3378 2091 473 -2369 2232
1418 2232 -494 -1326 1576 -111 -1769 2320 -843 -1818 3623 -3111 407 2683 -4104 2971 -180
1433 -180 -2351 3075 -1796 -275 1579 -1283 -111 1290 -1152 -258 1890 -2424 1333 788 -2569 2951
1449 2951 -1697 -370 1997 -2336 1393 -24 -776 631 19 -339 -223 1319 -2046 1490 359 -2599
1465 -2599 3660 -2667 -119 2902 -3961 2539 244 -2468 2631 -870 -1234 1865 -483 -1729 2805
1480 2805 -1559 -1308 3735 -3845 1470 1841 -3907 3530 -1254 -1188 2250 -1650 412 193 276 -1068 1028
1497 1028 284 -2151 3115 -2330 13 2390 -3487 2661 -604 -1422 2245 -1728 499 437 -523 -62
1513 -62 584 -532 -297 1497 -2266 1960 -329 -1925 3619 -3570 1610 1402 -3656 3988 -2159 -572
1529 -572 2491 -2534 1139 338 -600 -314 1165 -720 -1072 2904 -3144 1202 1767 -3812 3423 -978
1545 -978 -1704 2686 -1493 -528 1367 -257 -1817 2718 -1237 -1887 4413 -4354 1408 2575 -4998 4377
1561 4377 -1372 -1848 3298 -2532 725 524 -532 -101 371 197 -1270 1943 -1512 241 1211 -2015
1577 -2015 1897 -1193 318 501 -1250 1778 -1800 1079 35 -1122 1654 -1583 1119 -620 107
1592 107 551 -1556 2462 -2547 1177 1315 -3537 3920 -2020 -1020 3269 -3223 1158 1214 -1984 783
1608 783 1204 -1956 582 2038 -3616 2665 418 -3441 4346 -2510 -603 2788 -2784 1186 400 -642
1624 -642 -281 999 -317 -1607 3122 -2770 369 2578 -4106 3139 -454 -2116 3008 -2004 184
1639 184 1006 -884 16 524 -195 -682 1384 -1301 472 627 -1419 1738 -1519 810 326 -1564 2455
1656 2455 -2336 1058 933 -2449 2662 -1516 -183 1308 -1356 721 -285 468 -866 674 428 -1891
1672 -1891 2496 -1550 -513 2264 -2493 1027 883 -1714 816 851 -1648 669 1465 -2991 2424 147
1688 147 -2971 4080 -2630 -405 2990 -3470 1894 350 -1630 1443 -449 -176 -104 791 -928 124
1704 124 1143 -1902 1519 -195 -1120 1559 -1012 116 365 -269 -141 215 236 -874 1117 -797 -15
1721 -15 936 -1485 1422 -829 -41 952 -1654 1783 -1139 -90 1469 -2120 1637 -303 -978 1509
1737 1509 -987 22 614 -396 -388 940 -518 -625 1694 -1717 522 1082 -1954 1590 -384 -769 1066
1754 1066 -534 -143 151 458 -1034 809 376 -1765 2186 -1184 -590 2046 -2224 1087 514 -1469
1770 -1469 1310 -393 -439 577 -7 -554 548 77 -781 1131 -799 40 720 -1083 947 -462 -45
1787 -45 424 -637 716 -690 451 9 -530 832 -893 677 -252 -319 777 -1035 964 -491 -255
1804 -255 914 -1214 941 -169 -622 913 -603 9 393 -232 -269 640 -405 -297 1081 -1282 697
1821 697 433 -1290 1416 -769 -152 711 -744 452 -263 272 -327 127 378 -1012 1246 -813 -208
1838 -208 1156 -1487 1011 -76 -741 961 -612 84 215 -149 -134 303 -90 -405 787 -775 359
1855 359 304 -835 1005 -759 297 285 -720 912 -785 453 41 -513 796 -813 579 -205 -230
1872 -230 574 -786 766 -515 1 499 -834 795 -458 -29 339 -423 347 -263 275 -351 312 24
1890 24 -564 1027 -1043 517 343 -1063 1314 -938 216 499 -854 869 -573 293 -51 -188 520
1907 520 -767 825 -527 -26 624 -915 804 -414 -25 336 -434 430 -451 453 -369 82 379 -832
1925 -832 973 -752 234 414 -958 1146 -933 368 344 -901 1163 -977 479 214 -746 984 -827
1942 -827 463 -5 -323 555 -649 617 -402 127 245 -553 755 -685 399 2 -380 598 -703
1959 -703 681 -494 96 413 -940 1187 -956 280 538 -1198 1319 -878 137 516 -868 880
1975 880 -652 364 -19 -317 632 -750 722 -398 -26 476 -711 750 -551 288 39 -388 754
1992 754 -911 803 -324 -340 912 -1171 951 -386 -330 829 -1004 821 -436 -27 409 -701 791
2009 791 -674 342 75 -461 723 -793 596 -261 -138 530 -792 858 -675 256 372 -882 1115
2026 1115 -890 371 305 -803 980 -821 416 64 -438 669 -724 621 -340 -83 484 -691 658
2043 658 -469 187 99 -370 570 -734 665 -381 -142 731 -1135 1057 -513 -251 877 -1123 946
2060 946 -415 -159 645 -839 762 -452 84 290 -541 650 -522 308 6 -239 405 -453 456 -352
2078 -352 193 53 -360 649 -786 639 -205 -446 941 -1115 807 -188 -534 991 -1085 736 -177
2095 -177 -429 792 -842 621 -216 -208 487 -564 458 -268 82 105 -245 379 -419 369 -181 -15 270
2114 270 -460 553 -448 220 141 -490 708 -664 397 72 -520 766 -721 435 -23 -387 664
2131 664 -744 540 -157 -278 574 -648 507 -232 -93 353 -468 460 -327 158 95 -309 465 -447 320
2150 320 -28 -183 354 -379 327 -170 40 103 -227 365 -436 389 -153 -256 612 -701 499 -90 -375 659
2170 659 -653 418 -79 -254 445 -537 492 -281 -70 427 -624 518 -179 -175 381 -357 207 -20 -25 -38
2190 -38 88 -10 -172 418 -436 240 102 -387 577 -482 258 79 -363 531 -536 390 -101 -285 633 -736
2210 -736 469 -1 -466 680 -543 178 160 -378 306 -123 -4 3 70 -108 10 125 -233 277 -205 89
2230 89 95 -279 432 -450 304 81 -454 699 -634 248 289 -631 673 -417 37 271 -388 381 -274 138
2250 138 -6 -143 261 -353 268 -92 -152 230 -197 54 10 43 -187 223 -37 -306 584 -561 199 343 -710
2271 -710 696 -319 -149 474 -479 285 -66 -11 42 -77 210 -321 367 -193 -118 382 -473 341 -70 -172
2291 -172 259 -239 169 -148 79 -28 -110 227 -337 300 -157 -87 293 -405 335 -192 -14 217 -357 382 -240
2312 -240 53 169 -258 281 -183 130 -60 15 108 -253 422 -423 204 218 -581 647 -396 -64 418 -496
2332 -496 305 -48 -120 96 36 -54 -138 374 -455 226 188 -575 617 -341 -78 383 -444 261 -22 -64 -23 117
2354 117 -21 -226 500 -498 209 266 -620 699 -393 -71 465 -523 363 -92 -63 99 -68 103 -199 315
2374 315 -316 143 137 -425 573 -461 119 235 -514 542 -366 49 212 -336 296 -171 66 -90 116 -27
2394 -27 -191 469 -562 388 74 -533 786 -615 150 365 -585 453 -152 -43 45 73 -68 -142 474 -651
2414 -651 449 113 -723 944 -644 -13 566 -726 445 -31 -244 162 66 -185 -3 353 -613 521
2432 521 -68 -503 860 -770 319 258 -626 688 -469 139 136 -266 328 -300 324 -269 119 155 -441 618
2452 618 -555 249 205 -594 719 -492 63 338 -472 320 -52 -81 -41 245 -310 29 482 -910 836
2471 836 -196 -677 1214 -1073 364 483 -948 815 -287 -163 290 -106 -57 -26 374 -610 521 16
2489 16 -625 944 -710 133 444 -666 503 -140 -86 63 94 -119 -117 484 -721 546 -37 -590 967
2508 967 -909 416 242 -797 938 -671 158 351 -610 566 -266 -32 158 -45 -80 59 227 -558
2526 -558 668 -299 -337 909 -1001 535 232 -744 790 -365 -76 201 13 -198 40 443 -882 836
2544 836 -162 -795 1374 -1175 246 767 -1245 888 -84 -560 583 -125 -335 353 103 -636 788 -340
2562 -340 -406 978 -973 464 247 -682 732 -497 196 55 -210 343 -430 454 -337 74 269 -524 602
2581 602 -503 226 153 -537 743 -662 233 320 -698 644 -263 -220 366 -159 -239 357 -26 -580 963
2600 963 -700 -182 1144 -1458 882 263 -1196 1314 -618 -266 738 -532 2 324 -72 -452 748
2617 748 -382 -438 1122 -1079 325 609 -1091 804 -90 -498 517 -104 -348 313 139 -679 754 -291
2635 -291 -488 1007 -978 402 326 -824 884 -557 78 331 -529 529 -344 94 167 -260 221 -86
2653 -86 27 -135 288 -274 -16 475 -783 668 -89 -575 906 -674 44 458 -492 115 235 -179 -304
2672 -304 702 -606 -120 987 -1333 788 346 -1287 1364 -551 -542 1078 -759 -69 663 -565 -103
2689 -103 742 -751 99 760 -1124 740 149 -871 992 -502 -139 506 -414 122 47 44 -241 268 -44
2708 -44 -362 623 -571 180 275 -607 595 -377 22 282 -470 428 -236 -78 258 -266 61 135 -151 -87 408
2729 408 -505 168 444 -922 881 -204 -649 1134 -883 100 646 -851 424 182 -487 230 292 -550
2747 -550 237 405 -924 760 -33 -813 1057 -624 -218 773 -714 110 436 -539 41 498 -676 207
2765 207 513 -965 751 -45 -704 1004 -674 25 540 -665 394 -5 -210 188 -9 -73 19 154 -268
2784 -268 254 -88 -192 408 -453 278 21 -344 476 -387 67 205 -335 169 38 -156 6 258 -400 162
2804 162 303 -715 719 -238 -488 945 -808 156 539 -811 499 119 -497 396 90 -471 427 86
2822 86 -636 766 -330 -373 886 -778 177 466 -696 411 58 -374 249 108 -381 258 153 -584 624
2841 624 -254 -354 733 -706 243 283 -591 516 -196 -149 283 -177 -2 98 -33 -150 302 -242 -3 323
2861 323 -522 449 -110 -295 585 -520 193 218 -428 339 -64 -155 138 68 -269 218 109 -496 635 -341
2881 -341 -259 725 -786 318 270 -679 560 -140 -292 372 -112 -237 326 -43 -379 605 -393 -146 645 -720
2901 -720 372 197 -559 544 -185 -169 286 -103 -149 208 15 -335 484 -308 -120 528 -671 412 37
2920 37 -474 605 -424 51 248 -355 224 -50 -86 55 50 -155 86 114 -346 392 -214 -131 435 -517 324
2941 324 54 -341 393 -193 -41 131 -7 -145 151 83 -400 546 -315 -177 645 -767 424 172 -654 659
2961 659 -295 -201 423 -301 -49 255 -178 -140 387 -394 36 369 -594 442 -53 -331 474 -358 115 87 -149
2982 -149 133 -88 143 -210 215 -37 -199 412 -427 245 77 -359 495 -365 76 209 -376 301 -98 -116
3002 -116 184 -74 -119 192 -86 -224 440 -419 85 368 -691 576 -147 -362 628 -518 147 189 -314 209
3022 209 -19 3 -126 245 -152 -118 441 -503 273 178 -477 475 -180 -162 331 -181 -80 223 -99 -190 405 -316
3044 -316 -24 402 -581 422 -54 -354 522 -442 172 88 -271 302 -263 154 -24 -99 185 -189 160 -72
3064 -72 28 26 -68 184 -241 224 -82 -122 296 -296 158 47 -144 115 -29 10 -113 248 -234 -5 343 -562
3086 -562 453 -62 -390 627 -463 36 318 -418 208 61 -182 39 166 -247 63 248 -446 364 -29
3105 -29 -308 454 -315 58 173 -174 118 -26 82 -151 164 -20 -193 378 -339 138 152 -321 317 -195 21
3126 21 88 -150 159 -183 120 -49 -50 126 -162 119 -80 56 -46 -11 137 -270 314 -171 -106 378 -432 265
3148 265 42 -270 327 -170 0 97 -16 -49 35 126 -274 285 -90 -201 390 -330 109 151 -256 158 -21 -55
3170 -55 -38 148 -163 -13 251 -404 288 -2 -310 425 -318 58 162 -246 190 -97 45 -37 22 54 -151 199
3192 199 -154 45 111 -152 168 -107 65 -15 -31 104 -169 200 -141 -12 154 -217 201 -109 2 71 -119
3213 -119 151 -193 147 -55 -126 255 -305 175 28 -215 261 -164 17 53 -54 -1 7 70 -161 191 -82 -94
3235 -94 272 -268 168 46 -150 192 -105 54 -33 32 0 -92 185 -232 151 11 -206 277 -223 59 84 -170
3257 -170 156 -121 57 -22 -14 61 -120 158 -119 32 68 -154 162 -108 44 27 -52 100 -120 144 -64 -2 111
3280 111 -163 183 -104 17 105 -134 163 -129 68 8 -104 190 -190 119 -10 -115 171 -166 83 1 -66
3301 -66 73 -86 72 -82 44 2 -63 124 -141 100 -18 -49 125 -125 104 -66 19 67 -124 162 -149 63
3323 63 53 -143 208 -153 57 79 -151 165 -105 36 25 -55 76 -86 76 -68 21 56 -111 113 -113 29
3345 29 26 -97 88 -99 82 -48 -2 80 -130 154 -96 31 90 -149 180 -113 26 99 -130 141 -82 43
3367 43 31 -53 104 -110 75 -48 -27 81 -122 104 -63 -7 51 -84 93 -92 57 -4 -52 90 -125 92 -51
3390 -51 -14 87 -131 128 -95 27 76 -135 174 -113 35 71 -111 144 -98 41 27 -54 97 -85 98 -42
3412 -42 13 63 -108 118 -83 27 47 -96 104 -82 36 -4 -25 68 -98 116 -94 8 74 -159 169 -103 -5
3435 -5 114 -149 139 -56 -1 74 -68 95 -70 63 -4 -14 79 -93 107 -54 19 60 -96 123 -83 48 27
3458 27 -80 107 -127 85 -35 -60 118 -151 124 -60 -45 111 -148 130 -55 -30 85 -98 91 -53 21 24
3480 24 -30 61 -52 92 -62 31 56 -101 148 -115 47 61 -123 171 -105 34 42 -100 131 -111 64 8 -69
3503 -69 98 -125 92 -39 -45 86 -115 74 -61 1 27 -62 62 -87 67 -47 3 83 -135 153 -89 11 109
3526 109 -152 167 -76 21 91 -127 136 -91 29 49 -87 112 -93 50 21 -39 53 -70 66 -60 26 19 -74
3549 -74 94 -107 83 -29 -52 123 -142 116 -46 -40 129 -158 143 -58 -42 114 -133 129 -47 -9 91 -92
3571 -92 85 -43 21 24 -20 54 -68 76 -59 15 34 -92 111 -100 53 5 -72 126 -137 104 -27 -84 169 -171
3595 -171 108 -3 -95 135 -115 64 2 -43 46 -59 64 -47 51 0 -33 78 -80 89 -15 5 72 -78 93
3618 93 -65 48 24 -91 147 -142 72 18 -122 166 -133 44 43 -125 104 -92 24 -14 -45 37 -63 59 -46
3641 -46 14 6 -36 55 -74 92 -50 6 89 -125 132 -71 -10 110 -131 113 -34 -12 53 -69 91 -85 49 -11
3665 -11 -73 125 -121 50 37 -99 107 -52 -11 26 3 -49 13 31 -114 132 -86 -42 148 -188 108 20 -114 135
3689 135 -92 36 13 -21 31 -44 67 -78 62 19 -73 122 -85 24 37 -66 52 -53 20 -20 -2 3 -50 62
3713 62 -69 43 -10 -50 60 -95 77 -55 -50 103 -138 100 -5 -95 139 -103 19 46 -78 29 21 -8 -19 84
3737 84 -77 16 97 -150 121 1 -102 142 -83 -18 58 -55 -26 45 -13 -89 127 -101 -41 163 -202 99 39 -170
3761 -170 166 -80 -48 90 -75 12 28 -23 -27 60 -32 -24 72 -90 71 -2 -52 81 -67 56 -2 -23 60 -49 55
3786 55 -23 -9 21 -34 43 -65 49 -35 -47 93 -145 80 -1 -126 147 -108 -31 104 -116 24 63 -93 12 84
3810 84 -138 63 78 -180 193 -41 -120 216 -137 9 123 -126 59 46 -55 3 76 -76 16 109 -157 115 27
3833 27 -146 167 -99 -37 116 -115 38 37 -71 3 49 -79 15 52 -130 103 -31 -70 129 -143 60 27 -98
3856 -98 128 -72 20 55 -64 57 -8 0 15 28 -46 21 65 -139 116 -26 -109 167 -144 16 107 -144 72 33 -118
3881 -118 58 37 -137 90 30 -168 176 -68 -109 211 -189 52 109 -190 130 6 -99 71 18 -85 55 53
3903 53 -135 144 -27 -110 215 -160 31 124 -168 119 -6 -84 85 -23 -44 50 -20 -61 95 -83 -18 102 -159
3926 -159 112 -24 -106 157 -136 50 70 -114 95 -13 -35 37 26 -33 43 57 -128 132 -29 -80 194 -166 44
3949 44 120 -171 114 18 -119 122 7 -117 126 -24 -149 210 -136 -44 224 -258 109 71 -210 184 -70 -84
3971 -84 111 -65 -33 73 -12 -80 114 -57 -45 158 -161 72 62 -140 148 -37 -36 100 -49 -9 76 -24 -38 114
3995 114 -107 33 92 -190 175 -64 -92 213 -202 96 56 -178 158 -73 -58 107 -75 -25 79 -51 -54 131
4017 131 -100 -11 134 -170 103 53 -145 145 -18 -68 111 -7 -97 141 -20 -109 243 -155 -13 229 -276 182
4039 182 40 -218 256 -141 -49 151 -146 31 68 -88 12 73 -96 38 51 -128 113 -48 -45 113 -83 46
4061 46 26 -38 38 3 20 -23 69 -73 26 78 -149 182 -57 -66 217 -211 123 79 -202 209 -57 -95 184 -115 -42
4086 -42 153 -134 -9 161 -200 110 90 -236 198 -51 -114 183 -134 2 83 -64 -1 65 -34 -52 157 -112 -3
4109 -3 166 -225 154 47 -169 221 -99 -45 156 -115 34 110 -105 36 80 -134 96 14 -131 153 -131 -8
4131 -8 114 -166 116 -10 -87 118 -97 8 44 -63 0 28 -33 -32 96 -104 36 100 -168 147 -7 -128 184
4154 184 -106 -24 136 -102 11 123 -103 19 146 -187 100 85 -213 222 -67 -125 228 -150 -2 128 -144
4175 -144 25 83 -111 21 83 -135 83 45 -169 168 -72 -72 161 -136 52 62 -82 78 -6 -17 44 14 -23 46
4199 46 4 -39 84 -60 -1 72 -108 99 -15 -73 115 -82 -5 58 -79 -2 60 -80 -2 84 -148 86 47 -186
4223 -186 199 -97 -97 208 -186 38 128 -176 108 53 -118 100 37 -121 122 0 -127 164 -72 -50 143 -113
4245 -113 28 96 -83 35 46 -65 11 75 -104 66 41 -145 147 -57 -80 145 -145 52 62 -122 110 -46
4267 -46 -33 78 -63 8 41 -62 31 45 -71 62 5 -67 116 -63 -10 116 -111 72 35 -90 76 -3 -47 48
4291 48 17 -74 73 17 -109 153 -80 -67 159 -167 46 90 -171 107 18 -116 88 -9 -83 106 -14 -85 143
4314 143 -90 -34 146 -126 60 68 -106 111 1 -42 64 -11 -33 49 5 -57 87 -42 -19 85 -93 65 4 -64
4338 -64 95 -77 9 32 -64 53 -24 -19 19 -2 -19 24 17 -42 84 -49 -17 100 -101 69 41 -88 99 -7 -45 79
4364 79 -9 -28 82 -17 -58 120 -71 -15 140 -152 82 51 -137 136 -44 -45 93 -50 -20 54 -32 -31 69 -49 -18
4389 -18 95 -102 50 34 -75 80 -18 -2 46 -11 8 21 22 -39 53 -7 -11 81 -61 73 8 -46 102 -85 36 40 -76
4416 -76 75 -25 -2 48 -40 -4 25 -29 -34 55 -69 4 65 -107 74 -10 -79 97 -64 -2 54 -45 8 31 11 -40 75
4443 75 -39 -33 107 -102 78 43 -111 117 -37 -31 71 -39 3 45 -25 -28 62 -53 -11 51 -86 55 -16 -48 64
4468 64 -69 28 -7 -26 31 -62 40 -28 3 19 -35 51 -39 29 10 -35 74 -50 33 28 -44 67 -44 5 37 -31 8 31
4496 31 -11 -26 75 -69 11 52 -112 95 -39 -60 101 -89 29 6 -39 27 -20 28 -37 36 -4 -39 74 -76 25
4521 25 42 -60 70 -19 -6 37 1 2 24 5 -32 56 -33 -6 62 -85 70 -20 -22 66 -78 56 -26 -24 57 -76 48 -26
4549 -26 -23 42 -55 21 -13 -12 4 -15 25 -51 32 -7 -15 45 -25 19 7 11 1 8 13 -34 73 -44 4 77 -95 79 -9 -49 92
4580 92 -67 30 21 -44 21 -18 0 -22 19 -13 -31 46 -45 18 -2 -29 23 -24 6 -21 16 -10 -11 49 -58 58 7 -45 78
4609 78 -54 29 19 -40 58 -40 36 6 -14 47 -41 35 7 -9 15 -12 7 -13 17 -19 1 7 -46 46 -50 -3 24 -62 40 -26
4639 -26 -3 12 -33 35 -36 25 5 -33 60 -46 23 20 -52 53 -3 -6 26 0 1 23 21 -19 40 -18 -8 50 -47 32 -5 -21 42
4670 42 -30 15 -15 -14 19 -36 37 -41 10 16 -40 45 -32 -13 28 -30 35 3 -7 7 6 8 4 23 -10 32 9 -6 47 -12 37 -2 -11
4703 -11 25 -25 28 -12 -14 34 -36 7 -2 -19 23 -14 -14 -4 -2 4 -23 7 -29 -13 7 -15 4 -10 -3 12 0 -4 8 4 -18 15 10 -21 41
4738 41 -31 22 23 -24 34 -12 -3 22 -24 16 5 -1 8 -1 3 -25 26 -11 -23 24 -39 8 2 -22 13 -25 -14 -9 -13 -12 3 7 -1 24 -7 11
4774 11 18 -24 36 -3 -7 37 -25 25 -13 2 29 -13 15 -13 15 2 -12 19 -38 8 -2 -22 26 -31 7 -1 -20 12 -14 5 -1 -13
4806 -13 1 -1 -6 -19 25 -14 7 26 -28 37 -9 -7 29 -26 33 1 -16 39 -8 15 -3 8 6 -7 23 -26 15 -1 -33 29 -22 4
4838 4 7 -27 6 -17 -11 -15 7 -25 -4 20 -42 36 -17 -32 35 -42 22 -2 -26 28 -16 23 2 -3 16 -29 29 -7 4 14 -22 26 -7
4871 -7 9 16 -8 5 -3 12 -14 12 1 -19 24 -29 21 -9 -21 18 -37 21 -15 -18 38 -55 23 1 -30 50 -26 16 19 -11 17 11 14 1
4905 1 23 -19 3 25 -28 34 -13 -1 27 -10 29 -18 20 -6 -14 37 -51 28 3 -27 41 -46 8 11 -33 15 -20 -2 6 3 0 -9 13 -14
4939 -14 11 -7 5 22 2 19 -8 21 11 -17 41 -33 21 20 -37 48 -20 -7 12 -31 8 -6 13 -2 3 0 -17 24 -34 -12 9 -34
4971 -34 11 -14 -10 -11 -2 6 -26 21 -22 4 28 -32 42 -27 1 35 -19 27 4 16 10 -2 16 -13 9 -1 -4 22 -7 2 -2 11 -11 15
5005 15 21 -28 35 -15 -25 38 -40 14 -3 -26 22 -18 10 -7 18 0 -5 35 -35 25 11 -18 38 -14 6 16 0 6 10 6 -17 35 -18
5038 -18 -3 27 -43 32 -8 -24 32 -39 5 -6 -23 8 -24 4 -26 -5 11 -22 14 -20 4 1 -1 12 -6 8 -2 5 9 -7 27 3
5070 3 19 9 20 15 -2 40 -32 20 30 -51 44 -13 -32 60 -55 6 23 -40 26 -11 -24 14 -8 -26 11 -12 -23 39 -25 -13 31
5101 31 -27 -4 5 -11 9 10 -5 0 40 -32 21 26 -47 49 -18 1 48 -40 30 16 -29 32 -9 6 8 -25 3 -2 -5 2 6 -21 12 -4 -24
5136 -24 34 -18 -3 14 -12 10 -5 -14 -2 9 -13 -4 31 -30 21 22 -37 53 -24 -19 59 -45 37 32 -39 35 6 -27 40 -1 -19 39
5168 39 -31 -29 31 -33 5 20 -40 12 -4 -33 13 1 -22 8 7 -20 17 1 -29 39 -41 -7 42 -60 35 15 -25 46 -26 3 46
5199 46 -32 22 22 -33 25 3 -34 31 -12 -14 34 -45 5 11 -38 17 3 -38 14 -12 -27 27 -8 -34 18 -13 -32 40 -34 -10 43 -60
5231 -60 15 27 -49 53 -1 -37 58 -20 -12 44 -36 6 38 -29 23 29 -34 25 -6 -42 40 -26 -26 29 -41 -2 20 -31 1 -1 -31 9
5263 9 13 -32 16 -2 -41 53 -29 5 30 -50 38 4 -37 56 -10 -3 47 -19 1 40 -35 6 42 -48 36 36 -52 54 -21 -32 55 -52
5295 -52 -16 31 -49 -6 14 -44 14 26 -52 26 15 -60 53 -29 -26 54 -53 8 35 -54 24 23 -39 38 20 -31 43 -2 -35 57
5325 57 -36 -6 56 -58 32 5 -34 25 -17 -11 15 -13 -14 18 -25 -17 25 -58 5 22 -57 47 -21 -28 52 -44 -3 38 -36 20 33
5356 33 -27 12 34 -46 40 10 -45 78 -27 -18 66 -67 28 30 -51 42 15 -47 38 18 -56 44 -11 -48 61 -56 -5 41
5384 41 -67 19 19 -49 25 3 -29 19 8 -24 36 -8 -19 52 -44 16 30 -41 53 0 -18 56 -23 10 39 -23 7 26 -35 23
5414 23 29 -43 42 -7 -56 68 -38 -5 45 -58 23 18 -49 29 14 -34 24 -10 -56 61 -16 -34 67 -47 -2 63 -54 46
5442 46 34 -46 39 16 -24 57 12 -27 64 -11 -15 58 -46 23 35 -47 49 -19 -20 31 -26 -6 15 -27 -12 30 -25 -4 19 -50 29
5473 29 1 -31 33 -34 0 36 -33 21 27 -30 18 25 -42 40 14 -40 70 -27 -25 90 -59 21 47 -54 58 8 -47 36 2
5502 2 -38 40 -18 -47 53 -44 -14 52 -61 27 13 -57 19 -3 -32 31 15 -29 26 -4 -25 60 -22 1 55 -55 39 9 -37
5531 -37 49 -15 -6 38 -24 5 24 -21 16 16 -37 27 2 -26 56 -38 -8 33 -60 25 3 -38 21 -8 -32 27 2 -33 31 -13 -28
5562 -28 63 -50 -6 54 -54 30 38 -45 54 15 -14 55 10 -31 58 -12 -15 69 -47 13 34 -47 45 3 -46 44 -20 -14 27 -7
5592 -7 -7 27 -20 -5 33 -30 8 20 -46 41 -11 -15 38 -20 22 21 -4 10 10 -24 29 11 -23 43 -8 -12 61 -39 18 46 -48 37 -1
5625 -1 -35 42 -13 -17 26 -27 -23 19 -46 -8 28 -59 13 29 -54 30 11 -40 40 -12 -29 49 -17 -9 49 -22 3 48 -45 17 22 -42 47
5658 47 -15 -22 30 -20 8 43 -15 16 10 -14 19 17 -12 11 -1 -19 24 -19 -2 15 -24 12 11 -21 15 -8 -23 24 -14 -8 36 -15 3
5691 3 30 -20 19 32 -35 39 10 -33 50 -16 -17 51 -32 1 32 -15 9 27 -26 12 13 -39 30 0 -34 49 -15 -19 34 -32 3 12 -24
5724 -24 7 10 -19 22 16 -26 25 9 -16 35 -10 8 29 -14 23 19 -15 27 4 -3 21 -5 4 22 -5 13 17 -22 19 11 -20 30 -25 -17
5758 -17 26 -26 12 9 -9 0 4 -12 10 7 -17 21 2 -10 37 -23 0 34 -36 14 14 -12 22 24 -3 25 9 -10 29 8 -13 36 -4
5791 -4 3 33 -34 24 9 -19 25 -11 -5 13 -12 -9 3 -8 -10 12 -15 9 22 -17 26 2 3 19 0 14 10 -3 12 6 9 6 26 -6 7
5826 7 24 -26 24 -7 3 18 -19 17 4 -10 12 -5 3 8 8 -13 17 0 -6 31 -23 0 11 -30 20 0 -1 12 -3 7 0 9 0 11 16
5861 16 1 29 -6 -2 26 -14 31 8 -8 14 -4 10 7 0 -4 15 -3 -13 20 -24 -4 4 -31 16 -9 -7 10 -19 12 -12 1 -6 -9 1
5895 1 -3 12 -7 13 14 1 23 -2 1 18 -7 23 11 5 24 9 11 -1 19 -8 8 8 -15 24 -17 -1 12 -26 6 -9 -11 8 -9 -5 -10
5930 -10 1 -7 4 3 -6 22 -18 11 12 -10 18 4 8 13 -11 3 6 16 9 13 17 -3 24 -11 12 8 -17 13 -12 2 7 1 1 -11 -6 -10 4 2 -9
5969 -9 12 -11 19 5 -7 20 -12 1 5 -7 8 -6 3 8 12 6 13 14 -4 10 2 3 16 -7 16 1 -1 -3 8 12 -5 6 7 4 14 -16 -1 -4
6007 -4 -15 14 -17 -1 9 -6 1 -9 2 7 4 -7 0 15 -4 18 -6 6 21 1 14 2 5 26 8 15 9 -4 10 -6 10 0 11 -2
6041 -2 12 6 -14 8 0 -3 0 -12 -5 -3 2 -8 -4 9 -15 10 -15 4 16 -12 13 -1 -18 17 -2 5 16 3 1 9 -1 5 11 -8 4 9 0 28
6079 28 9 -2 14 -2 8 -6 6 -9 -14 -7 -10 1 3 -5 8 -11 7 4 -9 7 -18 0 5 -4 13 -4 0 4 -5 15 10 -3 -9 18 -1 11 8
6116 8 -4 8 -13 -6 17 -9 5 -5 -6 5 1 2 -11 -3 -6 -1 6 -10 -10 -13 -7 7 -11 -13 4 -4 -10 6 -4 3 12 6 7 14 0 17 0 0 26 -8 13
6157 13 8 -3 11 5 5 1 10 13 12 1 -14 6 5 4 6 -17 0 7 4 6 -7 -7 -3 -8 -1 3 -1 7 4 -6 10 11 -2 13 15 -16 11 5 9 8 -4 17 6
6200 6 -2 7 3 7 10 8 -1 -5 9 -6 8 -5 -7 8 -11 5 6 -18 7 -5 -7 2 6 -6 -1 -10 0 -8 -9 -1 7 -13 10 3 -1 16 5 6 -3 6 6 8 25 9
6244 9 12 8 -8 22 0 6 6 -13 7 -14 0 7 -16 6 -3 -15 -7 -9 -8 8 -2 -14 5 -11 -5 15 -9 26 5 12 21 9 19 -2 4 16 1
6281 1 6 -17 4 10 -4 19 -7 7 13 -13 7 -3 -1 -5 -5 -3 -6 1 -10 -6 -13 -14 2 -9 7 -6 -7 2 -11 6 -1 0 12 -7 11 -1 2 5 -7 15
6321 15 2 3 13 5 6 -10 12 2 9 16 -13 -4 -3 3 -2 -14 -1 -8 -3 -8 -9 6 -2 1 -6 -2 11 -14 10 -8 -5 4 -14 0 -4 -2 6 3 19 5 11 11 3
6364 3 6 -9 17 4 -5 17 -10 8 7 -5 8 0 8 -8 4 -10 -6 -2 -6 3 -3 -3 14 -3 11 -13 5 -2 -4 12 -12 -2 0 -2 1 -3 4 -8 2 4
6404 4 -2 14 3 5 13 -6 7 1 3 13 -4 7 12 7 -1 -2 -10 -7 -6 -12 -1 1 -13 -3 -17 -6 5 -14 1 -4 0 -4 19 5 2 17 -6 18 2 2
6444 2 18 -5 2 6 13 -5 15 4 6 9 -5 4 3 -16 4 8 -3 0 -9 3 2 -11 -4 -15 -18 -12 -7 -11 8 -3 -10 6 -16 1 -2 -16 16 -1 1 12
6484 12 -10 8 6 -1 10 21 3 9 7 -10 10 7 -13 14 -4 -10 9 -4 4 5 2 2 7 -5 4 0 -4 4 -7 -9 7 -11 2 14 -17 4 0 -7 -1 7
6524 7 -9 12 4 -8 9 6 -5 22 1 8 16 -4 13 8 1 11 -7 3 0 -12 -7 4 -4 5 5 -11 4 -4 -10 10 -13 -8 -4 -14 8 -2 -1 7 19
6563 19 1 8 8 -10 14 -8 -10 14 -3 -2 15 3 -1 18 -7 7 14 -10 6 -3 -10 6 -6 -20 9 -11 -1 8 -15 0 3 -5 1 -20 16 0
6599 0 -6 2 7 -5 9 11 -11 11 9 -2 25 1 12 17 -5 -3 11 -4 8 7 -14 7 4 -13 9 -2 -8 13 -21 0 13 -12 5 10 -16 17
6635 17 9 -15 13 -2 -7 10 3 -6 13 -13 2 9 -6 5 18 -6 19 6 8 26 12 8 25 12 3 20 -5 15 8 1 20 -3 -8 11 -8 3
6671 3 13 -28 -5 11 -4 9 -1 -7 8 1 -13 2 -5 -1 12 -15 8 17 -8 12 13 -3 18 0 0 22 -1 -3 12 -12 13 16 -17 24 8
6706 8 -16 28 2 -5 12 -8 -10 8 -18 -12 6 -22 1 3 -19 3 -10 -15 17 -8 1 7 -12 3 8 -5 13 8 0 4 2 -1 13 -2 -4 16 -12 1
6744 1 11 -4 17 13 -2 18 -2 -5 13 -7 2 3 -12 -7 6 -16 8 -5 -25 14 -4 -6 19 -12 -8 18 -7 -1 6 -9 27 18 -8 28 10 -3
6780 -3 18 5 5 21 -14 15 14 -4 14 13 3 11 3 -9 5 -9 -17 17 -4 -2 13 -10 11 8 -8 5 0 -14 12 -8 -5 7 -12 5 10 -5
6816 -5 16 12 -5 27 -3 -3 16 -1 19 20 -3 11 13 -5 12 1 -8 1 -2 -6 23 -15 -12 1 -15 3 9 -14 -7 -2 -14 6 5 -2 17 -4 0 12
6854 12 -3 3 12 -14 8 5 -8 15 -2 0 12 2 5 11 6 6 7 -13 12 9 0 16 10 -6 14 -12 -10 10 -2 -5 -7 -13 -1 -2 -7 9 -2 -2 16 0
6894 0 5 4 -13 14 6 0 16 10 -4 15 0 0 17 3 0 22 -11 11 6 -9 14 3 -11 -6 3 -9 13 -6 -4 13 -7 -6 0 -7 3 -6 -10 0 -10
6933 -10 -11 10 -11 -8 5 -3 1 0 -15 8 2 -7 11 2 2 9 0 7 5 -1 9 11 -6 5 2 -2 8 -8 -13 -2 -12 -1 8 -15 0 -7 -5 9 4 -17 9
6974 9 -8 -11 22 -15 -8 -3 -22 0 5 -2 10 4 1 10 2 -5 8 5 4 23 1 8 17 -8 15 0 -7 -1 -9 -9 -7 -6 -10 3 -8 -3 7 -18 3 -2 -17 12
7016 12 -7 -8 13 -12 7 -2 -8 17 9 0 14 4 1 19 8 0 22 3 8 1 -12 12 10 0 3 4 2 9 -1 -11 14 -2 -9 9 -7 2 14 -16
7054 -16 4 -7 1 10 -11 -6 18 -12 3 2 5 4 16 -3 6 7 3 11 3 5 1 11 5 8 -8 -4 1 0 2 3 -9 -4 11 -5 11 -10 -6 5 -8 4 -9
7095 -9 0 9 2 0 4 -1 -7 3 -14 8 9 -11 4 9 8 13 1 -5 24 9 16 11 12 2 15 -5 3 14 -11 7 8 -7 6 -3 -6 9 -16 -1 3 -11 -5
7136 -5 11 -1 5 6 -3 4 -4 4 9 4 -5 6 -7 13 1 5 7 14 -2 10 -4 12 15 -2 14 14 2 16 8 -12 4 -2 5 12 2 7 10 3 -5 3 -9 0 8
7179 8 -13 2 -4 -7 -2 -3 -13 11 8 7 15 2 5 20 1 15 7 7 24 16 11 2 13 4 6 -2 0 8 0 16 14 -1 1 5 -1 2 3 -6 -6 -5 -5 -1 -7 3 -3 -18 4
7226 4 0 2 -1 3 12 -2 11 7 10 6 7 7 11 14 4 6 8 -9 1 1 -5 3 3 -2 7 2 -7 -3 -9 -9 -5 4 1 2 -6 -9 -2 -12 -1 1 2 -7 5 1 7 7 -1 16 7 17 4
7277 4 7 5 11 2 10 9 3 9 9 3 -1 6 6 -6 -2 -4 -1 -12 1 3 -6 -8 3 0 -1 -7 -2 -8 3 2 -6 1 1 -6 9 4 14 15 9 8 9 -3 0 17 15 6 -1 2 20 14 15
7328 15 17 9 15 -7 7 9 0 11 -5 -1 1 -7 -3 -2 2 -1 -1 3 -5 3 -10 14 4 4 5 -2 4 17 7 2 4 3 15 11 12 9 7 10 14 -1 11 8 13 4 -1 8 7 7
7376 7 -3 -2 5 -4 6 -6 4 3 5 0 5 -6 1 0 -5 9 4 8 10 3 0 6 9 8 12 5 4 10 11 14 9 -4 14 6 6 8 -1 -3 6 -3 -3 8 2 8 5 -6 3 -9 2
7425 2 0 -1 1 0 -9 -4 7 5 2 9 -11 -1 9 1 11 -3 9 16 8 7 5 19 18 13 0 10 6 2 7 11 10 13 4 0 7 0 11 4 -4 8 9 0 6 6 -4 19 4
7472 4 5 11 -1 15 -3 -2 -2 -1 -6 8 10 12 7 7 1 -2 14 9 5 4 22 -9 5 12 -1 10 0 -2 6 2 8 -4 1 1 -8 -1 -9 -2 -15 -10 -1 -6 4 10 -2 17
7518 17 1 -5 10 0 0 10 7 5 15 -12 2 0 6 16 7 5 10 5 4 -1 6 4 5 -2 2 6 -7 -7 -5 -11 2 0 -1 -8 -4 1 -4 2 5 -2 4 -2 -4 3 -5 5 3 7 5
7567 5 1 3 0 10 5 18 5 2 12 7 -6 11 4 -2 -6 2 1 -1 10 0 7 6 12 1 -8 3 -4 -11 -7 -11 -10 8 12 -4 0 6 -1 9 5 -2 14 2 10 8 1 14
7613 14 5 14 7 12 10 15 7 2 12 10 5 20 -4 6 -3 6 10 5 1 1 1 -4 10 6 2 1 4 -9 9 0 2 -9 5 1 -2 10 6 12 16 10 9 10 13 10 5 11 2 1 14
7662 14 12 13 4 3 0 -1 -2 3 12 3 -3 -7 -4 11 1 7 -3 -8 3 -3 1 -4 -5 -1 7 8 8 11 13 4 10 6 7 9 3 -3 15 8 7 8 11 11 3 23 9 1 5 -10 3 -4 1
7713 1 0 6 1 -6 6 0 -1 -7 4 -2 -11 -7 -3 4 2 -9 -1 1 0 1 5 7 9 12 -4 11 11 10 14 10 3 7 -1 9 5 1 12 -2 -1 1 -5 -5 -1 3 2 -1 -4 -1 1 -12 1
7764 1 -6 6 -1 2 2 -1 2 -2 -6 2 10 10 6 6 16 10 16 20 16 8 7 8 2 7 15 5 5 7 5 1 6 -6 -1 -14 -8 -2 -7 -6 -5 -10 -7 -4 -6 4 -4 3 10 5 12 2 11 0 13
7817 13 6 12 11 5 17 12 10 7 1 6 9 -3 13 6 4 13 14 7 13 12 -5 7 4 -5 -11 -9 -1 -6 -13 -5 6 -6 9 2 2 4 6 0 12 -8 13 16 5 0 14 12 16
7864 16 6 7 7 8 -1 12 0 5 8 -2 14 4 -4 6 4 3 12 9 -4 5 4 -4 2 -9 -8 6 -8 -10 -9 -6 6 6 -2 10 -1 -1 11 2 4 10 -15 15 17
7907 17 6 16 11 12 18 -1 7 11 5 6 5 -1 13 0 -9 5 -2 -10 8 -1 -11 0 -10 2 1 9 4 14 7 9 -5 2 14 3 10 20 -3 1 17 -5 21
7948 21 8 -3 12 4 5 9 11 0 5 -1 5 1 0 -3 14 -2 0 14 -2 9 1 -3 8 -8 -6 3 0 4 0 3 15 7 -7 13 -2 -6 11 5 1 10 5 5 11 -5
7992 -5 20 11 3 16 4 11 11 0 0 1 -8 14 7 -2 6 -4 3 9 6 -4 5 -1 -3 -1 -6 11 3 -11 5 7 -6 20 -3 2 8 1 14 17 4 9 -2 9 16 14
8036 14 -4 11 -2 -5 6 2 -1 10 2 5 0 -6 11 -2 -3 -9 -6 -9 1 -1 7 16 -4 0 4 -6 3 5 2 8 5 1 11 4 0 22 3 9 12 4 16 7 4 14 0
8081 0 14 9 3 3 5 -4 3 4 -2 -3 -8 5 2 8 0 13 -2 1 10 -10 3 9 2 13 9 -2 17 5 -2 7 5 11 20 -2 10 8 2 3 7 -2 6 5 10 11 6 12 23 7
8129 7 12 10 -3 2 9 5 -3 1 -3 -2 -1 13 -1 -7 -1 7 5 2 3 4 26 8 11 15 12 4 4 1 6 6 4 10 10 -2 7 -3 0 15 7 16 12 3 2 10 -7 12 1 -10 8
8178 8 3 -6 11 -2 6 9 -8 7 5 1 16 10 -6
8191f
##END NTUPLES=NMR FID
##END=
