##TITLE=1H_AM_NV29+MetOH
 CDCl3
 8 sc, 
 25.11.2022
##JCAMPDX= 6.0         $$ Bruker NMR JCAMP-DX V2.0
##DATA TYPE= NMR FID
##DATA CLASS= NTUPLES
##ORIGIN= UXNMR, Bruker Analytische Messtechnik GmbH
##OWNER= root
$$ XWIN-NMR		Version 3.5
$$ Fri Nov 25 15:02:27 2022 Russian Standard Time (UT+4h)  she@DPX200
##.OBSERVE FREQUENCY= 200.13135
##.OBSERVE NUCLEUS= ^1H
##.DELAY= (6, 6)
##.ACQUISITION MODE= SIMULTANEOUS
##.ACQUISITION SCHEME= undefined
##.AVERAGES= 8
##.DIGITISER RES= 18
##SPECTROMETER/DATA SYSTEM= spect
##.PULSE SEQUENCE= zg30
##.SOLVENT NAME= CDCl3
##.SHIFT REFERENCE= (INTERNAL, CDCl3, 0, 15.7039)
##AUDIT TRAIL= $$ (NUMBER, WHEN, WHO, WHERE, WHAT)
$$ ##TITLE= Audit trail, XWIN-NMR		Version 3.5
$$ ##JCAMPDX= 5.01
$$ ##ORIGIN= Bruker BioSpin GmbH
$$ ##OWNER= she
$$ F:/spectra/data/she/nmr/H-F/1/audita.txt
$$ ##AUDIT TRAIL=  $$ (NUMBER, WHEN, WHO, WHERE, WHAT)
(   1,<2022-11-25 15:01:17.32 +0400>,<she>,<DPX200>,
      <created by zg, POWCHK disabled, PULCHK disabled
       configuration hash MD5:
       00 E9 B6 7A A2 85 ED C7 34 08 36 98 17 FE 4E 26
       data hash MD5: 16K
       5D BD 97 2C AA EF 65 BD E4 15 5D FF 15 D7 8B 2D>)
$$ ##END=
$$ 
$$ hash MD5
$$ D2 65 52 A6 94 A2 CF CD 4C 30 2C 1B B3 BD 9B FA
##$RELAX= 
##$RELAX= 
##$RELAX= 
##$RELAX= 
##$RELAX= 
##$RELAX= 
$$ Bruker specific parameters
$$ --------------------------
##$DU= <F:/spectra>
##$EXPNO= 1
##$NAME= <H-F>
##$PROCNO= 1
##$TYPE= <nmr>
##$USER= <she>
##$AMP= (0..31)
100 100 100 100 100 100 100 100 100 100 100 100 100 100 100 100 100 100 
100 100 100 100 100 100 100 100 100 100 100 100 100 100 
##$AQSEQ= 0
##$AQ_mod= 1
##$AUNM= <au_zg>
##$AUTOPOS= <>
##$BF1= 200.13
##$BF2= 200.13
##$BF3= 200.13
##$BF4= 200.13
##$BF5= 200.13
##$BF6= 200.13
##$BF7= 200.13
##$BF8= 200.13
##$BYTORDA= 1
##$CFDGTYP= 0
##$CFRGTYP= 5
##$CHEMSTR= <none>
##$CNST= (0..31)
1 1 145 1 1 1 1 1 1 1 1 1 1 1 1 1 1 1 1 1 1 1 1 1 1 1 1 1 1 1 1 1 
##$CPDPRG= <>
##$CPDPRG1= <>
##$CPDPRG2= <>
##$CPDPRG3= <>
##$CPDPRG4= <mlev>
##$CPDPRG5= <mlev>
##$CPDPRG6= <mlev>
##$CPDPRG7= <mlev>
##$CPDPRG8= <mlev>
##$CPDPRGB= <>
##$CPDPRGT= <>
##$D= (0..31)
0 1.2 0 0 0 0 0 0 0 0.06 0 0.03 0 0 0 0 0.0002 0 0 0 0 0 0 0 0 0 0 0 0 
0 0 0 
##$DATE= 1669374076
##$DBL= (0..7)
120 120 120 120 120 120 120 120 
##$DBP= (0..7)
150 150 150 150 150 150 150 150 
##$DBP07= 0
##$DBPNAM0= <>
##$DBPNAM1= <>
##$DBPNAM2= <>
##$DBPNAM3= <>
##$DBPNAM4= <>
##$DBPNAM5= <>
##$DBPNAM6= <>
##$DBPNAM7= <>
##$DBPOAL= (0..7)
0.5 0.5 0.5 0.5 0.5 0.5 0.5 0.5 
##$DBPOFFS= (0..7)
0 0 0 0 0 0 0 0 
##$DE= 6
##$DECBNUC= <off>
##$DECIM= 32
##$DECNUC= <off>
##$DECSTAT= 4
##$DIGMOD= 1
##$DIGTYP= 9
##$DL= (0..7)
0 120 120 120 120 120 120 120 
##$DP= (0..7)
150 150 150 150 150 150 150 150 
##$DP07= 0
##$DPNAME0= <>
##$DPNAME1= <>
##$DPNAME2= <>
##$DPNAME3= <>
##$DPNAME4= <>
##$DPNAME5= <>
##$DPNAME6= <>
##$DPNAME7= <>
##$DPOAL= (0..7)
0.5 0.5 0.5 0.5 0.5 0.5 0.5 0.5 
##$DPOFFS= (0..7)
0 0 0 0 0 0 0 0 
##$DQDMODE= 0
##$DR= 18
##$DS= 0
##$DSLIST= <SSSSSSSSSSSSSSS>
$$ [...]
##$SUBNAM2= <"">
##$SUBNAM3= <"">
##$SUBNAM4= <"">
##$SUBNAM5= <"">
##$SUBNAM6= <"">
##$SUBNAM7= <"">
##$SUBNAM8= <"">
##$SUBNAM9= <"">
##$SW= 18.05172834244
##$SWIBOX= (0..15)
0 0 2 0 0 0 0 0 0 0 0 0 0 0 0 0 
##$SW_h= 3612.71676300578
##$TD= 16384
##$TD0= 1
##$TE= 0
##$TE2= 300
##$TE3= 300
##$TEG= 300
##$TL= (0..7)
0 120 120 120 120 120 120 120 
##$TP= (0..7)
150 150 150 150 150 150 150 150 
##$TP07= 0
##$TPNAME0= <>
##$TPNAME1= <>
##$TPNAME2= <>
##$TPNAME3= <>
##$TPNAME4= <>
##$TPNAME5= <>
##$TPNAME6= <>
##$TPNAME7= <>
##$TPOAL= (0..7)
0.5 0.5 0.5 0.5 0.5 0.5 0.5 0.5 
##$TPOFFS= (0..7)
0 0 0 0 0 0 0 0 
##$TUNHIN= 0
##$TUNHOUT= 0
##$TUNXOUT= 0
##$USERA1= <user>
##$USERA2= <user>
##$USERA3= <user>
##$USERA4= <user>
##$USERA5= <user>
##$V9= 5
##$VALIST= <valist>
##$VCLIST= <CCCCCCCCCCCCCCC>
##$VD= 0
##$VDLIST= <DDDDDDDDDDDDDDD>
##$VPLIST= <PPPPPPPPPPPPPPP>
##$VTLIST= <TTTTTTTTTTTTTTT>
##$WBST= 1024
##$WBSW= 4
##$XGAIN= (0..3)
0 0 0 0 
##$XL= 0
##$YL= 0
##$YMAX_a= 520061
##$YMIN_a= -473963
##$ZGOPTNS= <>
##$ZL1= 120
##$ZL2= 120
##$ZL3= 120
##$ZL4= 120
##$ABSF1= 10
##$ABSF2= 0
##$ABSG= 5
##$ABSL= 3
##$ALPHA= 0
##$AQORDER= 0
##$ASSFAC= 0
##$ASSFACI= 0
##$ASSFACX= 0
##$ASSWID= 0
##$AUNMP= <proc_1d>
##$AZFE= 0.1
##$AZFW= 0.1
##$BCFW= 1
##$BC_mod= 2
##$BYTORDP= 1
##$COROFFS= 0
##$CY= 11.3945322036743
##$DATMOD= 1
##$DC= 2
##$DFILT= <>
##$DTYPP= 0
##$F1P= 2.36226072786647
##$F2P= -0.459571619588291
##$FCOR= 0.5
##$FTSIZE= 0
##$FT_mod= 4
##$GAMMA= 1
##$GB= 0.15
##$INTBC= 1
##$INTSCL= 1
##$ISEN= 128
##$LB= 0.24
##$LEV0= 0
##$LPBIN= 0
##$MAXI= 10000
##$MC2= 0
##$MEAN= 0
##$ME_mod= 0
##$MI= 1.114404
##$NCOEF= 0
##$NC_proc= 0
##$NLEV= 6
##$NOISF1= 3.799351
##$NOISF2= 2.8
##$NSP= 1
##$NTH_PI= 0
##$NZP= 0
##$OFFSET= 15.70392
##$PC= 1
##$PHC0= -18665.68
##$PHC1= 14.60072
##$PH_mod= 1
##$PKNL= yes
##$PPARMOD= 0
##$PSCAL= 0
##$PSIGN= 0
##$REVERSE= no
##$SF= 200.130013532006
##$SI= 16384
##$SIGF1= 3
##$SIGF2= 2
##$SINO= 400
##$SIOLD= 16384
##$SREGLST= <1H.CDCl3>
##$SSB= 0
##$STSI= 0
##$STSR= 0
##$SW_p= 3612.71676300578
##$SYMM= 0
##$S_DEV= 0
##$TDeff= 0
##$TDoff= 0
##$TI= <>
##$TILT= no
##$TM1= 0
##$TM2= 0
##$TOPLEV= 0
##$USERP1= <user>
##$USERP2= <user>
##$USERP3= <user>
##$USERP4= <user>
##$USERP5= <user>
##$WDW= 1
##$XDIM= 8192
##$YMAX_p= 0
##$YMIN_p= 0
$$ End of Bruker specific parameters
$$ ---------------------------------
##NTUPLES= NMR FID
##VAR_NAME=  TIME,          FID/REAL,        FID/IMAG
##SYMBOL=    X,             R,               I
##VAR_TYPE=  INDEPENDENT,   DEPENDENT,       DEPENDENT
##VAR_FORM=  AFFN,          ASDF,            ASDF
##VAR_DIM=   8192,          8192,            8192
##UNITS=     SECONDS,       ARBITRARY UNITS, ARBITRARY UNITS
##FACTOR=    0.0002768,     1,               1
##FIRST=     0,             0,               0
##LAST=      2.2672688,     0,               0
##MIN=       0,             -473963,         0
##MAX=       2.2672688,     520061,          0
$$ Real data points
##PAGE= N=1
##DATA TABLE= (X++(R..R)), XYDATA
$$ [...]
$$ plain form
2514 152 -1011 -785 599 1202 61 -1240 -812 763 1326 137 -1355 -994 765 1581 291 -1406 -1278
2531 -1278 610 1819 608 -1454 -1625 403 2012 930 -1443 -1889 142 2061 1272 -1238 -2118 -188
2547 -188 1950 1531 -906 -2197 -642 1733 1806 -510 -2182 -979 1508 1947 -206 -2012 -1185 1209
2563 1209 1963 129 -1787 -1298 875 1797 396 -1475 -1285 577 1622 515 -1222 -1236 438 1432 460
2580 460 -1060 -1072 327 1198 401 -947 -934 330 1040 273 -823 -753 361 928 184 -823 -674 409
2598 409 952 138 -898 -677 489 1004 133 -970 -707 598 1103 85 -1075 -761 665 1139 58
2615 58 -1138 -769 693 1282 122 -1214 -889 696 1359 189 -1291 -986 675 1444 250 -1345 -1112
2632 -1112 631 1569 352 -1352 -1283 531 1637 521 -1375 -1441 406 1722 750 -1269 -1622 222 1786
$$ packed form
2514A52j163K26J384O03j141j301M28J575N63j189j492L61J759Q16j290j697J28
2531a278J888J209j211k062j71K028J609j082k373m46K031J919p89k510q80J930
2547a88K138m19k437j291J555K375P3k316j672J203K487M39k153j806Q27K394
2563A209P54j834j916M89K173R22j401j871J90J862J045j107j737j4J674R94r72
2580D60j520j2J399Q71p97j348J3J264P10p67j096P0J114N67p44j007J49J083
2598D09N43q14j036K21J166N15q71j103K63J305N05j018j160L14J426M74j081
2615E8j196L69J462N89j160j336L25J585O63j170j480L05J661P69j194j595K33
2632a112J743R38j217j704O9J814J106j116j896o6J847J316r72k019l53J844J564
$$ plain form
2649 1786 967 -1178 -1779 -18 1815 1199 -976 -1877 -273 1713 1419 -735 -1874 -494 1542 1562 -495
2666 -495 -1822 -722 1321 1586 -207 -1687 -871 1065 1565 12 -1537 -1013 843 1415 97 -1302
2682 -1302 -932 604 1245 157 -1099 -808 494 1054 162 -903 -671 459 872 83 -767 -509 527
2699 527 817 -40 -812 -372 608 800 -191 -903 -322 771 809 -285 -1050 -349 934 928 -352 -1207 -444 1003
2719 1003 1104 -325 -1387 -603 1024 1274 -218 -1503 -750 1021 1478 -70 -1509 -930 944 1586 134
2736 134 -1454 -1117 788 1657 316 -1427 -1262 567 1673 527 -1320 -1334 426 1660 680 -1224 -1458
2753 -1458 250 1587 827 -1035 -1524 88 1534 923 -906 -1503 -48 1447 1006 -783 -1487 -192
2769 -192 1348 1033 -653 -1442 -272 1230 1039 -548 -1368 -349 1107 1062 -435 -1282 -397 1016 1044 -318
$$ packed form
2649A786q19k145o01J761J833o16k175r01J604J986k94k154j139J380K036K0k057
2666d95j327J100K043K65j793j480Q16J936N00j553j549N24J856N72j318j399
2682a302L70J536O41j088j256K91J302N60q92j065K32J130M13p89q50K58J036
2699E27K90q57p72M40R80J92r91p12N81J093L8j094p65P01J283oj280q55P63J447
2719A003J01j429j062P84J627K50j492j285P53J771M57j548j439N79J874O42j452
2736A34j588L37J905Q69j341j743J65J829J106j146j847j4J760J234r80j904k34
2753a458J708J337p60j862m89J612J446o11j829n97J455J495m41j789p04J295
2769a92J540l15j686p89J170J502j91j587q20J019J456m5j497q47Q85J413K8j362
$$ plain form
2787 -318 -1205 -417 929 993 -269 -1097 -368 842 897 -240 -1020 -341 772 826 -262 -949 -298 742 721
2806 721 -310 -935 -264 807 722 -387 -991 -207 880 742 -491 -1093 -182 1016 850 -568 -1207 -221
2824 -221 1106 992 -511 -1309 -287 1213 1112 -466 -1432 -446 1229 1302 -380 -1533 -674 1151 1456
2841 1456 -214 -1601 -853 988 1554 17 -1571 -1074 842 1620 224 -1450 -1223 640 1646 447
2857 447 -1325 -1318 435 1593 582 -1155 -1315 265 1460 705 -979 -1284 160 1296 736 -768 -1178
2874 -1178 74 1192 686 -672 -1098 10 1074 636 -649 -1005 27 1015 594 -655 -927 84 967
2891 967 511 -683 -925 122 982 457 -704 -927 107 1020 459 -753 -933 129 1045 537 -759 -995
2909 -995 140 1084 573 -733 -1067 103 1154 652 -719 -1133 54 1208 713 -734 -1177 21 1238
$$ packed form
2787c18q87P88J346O4j262q28P29J210N5j137p80O79J113N4j088o87O51J040k1
2806G21j031o25O71J071q5j109o04P84J087j38j233o02R11J198j66j418o39R86
2824b21J327j14j503p98J022J500j01j578r66R86J675P3j682j153Q59J825L05
2841A456j670j387P48J841N66j537j588M97J916P78j396j674K27J863J006j199
2857D47j772PJ753J158j011j737j60J580J195p55j684l05J444J136n60j504m10
2874a178J252J118n06j358m26J108J064m38j285l56J032R88m21j249k72J011Q83
2891I67m56j194k42J047Q60n25j161k23J034R13n61j212j80J062R16n08j296k36
2909i95J135R44n11j306l34J170J051n02j371m14J187J154m95j447m43J198J217
$$ plain form
2926 1238 759 -733 -1252 -55 1237 856 -690 -1346 -128 1239 943 -645 -1396 -241 1240 1011 -610
2943 -610 -1441 -357 1205 1146 -490 -1466 -503 1160 1293 -286 -1480 -660 1054 1411 -106 -1447 -818
2960 -818 952 1454 3 -1385 -933 778 1415 135 -1262 -947 566 1307 273 -1094 -999 450 1233
2977 1233 371 -972 -955 332 1109 331 -882 -860 297 993 269 -788 -732 336 907 208 -790 -639 406
2996 406 851 146 -797 -582 465 901 84 -880 -645 524 1018 88 -981 -660 580 1080 112 -1034
3014 -1034 -793 532 1154 207 -1054 -941 473 1286 344 -1093 -1081 415 1370 466 -1105 -1190 301 1371
3032 1371 575 -1033 -1232 204 1334 679 -894 -1241 70 1275 801 -761 -1271 -71 1230 900 -644
3049 -644 -1295 -202 1168 940 -543 -1262 -246 1106 955 -458 -1246 -377 1005 1000 -372 -1196 -434 903
$$ packed form
2926A238m79j492n19J197J292l81j546o56J218J367k96j588p51J155J481k29j621
2943f10q31J084J562n9j636r76R63J663J33j579j194Q20J714L57j517j341O29
2960h18J770N02j451j388M52J711O37j280j397L15J513P41j034j367R5J449P83
2977A233q62j343J7J287P77p78j213K2J157O96p24j057N6J068N71o99r98J51J045
2996D06M45p05r43K15J047M36q17r64K35J169M94r30j069L21J240N00r68j146
3014a034K41J325O22r47j261J13J414Q13r42j437J2J496R55r04j571q5J491J070
3032A371p96j608j99J436J130o55j573l47J311J205m74j562n10J200J301l30j544
3049f44o51J093J370k28j483p19J016J352j51j413p88Q69J382nj372q24P62J337
$$ plain form
3067 903 1005 -276 -1188 -493 854 992 -237 -1148 -517 772 989 -156 -1051 -527 686 961 -74 -967
3085 -967 -497 634 903 -57 -906 -484 625 870 -63 -914 -473 635 846 -127 -871 -397 623 798 -195
3104 -195 -890 -405 643 786 -204 -964 -420 682 860 -153 -1027 -511 734 979 -158 -1118 -558 760
3122 760 1103 -80 -1166 -671 757 1219 73 -1209 -826 674 1299 180 -1200 -967 593 1345 330
3139 330 -1123 -1051 413 1330 446 -992 -1142 265 1245 553 -899 -1124 118 1170 675 -743 -1142 -3
3157 -3 1107 702 -628 -1131 -97 984 732 -512 -1045 -168 947 739 -460 -984 -173 879 712 -429
3175 -429 -915 -140 807 642 -389 -859 -136 800 613 -411 -818 -107 788 600 -419 -847 -120 752 596
3194 596 -439 -889 -79 825 588 -461 -898 -103 816 608 -452 -903 -119 823 682 -434 -965 -147 890
$$ packed form
3067I03J02j281r12O95J347J38j229r11O31J289K17j145q95N24J213K75j035q93
3085i67M70J131K69r60q49M22J109K45r33q51M41J108K11r73p44M74J020J75r93
3104a95o95M85J048J43r90p60N44J102J78j013q74N16J245K45j137r60N60J318
3122G60L43j183j086M95J428M62j146j282L83J500O25j119j380K33J560P52j015
3139C30j453P2J464R17q84j438j50J407R80o92j452k25J242J052m95j418l99J139
3157cJ110m05j330n03J034J081k52j244n33Q77J115k08j199n24Q11J052j67j141
3175d29m86P75R47j65j031m70P23R36j87j024m07P11Q95j88j019m28P27Q72j56
3194E96j035m50Q10R04k37j049m37P95R19k08j060m51P84R42j41j116n31Q18J037
$$ plain form
3213 890 737 -421 -1008 -197 887 827 -363 -1067 -297 904 903 -329 -1120 -378 897 983 -264 -1148 -468
3232 -468 830 1043 -160 -1180 -600 790 1115 -105 -1158 -678 694 1100 13 -1102 -758 591 1146
3249 1146 167 -1037 -828 462 1144 282 -931 -864 359 1086 382 -793 -887 209 1039 431 -701 -867
3267 -867 149 965 472 -648 -823 79 832 411 -553 -759 67 748 371 -538 -680 83 710 296 -526
3286 -526 -622 148 702 247 -577 -574 204 743 253 -636 -629 265 797 238 -669 -691 266 866 276 -713 -726 262
3308 262 955 339 -728 -816 222 1009 459 -732 -921 148 1027 505 -680 -1016 24 1032 678 -610
3326 -610 -1088 -130 994 749 -522 -1125 -190 949 834 -440 -1134 -300 912 862 -344 -1063 -362 827
3344 827 942 -201 -1024 -442 746 933 -131 -973 -468 660 905 -58 -929 -524 562 867 6 -872
$$ packed form
3213H90j53j158n87Q11J084o0j190p04P70J201jj232p91P42J275Q6j247q84O80
3232d68J298K13j203j020N80J390L25j220j053M80J372M06j087j115L44J349N55
3249A146r79j204K09J290O82q62j213O7J223P27p04j175r4J096Q30o08j132j66
3267h67J016Q16m93j120j75R02P53m21r64k06Q26O81l77r09j42P63O27m14q22
3286e26r6P70N54m55q24LP78N39m90q89PQ94N32n59r07k2R57O00n90r89j3R88
3308B62O93o16j067q8J038P87n50j191j89J069Q79n22j185l36J040J008l54j288
3326f10m78R58J124k45j271o03R35J139j15j274o94Q34J212n0j206p19P01J189
3344H27J15j143q23N82J188J87j064q42N05J128K45r63q71M05J086L05q61q78
$$ plain form
3362 -872 -547 493 850 64 -818 -579 407 799 67 -772 -545 377 767 110 -702 -529 350 736 83 -653
3382 -653 -474 383 634 82 -585 -438 372 662 65 -620 -382 412 647 7 -645 -395 430 661 -35 -735
3402 -735 -407 493 713 -52 -788 -451 555 801 -33 -849 -519 533 872 44 -930 -660 483 971 136
3421 136 -938 -786 415 1086 298 -885 -903 304 1102 419 -857 -1004 175 1154 561 -737 -1075 70
3439 70 1100 671 -608 -1043 -70 1000 719 -514 -1021 -180 857 737 -400 -968 -251 779 725 -298
3457 -298 -903 -287 635 671 -228 -797 -298 554 637 -176 -752 -261 545 588 -173 -689 -205 576 602 -181 -660
3478 -660 -165 567 505 -223 -667 -137 613 536 -259 -665 -117 584 516 -289 -683 -158 626 522 -329 -761 -161
3499 -161 654 571 -323 -785 -187 663 617 -301 -817 -194 721 683 -280 -862 -246 713 757 -227 -951 -325 748
$$ packed form
3362h72L25J040L57p86q82K39R86L92p32q39K27R22L90o57q12J73Q79L86o53p36
3382f53J79Q57K51n52o67J47Q10K90n97o85K38P94K35o40o52K50Q25K31o96p00
3402g35L28R00K20p65p36L37J006K46q34q16L30J052L39q28r74K70J143M88q35
3421A36j074J52J201O71p88j183j8J207P98o83j276j47J179R79n93j298l38J145
3439G0J030m29j279m35R73J070k81j233n07Q41J037j20j137n68P17J030n4j023
3457b98o05O16R22L6q99n69M99Q52Q3q13n76M91Q06M3p61n16M84P81K6p83m79
3478f60M95P32o2p28m44N30P50p7p95m06N48P01o8q05l94N25P84j04q51m32O00
3499a61Q15q3q94m62N98Q50m6r18n16O23R15l8r63n82O16R59M4r84p24O26J073
$$ plain form
3520 748 839 -196 -961 -437 694 922 -108 -1002 -567 650 967 3 -986 -679 538 1034 128 -977
3538 -977 -783 454 1086 278 -914 -868 338 1040 368 -801 -885 222 1005 437 -719 -901 94 892 496
3557 496 -515 -815 -6 774 513 -435 -756 -34 663 506 -360 -645 -64 593 405 -317 -578 -46 563 349
3577 349 -325 -532 16 515 270 -381 -514 81 571 233 -482 -530 151 618 218 -512 -534 191 669 225 -538
3598 -538 -580 221 762 304 -593 -659 184 846 377 -607 -731 153 869 463 -582 -872 61 926 558 -553
3618 -553 -938 -84 893 664 -495 -970 -166 856 733 -387 -991 -261 808 799 -269 -978 -408 755 859
3637 859 -154 -981 -477 670 910 -49 -907 -534 580 912 51 -863 -573 504 898 99 -772 -567 377
3656 377 827 146 -690 -589 319 746 202 -611 -590 217 706 184 -558 -525 192 615 195 -506 -497 168 585
$$ packed form
3520G48R1j035p65N24J131K28j030q94M35J217L17r64r89L07J217M96r06j105
3538i77J94J237O32q08j192M6J206P02o72j169q4J107P83n68j156j82R95P98l96
3557D96j011l00Q09P80k61r48l21P22O97j57q66k85N81O57j88p22k61N32O09k14
3577C49o74k07N48M99k45o51j33N95M90l38p15m8O81M67m00p30k2P25M78m44p63
3598e38m2Q01N41m58q97o6Q43O62m69r84j24Q84P16m06j045k90R33Q65l68j111
3618e53l85Q54R77k29j159m75Q04J022j23j120o04P30J069rj068p09N70J163J04
3637H59j013q27N04J147K40r59q58L73J114L32q61r14K90J077L94p99q71K05R44
3656C77M50o81q36J01R08M27n44q13K1Q07M89n22p42L3P17M23m20p01RO65M17
$$ plain form
3677 585 166 -486 -456 197 552 139 -461 -410 252 536 103 -505 -366 299 557 55 -567 -370 363 613 28
3698 28 -635 -368 417 691 2 -699 -476 430 778 49 -785 -556 391 843 107 -788 -654 369 938 204
3718 204 -824 -785 309 987 362 -754 -870 188 1035 528 -670 -943 10 1017 640 -569 -1016 -104
3736 -104 973 747 -415 -1005 -225 861 796 -316 -982 -326 716 780 -215 -885 -406 614 743 -116 -809
3755 -809 -398 536 682 -82 -716 -370 447 632 -50 -638 -359 389 545 -41 -574 -312 341 525 -18 -524
3775 -524 -259 379 518 -85 -536 -229 432 506 -119 -562 -186 482 448 -205 -634 -197 489 498 -220 -668 -224
3796 -224 502 547 -240 -708 -249 589 603 -216 -780 -290 588 663 -201 -825 -330 619 751 -132 -852 -417 625
3817 625 826 -53 -896 -551 579 931 37 -905 -635 510 1002 172 -895 -735 422 1002 288 -831
$$ packed form
3677E85m19o52L0O53L55m13o00N1O62K84m33o08J39O65K58n02o22J97P33K50n85
3698B8o63K67P85K74o89p01K23R06L48p29q34K29R47M52p36q95J34J023N69p34
3718B04j028L9J094O78o25j116j16J058Q47n07j198k73R53J007l77j209m47R12
3736a04J077k26j162n90P80J086o5j112o66O56J042O4r95o70M79J020J29q59o93
3755h09M11R34J46p64o34L46Q17J85o82n88K79P48J56n86n33K62O53J84n43n06
3775e24K65O38J39o03m51L07O61P4o25m43L76O68l4o53m29M37O86Rp18m48M44
3796b24P26M5p87m68M59Q38J4q19n64M90Q78P5q64o24M95R49J32q83p20M35J042
3817F25K01q79q43L45J130L52q94r42K70J145M92q30j067J60J157N80p14j119
$$ plain form
3835 -831 -832 278 1000 400 -746 -920 142 950 522 -640 -937 29 874 582 -528 -931 -98 813 591
3854 591 -402 -825 -147 690 589 -306 -717 -193 593 545 -174 -614 -155 524 469 -148 -536 -119 442 358 -178
3875 -178 -459 -103 443 347 -237 -475 -58 458 310 -325 -504 35 543 255 -410 -550 77 622 299 -485
3895 -485 -617 86 696 365 -490 -710 27 746 445 -473 -767 -22 772 546 -427 -835 -102 808 647 -367
3915 -367 -918 -218 796 734 -307 -961 -333 727 801 -191 -985 -452 641 849 -74 -943 -543 587 908
3934 908 -2 -902 -609 493 946 108 -819 -639 393 923 249 -757 -717 302 862 317 -654 -724 223
3953 223 840 349 -572 -677 157 767 355 -474 -620 68 651 348 -401 -576 42 580 296 -367 -514 4
3973 4 523 261 -317 -453 54 486 203 -367 -409 111 479 159 -396 -401 153 546 169 -434 -388 264 617 130
$$ packed form
3835h31jJ110P22o00j146j74J062Q08m28j162k97R66Q45k92j110m03Q33R11k22
3854E91r93m23O78Q37j01q95m11N24P86m8p19m40M59O79n5o17l88M17N61q4n36
3875a78k81L56N46r6n84k38M17N16j48o35j79N39N08k88o65j40O27N45l23p84
3895d85j32P03O10l31q55k20P37P19l01r18k94P45P94k26r73m08P33R10j61j014
3915c67n51P00J014o2j041o54O28J060P4r92p94N33J093K08r23q69M00J130L21
3934I08r10r00K93J102M53q38r27J80J032N30o74j006M0J019N60n45r71p0R47
3953B23O17m91r21j05Q34O10m12q29j46O88N83l03p49j75O18N38k84o63j47N18
3973DN19k62n78j36N07M32k83n70m2N20L68l20n55nN54L93l77o03M6O52L53m87
$$ plain form
3995 130 -535 -446 281 708 127 -617 -531 315 741 196 -647 -626 276 784 276 -676 -753 188 839 384 -642
4016 -642 -824 90 914 513 -561 -911 -24 904 644 -499 -936 -146 854 706 -384 -976 -244 833
4034 833 798 -260 -941 -343 716 851 -161 -898 -443 599 829 -37 -821 -504 485 799 44 -765 -509
4053 -509 407 734 90 -703 -527 312 674 90 -569 -478 295 610 98 -494 -421 251 528 105 -438 -356 253
4074 253 515 59 -460 -314 238 483 37 -436 -265 305 474 -41 -473 -258 343 490 -56 -556 -268 392
4094 392 524 -82 -646 -300 435 606 -110 -698 -362 484 656 -71 -756 -415 476 726 -25 -774 -506 451
4114 451 805 79 -796 -614 413 905 209 -769 -695 318 919 323 -726 -780 204 954 444 -653 -858
4133 -858 68 920 524 -595 -884 -36 831 589 -473 -905 -144 765 637 -348 -842 -219 660 631 -239 -813
$$ packed form
3995A30o65Q9P27M27n81p44Q6Q46M26n45q43K1R02N08n08r52p7R41O51m55j026
4016f42j82R14Q24m01j074l50Q87R28k60j143m37P90J000j48j090n92P32J077
4034H33l5j058o81N98J059J35j012p37M55J042K30q66p84L17R89L14p55q09K56
4053e09R16L27o44p93J76Q39L62n84o59R1P73L15n12n92P3O72K77m23n43Q2O09
4074B53K62m56n19J46N52K45m46m73J71N70J69n15m32K15O01J47n46n00K88O60
4094C92J32o06n64L46P35J71p16n88L36Q46J72p27o85L41Q91K50p51p49K68R57
4114D51L54p26q75J82J027M92o96r78P4J013O01n96j049n4R84P50n10j097k05
4133h58R26Q52l96j119k89Q48Q67k42j062m32P61R09j28r85m94O23Q79k9q70n74
$$ plain form
4153 -813 -268 574 634 -184 -705 -281 508 593 -121 -613 -263 428 530 -103 -536 -226 387 445 -85 -474 -179
4174 -179 371 381 -131 -445 -103 403 341 -186 -481 -75 432 328 -254 -505 -52 501 366 -276 -568 -92 583
4195 583 387 -331 -649 -107 621 508 -337 -718 -138 654 585 -279 -764 -171 666 665 -255 -850 -246 661 728
4216 728 -174 -845 -375 613 816 -112 -845 -476 565 842 11 -864 -598 480 902 91 -850 -680 392
4235 392 898 183 -773 -729 282 905 309 -688 -757 144 861 373 -585 -764 101 809 470 -506 -743 31
4255 31 720 492 -405 -676 -53 657 452 -350 -632 -76 567 420 -299 -558 -86 491 335 -275 -514 -37
4275 -37 437 271 -275 -435 -9 399 220 -334 -421 44 451 182 -372 -411 138 552 213 -451 -456 170 621 228
4297 228 -498 -572 166 704 299 -559 -674 136 789 371 -557 -750 74 836 452 -554 -874 -24 823 568
$$ packed form
4153h13N45Q42O0q18n21M24P89Q5p14m92L50O91J02o33m33L10O13N8n30l89K95
4174a79N50J0n12l14L42N06o2n27k95M06N07j04n82k51M53N53j35o42k92M76O75
4195E83j96p18l18N42P28j13q45l81N80P92o9q64m85N93Q37jr20n95O04R07O7
4216G28r02o71M70R88K03r28p33L69J041K77q31q75K66J078M22q11r41J70J072
4235C92N06p15r56M4J011O23n96r97o9R01P17m88r58j79Q65P08l39r76k37P74
4255C1O89k28q97k71O23P10k05q02k82N56O43j47p19k59M72N77j56o10k39M77
4275c7M74j66n46j60M26M08j79n54q7M65M07k69n54l9N49M14l39o64nO26M51l93
4297B28p26p4P38N38m05q58j15Q10O53m18r28j93Q24P62l84j006l20Q50Q47k55
$$ plain form
4317 568 -500 -911 -129 807 670 -387 -942 -234 778 759 -281 -926 -348 703 818 -165 -941 -433 637
4336 637 858 -25 -873 -490 533 874 26 -788 -545 452 827 108 -729 -577 361 792 140 -662 -614 277
4356 277 721 181 -620 -570 246 666 186 -523 -565 175 634 183 -514 -496 177 575 165 -441 -433 175 535 139
4378 139 -436 -388 185 516 104 -435 -363 219 509 60 -445 -319 279 531 67 -494 -373 319 603 23 -593
4399 -593 -428 329 646 60 -675 -490 347 742 110 -757 -588 364 827 165 -740 -682 330 885 295 -710
4419 -710 -767 193 928 411 -642 -840 104 920 548 -559 -913 -30 888 635 -465 -940 -155 835 702
4438 702 -380 -933 -236 735 724 -250 -882 -335 658 733 -170 -818 -379 558 684 -110 -760 -394 459 691
4458 691 -31 -656 -384 406 589 -5 -593 -344 381 526 -20 -531 -305 332 501 -25 -521 -249 353 465
$$ packed form
4317E68j068m11P82R36j37j057n55P08J012j9j040o45N78J051J15r83p76N08J070
4336F37K21q83q48L83J023L41q48q14K43R97L75p19q37J52R38M31o52q02M8Q91
4356B77M44n40q01N0Q16M20m80p09m2P40M59m51o97J8O73L98m10o06QO08L60l96
4378A39n75M8N73L31m12n39P2N82K90m49n05J26N98K52m64n61J21O92K84n80o16
4399e93J65P57L17n86p35J85Q37L95o32q67J69R52M63o62r05N8J012N55n90j005
4419g10n7R60P35n17j053j98R44Q16l72j107l54Q83R18k53j100m75P85R90j33
4438G02j082n53O97R71j1r74o32N47R93P5r03o48M39R37J26p94o50L66Q53K32
4458F91p22o25K72P90J83n94n88K49P25J45n46n11K26O37J69n26m96K72O02J12
$$ plain form
4478 465 -79 -514 -221 362 431 -141 -541 -212 389 424 -181 -575 -204 414 470 -164 -616 -233 489 529 -164
4499 -164 -661 -254 524 609 -127 -748 -334 566 687 -104 -749 -376 532 784 -59 -826 -449 544 826 18
4519 18 -820 -540 466 868 100 -785 -643 383 877 197 -764 -713 304 929 332 -721 -793 166 877 410
4539 410 -634 -831 105 870 470 -547 -845 19 819 515 -451 -799 -68 751 557 -346 -727 -133 659
4558 659 538 -293 -713 -144 568 532 -207 -643 -161 525 463 -232 -578 -136 449 427 -220 -522 -130 436 333
4579 333 -247 -504 -94 457 316 -282 -477 3 498 278 -324 -500 35 588 337 -326 -585 17 639 405
4599 405 -398 -639 -15 663 476 -396 -726 -72 720 557 -381 -832 -158 722 632 -356 -864 -247 721 721 -259
4620 -259 -903 -322 660 761 -187 -902 -420 603 836 -86 -881 -527 519 860 25 -785 -560 479 871
$$ packed form
4478D65n44m35K93N83O9n72m00L29O01L5o05l94L71O18N6o34m52L83P22M0o93
4499a64m97M07P78Q5p36o21M14R00J21p91o45L73R08K52q43p67L77R93K82q08
4519A8q38K80J006M02p68q85J42J026M94o80r61N1J017O25n97j053p2R59P11m67
4539D10j044j97R36P65m00j017k98Q64Q00l04r66l48P31Q19j94r03l81N94P92
4558F59j21q31m20N69P12l6p39m36M82O86o2o95l46M42N85k2o47l02L92N66j03
4579C33n80k57M10N51j41n98j95M80M95k20o02j76N35N53k51o63k59O02O22k34
4599D05q03k41O24O78j87q72l30O54P92j63r38m51O74Q80r0r88n08O17R68%r80
4620b59o44N81R82J01r48p15M82J023K33r22p95L54J046L41q35q10K25J039L92
$$ plain form
4639 871 149 -781 -629 345 840 216 -684 -666 277 812 242 -614 -629 207 763 290 -566 -635 135 696 267
4660 267 -511 -624 98 654 283 -474 -560 87 621 266 -407 -523 77 556 263 -401 -471 101 538 245 -398
4681 -398 -459 133 543 236 -399 -414 159 542 186 -455 -435 171 561 169 -465 -490 190 623 179 -556 -546 197
4703 197 674 217 -567 -633 158 771 274 -577 -677 136 822 392 -565 -773 79 816 478 -537 -817 -9
4723 -9 850 555 -473 -855 -86 832 673 -342 -871 -238 729 701 -279 -860 -329 636 724 -117 -843 -421 565
4744 565 730 -79 -784 -435 476 678 10 -708 -444 388 677 68 -644 -433 348 612 70 -577 -439 308
4764 308 616 67 -532 -367 316 569 96 -502 -318 300 525 40 -465 -338 284 499 6 -495 -313 313
4784 313 518 -3 -526 -334 319 532 -39 -559 -369 343 542 -35 -590 -354 360 598 16 -600 -400 372
$$ packed form
4639H71p22r30J52R74M95o24r00J8R43N35n70q56j5Q36N56m73q56o9P70N61m29
4660B67p78j13P22N56l71p57q6O47N34l55o73j16O00M79k93o64p0N72M37k93o43
4681c98o1N92M10l07o35j5N73L83l56o41K0O06L90l92o34k5O80M33m44p35J0P43
4703A97M77m57p84o6P91O13m97q51j00Q13O86m30r57k08Q52P37l38j015k80Q08
4723iQ59k95j028l82P69R18j59j015n29O33R67k8r80n81N31R65Q8q41p26M22R86
4744E65J65q09p05L49R11K02o68p18K64Q32K89o09p12K11P81K64n42o47J38P47
4764C08L08n49n99J65O83K53m73n98J84O18K25m85n05J27O22K15m93n01J82O26
4784C13K05n21n23J92O53K13n71n20J90P12J99n77n55K36P14K38n82o16K00P72
$$ plain form
4804 372 635 42 -643 -472 349 738 132 -637 -528 335 788 166 -677 -589 285 801 255 -673 -684 235 787
4825 787 302 -608 -722 106 833 403 -553 -746 36 765 465 -476 -783 -51 725 534 -384 -802 -151 698
4845 698 602 -286 -733 -191 616 588 -193 -674 -214 536 579 -152 -644 -247 474 551 -110 -612 -244 438 504 -122
4867 -122 -530 -258 407 467 -112 -526 -247 363 417 -163 -511 -197 372 408 -160 -494 -162 400 401 -168 -572 -159
4889 -159 444 427 -173 -552 -156 469 447 -168 -568 -163 491 519 -142 -639 -239 499 559 -147 -660 -298 510
4910 510 604 -96 -707 -382 463 679 -68 -724 -441 432 737 26 -742 -503 390 736 75 -711 -544 336
4930 336 757 135 -646 -590 257 759 282 -570 -586 197 727 305 -500 -637 77 694 365 -441 -616 18 639
4951 639 378 -391 -617 8 616 384 -330 -577 -22 542 385 -288 -560 -66 504 365 -272 -499 -69 449
$$ packed form
4804C72K63n93o85J71Q21L89o06p69J09Q63M53o22q43Q8Q74N16n46r28j1R19N52
4825G87m85r10j14Q28P27m30r56j93P82P29l00r41l07P32P76j91r18m18O51Q49
4845F98r6q88m47N42Q07k8p81m81M60P50M3p31m92L97P21P7o61n02L68O82O6o26
4867a22m08K72O65O0n79m14K79O10N4n80l48L14N69L6n68l34L32N62Jn69m04M13
4889a59O03j7o00l79L96O25k2o15m00M05O54K8o61m97M00P38O0p06n13L62Q08
4910E10R4p00o11L25Q45K16p47o56K83Q73L05p11p68K39Q93L46o61p86J67Q80
4930C36M21o22p81N6Q47N02m77q52j6P83N30m22q05j37P14O17l29q06j75O34O21
4951F39k61p69k26O25O08k32p14k47N55N64j57o73k72M94N70j39o37k27M30N18
$$ plain form
4971 449 304 -246 -489 -61 450 283 -236 -449 8 459 299 -280 -473 13 500 282 -286 -455 3 490
4991 490 300 -285 -488 36 549 327 -348 -541 -11 545 359 -344 -584 -37 536 403 -339 -655 -132 591
5011 591 470 -283 -689 -177 587 561 -245 -699 -241 556 617 -170 -735 -283 544 665 -97 -716 -340 474 656
5032 656 -4 -668 -405 404 669 41 -622 -467 313 624 139 -551 -501 273 625 156 -498 -512 175 595 193
5053 193 -459 -504 152 576 181 -407 -442 127 543 166 -403 -412 125 516 159 -373 -382 165 463 179 -348 -382
5075 -382 144 472 165 -376 -378 134 468 167 -390 -400 112 477 160 -385 -405 153 501 176 -418 -441 117 514
5097 514 183 -437 -447 140 552 231 -439 -483 110 595 250 -406 -535 99 600 325 -380 -585 52 602 386
5118 386 -357 -596 -16 618 426 -304 -662 -100 580 515 -253 -697 -149 561 521 -198 -675 -222 523 542 -147
$$ packed form
4971D49j45n50k43M28N11j67n19k13M57M51j60n79j93M86M87k18n68j69M58M87
4991D90j90n85k03N24N13k22o75j93N30N56j86p03k40N47N73j33p42l16N23P23
5011E91j21p53m06N12P64k6q06m54M58P97O1p87n65M52Q27J21p62o19L76Q14J82
5032F56o60o64K63Q09K65o28o63J55P80L11m85o90N0P74L52m69o54j4O87M20m02
5053A93o52m5O56M24l95n88l5N69M16l77n69rN37L91l57n32rN47K98k84n27l4
5075c82N26L28l07n41kN12L34l01n57j0N12L65l17n45k0N58L48l25n94k3N58L97
5097E14l31o20j0N87M12l21o70m4N93M85l45o56j29O34N01k75p05k05O37N50k16
5118C86p43k39N80O34j92p30l58N62O80o5p68m44N48P10m0p19m77M53P45J9o89
$$ plain form
5139 -147 -660 -298 433 548 -68 -586 -317 398 562 -4 -538 -354 305 552 37 -481 -330 281 508 71
5159 71 -424 -298 256 470 56 -400 -284 235 423 47 -414 -241 233 377 8 -404 -260 270 407 -27
5179 -27 -402 -239 270 411 -38 -453 -280 284 467 -20 -464 -276 289 475 24 -477 -294 302 531 59
5199 59 -500 -369 282 571 76 -507 -405 260 592 158 -508 -472 212 590 191 -479 -525 159 615 234 -468
5220 -468 -555 112 600 241 -418 -551 30 590 324 -392 -559 4 571 336 -346 -571 -50 560 411 -279
5240 -279 -552 -68 533 417 -242 -529 -120 444 427 -176 -512 -157 412 426 -167 -493 -203 366 403 -99 -478
5261 -478 -207 341 363 -98 -432 -185 323 362 -97 -418 -195 308 321 -106 -372 -116 309 343 -125 -415 -94
5282 -94 345 343 -153 -382 -81 365 373 -145 -430 -135 394 367 -160 -492 -164 411 432 -169 -519 -210 406 484 -120
$$ packed form
5139a47n13L62P31J15o16n18K69P15J64n66n34J84O59K47n15n18J51O11K27m37
5159G1m95J26N54K14m14m56J16N19J88l76m61J73M74J44l69m12J44N30J37m34
5179b7l75J63N09J41m49m15J73N64J83m87m44J88N65J86m51n01J83N96K29m72
5199E9n59J31O51K89m95n83J02O65L32m34o66L6O84L78l99o70m6O84M56l81p02
5220d68q7O67M88l59o59j33N81N60k66p16j67N63N67k35o82k25N21O10j49o90
5240b79k73M84O01j16o59k87M09N64j7o03l36L55N69J4n93l26K90N69L7n02l79
5261d78K71N48K2m61l34K47N08L9m59l21K23N03J3m27k66K56M25L4m68k90L21
5282i4M39km96k29L01M46Qn18k85K95N29k7n27l32L28N75K1o01l50L09O16P8o04
$$ plain form
5305 -120 -556 -294 380 533 -49 -556 -334 370 565 -14 -571 -379 296 589 75 -517 -429 257 601 148
5325 148 -477 -446 202 586 183 -436 -477 163 568 230 -399 -466 93 519 265 -334 -468 39 464 258 -310
5346 -310 -443 -3 423 271 -269 -454 -41 410 256 -248 -427 -17 396 242 -230 -379 -4 359 254 -195
5366 -195 -355 -24 359 254 -204 -372 -2 387 227 -207 -378 -8 396 209 -218 -366 12 387 252 -250
5386 -250 -424 -7 428 253 -269 -439 -35 419 288 -276 -455 -53 432 318 -252 -477 -64 467 376 -189
5406 -189 -515 -134 446 408 -162 -534 -155 451 460 -128 -548 -225 382 482 -71 -529 -264 374 500 -35 -554
5427 -554 -300 299 527 -1 -520 -364 260 510 77 -438 -363 200 512 109 -443 -393 164 493 141 -376 -371
5448 -371 133 454 184 -334 -361 98 419 170 -269 -335 75 359 162 -257 -302 105 349 123 -264 -267 69 354
$$ packed form
5305a20m36K62O74J53n82n07K22P04J95n79n57J92O75K93n14n92Q8O86L44m53
5325A48o25L1O48L84m03o19m1O40M05l38o29o7N59M26k54n99j34N07M25k06n68
5346c10j33M40M26j52n40j85M13M51j54n04j79M10M13j54m72j49L75L63j05m49
5366a95j60L31L83j05m58j68L70L89j60m34j71L70M04j87m27j48L78L75j35n02
5386b50j74M17M35j75n22j70M04M54j31n64j79M02M85j14n70k25M13N31r1n65
5406a89l26L81N80l8n70l72L79O06Rn88m20L23O07J00n53m58K65O38J26n35n19
5427e54K54N99K28n28n19J56O24K50m33n15P5N63L12m03n52N0N57L29l52n17N
5448c71N04L21k70n18k7M59L21k49m39o6M10K84j97m19m5M07K44k26l87lL36K85
$$ plain form
5470 354 91 -265 -248 127 324 94 -314 -305 155 400 83 -367 -310 155 397 93 -355 -312 156 421 117 -413
5492 -413 -367 169 487 173 -379 -421 140 501 208 -375 -466 74 533 259 -332 -494 41 519 329 -297 -523
5513 -523 -21 493 334 -251 -538 -105 486 367 -207 -529 -158 450 386 -158 -534 -165 378 420 -98 -505 -219
5534 -219 369 440 -74 -467 -235 333 446 -44 -441 -230 281 423 16 -396 -205 267 394 13 -363 -222
5554 -222 228 349 51 -364 -233 176 325 -12 -329 -237 156 314 7 -328 -198 179 287 -12 -354 -195
5574 -195 234 289 -47 -326 -168 263 351 -13 -344 -167 287 361 -36 -397 -191 279 385 -18 -424 -237 290
5595 290 425 -11 -457 -296 255 456 22 -461 -317 236 526 104 -461 -426 185 530 147 -453 -455 139 529
5616 529 210 -367 -468 37 500 243 -318 -456 12 490 313 -244 -467 -49 462 373 -191 -456 -78 430
$$ packed form
5470C54k63l56J7L75J97k30m08RM60K45l17m50N7M65K42l04m48M3M68K65l04n30
5492d13M6N36L18l14n52m2N61L61k93n83r1N40M59k74n91j62N35M78j90o26k26
5513e23N02N14j59n85k87M33N91j19n74l22L71O08o4n44l76L69N43M2n18m07K86
5534b19N88P1n14l93K32N68J13m90l97K11N11J42m07m12J91M72J27l81l76J41
5554b22M50J21k98m15J31M09J49l37l17R2L93J58l07l35J30L77J08k99l42J59
5574a95M29N5l36k79J58M31Q8l64l31J77M54P4l97l61K06M70J06m03m06J87N27
5595B90J35m36m46J61N51K01m34m83J44N53K90m22n65L5O11L45l83o00kN94L90
5616E29l19n77j01N05M63k57n61j38M68M78j77n57k23M18N11q9n64k65L78N08
$$ plain form
5636 430 341 -178 -432 -78 377 336 -158 -403 -117 337 317 -98 -377 -125 302 299 -88 -351 -116 261 255 -102
5658 -102 -344 -106 251 258 -81 -299 -106 269 253 -96 -285 -58 292 247 -125 -294 -73 280 239 -129 -330 -46
5680 -46 319 252 -169 -354 -59 350 290 -202 -379 -120 333 316 -172 -453 -146 334 355 -153 -469 -159 349 381
5702 381 -111 -485 -232 332 455 -38 -490 -255 318 476 7 -468 -317 264 501 69 -461 -344 232 529
5722 529 154 -407 -414 130 499 181 -363 -416 77 475 204 -341 -415 64 435 214 -278 -418 1 389 220
5743 220 -254 -421 -12 371 226 -203 -330 -13 304 220 -170 -317 -16 309 191 -144 -277 14 287 155
5763 155 -155 -265 16 290 148 -183 -253 30 317 160 -189 -283 53 317 144 -254 -330 29 343 170 -265
5784 -265 -341 36 376 182 -293 -380 22 426 197 -271 -402 4 442 290 -253 -440 -8 429 304 -204 -448
$$ packed form
5636D30q9n19k54L54M55m1m94k45K86M54k0m15k79K52M27ll87k63K35L77ol57
5658a02k42K38L57Pl39k18J93L75j6l49j89K27L50m5l72j69K21L53m1l68k01K84
5680d6L65o7m21j85K95M09o0m92j77K59M53j7m88k81L07M80K1n08l16L10N08L2
5702C81m92l74K53N64J23m93m52K35N73J58m69m75J51N81K37m32n30J17N76K97
5722E29l75n61pN44L69l18n44n3M93L98k71n45p4M79L71k21m92j40M19L88j69
5743B20m74j67M09L83j45m29j27L17L17q4l90j47L01L25j18l35j33K91K73j32
5763A55l10j10K81K74j42l31p0K83K87j57l49r4L36K64j73l98p6L59L14j73m35
5784b65p6L77L40j94m75q7M02M04k29m68j31M06M38j52n43j87M32M37j25n08k44
$$ plain form
5805 -448 -90 448 374 -193 -456 -125 436 388 -141 -488 -177 359 430 -102 -504 -242 327 439 -31 -467 -303
5826 -303 277 422 15 -450 -327 208 436 57 -386 -302 200 430 87 -350 -287 152 410 111 -308 -298 132
5847 132 346 139 -294 -245 112 310 106 -246 -246 97 313 84 -235 -240 102 272 52 -257 -191 107 265 38
5869 38 -248 -194 136 281 -7 -286 -206 170 296 8 -321 -219 204 333 19 -328 -235 214 364 40 -374
5890 -374 -272 220 459 96 -386 -307 185 459 113 -390 -373 136 466 168 -374 -443 78 503 219 -347 -464
5911 -464 26 460 301 -305 -495 -43 457 327 -221 -501 -67 458 380 -179 -468 -120 357 394 -108 -441 -171
5932 -171 344 376 -79 -398 -164 288 344 -34 -359 -160 243 349 -66 -344 -194 244 298 -49 -321 -183 202
5953 202 271 -45 -306 -180 222 275 -51 -284 -133 205 259 -75 -297 -83 195 251 -66 -299 -69 234 263 -58
$$ packed form
5805d48L58N38p4n67k63L31N61m8n29l47L11N36P1n32m02K62N69J12m70m36J64
5826c03N80J45m07m65J23N35K28l79m43Q4N02K30l43m37O3M39K58k99m19J0M30
5847A32K14k07m33M9L57J98k04l52%L43K16k29l19nL42J70k20l09O6K98J58k27
5869C8k86N4L30J45k88k79Q0L76J26k88l29J02M23J29l14l47R3M49J50l24m14
5890c74J02M92K39l63m82P9M92K74l46n03J7N09L30k98n42o9N21M25k84n66j17
5911d64M90M34j59o06j90M52N00j30n48k80M34N25p8n59k89L48M77L7n02l33K70
5932a71N15L2m55l19K34M52N6l78l25J99M03J06m15k78J50M38N4l47k72J38L85
5953B02O9l16k61J26M02N3l26k33J51L38N4l34k22K14K78N6l17k33K30L03K9l21
$$ plain form
5975 -58 -302 -98 266 278 -86 -366 -111 273 283 -94 -387 -139 329 326 -96 -437 -163 311 360 -102 -431 -204
5997 -204 302 405 -55 -454 -257 301 454 -17 -470 -325 264 506 60 -448 -342 217 541 157 -419 -404
6017 -404 160 502 167 -386 -419 96 497 261 -323 -427 38 471 243 -273 -458 -42 393 272 -227 -449
6037 -449 -51 351 251 -189 -400 -72 293 230 -166 -317 -70 280 220 -162 -298 -28 274 208 -128 -264 0
6058 0 299 208 -154 -250 21 284 158 -167 -264 32 290 168 -188 -285 21 329 173 -218 -296 3 344 159
6080 159 -225 -368 8 376 208 -257 -394 14 415 253 -232 -406 -15 432 285 -220 -468 -46 384 338
6100 338 -200 -463 -93 440 366 -174 -491 -154 403 422 -111 -465 -182 337 465 -66 -497 -280 307 449 -15
6121 -15 -469 -304 248 444 39 -463 -343 195 453 71 -408 -343 162 433 107 -357 -338 109 421 122 -321
$$ packed form
5975e8k44K04L64J2l64k80K55L84J0l77k93K48M68lm22l41K74M74M9m62l29K27
5997b04N06J03m60l99J97N58J53m71m53J45N89K42m46n08J06N59L24l84n76J5
6017d04N64L42l35n53l3N15M01k36n84j04M65M33k28n16j85M16M35j21m99k22
6037d49L98M02j00m40k11L28L65o3l96j51K47L50o0l82j36K70L02o6l36j36K64
6058@K99r1l62r6K71K63j26l25r7K96K58j22l56r7L06L08j56l91p8K99L41j85
6080A59l84j43L76L68j68m65j37M08M01j62m85j74L91M47j47n05k48M22M30m6
6100C38n38k63L70N33p4n40l17L37N57J9n33l54K83N19J28n31m31K17N87J42m64
6121a5m54J65N52J96m05n02J20N38K58l82m79O5N05K71l26m64J9M47L12k99m43
$$ plain form
6142 -321 -293 118 355 128 -248 -303 95 330 112 -250 -249 76 288 111 -253 -210 87 279 60 -261 -235 116
6164 116 273 36 -293 -202 122 291 12 -299 -218 149 320 8 -338 -236 159 348 39 -341 -272 223 399
6185 399 70 -361 -299 177 473 111 -357 -360 169 495 141 -377 -397 111 507 215 -362 -463 76 500 233
6206 233 -338 -482 3 490 290 -289 -515 -21 468 334 -242 -488 -98 430 363 -168 -504 -153 381 397 -120
6227 -120 -440 -171 317 404 -62 -425 -174 315 377 -37 -405 -179 265 335 -32 -397 -174 253 334 -29 -330
6248 -330 -141 237 316 -46 -326 -154 201 258 -54 -318 -159 202 262 -78 -321 -128 253 247 -95 -356 -95 280
6270 280 270 -94 -324 -111 315 311 -123 -398 -130 311 354 -96 -425 -137 343 368 -115 -423 -197 300 398 -86
6292 -86 -494 -244 291 427 -56 -493 -281 295 464 13 -483 -323 277 527 79 -488 -396 242 566 132 -449
$$ packed form
6142c21K8M11K37k27l76n5L98K35k18l62JL25K12j77l64M3K97J92k19l21K6L51
6164A16J57k37l29R1L24J69k79l11Q1L67J71l12l46J02L95J89l09l80O9M95J76
6185C99l29m31O2M76K96l62m68lN29L26l54n18k0N08L96k92n77j01N39M24k67
6206B33n71j44M85M87k00n79k26M94M89j34n76k46L90N28o7n31l36L51N34J6n17
6227a20l20K69M88Q7m66l63K51M89O2m14l68K26M44P0l67l65K23M27Q1l63l01
6248c30J89L78P9l62k80J72L55N7l12k64J59L61O0l40k43J93L81ol42k61K61L75
6270B80j0l64k30K13M26mm34k75K68M41M3m50l29K88M80K5m83l08K26M97R8m84
6292h6m08K50N35J36m83m37K12N76J69m51m96J60O00K50m48n67R2O38L24m34n81
$$ plain form
6313 -449 -425 161 539 170 -401 -462 127 539 245 -354 -421 48 484 299 -322 -468 -29 461 284 -256 -425
6334 -425 -41 390 268 -225 -409 -87 362 251 -210 -366 -52 322 263 -197 -331 -28 329 186 -188 -316
6354 -316 -11 307 174 -183 -304 16 332 192 -223 -332 36 320 184 -251 -334 63 345 183 -271 -362 55
6375 55 388 215 -268 -389 32 384 243 -300 -432 -12 443 267 -290 -484 -56 472 319 -229 -521 -99
6395 -99 452 372 -200 -542 -126 450 429 -182 -546 -171 423 469 -115 -524 -201 375 474 -71 -525 -249 369 473
6417 473 -14 -518 -313 287 493 34 -490 -329 253 476 57 -413 -358 176 463 82 -394 -357 145 427 122
6438 122 -341 -325 133 405 129 -295 -316 139 393 120 -254 -259 113 342 109 -283 -261 125 331 64 -307 -243
6460 -243 169 307 51 -316 -220 160 324 15 -319 -243 201 348 15 -382 -272 189 389 31 -405 -282 201
$$ packed form
6313d49K4N86L78l69n71o1N89M12k94n99o7M69M36j85o21j46M39M90j77n40j69
6334d25L84M31j22m93j84L22M49j11m61j56L14L74n9m60j34L03L57j43l74j28
6354c16L05L18j33l57j21L20L16j40m15j09L68K84j36m35q3L97K82j62m54r1M17
6375E5L33j73m83j21M21L52j41n43j32M20M55j76n57j94M28N28j53n48k92M22
6395i9N51q0n72l42M16N76k1o11l64L75N94M6n84m09L23N76R9n45m54K76O18J04
6417D73m87n04K05O00K06m59n24J61N82K23m19m70N5N34K87l81m76L7N02K82l05
6438A22m63J6M58K72k76m24k1M55K54k73l74nL72K29k33l92K2L86K06k67l71O4
6460b43M12J38k56l67R6L80J64l09l34P6M44J47l33l97J10M61K00l58m36J23M83
$$ plain form
6481 201 433 73 -394 -356 189 500 135 -429 -370 188 527 158 -408 -406 146 537 189 -377 -484 71 539
6502 539 263 -368 -510 18 524 304 -335 -528 -33 488 340 -273 -535 -84 457 372 -241 -526 -129 439
6522 439 399 -171 -480 -151 405 387 -140 -445 -151 355 382 -83 -428 -196 327 364 -43 -373 -187 286 355 -50
6544 -50 -361 -164 281 339 -59 -357 -173 227 282 -75 -343 -132 240 268 -111 -355 -104 239 283 -127 -351 -102
6566 -102 300 273 -123 -365 -93 317 308 -105 -415 -84 346 365 -119 -438 -145 366 376 -131 -455 -180 357 431
6588 431 -85 -511 -250 339 471 -63 -538 -286 309 502 -21 -516 -359 265 546 48 -522 -377 252 554
6608 554 104 -469 -415 187 531 151 -434 -447 175 535 211 -399 -427 111 511 255 -324 -446 49 448 275
6629 275 -277 -434 -9 435 266 -268 -418 -30 370 243 -224 -402 -38 333 211 -244 -367 -32 316 223
$$ packed form
6481B01K32l60m67L8N45L11l65n64N9N58L39l69n66KN52L91l48n66j07N55M68
6502E39k76o31j42N28N06k20o39j93M95N21j48o13k62M51N41q5o13k85L97N68
6522D39m0n70l09L29N56j8n27l05K94N06K7m65l45K32N23L7m07l30J86M73O9m05
6544e0l11J97M45N8l98k98J84M00N5l57k68K11L72K8l79k44K51L43M4m10k24K49
6566a02M02k7l96k42K72M10rm13l10L31M30J9m84l19K93N11J0n07l24K75N37P4
6588D31n16m26K61N89J32n34m75K52N95J93n23m95J57O24K81m98n70J45O29L02
6608E54m50n73N4O02L44l80n85j3O22L60l24o10k8N38M00k56n79j22M95L99j73
6629B75n52j57M25M44j69n34j50L88M00j27m67j78L64L71j22m55j23L35L48r3
$$ plain form
6649 223 -194 -341 -5 339 177 -198 -339 50 360 183 -223 -280 43 356 163 -246 -287 66 362 199 -249
6670 -249 -358 56 386 197 -282 -363 39 398 206 -299 -401 -1 443 226 -298 -471 -23 452 291 -286
6690 -286 -501 -74 460 339 -247 -531 -107 461 423 -206 -537 -149 447 427 -157 -524 -177 445 456 -66 -529
6711 -529 -237 390 462 -55 -496 -284 342 493 -34 -499 -294 253 485 22 -437 -333 211 467 37 -415
6731 -415 -348 188 418 86 -359 -341 153 386 93 -324 -269 136 389 85 -283 -281 133 324 100 -272 -233 165
6753 165 351 43 -292 -203 145 316 24 -305 -235 222 344 27 -343 -243 174 360 0 -369 -251 223 359
6774 359 18 -397 -302 204 416 50 -409 -311 223 463 64 -407 -363 202 514 150 -413 -400 152 507 179
6795 179 -398 -457 111 501 226 -370 -464 24 510 280 -324 -504 -8 490 302 -290 -489 -61 459 328 -280
$$ packed form
6649B23m17j47L36L44j62l75j41L89L10j77m06n7L23L13j93m09m1L53K96j63m48
6670b49j09M14L30j89m79q1M02L59j92n05j02M00M44k17n24j73M48M75j61n77
6690b86k15M27N34j21n86k84M24N68l8o29l31L88N96k0n84l67L47O22J1n22m63
6711e29K92O27P2n17m41K12O26J51n27m65K05N47K32m63m59J04N44K56m30m52
6731d15O7N36K30l32m45J8M94K33k93m17N5M05K53l04l68KM14J91k24l72L9L98
6753A65J86l08l35Q9L48J71k92l29P0M57J22l17l70J00M17J86l60l69J18M74J36
6774C59l41m15R5N06K12l66m59R8N34K40l99m71M4N65L12l64n63J3N52L55l28
6795A79n77n9N68L90k75n96r4M88M86k30o04j80M96M98j88n92j99M28N20j31o08
$$ plain form
6816 -280 -486 -89 426 338 -197 -496 -100 373 372 -150 -450 -130 366 356 -116 -405 -137 302 349 -54 -374 -132
6838 -132 296 336 -79 -373 -127 271 320 -100 -363 -130 236 287 -92 -329 -140 260 258 -102 -321 -115 240 250
6860 250 -123 -348 -111 269 254 -138 -363 -78 307 277 -125 -357 -76 353 318 -125 -405 -99 376 334 -144
6881 -144 -439 -130 360 402 -119 -460 -199 347 426 -84 -470 -261 336 464 -10 -472 -269 300 483 17 -485
6902 -485 -326 256 497 69 -474 -394 224 492 103 -410 -388 153 492 182 -354 -388 119 452 220 -301 -394
6923 -394 97 433 190 -266 -357 53 401 204 -267 -346 14 345 188 -220 -340 28 326 207 -216 -307 8
6944 8 323 187 -253 -297 35 289 161 -211 -265 45 346 162 -209 -285 39 347 176 -225 -294 85 331 160
6966 160 -247 -288 88 390 169 -252 -336 86 386 177 -294 -357 46 400 214 -288 -387 20 432 242 -263
$$ packed form
6816b80k06L97N15q8n35k99L96M73jn22l00L20M96j0m72k89K68M39M7m03l20K42
6838a32M28M0m15k94K46L98M9m20k63K33L66N1l79k37J89M00kl60k19K06L55J0
6860B50l73k25K37L80j5l92k25K85L85l0m02k32K81M29l5m43k80L06M75m2m78
6881a44k95L09M90M2n21l41K61N46P9n10l86K09N97J28m74m62K03N69J83m66n02
6902d85J59N82K41m28n43Q0O18K68l89n13K2N41L39l10n36l4N07L33k32n21r3
6923c94M91L36k43m56r1M10L48j97m71p9L60L31j57m08j20L68K98j19m23r1L15
6944HL15j36m40m4L32K54j28l72n4L10L01j84l71p6L24L08j71m01o9L79K46j71
6966A60m07m1L76L02k21m21q4M22L00k09m71o3M03L54j86n02r9M07M12j90n05
$$ plain form
6987 -263 -414 14 438 281 -250 -483 -71 441 306 -223 -476 -70 440 353 -183 -467 -121 408 392 -102 -445
7008 -445 -166 390 412 -80 -462 -203 311 409 -43 -444 -236 291 384 -23 -414 -243 238 369 12 -384 -252
7029 -252 184 356 7 -345 -228 152 336 34 -309 -197 170 314 8 -276 -188 164 300 27 -272 -181 187
7050 187 307 11 -291 -193 209 287 10 -298 -172 221 302 -33 -311 -180 231 337 -18 -323 -193 218 313
7071 313 -61 -383 -223 217 366 -11 -369 -265 216 384 35 -388 -281 222 432 72 -385 -324 174 435
7091 435 90 -342 -347 142 462 155 -359 -367 126 463 202 -278 -409 75 440 223 -298 -409 20 380 232
7112 232 -256 -419 8 361 253 -220 -388 -43 344 249 -184 -371 -41 332 260 -173 -347 -53 299 254 -127
7133 -127 -325 -62 247 236 -106 -295 -75 271 236 -110 -294 -51 250 209 -100 -297 -75 230 218 -121 -302
$$ packed form
6987b63j51M28M24j57n31k33M12N12j35n29k53M06N10q7n36k84L46N29j6m94l43
7008d45K79N56K2m92l82K59N14R8m52m01K08N27R3m07l91J71M81J31l57l96J32
7029b52M36J72l49l52J17L80J84l02l43J12L67J44l06k84Q8L52J36k73k99R1L68
7050A87J20k96l02R8M02P8k77l08J26L93Q1l35k78J31M11J06l55l05J30M11R5
7071C13l74l22J60M40J49l77l58J04M81J68l49m23J07N03K10l60m57O1M98K61
7091D35l45m32nM89L20l07n14qM93L37k61m80j31M84L65k17n21j11M29L60j48
7112B32m88j63M27L53j08m73j68L45L87r5m33j87L30L73p2m33j74K94L52m5l81
7133a27j98K63L09j1l42j89K20L46l5l46j84K43L01m1l09j97K22L05j2l39j81
$$ plain form
7154 -302 -57 274 208 -151 -304 -48 269 189 -168 -325 -13 279 209 -169 -364 -55 296 247 -161 -357 -36
7175 -36 324 273 -156 -382 -71 354 290 -159 -398 -94 333 366 -122 -441 -160 323 369 -80 -425 -192 301 379
7197 379 -83 -423 -267 273 401 -14 -406 -268 189 406 49 -387 -300 188 415 58 -320 -296 157 399 104
7218 104 -305 -265 114 355 102 -271 -269 100 316 108 -246 -280 110 326 106 -248 -218 63 299 85 -251 -249
7240 -249 80 266 65 -252 -207 77 276 58 -251 -211 142 245 67 -243 -202 138 275 62 -275 -240 121
7261 121 343 74 -266 -227 157 350 82 -273 -247 125 364 92 -285 -298 114 332 127 -295 -314 99 372
7282 372 139 -269 -355 60 348 161 -259 -356 5 385 205 -272 -376 -14 343 235 -204 -396 -26 371 274
7303 274 -181 -390 -84 325 288 -134 -364 -107 318 280 -89 -356 -94 294 287 -66 -331 -109 254 263 -81 -317
$$ packed form
7154c02K45L31o6l59j53K56L17q0l57j57L12K92p0l78j95L09L51m9m08j96L21
7175c6L60n1m29k26L11M25o4m49k39L04M27L3m88l19K81M83M6m49l45K33M93P8
7197C79m62l40J56N40J28m15l92J38M57K17l57m36Q7M88K27l57l78K4M53K42k95
7218A04m09M0L79K41k53l73KL69K16k08l54l4L90K16k20l54L0K81K36k14l36K
7240b49L29J86k01l17M5K84J99k18l09M0L53J03j78l10M1L40J37k13l37L5L61
7261A21K22k69l40L9L84J93k68l55K6L72K39k72l77j3M12K18k05m22j9M13K73
7282C72k33m08q6M15K88j87m20r7L61L80j80m77j04L62L57j08m39j92L70L97r7
7303B74m55k09L06M09l7m22k30K57M25l8l69k67K62L88pl53k65K22L63Rl44k36
$$ plain form
7325 -317 -119 218 263 -66 -298 -131 207 222 -56 -268 -111 219 204 -82 -272 -71 193 240 -68 -275 -73
7346 -73 231 189 -95 -240 -71 247 206 -93 -262 -70 261 222 -108 -302 -103 259 247 -101 -326 -121 270 258
7368 258 -90 -341 -118 268 281 -76 -371 -165 256 315 -74 -351 -195 219 311 -39 -362 -187 232 362 5
7389 5 -356 -225 167 371 47 -320 -273 169 373 102 -297 -245 134 362 80 -280 -277 105 342 104 -250 -277
7411 -277 56 313 106 -233 -298 32 313 128 -217 -289 31 257 126 -201 -262 53 245 115 -160 -252 51
7432 51 251 127 -177 -245 41 223 104 -165 -199 60 232 101 -183 -217 67 256 87 -200 -186 69 245 104
7454 104 -212 -245 71 269 118 -211 -261 55 294 113 -242 -299 70 283 148 -249 -270 21 341 163 -214
7475 -214 -297 25 321 191 -213 -307 -27 342 237 -170 -330 -32 341 237 -136 -343 -58 296 284 -109 -355
$$ packed form
7325c17J98L37M5l29k32J67L38J5k78k12J57L30j5k86j90K01K64M7l08k07K02
7346g3L04m2k84j45J69L18m1k99j69J92L31l9l30j94J99L62j2l48k25K05L91j2
7368B58l48k51K23L86J3l57k95K06M21N9l89k77J56M14R2l50l23J75M19J30l57
7389El61J31L92K04l24l67M7M42K04k71l99N2L79K28k82l60LL82K37k38l54k7
7411b77L33K57k07l39o5L30K81j85l45p2L20K26j31l27o1L15J92j30k75r2L03
7432E1K00j24l04o8K86J82j19k69l4K59J72j31k84l4K84J89j69k87J4K55J76j41
7454A04l16l3L16J98j51l29n0L16K39j81l55n7L69K13j35l97k1K91L20j78l77
7475b14q3L22K96j30m04r4K80L69j05m07j60K98L73j04l73k07K85L54j2l93k46
$$ plain form
7496 -355 -118 282 238 -96 -349 -146 219 280 -56 -317 -138 191 256 -36 -316 -151 193 263 -39 -293 -133
7517 -133 164 248 -13 -248 -131 171 224 -12 -213 -108 160 245 0 -221 -88 163 209 -6 -216 -104 151
7538 151 212 -60 -249 -107 166 161 -48 -254 -100 168 184 -79 -255 -137 184 216 -54 -287 -128 205 280 -48
7560 -48 -282 -146 209 285 -35 -291 -178 205 291 1 -291 -190 188 343 11 -294 -201 183 315 43 -317
7581 -317 -234 149 312 73 -296 -246 111 294 77 -292 -302 76 331 103 -248 -310 32 302 144 -239 -297 30
7603 30 301 156 -159 -258 1 245 166 -151 -243 -15 236 136 -140 -228 7 226 133 -140 -198 -8 186 132 -118
7626 -118 -195 1 183 100 -144 -188 -1 188 76 -157 -206 30 188 113 -150 -184 48 215 74 -180 -185 40 258
7649 258 122 -191 -222 61 281 130 -185 -253 39 291 162 -177 -287 25 287 168 -133 -290 -20 277 198
$$ packed form
7496c55K37M00m4l34k53K03L65O1l36k61J79L29O5k92k80J65L44P0l02k54J60
7517a33K97Q4k61k35J17L02N3k36k01J05K68Q5k45k21J33K51M6k15k10J12K55
7538A51O1k72j89J42K73nk09k06J54K68J6k63j76J18L21L2k70k33J59L33P5l28
7560d8k34J36L55P6l20k56J13L83Q6k90k92J01L78J55l32l05R3L84J32k72l60
7581c17Q3L83J63k39l69N0L57J83k17l69j0L78K55k28l51o2L42K70j58l83n8L27
7603C0K71j45l15r9K59K44p9l17r2K28K51j00k76q8K35K19r3k73n8J90J94n4k50
7626a18p7J96J82q3k44m4J87J89j12k33m9K36J58p5k63l4K32J67j41k54nK25K18
7649B58j36l13l1K83K20j51l15o8K92K52j29l39j10L12K62j19l01j57K70K97p9
$$ plain form
7670 198 -150 -321 -34 271 247 -134 -315 -77 246 243 -106 -329 -113 273 264 -75 -298 -131 231 289 -63 -277
7692 -277 -117 182 264 -22 -252 -146 176 270 -25 -247 -141 176 274 30 -246 -148 141 235 16 -239 -167 106
7714 106 221 13 -219 -147 112 188 -5 -185 -134 103 202 -18 -182 -116 93 160 -14 -193 -97 131 181 8 -190
7737 -190 -113 159 194 -21 -173 -94 147 182 -29 -210 -99 167 221 -38 -230 -136 169 258 -6 -277 -152 160
7759 160 251 7 -270 -192 136 280 9 -280 -223 128 294 45 -305 -225 110 306 75 -271 -254 82 323 137
7781 137 -212 -260 54 322 134 -202 -272 48 295 176 -164 -261 -31 257 153 -128 -249 -35 236 144 -134
7802 -134 -238 -25 186 144 -127 -232 0 189 128 -120 -220 -70 190 137 -114 -196 -20 183 119 -125 -184 11
7824 11 195 107 -89 -160 -9 185 121 -132 -170 6 209 113 -145 -200 11 181 90 -118 -226 17 224 122 -164
$$ packed form
7670A98l48j71K87L05k4l81j81K38L23ll49k23K16L86rl39k23J67L62N8l52k14
7692b77J60K99Q2k86k30J06L22R4k95k22J06L17R8k44k76R8K89R4k19k55P2K73
7714A06J15k08k32P2K59P6j93j80N1K37R9k20j64O6K09O7j74j79R6K28N0j73j98
7737a90P7K72L5k15j52P9K41L5k11j81J11K66N4k59j92R4L05Q9k64k71J25L12
7759A60R1k44k77P8L28J44k71k89N7L51J66k49l50Q0L35J96k31l46J7L36K41j86
7781A37l49m8L14K68j88l36p0L20K47j19l40r7K30K88j04k81j21K14K71r2k78
7802a34j04K13K11m2k71j05K32J89o1k48j00J50K60n3k51q2J76K03o4k44n9J95
7824A1J84q8j96p1J51J94o4k53l8J76K03r6k58n5K11J70r1k08j08K43K07j02k86
$$ plain form
7847 -164 -249 -9 209 112 -162 -242 -1 247 141 -159 -263 -32 274 174 -132 -256 -9 261 213 -100 -259
7868 -259 -71 240 247 -95 -279 -94 238 256 -35 -292 -132 205 264 -31 -285 -145 206 277 14 -281 -184 121
7890 121 263 -31 -274 -197 131 276 32 -241 -163 93 249 51 -211 -184 74 234 48 -186 -164 70 205
7911 205 45 -156 -111 77 204 44 -146 -128 83 193 9 -143 -110 92 167 19 -195 -98 105 162 -14 -174
7933 -174 -97 108 186 -14 -208 -115 140 194 -18 -212 -116 133 207 -27 -217 -147 139 258 -3 -254 -163 151 273
7956 273 30 -244 -193 144 282 75 -223 -231 77 302 86 -219 -257 59 304 116 -222 -277 35 272 155 -203
7978 -203 -316 -3 263 159 -180 -300 -12 252 174 -126 -274 -45 239 176 -115 -252 -63 216 172 -90 -208
7999 -208 -47 205 162 -54 -201 -69 173 163 -88 -198 -37 156 170 -58 -195 -11 145 139 -73 -177 -26 130
$$ packed form
7847a64q5K40K18r7k74q0K41K48j06l00j04K31L06j00l06j24K47K70m8l13j59
7868b59J88L11Pl42j84J85L32J8k91k57J60L37N9k95k54J40L51P1k63k95R7L05
7890A21J42k94k43P7L28J45k44k73P8K56J56j98k62K7K58J60j86k34K2K34J35
7911B05j60k01M5J88J27j60j90J8K11J10j84j52L3K02P5j48k14R7K03N7j76j60
7933a74P7K05P8k00j94R3K55N4k12j94R6K49P4k34j90P0K86J19k61k51R1L14J22
7956B73k43k74N1L37J38k07k98qL08K25k16l05l8L16K45j88l38n5L12K37j17l58
7978b03j13L13K66j04l39j20K88K64p8l00j48K29K84o3k91j37J89K79m4k62j18
7999b08J61K52m3k16j47J32K42j0k51j10J61J93J4k28j37J84J56ok12j04J51J56
$$ plain form
8021 130 144 -86 -155 -9 154 97 -95 -192 -11 159 123 -105 -187 -12 192 132 -93 -172 -17 200 135 -107 -213
8044 -213 -7 232 144 -116 -214 -20 227 171 -136 -266 -43 215 184 -104 -291 -66 219 202 -90 -266 -101 211
8066 211 233 -84 -295 -146 174 264 -36 -279 -193 169 282 -13 -296 -189 166 273 44 -256 -197 111 304
8087 304 71 -253 -196 93 256 101 -173 -202 77 222 70 -178 -164 44 220 80 -170 -183 49 180 83 -150
8109 -150 -183 33 191 46 -137 -146 56 153 60 -153 -146 77 186 65 -123 -137 90 172 44 -147 -121 88 193
8132 193 25 -152 -146 86 201 30 -179 -155 113 191 17 -197 -149 62 230 40 -219 -188 81 249 49 -207
8154 -207 -187 47 243 95 -208 -233 41 257 97 -200 -239 35 291 152 -192 -244 26 293 175 -128 -274
8175 -274 -9 255 193 -134 -274 -52 273 209 -102 -273 -58 228 200 -92 -299 -103
$$ packed form
8021A30J4k30o9J46J63n7j92r7J81J70l6k28q2J75K04o0k25p9J55K17o5k42j06
8044b13K06K39q8k60r8J94K47n6l07j30K23K58l1k88j87K25K85j7k92j76J65L12
8066B11K2l17k11J49L20R0l00k43Q6L62J13k95k83J07L55J07k29l00N9L08J93
8087C04k33l24N7K89J63j55k74k9K79J45j52k48J4K08J76j40k50j3K32J31r7k33
8109a50l3K16J58j45j83rK02R7r3k13PK23J09j21j88j4K27Q2j28j91K6K09J05
8132A93j68j77OK32J15j71k09K4K68P8j74k14M8K11J68j90k59L1K69J68k00k56
8154b07K0K34J96j48l03k5K74K16j60k97l9K74K56j39l44n2K70K67j18l03j46
8175b74K65K64o2l27j40K22L25o4l11j71K15K86k8k92k07J96
8191a03
$$ Imaginary data points
##PAGE= N=2
##DATA TABLE= (X++(I..I)), XYDATA
$$ plain form
0 0 0 0 0 0 0 0 0 0 0 0 -8 8 -8 12 -16 16 -24 29 -32 40 -48 57 -72 81 -96 112 -132 153 -176 201 -232 263
32 263 -299 341 -383 431 -485 543 -607 677 -756 837 -929 1029 -1140 1259 -1389 1533 -1688
49 -1688 1859 -2050 2257 -2489 2746 -3032 3357 -3725 4147 -4638 5215 -5909 6756 -7821 9206
64 9206 -11087 13805 -18099 25926 -44812 188544 21965 -473963 -237299 152055 354364
75 354364 84229 -224645 -196447 79754 177212 45308 -174850 -124879 117025 211985 44564
86 44564 -211981 -278036 77242 368478 145965 -230179 -276963 -27600 233161 177154 -81670
97 -81670 -163287 -27036 96586 58178 -88324 -73183 86726 121574 7798 -139962 -171656
108 -171656 60132 253981 87414 -169342 -183037 4672 163919 90939 -83859 -89636 27384
$$ packed form
0@%%%%%%%%%%qJ6j6K0k8L2m0N3o1P2q8J05j29J53j77K08k44K85l29L77m33M95
32B63n62O40p24Q14r16J028j150J284j433J593j766J958k169K399k648K922l221
49a688L547l909M307m746N235n778O389p082P872q785R853j1124J2665j4577J7027
64I206k0293K4892l1904M4025p0738K33356j66579m95928K36664L89354K02309
75C54364k70135l08874K8198K76201R7458j31904k20158M9971K41904R4960j67421
86D4564k56545o6055L55278K91236k22513l76144m6784K49363K60761n6007k58824
97h1670q1617J36251J23622l8408j46502J5141J59909L4848j13776j47760l1694
108a71656K31788J93849j66567k56756j3695J87709J59247p2980j74798n777J17020
$$ plain form
119 27384 80672 -581 -116292 -50629 121517 126911 -13792 -148530 -156496 53346 236344
130 236344 105201 -150042 -204679 -14820 185625 122497 -97209 -139872 17002 135735
140 135735 44231 -143506 -114004 108500 177049 17899 -164441 -170862 44863 220983 111218
151 111218 -123219 -193636 -33454 160767 130293 -67807 -144689 -19518 129701 89610 -109222
162 -109222 -156494 41666 191474 92690 -135218 -217397 -16117 222336 175001 -86487 -231784
173 -231784 -87473 162051 183949 -32825 -177662 -77506 120509 144127 -50363 -172992
183 -172992 -40664 148881 144152 -50764 -196955 -92557 134881 190761 15695 -172786
193 -172786 -146985 58306 172248 62130 -104978 -119340 21836 118116 32877 -94147 -70975
$$ packed form
119B7384N3288q1253j15711O5663J72146N394j40703j34738p966K09842J82998
130B36344j31143k55243n4637J89859K00445o3128k19706m2663J56874J18733
140A35735r1504j87737K9502K22504O8549j59150j82340o421K15725J76120j09765
151A11218k34437p0417J60182J94221l0474j98100p6882J25171J49219m0091j98832
162a09222m7272J98160J49808r8784k27908q2179K01280K38453m7335k61488j45297
173b31784J44311K49524K1898k16774j44837J00156J98015K3618j94490j22629
183a72992J32328J89545m729j94916j46191J04398K27438N5880j75066j88481
193a72786K5801K05291J13942j10118j67108j4362J41176R6280q5239j27024K3172
$$ plain form
204 -70975 57902 108053 5898 -115861 -83715 62369 125281 30245 -96009 -94842 23020
215 23020 91959 32627 -51911 -47553 24529 49157 -16146 -65770 -10325 76358 66763 -40740
227 -40740 -110308 -39444 89912 109000 -9944 -115644 -71661 64066 108712 3860 -101064
238 -101064 -58267 71324 100059 -21801 -124473 -53905 103214 131105 -18552 -153849 -94245
249 -94245 88258 159995 29511 -133989 -123407 40392 143051 55774 -98951 -111892 28521
260 28521 124877 44437 -101873 -108844 40492 142154 52398 -112488 -133921 20473 150482
271 150482 85090 -86578 -139701 -13750 120661 89756 -56249 -114487 -12842 99260 67655
282 67655 -61172 -105199 1901 111461 69569 -69178 -120692 -13775 113327 92041 -46327
$$ packed form
204g0975J28877N0151j02155j21759L2146J46084O2912r5036j26254J167J17862
215B3020O8939n9332q4538M358P2082K4628o5303m9624N5445Q6683r595j07503
227d0740o9568P0864J29356J9088j18944j05700M3983J35727M4646j04852j04924
238a01064M2797J29591K8735j21860j02672P0568J57119K7891j49657j35297N9604
249i4245J82503P1737j30484j63500J0582J63799J02659q7277j54725j2941J40413
260B8521R6356q0440j46310o971J49336J01662q9756j64886k1433J54394J30009
271A50482o5392j71668n3123J25951J34411l0905j46005n8238J01645J12102l1605
282F7655j28827m4027J07100J09560m1892j38747n1514J06917J27102k1286j38368
$$ plain form
293 -46327 -118622 -37671 85544 90285 -23534 -95770 -32638 70524 71373 -29808 -90623 -21475
305 -21475 81719 74270 -35075 -101319 -34305 78869 86905 -16867 -91940 -45607 54190 74131
317 74131 -6013 -68350 -29751 46840 51768 -20805 -65470 -13364 62843 52883 -32301 -77568
329 -77568 -18439 67948 62697 -26623 -76592 -21257 60811 55463 -29356 -71135 -8231 70069
341 70069 50016 -46166 -85465 -5628 90140 68475 -48370 -106889 -25687 92297 90506 -31077
353 -31077 -111138 -43358 80971 95548 -19105 -108046 -48831 78956 100582 -15339 -114410
364 -114410 -61598 77362 117194 1829 -117254 -84031 58025 124009 28011 -101284 -93667
375 -93667 33997 110531 39032 -81095 -87427 24277 97995 37372 -72341 -83996 18813
$$ packed form
293d6327p2295Q0951J23215M741j13819p2236O3132J03162Q49j01181o0815O9148
305b1475J03194p449j09345o6244O7014J13174Q036j03772p5073M6333R9797J9941
317G4131q0144o2337L8599P6591M928p2573m4665N2106P6207r960q5184m5267
329g7568N9129Q6387n251q9320m9969N5335Q2068n348q4819m1779O2904P8300
341G0069k0053r6182l9299P9837R5768k1665j16845n8519Q1202J17984j791j21583
353c1077q0061O7780J24329J4577j14653q8941N9215J27787K1626j15921r9071
364a14410N2812J38960L9832j15365j19083L3223J42056O5984r5998j29295P617
375i3667J27664P6534p1499j20127o332J11704P3718o0623j09713j1655J02809
$$ plain form
386 18813 95624 42608 -64711 -84565 5583 86230 50071 -49542 -75665 -1578 67832 42342
398 42342 -39624 -61004 5354 59956 29171 -42260 -56681 10106 65127 29073 -45704 -59237
410 -59237 5337 64339 34916 -42666 -57952 5699 59300 30080 -44049 -54913 15126 62960
422 62960 23518 -49980 -59210 15917 72373 28541 -51610 -62314 7627 68502 36346 -44659
434 -44659 -60778 4354 61884 35225 -43382 -61123 9148 65610 33651 -45659 -69010 4715
446 4715 76015 41744 -47771 -73142 -2085 73762 48047 -43944 -72264 -2837 70435 48199
458 48199 -44736 -75453 568 74180 50360 -40869 -84169 -13219 79367 65090 -33761 -88530
470 -88530 -28618 71077 75000 -21384 -85981 -37091 61668 78191 -15225 -86004 -37531 57155
$$ packed form
386A8813P6811n3016j07319j9854R0148Q0647l6159r9613k6123P4087O9410k5490
398D2342q1966k1380O6358N4602l0785p1431j4421O6787N5021l6054p4777j3533
410e9237O4574N9002k9423p7582j5286O3651N3601k9220p4129j0864P0039M7834
422F2960l9442p3498r230P5127N6456m3832q0151j0704O9941O0875l2156q1005
434d4659j6119O5132N7530k6659p8607j7741P0271N6462l1959p9310k3351P3725
446D715P1300l4271q9515k5371P1057P5847k5715r1991k8320O9427P3272k2236
458D8199r2935l0717P6021P3612k3820r1229m3300P0950R2586j4277r8851n4769
470h8530N9912R9695L923r6384o4597M8890R8759J6523r3416p0779M8473R4686
$$ plain form
482 57155 76834 -3961 -84034 -50981 51256 82276 6292 -75629 -57034 36840 75840 13305
494 13305 -59486 -50780 24736 63116 10785 -49883 -36664 20143 48206 14204 -40868 -40470 14844
507 14844 48623 18549 -37162 -42787 12415 47565 14175 -37226 -35302 20633 47420 -1959
519 -1959 -48797 -20169 36432 41988 -10050 -50912 -22009 37115 45984 -4057 -49306 -30573 30509
532 30509 50624 2818 -49346 -37670 29493 61051 3066 -62424 -39646 37555 64789 5331
544 5331 -63124 -47215 30376 66427 17340 -53874 -54917 16746 64507 26749 -45785 -58871
556 -58871 10438 68940 28552 -53462 -58881 17614 69531 25698 -52693 -57176 13601 62133
568 62133 29307 -39117 -54429 655 51395 35099 -25842 -55028 -9646 53110 42351 -30441
$$ packed form
482E7155J9679q0795q0073L3053J02237L1020p5984q1921J8595R3874L9000o2535
494A3305p2791Q706P5516L8380n2331o0668J3219N6807K8063l4002n5072L98N5314
507A4844L3779l0074n5711n625N5202L5150l3390n1401J924N5935K6787m9379
519a959m6838K8628N6601N556n2038m0862K8903N9124Q869n0041m5249J8733O1082
532C0509K0115m7806n2164J1676O7163L1558n7985o5490K2778P7201K7234n9458
544E331o8455J5909P7591L6051m9087p1214j043P1663M7761l7758p2534j3086
556e8871O9309N8502m0388q2014n419P6495N1917m3833p8391m483P0777M8532
568F2133l2826o8424j5312N5084N0740j6296o0941k9186M5382O2756j0759p2792
$$ plain form
580 -30441 -62676 -6884 61601 44960 -35850 -66732 -5940 60771 44284 -29725 -59865 -9773
592 -9773 47903 39949 -17429 -49779 -15854 39023 40578 -13125 -49496 -18604 39138 43848 -12123
605 -12123 -51171 -20597 36119 42346 -7483 -43588 -20008 26394 34206 -2705 -33491 -17580
617 -17580 22228 30639 -4862 -35267 -15395 29638 34143 -12084 -43252 -12173 37704 33442 -18720
630 -18720 -42547 -5238 37734 25771 -21900 -37339 -856 36113 24680 -20237 -40841 -8279
642 -8279 38403 37786 -14446 -52654 -21654 42076 50977 -10062 -58550 -27706 41492 53702 -8168
655 -8168 -57490 -27491 38786 52415 -4116 -55299 -32857 33197 56234 5721 -53586 -42211
667 -42211 25374 57735 13647 -46186 -43631 16006 51335 16499 -37198 -38763 9988 44045
$$ packed form
580c0441l2235N5792O8485j6641q0810l0882O0792O6711j6487p4009l0140N0092
592i773N7676p954n7378l2350L3925N4877J555n3703l6371L0892N7742M710n5971
605a2123l9048L0574N6716O227m9829l6105K3580M6402P812l6911l0786J5911
617a7580L9808Q411l5501l0405J9872M5033M505m6227l1168L1079M9877m262n2162
630a8720k3827L7309M2972j1963m7671j5439L6483L6969j1433m4917k0604L2562
642h279M6682o17n2232l8208L1000O3730Q901o1039m8488L0844O9198J2210o1870
655h168m9322K9999O6277J3629n6531n1183K2442O6054K3037n0513n9307J1375
667d2211O7585L2361m4088n9833K555N9637L5329l4836n3697j565M8751L4057
$$ plain form
679 44045 18627 -31788 -39067 5907 44038 23659 -30733 -43590 4452 45243 23241 -29291
691 -29291 -39791 5642 40505 16065 -28102 -29986 9124 34084 10828 -26825 -26810 8461 32649
704 32649 14635 -24535 -32062 4127 34640 19064 -22289 -34270 1764 35311 18317 -23370
716 -23370 -31803 3907 35062 16982 -25159 -32144 4171 35568 20222 -23692 -35955 1104
728 1104 35901 22124 -21402 -35681 416 35068 18749 -22747 -31483 3587 34041 16201
740 16201 -24479 -30827 3846 33587 19596 -21757 -34827 -999 34241 24664 -18742 -38449
752 -38449 -4261 37026 26554 -21042 -40370 -3431 40385 28230 -23720 -43232 -4751 40481
764 40481 32532 -19202 -45342 -11787 36145 36982 -10446 -44634 -19072 31546 38984 -5322 -42399
$$ packed form
679D4045k5418n0415p279M4974L8131k0379n4392j2857M8042M0791k2002n2532
691b9291j0500M5433L4863k4440m4167j884L9110K4960k3256l7653J5L5271K4188
704C2649j8014l9170p527L6189L0513j5576m1353j1981L6034L3547j6994m1687
716b3370q433L5710L1155j8080m2141o985L6315L1397j5346m3914j2263L7059
728A104L4797j3777m3526j4279L6097L4652j6319m1496q736L5070L0454j7840
740A6201m0680o348L4673K9741j3991m1353j3070L3828L5240r577m3406j9707
752c8449L4188M1287j0472m7596j9328L6939M3816j2155n1950j9512L8481M5232
764D0481p949n1734k6140L3555M7932Q37m7428l4188K5562N0618P438m4306l7077
$$ plain form
777 -42399 -22388 28349 40074 -2511 -40634 -24463 23945 40260 2954 -36732 -26981 16849
789 16849 37369 8532 -30321 -26715 11900 31873 8311 -25181 -22495 11369 27442 4441
801 4441 -23376 -18043 11935 24578 2666 -21955 -15575 11298 21889 2203 -20299 -13849 12206
814 12206 20887 -162 -21997 -13083 16127 24102 -2462 -27408 -15105 19430 29012 -1445 -31135
827 -31135 -18817 19293 31634 1277 -31117 -21423 17387 32529 3554 -30493 -23733 15530
839 15530 34588 6776 -30691 -27285 12597 36102 11631 -28472 -30269 8169 34852 14845
851 14845 -24208 -29920 4832 31938 15110 -21424 -28272 3503 30537 15327 -20886 -28319 2489
864 2489 29930 16981 -19366 -29169 594 28683 17765 -17044 -28445 -591 27552 17378
$$ packed form
777d2399K0011N0737J1725m2585l8123J6171M8408J6315l7306l9686R751M3830
789A6849K0520k8837l8853L606L8615J9973k3562l3492K686L3864J6073k3001
801D441k7817N333K9978J2643k1912k4621O380K6873J0591j9686k2502O450K6055
814A2206Q681k1049k1835Q914K9210P975k6564k4946J2303L4535R582l0457k9690
827c1135J2318L8110J2341l0357l2394R694L8810J5142k8975l4047O760L9263
839A5530J9058k7812l7467L406L9882K3505k4471m0103j797L8438K6683k0007
851A4845l9053n712L4752K7106j6828l6534o848L1775K7034j5210l6213p433L0808
864B489K7441j2949l6347r803K9763K8089j0918l4809j1401K7854K8143j0174
$$ plain form
876 17378 -16260 -27817 -1205 27933 18727 -16422 -29255 -2779 28008 21643 -14296 -30705
888 -30705 -5650 26109 22862 -10683 -29486 -7909 23455 21971 -8449 -26935 -8994 21195
900 21195 21724 -7236 -25483 -9728 18679 21708 -4864 -23680 -10022 15618 19431 -2835 -20489
913 -20489 -8736 14276 15924 -4153 -17992 -6179 15099 14538 -7019 -18618 -4423 16872 15339
926 15339 -8707 -20912 -3745 18559 15899 -9264 -22968 -4015 21308 17032 -11014 -25234
938 -25234 -5047 23702 20537 -11106 -28423 -8326 23998 25270 -8018 -30659 -12406 21723
950 21723 27674 -2912 -30216 -16655 19055 28762 501 -28470 -19506 15930 29441 3709 -26334
963 -26334 -21836 11667 29480 7330 -23431 -22150 7224 26299 10238 -19081 -21415 4759 22961
$$ packed form
876A7378l3638j1557K6612K9138r206l5149j2833K6476L0787o365l5939j6409
888c0705K5055L1759l247l3545j8803K1577L1364j484l0420j8486J7941L0189
900B1195N29k8960j8247J5755K8407L029k6572j8816J3658K5640L813k2266j7654
913b0489J1753K3012J648k0077j3839J1813K1278n61k1557j1599J4195K1295j533
926A5339k4046j2205J7167K2304k660k5163j3704J8953K5323m276k8046j4220
938b5234K0187K8749l165l1643j7317K0097L2324J272l3288k2641J8253L4129
950B1723N951l0586k7304J3561L5710R707k8261k8971Q964L5436J3511k5732l0043
963b6334M498L3503J7813k2150l0761J281K9374J9075j6061k9319k334K6174J8202
$$ plain form
976 22961 10016 -16036 -19408 4205 20900 8680 -14680 -17846 3848 20130 7790 -14474
988 -14474 -15958 3752 18008 7319 -13623 -14978 4463 17270 6129 -14110 -14949 5681 18526
1001 18526 5743 -15309 -16276 5699 20649 6762 -16385 -16879 5233 20262 7711 -15253 -16792
1014 -16792 4429 19134 8077 -13926 -16838 3328 18684 8986 -12677 -17867 1218 19156
1026 19156 10812 -12273 -18639 288 18823 11269 -11972 -18328 728 18586 10443 -12447 -17935
1039 -17935 1676 18912 10174 -12638 -18528 1065 19691 11541 -12494 -19683 -37 20009 12809
1052 12809 -11997 -20425 -912 19998 13674 -11292 -21033 -2530 19458 15578 -9138 -22083 -6006
1065 -6006 18278 18817 -5843 -23300 -9716 17109 20977 -3499 -23220 -11063 15885 20369 -2660
$$ packed form
976B2961j2945k6052l372K3613J6695j2220k3360l166K1694J6282j2340k2264
988a4474j484J9710J4256j0689k0942j355J9441J2807j1141k0239q39K0630J2845
1001A8526j2783k1052r67K1975J4950j3887k3147m94K2112J5029j2551k2964j539
1014a6792K1221J4705j1057k2003k912K0166J5356r698k1663n190J9085J7938
1026A9156q344k3085o366J8927J8535p554k3241o356J9056J7858q143k2890n488
1039a7935J9611J7236q738k2812n890J9593J8626q150k4035p189J9646K0046p200
1052A2809k4806q428J9513K0910o324k4966r741J8503K1988l880k4716j2945J6077
1065f006K4284N39k4660j7457J3584K6825L868k4476j9721J2157K6948M484k3029
$$ plain form
1078 -2660 -20886 -10428 13330 18085 -1049 -17272 -10326 9085 16133 2234 -14145 -11529 5981
1091 5981 15206 3884 -12859 -11370 6138 14107 1911 -12613 -8855 7801 12635 -1168 -12528
1104 -12528 -5872 8640 11050 -2137 -12284 -5105 9073 11043 -2187 -13369 -5762 10834 12419
1117 12419 -3408 -15226 -6329 12392 14303 -4076 -16731 -6916 11898 15292 -1819 -16682 -9559
1130 -9559 9764 16909 1958 -16881 -13416 8886 19401 3766 -17627 -15475 8826 21057 3818
1143 3818 -17823 -14808 7825 19462 4599 -15410 -13901 5017 16695 6686 -12236 -14447 2688
1156 2688 15604 7863 -10597 -15185 1584 16103 7915 -10757 -14674 1324 15634 8002 -10281
1169 -10281 -13925 715 14352 8797 -9094 -14324 213 14189 9174 -8568 -15009 -74 15008
$$ packed form
1078b660j8226J0458K3758M755j9134j6223O946J9411P048j3899j6379K616J7510
1091E981R225j1322j6743J489J7508P969j2196j4524L758J6656M834j3803j1360
1104a2528O656J4512K410j3187j0147P179J4178J970j3230j1182P607J6596J585
1117A2419j5827j1818Q897J8721J911j8379j2655R815J8814L394j7111j4863P123
1130i559J9323P145j4951j8839L465K2302J0515j5635k1393K152K4301J2231j7239
1143C818k1641L015K2633J1637j4863k0009J509J8918J1678j0009j8922k211J7135
1156B688J2916p741j8460m588J6769J4519q188j8672l917J5998J4310p632j8283
1169a0281l644J4640J3637n555j7891n230J4537J3976n015j7742o441J4935J5082
$$ plain form
1182 15008 8918 -9013 -14459 -169 14282 8678 -8193 -13080 -1061 11788 9041 -5810 -12563
1195 -12563 -2644 10306 9811 -4092 -13007 -3704 10885 10120 -4571 -12966 -3102 11307 9210 -5690
1209 -5690 -11712 -1459 10381 7613 -5735 -10463 -516 9678 6600 -5620 -10453 -478 10500
1222 10500 6938 -6460 -11512 -583 11906 7956 -7419 -12764 -758 12589 9064 -7118 -13966
1235 -13966 -1988 12935 11011 -5936 -15686 -4345 13607 13644 -4955 -17492 -6356 13875 15399
1248 15399 -4095 -17815 -7383 12548 15255 -2205 -16049 -8452 9634 14466 638 -13683
1260 -13683 -10114 6550 14449 3219 -12210 -11374 4750 14386 4364 -11301 -11030 4027 12983
1273 12983 4121 -9842 -9664 3597 11068 3340 -8279 -8267 3025 9839 2879 -7774 -7584 3085
$$ packed form
1182A5008o090j7931n446J4290J4451n604j6871m887J2019J2849k747j4851o753
1195a2563R919J2950m95j3903q915R303J4589p65j4691q395R864J4409k097j4900
1209e690o022J0253J1840k768j3348m728R947J0194l078j2220m833R975J0978
1222A0500l562j3398n052J0929J2489l950j5375n345J2006J3347l525j6182o848
1235a3966J1978J4923j924j6947r750J1341J7952L7j8599j2537J1136K0231J524
1248A5399j9494j3720J0432J9931K707j7460j3844P597J8086M832j3828j4321
1260a3683L569J6664P899j1230j5429Q36J6124R636j0022j5665K71J5057Q956
1273A2983q862j3963J78J3261P471p728j1619J2J1292O814o960j0653J90J0669
$$ plain form
1287 3085 9580 2372 -8308 -7135 3937 9356 1747 -8632 -6849 4722 9439 1122 -8611 -6853
1301 -6853 4487 9978 1706 -8879 -7642 4066 10945 2755 -9681 -8596 4273 11386 3171 -9767
1315 -9767 -9176 4465 11414 2714 -9290 -8764 3718 10994 3038 -8601 -8685 2582 10831 4251 -8474
1330 -8474 -9399 2217 10888 5180 -8256 -10590 2243 11778 5198 -8403 -10937 1872 12396 5621
1344 5621 -8467 -11164 922 12423 7012 -8256 -11962 137 11899 8263 -7031 -12992 -1068
1357 -1068 11842 8892 -5677 -12970 -2630 11191 9460 -4237 -12165 -4348 9574 10458 -2739
1370 -2739 -11502 -5161 7641 10572 -934 -10864 -5595 6508 9571 14 -9574 -5573 5759 8177
1384 8177 -80 -7748 -5037 4691 7384 -517 -6817 -3726 4103 6369 -717 -6716 -2730 4695 5601
$$ packed form
1287C085O495p208j0680J173J1072N419p609j0379J783J1571M717q317r733J758
1301f853J1340N491q272j0585J237J1708O879q190j2436J085J2869P113q215j2938
1315i767N91J3641O949q700j2004N26J2482P276p956j1639q4J1267Q249o580j2725
1330h474r25J1616Q671n708j3436k334J2833R535o580j3601k534J2809J0524o775
1344E621j4088k697J2086J1501n411j5268l706J2099J1762l636j5294n961J1924
1357a068J2910k950j4569p293J0340J3821j731j3697p928P817J3922Q84j3197
1370b739q763O341J2802K931j1506r930N269J2103L063r557r588M001J1332K418
1384H177q257p668K711R728K693p901o300L091P829K266p086n999L986P425R06
$$ plain form
1399 5601 -1346 -7035 -2289 6160 5537 -2723 -7363 -2051 6961 6421 -3551 -8414 -1954 7307 7157 -3286
1415 -3286 -9556 -2611 7667 7964 -2438 -10399 -4122 8042 9044 -1946 -10474 -5447 7357 10260
1429 10260 -872 -10554 -6331 6256 10831 610 -10333 -7121 5215 10744 2113 -9746 -8215
1442 -8215 4599 10788 2624 -8939 -8631 3566 10679 3120 -8233 -8480 2575 10137 3636 -7539
1456 -7539 -8183 1827 9281 4321 -6750 -8478 1399 9038 4565 -6032 -8513 771 8885 4757
1470 4757 -5490 -8262 154 8344 4989 -4907 -7824 -396 7434 5267 -4080 -7733 -814 6923 5220
1485 5220 -3523 -7397 -1109 6503 4966 -3240 -6810 -978 5991 4424 -3121 -6005 -569 5501 3822
1500 3822 -3139 -5566 -82 5483 3343 -3515 -5480 328 5862 3191 -4204 -5825 830 6521 3087
$$ packed form
1399E601o947n689M746Q449o23q260m640N312R012n40r972m863O460R261j50j0443
1415c286o270O945J0278K97j0402p961O277J2164J002j0990q528N027J2804K903
1429A0260j1132r682M223J2587M575j0221j0943L212J2336N529q631j1859J531
1442h215J2814O189q164j1563L08J2197P113p559j1353k47J1055P562o501j1175
1456g539o44J0010P454m960j1071j728R877P639m473j0597k481R284Q114m128
1470D757j0247k772Q416Q190l355r896k917P428P830k167r347l653O919P737j703
1485E220q743l874O288P612j537q206l570N832O969j567p545k884N436O070j679
1500C822o961k427N484N565k140o858j965N808N534k671p395j621O655N691l434
$$ plain form
1515 3087 -4874 -6321 1100 7247 3460 -5362 -7142 935 8056 4222 -5488 -8002 180 8502 5588
1530 5588 -5109 -9080 -817 8607 6759 -4193 -9724 -2238 8369 7906 -3053 -10096 -3673 7754
1544 7754 8752 -1851 -9908 -4998 6599 9332 -523 -9408 -5640 5282 9002 812 -8295 -6092
1558 -6092 3970 8439 1685 -7190 -6125 3142 7628 1935 -5926 -5700 2239 6903 1924 -5170 -4858
1573 -4858 1707 5742 1931 -4342 -4417 1495 5130 1769 -4199 -4254 1803 5129 1244 -4360 -4028 2138
1589 2138 5416 741 -4907 -3585 2689 5228 457 -5051 -3419 2881 5243 546 -5115 -3811 2931
1604 2931 5605 691 -5205 -4256 2699 6168 973 -5558 -4429 2700 6200 1160 -5570 -4619 2565
1619 2565 6193 1491 -5481 -5059 2395 6603 1861 -5490 -5661 2080 7251 2339 -5851 -6030 2006 7460
$$ packed form
1515C087p961j447P421O147l787q822j780Q077P121l834r710k514Q182Q322k914
1530E588j0697l971Q263R424j848j0952n531P486J0607m63j0959p043O423J1427
1544G754R98j0603q057M910J1597K733r855q885L768J0922L720q190r107K203
1558f092J0062M469o754q875J065R267M486n693p861K26P939M664m979p094L12
1573d858O565M035l811o273p5N912L635l361n968n5O057L326l885n604L32O166
1589B138L278m675n648J322O274K539m771n508J632O300K362m697n661J304O742
1604B931K674m914n896R49O955L469n195o531J129P129L500n040o730R51P184
1619B565L628m702o972M22P454M208m742p351j71P741N171m912q190j79Q036N454
$$ plain form
1635 7460 2706 -5789 -6334 1607 7360 3297 -5266 -6888 668 7354 4350 -4460 -7648 -676 7446
1650 7446 5582 -3866 -8268 -1635 7254 6365 -3140 -8247 -2272 6583 6525 -2128 -7615 -2890 5393 6327
1666 6327 -879 -6669 -3570 4039 6086 171 -5628 -3830 2850 5416 701 -4625 -3555 2081 4454
1681 4454 757 -3708 -2924 1715 3680 492 -3168 -2281 1815 3193 -137 -3259 -1479 2556 2826 -1174
1697 -1174 -3634 -634 3562 2676 -2146 -4060 -233 4248 2907 -2541 -4620 -527 4438 3698 -2198
1712 -2198 -5475 -1435 4691 4731 -1674 -6257 -2438 4890 5644 -1204 -6633 -3287 4679 6326 -562 -6520
1728 -6520 -3879 3869 6644 521 -6286 -4576 3109 6643 1336 -5836 -5023 2512 6396 1809 -5155
1743 -5155 -5262 1820 6211 2138 -4446 -5164 829 5817 2901 -3950 -5429 290 5680 3390 -3718
$$ packed form
1635G460m754q495n45P941N753m063q563j622P556O686l004q810l188O972Q122
1650G446j864r448m402O633Q889q89r505n107N975Q855n8q653n487M725Q283R34
1666F327p206n790L099P609K047n915n799J798O680K566m715n326J070N636K373
1681D454l697m465P84M639J965l188l660Q87M096J378l330l122J780M035K70m000
1697a174k460L000M196q86m822j914L827M481j341n448k079M093M965p40n896
1712b198l277M040O126M0o405m583L819P328P54o848n429L346P966J647o888n958
1728f520K641P748K775o123o807J710P685L534n307p172Q13P535L884m587o964
1743e155j07P082M391m073o584p18N993M988k916o851j479N719N390k290p108
$$ plain form
1758 -3718 -5560 250 5497 3366 -3389 -5572 155 5350 3033 -2965 -4889 -409 4576 3298 -2276
1773 -2276 -4599 -1006 3874 3601 -1647 -4440 -1309 3318 3573 -1078 -4327 -1370 3233 3035 -987 -3507
1789 -3507 -1252 2705 2657 -947 -2935 -955 2415 2304 -1246 -2713 -248 2414 1769 -1651 -2904 379
1805 379 3225 1193 -2550 -2845 885 3631 1127 -3050 -3095 929 4007 1725 -3288 -3938 757 4561
1821 4561 2620 -3132 -5168 53 5489 3555 -3175 -5914 -658 5726 4381 -2741 -6158 -1595 5188
1836 5188 5175 -1828 -6212 -2507 4287 5651 -433 -6093 -3703 3526 5976 586 -5652 -4391 2716
1851 2716 5877 1289 -4697 -4549 1669 5479 1793 -3907 -4247 855 4743 2231 -3140 -4016 437 4086
1867 4086 2163 -2616 -3635 354 3457 1787 -2088 -3001 224 2963 1377 -1877 -2414 233 2542
$$ packed form
1758c718j842N810N247k131o755k183N727N195k317n998j924M480M985j278n574
1773b276k323L593M880k73n248k793L131M627K55m651l249K957M603j98m022k520
1789c507K255L957m8l604j988J980L370j11l550j467K465K662o45l420j253L283
1805C79K846k032l743k95L730K746k504m177m5M024L078k282n013o50M695L804
1821D561j941n752k036N221N436j934o730k739N256O384j345p122l417M563O783
1836E188j3p003m384L705O794J364o084n660K390P229K450n390o238J261P107
1851B716L161m588n986J48O218L810l686n700l40N102L888k512n371q76M453L649
1867D086j923m779j019L989L103j670l875r13L225K739j586l254n37K647K309
$$ plain form
1882 2542 1247 -1789 -2208 386 2477 1129 -1919 -2302 707 2705 818 -2176 -2162 1030 2809 588
1898 588 -2445 -2085 1200 2870 515 -2646 -2106 1271 2960 626 -2734 -2432 1326 3303 694 -2928
1914 -2928 -2620 1394 3581 816 -3122 -2819 1378 3832 1025 -3249 -3135 1253 4037 1474 -3235 -3674
1930 -3674 884 4369 1978 -3226 -4134 528 4562 2459 -2997 -4552 -28 4561 3056 -2551 -4827
1945 -4827 -760 4270 3693 -1754 -4970 -1648 3893 4317 -997 -4938 -2324 3347 4510 -277 -4599
1960 -4599 -2701 2664 4372 330 -3934 -2881 1806 3901 899 -3129 -2970 1042 3404 1218 -2426
1975 -2426 -2721 480 2809 1270 -1852 -2235 322 2169 921 -1446 -1563 413 1585 473 -1204 -1028
1991 -1028 657 1325 -48 -1310 -591 1110 1304 -513 -1798 -446 1716 1577 -948 -2428 -486 2337
$$ packed form
1882B542j295l036m19K594K091j348l048l83L009J998j887k994J4L192J779k221
1898E88l033L60L285J670k355l161N40L377J689k334l360L02L758J977k609l622
1914b928L08M014K187k765l938L03M197K454k807m274J14M388K784k563m709m39
1930c674M558L485k391n204r08M662M034k103n456j555M524M589j505n607k276
1945d827M067N030n77n447l216L322N541M24n314l941K614N671J163m787m322
1960d599J898N365J708m042m264J053M687K095l002m028J59M012K362k186l644
1975b426k95L201K329j539l122l83K557J847j248k367j17J976J172j112j677J76
1991a028J685O68j373j262P19J701J94j817j285J352K162j39k525j480J942K823
$$ plain form
2007 2337 1974 -1151 -2883 -748 2573 2461 -1060 -3257 -1196 2574 3040 -604 -3562 -1828 2439 3560
2023 3560 -61 -3776 -2444 2259 3925 394 -3700 -2885 1804 4036 868 -3383 -3191 1205 3979
2038 3979 1439 -2998 -3460 617 3909 2013 -2602 -3735 183 3794 2345 -2206 -3784 -248 3577
2053 3577 2563 -1790 -3675 -612 3247 2696 -1382 -3516 -1000 2810 2838 -981 -3395 -1289 2479 2813
2069 2813 -567 -3144 -1462 2055 2673 -264 -2744 -1519 1663 2407 -2 -2253 -1428 1220 2109 195
2085 195 -1813 -1293 901 1756 245 -1458 -1029 785 1397 40 -1287 -663 908 1024 -434 -1260 -232
2102 -232 1198 880 -873 -1477 133 1685 869 -1327 -1836 274 2139 1160 -1566 -2310 140 2616 1621
2119 1621 -1648 -2858 -184 2878 2245 -1477 -3349 -761 2986 2827 -1070 -3621 -1402 2693 3318 -456
$$ packed form
2007B337l63l125j732K135L321j12l521k197K061L770M66l644k958J734M267J121
2023C560l621l715J332M703J666l531m094Q15M689K232l168m251J92M396K774
2038C979k540m437m62M077L292j896m615j133L918L611j449m551j578L536L825
2053C577j014m353j885L063L859n51m078k134K516L810K8l819k414K106L768L34
2069B813l380k577J682L517O18k937k480J225L182P44k409k251Q25K648Q89j914
2085A95k008N20K194Q55j511j703M29J814O12j357j327O24J571J16j458q26J028
2102b32J430l18j753o04J610J552q16k196n09K110J865r79k726p44K450K476r95
2119A621l269j210K674L062o33l722j872K588L747j59l897k551K219M095O25l774
$$ plain form
2135 -456 -3675 -2086 2274 3685 239 -3521 -2698 1678 3840 929 -3237 -3091 1117 3781 1443 -2689
2151 -2689 -3223 458 3406 1822 -2035 -3115 -135 2960 2044 -1479 -2954 -505 2522 2132 -1129 -2720
2167 -2720 -686 2139 1983 -799 -2394 -689 1808 1704 -608 -1982 -671 1512 1508 -519 -1672 -535
2183 -535 1255 1336 -446 -1488 -418 1196 1122 -431 -1372 -283 1144 884 -563 -1223 -188 1133 798
2200 798 -729 -1241 -30 1257 754 -933 -1367 173 1466 745 -1139 -1522 320 1836 749 -1393
2216 -1393 -1675 421 2049 869 -1540 -1897 336 2258 1172 -1605 -2266 144 2378 1561 -1438 -2660
2232 -2660 -264 2552 1967 -1251 -2921 -781 2462 2434 -861 -3122 -1271 2253 2897 -376 -3130 -1743
2248 -1743 1884 3099 237 -2972 -2164 1423 3115 730 -2535 -2402 859 2898 1152 -1992 -2515 265
$$ packed form
2135d56l219J589M360J411l446l760Q23M376K162k911m166J46M208K664k338m132
2151b689n34L681K948j584l857j080K980L095r16l523j475K449L027l90l261j591
2167b720K034K825j56k782j595J705K497j04k312j374J311K183mk027j153J137
2183e35J790Q1j782j042J070J614p4j553r41J089J427k60j447o60J035J321l35
2200G98j527n12J211J287n03j687m34J540J293p21j884l83J842J516j087k142
2216a393k82K096J628j180k409l57K233J922j086k777o61K410K234q17k999j222
2232b660K396K816n85l218j670K140L243k8l295k261J851L524O44l273k754J387
2248a743L627J215k862l209Q08L587J692k385l265J33L261K039j746l144n23K780
$$ plain form
2264 265 2646 1464 -1504 -2429 -225 2222 1632 -1145 -2253 -347 1813 1477 -799 -1830 -416 1367
2280 1367 1194 -501 -1413 -353 1063 913 -414 -1023 -254 847 672 -463 -877 -7 830 416 -636
2297 -636 -775 283 929 210 -858 -801 505 1167 158 -1149 -899 646 1409 261 -1342 -1147 726
2314 726 1705 354 -1578 -1407 767 1919 494 -1671 -1633 641 2086 720 -1618 -1820 403 2117
2330 2117 1030 -1483 -2082 93 2189 1380 -1320 -2324 -187 2243 1688 -1164 -2479 -483 2198 1933
2346 1933 -838 -2558 -790 1995 2144 -516 -2493 -1130 1726 2333 -127 -2411 -1459 1379 2389 178
2362 178 -2215 -1661 1062 2313 518 -1929 -1787 647 2160 791 -1611 -1799 305 1934 918 -1260
2378 -1260 -1688 119 1678 946 -911 -1418 0 1299 809 -678 -1107 -81 963 637 -528 -870 -15
$$ packed form
2264B65K381j182k968r25K204K447n90k777j108J906K160l36k276j031J414J783
2280A367j73j695r12J060J416j50j327o09P69J101j75j135m14Q70Q37m14j052
2297f36j39J058O46p19j068N7J306O62j009j307K50J545P63j148j603J95J873
2314G26R79j351j932J71K174J152j425k165L8K274J445j366k338k02K223J714
2330B117j087k513n99K175K096q09k700j004K137K430n55k852j315J996K681k65
2346A933k771j720J768K785J49k660j977J363K856O07k460k284R52K838J010k211
2362A78k393N54K723J251j795k447J42K434J513j369k402j88K104J629j016k178
2378a260m28J807J559p32j857n07J418J299m90j487m29J026J044l26j165l42Q55
$$ plain form
2395 -15 736 420 -515 -673 171 734 159 -702 -524 473 833 -101 -963 -454 761 1002 -225 -1258 -579
2414 -579 989 1273 -219 -1512 -794 1099 1577 -91 -1731 -1126 1058 1920 163 -1864 -1423 900 2085
2431 2085 509 -1778 -1761 611 2210 902 -1605 -2034 271 2231 1261 -1350 -2197 -123 2187 1566
2447 1566 -1159 -2285 -389 1964 1709 -822 -2242 -655 1693 1772 -476 -2079 -933 1367 1803 -139
2463 -139 -1933 -1137 1168 1856 10 -1787 -1161 990 1764 136 -1609 -1126 826 1594 226 -1353 -1028
2480 -1028 629 1407 357 -1129 -1062 496 1330 336 -1020 -986 382 1161 332 -959 -851 354 1034 201
2498 201 -853 -683 372 825 146 -782 -603 458 830 7 -841 -521 574 930 -133 -1039 -473 844
2516 844 1040 -273 -1282 -436 1059 1126 -338 -1428 -611 1128 1358 -277 -1562 -826 1074 1641 -48
$$ packed form
2395a5P51l16r35j58Q44N63n75q61J78R97L60r34q62N09J215K41j227j033O79
2414e79J568K84j492j293P18J893M78j668j640O05K184Q62j757k027M41K323J185
2431B085j576k287J7K372J599j308k507m29K305J960r70k611q47K074K310o21
2447A566k725j126J896K353k55k531j420J587K348P9k248j603J146K300M36j942
2463a39j794P96K305O88j846j797O26K151P74j628j745M83J952P68j368j579L25
2480a028J657P78j050j486O7J558Q34r94j356L4J368P79q29j291J08J205O80q33
2498B01j054J70J055M53o79r28J79J061L72q23q48L20J095L56j063r06N66J317
2516H44J96j313j009Q46J495O7j464j090Q17J739K30j635j285P36J900N67j689
$$ plain form
2533 -48 -1771 -1200 1007 1956 262 -1878 -1487 867 2100 565 -1737 -1818 549 2174 924 -1538 -1996
2550 -1996 139 2091 1300 -1203 -2152 -263 1942 1560 -887 -2129 -550 1711 1669 -573 -1992 -744
2566 -744 1427 1620 -246 -1709 -890 1082 1546 -46 -1493 -901 871 1399 86 -1315 -833 711 1227
2583 1227 52 -1137 -712 665 1007 -34 -1015 -574 605 889 -60 -931 -475 611 874 -136 -967
2600 -967 -438 710 871 -163 -1031 -442 851 945 -275 -1136 -405 919 1019 -292 -1219 -484 974 1071
2618 1071 -323 -1340 -529 995 1156 -249 -1404 -645 1023 1305 -231 -1487 -743 1019 1443 -162
2634 -162 -1544 -891 979 1550 12 -1593 -1055 958 1669 199 -1590 -1256 828 1815 395 -1584 -1448
2651 -1448 603 1893 601 -1489 -1639 369 1900 886 -1326 -1768 122 1799 1077 -1073 -1820 -148
$$ packed form
2533d8j723N71K207R49j694k140L91K354J233j535k302q1K367J625j250k462m58
2550a996K135J952p91k503r49J889K205l82k447j242J579K261m2k242j419J248
2566g44K171J93j866j463Q19J972M64j592j447N92J772N28j313j401M82J544N16
2583A227j175j189M25J377L42j041r81M41J179K84r49q71M56J086K63j010q31
2600i67N29J148J61j034q68N89J293R4j220q61P31J324J00j311r27P35J458R7
2618A071j394j017Q11J524J61j405j155P59J668K82j536j256P44J762M24j605
2634a62j382O53J870N71j538j605N38K013P11j470j789L34K084R87j420j979J36
2651a448K051J290j292k090j50K008J531j014k212m42J890J677p22k150p47J672
$$ plain form
2667 -148 1666 1236 -801 -1769 -392 1452 1292 -531 -1606 -542 1204 1310 -340 -1444 -575 989
2683 989 1154 -218 -1245 -542 841 982 -161 -1027 -446 742 794 -184 -876 -356 675 706 -307 -845
2701 -845 -166 749 583 -405 -888 -50 885 580 -560 -974 -12 1005 652 -688 -1117 -32 1171 785
2719 785 -748 -1330 -144 1273 968 -688 -1487 -250 1342 1191 -576 -1582 -486 1330 1350 -438 -1621
2736 -1621 -669 1206 1455 -236 -1609 -806 1058 1540 -38 -1570 -996 910 1609 137 -1508 -1146 753
2753 753 1599 296 -1403 -1223 580 1577 422 -1313 -1267 440 1561 538 -1187 -1312 323 1495 651
2770 651 -1055 -1318 232 1450 712 -908 -1248 112 1294 770 -826 -1235 18 1198 757 -707 -1170
2787 -1170 -52 1112 724 -610 -1092 -93 1012 672 -598 -991 -58 904 614 -545 -917 -34 905 556
$$ packed form
2667a48J814m30k037r68J377J844j60j823j075J064J746J06j650j104Q69J564
2683I89J65j372j027P03J383J41j143q66N81J188N2r78o92N20J031L1j013n38
2701h45O79R15j66r88m83Q38R35l05j140m14R62J017l53j340m29J085J203l86
2719G85j533n82J186J417l05j656p99J237J592j51j767j006J096J816K0j788j183
2736a621R52J875K49j691j373Q03J864M82j578j532N74J906O99j472j645L62J899
2753G53Q46j303j699J80J803R97j155j735M6J707J121j023j725j25J635J172q44
2770F51j706k63J550J218p38j620l40J360J182n24j596m09J253J180m41j464m63
2787a170J118J164l88j334m82R99J105l40j270l93R33R62k90j159l72Q83R39l49
$$ plain form
2805 556 -556 -897 37 927 528 -613 -876 79 975 483 -728 -976 166 1097 552 -826 -1077 174
2823 174 1236 603 -888 -1204 128 1368 724 -881 -1353 23 1430 921 -851 -1504 -156 1433 1097
2840 1097 -752 -1607 -339 1400 1278 -548 -1659 -580 1305 1395 -327 -1632 -812 1111 1525 -128
2856 -128 -1554 -940 940 1523 89 -1464 -1014 748 1480 269 -1266 -1041 612 1368 324 -1097 -1012
2873 -1012 450 1283 339 -989 -946 356 1149 317 -938 -880 333 1005 298 -886 -825 371 998 227
2891 227 -869 -778 426 1021 168 -869 -735 420 1029 176 -902 -735 462 1046 219 -940 -818 451
2909 451 1108 259 -988 -899 435 1182 267 -992 -944 444 1244 324 -1046 -1015 380 1265 380 -1044 -1077
2928 -1077 364 1289 458 -1007 -1158 313 1368 567 -999 -1242 246 1395 659 -994 -1307 144 1376
$$ packed form
2805E56j112l41R34Q90l99j141k63R55Q96m92j211k48J142R31n45j378k51J251
2823A74J062o33j491l16J332J240o44j605m72J376J407n09j772o53J348J589l36
2840A097j849q55J268J739j22j826j111J079J885R0j722j305Q20J923M14j653
2856a28j426O14J880N83j434j553M50J762P32j211j535K25J653P56j044j421Q5
2873a012J462Q33r44j328M3J302P93q32j255N8J213O72p07j184O1J196O27p71
2891B27j096R1J204N95q53j037J34J155O09q53j078J67J197N84q27j159J22J269
2909D51O57q49j247Q9J334P47r15j259M8J388Q00r20j370L1J395Q85q85j424l3
2928a077J441R25q31j465j51J471J055q01j566k43J488J149p36j653l13J451J232
$$ plain form
2945 1376 813 -878 -1367 -8 1391 947 -758 -1473 -182 1353 1085 -646 -1520 -383 1286 1219 -529
2962 -529 -1473 -487 1149 1235 -320 -1393 -585 961 1198 -147 -1293 -698 801 1141 -26 -1165 -689
2979 -689 670 1085 -4 -1063 -656 642 962 -36 -953 -539 576 879 -75 -903 -424 582 791 -110
2997 -110 -873 -375 653 813 -198 -959 -380 749 867 -260 -1048 -417 790 929 -279 -1147 -475 856
3015 856 990 -186 -1195 -605 806 1160 -74 -1263 -761 798 1312 58 -1270 -897 743 1382 123
3032 123 -1244 -952 669 1366 277 -1189 -1000 476 1331 381 -1088 -1087 351 1308 494 -971 -1153 248
3050 248 1290 578 -910 -1196 148 1228 648 -846 -1161 79 1183 717 -749 -1152 -59 1131 772
3067 772 -620 -1195 -102 1097 780 -556 -1141 -163 1018 776 -473 -1076 -205 928 776 -422 -1015
$$ packed form
2945A376n63j691m89J359J399m44j705p15J291J535k68j731q74J137J669o7j748
2962e29r44R86J636Q6j555j073Q08J546K37j345j146N95J499L40j167j139M76
2979f89J359M15j089j059M07J298L20r98r17M14J115L03r54q28M79J006K09r01
2997a10p63M98J028J60j011p61N79J129J18j127p88O31J207J39j208q68O72J331
3015H56J34j176j009N90J411L54j234j189N02J559N14j254j328L73J640O39j259
3032A23j367K92J621O97j089j466J89J476Q55r50j469JJ438R57q14j465j82J401
3050B48J042p12j488k86J344J080n80j494l15J240J104m66j466m03J093J190l59
3067G72j392n75J093J199l17j336n85R78J181k42j249o03Q71J133j52j198n93
$$ plain form
3084 -1015 -234 843 754 -364 -960 -225 817 714 -337 -917 -219 796 675 -386 -873 -152 798 659
3102 659 -403 -897 -131 817 597 -462 -918 -88 878 664 -464 -1015 -151 899 769 -463 -1126 -263
3120 -263 980 903 -438 -1224 -304 1003 1020 -384 -1302 -461 1003 1123 -264 -1302 -587 933 1193 -123
3138 -123 -1315 -742 788 1264 12 -1254 -833 668 1259 157 -1144 -936 516 1205 298 -1029 -970
3155 -970 363 1195 400 -893 -933 261 1127 442 -790 -931 167 1023 478 -706 -879 133 960 438
3173 438 -645 -864 109 893 435 -617 -795 138 870 377 -638 -759 119 839 340 -630 -759 160 842
3192 842 361 -626 -775 170 885 352 -639 -788 183 908 373 -697 -791 190 938 429 -693 -863 168
3211 168 970 458 -666 -921 86 1024 533 -645 -1017 21 1056 635 -649 -1061 -31 1090 703
$$ packed form
3084a015P81J077q9j118n96P35J042j03j051n80O98J015j21j061m87P21R50j39
3102F59j062m94P66R48k20j059m56Q30R66k14j128n51Q64J050j30j232o63Q63
3120b63J243p7j341p86R20J307J7j404r18Q41J464J20j387j038P15J520K60j316
3138a23j192N73J530M76j252j266M21J501N91j102j301K08J452O89r07j327N9
3155i70J333Q32p95j293m0J194Q66o85j232j41J098Q56n45j184j73J012Q27n22
3173D38j083k19R73P84m58j052j78R33P32m93j015j21Q78P20m99r70j29R19O82
3192H42m81r87j49R45P15n33r91j49R71P25n35j070r4R81P48n09j122j70J031
3211A68Q02n12j124k55J007R38m91j178l72J038J035m21j284m12J030J121l87
$$ plain form
3228 703 -626 -1166 -129 1059 798 -552 -1195 -231 1035 881 -486 -1220 -328 987 956 -359 -1191 -446
3246 -446 905 1000 -222 -1148 -556 789 1021 -75 -1079 -600 675 1045 22 -1015 -684 565 1036
3263 1036 99 -933 -708 433 944 141 -815 -665 344 864 149 -741 -638 342 770 143 -670 -558 335
3282 335 739 101 -650 -478 327 731 84 -653 -436 406 702 20 -692 -443 463 739 9 -754 -441 499
3302 499 804 -17 -862 -523 517 877 29 -921 -614 507 964 114 -942 -731 466 1025 220 -902
3320 -902 -816 378 1081 335 -849 -908 283 1076 477 -815 -1005 170 1135 550 -778 -1047 56 1076
3338 1076 616 -642 -1053 -26 1020 660 -552 -993 -116 942 688 -482 -1005 -165 842 724 -384
3355 -384 -978 -222 784 709 -289 -926 -298 733 733 -232 -867 -357 619 716 -193 -809 -364 586 702 -158 -768
$$ packed form
3228G03j329n40J037J188k61j350o43R64J266j54j367p34Q92J315l1j315q32P45
3246d46J351R5j222r26N92J345K32j096j004M79J275L70j023j037L31J249M71
3263A036r37j032K25J141N11q03r56J50J009N20p15q90J03R80M28o27q13J12Q93
3282C35M04o38p51J72Q05M04o47p37K17Q42K96o82p12K49R06K76p30p63L13R40
3302D99L05q21q45L39J040L60q48r50L07J121M57q50j056K11J197N59q05j122
3320i02Q6J194P03p46j184n9J191P93n99j292j90J175R65n85j328k69J103J020
3338A076m60j258m11J027J046l60j212m41Q77J058k54j170n23Q40J007j18j108
3355c84n94P56J006p5r98o37O28J031%r65o35N10R76R7r09o16M45R50J16q60o10
$$ plain form
3376 -768 -340 557 634 -142 -709 -290 526 616 -142 -678 -297 507 576 -159 -684 -250 533 565 -218 -686 -225
3397 -225 593 533 -272 -735 -195 631 549 -304 -801 -205 677 666 -332 -849 -269 712 745 -280 -951 -342 746
3418 746 860 -204 -1033 -456 750 1011 -81 -1051 -639 697 1099 65 -1046 -761 541 1140 199 -1004
3436 -1004 -827 420 1138 297 -910 -922 308 1064 439 -795 -948 153 974 450 -671 -901 59 876
3454 876 507 -525 -841 -3 809 487 -448 -749 -48 695 501 -397 -702 -62 683 477 -364 -661 -26 642
3474 642 409 -397 -677 13 659 383 -424 -660 33 659 360 -464 -640 43 672 350 -477 -652 91 669
3494 669 357 -491 -653 47 717 367 -513 -691 55 795 438 -502 -735 52 820 456 -515 -824 9 834
3514 834 557 -521 -901 -45 882 619 -492 -961 -135 900 713 -443 -1013 -235 858 795 -363 -1079
$$ packed form
3376g68M28Q97P7p76n67M19Q16R0p58n36L81Q04O9p35n25M34P83L2p83m68M61
3397b25Q18o0q05m63N40Q26q2q53m97N96Q82j1r98n17N80R81L3j025o71O09J088
3418G46J14j064q29N77J206K61j092r70M12J336M02j034j111K85J302N99r41j203
3436a004J77J247P18q41j207j2J230P56o25j234j53J101Q21n24j121k30R60Q17
3454H76l69j032l16Q38Q12l22r35l01P01P43j94q98l05O40P45k06q41k97O35O68
3474F42k33q06k80O90O46k76q07k36O93O26k99q24j76O83O29l22q27j75P43N78
3494F69l12q48j62P00O70l50q80j78P46P40l57r40k33P87P68l64r71l09Q33Q25
3514H34k77j078l80Q56R27k63j111m69Q26J035j87j156n70P78J093o3j158p16
$$ plain form
3532 -1079 -336 817 903 -236 -1086 -490 728 999 -118 -1070 -635 683 1023 24 -948 -676 538 978
3550 978 114 -869 -679 360 955 224 -746 -716 252 851 268 -638 -692 159 771 293 -537 -613 126 667 285
3571 285 -487 -547 120 581 186 -464 -480 163 537 134 -468 -404 242 588 78 -543 -389 347 612 21 -614
3592 -614 -381 391 656 31 -664 -414 417 724 41 -721 -497 433 798 87 -786 -578 394 862 150 -798
3612 -798 -689 322 930 249 -770 -767 246 960 369 -717 -872 162 975 488 -670 -940 53 949 576
3631 576 -582 -978 -52 926 668 -481 -978 -154 860 747 -360 -920 -252 807 755 -289 -918 -331
3649 -331 689 759 -220 -861 -378 595 752 -130 -814 -370 500 720 -49 -746 -414 414 660 4 -635 -408
3669 -408 387 599 8 -594 -372 335 565 -4 -531 -311 363 534 -29 -546 -305 375 505 -73 -553 -239
$$ packed form
3532a079P43J153Q6j139q50N96J218K71j117r52M35J318L40r99r72K72J214M40
3550I78q64r83J90J039N95p31r70L0R68N99n83r06n4Q51O12m78q30p6P39N41l82
3571B85p72o0O67M61l95o50j6O43L74m03o02O4O46L46n10o21J54P36K65n91o35
3592f14K33P72K65o25o95K50Q31L07o83p62K24R30L65p11q73K08R72M68p12r48
3612g98J09J011O08o81j019LJ013P14n91j086j55J034Q13m87j158k70R93Q96l73
3631E76j158l96R26R78k58j149m97Q24J014j13j107n60O68J059n2j044o29N87
3649c31J020P0r79o41M83R73J57q82o84M44Q70K20p69o97L32Q28K46o56o39K27
3669d08P95K12n91o02K22P07K30n69n27K20O74J71n63n17K41O80J30n78m80L14
$$ plain form
3689 -239 407 495 -137 -600 -216 491 492 -200 -657 -216 555 553 -234 -739 -268 586 629 -225 -797 -312 640 748
3711 748 -146 -872 -416 613 835 -79 -940 -538 626 941 19 -938 -679 526 1021 184 -914 -786 379
3730 379 1024 332 -832 -860 244 1048 454 -745 -952 145 996 532 -620 -932 10 904 574 -495
3748 -495 -882 -90 788 593 -402 -850 -141 697 585 -316 -749 -182 579 542 -254 -691 -184 525 481 -199 -601
3769 -601 -148 464 412 -240 -542 -106 488 407 -239 -534 -80 501 378 -307 -540 -12 550 346 -344 -594 4
3790 4 605 370 -391 -620 9 611 398 -393 -671 -28 692 439 -425 -744 -35 708 512 -394 -777 -59 743
3811 743 558 -400 -855 -150 783 694 -318 -913 -249 753 761 -264 -972 -359 724 839 -209 -1012 -461
3830 -461 678 936 -77 -1004 -595 593 972 72 -932 -703 458 987 206 -878 -761 342 972 292
$$ packed form
3689b39O46Q8o32m63L84P07Jo92m57M41P71kp87n05M71Q54M3q54n72M85R52J08
3711G48q94p26M56J029K22r14q61M02J164L15r22r57K59J205M95q37j098J28J165
3730C79O45o92j164k8J104Q04n94j199k07J097Q51m64j152l12R42Q94l30j069
3748d95l87P92Q78j95r95m48P09Q38j12r01m33N67P61l7p96m37N07P09m4o80m02
3769f01M53O12n2o52l02M36N94q1o46k95M54N81j23o85k33N28N62k04o90k50N98
3790DO01k35p61k29O29O02k13p91k78O43P20k53q64l19P09P43j96r06l83P18Q02
3811G43j85r58m55P05R33q9j012n95O64J002Qj025p08O13J083J15j048q03N51
3830d61J139K58j013r27M09J188L79r00j004K29J161N29p81j084J17J103O30o80
$$ plain form
3848 292 -737 -784 239 895 380 -629 -738 119 809 394 -511 -698 70 700 368 -425 -630 7 587
3867 587 338 -356 -518 -6 503 264 -316 -498 56 471 209 -355 -419 100 491 156 -400 -391 183 526 113
3888 113 -493 -422 282 637 119 -546 -487 280 681 140 -631 -549 296 760 235 -644 -655 253 819 298 -641
3909 -641 -738 179 859 370 -638 -842 114 880 467 -593 -880 -35 895 613 -527 -964 -116 868 673
3928 673 -431 -960 -229 822 758 -301 -954 -332 765 815 -226 -953 -410 652 846 -76 -883 -490 590
3947 590 855 3 -818 -549 470 794 68 -753 -558 400 749 135 -674 -534 288 665 123 -585 -493 209
3967 209 589 154 -502 -447 183 518 103 -411 -382 208 470 107 -411 -326 255 460 48 -438 -280 303 489
3988 489 -14 -515 -284 388 513 -77 -594 -342 437 587 -82 -681 -334 488 656 -83 -751 -414 467 743
$$ packed form
3848B92j029m7J023O56n15j009j09Q57O90m15r05j87P68O30l32p93k05O37N80
3867E87k49o94j62N12N09k39n80j82N54M15k62n64o4N19L91l35n56RN74L43m13
3888A13o06P1P04L55n18o65N9P67M01n41p71Q2Q45M64n25q79j1R08N66n21r39
3909f41r7R17O80m89j008k04R56P66m13j060k87Q45R30k82j140m37Q48R84j95
3928F73j104n29P31J051o4j059o53O22J097N0j041p27N43J062J94r22q07L93J080
3947E90K65q52q21K69J019L24p26q21J95R58L49o14q09J40Q22L77n42p08R2P02
3967B09L80m35o56N5O30L35m15n14K9N90K62l63n18Q5N81K05m12m86J58N83J86
3988D89n03n01K31O72J25n90n17K52P79J50o69n99L47Q22J68p39o68L37Q81K76
$$ plain form
4008 743 -4 -786 -552 448 860 126 -803 -656 366 917 223 -790 -729 303 944 353 -756 -835 194
4027 194 981 446 -641 -915 75 937 576 -515 -928 -40 872 630 -455 -910 -173 774 684 -331 -882
4046 -882 -245 681 683 -262 -833 -290 595 673 -159 -770 -318 507 625 -95 -655 -303 471 577 -90 -595 -287
4067 -287 406 502 -80 -534 -241 366 458 -66 -464 -184 380 387 -125 -486 -164 384 359 -186 -504 -133 452 384
4089 384 -233 -532 -102 518 408 -266 -633 -137 533 455 -305 -701 -131 612 541 -313 -776 -188 661 607 -244
4110 -244 -799 -250 669 723 -173 -835 -354 643 778 -101 -864 -466 578 873 6 -883 -589 493 929 104
4130 104 -841 -700 394 928 225 -804 -765 299 905 338 -695 -807 155 897 447 -602 -807 69 811
4149 811 466 -482 -761 0 727 480 -385 -722 -81 640 463 -311 -632 -56 572 420 -286 -560 -70 492
$$ packed form
4008G43p47p82K34J000M12p34r29J47J022N51o94j013O1J032O41n91j109p9J029
4027A94P87n35j087k74R90Q62l61j091m13Q88R12k42j085m55P37R47r0j015n51
4046h82O37R26Kr45n71N43Q85P8q32o11M52Q25J18p20n60L52P74J06o67n05L08
4067b87O93R6n82m54K93O07R2n24l98K80N64Pn12l61L22N48k5n45l18L71N85o8
4089C84o17k99M30O20j10o74l67M96O70p8p60l96N70P43p1q54m63N88Q49n4q51
4110b44n55N49R19N4q96o62M81R97J35q79p63L98J044K95q67q89K94J082M36q25
4130A04r45J41J094N34p03j029L9J064O06n67j033j12R62P42m50j049k05Q76P42
4149H11l45r48k79P61P27k47q65l37O41P21j77p74l21N76O28j52p06k74M90N62
$$ plain form
4169 492 351 -248 -507 -39 437 292 -254 -417 14 418 231 -331 -440 45 437 217 -356 -442 111 520
4189 520 208 -431 -474 125 596 252 -470 -537 130 666 278 -491 -624 97 727 388 -505 -736 54 769 473
4210 473 -508 -770 2 807 528 -459 -834 -87 778 607 -386 -879 -214 758 698 -297 -919 -306 691 793
4230 793 -194 -897 -389 634 835 -87 -843 -495 571 875 26 -824 -572 480 882 123 -768 -620 375
4249 375 838 193 -688 -640 248 779 226 -608 -616 184 709 251 -507 -583 109 616 240 -438 -508 116 562 219
4271 219 -396 -449 109 489 175 -364 -363 147 460 143 -363 -345 206 446 43 -426 -317 283 504 9 -543
4292 -543 -346 322 558 17 -576 -420 356 669 60 -636 -508 355 749 117 -707 -595 358 833 209 -732
4312 -732 -721 231 882 324 -689 -784 192 940 404 -632 -833 85 897 517 -532 -873 -52 892 606 -426
$$ packed form
4169D92j41n99k59M68M76j45n46j63M31M04j87n62j09M85L92k20n73q6N53M09
4189E20l12o39m3N99M71l44p22o7O67N36l88p69j33P21O30l39q93k31P90P15k96
4210D73r81k62P72Q05k79r87l75P47Q65j71r93m93O65R72o0r95o22O13R97J02
4230G93r87p03N08J023K01r22p56L48J066L04q49q50K52J052M02p59q91J48R95
4249C75M63o45q81M8Q88N31n53q34qQ00N25m58p58p6O92N07l76o78p0O24M46l43
4271B19o15n3N58L80l14n39JN10L13l17n06J8N51K40m03m69J09O00K21m95n52
4292e43J97O68K36n41n93J56P76L13o09o96J28Q63L94o32q24J12R53M75o24r41
4312g32J1R52O51n58j013r5R76P48n36j036k01R18Q12l80j049l41Q21R44k86j032
$$ plain form
4332 -426 -923 -130 810 701 -339 -899 -267 748 736 -277 -883 -314 664 722 -168 -859 -392 565 721 -107
4352 -107 -784 -403 487 694 -32 -683 -398 410 657 -28 -656 -367 365 606 -6 -581 -349 336 580 13
4372 13 -506 -337 326 514 -8 -501 -277 351 471 -52 -476 -223 346 435 -100 -524 -215 383 449 -131 -547
4393 -547 -202 430 495 -153 -661 -247 522 599 -185 -712 -298 562 674 -139 -766 -331 597 763 -94 -828 -451
4414 -451 555 847 -21 -848 -570 512 906 99 -840 -672 416 965 193 -794 -753 308 954 358 -718
4433 -718 -822 173 926 452 -635 -889 49 890 516 -549 -844 -49 810 572 -412 -815 -100 715 566
4452 566 -321 -749 -140 613 552 -249 -679 -160 582 515 -192 -616 -165 527 487 -208 -578 -172 473 414 -227
4473 -227 -542 -103 440 366 -240 -508 -70 466 311 -291 -493 -43 460 313 -281 -522 3 516 347 -321
$$ packed form
4332d26m97P93R40j09j040n60O32J015j2j013o06N69R78N8q90o91M67R57J56q28
4352a07o77L81Q90K07p26o51K85Q08K47o85o28K89P32K41o12n75K32O85K44n67
4372A3n19J69O63J88n22m93K24O28J20n23m24K53N69Q9n35m24L09N98O6n80m16
4393e47L45O32O5o48n08M14P69P7p84n27M14Q60J12q13o27M35R28J66q57p34L77
4414d51J006K92q68q27K78J082L94q07r39J68J088N49p72r87M1J061O46n96j076
4433g18j04R95P53m74j087k54R38Q41l74j065k95P95Q59k38r84m03P15Q15j49
4452E66q87m28O09P53o1q01m30N19P42o7p07m24M51O92m0o95l70M06O45n9o41
4473b27l15M39N43p4o06k68M38N36j55o02k02M50N03j47n94k41N25N13j69o68
$$ plain form
4493 -321 -581 -35 576 392 -347 -633 -35 634 482 -334 -722 -84 694 525 -363 -793 -141 699 604 -327
4513 -327 -841 -239 690 636 -273 -897 -331 688 741 -202 -870 -401 619 797 -104 -897 -508 557 858 -11
4533 -11 -876 -545 486 882 119 -809 -657 374 904 175 -738 -656 294 868 244 -645 -727 203 816 338
4553 338 -580 -707 149 724 347 -495 -664 50 657 353 -427 -611 11 584 341 -356 -539 -2 525 278
4573 278 -346 -482 61 496 228 -359 -444 126 492 181 -393 -436 160 523 160 -421 -444 175 553 172 -492
4594 -492 -477 199 625 186 -538 -557 213 688 222 -573 -625 180 758 312 -608 -739 111 828 386 -582 -808
$$ packed form
4493c21k60N46O11j84p39k86N98O69j52q16l88O38P78j69q88m30O52Q40r5r31
4513c27n14O02R29n4r09o24N66J019N3r43o68M69J020J78r01p93L89J065L01q69
4533a1q65L31J031L96p63r28J52J031N30p29r13Q2R50N74o24q89q2R30O13m78
4553C38r18j27Q56N75l77q42j69P14O07l04p80j84O22N73k43o97j83N37N27k47
4573B78o24j36N43M35k68n87q5N70L66l11n74m3N96L63l63n81k3O19L78l81o64
4594d92J5O76M26m39p24j9P70M75m66p95n2Q05N78m46r20j31Q50P17m42r68k26
$$ [...]
8191B28
##END NTUPLES=NMR FID
##END=
