##TITLE=1H_AM_NV28
 CDCl3
 8 sc, 
 15.11.2022
##JCAMPDX= 6.0         $$ Bruker NMR JCAMP-DX V2.0
##DATA TYPE= NMR FID
##DATA CLASS= NTUPLES
##ORIGIN= UXNMR, Bruker Analytische Messtechnik GmbH
##OWNER= root
$$ XWIN-NMR		Version 3.5
$$ Tue Nov 15 16:26:47 2022 Russian Standard Time (UT+4h)  she@DPX200
##.OBSERVE FREQUENCY= 200.1313499994
##.OBSERVE NUCLEUS= ^1H
##.DELAY= (6, 6)
##.ACQUISITION MODE= SIMULTANEOUS
##.ACQUISITION SCHEME= undefined
##.AVERAGES= 8
##.DIGITISER RES= 18
##SPECTROMETER/DATA SYSTEM= spect
##.PULSE SEQUENCE= zg30
##.SOLVENT NAME= Acetone
##.SHIFT REFERENCE= (INTERNAL, Acetone, 0, 15.7039)
##AUDIT TRAIL= $$ (NUMBER, WHEN, WHO, WHERE, WHAT)
$$ ##TITLE= Audit trail, XWIN-NMR		Version 3.5
$$ ##JCAMPDX= 5.01
$$ ##ORIGIN= Bruker BioSpin GmbH
$$ ##OWNER= she
$$ F:/spectra/data/she/nmr/H-F/1/audita.txt
$$ ##AUDIT TRAIL=  $$ (NUMBER, WHEN, WHO, WHERE, WHAT)
(   1,<2022-11-15 16:25:21.31 +0400>,<she>,<DPX200>,
      <created by zg, POWCHK disabled, PULCHK disabled
       configuration hash MD5:
       00 E9 B6 7A A2 85 ED C7 34 08 36 98 17 FE 4E 26
       data hash MD5: 16K
       B9 CE 73 45 B2 85 7C 92 27 24 DB 72 E9 88 CE F3>)
$$ ##END=
$$ 
$$ hash MD5
$$ A3 5A 53 B4 21 3B 49 36 22 82 DD E5 2C B8 A7 BF
##$RELAX= 
##$RELAX= 
##$RELAX= 
##$RELAX= 
##$RELAX= 
##$RELAX= 
$$ Bruker specific parameters
$$ --------------------------
##$DU= <F:/spectra>
##$EXPNO= 1
##$NAME= <H-F>
##$PROCNO= 1
##$TYPE= <nmr>
##$USER= <she>
##$AMP= (0..31)
100 100 100 100 100 100 100 100 100 100 100 100 100 100 100 100 100 100 
100 100 100 100 100 100 100 100 100 100 100 100 100 100 
##$AQSEQ= 0
##$AQ_mod= 1
##$AUNM= <au_zg>
##$AUTOPOS= <>
##$BF1= 200.13
##$BF2= 200.13
##$BF3= 200.13
##$BF4= 200.13
##$BF5= 200.13
##$BF6= 200.13
##$BF7= 200.13
##$BF8= 200.13
##$BYTORDA= 1
##$CFDGTYP= 0
##$CFRGTYP= 5
##$CHEMSTR= <none>
##$CNST= (0..31)
1 1 145 1 1 1 1 1 1 1 1 1 1 1 1 1 1 1 1 1 1 1 1 1 1 1 1 1 1 1 1 1 
##$CPDPRG= <>
##$CPDPRG1= <>
##$CPDPRG2= <>
##$CPDPRG3= <>
##$CPDPRG4= <mlev>
##$CPDPRG5= <mlev>
##$CPDPRG6= <mlev>
##$CPDPRG7= <mlev>
##$CPDPRG8= <mlev>
##$CPDPRGB= <>
##$CPDPRGT= <>
##$D= (0..31)
0 1.2 0 0 0 0 0 0 0 0.06 0 0.03 0 0 0 0 0.0002 0 0 0 0 0 0 0 0 0 0 0 0 
0 0 0 
##$DATE= 1668515120
##$DBL= (0..7)
120 120 120 120 120 120 120 120 
##$DBP= (0..7)
150 150 150 150 150 150 150 150 
##$DBP07= 0
##$DBPNAM0= <>
##$DBPNAM1= <>
##$DBPNAM2= <>
##$DBPNAM3= <>
##$DBPNAM4= <>
##$DBPNAM5= <>
##$DBPNAM6= <>
##$DBPNAM7= <>
##$DBPOAL= (0..7)
0.5 0.5 0.5 0.5 0.5 0.5 0.5 0.5 
##$DBPOFFS= (0..7)
0 0 0 0 0 0 0 0 
##$DE= 6
##$DECBNUC= <off>
##$DECIM= 32
##$DECNUC= <off>
##$DECSTAT= 4
##$DIGMOD= 1
##$DIGTYP= 9
##$DL= (0..7)
0 120 120 120 120 120 120 120 
##$DP= (0..7)
150 150 150 150 150 150 150 150 
##$DP07= 0
##$DPNAME0= <>
##$DPNAME1= <>
##$DPNAME2= <>
##$DPNAME3= <>
##$DPNAME4= <>
##$DPNAME5= <>
##$DPNAME6= <>
##$DPNAME7= <>
##$DPOAL= (0..7)
0.5 0.5 0.5 0.5 0.5 0.5 0.5 0.5 
##$DPOFFS= (0..7)
0 0 0 0 0 0 0 0 
##$DQDMODE= 0
##$DR= 18
##$DS= 0
##$DSLIST= <SSSSSSSSSSSSSSS>
$$ [...]
##$SUBNAM2= <"">
##$SUBNAM3= <"">
##$SUBNAM4= <"">
##$SUBNAM5= <"">
##$SUBNAM6= <"">
##$SUBNAM7= <"">
##$SUBNAM8= <"">
##$SUBNAM9= <"">
##$SW= 18.0517283424941
##$SWIBOX= (0..15)
0 0 2 0 0 0 0 0 0 0 0 0 0 0 0 0 
##$SW_h= 3612.71676300578
##$TD= 16384
##$TD0= 1
##$TE= 0
##$TE2= 300
##$TE3= 300
##$TEG= 300
##$TL= (0..7)
0 120 120 120 120 120 120 120 
##$TP= (0..7)
150 150 150 150 150 150 150 150 
##$TP07= 0
##$TPNAME0= <>
##$TPNAME1= <>
##$TPNAME2= <>
##$TPNAME3= <>
##$TPNAME4= <>
##$TPNAME5= <>
##$TPNAME6= <>
##$TPNAME7= <>
##$TPOAL= (0..7)
0.5 0.5 0.5 0.5 0.5 0.5 0.5 0.5 
##$TPOFFS= (0..7)
0 0 0 0 0 0 0 0 
##$TUNHIN= 0
##$TUNHOUT= 0
##$TUNXOUT= 0
##$USERA1= <user>
##$USERA2= <user>
##$USERA3= <user>
##$USERA4= <user>
##$USERA5= <user>
##$V9= 5
##$VALIST= <valist>
##$VCLIST= <CCCCCCCCCCCCCCC>
##$VD= 0
##$VDLIST= <DDDDDDDDDDDDDDD>
##$VPLIST= <PPPPPPPPPPPPPPP>
##$VTLIST= <TTTTTTTTTTTTTTT>
##$WBST= 1024
##$WBSW= 4
##$XGAIN= (0..3)
0 0 0 0 
##$XL= 0
##$YL= 0
##$YMAX_a= 754284
##$YMIN_a= -1043091
##$ZGOPTNS= <>
##$ZL1= 120
##$ZL2= 120
##$ZL3= 120
##$ZL4= 120
##$ABSF1= 10
##$ABSF2= 0
##$ABSG= 5
##$ABSL= 3
##$ALPHA= 0
##$AQORDER= 0
##$ASSFAC= 0
##$ASSFACI= 0
##$ASSFACX= 0
##$ASSWID= 0
##$AUNMP= <proc_1d>
##$AZFE= 0.1
##$AZFW= 0.1
##$BCFW= 1
##$BC_mod= 2
##$BYTORDP= 1
##$COROFFS= 0
##$CY= 11.3945322036743
##$DATMOD= 1
##$DC= 2
##$DFILT= <>
##$DTYPP= 0
##$F1P= 2.36226072786647
##$F2P= -0.459571619588291
##$FCOR= 0.5
##$FTSIZE= 0
##$FT_mod= 4
##$GAMMA= 1
##$GB= 0.15
##$INTBC= 1
##$INTSCL= 1
##$ISEN= 128
##$LB= 0.24
##$LEV0= 0
##$LPBIN= 0
##$MAXI= 10000
##$MC2= 0
##$MEAN= 0
##$ME_mod= 0
##$MI= 1.114404
##$NCOEF= 0
##$NC_proc= 0
##$NLEV= 6
##$NOISF1= 3.799351
##$NOISF2= 2.8
##$NSP= 1
##$NTH_PI= 0
##$NZP= 0
##$OFFSET= 15.70392
##$PC= 1
##$PHC0= -18036.92
##$PHC1= 20.2007
##$PH_mod= 1
##$PKNL= yes
##$PPARMOD= 0
##$PSCAL= 0
##$PSIGN= 0
##$REVERSE= no
##$SF= 200.130013532006
##$SI= 16384
##$SIGF1= 3
##$SIGF2= 2
##$SINO= 400
##$SIOLD= 16384
##$SREGLST= <1H.CDCl3>
##$SSB= 0
##$STSI= 0
##$STSR= 0
##$SW_p= 3612.71676300578
##$SYMM= 0
##$S_DEV= 0
##$TDeff= 0
##$TDoff= 0
##$TI= <>
##$TILT= no
##$TM1= 0
##$TM2= 0
##$TOPLEV= 0
##$USERP1= <user>
##$USERP2= <user>
##$USERP3= <user>
##$USERP4= <user>
##$USERP5= <user>
##$WDW= 1
##$XDIM= 8192
##$YMAX_p= 0
##$YMIN_p= 0
$$ End of Bruker specific parameters
$$ ---------------------------------
##NTUPLES= NMR FID
##VAR_NAME=  TIME,          FID/REAL,        FID/IMAG
##SYMBOL=    X,             R,               I
##VAR_TYPE=  INDEPENDENT,   DEPENDENT,       DEPENDENT
##VAR_FORM=  AFFN,          ASDF,            ASDF
##VAR_DIM=   8192,          8192,            8192
##UNITS=     SECONDS,       ARBITRARY UNITS, ARBITRARY UNITS
##FACTOR=    0.0002768,     1,               1
##FIRST=     0,             0,               0
##LAST=      2.2672688,     0,               0
##MIN=       0,             -1043091,        0
##MAX=       2.2672688,     754284,          0
$$ Real data points
##PAGE= N=1
##DATA TABLE= (X++(R..R)), XYDATA
$$ [...]
2336A384K618j999m191k170K912M367J092l787m109R3M327L782j160m863k858
$$ 1384 4002 2003 -2188 -4358 -1446 2921 4013 226 -3883 -3790 537 4319 3159 -1704 -4562
2351d562K368M606K291l082n172r46M205M688j96m795m108J356N176L320k373
$$ -4562 -2194 2412 4703 1621 -3551 -4497 -292 4396 4200 -595 -4703 -3347 1829 5149 2776
2366B776n325k593L167N429J725m313n665j56N383N050j416o113l880K866O316
$$ 2776 -2549 -5142 -1975 3454 5179 866 -4799 -4955 428 5478 4062 -2051 -5931 -3065 3251
2381C251K471l830o111j126M819N602j98n295n019J280O162L972k706o257k975
$$ 3251 5722 1892 -4219 -5345 -526 5076 4878 -417 -5436 -4156 2006 5978 3272 -2985 -5960
2396e960M115O131J148n010n330Q4N556M765j655n809l787K600O139K628m071
$$ -5960 -1845 4286 5434 424 -4906 -4822 734 5499 3844 -1965 -5752 -3152 2987 5615 1544
2411A544n549j016M546N165l67n151l907J455M896L224k025n537k060L205N104
$$ 1544 -4005 -5021 -475 4690 4323 -828 -4735 -3280 1616 4840 2815 -2722 -4782 -1577 3527
2426C527J235m335m652O30M648L253j400m670k636K616M098J187k307m071q76
$$ 3527 4762 427 -4225 -3595 1053 4306 2906 -1764 -4400 -1784 2314 3501 1194 -2877 -3753
2441c753L298L676k9l570l460J066M350K123j981l716j618K671L804M21l084k999
$$ -3753 -455 3221 3192 -378 -3838 -2772 1578 3701 1720 -1996 -3614 -943 2861 3282 198 -2801
2457b801J08L267K958j326l526k393K034M079J117k833l506l49L221L286p17l746
$$ -2801 -2693 574 3532 2206 -1320 -3713 -1679 2400 3517 684 -2822 -3171 50 3336 2619 -1127
2473a127k628J610L777K152k255l991j042L038L883n1m136k825J282M206J941
$$ -1127 -3755 -2145 1632 3784 1529 -2462 -3504 -466 3417 3366 -770 -3595 -2313 1893 3834
2488C834k167m071j252K913L945R3l456l435L77M242L237j629n010k222L097M893
$$ 3834 1667 -2404 -3656 -743 3202 3295 -161 -3596 -3219 1023 4260 2631 -2379 -4601 -1504 3389
2504C389O26l732m109J9M592L513j389m481k784K064M695K372l312m785j010L989
$$ 3389 4015 283 -3826 -3807 785 4298 2909 -1572 -4356 -2292 2403 4775 1463 -3322 -4332 -343
2520c43M685m92m732l552J362N032K538k464m951j561L413M284P62l912m054K43
$$ -343 4342 3850 -882 -4434 -3072 1960 4498 2034 -2917 -4478 -1065 3219 3981 69 -3985 -3742
2536c742M434L673j587m542k591K301M550J692l106m420m28L482L749j82l707
$$ -3742 692 4365 2778 -1764 -4355 -2054 2496 4188 1082 -3338 -3766 -284 3465 3283 -424
2551d24l336R80M208K493j655m176k017K473M090J065l190l769j51L910K891q70
$$ -424 -3760 -2780 1428 3921 2266 -1910 -3927 -1454 2636 3701 511 -3258 -3409 501 3392 2522
2567B522l560k463J194L841K068k010l766j388K698L661O03l240l294K81L615
$$ 2522 -1038 -3501 -2307 1534 3602 1592 -2174 -3562 -864 2797 3400 160 -3134 -2853 762
2582G62K972j520l719j923K086L484J222k775l235l05L100K667l86l217k476J193
$$ 762 3734 2214 -1505 -3428 -1342 2142 3364 589 -2646 -2951 149 2816 2430 -787 -3263 -2070
2598b070L496J743k106l370r65K967L234l11l304k459J249L226J635j707k983
$$ -2070 1426 3169 1063 -2307 -3272 -305 2929 2618 -686 -3145 -1896 1330 2965 1258 -1725
2613a725j362K442L179K00k806k757O44L231K168j488l533j235K383L062L95k863
$$ -1725 -3087 -645 2534 2734 -72 -2829 -2185 1046 3214 1726 -1807 -3042 -659 2403 2798 -65
2629f5k941P43L040J981j192l249j243K055K769R39k563k819Q3L184K266q95l196
$$ -65 -3006 -2263 777 2758 1566 -1683 -2926 -871 1898 2837 274 -2545 -2462 722 2988 2093 -1103
2646a103j844J784L281P19k383k642k15K714K334n16l008j910Q65L041J640j595
$$ -1103 -2947 -1163 2118 2837 454 -2188 -2403 311 2645 2129 -879 -2789 -1924 1117 2757 1162
2662A162l070r50K117L121K90k955k400M69K866K179j151k927j449J491K834J036
$$ 1162 -1908 -2858 -741 2380 2670 -285 -2685 -2216 650 2829 1678 -1249 -2698 -1207 1627 2663
2678B663j809k758n63K139K852L8k775k619Q01L037J854j266l453j231K222K757
$$ 2663 854 -1904 -2467 -328 2524 2562 -213 -2832 -2031 1006 2860 1594 -1859 -3090 -868 1889
2694A889O80k160k800j70K559K445k72k835k461J110L475J440j655l270j039K600
$$ 1889 2569 409 -2391 -2561 -2 2443 2171 -664 -3125 -2015 1460 2900 1245 -2025 -3064 -464
2710d64K937J77k598k711L50L161K039j339l015j365J561L174P92k170l044k19
$$ -464 2473 2650 52 -2659 -2309 852 2891 1552 -1463 -2828 -1267 1907 2699 529 -2515 -2734
2726b734K996K361p29k987j618J183L034J147k005k497n32K033K540m1k517j843
$$ -2734 262 2623 1894 -1093 -2711 -1528 1506 2653 648 -1849 -2381 -348 2192 2151 -366 -2209
2742b209O33K720J170j400k541m67J842K139o4k078j494L13K214J078j000k102
$$ -2209 -1576 1144 2314 914 -1627 -2094 -252 1887 1823 -255 -1749 -1436 778 1856 856 -1246
2758a246n21J386J611K56j667j333J98J646J327o58j863p56J014J795K79j381
$$ -1246 -1767 -381 1230 1486 -181 -1514 -1316 330 1657 999 -864 -1620 -606 1189 1468 87
2774H7j345J34J690Q75m62j551p01O50J351Q77j106j328n63J235J380j16j350
$$ 87 -1258 -1124 566 1441 979 -572 -1273 -623 728 1605 499 -829 -1392 -157 1223 1107 -243
2791b43j364M89J729P96q48j643l93J038J771k7j390j304J62J580J295m20j912
$$ -243 -1607 -1118 611 1407 559 -1084 -1477 -439 1332 1305 -85 -1389 -1227 353 1648 1228 -684
2808f84j042R43J849P36j430j585l31J339J910o0j965j550N68K044J318j120k178
$$ -684 -1726 -783 1066 1802 372 -1213 -1544 -205 1705 1645 -320 -1870 -1302 742 2060 940 -1238
2825a238p12J381K180K97k026j912M91K167J296l75k383j243J114K202P11j458
$$ -1238 -1950 -569 1611 1908 -118 -2030 -1539 628 1924 1549 -834 -2077 -963 1239 1950 492
2841D92j934m88K103J861k41k399j435O99K311R46j202j933q80J725J962k5j647
$$ 492 -1442 -1930 173 2034 1793 -606 -2041 -1342 969 1915 713 -1220 -2100 -375 1587 1562 -85
2858h5j619K19J846J390p78j862p34J012J646N20j178j576k07J293J574k43j665
$$ -85 -1704 -1485 361 1751 973 -889 -1623 -611 1035 1555 377 -1199 -1406 -113 1461 1218 -447
2875d47j122Q17J368P90p83j566k20J078R33O3j027r36K43Q50P47n3j064o76M92
$$ -447 -1569 -752 616 1406 623 -943 -1163 -85 848 911 -116 -1052 -809 41 788 735 -329 -1005 -513
2894e13R75M37m67j114j36P61Q69j26p18o42L89M88J48K21p99o24O34P18rk84
$$ -513 462 899 432 -682 -818 -57 812 686 -32 -674 -285 203 351 572 -227 -851 -217 501 492 208
2914B08p61j73P39P23m18n99m87L14P56M01n96o94r8P60P59l21p47l93L57Q47
$$ 208 -553 -726 13 736 318 -281 -768 -454 302 703 107 -587 -685 75 834 513 -234 -627 -270 577
2934E77K35p08q04J07P10P82o3j143o64P08P59L53n82j232P4R73Q77j47j216q22
$$ 577 812 104 -700 -593 117 899 836 -307 -971 -263 496 849 267 -965 -891 82 959 812 -404 -1226
2954a226N94J185N67r46j115j09J138J085l57j176p66O00J004P27q24j056k46
$$ -1226 -632 553 1120 174 -941 -1050 88 1173 816 -360 -1126 -526 478 1205 381 -675 -921
2971i21P29J184nj195q24K19J137R38o70j306l35Q98R90J04j082q34K41Q70O67
$$ -921 -192 992 987 -208 -1032 -813 324 1262 592 -714 -1049 -151 839 943 -139 -973 -732 138 805
2990H05k14q30o41M64P68N06l51j121k49P27R28j07o82n13J14M92L93L3n58l54
$$ 805 591 -239 -880 -416 352 858 507 -614 -863 -136 792 685 3 -510 -396 96 489 522 -36 -390
3010c90nO58L25k21p23m54N13O26J97l85p31j6L71N12K29m05p98J09P80M71r3
$$ -390 -395 263 588 367 -356 -810 -297 329 526 141 -590 -606 -235 277 506 101 -697 -588 192 663 570
3031E70q49l95M37O31N81q37n21J00K35M50K26n20n79l5O96K18l3o41m32L30P88
$$ 570 -279 -674 -237 394 975 138 -383 -283 -48 402 628 108 -471 -506 190 408 375 -266 -698 -368 420
3052D20J02p04l36K64M40J49l27r8j14J24M69j53j26l61M4L83M16l74n55N9M18
$$ 420 522 -182 -518 -254 186 335 8 -90 -204 -80 389 236 110 -251 -207 176 592 218 -337 -278 140
3073A40J20j31m22pL35K12j48k50j76P6O09r8k20l00j10M48L45k88l53k59L35
$$ 140 260 129 -293 -300 35 247 99 -151 -327 -251 358 260 40 -260 -370 78 423 135 -218 -477 -142
3094a42O00j25l81l73J94L58M54m43m15q1K64N28p1n11k55J94K49L63k69k50k14
$$ -142 458 333 -48 -421 -227 131 585 142 -273 -354 -90 438 367 -144 -399 -205 44 407 138 -112 -326
3115c26Q5L77J09k06m84L23J81Q1P9j93k08K47P6m9O8jk93o4K45J63q8O2m61K20
$$ -326 -241 136 245 39 -445 -122 59 140 219 26 -182 65 141 92 160 159 -134 -198 47 210 122 184 -277 -57
3139e7L1J5K66k31l23J12K62J73L4k64l46J1L88K42km80n05O51L88O1m35l79J40
$$ -57 -26 -11 255 24 -299 -187 75 248 282 18 -328 -317 71 313 311 -169 -674 -23 365 426 -9 -388 -248
3162b48N08K85n32N6l71K23K01L38k65m64j38J89O36j09n62j66K18J98M25l82
$$ -248 260 545 13 69 -302 -79 122 460 195 -269 -407 -218 418 309 -253 -419 -201 -3 422 40
3182D0k84J66Q9K48r6j06k68J31R8O8m2j41J37p8J98J3Q4k70J89k30No5K85M6
$$ 40 -244 -78 11 259 163 57 -211 -80 18 86 44 -97 40 -38 160 173 257 -13 176 -54 -49 -114 171 217
3206B17j81k51J14n9K06Q6j87l59L80L31pj83l38M1O2P59j92l79l01l2M54M50
$$ 217 36 -215 -101 -160 46 132 -55 -414 -34 297 290 107 -231 -190 -128 631 439 60 -241 -273 181 631
3228F31k14n51k69N17M05j17o02j35OM32K61j60l84l6M6L46J6k44k67j34N37J28
$$ 631 417 -134 -403 114 519 402 -200 -335 -329 103 364 204 -180 -216 -170 176 192 -52 -319 -453 84 212
3250B12R7l36k18K62K46mm41K6J38p0J17Q0r5N3j65K8P2O9j27J91r4j43j20J23
$$ 212 309 -27 -245 17 263 259 -182 -156 -18 -88 29 109 14 67 -98 -70 2 71 -56 135 41 -102 -222 -99
3274i9J31k7o9k45K55P1J65j00k34J1R9J35J35k66k91K25J26J91j06k28R5J00
$$ -99 32 5 -64 -309 -54 17 182 82 -152 -141 -42 93 228 -38 -329 -104 22 213 107 -121 -26 74
3296G4J69m8l19j13J32L60j3r6l81K0M9N31j29k20k01K17n6J67k49j25J94O3j7
$$ 74 243 195 -124 -237 -105 255 242 146 -235 -215 -166 365 236 16 -185 32 -24 143 -106 -231 -37 26 9
3319IQ4m2j59J31R4o6Rl7P1k2p4k08K73Q4Qj02k82J69K02J73j98l54r0K65L60
$$ 9 93 51 -108 23 117 51 60 23 94 72 -2 -210 63 147 155 53 -229 -60 142 315 117 -237 -327 -62 298
3344B98n9k61m44L04L54J05m7k64l87K15N93J42n92n4n8K58K24k8m05k77Q8O15
$$ 298 239 -22 -466 -162 192 297 250 -14 -401 -186 407 549 -43 -97 -155 103 327 299 -106 -383 -295 320
3366C20m6m40k56j10N66J30R2m24j98Q8M16l8jl19l8J37M05q2k54j62J00J37J58
$$ 320 274 -166 -422 -532 34 164 256 -168 -366 -278 138 100 99 -220 -258 -121 284 202 -52 -214 -114 23 181
3389A81j15j06K6N4J4k43QL30k11r2J09j1R3Q5q6r7j31L2K17J2k07k16J39L71
$$ 181 66 -40 -14 40 54 -189 -181 149 -62 -154 -45 -56 37 122 36 -61 -192 -160 57 69 -138 -354 -215 156
3413A56Q4j70m01O2L12K51j52j29k59K29K76m9n1m38P7K34J88L8k82j79K9L43
$$ 156 240 70 -331 -269 43 294 142 13 -246 -17 259 210 159 -279 -202 32 220 258 -24 -203 -174 169
3435A69P7j67k71o1K33J49N2j83k09j0K03j6N0k1p6J33qkJ5j63M7L20l33K9O6
$$ 169 246 79 -192 -253 -20 129 181 -2 -211 -221 -18 -34 16 -5 -81 52 44 42 57 -106 -59 261 -72 -43 23
3460B3J43P3l11j4l2K63O7l11l28K99L87m6j59k98L6m2M68R4l59j19j86N30K54
$$ 23 166 239 -72 -86 -118 145 212 -99 -427 -128 259 213 54 -244 -208 -250 218 312 -47 -166 -352 178 432
3483D32j85m51r7K91L15Q6m15l44M1N03M6l0l09l45L15M70N5n77k28J59L85J05
$$ 432 247 -204 -301 -10 305 391 -24 -368 -327 176 222 192 -117 -462 -147 323 378 -199 -427 -268 117 222
3505B22j99q3l07M12K13j77k10M9p8J73J83k51o4j87J64K23l5j89K30k08M12k6
$$ 222 23 -60 -367 45 258 81 -129 -80 -158 15 198 -53 -117 -304 -140 83 48 -141 89 -119 293 267
3527B67n17o4K12K35K1j60l62J61M71p7l07k9j4Q6K18k9j24j61p0K87M0j20k45
$$ 267 -250 -314 -102 133 154 -6 -368 -207 264 187 -120 -149 -163 -77 141 112 -12 -173 -243 44 84 -36 -281
3550b81J7N09p8Q3l61n9J93J79N6k33j68j03K46O4J04k06r6j2QL52j64j78J08
$$ -281 -264 245 167 250 -111 -170 23 202 258 25 -143 -246 0 64 168 -38 -134 -146 -138 214 50 -128 -20
3573b0k32L97kn5Nj36j45L06J13p3k23k41K82P5J81p8k37k58L42J01J08k40k73
$$ -20 -252 145 143 88 93 -43 -188 118 231 158 -65 -306 -24 51 232 154 -83 -341 1 102 210 -30 -303
3596c03m1K88J87J57l92l62J55L30L43k17m07k17L74M95J58p08l63Q8N61L72j91
$$ -303 -344 -56 131 288 -104 -466 -311 19 362 145 -262 -479 -105 390 548 -160 -523 -435 126 498 307
3617C07m69l53N65M48K3m81m46j03O50L07j28p22p3K54M82Q9l40n16O2N15N37
$$ 307 -162 -515 50 498 521 40 -406 -509 141 448 320 -402 -475 -221 261 350 10 -506 -444 71 608
3638F08p0m92m98J79O19r2j94l43k52N84M07k68k43k71L15J35L05l77l91K7M24
$$ 608 538 46 -452 -273 346 254 60 -283 -535 49 456 188 -55 -326 -11 124 429 52 -339 -312 112
3659A12J21k22q0j20K21p1Rm6j4j32J32J87Q2l37j92K75K31m3J1j76j07Q4J92
$$ 112 233 11 -69 -189 32 -39 -30 -76 -90 -222 -90 97 179 -158 -350 -75 156 113 124 -52 -159 -75 117
3682A17J67k14k06J6J05K36O3k78k64K71j21L72j79k23o5%L46K25l48l22j08L69
$$ 117 284 70 -136 -120 -15 221 284 6 -258 13 -108 264 85 -138 -203 -203 143 368 20 -302 -410 -41
3704d1M47j40l02l14J40M08K60l18m59k9L15M23O7o92l08J58O95K43l66m59m25
$$ -41 406 266 -36 -350 -210 198 458 140 -319 -348 -33 390 457 -235 -543 -385 310 553 187 -272 -697
3725f97M65O29O3n70m83m2Q77L21j48q45k82O77O98mo25n28q4P05O13k58o88m40
$$ -697 -232 397 460 -110 -593 -635 242 563 415 -430 -712 -35 663 659 34 -494 -578 127 740 482 -206 -646
3747f46L08R38J50n91o75j13O46P46l84p71m73L61R30L69m73q92kN80N06O0o21
$$ -646 -338 600 750 159 -516 -629 17 763 379 -392 -865 -504 426 795 322 -570 -572 8 514 574 -47
3768d7m45J78P07K46l71n77k82L53N97J39l89o95K20K99L89m4m28m02K63L73L71
$$ -47 -492 -314 393 639 268 -309 -591 -238 359 498 109 -586 -366 -67 322 278 -150 -552 -289 84 455
3789D55l57m78j85L79O12J9l55m72M8J87O34l21k87l05NO88K00k35m09l67M20
$$ 455 98 -380 -565 -186 426 445 90 -382 -334 -147 487 166 -121 -426 -421 267 467 232 -177 -544 -124
3810a24M22J64m14m98J50L86N83m99m22k31J53Q36L3n28l94k55P87N35m53o21
$$ -124 298 462 48 -450 -300 86 669 170 -252 -483 -330 506 539 11 -383 -638 149 684 231 -390
3830c90k23K90P16K79o39n83J97L43P63k82o46m91M19O24M48o00p05k73P91O41
$$ -390 -613 -323 393 672 33 -550 -353 -10 753 471 -175 -666 -247 377 825 225 -480 -753 38 679
3850F79j69q80m91L75Q23L10n84o63j08P95O55j23r96m25L50Q19N55n60q21k72
$$ 679 510 -370 -861 -486 337 647 63 -600 -708 87 742 619 -377 -802 -452 367 922 362 -459 -731
3870g31O54Q44k99n73m51J32O80N09l52p37m79N89O61L16p05o21k49P31O47j34
$$ -731 -77 767 468 -105 -556 -424 256 765 413 -324 -803 -214 447 763 58 -563 -812 -81 566 432
3890D32p02n38N07O04M03n12p85o9M85P29M1o18n71R7P51M06k63o67k95J76P95
$$ 432 -270 -808 -301 303 706 194 -591 -660 -175 554 595 -23 -594 -497 254 660 397 -270 -565 -389 406
3911D06J50k69q82r3M26P82J28p55o29P5P53O03l00q72k15M27O64J83l88r45o1
$$ 406 556 287 -595 -688 -262 520 648 -107 -736 -661 92 695 395 -477 -692 -265 399 582 194 -751 -812
3932h12P83Q30P1j038n99J57J068L45k78j165k80Q09Q45j5p72r06K39J146M75
$$ -812 -29 801 872 -166 -765 -608 460 805 527 -638 -918 -109 736 721 -51 -957 -718 428 903
3951I03n83q11m05O73P94K25q07q31J84O73Q31m04j026k38M74J064N7p29p15L3
$$ 903 320 -491 -896 -223 571 796 -11 -842 -658 15 846 442 -584 -822 -348 716 773 44 -671 -638
3971f38Q99N08j86r34m28M24O91L87o37r24J64P38P01k12r57l41M01P31L46o16
$$ -638 261 769 583 -351 -779 -355 336 723 86 -838 -674 64 765 553 -404 -745 -344 387 733 117
3991A17o08j77P34P71k58q05n04K58O30N56m37p43j07M36P41n3n37p63K63O30
$$ 117 -491 -668 66 837 579 -226 -730 -472 158 714 277 -466 -573 -137 604 551 14 -749 -486 144
4011A44N16k56p34m31M81O97K21l90p48j36L96Q26J36p18o73J25N92P49l17q54
$$ 144 660 404 -330 -761 -280 417 638 248 -500 -636 -240 586 722 4 -669 -544 48 797 480 -374
4031c74m56N03P89L30n54r45qQ09P86j93r57o45K87J193L79n99j020k46P71P70
$$ -374 -830 -327 462 792 238 -707 -715 94 880 687 -270 -915 -628 565 944 345 -675 -921 -150 620
4051F20K20q51r14K04Q68R94m88j195m42P83R18K15p53j129Q2R21R42l16j118
$$ 620 840 -11 -925 -721 147 1141 653 -542 -984 -201 717 932 179 -950 -868 53 995 679 -439
4070d39o35N95J242L68p81j112j96J010P52k07q33p40L46J242K56n38j054j92
$$ -439 -1074 -479 763 1131 350 -762 -958 52 804 597 -236 -976 -630 612 868 330 -724 -916
4088i16Q16R33J34r50r64K70Q92P30n53q52l12N01J120k4o67q20J2Q25M39p9p80
$$ -916 -100 833 967 17 -947 -677 215 945 392 -460 -772 -271 849 825 158 -662 -650 175 614 535 -245
4109b45n42K24R11M03o27o37j62O52N93L1p13m88J58P50L41l88o43j84J54Q21
$$ -245 -787 -563 348 751 124 -513 -675 -23 570 601 -112 -600 -442 308 649 261 -382 -566 -412 409
4129D09J27n04p09Q7N55O64q2n44p69K89R49J85l39p15l12N11Q34j07o26n78J89
$$ 409 536 32 -677 -590 -35 629 547 3 -766 -477 472 657 318 -397 -709 -198 636 529 -97 -675 -486
4150d86P67O30m90r07m43Q27O69K34p13q87L9R98O48j66j111m82L59R25L48o65
$$ -486 281 911 421 -486 -929 -102 567 801 88 -799 -760 238 886 720 -391 -873 -514 411 759 94
4170I4j033J77R21N95j56q49q46L05J247M60n95j126j26J003P52J0r97q89N22
$$ 94 -939 -762 159 754 598 -251 -1097 -792 455 915 320 -806 -932 71 823 833 -164 -1053 -531
4189e31J079M92o62q71n43Q54J066j19q07q67K29Q20R85l66j175m65N35P77L22
$$ -531 548 1040 378 -493 -1036 -182 884 765 -42 -909 -680 140 1125 759 -416 -881 -346 431 753
4208G53m66r50j13Q08P55p6j080n10M36P74L01k80q41l75P29R03m6n69p57R3Q28
$$ 753 287 -663 -776 32 787 711 -369 -879 -443 331 632 352 -489 -864 -135 768 722 153 -604 -511 317
4229C17L74j33r31l06L58P62L16n97p79p2O33O72k6o00n94o0R40L68j46p54m20
$$ 317 691 558 -373 -679 -321 441 757 160 -619 -691 -58 614 588 -12 -606 -666 274 642 496 -258 -678
4250f78L86Q36J49l89q40k34P08P90k31m23p33J57Q41M64l00j230k12P65P57K36
$$ -678 -292 544 693 304 -536 -770 -62 728 497 74 -659 -502 339 803 503 -727 -939 -174 583 819
4270H19r54n42J19P88N23l60q01l63M05R79J77q20n96j39J003M95k34q55l94M66
$$ 819 -135 -677 -558 230 753 393 -408 -771 -366 613 790 -30 -626 -765 238 733 499 -356 -750 -284
4290b84Q04M03r67o89K46O62O79k99q34n97N78P91J92n69q23J04N57P15M6r85
$$ -284 520 923 -44 -733 -487 175 854 555 -279 -876 -298 493 685 116 -707 -603 -46 669 715 -270
4310b70m12K73Q78L34o28q02l4N31P56q5o90o02K36P29M43j26j094k11N47P22
$$ -270 -682 -409 469 803 175 -627 -661 -130 626 541 -149 -751 -515 214 657 531 -563 -774 -227 495
4330D95R9n38n02k48Q08M20O3r95l17L15P14L31o19n13k42L27J034m3o14o25K04
$$ 495 594 56 -446 -694 114 534 597 -398 -715 -400 314 645 26 -487 -729 -402 632 589 -25 -650 -446
4351d46O21L31j20o21m85K82R66K27n57o05j74N02O79j54m38n37P5O18O18l97
$$ -446 175 506 386 -235 -720 -438 528 755 198 -407 -581 -79 600 446 8 -529 -454 164 782 385
4371C85o31n80N27Q58J18o72n06l16R34O75j16q79p04N58Q37J79m49p72l46P66
$$ 385 -246 -826 -299 559 677 5 -501 -817 117 792 676 -203 -907 -349 488 667 218 -554 -900 -134
4391a34R10k83o03o29L62R06L59o28q72n5M02J055j7q88n71R3Q97N07l51q22l63
$$ -134 776 493 -110 -739 -377 529 888 260 -612 -667 -265 790 773 -115 -686 -593 304 811 460 -362 -725
4412g25N49O83Q7m24p59l5O14P92l23q59k78L58P59J89l95p16j7O22K51J5m22
$$ -725 -176 507 594 170 -589 -624 -10 782 459 -400 -678 -320 439 628 233 -483 -500 122 373 388 -34
4433c4n98P2R42J40k30n13l56N29L74J05l65m28r2M57L41j0m68k59J89L48K64
$$ -34 -632 -560 382 522 292 -221 -577 -48 326 431 66 -362 -454 3 344 334 -134 -393 -204 144 408
4454D08k95m66q9M78M13l8n35l48O1N40M49j96n55l59K27O91J8m14l44k26N75
$$ 408 113 -353 -442 36 449 411 -124 -472 -411 129 578 382 -173 -532 -305 386 404 -10 -354 -580 -5
4475eM55J11p09l55R7N56M37k94o51q3L20O51Q2o19o34L9P90O11o51n28j69L25
$$ -5 450 561 -148 -503 -406 150 587 293 -358 -441 -121 530 612 -7 -641 -602 188 799 148 -380 -549 -224
4497b24O59J24n59q11J60Q52L83j29p59l34K85P96K11o05n36j68O69O26j83o18
$$ -224 435 559 0 -811 -651 201 584 455 -304 -638 -353 443 654 49 -487 -655 14 640 457 -161
4517a61n42L59P30K95n07o21j95N73N89p4o02m19J67M92M02k51m90l08L59N02
$$ -161 -703 -344 386 681 174 -447 -642 -69 520 446 -156 -575 -408 84 486 235 -255 -563 -204 298
4537B98J31n20l98J4N01M87j79l69m33J73L86L80k39m97j67M67L75Q9m69k78K7
$$ 298 429 -91 -489 -475 26 513 334 -35 -468 -295 91 471 232 -265 -432 35 410 499 30 -248 -221
4558b21K80L37j14m23k02J43M64J16k18m27k98M75L30J52m16m76O0O79R5j67j73
$$ -221 59 396 282 -141 -343 -200 264 380 162 -265 -563 -88 242 394 -22 -498 -438 241 336 169 -4
4579dm48L15M74K89m53o93j8N94L81j34m03l54K47N12P7k99m75j78L47P27k5o76
$$ -4 -452 -137 337 626 173 -520 -538 56 437 303 -100 -454 -207 305 382 83 -392 -570 -223 504 479 -197
4601a97l05K82K99L76j95o55k37M33O22J33n94l97J08M13N21k46m84l80K34O14
$$ -197 -502 -220 79 455 260 -395 -632 -199 423 556 -38 -435 -327 86 607 361 -123 -503 -269 345
4621C45J71m61o50J96M77M55j81p06j11L44M87J56l20o20p5O91K83q8n54k80Q8
$$ 345 516 55 -595 -399 78 533 352 -354 -465 -121 366 522 202 -418 -493 198 481 393 -161 -441 -353
4642c53N11K31l06l48j32K85M59J09m53m12J89J41N34j88m63m20M88L08J74j96
$$ -353 158 389 83 -265 -397 -112 347 456 3 -409 -220 -79 455 267 -196 -616 -128 180 354 158
4662A58m92q4K34L34K51l17m75J09L64M00k08m16k36K09M19N6k10m70j96M06N55
$$ 158 -334 -418 -184 150 401 84 -391 -282 82 482 274 -142 -378 -169 250 306 96 -374 -570 -164 391
4683C91Q8n26n06J53O95K07k01o86k38L81M80K73l94n87l3N85N10k31n74l74K81
$$ 391 479 -47 -553 -400 295 502 301 -385 -623 -242 238 511 117 -470 -503 82 592 361 -213 -587 -306
4704c06O16K53m71n01j68O53M87r6o84j97J75M52L15m03m64k41L67P07K5o60m40
$$ -306 310 563 92 -409 -577 76 563 467 -217 -414 -239 213 528 125 -339 -580 -213 494 519 -141 -581
4725e81K84M45N29m24o98r3M34N67N5l90n35l8N50L69k78o06m9Q4O74J96k44o35
$$ -581 -297 148 677 253 -445 -538 -104 463 518 128 -407 -445 105 474 196 -410 -459 -375 299 495 251 -384
4747c84j87O08L87j1n01l60L86K41L34j78n30l06L73N57j05m17l03Q6K19L98J6
$$ -384 -571 37 424 413 -88 -448 -62 179 513 335 -195 -501 -128 429 324 -93 -396 -310 -91 307 323
4768C23l58n30K14O44J27l63k34j4R7L23K83m97k76RL48L10n0p31j11L99L78J68
$$ 323 -35 -565 -351 293 420 57 -177 -191 -94 229 512 15 -261 -252 96 406 356 -375 -486 -87 291 459
4790D59l83m02k11P19K12m2n39k94J76N23K15k07o22j26M68N85j3n78m54J25O27
$$ 459 76 -326 -537 182 394 352 -187 -481 -305 218 433 226 -396 -522 -54 531 518 -60 -514 -389 238
4811B38M27m14o02r6L86M79Q6m34n26o1O27N01k42p10l38N62N63o9j74o73j59
$$ 238 665 251 -351 -447 -61 418 504 70 -456 -517 110 611 369 -341 -679 -117 446 377 203 -470 -629
4832f29Q11L61o5o16n17K47N75L80k85m87l63P39K26J97o67m46J30P15J91k41
$$ -629 182 543 478 -138 -655 -408 167 547 262 -225 -588 151 377 574 -93 -539 -409 306 497 256
4852B56m69k49K69O13R8m44l15k80N97M14j18n15m20L28O00L03o20m58q3L20N75
$$ 256 -213 -462 -193 420 518 74 -241 -521 76 490 372 -143 -563 -235 365 668 48 -410 -493 -173 402
4873D02j38l39l38K22L99L05q9q00q3J76M73M13m13m62l83N62N05j52k57n42J33
$$ 402 264 -75 -413 -191 208 513 424 -376 -459 -283 190 603 190 -272 -655 -93 412 260 3 -539 -406
4894d06N81K51k72m32j32L83L53K92p31m28J87N08M80k65o17l47L44N91J53m85
$$ -406 175 426 154 -278 -410 -27 326 618 -113 -541 -354 154 634 369 -248 -595 -251 340 493 8
4914Hk87k15N63L95J27o90m68J89P38J57m76n13k5N71N05r3o67m06L96L72N15
$$ 8 -279 -494 69 464 591 -99 -567 -378 360 517 41 -472 -497 74 579 486 -181 -587 -191 181 696
4935F96m05p10j79O11M90p8m20n72L78M48K53j54p69j34M79M74K40p84m14K01
$$ 696 291 -419 -598 13 503 425 5 -567 -189 259 512 358 -411 -545 -66 408 648 -136 -550 -349
4955c49M61N27k52o14l40L59M98K99m03p56J00N90K60j25l89l40J99N83K03j65
$$ -349 112 639 387 -227 -567 -208 290 589 186 -570 -470 120 380 255 -134 -474 -275 308 511 346
4975C46o56j60K93N20K2m09m61J82M56K62j83m85k73M46K82M05p27l60jL11O02
$$ 346 -310 -470 -177 343 365 -44 -505 -323 133 395 212 -273 -546 -100 182 587 -140 -500 -501 -190 412
4996D12L4o29l32K58L45M61l68l64m31N37M79K91n51o87J7M44O43j55o00m84K36
$$ 412 446 -183 -515 -257 88 549 181 -183 -614 -77 402 693 142 -545 -528 -84 559 404 -196 -680 -444
5017d44Q47J98m00n60r7L33O94J6n95n83K86N22M93m82o34k62N31O57j5l74p79
$$ -444 403 601 201 -359 -456 -123 571 587 -8 -591 -305 217 710 228 -406 -668 -137 520 505 131 -648
5038f48K38N21N33k38p56k33L69N72J46l32p46J94M65M56p7o32m87M02O89R8m07
$$ -648 -410 111 644 406 -350 -583 -214 358 504 172 -574 -380 85 541 464 -168 -655 -253 436 534 127
5059A27n60o6M19N15M3o61k80K69N04K09k80o51j39K97P78m3n45l01N7L28K35
$$ 127 -433 -499 -80 435 478 -183 -463 -194 310 519 239 -412 -551 -254 524 481 -64 -365 -308 20 255
5080B55j27m71k05L49M69J72l88k88j65M00M66j88l39j32j38M80J80j21n55L3
$$ 255 128 -343 -548 -199 270 442 54 -234 -399 1 467 279 -60 -192 -330 150 330 209 -346 -313
5100c13K45L52R0n79j07n0L42M77q7q10m0K02N53L0k29m50q4N33J81R2l51n34
$$ -313 -68 284 374 -205 -312 -362 -20 457 370 -440 -480 -278 275 305 76 -374 -458 75 256 348 -3 -537
5122e37L03N08K60m22o31k08O76N01O6n81k54j09O18M35k53o95j90L77N56N6l46
$$ -537 -234 274 534 112 -519 -727 -51 450 516 -65 -319 -428 190 625 372 -323 -513 -136 420 476 130
5143A30n30rL85N93k58o06l67L54P53R5m38n75p7P73M19m5o55l59P7O37K74l62
$$ 130 -400 -409 -24 569 311 -295 -662 -308 445 540 102 -473 -550 223 642 597 -58 -417 -340 297 571 209
5165B09m96k72O93J91J86o83m12J91N17M38r8o67l12L84M40J08n56l86K70N08
$$ 209 -287 -559 134 325 511 -172 -584 -393 124 562 464 -203 -515 -131 309 417 -139 -525 -255 253
5185B53K51j88o73j80L98M62j8l20m50L4M61M11j29m18l52J33L50N06m25k52k46
$$ 253 504 316 -357 -537 -139 323 305 -15 -465 -431 30 441 312 -106 -458 -325 25 531 106 -146 -392
5206c92K20L49J03l31l31J13J62M44pm01l60J26L75K75j0l99l67K62M67R3m25
$$ -392 -172 177 280 -51 -382 -269 -107 337 330 -71 -431 -305 70 345 335 -64 -431 -169 298 391 -34
5227c4l94M6L79M28k05n27j7J83K85L23m96l18O5K94K75j08l90m08L61M20K92
$$ -34 -428 -382 -3 425 220 -307 -324 -141 144 467 -29 -347 -282 12 287 179 -211 -619 -258 162 454
5248D54j67o86J11L44L78p5m35l33K84L61K61k97m50k82N54M94k00k80l30O5L14
$$ 454 287 -399 -288 56 434 359 -76 -409 -125 236 497 200 -250 -532 22 516 316 36 -294 -229 85
5269H5N09k38n36m05N96L95J29n63m77R0O85J89l12m02j53L60M18m1l44l26m0
$$ 85 594 356 -180 -585 11 406 535 -28 -505 -415 270 459 147 -255 -408 -48 370 329 -15 -341 -381
5290c81O14J03j81l08q9J86M17Jk76l40j6K89K43J3m26k51K92LL60o9k94j78L43
$$ -381 233 336 155 -153 -242 -56 361 362 86 -254 -270 19 262 275 -151 -402 -110 -107 253 184 -110 -288 55
5313E5J07Q4k31l08K8L18L24j68l15l17J30M64P3j02j62l15N07J60J00k21m10
$$ 55 162 246 15 -293 -265 53 377 209 -106 -423 -293 171 244 142 -20 -335 172 332 432 211 -199
5334a99n4K78K95j83k27k27n5N21J70l32l00l6L41M81q0m02n15K53L91J88o6m21
$$ -199 -253 25 320 137 -90 -317 -372 149 319 -13 -313 -349 -8 473 393 -9 -524 -271 120 308 242 -179
5356a79k51K72M44Kk96m20J61L12L09p5m65k46L02M80q4l10l67n1O02K49j70n34
$$ -179 -430 -158 286 288 -8 -428 -267 45 354 279 -186 -432 -130 350 266 -44 -411 -462 140 389 219 -315
5378c15kJ34L60J75k75n38J05L88K64k6l76k68J31N32J64k97l95K5K78J81j50
$$ -315 -317 -183 177 352 77 -461 -356 32 296 270 -106 -374 -243 289 453 156 -239 -214 64 245 95
5399I5j65k81K46K16K88k60m09k5J46M05p9j21k55%L01J55N2m09n5M4Q8K89k73
$$ 95 -70 -351 -105 111 399 139 -270 -295 -149 256 177 56 -199 -199 102 257 309 -100 -155 -111 -23 266 -7
5422gn1j90K18K14j13j18k20Q9J97K01o8k05o7l8M21R2m92J43k60J27L11M9k45
$$ -7 -58 -248 -30 184 71 -47 -267 -178 19 220 152 -53 -120 -158 263 355 -137 6 -254 -127 184 233 -12
5445a2k30r3M93o6N5j77k46L06K21j20k64q8R9K34Q5p4m25N7K22L17N9l49k24
$$ -12 -242 -335 158 92 147 -30 -276 30 251 131 -133 -221 -122 112 197 123 -302 -245 -23 294 353 4 -220
5468b20j29M89K25q1l27l32K68K24K05j83m56Q6J81K46J97n86k5J42K91J10k52
$$ -220 -349 140 365 284 -43 -375 -107 117 322 139 -317 -231 -50 196 393 -193 -218 -76 215 325 73
5489G3k45m8K18J87J35l44l40K22L72J58k54k88j17L94J35k90n8j4j9K50%j78
$$ 73 -172 -220 -2 185 320 -24 -364 -142 230 388 134 -154 -271 123 258 -32 -90 -104 -123 127 127 -51
5511e1K1j42j8M95k74j14lo3J85K11jk87j29k8J78J78N6k94l0J71L1M7k14l8J5
$$ -51 -30 -172 -190 305 31 -83 -86 -149 36 247 246 -41 -170 -198 -20 158 214 -80 -110 61 92 139 -75 -113 -98
5536i8J04P7n7k5j48J12J59O0m0l07k3L26m4M3j39j37m2J05J44n2j66O1kK20J54
$$ -98 6 83 26 1 -147 -35 124 184 144 -163 -186 140 96 139 0 -137 -179 -74 70 18 -148 -87 -89 131 285
5561B85j09m84rL54J34J54k69l27J98J93Q2o8k91K2J63K21k35K2j29J4J54J53
$$ 285 176 -308 -317 37 171 325 56 -271 -73 120 202 134 -157 -135 28 249 14 36 -93 -79 75 228
5583B28k24j37rK28n1J26N9n97K13L92K8k46k24j12K65L79l19ql10K85O7K70m33
$$ 228 4 -133 -142 86 35 161 220 -377 -164 228 256 10 -214 -326 -61 318 -1 -9 -319 -34 33 303 -130
5606a30l2N0J46J55j22j16j52J57J69J18j17j28l47K81L21j83q8k27L5K76R7j03
$$ -130 -162 -112 34 189 67 -49 -201 -44 125 243 126 -2 -349 -68 253 70 -18 -245 -210 66 163 60
5628F0q8j68Q6L42k79M4j26J37P3lM4k15J34k14K52P2j58P4r9p2J20J92k69p8
$$ 60 -28 -196 -110 232 -47 -3 -129 8 81 78 122 -93 41 -173 79 151 -7 67 -32 -104 16 208 -61 -139
5652a39O6N5NJ1P4l02M9K0K98j1l0j35J58j71K76k12r8J00j76K08P5j44p6o2L32
$$ -139 -73 -18 -13 -2 72 -230 -181 -161 137 126 96 -39 119 -52 224 12 -86 14 -162 46 121 -23 -99 -161 171
5677A71j37J29m12j23M01o9J51L6j99m5J55K24j81j28k2j87L87j12r6k10K12R0
$$ 171 34 163 -249 -372 29 -40 111 147 -52 -97 58 282 101 -27 -49 -236 151 39 -57 -267 -55 35
5699C5j5J66l28O8R2K13M3l20J1k4K04J72l09m6L9j18L66l9k35l0L9N5R8k12k49
$$ 35 20 186 -142 -74 18 231 274 -46 -35 -59 145 317 8 -38 1 -117 249 210 -25 -55 -16 39 137 -75 -324
5724c24J13K44J56o0k44J65j14R3k1r4O3j20J23J2N4n2j26K01j43L1J67k20M4
$$ -324 -211 33 189 129 -115 50 -64 29 8 -86 -23 -143 -20 -8 46 -6 -132 69 -74 -43 124 -96 -52
5747e2J76l3R2k72j8J44K7k8M7k95K62P3J4J67l17R4j45L2Q1M5K5j0j66mP1m3
$$ -52 124 91 183 -89 -107 37 64 36 83 -212 50 123 137 304 -13 81 -64 -32 49 94 119 109 -57 -61 10 -33
5773c3O8p2l1J40l4M1j26K3j57K87J02k10Q4k15R2O6K43l33k36J66K11K3p4m6
$$ -33 35 -37 -68 72 38 79 -47 -24 -181 106 208 -2 82 -133 -41 25 268 -65 -301 -135 76 99 25 -21
5797b1m0K7J11q9mk83J06L25o0m2k91J85R5M8J8j25k7n1J76J33m4k52j37K17Q2
$$ -21 -61 -34 77 -12 -16 -299 -193 132 72 30 -261 -76 19 67 85 -40 -67 -118 58 191 147 -105 -242 -25 57
5822E7l4n4m9N5J48Q3j33j94Q1J9J91J8l20r1J31J73o4q6J25n6J87l8r8j51p5
$$ 57 23 -31 -80 -25 123 206 73 -121 -40 -21 170 188 -132 -223 -92 81 17 -69 56 0 187 149 51 -100 -175
5847a75M21j38J0j17j31J35oK06Ok75j02O6L01q9j44l8j70J82L21k28j92n7K00
$$ -175 246 108 118 1 -130 5 -1 205 211 -64 -166 -100 201 112 -32 -70 -240 -58 263 35 -157 -214 -14
5870a4O2Q4j72M0J0P7o8J5J7j3m5J11L5j13pj59J33K12j43k0j24r5R4K2J96j38
$$ -14 48 132 -40 0 10 87 19 34 51 38 -7 104 139 26 19 -140 -7 205 62 42 -82 -177 -83 -61 135 -3
5896cm2K0m4P2J48j38j18l6K01J40k27j08J12O6J35m2l21o1J59R0J25L4n8k39
$$ -3 -45 -25 -69 3 151 13 -105 -141 60 200 -27 -135 -23 43 178 136 -185 -246 -87 3 128 162 104 -135
5920a35%M06j53O8l92J00K03R5j25j32q4M9K43l5L0k96J6K92O0O3k88l04K80K29
$$ -135 -135 271 118 186 -206 -106 97 192 67 -65 -149 -100 143 108 138 -158 -142 150 210 273 -15 -319 -39 190
5944A90P9l27j13PK54k3j21j77K4J86M5O9j53j60O5L15J89k00j17k18J72K00L9
$$ 190 269 -58 -171 -164 90 67 -54 -231 -207 -21 24 93 -60 -220 -155 160 349 149 32 -186 -14 186 225
5967B25l13q6P3N5J20O5j89j07P1J79j6n2K6j88J47J05J40n71J16J66m0L13j39
$$ 225 -88 -174 -101 -46 74 139 -50 -157 -86 93 77 25 51 -137 10 115 255 -316 -200 -34 -74 239 100
5990A00k11q9M8J52Q5J07k72j23K89K11k22j95K1q8K36K13j15k01k67M47j33J76
$$ 100 -111 -200 -152 0 85 192 -80 -203 86 297 75 -120 -99 -187 49 262 147 -54 -321 126 -7 169
6012A69O3m31J53j2M14k60k89M3l9J55K34k06k09Q8J18J78l8l20j50K76J67J73
$$ 169 232 -199 -46 -58 356 96 -193 -150 -189 -34 200 -6 -215 -127 -9 169 131 -189 -339 -63 104 277
6034B77j50l15K2K94J28j4j11m26J98P5O1Ml30n0K37L58k0l18k48P3N34j2j38
$$ 277 127 -188 -166 128 256 242 131 -295 -97 -22 39 43 -287 -337 -100 258 238 -80 -328 -255 279 267 129
6057A29k72k8K01K61M1l17k04p7K94L01n4l83k21J15N31J4j57l67r4K43L19j25
$$ 129 -143 -171 30 291 332 15 -189 -266 28 329 275 -108 -329 -214 317 331 174 -193 -287 -44 275 150
6079A50k70j03K6M33jj80r4k00J36L28o2k10j14pL16L9j89j55j41K61K55K2j69
$$ 150 -120 -223 -197 236 235 55 -39 -239 -103 225 163 -47 -161 -168 148 187 -2 -157 -298 -37 218 240 71
6102G1j94k02M23J80j43j27k17J24K46L6n8l00q1K41J06J01O2m60j4J56K40j13
$$ 71 -123 -325 98 278 135 8 -209 -85 161 197 139 -161 -242 -1 105 206 268 -192 -206 -50 190 77
6124G7n7j70m0L16N7k5l78j4K04L86O7o06j57K39L16L3l1m04p5J93L29j25j24
$$ 77 20 -150 -190 126 183 158 -220 -234 -30 356 423 -183 -340 -101 215 248 217 -187 -262 -69 260 135 11
6147A1j92k07N56J18j31l00j71K90K58N2k46k41j16N28J29k28k42l76M69L42J72
$$ 11 -181 -388 168 286 155 -145 -316 -26 232 284 38 -203 -319 209 338 110 -132 -508 -39 303 475
6168D75k82n41j10M67J40L5j99l43R1M40J60j49n19n7L72L58j17l68k48L05O5
$$ 475 193 -348 -458 9 149 184 -15 -358 -267 173 333 184 -335 -392 -20 338 221 -147 -395 -90 -25
6189b5M17l04k85j49L56K76J01k99m10J48K32L11k60o6l14K02K06K86m76l34L9
$$ -25 392 88 -197 -346 10 286 387 88 -322 -174 58 369 109 43 -271 -69 137 423 -53 -387 -348
6210c48K75N44j08m89j53L4M16K85l82l47k74N46K00o0q5l21Q0K55J61K13o47
$$ -348 -73 471 363 -126 -279 -245 171 456 74 -273 -547 -1 199 139 54 -267 -187 68 229 442 -205
6231b05j47K44M18L4l00l82j27N54K11m1l72m13K44L26L30k76l12k43L18M04J61
$$ -205 -352 -108 310 344 44 -338 -465 89 300 259 -113 -526 -282 44 374 98 -214 -457 -139 265 426
6252D26m41l63NM08L79k89k71j92O7O04J25n78j78j00N18K31n5m09l48K28M69
$$ 426 -15 -378 -373 35 414 125 -146 -338 -271 333 458 -120 -298 -398 120 351 296 -113 -461 -233 236
6273B36K0m4n77J16K21L09J06o57j31N7O05J64j96m66j51M71J68O4m49k97LM59
$$ 236 256 212 -365 -249 -28 281 387 -270 -401 -344 261 425 229 -237 -388 83 251 315 -134 -431 -428 31
6295C1M88l75l45j49K17M29P4k42m20j52N98J66Lm79k95K34M79J51l96l66n8M80
$$ 31 519 144 -201 -350 -133 296 370 128 -292 -444 154 320 323 -156 -451 -217 262 413 17 -349 -407 73
6317G3K74j75j97l66L7L84L50j64m53q2L77J55k4l52k96J75M03L00j14m29j77
$$ 73 347 172 -25 -391 -354 30 380 216 -237 -319 58 213 189 -163 -459 -284 119 419 305 -124 -301
6338c01J98L57J31k93m60NM34J65J72o38o5j1O31K25l87m21o6L69K31K3l51k85
$$ -301 -103 254 385 92 -368 -363 71 236 408 -230 -295 -306 325 550 163 -258 -324 45 276 299 -52 -337
6360c37R6L83M48l13m62k68M44K85J24k67m78m7L60L86j69l15k96R9O34J52l25
$$ -337 -241 142 590 277 -185 -453 -9 276 400 133 -345 -392 -32 354 185 -130 -426 -327 307 459 134
6381A34m48q1L87M50r6l17l81LO24J13k10k29l96M66L95M1l49m28n0M64K30r1
$$ 134 -314 -395 -8 442 346 29 -352 -349 275 388 178 -51 -447 19 414 455 106 -322 -372 92 322 231
6403B31o09p7K55M53K50l88m43j77N32J76O6k96l26K52J99K41q6l92k67K62N99
$$ 231 -378 -455 -200 253 503 115 -328 -505 27 203 269 -27 -353 -101 98 339 253 -139 -406 -144 455
6424D55j92l38k48pM91K37p1n06j31L29K80K9l83k80l4L37L84n2l49l85K98L00
$$ 455 263 -75 -323 -330 161 398 327 -179 -310 19 299 328 -55 -335 -369 -32 352 300 -49 -434 -136 164
6446A64K81j74n04k33K66N85l3o10l0M6K20L60r0m26k35L75K72J31k13o63J96
$$ 164 445 271 -233 -466 -200 385 352 -258 -288 -242 -22 338 248 -178 -413 -38 234 365 152 -511 -315
6467c15M69J70j23l94j75K40L52K23k68n68M5K59L79J65n02k45j5L93L47j56o06
$$ -315 154 324 201 -193 -368 -128 224 447 179 -389 -344 -85 294 459 -43 -288 -303 90 437 281 -325
6488c25j12L04N04km93k64qL80N22l53l13k87M07L91j11k45l16q4L68N41l01k30
$$ -325 -437 -133 371 369 -124 -388 -396 -16 506 153 -160 -447 -40 351 240 -5 -321 -405 -37 504 203 -27
6510b7l64J86M63J45l45l80j7L77L27j43m16k40Q1M93L36k13m45j84L08L36N9
$$ -27 -391 -205 258 403 58 -322 -339 38 365 222 -194 -434 -353 140 476 263 -182 -366 -58 278 337
6531C37m01k49O0M19J19r6l56j42K24L75nk36m44J47K26L75qm82l70J51M20M42
$$ 337 -64 -313 -253 166 285 189 -167 -309 -85 290 285 49 -395 -248 -22 353 345 -137 -507 -356 64 506
6553E06l10m27j27L31M07l0k18m53J8L88J97r0l97O8j60M01J06j96j85j18N01
$$ 506 196 -231 -358 -27 380 350 132 -321 -303 85 282 192 -205 -137 -297 104 210 14 -171 -289 212
6574B12K49j12n08k36K55M11J14k32l35j83K13M54O5l90k62k1N04L73k47n93r8
$$ 212 461 349 -159 -395 -140 271 385 153 -182 -365 -152 302 367 -23 -285 -306 198 571 324 -269 -367
6595c67J12N03K37l99l98J8L81L37j91m52k00J92O63j23j91l53k32M55M22k32
$$ -367 -255 248 485 86 -312 -294 87 424 233 -219 -419 -227 436 313 122 -231 -463 -8 414 182
6615A82k09j53o3N30O3j40l81j51K02L98K57n16k96O6K46K27p3m39j21L64K69
$$ 182 -27 -180 -243 287 350 210 -171 -322 -120 278 535 19 -277 -211 35 262 189 -250 -371 -7 262
6636B62J2k59k98n6L02K15R3l00j03n0L25J39j14j99j78J46L38O3k95j73o7K86
$$ 262 274 15 -283 -339 -37 178 271 -29 -132 -182 143 282 168 -31 -209 -63 275 338 43 -130 -197 89
6658H9K43j32l50k41J92N48Kk58k97O5J78J46K1l39Q0j56L67nr2k70k40M95K43
$$ 89 332 200 -150 -391 -199 349 351 93 -204 -139 39 185 206 -133 -53 -209 158 153 61 -209 -449 46 289
6681B89k1j05n33R5M44K59r7n46j79M16K85j47K8n12K4J76M05j87l27P3r8L61
$$ 289 268 163 -370 -275 169 428 331 -215 -394 22 307 160 188 -324 -300 -124 281 94 -233 -160 -258 103
6703A03K42k79k67j59K72M59k5n21j59Q9L91K52l13k39j48L32K35l0k70k36nL73
$$ 103 345 66 -201 -360 -88 371 346 -175 -334 -245 146 398 85 -154 -302 30 265 235 -35 -271 -276 97
6725I7L0p7j57j94K29K38K13m38k47mK20M31j45m06l2R3L05K05k41k38j12J50
$$ 97 127 50 -107 -301 -72 166 379 -59 -306 -310 -90 341 196 -210 -242 -149 156 361 120 -118 -230 -80
6747h0K78j72l3k23kM88j6j95k80o0K23J77M5k28k32j18L57L52o5l11k52J62M61
$$ -80 198 26 -7 -230 -232 256 240 45 -235 -295 -72 105 150 -78 -310 -428 -71 281 216 -95 -347 -185 276
6770B76r9r1k52M9N4J36J63j48l57N3J66L98k52l43%J35K38J66l67j63J07J98
$$ 276 177 86 -166 -117 -63 73 236 88 -269 -216 -50 348 96 -247 -247 -112 126 292 -75 -238 -131 67
6792F7m1R8r0k12n5L30K43k07j33l92K25J86J97j92l70K24K95k3jl42j62L45K27
$$ 67 26 124 34 -178 -233 97 340 133 0 -392 -167 19 216 24 -346 -122 173 150 149 -193 -355 -10 217
6815B17L5k51l62K10J55K54j18k40j17J40J53Q7N6l53j91K11L23q1k05j34J55
$$ 217 252 1 -361 -151 4 258 140 -100 -217 -77 76 163 219 -134 -325 -114 209 128 -77 -211 -56
6836e6J11L45k74j62k35J58K66r4rk12j13L28K2r6j28j47J21J95J07k16j26o3
$$ -56 55 400 126 -36 -271 -113 153 59 50 -162 -275 53 75 -21 -149 -296 -175 20 127 -89 -215 -278
6858b78L13K2J6q8k37l8M29K9J41l58q2K30k8J29j26k73J04L84oj76l41O3J59
$$ -278 35 57 73 -15 -252 -290 139 168 309 -49 -131 99 71 200 74 -199 -95 289 283 107 -234 -171 -12
6881a2p2L75j99k13j95L45R2J20k71n9j19L54P7l5l36j0J28L57j91j03n1k57L30
$$ -12 -84 291 92 -121 -316 29 121 241 -30 -89 -208 146 223 188 -148 -158 -30 327 136 33 -18 -275 55
6904E5J48m7m50J95NL19kk52q6n1J42L09k21j53n1L7L25K8k67k9j70o1M69Mj21
$$ 55 203 156 -294 -99 -94 225 223 -29 -115 -166 -24 285 64 -89 -140 -103 222 250 -17 -46 -216 -277 192 196 75
6929G5k52o0K10K00n1k42k4N1K17L7j29j09j51L71N8J9p0l81O0K36J15k9j01r7
$$ 75 -177 -237 -27 173 122 -120 -144 -93 124 161 32 -77 -228 143 201 220 150 -231 -171 65 180 151 50 -47
6953d7J03J36Q0k48k32J60M4K41p2k70n2Q7L29n6j76M2j95J40J91l1j88k17K9
$$ -47 56 192 272 24 -208 -48 -4 237 165 -105 -157 -70 259 203 27 69 -126 14 205 174 -14 -231 -202
6976b02L40N5r8l24M3J65M7M3o6k02K06j81K89M9j85l8j74K93P8J59m07n0J13
$$ -202 138 193 95 -229 -186 -21 26 69 3 -199 7 -174 115 164 -21 -59 -233 60 138 297 -110 -160 -47
6999d7M13j14l35o9J31O1J24J44n22n9K64J92l3j14j23j77L61J85j96k64j4M4
$$ -47 366 252 -83 -152 -21 40 164 308 -214 -273 -9 183 150 36 -87 -264 97 282 86 -178 -192 -148
7021a48K63JK8k69j42L10L01j55k50n7O3O1J85q9l79qL46L21k14k91j08J73J02
$$ -148 115 116 144 -125 -267 43 344 189 -61 -118 -55 6 191 102 -277 -285 61 382 168 -123 -231 -58 44
7044D4K23j50k69j35K26J7K45j91oj05J7L04j49q0k51L08J43J9j06k70mJ42K48
$$ 44 267 117 -152 -287 -61 -44 201 10 4 -101 -84 220 71 -9 -260 48 191 210 104 -166 -170 -28 220
7067B20k72J67j76L4J22Q2K6j89j76P5P4J81r8j92J60rR1J50j99k68P2J57J2l9
$$ 220 -52 115 -61 -27 95 177 203 14 -162 -87 -13 168 70 -122 38 29 120 270 71 -197 -125 32 44 5
7091Ek23P5mL76l8j03k86J27K42o2k4k07j46J19L78o4k16j00Q8P7J04J0k21rm
$$ 5 -218 -143 -147 229 191 88 -198 -71 171 109 85 -122 -268 -149 229 165 -51 -151 -63 14 118 128 -93 -102 -106
7116a06J69L11l99k7J3o9K36M9k69kj78J34L58R3n72M4K44K55o7j23l88K1M97
$$ -106 63 374 -25 -52 -39 -108 128 177 -92 -94 -272 -138 220 313 -259 -215 29 284 217 94 -294 -273 224
7139B24Qp6j72k90J55L17o6j04o2j56J37J55J38l24joK56J07j62k94p8J81M41
$$ 224 232 156 -16 -306 -151 166 100 -4 -66 -222 -85 70 208 -116 -117 -123 133 240 78 -216 -294 -113 328
7162C28k21j41k81J13L10J88r7k71j18N3L27J2j32l78p6M60J16j52p0j06jJ80
$$ 328 107 -34 -315 -202 108 296 199 -72 -190 -137 190 202 70 -308 -384 76 192 40 -30 -136 -137 43
7184D3N9K3j53j62R7J28J16k46l5l8L36mK0j94j04K23J06m6k17O3l99L66jK87
$$ 43 102 125 -28 -190 -93 35 151 -95 -130 -168 168 164 184 -10 -114 109 215 169 -48 15 -384 -18 -19 268
7208B68j54l12J46L1K68o3j97j40K35J06J05k67j78j57J93M79j17n13pQ8M22l3
$$ 268 114 -198 -52 -21 247 184 -13 -153 82 188 293 26 -152 -309 -116 363 246 -267 -274 -186 236 203
7230B03k20j72L1J05L48k11j53k53K05K89m3n9j43l49L63R9P4k26j75J20J27J17
$$ 203 -17 -189 -158 -53 295 84 -69 -322 -117 172 129 70 -73 -422 -59 40 114 -112 -287 -167 -40 77
7252G7K2p0k24J44L28n3k12k68Q5K12J51Q0l18r2P1J16O0k16m3L3R7K48j9j06
$$ 77 99 29 -195 -51 277 224 12 -256 -171 41 192 272 -46 -138 -67 49 109 -107 -150 -117 -20 228 209 103
7276A03j94lJ42R5n0j51j70K23K36j11r3k38P0R0K99k22k06Q6j31J72K6K03l40
$$ 103 -91 -94 48 143 93 -58 -228 -5 231 120 27 -211 -141 -51 248 26 -180 -94 -225 -53 -27 176 -164
7299a64J4K89Q0m5k03j25o1M35K5j54j12j05R4J64O4p0l89J09J89K72l14j44J7
$$ -164 -150 139 219 174 -29 -154 -215 220 245 91 -21 -126 -32 132 196 126 -263 -154 35 307 -7 -151 -134
7322a34R2L39r7p9k48j03K09L81j79j61k00n7M54k8l2l76J9J27K04Q7k53m4j50
$$ -134 -42 297 200 121 -127 -230 -21 360 181 20 -180 -237 217 189 157 -219 -200 -73 131 218 -35 -79 -229
7345b29K73J91j00j52j97K42K11q9j14j20n0K15L8J02l95j64J79L23J27l67j28
$$ -229 44 235 135 -17 -214 28 239 150 36 -84 -134 81 119 221 -174 -338 -159 164 291 -76 -204
7366b04R7P0J51k6k24n7K55l4K13j37k32O8k6J34J6j32j29O3K80PJ18k85k59J01
$$ -204 -107 -37 114 88 -136 -193 62 28 241 104 -128 -60 -86 48 64 -68 -197 -134 146 153 271 -14 -273 -172
7390a72J93J31pj81j14K0L09J14k91k19L6K77K87j54m61p6J84J93j1j89O1qJ71
$$ -172 21 152 145 -36 -150 -130 179 293 2 -217 -181 96 383 229 -232 -308 -124 69 58 -131 -70 -78 93
7413I3N3J14k71j61O7K38K3k30j2n3J10L29jl87j28J65J54K46l50J2r4j39K77
$$ 93 146 260 -11 -172 -105 133 156 -74 -86 -139 -29 300 299 -88 -216 -51 103 349 -1 11 -83 -222 55
7436E5K07l84j03k2K96Q8j06j01k20O8M29P5k41k32j62M15J73k52k74J48Q5K21
$$ 55 262 -122 -225 -247 49 137 31 -70 -290 -222 207 282 41 -191 -353 62 235 -17 -291 -143 -58 163
7458A63mj33j84j40K88J65Q9k84O3Mm9K78j33j77j76R4L23K3k17r8M0J21J10n9
$$ 163 159 26 -158 -298 -10 155 244 -40 23 27 -22 256 123 -54 -230 -136 187 210 -7 -105 -65 56 166 107
7482A07k33n7J52O1Q4j2k17j70L04j1J39j30j59Q3K01O6j70j65j07J54K44k7k43
$$ 107 -126 -183 -31 30 114 102 -115 -285 19 8 147 17 -142 -59 142 208 38 -127 -234 -80 164 137 -106
7505a06q2R0K39R1p3k99J4L11j15K1k5j27J27m1K26j26j48j54R0K52m0j19j73
$$ -106 -188 -98 141 232 159 -140 -126 185 70 91 66 -61 66 25 251 125 -23 -177 -87 165 125 6 -167
7528a67K8J61J78j38P5k93q7K50J37Nk50j17J94K28j06k02m5KK72J65k70j15L1
$$ -167 -139 22 200 62 137 -156 -243 7 144 149 -101 -218 -24 204 98 -104 -149 -147 125 290 20 -95 -64
7551f4R0J69K1j68j59n4K22J60ok68q9PL16Q8k60j15J16j43L37M0k10j85J17K65
$$ -64 26 195 216 48 -111 -165 57 217 211 -57 -146 -139 177 265 5 -110 6 -137 200 240 30 -155 -38 227
7575B27oj58k77k7K57J23J8k95P1m9K42l7l2J00k22M6p2J49j05j50J29L4M6l5
$$ 227 221 63 -214 -241 16 139 157 -138 -67 -116 126 89 57 157 -65 -19 -91 58 -47 -197 -68 -34 12 -23
7599b3R1k67J65R9R7r5j25M1P5J63%k03j33l2K35O1M2k58pJ16M7j35L06l89J1
$$ -23 68 -199 -34 65 162 67 -58 -17 58 221 221 18 -115 -147 88 149 191 -67 -74 42 89 -46 260 -129 -118
7624a18J0J40J21k11j23N8J38M9Q3j44j76K07Q7J07j19k07J22O5J56j68j06j32
$$ -118 -108 32 153 -58 -181 -123 15 64 147 3 -173 34 121 228 109 -98 24 89 245 77 -29 -161
7646a61Q0J84M8o7k00r0K78J35j47l0j99OK78j8j40k1n5M4K7J87p7k67Q2J03J61
$$ -161 -81 103 151 84 -116 -206 72 207 60 30 -169 -163 115 97 -43 -64 -119 -75 -48 139 62 -205 -123 -20 141
7671A41p2lk03K29k8J6j13q3RJL73jk67j19N0J43J46l01j67J23K25O4j58q1j44
$$ 141 69 66 -137 92 64 80 -33 -116 -107 -106 267 266 -1 -120 -70 73 219 -82 -249 -126 99 163 5 -76 -220
7696b20L6L44pk55K04k15J15J18q8l7j72K1J95J73j31j20j68K12J36Q7k23l7J8
$$ -220 -184 160 153 -102 102 -113 2 120 32 -5 -177 -156 39 212 81 -39 -207 5 141 228 5 -32 -14
7719a4J35N2j38J1p0Ok9J08p0K0Pq2K19j89K9l0J4P5N2n3l6m9%o8K70k32j95J40
$$ -14 121 173 35 46 -24 -18 -47 61 -9 11 18 -64 155 -34 -5 -35 -21 54 106 53 17 -32 -32 -100 170 -62 -257 -117
7747a17J62K06l8l09l1j2J33%J9q7j25J56J20J70k21j86J04p1M47l87K03k56J24
$$ -117 45 251 213 -96 -127 -139 -6 -6 13 -74 -199 -43 77 247 26 -160 -56 -127 320 -67 136 -120 4
7770Dl3J53j53q6J85r8P5N9J0k80JK93Nj61j35P8J74K1k1k74lJ46j9O1K18l01
$$ 4 -29 124 -29 -115 70 -28 47 106 116 -164 -163 130 135 -26 -161 -83 91 112 91 -183 -186 -40 -59 2 220 -81
7796h1J09N7Q1k57K02nk32K86o4m3k57M48j78K1KOj45K7J93j17r9p0n4J70L7M4
$$ -81 28 85 166 -91 111 106 -126 160 96 53 -204 244 66 87 89 95 -50 -23 170 53 -46 -116 -170 0 37 81
7822H1o5k73J30m4J24J24q3KK3K8o8N7j68J44K5j7j2K5K5j25L6k0J99j60K5k8
$$ 81 16 -257 -127 -171 -47 77 -6 -4 19 47 -21 36 -132 12 37 20 8 33 58 -67 -31 -51 148 -12 13 -15
7848a5J85j9j46p0j35J43K46n3j4k20jQ1LP0j03J58k04Q0J5R9j1j23J14j25J7
$$ -15 170 151 5 -65 -200 -57 189 136 122 -98 -99 -18 -15 55 -48 110 -94 -14 1 100 89 -34 80 -45 -28
7873b8l5M7k5M3J06j38J10j64j0K5R2k31K17K22j14p9j90J31J5L2R9rj97o9J71
$$ -28 -63 -16 -41 2 108 -30 80 -84 -94 -69 23 -208 9 231 117 38 -152 -21 -6 26 125 116 -81 -150 21
7898B1M2J4j00J36p1p0L2J32j24j40M9J94R7k97J5JQ2J0J90K9l12l9J77p3j7j7
$$ 21 63 77 -23 113 42 -28 4 136 12 -128 -79 115 212 -85 -70 -69 13 23 213 242 -70 -109 68 -5 -22 -39
7924c9l7n9P3m7J71J12q0n5J10o1j9k31K21n0J12j86J20j56J05M6j33P5pJ16j7
$$ -39 -76 -135 -62 -109 62 174 94 39 149 88 69 -162 59 9 121 -65 55 -101 4 50 -83 -8 -15 101 84
7949H4Rj34R1r7R9L3O5j46O7j08J07j42N8L4o9L7j20K02j8j9q5J21k6q1KL8p6
$$ 84 93 -41 50 -47 52 85 150 4 71 -37 70 -72 -14 20 -49 -12 -132 70 52 33 -52 69 43 -38 -36 2 -74
7976g4n4J58J1m3r3J72q4Q5j04j64K94m8j3k04J40r0J20j19K00m1j08rK96l76
$$ -74 -128 30 41 -2 -95 77 -7 78 -26 -190 104 56 43 -161 -21 -111 9 -110 90 49 -59 -68 228 -148
8000a48J34J57j95O2Q4n3oj14Q8J24R7j98j20O5p4N0J29p1l4M7k5M9jN1k07K44
$$ -148 -14 143 -52 10 94 41 35 -79 9 133 230 32 -88 -23 -97 -47 82 11 -23 24 -1 48 47 98 -109 135
8026A35j18J82j12j58J7J92j24J5j57P0J23Q8mk6j52Q4q6K7n4J00j1p4N8j66J07
$$ 135 17 199 87 -71 -54 138 14 29 -128 -58 65 153 149 123 -29 55 -31 -4 -58 42 31 -43 15 -151 -44
8051d4L5M2j39l7J82ro2J29J2m4Nj41j16P2J82L6j15J46r3J8k9J52j97j8P7K5
$$ -44 -9 33 -106 -143 39 30 -32 97 109 65 70 -71 -187 -115 67 103 -12 134 41 59 30 182 -15 -33 44 69
8077F9j8k2K4p2K07l24K16l3k9j34O0P0r4k1J31O2j06L2p5l4N5k4J50j05J3q6
$$ 69 51 29 53 -19 188 -136 80 47 18 -116 -56 14 -80 -101 30 92 -14 18 -57 -91 -36 -60 90 -15 -2 -88
8103h8J47m3K7l4l30R9L26L6j15J5j37L4K45k13L9k17K54%Q6o9j58J66l8j12O4
$$ -88 59 16 43 9 -321 -222 104 140 25 40 -97 -63 182 -31 8 -209 45 45 131 62 -96 70 32 -80 -16
8128a6L5k7K9N8O3m8j3j03o1J39K5j40J38k06P5P4%p8J2j8QQ2m0N8N3j63J83j06
$$ -16 19 -8 21 79 142 94 81 -22 -83 56 81 -59 79 -127 -52 22 22 -56 -44 -62 -54 28 -12 46 99 -64 119 13
8156A3R0j81J43R4j11Q0k36Q3J50j75K02o8q3j36J36O8k46O2N6n1P4K22k54Rj10
$$ 13 103 -78 65 159 48 128 -108 -25 125 -50 152 84 1 -135 1 69 -177 -115 -59 -110 -36 186 -68 -59 -169
8181a69K03j75J36M9j17j4O5L7m1J30
$$ -169 34 -141 -5 44 -73 -87 -22 15 -26 104
8191A04
$$ Imaginary data points
##PAGE= N=2
##DATA TABLE= (X++(I..I)), XYDATA
0@%%%%%%Qq%qJ6j6J6j8K6l3M1m8N6p2Q8j05J23j42J69k01K31k64L05l49L97m54
$$ 0 0 0 0 0 0 0 8 0 0 -8 8 -8 8 -10 16 -17 24 -24 32 -40 48 -57 66 -76 93 -108 123 -141 164 -185 212 -242
32b42N13n78O54p35Q22r19J024j140J269j408J558j724J907k105K320k556K814
$$ -242 271 -307 347 -388 434 -485 539 -601 668 -740 818 -906 1001 -1104 1216 -1340 1474
49A474l099L415l761M147m581N066n616O248o975P826q843J0072j1598J3555j6149
$$ 1474 -1625 1790 -1971 2176 -2405 2661 -2955 3293 -3682 4144 -4699 5373 -6225 7330 -8819
64h819J9759k5135L3942n0714R3178l86688p18614J066026N46985k70233k31173
$$ -8819 10940 -14195 19747 -30967 62211 -324477 -1043091 22935 569920 299687 68514
75F8514l80399j23353N09360L02314r3119l41258k85143J37828K04253K17989
$$ 68514 -311885 -435238 74122 376436 283317 -57941 -343084 -205256 -1003 216986
85B16986L20054n99011p90355O99845Q07783m12940l40239q3149k16241L86662
$$ 216986 537040 -61971 -852326 -152481 655302 242362 -97877 -181026 -397267 -10605
95a0605N14484k66616m50777j22975K00418L38087M4074j15096k04073l95920
$$ -10605 503879 237263 -213514 -336489 -136071 202016 246090 130994 -73079 -468999
105d68999K78449P29308k51562n68530J19942L3103N0280M55319j02553n50684
$$ -468999 -190550 538758 287196 -281334 -161392 -128289 -78009 377310 274757 -275927
115b75927k7044K75234K15409P4534k22968k41858o7751J87985M72302o2674o57239
$$ -275927 -302971 -27737 187672 262206 39238 -202620 -270371 -82386 389916 327242 -329997
126c29997j4016M32258K9844M8954k3360m18046N354M29490M4898j50265q6638
$$ -329997 -344013 88245 118089 167043 143683 -274363 -269009 160481 205379 55114 -31524
137c1524j26089L0849J75158J57588j7608l65786j55057L95327J85110j58029
$$ -31524 -157613 -126764 48394 205982 188374 -177412 -332469 62858 247968 89939
147H9939p0896k08434q2119M33647J80979l52177j98947N3561J40191K01160j3887
$$ 89939 19043 -189391 -271510 162137 343116 -9061 -208008 -154447 -14256 186904 173017
158A73017k18321j48885K7323K54887J65541k04403j76853r044m307K48053K35976
$$ 173017 -45304 -194189 -166866 88021 253562 49159 -127694 -136738 -141045 107008 342984
169C42984l14677l49694J35149K80730J60854p7407l31827j46438K38821K79909
$$ 342984 28307 -321387 -186238 94492 255346 177939 -153888 -300326 -61505 218404
179B18404L1413k59941k43446R5415K16855J17009J9339k38707k68967J75893
$$ 218404 249817 -10124 -253570 -158155 58700 175709 195048 -43659 -312626 -136733
189a36733L33456K9857j69527k17012r7066K23120K80174k8505k67031k11698
$$ -136733 196723 226580 57053 -159959 -257025 -33905 246269 217764 -49267 -260965
199b60965Q3504K93039J40690j32353k58182j50806J99133L37576j0370k84045
$$ -260965 -177461 115578 256268 123915 -134267 -285073 -85940 251636 241266 -42779
209d2779j68619L8158K03273K08238o5129k75367j40775J28409K44047J04667
$$ -42779 -211398 -173240 30033 238271 173142 -102225 -243000 -114591 129456 234123
219B34123j50342k45378q1725J93937K77108L25k85534j86790R9811K27484J39750
$$ 234123 83781 -161597 -243322 -49385 227723 228048 -57486 -244276 -144465 83019 222769
230B22769r6609k56496j01478J78199K15848J9202j58901j74671k4081J73518
$$ 222769 126160 -130336 -231814 -53615 162233 181435 22534 -152137 -176218 -2700
240b700J95544k8354k26206j39619R7557J96993Q9148j01144j95380p6082J48782
$$ -2700 192844 164490 -61716 -201335 -103778 93215 182363 81219 -114161 -190243 -41461
251d1461J98746L176j75686j40339K1244J62104J50290o0244k15663q1992J33626
$$ -41461 157285 160461 -15225 -155564 -134320 27784 178074 117830 -97833 -179825 -46199
262d6199J58921K7590j15202j42683j5223J33162J37568j7133j61553j07569O8343
$$ -46199 112722 140312 25110 -117573 -132796 366 137934 120801 -40752 -148321 -79978
273g9978J46579P9521p6586j79434m5944J61871J32544m4098j28405q7686M0981
$$ -79978 66601 146122 69536 -109898 -155842 6029 138573 94475 -33930 -121616 -80635
284h0635J38573O8334p9932j30165l5957J05156J17273j0089j04325r5352J3204
$$ -80635 57938 126272 46340 -83825 -119782 -14626 102647 92558 -11767 -107119 -93915
295i3915J41634Q8459r4962j28481j2785Q3567J07807J4972j20418j03043M1591
$$ -93915 47719 136178 41216 -87265 -100050 -16483 91324 106296 -14122 -117165 -75574
306g5574J27078O8690p2069j26796k9167Q7203J11627K0269j21625j16200M8403
$$ -75574 51504 120194 48125 -78671 -107838 -20635 90992 111261 -10364 -126564 -78161
317g8161J28202N8244m8577j20676o7069R0230J36488J4089j12802j11524J4461
$$ -78161 50041 108285 59708 -60968 -128037 -37807 98681 112770 -32 -111556 -97095
328i7095J24473R1156l8941j28987q0691P5539J42523L0073r7131j08866k1322
$$ -97095 27378 118534 79593 -49394 -130085 -54546 87977 118050 20919 -87947 -109269
339a09269J01180J23692j2241j34792q9955M7238J23945P0611o1101j30970n3869
$$ -109269 -8089 115603 103362 -31430 -121385 -74147 49798 120409 59308 -71662 -125531
350a25531Q8908J32160J9522j11850j09947O600J11297J04311k1334j36363q8580
$$ -125531 -36623 95537 115059 3209 -106738 -100138 11159 115470 94136 -42227 -130807
361a30807O6621J32045N1114p1729j24623m5972R9022J30087N628j15011j06335
$$ -130807 -64186 67859 118973 47244 -77379 -123351 -24329 105758 111386 -3625 -109960
372a09960J3415J22210R5449l9915j30168p8379O8385J38220L7903r2472j08432
$$ -109960 -96545 25665 121114 81199 -48969 -127348 -58963 79257 117160 24688 -83744
383h3744k4670R2295J20600o167j20954q3180K7916J09538Q3721n2199j26897
$$ -83744 -108414 -16119 104481 98314 -22640 -105820 -77904 31634 115355 63156 -63741
394f3741m6882P5318J15529K5794j02563r5068J6840Q5573P8118j4056j09740
$$ -63741 -110623 -35305 80224 106018 3455 -91613 -74773 10800 88918 74862 -34878
405c4878n9825N3321Q2145M5959m3146j10423k6651Q9620P9714m882q4892p5629
$$ -34878 -94703 -41382 40763 86722 43576 -66847 -93498 -3878 75836 70954 -13938 -89567
417h9567M1122R1138K3457l9626o7019k8759O1203N8820q351l4396n1773j5815
$$ -89567 -48445 42693 66150 26524 -40495 -69254 -8051 50769 42418 8022 -43751 -59566
429e9566P4775N1025l9592n1804k6191K7063P1345M085o1576k8581R386L8382
$$ -59566 15209 66234 26642 -25162 -51353 -24290 47055 51140 -10436 -39017 -29631 8751
441H751L7937k9085m3987o34R728L6206K9220n2434m1241L0807K4223J5211J811
$$ 8751 46688 17603 -26384 -27018 -17290 18916 48136 -4298 -45539 -14732 9491 24702 26513
454B6513m8344j7860M0526K0201K658j3067m0256r40L7221K3605O052m5799n2599
$$ 26513 -21831 -39691 835 21036 23694 10627 -29629 -30569 6652 30257 36309 -9490 -62089
467f2089M8784O3863k0138l2961k6762j2153N4137L6538l7896k8090q910j695
$$ -62089 -13305 50558 30420 -2541 -29303 -41456 12681 49219 11323 -16767 -25677 -27372
479b7372L9229L0160j9234m2329l8854L3976Q2963q159o8901k3229M106M2359
$$ -27372 11857 42017 22783 -19546 -58400 -24424 58539 50380 -18521 -41750 -37644 4715
491D715O0757l2229p3141m092K7401L8784L6572l6385o7797j2005M8844P0802
$$ 4715 65472 33243 -39898 -43990 -16589 22195 58767 22382 -45415 -57420 -8576 62226
503F2226j562q7430l6688L8192M0522M1797j3584q7310k3575N8444M3795J9864
$$ 62226 60664 -26766 -63454 -25262 15260 57057 43473 -43837 -67412 -8968 34827 54691
515E4691k9635q1984j6137P7548O8297j3628r0125n2950N9982P2256P430l5344
$$ 54691 25056 -56928 -73065 4483 72780 59152 -30973 -83923 -23941 48315 55745 20401
527B0401o5513j8989P2325M4799k4470k5473l4496k0151N1875N5793j2245n8028
$$ 20401 -45112 -64101 8224 53023 28553 3080 -31416 -51567 308 56101 43856 -14172
539a4172m8812K5126P5081K2093m3170n7913k0276O2156O3607l5066n6175k904
$$ -14172 -62984 -37858 37223 59316 16146 -41767 -62043 113 63720 28654 -27521 -30425
551c0425J3062K4035K4280j3721k4900j3397o286K8045M0196q014m9241l6808
$$ -30425 -17363 6672 30952 17231 -7669 -21066 -27352 693 40889 32875 -16366 -53174
563e3174K9831P3212J750p2495k5582L6269L0656M639k1875j9319R058L009n819
$$ -53174 -23343 49869 51619 -20876 -46458 -10189 20467 25106 3231 -16088 -7030 -4021 -9840
576i840K1600J5887k8045l4324R065M8287J8907m5697l3923K7086K8570m653j1576
$$ -9840 11760 27647 -398 -34722 -25657 22630 41537 -4160 -38083 -10997 17573 12920 1344
589A344m913L64k774l418J9164J7134k6377l2979J6985M2136L614m2477k2283
$$ 1344 -3569 -3205 -5979 -9397 9767 26901 524 -32455 -15470 26666 30280 -12197 -34480
602c4480L4559K9313k3400k7333J3574K2155q109k1082P727K3802q709k8685O032
$$ -34480 79 29392 5992 -21341 -7767 14388 6279 -14803 -7076 16726 8017 -20668 -14636
615a4636L4657L712l9599j9476M0043L7374k9214n0412P719N3246J6915m2493
$$ -14636 20021 23733 -15866 -35342 4701 42075 12861 -37551 -29832 23414 40329 -2164
627b164l1905K1628L0824j360j8291o399N676j927n112J5780J7442k0341l3503
$$ -2164 -34069 -12441 18383 17023 -1268 -7667 -1991 -3918 -9030 6750 24192 3851 -29652
640b9652N157L9947K1730l0172m0421P286L5325J5851r499k3576j6427J1022K2624
$$ -29652 -24495 15452 37182 7010 -33411 -26125 9200 25051 15552 -8024 -24451 -13429 9195
653I195J3522m617k9924k0836K4227L4169N95k6180k4299N277K5316J0846k573
$$ 9195 22717 18100 -11824 -32660 -8433 25736 26331 151 -24148 -18871 6445 17291 14718
666A4718r682k4214p815K9160K6806n277l3915k8756K1503M4956K463l0766k1527
$$ 14718 5036 -19178 -26993 2167 28973 23696 -10219 -38975 -17472 27484 29947 -819 -22346
679b2346m9K2348K0319m115j3657j7552r668K3007K8409n775k4133k0733J576
$$ -22346 -22395 -47 20272 16157 2500 -15052 -24720 -1713 26696 20921 -3212 -23945 -22369
692b2369L2479K0191j5739k4288j7326O719L8339J8750k8263l4809o925L0641
$$ -22369 10110 30301 14562 -9726 -27052 -20333 18006 36756 8493 -26316 -33241 -2600
704b600L7450r991l8624j3695J1884K2940J7855j1125k3847j1553J178K6781L0199
$$ -2600 34850 24859 -13765 -27460 -15576 7364 25219 14094 -9753 -21306 -20128 6653 36852
717C6852j8327m3525j0262K9593L8994R14m5539k5132K3861K9688Q390j7016k5264
$$ 36852 18525 -25000 -35262 -5669 33325 34239 -11300 -36432 -12571 17117 25507 8491 -16773
730a6773p32J4934R572J0102n428k6563p662J9168J9141L918k0550k2979J0787
$$ -16773 -17505 -2571 7001 17103 11675 -14888 -22550 -3382 15759 19677 -873 -23852 -13065
743a3065K2733M866p043j4151q635J1352J1713J839k845j3316p014J5256R083
$$ -13065 9668 14534 7491 -6660 -15295 -3943 7770 9609 6764 -6552 -13566 1690 10773
756A0773o261m564m011K04N177j056J699N645q753r718O766R753K530o708j1441
$$ 10773 4512 -52 -4063 -3859 1318 262 1961 7606 -1147 -10865 -4099 5654 8184 1476 -9965
771i965L783J1787k711n130L094m88k945n80J546P418R92j1469l460Q254N397
$$ -9965 -6182 5605 2894 -2236 858 370 -2575 -3155 -1609 5809 6801 -4668 -8128 126 5523
786E523L11n300o038L218M742o29J001n98m753l98J766J182L706k07n661l413
$$ 5523 5834 534 -5504 -2286 2456 1827 2828 2230 -2523 -2921 -1155 27 3733 3526 -2135 -5548
802e548P66N324P350k748j0773m249N820R663N239p631j2158j658R023J0913L554
$$ -5548 -4782 542 7892 5144 -5629 -9878 -4058 5605 10844 3213 -8945 -10603 -1580 9333 12887
817A2887j0917j4845j84J5000J4208k006j8374j5001P418K2030J0960j2302k3114
$$ 12887 1970 -12875 -13059 1941 16149 14143 -4231 -19232 -11814 10216 21176 8874 -14240
830a4240q447J7876K3207J770k0627k1248J611K5058J8738r173k4156j4478J1023
$$ -14240 -22687 -4811 18396 20166 -461 -21709 -20098 4960 23698 14525 -9631 -24109 -13086
843a3086K6968J1269j7955k4286n180J8302K4450K102k3319k0780K763K3624K0477
$$ -13086 13882 25151 7196 -17090 -22270 -3968 20482 22584 -735 -21515 -18752 4872 25349
856B5349q986k7581j2062J2860K3076J0232j6495k3101k099J5343J7092M815j6736
$$ 25349 16363 -11218 -23280 -10420 12656 22888 6393 -16708 -18807 -3464 13628 18443 1707
869A707j9566P24J7323J7114o21k1694j5071Q878J7939J0876o244k0458q543J2074
$$ 1707 -17859 -17135 188 17302 16681 -5013 -20084 -11206 6733 17609 11365 -9093 -17636 -5562
883e562J4614P304p700j9977n792J4192J5366M067j3153j9551O81J7579J2317
$$ -5562 9052 16356 8656 -11321 -17113 -2921 12445 16512 3359 -16192 -15511 2068 14385
896A4385p90j5990j6596O853J9110Q676o181j7924j0810J3441J7934K624j0836
$$ 14385 13595 -2395 -18991 -12138 6972 15648 9467 -8457 -19267 -5826 12108 14732 3896
909C896j6488l206J7179J2774l434j1172j2889J859J8247Q167q906j2224o817
$$ 3896 -12592 -15798 1381 14155 10721 -451 -13340 -11481 6766 14933 6027 -6197 -13014
922a3014Q768J4962p32j1059o680k74R329P668o109o424n31n69O039N463o281
$$ -13014 -4246 10716 9984 -1075 -7755 -8029 1300 8968 2859 -3565 -4096 -4665 1374 6837 556
937E56m885J674K181L277m96n230K025L586k106j250j343J528O253k454p811J450
$$ 556 -4329 -2655 -474 2803 2307 -2923 -898 2688 582 -668 -2011 -483 5770 3316 -4495 -3045
953c045L817R24L369k462q039n90N298O277K668r113j0202L784J1027P615n278
$$ -3045 772 1696 5065 2603 -5436 -6026 -728 5549 8217 -896 -11098 -7314 3713 11328 6050
968F050j5543k938J2710P624m52m923j0777k472J1602R365m81j0166j1838K590
$$ 6050 -9493 -12431 279 7903 7451 2528 -8249 -10721 881 10246 9765 -401 -12239 -9649
982i649J4987Q579o109j4980o845J0900J2543K22o449j0396o292J0546J4133j70
$$ -9649 5338 13917 7808 -7172 -14017 -3117 9426 9648 3199 -7197 -13489 -2943 11190 11020
996A1020j1796j0955L92J3540R913l951j1343q566L475J1831Q034k228j2079j3186
$$ 11020 -776 -11731 -11339 2201 12114 8163 -3180 -11746 -8271 3560 11594 9366 -2713 -15899
1010a5899N154K1369Q536j4487j8266k239J5768J5672k987j5070j0177K069J1859
$$ -15899 -10745 10624 19160 4673 -13593 -15832 -64 15608 12621 -2449 -12626 -10557 1302
1023A302J1427p24j3402j5491J615K2015J5412j3000k4013o190J7416K0938k40
$$ 1302 12729 12005 -1397 -16888 -15273 6742 22154 9154 -14859 -21049 -3633 17305 17065
1036A7065j9570j4820N076J6535J1577m698j6056j1042O041J8407R957j1504j8872
$$ 17065 -2505 -17325 -12249 4286 15863 11165 -4891 -15933 -9892 8515 18472 6968 -11904
1049a1904m065J4000J5478J68j4571j2484K459J3619J0284l959j4001q873O469
$$ -11904 -15969 -1969 13509 13677 -894 -13378 -10919 2700 12984 9025 -4976 -13849 -7380
1062g380J4664N192j0271j2064O87R968P035k738o698l187J400L258L696J187
$$ -7380 7284 12476 2205 -9859 -9172 796 7831 5093 -1605 -4792 -3392 -134 3562 4749
1076D749k976n340j753N064O196n71o660l795J684N252K954l346m013n5J653J067
$$ 4749 1773 -3567 -5320 -256 5940 5369 -1291 -5086 -3402 1850 4804 1458 -2555 -2610 -957 110
1092A10P03J11N12k052m197J120O948L642n425q856j9J0933O057p834q090J911
$$ 110 813 924 1436 -616 -4813 -3693 3255 6897 1472 -7384 -7403 3530 9587 1753 -6337 -4426
1108d426O751K251m478j663M010o56o431Q62Q233L562p688j0164L485J3021J702
$$ -4426 2325 4576 98 -1565 2445 1789 -4642 -3780 4453 8015 327 -9837 -6352 6669 8371
1123H371r839m964L413M393K44j839J905P15p007k737Q416Q222l340j1754m938
$$ 8371 -1468 -6432 -3019 1374 1618 -221 1684 2399 -4608 -7345 1071 9293 5953 -5801 -10739
1138a0739R575J0555k241p830n030j299N968R314J457r285j2167N03J6785J0517
$$ -10739 -1164 9391 7150 -680 -5710 -7009 -1041 8273 9730 445 -11722 -11219 5566 16083
1152A6083j0752j6308k271J2225J1916k656r924n133j370L981J2349N530j1991
$$ 16083 5331 -10977 -13248 -1023 10893 8237 -1687 -6820 -8190 -4209 8140 13670 1679
1165A679j6809k52K0761J6110j2647k3780k496J8567J4883n341j6077n325O822
$$ 1679 -15130 -15382 5379 21489 8842 -14938 -17434 1133 16016 10675 -5402 -10727 -3905
1178c905O056M430J777p948j0447K26J1776J1707n009j7252o065J1824J2822M08
$$ -3905 2151 6581 8358 410 -10037 -9811 1965 13672 8663 -8589 -14654 -2830 9992 10400
1192A0400j1308r445K876R167N906r99q489p099M231Q755L042l618o143k472K871
$$ 10400 -908 -10353 -7477 1690 7596 6597 -1892 -8991 -4760 3995 7037 3419 -2724 -5196 -2325
1207b325M056K766O69n575o974J850R192O020n932j1704q14J0904N734m993o243
$$ -2325 1731 4497 5166 -409 -7383 -5533 3659 9679 3747 -7957 -8771 2133 7867 2874 -3369
1222c369j113L148J884J52J704L47n535l832N127Q054J37r164n853N867Q249m48
$$ -3369 -4482 -1334 550 702 2406 2753 -2782 -6614 -1487 6567 6704 -2460 -8313 -2446 5803 5355
1238E355n670l297J080L263J959l82j679k603q68K616L133j394k781k98J297k07
$$ 5355 -315 -3612 -2532 731 2690 2308 629 -1974 -2842 -226 2907 1513 -1268 -1566 -269 -476
1254d76n12J299K121j808m306K83N322K055l344l166P54K148j80Q4K713K40o130
$$ -476 -988 311 2432 624 -3682 -3399 1923 3978 634 -2532 -1778 370 190 274 2987 3227 -2903
1271b903m009O547R077j708j1208o598Q233J1547q52r901o368K479P627M938k459
$$ -2903 -6912 -365 8712 7004 -4204 -10802 -2569 8978 8126 -1775 -8143 -5664 1963 6901 4442
1286D442o169n417L35Q790Q046m244j1580n393P409J2881J672j1121r300J748
$$ 4442 -1727 -7144 -6809 1981 10027 5783 -5797 -11190 -3781 9100 10772 -349 -9649 -7901
1300g901R555R006k903j1885n956M881J0200O376p415j1937j232Q561Q547kr101
$$ -7901 1654 10660 7757 -4128 -10084 -5203 4997 11373 3958 -7979 -9211 -650 7897 7895 -1206
1315a206o977K370O053N923L96q048p225K973Q066O054k840j0939m093Q175P870
$$ -1206 -8183 -5813 240 6163 6559 -1489 -8714 -5741 2325 8379 5539 -5400 -9493 -1318 6552
1330F552P8o138o445J380N493K823J059k932o721o48N759M880R36o355p832L138
$$ 6552 6630 492 -5953 -4573 920 3743 4802 1870 -4851 -5499 260 5140 6076 -279 -8111 -4973
1346d973Q673K319l126o417l478N342N750M52k944n747k134O277M924j013l494
$$ -4973 3700 6019 2893 -3524 -7002 -1660 4090 4542 1598 -4149 -6283 -6 4918 3905 411
1361D11n233k84P335L360l122l759l362K241O342O64m161l251p73L742M295l198
$$ 411 -4822 -5106 2229 5589 2467 -1292 -4654 -2413 3929 4593 432 -2819 -3592 150 4445 1247
1377A247l159L37J94K169J408l055q13J526l28Q98O2k198J395J755j235q31l42
$$ 1247 -1912 -1575 -1381 788 2196 -859 -1672 -146 -474 424 486 -1712 -317 1438 203 -628 -970
1394i70m10L686J011m352j486P74K332M028j825o186j052L744M526J685n630o462
$$ -970 -1380 2306 3317 -1035 -2521 -1747 585 4613 2788 -3398 -4450 -706 3820 5505 -125 -6587
1410f587K502N896L912j362p907m524N757O951J727m621q075j482Q519O286j110
$$ -6587 -4085 1811 5723 4361 -3546 -8070 -2313 4638 6365 1744 -6331 -7813 706 6992 5882
1425E882o822p633K983R907L945m279q122m809O752R767l9p000p073p44Q216P134
$$ 5882 -940 -8573 -5590 4317 8262 3983 -4139 -8948 -2196 7571 7532 532 -6541 -7285 931 8065
1441H065k571p803n216J987Q895M605m977p062l480M237Q449K104o361o281j348
$$ 8065 5494 -2309 -7525 -5538 3357 7962 2985 -4077 -7557 -3320 5129 7233 872 -5409 -6757
1456f757N545P718L26p671n690J077P231N727k576p490m239L049P093M265m391
$$ -6757 -1212 6506 6832 -839 -6529 -5452 1779 7506 4930 -2560 -6799 -3750 3343 7608 3217
1471C217p643k333M245P731K252o616p861K30P553O407j898p912m987L450P725
$$ 3217 -4426 -6759 -2514 5217 7469 853 -7008 -6778 775 7182 5284 -2628 -7615 -4165 3560
1486C560L455l995p508k466N211P340J397o439p004Q22P731N034l170p096k834
$$ 3560 7015 3020 -4488 -6954 -1743 5597 6994 555 -6449 -5627 2104 7138 3968 -3128 -5962
1501e962L832O243J379m861m767j15M152M484m79n664l324K378N394J718m341
$$ -5962 -2130 4113 5492 631 -4136 -4251 -99 4385 3906 -1758 -5082 -2704 2690 4408 67
1516F7m378J445M452J459j922l396k79L155J778j078j855j163P31K982P42k540
$$ 67 -4311 -2866 1586 3045 1123 -2273 -2552 603 2381 1303 -552 -1715 -984 1998 2740 200
1532B00k568l0L676K986l150m300k20L316L723l29n591k596L150M072J865k926
$$ 200 -2368 -2398 1278 4264 1114 -3186 -3406 -90 3633 3304 -2287 -4883 -1733 2339 4204 1278
1548A278n223q03M994M068k08n082m661K769N835J961k273n084k850M072N108
$$ 1278 -3945 -4748 246 4314 4106 -976 -5637 -2868 2967 4928 2655 -2429 -5279 -1207 3901
1563C901R61l158n334k391N841O408j187o125n585K145P759L040m173n535k484
$$ 3901 4862 1704 -3630 -6021 -180 6228 5041 -1084 -6669 -4524 3235 6275 2102 -3433 -5917
1578e917L254O578J605m020n032k956M250Q207J004o997o580L65Q013O650l477
$$ -5917 -2663 3915 5520 1500 -3532 -6488 -2238 5969 6973 -24 -6604 -6239 1774 8424 4947
1593D947q003m027K986Q305M431n910p907k505N444R008J767r164p671J838P863
$$ 4947 -3056 -7083 -4097 4208 8639 2729 -5178 -7683 -2239 6769 8536 -628 -8299 -6461 1402
1608A402O409j979r451m947L697Q832N277n574j0700j992P936Q878J025j0103
$$ 1402 7811 5832 -3619 -8566 -4869 3963 9240 3666 -7034 -9026 -1090 7788 8813 -1290
1622a290q326L918R892M354m530q625l303O080P281J411n312p625n95P311N996
$$ -1290 -9616 -5698 4194 8548 4018 -4607 -7910 -1830 5451 6862 1550 -6075 -6670 641 6637
1637F637j593o892n715L302Q062K732m541o413k089N606O602p75o322m069K422
$$ 6637 5044 -1848 -7563 -4261 3801 6533 1992 -4421 -6510 -904 5698 4923 -1399 -5468 -3046
1652c046N678K051l418l853p6K688K205K76k090j695r00J273L403L25l577k743
$$ -3046 2632 4683 1265 -2588 -2664 24 2229 2505 415 -1280 -2180 -907 2496 2821 -756 -3499
1668c499J838M032P44l660k715J539L644K71k780j516J387J370M0l62l79o12k44
$$ -3499 -1661 2371 3115 -545 -3260 -1721 1923 2194 -586 -2102 -715 655 695 333 -46 -658 -902
1685i02R53J772l90k493r96J766K673N0k955k090J491K064J387o18k936k151J749
$$ -902 51 1823 1433 -1060 -2056 -290 2383 2433 -522 -2612 -1121 943 2330 1712 -1224 -3375 -1626
1702a626M071J167l209m657K70N346K964k073m524k223K689M396J073j847l717
$$ -1626 2445 3612 403 -4254 -3984 1362 4326 2253 -2271 -4494 -1805 2591 3664 1817 -1900
1717a900l198K948O660J699n331p069k78Q686O203m397q376l005N079Q022R92
$$ -1900 -5098 -2150 4510 6209 878 -6191 -6469 2217 8420 4023 -4353 -7358 -2279 5743 6735
1732F735o672n759m34N663P227n95q339n524K332Q182O011m854r779k173N985
$$ 6735 63 -5696 -6130 -467 6760 6165 -2174 -7698 -5366 2816 8827 3973 -5806 -7979 -1994
1747a994Q192K170p797q570J364Q205O928j835j0316n556O258Q277K460n759q363
$$ -1994 6198 8368 571 -7999 -6635 1570 8498 6663 -3653 -9209 -2951 5326 7786 2027 -6336
1762f336l88O797N095K59m882p055J52P693N357j632p586o073M989Q948J419n577
$$ -6336 -6724 73 5168 5427 545 -6510 -6358 1335 6692 5060 -2526 -8599 -3610 5338 6757 1180
1778A180o546n73O747M544j710l887l987m13N979M315k356m756l864J895P102
$$ 1180 -5366 -5939 808 5352 3642 -245 -4232 -4645 1334 5649 3293 -1463 -5327 -3432 3670
1793C670K054m473m785j267L492N396r3m265l410p22M554N243k314n790j825K416
$$ 3670 5724 1251 -3534 -4801 -1309 4087 3994 -271 -3681 -4403 151 5394 3080 -2710 -4535 -2119
1809b119M942J820m292l533M63K575K987P48l646l065L10L356L954j323o396j207
$$ -2119 2823 4643 351 -3182 -2719 -144 2843 3591 -55 -3120 -2810 546 4500 3177 -3219 -4426
1825d426M400L574K27m696l668K718M515R7k215k957p16L208K449m78k247l187
$$ -4426 -26 3548 3775 -921 -4589 -1871 2644 2741 526 -2431 -3147 61 2510 2032 -215 -3402
1841c402P59M906J758l425l448n11L831M055j755m978j353K118M016J961l880
$$ -3402 -2643 2263 4021 596 -2852 -3363 468 4523 2768 -2210 -3563 -1445 2571 4532 652
1856F52m438J13M230M036q70o331k894L851N126J350m365n133M81N117L400j018
$$ 652 -3786 -3673 557 4593 3723 -2608 -5502 -1651 3475 4825 460 -4673 -4192 925 4325 3307
1872C307m380m048J873N756K996k836o210k462N012O331j68n489n233J240O478
$$ 3307 -1073 -5121 -3248 2508 5504 2668 -3542 -6004 -992 5339 5171 -318 -5551 -4311 2167
1887B167L657k861n452k670K387O008K387l895n654j881M509O154M08n857n164
$$ 2167 5824 2963 -2489 -5159 -2772 3236 5623 1728 -3926 -5807 -1298 4856 5264 -593 -5757
1902e757R83O054M631j965o406l356K647O338L241l949o506j885M573O466R97
$$ -5757 -4774 1280 5911 3946 -2460 -5816 -3169 3169 6410 2461 -4045 -5930 -1357 5109 6106
1917F106o002n772N60O405M991j572o885m665K936P241L536m266p590k103N965
$$ 6106 104 -5668 -5108 1297 6288 4716 -2169 -6834 -3898 3343 6879 2613 -4977 -7080 -1115
1932a115O852L26o731o061J387P443M754k956p031l686L990P368K517n371o952
$$ -1115 5737 6063 -668 -6729 -5342 2101 6855 3899 -3132 -6818 -2828 4540 7057 1686 -5266
1947e266r22O261O341q28o990n075K587O967L478m013o726j570M475N806O57n332
$$ -5266 -6188 73 6414 5586 -1404 -6479 -3892 3075 6553 2540 -4186 -5756 -1281 4525 5182 -150
1963a50n371J297N504L882k112n643k816L719N148J113l956m685M26M825L003
$$ -150 -5521 -4224 1280 5162 3050 -2593 -5409 -1690 3458 4571 615 -4070 -3644 1181 4184
1978D184j471l991k582K077M482R13k982l237r12L749L274j314l510j898J463
$$ 4184 2713 -1278 -3860 -1783 2699 3612 630 -2607 -3519 230 3504 2190 -1320 -3218 -1755
1993a755L577J218k621k950N4K196K961m14l255j894J182K904J999j833l763n90
$$ -1755 1822 3040 419 -2531 -2477 -281 2680 2266 -989 -2883 -1701 1203 3202 1369 -2394 -2984
2009b984K867K980r6l173k779J388L293J706j510l746j438K718L199Q07k659m075
$$ -2984 -117 2863 2767 -406 -3185 -1797 1496 3202 1692 -2054 -3492 -774 2425 3232 573 -3502
2025c502k68M608L054j169m386l294K497N519J422l531m669q91M748M445o28m652
$$ -3502 -3770 838 3892 2723 -1663 -4957 -2460 3059 4481 950 -3719 -4610 138 4583 3955 -697
2041f97m174J229N925L696k990o207k699M030O758J271o010n914N59O468N226
$$ -697 -4871 -3642 2283 5979 2989 -3218 -5917 -1887 4871 6142 132 -5782 -5223 1245 6471
2056F471k328p027l943L494O858L312m538p760j127N757O774L47p210o275K395
$$ 6471 4143 -2884 -6827 -3333 3525 6837 2299 -5461 -6588 -831 5943 6290 -920 -7195 -4800
2071d800P762M422l756p704k885N253O890J589n802o930J2O902N558j639p127
$$ -4800 2962 7384 3628 -4076 -6961 -1708 5182 6771 969 -5961 -5949 953 6511 4872 -2255
2086b255m822L078P601L144m704o840j511N404O282j81n680n220J012O417M119
$$ -2255 -7077 -3999 3602 6746 2042 -4798 -6309 -905 5377 5196 -484 -5704 -4692 1725 5844
2101E844k336n985l391L252O221K075m313n330q41M420N274k5n443m738J571N746
$$ 5844 3508 -2477 -5868 -2616 3605 5680 1367 -3963 -4804 -384 4890 4865 -578 -5316 -3745 2001
2117B001L127k539n272k343L226N052J188l975m421k36M395M028n06m957l629
$$ 2001 5128 2589 -2683 -5026 -1800 3252 4440 465 -3956 -4192 203 4231 3725 -1232 -4861
2132d861K076N319K225l194m732j029L749M347p8m335l384J175M428K803k212
$$ -4861 -2785 2534 4759 1565 -3167 -4196 -447 3900 3822 -513 -3897 -2722 1706 4509 2297
2147B297m789k015L276M928M16m741l691J133M498K882k220m558j952L173M311
$$ 2297 -2492 -4507 -1231 3697 4113 -628 -4319 -3186 1312 4194 1974 -2584 -4536 -1363 2948
2162B948R93l553m253Q2M547L915j538n625k720L927N243P06m474m723N62N506
$$ 2948 3941 388 -3865 -3783 764 4679 3141 -2484 -5204 -1277 3966 4672 198 -4525 -3963 1543
2178A543L469k294n018k467K926N142J581m305m843m92M972M914j145n977l728
$$ 1543 5012 2718 -2300 -4767 -1841 3301 4882 577 -4266 -4758 214 5128 3983 -1994 -5722
2193e722K676O158K696m421n819o80M822N386k94n767m575K053N776L420k880
$$ -5722 -3046 3112 5808 1387 -4432 -5112 -290 5096 4802 -965 -5540 -3487 2289 5709 2829
2208B829o050k203L977N404J472m595n796p4N491M879p56o451m576L088O505K550
$$ 2829 -3221 -5424 -1447 3957 5429 834 -4962 -5036 455 5334 4578 -1873 -6449 -3361 3144 5694
2224E694l539o385j431M831N390L43m816n213M25N928M387j576n994m167L121
$$ 5694 2155 -4230 -5661 -830 4560 4903 87 -5126 -4701 1227 5614 4038 -1956 -6123 -3002
2239c002O579K575m233o048j563N102N776j10n701m978R34O434M592k982o667
$$ -3002 3577 6152 1919 -4129 -5692 -590 5186 5076 -625 -5603 -4669 1765 6357 3375 -3292
2254c292k895L858O510J723n093n760j26N091N293o27o089m233K007O170L721
$$ -3292 -6187 -2329 4181 5904 811 -4949 -5075 16 5309 4682 -1407 -5640 -3633 2537 6258
2269F258l427o847j943N078O038R9n997m918J844N829L343k373o061k315L932
$$ 6258 2831 -4016 -5959 -881 5157 5256 -741 -5659 -3815 2014 5357 2984 -3077 -5392 -1460
2284a460N212J082m373n060N6N377M041j650n303l035K799N474J724l806n010
$$ -1460 3752 4834 461 -4599 -4543 834 4875 3225 -2078 -5113 -2314 3160 4884 1078 -3932
2299c932k68M625M251j381m913l056K444M978J733l540m145n48L758L627m46m121
$$ -3932 -4200 425 4676 3295 -1618 -4674 -2230 2748 4481 941 -3204 -3752 6 3633 3187 -934
2315i34k820J146M209K662k456m533j558L326M574K55m525l462J290M448K655
$$ -934 -3754 -2608 1601 4263 1807 -2726 -4284 -958 3616 3871 -654 -4116 -2826 1622 4277
2330D277k347m406j406K972M068R47l618l851j43M154L552j145m524k914K090
$$ 4277 1930 -2476 -3882 -910 3158 4105 487 -3364 -3507 647 4199 3054 -1470 -4384 -2294
2345b294M638K045l159m741p69L846M414j97m576l784J107N079L294k200n434
$$ -2294 2344 4389 1230 -3511 -4280 -434 3980 3783 -793 -4577 -3470 1609 4903 2703 -2731
2360b731k368L450N462R43l968n019j74M964M308p86n715l760K224O185K723l500
$$ -2731 -5099 -1649 3813 4756 788 -4231 -4405 559 4867 4081 -1634 -5394 -3170 3015 5738 2238
2376B238o355j591N098N476l1n853m347J384N902L792k686o066k616L543O347
$$ 2238 -4117 -5708 -610 4866 4835 -1018 -5365 -3981 1921 5713 3027 -3039 -5655 -2112 4235
2391D235J532n081n566j44N634N127j479o158l766K675O184K672m022o025j149
$$ 4235 5767 686 -4880 -5024 610 5737 4258 -1900 -5666 -2991 3193 5865 1843 -4182 -5331
2406e331M803N350j13n659m365J557N657L459k844n580k080L506N051J141l873
$$ -5331 -528 4822 4709 -950 -5315 -3758 1899 5358 2514 -3066 -5146 -1640 3411 4552 679
2421F79m848J33M565M217j296m992l361K580N127J786l146m506r89L997L749o89
$$ 679 -4169 -4036 529 4746 3450 -1542 -4903 -2323 2804 4590 1444 -3062 -4051 -54 3695 3006
2437C006l634l005Q64M147K523j878m238j597K425M156P89l468l449K81L674L019
$$ 3006 -628 -3633 -2769 1378 3901 2023 -2215 -3812 -1387 2769 3558 90 -3359 -3078 596 3615
2453C615j362l811j863J820L702J301k461l647m36K878L505k20l749k639J420
$$ 3615 2253 -1558 -3421 -1601 2101 3402 941 -2706 -3142 -264 3241 3021 -728 -3367 -1947
2468a947L521K156k178l907j162K787L542L37l494l230P95L852K669j679m463
$$ -1947 1574 3730 1552 -2355 -3517 -730 2812 3149 -345 -3575 -2780 1072 3741 2062 -2401
2483b401j692L204L776L36l069l550L02M220K881j720l677k506K143M595J316
$$ -2401 -4093 -889 2887 3223 154 -3396 -3094 1126 4007 2287 -1390 -3896 -1753 2842 4158
2498D158l268m518k63M431L765j205m834k834K145M684K197l283m554q27L840
$$ 4158 890 -3628 -3891 540 4305 3100 -1734 -4568 -2423 2261 4458 1175 -3379 -4206 -366
2513c66M319l6m508m000J347M815L325k784m937j924L684M578R11m249m284N40
$$ -366 3953 3917 -591 -4591 -3244 1571 4896 2112 -2825 -4749 -1065 3513 4424 175 -4109 -3569
2529c569M442L457j367m787k518K189M827J781l400m588o77M231L740l74m046
$$ -3569 873 4330 2963 -1824 -4342 -2153 2674 4455 1055 -3533 -4210 21 3761 3387 -659
2544f59l566J377M381K278j954m002j889K617M305R29l166l977K13L592L328q46
$$ -659 -4225 -2848 1533 3811 1857 -2145 -4034 -1417 2888 3817 651 -3326 -3113 479 3807 2961
2560B961m078k602J648M156J701k453l835r86K708L539M74l351l295N37L587K563
$$ 2961 -1117 -3719 -2071 2085 3786 1333 -2502 -3488 -780 2759 3233 -118 -3413 -2876 711 3274
2576C274j023l742k260K025M120J173k922l532l13L506K942p11l318k546J489
$$ 3274 2251 -1491 -3751 -1726 2394 3567 645 -2887 -3200 306 3248 2537 -781 -3327 -1838
2591a838L534J497j738l405j091K224L535K87l198k966O11L329K636j839l429
$$ -1838 1696 3193 1455 -1950 -3041 -817 2718 3005 -193 -3159 -2548 781 3417 1578 -1851
2606a851j325K321L278L45k961k446L87L013K208q70l579j734K090L240J053k834
$$ -1851 -3176 -855 2423 2768 -193 -2639 -2252 761 2969 2099 -1480 -3214 -1124 2116 3169 335
2622C35k965L1L236K224r98l227j726J903L146P83k084l154o1K903K430q48l116
$$ 335 -2630 -2599 637 2861 1863 -1364 -3090 -1187 1959 2742 658 -2496 -2557 346 2776 1928 -1188
2639a188j828J388L495J235k331k975n40K842K683m79l147j981J237L104J496
$$ -1188 -3016 -1628 1867 3102 771 -2204 -2744 98 2781 2302 -845 -2826 -1589 1515 3011
2654C011j947k878q28K102K828L12k449k788L35K874K278j077l121j540J664L009
$$ 3011 1064 -1814 -2642 -540 2288 2600 151 -2637 -2302 572 2850 1773 -1348 -2888 -1224 1785
2670A785J111k393k849j21K534K239k08k481k368Q76K778J893j128l277j375K148
$$ 1785 2896 503 -2346 -2467 67 2306 2098 -383 -2751 -1875 903 2796 1668 -1609 -2984 -836
2686h36K879Q09k419k893R2K894K245o35l020j880J187L093J282j722l128r24
$$ -836 2043 2852 433 -2460 -2368 526 2771 2136 -884 -2764 -1577 1516 2798 1076 -2052 -2976
2702b976K305K953K90k754k768M89L233K290j385l185j540J789L145J046k220
$$ -2976 -671 2282 2572 -182 -2950 -2461 772 3062 1677 -1508 -3048 -1259 1886 2932 712
2717G12k952l48K637K981o60l230k017J278L195J263j941k922n84K302K478j65
$$ 712 -2240 -2588 49 3030 2370 -860 -2877 -1599 1596 2859 918 -2004 -2588 -286 2192 2027
2733B027k442j870M01K792J481j116k678j142J906K511K08k053k152K56K604J470
$$ 2027 -415 -2285 -1884 908 2389 1273 -1405 -2547 -641 1870 2078 25 -2127 -1871 733 2203
2749B203j000k257j049J523J893L29j572j612p6J973J393o49j800j077R33K071
$$ 2203 1203 -1054 -2103 -580 1313 1642 70 -1542 -1618 355 1748 1099 -701 -1778 -845 1226
2765A226L71j222j845o6J704J214k74j608j059O32J853N57j117j391l83J431J251
$$ 1226 1597 375 -1470 -1536 168 1382 1108 -500 -1559 -927 926 1483 366 -1025 -1408 23 1274
2782A274k52j120j057L43J352Q81n68j712n31R99J650K19j509j517L59J580J076
$$ 1274 1022 -98 -1155 -812 540 1421 853 -859 -1390 -391 1259 1478 -31 -1548 -1189 391 1467
2799A467m98j634p90N51J703P97j108j678k81J500J283K58j914j489Q89J624J234
$$ 1467 969 -665 -1455 -904 799 1596 488 -1190 -1471 29 1312 1570 -344 -1833 -944 680 1914
2816A914p95k125r41J658J719M32j820j888K82J991J262k90k190j357J243J989
$$ 1914 1119 -1006 -1947 -289 1430 1862 42 -1846 -1564 427 1689 1399 -791 -2148 -905 1084
2832A084Q22j520k011l30J817K075k85k166j660P29K347J285j242k152p44J514
$$ 1084 1906 386 -1625 -1955 -138 1937 1652 -514 -2174 -1445 902 2187 945 -1207 -1951 -437
2848d37K016K89j866j772L48J914J632r84k097p22J005J937O84j813j623N5J525
$$ -437 1579 1868 2 -1770 -1422 492 2124 1140 -957 -1679 -674 1263 1947 134 -1489 -1434 91
2865I1J331k98j666r73O69J384Q38m80j861m90J324J294J42j307j244L88J602
$$ 91 1422 1124 -542 -1515 -846 538 1376 896 -965 -1455 -131 1163 1305 -2 -1246 -858 744
2882G44M52n00j167n31Q39O77L54m97j039k46P35Q53Q7q90p84K08J087N43o34
$$ 744 1196 696 -471 -1002 -163 514 868 371 -668 -914 -179 674 761 -129 -913 -705 382 925 291
2901B91p84j79L28P25J99m41n00k32O84O04M0q39l06j14Q98M42n71p23j46M56
$$ 291 -493 -672 -344 381 580 139 -361 -593 91 695 735 -104 -410 -524 374 816 245 -478 -624 -168
2921a68Q82j15p94n01K74P63M69m89j034k2P11O18K9p64p95M69R72L41p63n02
$$ -168 714 599 -195 -696 -422 341 810 321 -713 -735 -24 594 623 -141 -936 -467 505 846 83 -419
2941d19m55Q42R19j73r71o85N37J041L51p97p92m93J215P95j47j142o60L12J235
$$ -419 -874 -32 887 714 -257 -942 -405 636 987 190 -602 -1095 120 915 768 -374 -1034 -722 513
2960E13P89q97j267k01R67J021m2r64j009K84J017R14m72j334m03Q30R79M42j006
$$ 513 1302 405 -862 -1063 -96 925 883 -81 -1090 -806 211 1125 653 -681 -1084 -254 725 1167 161
2979A61j120k2J264Q38m14j252m08N71Q73M79p92p92l75P15R08J28q04p61M4R81
$$ 161 -959 -981 283 1121 707 -545 -953 -382 491 970 178 -614 -989 -274 634 762 -42 -803 -759 222
2999B22M09j09j042k34L69Q25K00m23n79j98M61M25L19m15o22j57O46L75J18q06
$$ 222 631 522 -520 -754 -385 440 640 217 -362 -560 -99 326 645 230 -392 -549 97 472 590 -216
3019b16m27M49K76M81l33m70l50J67P69K55k86q91k15Q12N31K04r28n31M17N20
$$ -216 -643 -194 82 563 230 -240 -590 -423 346 601 315 -576 -791 21 552 756 -172 -703 -286 234
3039B34L30k80k82n34K15Q13K64n76p06m5P75K94j58o22k92L71N42M2n92n9j3
$$ 234 564 284 2 -532 -317 496 760 184 -522 -567 208 502 344 -278 -570 -199 343 385 -207 -266 -279
3060b79K59K03k7m54m4M08k6J69k32k29k2N20k1n6m05J34M03r0k23k15L2L97R7
$$ -279 -20 183 156 -298 -342 66 40 209 -23 -252 -274 246 225 169 -236 -102 301 211 -12 -227 -195 202 299
3083B99j88k87q6K9L66K01m80k76K0L93L57k4o26j34M55K60Q2k01o33M2N93M52
$$ 299 111 -176 -262 -233 133 334 -146 -422 -402 -9 348 324 -302 -436 19 279 361 160 -473 -431 162 614
3105F14j68o84r8K64M06Lk32m87JM52K27j51k49j07L4M25j27j93j18j42J29K59
$$ 614 446 -238 -336 -72 334 337 105 -382 -381 71 298 147 -102 -209 -175 250 123 -70 -188 -330 -201 58
3127E8J63l07J04j70K4J53R1l5j98j67L31J24M4O7j99k62J08K00J94j96l10k57
$$ 58 221 -86 18 -152 -128 25 116 81 -117 -284 47 171 215 282 83 -179 -71 129 323 127 -183 -440
3149d40L10M95j1l54m59O2L86N51l17m94l96L44O67K3l66m46K00J55M90q1m15
$$ -440 -130 365 354 0 -459 -397 -11 540 223 -271 -667 -323 344 367 1 -445 -245 -90 400 319 -96
3170i6k91P0M72L02j71m70k49L61L56J21l97k36M1J96K96j61j84m05L43K43r5
$$ -96 -387 -317 155 457 286 -184 -433 -72 284 405 8 -228 -187 9 305 144 -40 -445 -102 141 46
3191D6Q6j48j99L21J0m7l6N9K6j15m2K01k32J06j02rN8J22L02k25n69J78L77J91
$$ 46 132 -16 -215 106 116 69 33 92 118 3 -39 162 -70 36 -66 -75 -17 105 407 182 -387 -209 168 359
3215C59k65k41j85J04L36J36P8n67k60M76L20R5j38o48qN13M35j91n63j91M02
$$ 359 94 -147 -332 -228 108 244 322 -245 -505 -29 291 386 248 -400 -408 105 540 349 -214 -405 -3
3236cM31m7l83j73r1L08M55j86m72j81O7N80Ml40j58l2K16J89j11l14j22M06K0
$$ -3 428 381 -2 -175 -266 42 497 311 -161 -342 -275 305 309 -31 -189 -221 -5 184 73 -241 -363 43 63
3259F3M6j13lR7p2O3l3p8j00L59l02m5J26J23k12J27oj47J31K9n6r3k47K17K00
$$ 63 109 -4 -7 90 18 81 48 -30 -130 229 -73 -118 8 131 -81 46 40 -107 24 53 -3 -96 -343 -126 74
3284G4P5j3k73j73K51M56k10k05k40K2M19K67l14l53N0J75J90J17n12P4j03M01
$$ 74 149 136 -137 -310 -59 397 187 -18 -258 -236 183 450 136 -217 -167 8 198 315 -197 -123 -226 175
3306A75N1j07k99r7K79R7K84k21l55K41j23N2J13n5j54J73k27O6K47k64J37J11
$$ 175 226 119 -180 -277 2 99 383 162 -193 48 -75 -23 90 35 -119 54 -173 -107 140 -124 13 124
3328A24k41j33K77O7P3j9l14l8K89J45j71k76J04K29K84j91m19l28M00L78J71
$$ 124 -117 -250 27 94 167 148 -166 -204 85 230 59 -217 -113 116 400 209 -210 -538 -138 240 411
3349D11m02l51J36J88L08M7l61m02J74M68J74l45m37N8L97L10K12p62q9Q4L79
$$ 411 9 -342 -206 -18 290 337 -24 -426 -252 216 390 45 -392 -334 63 373 585 -177 -266 -182 197
3370A97J6L0l67k02K13L44q9rl98q5M50J35j38k48j93K58M11k62j86Q7o2J22L6
$$ 197 213 243 -124 -326 -113 231 142 133 -265 -350 100 235 97 -151 -344 -86 325 63 -123 -36 -98 24 60
3393F0rK1M1J4k39m0K28n2M6L1k68R6K41l1j43j94J0M8L17lL3m96l7N10Q5j35
$$ 60 51 72 113 127 -112 -152 76 24 70 101 -167 -71 170 139 -4 -198 -188 -140 177 174 207 -289 -326 184 269 134
3419A34l53j05K51K79K3k81j85J11K15K64j72j32k13RM22K51o71k16J16L40R6
$$ 134 -219 -324 -73 206 229 -52 -237 -126 89 353 181 49 -164 -155 267 518 -153 -369 -253 87 183
3440A83l5k22J0J16M0o2J79l49P9m9R1K4l4q2O8N6L2j97K43L7K3j76J4j67L86
$$ 183 148 -74 -64 52 92 30 209 -140 -61 -110 -19 5 -29 -111 -43 13 45 -152 91 128 151 -25 -11 -178 208
3465B08l4k94j0R9K23q7Ok10l0J51K14j16k58k64L54J72J69k24l83M2L94K3J76
$$ 208 174 -120 -130 -31 192 105 111 -99 -129 22 236 120 -138 -402 -48 124 293 69 -314 -272 122 145 321
3488C21m30k18K53K66J61k95l90j9O65o3j9k87l03L38K01K04m62q4p3K80K82k82
$$ 321 -109 -327 -74 192 353 58 -332 -351 314 251 232 -55 -358 -20 181 385 -77 -161 -234 46 328 46
3510D6k49m1J36L20J21o60K84j98L56j36J53l62m9L53R9K1l00q7K88J73k42j50
$$ 46 -203 -244 -108 212 333 -327 -43 -241 115 -21 132 -230 -279 74 173 194 -106 -193 95 268 26 -124
3532a24q6K56K31j13q4k48J21J13R6k83k61J74J64N1J31l44m2J42M02J1j30m06
$$ -124 -210 46 277 164 80 -168 -47 66 162 -121 -382 -208 -44 7 138 -206 -248 -106 296 307 177 -229
3554b29L5K98J17k8l92N8L9L19j40r4o0j28N0K20P7lk12j34K51J26j50Q4j87O2
$$ -229 -194 104 221 193 -199 -141 -102 217 77 -17 -77 -205 -155 65 142 139 -73 -207 44 170 20 104 -83 -21
3578b1j2J45j3J45k86k60J36M33K0k24k09M7K05K03J25n47k26K0M64K59j88k88
$$ -21 -33 112 99 244 -42 -302 -166 267 287 63 -146 -99 106 309 434 -113 -339 -319 145 404 216 -72
3600g2l88K70N85J5m00o72L12L45P06m48n24k76L84M74R8n04k38N3L85L19M5n09
$$ -72 -460 -190 395 410 10 -662 -350 -5 701 253 -271 -547 -163 311 409 -95 -333 -280 105 424 469 -40
3622d0m37L70N30J95l36p12k0M06N49j15n48l78J59O99J29m33l60m1N18N5J53
$$ -40 -477 -107 423 618 282 -430 -450 -44 505 390 -158 -536 -377 322 451 18 -342 -383 135 190 343
3643C43n19k84K47L52N0J6l33l47M30K49j9j86l28J04L78R4k03l33O7J79J47l3
$$ 343 -176 -460 -213 139 189 205 -128 -475 -45 204 185 -1 -329 -225 153 247 44 -289 -222 -43 104 71
3665G1r1r0OJ64J21j20j83m8J45J98k1j85k00J47P3J14Oj06j22K3K19J7M7l16
$$ 71 -20 -110 -104 60 181 61 -122 -170 -25 173 152 -33 -233 -86 -13 101 107 1 -121 -98 121 138 185 -131
3689a31j03J04L10j4r1l84K20J38o8J57k48k7p5K16K10k3m01k37M16L36J08m66
$$ -131 -234 -130 180 166 75 -309 -89 49 -19 138 -110 -137 -212 4 214 191 -210 -447 -31 305 413 -53
3711e3l93J31L70N05k07q32N4M49M36j6m08m96j3O52M64k70o69l97L16Q38J96
$$ -53 -446 -315 55 560 353 -479 -425 24 460 444 36 -460 -473 179 643 373 -296 -693 -377 461 657
3732F57n59p76J35O49Q16m80q69m71M76Q71J75o21p00p8P02P90k96o27m53M41
$$ 657 98 -678 -543 106 922 442 -427 -898 -422 449 624 3 -697 -775 -73 717 421 -206 -659 -218
3752b18M87N27m87q76j29Q17N91k1p37n55K36M73M45j81p10k49L12P38q1l69m78
$$ -218 269 796 309 -567 -696 121 712 691 -46 -601 -365 108 553 372 -338 -587 -275 463 382 13 -465
3773d65q6O49L59n2m75m06l6P50L51l75n91mK88L68N0k93m47J28M52L02j41l96
$$ -465 -551 98 457 405 -70 -476 -512 238 589 214 -377 -381 -93 275 325 32 -415 -287 165 467 326 -70
3795g0n18L51M37R8m7m42l76N14M29M2l26n71J27M62M22j18n30l17J14N84L22
$$ -70 -588 -237 200 298 251 -191 -567 -53 376 418 92 -479 -352 110 532 414 -116 -433 -319 265 587
3816E87m96m73p4N55N15l48m44n71M04P46J11l33n84j48N12N10J52r27m48K68
$$ 587 91 -382 -456 99 614 266 -178 -749 -345 401 512 179 -405 -553 -41 469 621 -306 -754 -486
3836d86R11J35m51o47j12O37O98k31n35n52L62O24L95m74q00j56P02N95mp92n62
$$ -486 425 560 109 -538 -650 -13 685 454 -81 -633 -271 353 748 274 -526 -682 20 615 611 -181 -743
3857g43J93Q73M68n72p93l57Q01Q20J20q73n85j2J093L84m68p94j59K33Q54K34
$$ -743 -550 323 791 219 -574 -931 -130 690 810 -63 -648 -660 433 817 349 -445 -604 -371 483 717
3877G17o59p37l0R16M94j77p77l58K62Q49K63n42p49q3O19O85j00n78p66K56O26
$$ 717 58 -679 -709 207 701 524 -253 -611 -349 500 763 221 -528 -611 8 693 593 15 -751 -495 131
3898A31L19j4p96l45L58P18L18o23n61p8N69N62ln19o10k1P12O39l65o08l34J85
$$ 131 450 436 -360 -705 -347 371 689 66 -495 -573 -4 558 555 36 -574 -595 117 756 391 -217 -551 -366
3920c66R13K87o52q68m6R27N16k68n89p26L19R83L21l53q65n06P87J087L0q50
$$ -366 547 834 182 -686 -732 195 711 443 -146 -872 -553 430 751 398 -467 -973 -186 901 931 81
3940H1r59K07J012O42m16j180k87O57J033K40r14p23N1P55O10m14p34l39M28Q01
$$ 81 -878 -671 341 983 567 -613 -900 -243 790 1030 116 -607 -556 199 809 395 -339 -678 -250 551
3960E51Q8l84r38k6Q73N99k0r72p52N55Q91K00m84q30m2P11Q58j81q30n74L58
$$ 551 639 255 -683 -709 164 763 743 -229 -981 -426 465 665 181 -649 -691 20 878 697 -133 -707 -349
3981c49R96J42m10q14l07N36R19j41o96o14K70P46L52l28p89k91M78Q10K52p82
$$ -349 647 789 379 -435 -742 -206 713 572 -124 -738 -468 278 630 302 -487 -778 -300 510 762 -20
4001b0o09J69O97L23j44n98l99M85O54K9l55n35l48O85P18q4q24n81K92O64N80
$$ -20 -629 -460 237 560 416 -182 -581 -96 558 587 232 -303 -651 34 752 668 -156 -737 -445 219 799
4022G99m89p16k98L80Q12J91o54o67m4Q10O22k15q48l42K77P54N09n76p45m56
$$ 799 310 -406 -704 -324 488 679 25 -642 -686 124 746 531 -317 -659 -382 372 881 305 -440 -896
4042h96O27J005N5p38q21P7R96O84n16r77l81O41P97M11p16j126l9J203P14l16
$$ -896 -269 736 791 53 -768 -691 305 989 473 -504 -885 -244 553 964 248 -878 -917 286 1000 684
4062F84q20q58M50J330M78r19j004j76P60R27j2j100o62K94J038O00n86r77k99
$$ 684 -136 -994 -544 786 1264 345 -659 -835 -75 852 840 -260 -922 -628 410 1010 424 -553 -852
4081h52O83J022M7r73q80K95R06Q57n31j124l49L32J094L43q97q49J84R37N62
$$ -852 -169 853 900 -73 -953 -658 248 1105 574 -550 -899 -567 527 870 -27 -876 -692 245 807
4100H07l86p04m71L80Q46K62l84r56r5Q07M56Q9o75n67J13O16O25k82q27l82M85
$$ 807 421 -283 -754 -374 472 734 350 -606 -701 106 562 651 -24 -591 -478 138 763 481 -346 -728 -243
4121b43O33R4n15n89j3O87O70k86o74m47L60P56J52l14q75k0M59N29K26o38n61
$$ -243 390 484 -31 -620 -633 54 724 438 -236 -683 -323 433 585 271 -604 -624 -165 364 590 -48 -609
4142f09J12O67L83j12p39m95L23R63K16n24q02j96P42R59m39p33n38M70P85L23
$$ -609 -497 170 553 441 -298 -793 -470 493 709 185 -617 -813 -71 888 449 -284 -822 -352 433 756
4162G56o09p02j78P25P71R8j021p12N24P04M72m23j071k74P87J000Lj092n58K00
$$ 756 147 -555 -733 -8 763 861 -160 -872 -348 356 828 405 -666 -940 -153 847 850 -242 -800 -600
4182f00Q27O39l92q78m98O99R97J0p33r06O8Q88R59m89j082l75N70R00L62q95
$$ -600 227 866 474 -404 -902 -203 794 804 71 -835 -767 121 1080 591 -491 -866 -296 604 966 71
4202G1q02m7Q65N51J94r80o86L93P48N54n36q61j94P53M71R7n40p31J08Q54M38
$$ 71 -731 -778 87 638 832 -148 -834 -441 307 861 325 -536 -730 23 494 591 51 -680 -572 282 720
4223G20j14r78m10M85Q25L73o63q92k2N58P24j7n96p79K44Q90L97m61o81l11M64
$$ 720 606 -372 -782 -297 528 901 238 -654 -676 -118 606 589 -7 -786 -542 348 745 284 -397 -708 -244
4244b44O71K50n12r17J39P38N69n1p06p19K48R98K15m86m94m71O63P15J23p28
$$ -244 427 677 165 -752 -613 125 694 643 -63 -782 -534 464 679 193 -301 -772 -109 606 729 1
4264Ao97N2O76P40m37o74n33N70Q84K33p53p26j52R13O96k11q99n46N83R43J40
$$ 1 -696 -644 32 772 335 -339 -872 -302 582 815 62 -664 -816 97 793 582 -317 -863 -280 663 803
4285H03o79q25p6Q58Q83n44o74n32M19Q86R7k26r58j97P87O43j60p11m65L34P83
$$ 803 124 -701 -777 81 964 420 -254 -786 -367 519 616 390 -568 -765 22 665 505 -206 -671 -337 446
4306D46L74p48n80k77P14P39j36p42m80J5Q64N63k80q84l45P40M93J43n72o76
$$ 446 820 72 -508 -785 -71 668 532 -210 -690 -675 189 752 472 -412 -757 -17 476 619 47 -629
4326f29j68R25N65k60p45l45L45O90L47n44o97l0M73O11N8o05p08L5R08M46k68
$$ -629 -797 128 693 433 -312 -657 -312 378 725 181 -516 -546 -73 538 596 -9 -717 -682 226 672 404
4347D04p82j44J68P58J64n32o96OO48N48m8n37o74J66Q98M63l82p99k36L53P26
$$ 404 -378 -522 -354 404 568 36 -660 -654 -6 542 494 -43 -717 -551 347 810 428 -371 -607 -254 472
4368D72K48n39o87k58P90Q01l08p60m25K87Q67J89n11n97l79O19J093k71p15q59
$$ 472 720 181 -506 -764 26 827 519 -241 -666 -379 488 677 166 -431 -810 -191 902 631 -84 -943
4388i43L36P69O35l93q40l16N61R70j28n77q20J14R98K69j44r47l29M14Q50J51
$$ -943 -607 162 797 404 -436 -752 -191 779 651 74 -746 -632 366 635 491 -456 -785 -371 479 630
4408F30o53n79n8Q06M70J1q44m65K25Q49M16n90q48N9O87M67j18o82m67K78O25
$$ 630 -23 -602 -660 146 616 627 -217 -682 -457 392 808 218 -630 -571 116 583 465 -217 -684 -406 219
4429B19J46j70m80m65O67M48J28n45l25J8M26L47l04k71l94L75M31K47m67k68
$$ 219 365 195 -285 -750 -83 365 493 -52 -377 -359 67 414 110 -161 -555 -180 251 498 31 -237
4449b37j29K80L82m3k65m27k0N77L31j33n15n3J59L66J85k52n44k20N75K51R1
$$ -237 -366 -86 296 253 -12 -439 -459 118 449 316 -199 -252 -93 273 458 206 -338 -558 17 268 359
4470C59m37m76K46N23M95n37o36KL02P26j16m93m34P5N03L79k42o68MM6J042l6
$$ 359 -78 -554 -308 215 710 173 -463 -461 -159 567 451 -42 -476 -401 102 481 239 -429 -425 -379 663 627
4492F27o88n16p1Q04O81k95p62k58L13N71J16m70p29J78O25M13k00l80o46L61
$$ 627 -61 -577 -648 156 837 542 -220 -478 -165 406 522 52 -677 -499 126 539 339 -41 -687 -326
4512c26P03M14o70o36j2L65P35K4n19o51K61O53L65l74p30J2K66N67K04n71o94
$$ -326 377 791 121 -515 -527 -162 573 597 78 -573 -312 341 706 332 -398 -386 -120 447 651 80 -614
4533f14J64M57N65j24p93j51J15P17K06n11m25k66N69N16l2n68k67Q7M44L35k83
$$ -614 -450 7 572 448 -345 -496 -381 336 542 31 -394 -660 -91 425 393 -175 -442 -355 89 424 141
4554A41k84l28K81K69N18m66l26j60K07N86K3m08m62m1O53L14j71m21l89K17N34
$$ 141 -143 -471 -190 79 597 131 -195 -355 -148 438 461 53 -409 -450 203 517 346 -75 -464 -247 287
4575B87J93l27n74M9J98N89pl34o58J54O07L25j69o48l33M57O60J66o35m48j36
$$ 287 480 153 -421 -372 -174 415 408 74 -584 -430 177 502 333 -315 -648 -191 469 635 0 -448 -584
4596e84P66L27k14p28j74L19N42K67n04o97J57N86N71m05m34k42K44O58J77l38
$$ -584 182 509 295 -433 -607 -288 254 521 17 -680 -523 63 634 229 -205 -447 -203 455 632 294
4616B94q83J35M12O81k11p54k68K61O49K04m14n33J5L10L99m1m06m11J75O19K17
$$ 294 -589 -454 -42 639 428 -326 -594 -333 316 520 106 -427 -412 -102 297 256 -150 -561 -386 233 450
4637D50j48m26l41M70N23j7m94l10k09M96M54j16n89l54L35O40J03m32l51M3L39
$$ 450 302 -124 -465 5 528 511 17 -293 -502 -6 448 332 -257 -611 -276 364 467 35 -316 -273 66
4658F6M58j41l36m04j1M72L75k07m84k00P6N81K77o48l08R1M39K36J36o36m15
$$ 66 524 383 47 -357 -368 104 479 272 -212 -412 -336 245 522 -126 -434 -343 96 332 468 -168 -583
4679e83L09M76K75j63m65l82L19N67K47n10l75n7N08K63j22m78l69K75N72K59
$$ -583 -274 202 477 314 -151 -533 -214 353 600 90 -285 -342 166 429 307 -171 -540 -265 307 566
4699E66k74p76r6P08K76P6n27p31L75P83L03l68p04o5L36N26J54o67m68O4O62
$$ 566 292 -484 -580 128 404 480 -47 -778 -403 380 683 315 -389 -454 -118 408 562 -105 -573 -509 153
4720A53N36k20p03l32K53Q20j73l35n92L7N33O33j28n33o23L88N51J36j12o26
$$ 153 689 469 -234 -566 -313 507 334 -1 -593 -556 -23 610 482 -51 -674 -286 265 401 289 -337
4740c37j75N60M72k16m92l31L36M78J10k57m04r3L04N07J3l95m31J24M2O24k96
$$ -337 -512 48 520 304 -188 -519 -183 295 405 148 -256 -349 -45 462 475 80 -351 -227 -185 439 143
4761A43k90l09K22K96L61l18l60r9K23M61J11m51n11L10K63L54j04m42k97K37
$$ 143 -147 -456 -234 62 423 105 -255 -354 -131 330 441 -10 -521 -211 52 406 302 -140 -437 -200
4781b00O01J17m11m66M6L61L70M1o66m09K45O93J33l20m27k34N42M45j68k16o72
$$ -200 401 518 107 -359 -313 48 418 459 -207 -616 -371 322 455 135 -292 -526 16 461 293 77 -595
4802e95J21O50L43l45o21k35M08N12L78m69m35j70L98O46l71m33k85J55O57L08
$$ -595 -474 176 519 174 -447 -682 -274 238 616 147 -288 -458 -60 586 215 -218 -503 -348 309 617
$$ [...]
8191e3
##END NTUPLES=NMR FID
##END=
