##TITLE=1H_AM_NV28+MetOH
 CDCl3
 8 sc, 
 25.11.2022
##JCAMPDX= 6.0         $$ Bruker NMR JCAMP-DX V2.0
##DATA TYPE= NMR FID
##DATA CLASS= NTUPLES
##ORIGIN= UXNMR, Bruker Analytische Messtechnik GmbH
##OWNER= root
$$ XWIN-NMR		Version 3.5
$$ Fri Nov 25 14:56:08 2022 Russian Standard Time (UT+4h)  she@DPX200
##.OBSERVE FREQUENCY= 200.13135
##.OBSERVE NUCLEUS= ^1H
##.DELAY= (6, 6)
##.ACQUISITION MODE= SIMULTANEOUS
##.ACQUISITION SCHEME= undefined
##.AVERAGES= 8
##.DIGITISER RES= 18
##SPECTROMETER/DATA SYSTEM= spect
##.PULSE SEQUENCE= zg30
##.SOLVENT NAME= CDCl3
##.SHIFT REFERENCE= (INTERNAL, CDCl3, 0, 15.7039)
##AUDIT TRAIL= $$ (NUMBER, WHEN, WHO, WHERE, WHAT)
$$ ##TITLE= Audit trail, XWIN-NMR		Version 3.5
$$ ##JCAMPDX= 5.01
$$ ##ORIGIN= Bruker BioSpin GmbH
$$ ##OWNER= she
$$ F:/spectra/data/she/nmr/H-F/1/audita.txt
$$ ##AUDIT TRAIL=  $$ (NUMBER, WHEN, WHO, WHERE, WHAT)
(   1,<2022-11-25 14:54:47.95 +0400>,<she>,<DPX200>,
      <created by zg, POWCHK disabled, PULCHK disabled
       configuration hash MD5:
       00 E9 B6 7A A2 85 ED C7 34 08 36 98 17 FE 4E 26
       data hash MD5: 16K
       99 7B 07 F8 49 6F F3 4C C4 E2 AF F0 CC 41 1A 69>)
$$ ##END=
$$ 
$$ hash MD5
$$ BE FE B6 32 53 99 95 52 61 C6 8A 66 20 FC 0F 30
##$RELAX= 
##$RELAX= 
##$RELAX= 
##$RELAX= 
##$RELAX= 
##$RELAX= 
$$ Bruker specific parameters
$$ --------------------------
##$DU= <F:/spectra>
##$EXPNO= 1
##$NAME= <H-F>
##$PROCNO= 1
##$TYPE= <nmr>
##$USER= <she>
##$AMP= (0..31)
100 100 100 100 100 100 100 100 100 100 100 100 100 100 100 100 100 100 
100 100 100 100 100 100 100 100 100 100 100 100 100 100 
##$AQSEQ= 0
##$AQ_mod= 1
##$AUNM= <au_zg>
##$AUTOPOS= <>
##$BF1= 200.13
##$BF2= 200.13
##$BF3= 200.13
##$BF4= 200.13
##$BF5= 200.13
##$BF6= 200.13
##$BF7= 200.13
##$BF8= 200.13
##$BYTORDA= 1
##$CFDGTYP= 0
##$CFRGTYP= 5
##$CHEMSTR= <none>
##$CNST= (0..31)
1 1 145 1 1 1 1 1 1 1 1 1 1 1 1 1 1 1 1 1 1 1 1 1 1 1 1 1 1 1 1 1 
##$CPDPRG= <>
##$CPDPRG1= <>
##$CPDPRG2= <>
##$CPDPRG3= <>
##$CPDPRG4= <mlev>
##$CPDPRG5= <mlev>
##$CPDPRG6= <mlev>
##$CPDPRG7= <mlev>
##$CPDPRG8= <mlev>
##$CPDPRGB= <>
##$CPDPRGT= <>
##$D= (0..31)
0 1.2 0 0 0 0 0 0 0 0.06 0 0.03 0 0 0 0 0.0002 0 0 0 0 0 0 0 0 0 0 0 0 
0 0 0 
##$DATE= 1669373687
##$DBL= (0..7)
120 120 120 120 120 120 120 120 
##$DBP= (0..7)
150 150 150 150 150 150 150 150 
##$DBP07= 0
##$DBPNAM0= <>
##$DBPNAM1= <>
##$DBPNAM2= <>
##$DBPNAM3= <>
##$DBPNAM4= <>
##$DBPNAM5= <>
##$DBPNAM6= <>
##$DBPNAM7= <>
##$DBPOAL= (0..7)
0.5 0.5 0.5 0.5 0.5 0.5 0.5 0.5 
##$DBPOFFS= (0..7)
0 0 0 0 0 0 0 0 
##$DE= 6
##$DECBNUC= <off>
##$DECIM= 32
##$DECNUC= <off>
##$DECSTAT= 4
##$DIGMOD= 1
##$DIGTYP= 9
##$DL= (0..7)
0 120 120 120 120 120 120 120 
##$DP= (0..7)
150 150 150 150 150 150 150 150 
##$DP07= 0
##$DPNAME0= <>
##$DPNAME1= <>
##$DPNAME2= <>
##$DPNAME3= <>
##$DPNAME4= <>
##$DPNAME5= <>
##$DPNAME6= <>
##$DPNAME7= <>
##$DPOAL= (0..7)
0.5 0.5 0.5 0.5 0.5 0.5 0.5 0.5 
##$DPOFFS= (0..7)
0 0 0 0 0 0 0 0 
##$DQDMODE= 0
##$DR= 18
##$DS= 0
##$DSLIST= <SSSSSSSSSSSSSSS>
$$ [...]
##$SUBNAM2= <"">
##$SUBNAM3= <"">
##$SUBNAM4= <"">
##$SUBNAM5= <"">
##$SUBNAM6= <"">
##$SUBNAM7= <"">
##$SUBNAM8= <"">
##$SUBNAM9= <"">
##$SW= 18.05172834244
##$SWIBOX= (0..15)
0 0 2 0 0 0 0 0 0 0 0 0 0 0 0 0 
##$SW_h= 3612.71676300578
##$TD= 16384
##$TD0= 1
##$TE= 0
##$TE2= 300
##$TE3= 300
##$TEG= 300
##$TL= (0..7)
0 120 120 120 120 120 120 120 
##$TP= (0..7)
150 150 150 150 150 150 150 150 
##$TP07= 0
##$TPNAME0= <>
##$TPNAME1= <>
##$TPNAME2= <>
##$TPNAME3= <>
##$TPNAME4= <>
##$TPNAME5= <>
##$TPNAME6= <>
##$TPNAME7= <>
##$TPOAL= (0..7)
0.5 0.5 0.5 0.5 0.5 0.5 0.5 0.5 
##$TPOFFS= (0..7)
0 0 0 0 0 0 0 0 
##$TUNHIN= 0
##$TUNHOUT= 0
##$TUNXOUT= 0
##$USERA1= <user>
##$USERA2= <user>
##$USERA3= <user>
##$USERA4= <user>
##$USERA5= <user>
##$V9= 5
##$VALIST= <valist>
##$VCLIST= <CCCCCCCCCCCCCCC>
##$VD= 0
##$VDLIST= <DDDDDDDDDDDDDDD>
##$VPLIST= <PPPPPPPPPPPPPPP>
##$VTLIST= <TTTTTTTTTTTTTTT>
##$WBST= 1024
##$WBSW= 4
##$XGAIN= (0..3)
0 0 0 0 
##$XL= 0
##$YL= 0
##$YMAX_a= 767865
##$YMIN_a= -686711
##$ZGOPTNS= <>
##$ZL1= 120
##$ZL2= 120
##$ZL3= 120
##$ZL4= 120
##$ABSF1= 10
##$ABSF2= 0
##$ABSG= 5
##$ABSL= 3
##$ALPHA= 0
##$AQORDER= 0
##$ASSFAC= 0
##$ASSFACI= 0
##$ASSFACX= 0
##$ASSWID= 0
##$AUNMP= <proc_1d>
##$AZFE= 0.1
##$AZFW= 0.1
##$BCFW= 1
##$BC_mod= 2
##$BYTORDP= 1
##$COROFFS= 0
##$CY= 11.3945322036743
##$DATMOD= 1
##$DC= 2
##$DFILT= <>
##$DTYPP= 0
##$F1P= 2.36226072786647
##$F2P= -0.459571619588291
##$FCOR= 0.5
##$FTSIZE= 0
##$FT_mod= 4
##$GAMMA= 1
##$GB= 0.15
##$INTBC= 1
##$INTSCL= 1
##$ISEN= 128
##$LB= 0.24
##$LEV0= 0
##$LPBIN= 0
##$MAXI= 10000
##$MC2= 0
##$MEAN= 0
##$ME_mod= 0
##$MI= 1.114404
##$NCOEF= 0
##$NC_proc= 0
##$NLEV= 6
##$NOISF1= 3.799351
##$NOISF2= 2.8
##$NSP= 1
##$NTH_PI= 0
##$NZP= 0
##$OFFSET= 15.70392
##$PC= 1
##$PHC0= -18666.74
##$PHC1= 14.60072
##$PH_mod= 1
##$PKNL= yes
##$PPARMOD= 0
##$PSCAL= 0
##$PSIGN= 0
##$REVERSE= no
##$SF= 200.130013532006
##$SI= 16384
##$SIGF1= 3
##$SIGF2= 2
##$SINO= 400
##$SIOLD= 16384
##$SREGLST= <1H.CDCl3>
##$SSB= 0
##$STSI= 0
##$STSR= 0
##$SW_p= 3612.71676300578
##$SYMM= 0
##$S_DEV= 0
##$TDeff= 0
##$TDoff= 0
##$TI= <>
##$TILT= no
##$TM1= 0
##$TM2= 0
##$TOPLEV= 0
##$USERP1= <user>
##$USERP2= <user>
##$USERP3= <user>
##$USERP4= <user>
##$USERP5= <user>
##$WDW= 1
##$XDIM= 8192
##$YMAX_p= 0
##$YMIN_p= 0
$$ End of Bruker specific parameters
$$ ---------------------------------
##NTUPLES= NMR FID
##VAR_NAME=  TIME,          FID/REAL,        FID/IMAG
##SYMBOL=    X,             R,               I
##VAR_TYPE=  INDEPENDENT,   DEPENDENT,       DEPENDENT
##VAR_FORM=  AFFN,          ASDF,            ASDF
##VAR_DIM=   8192,          8192,            8192
##UNITS=     SECONDS,       ARBITRARY UNITS, ARBITRARY UNITS
##FACTOR=    0.0002768,     1,               1
##FIRST=     0,             0,               0
##LAST=      2.2672688,     0,               0
##MIN=       0,             -686711,         0
##MAX=       2.2672688,     767865,          0
$$ Real data points
##PAGE= N=1
##DATA TABLE= (X++(R..R)), XYDATA
0 0 0 0 0 0 0 0 0 0 0 8 -2 8 -8 8 -8 16 -16 23 -24 32 -37 40 -48 61 -69 80 -93 109 -121 141 -162 181 -205
33 -205 236 -262 295 -330 370 -412 460 -511 568 -629 697 -770 847 -936 1034 -1136 1252 -1379
51 -1379 1520 -1676 1853 -2050 2273 -2527 2825 -3171 3584 -4089 4715 -5521 6598 -8117 10412
66 10412 -14287 22024 -43461 229098 767865 192846 -452201 -441142 116613 371505 -5691
77 -5691 -381486 -94889 415645 414988 -202851 -627469 -262527 397061 521274 48370 -418650
88 -418650 -242718 251747 225304 -224454 -312712 110817 485224 237988 -376399 -518727
98 -518727 -15494 436758 297685 -175217 -277144 64112 225681 -31180 -311280 -179827
108 -179827 302922 458511 -18027 -461701 -304305 174360 355297 44159 -248471 -76419
118 -76419 228987 150320 -238957 -366134 44316 445465 275158 -203825 -396671 -104437
128 -104437 276014 206050 -150345 -189253 122674 282450 3620 -373923 -277262 217166
138 217166 441683 110871 -328517 -297527 114064 262342 -19475 -232676 -51777 270335
148 270335 240513 -183561 -413805 -101520 333106 337292 -67031 -329006 -112887 210699
158 210699 158355 -156961 -235663 93276 362042 123399 -317242 -357315 49987 378344
168 378344 205219 -205140 -263361 56710 237042 15563 -265549 -150196 236978 331775
178 331775 -25327 -365112 -242120 175535 321101 35193 -228546 -118733 151212 162122
188 162122 -116798 -257851 -9228 295089 225298 -138800 -320761 -88229 220183 191298
198 191298 -76589 -173310 21792 184757 33579 -218668 -177181 128389 286169 76258
208 76258 -223406 -213718 58989 193299 31317 -146653 -59322 154648 140709 -117699 -251528
219 -251528 -47175 236217 216662 -75195 -234999 -66320 155800 110627 -107387 -143724
229 -143724 77818 223895 46697 -230730 -218878 83491 273755 103538 -176600 -182618
239 -182618 59944 175827 -2132 -190665 -82087 185791 216406 -64266 -281016 -133195
249 -133195 179872 238519 -13080 -205695 -82493 145442 128345 -106384 -197476 16997
259 16997 245020 150381 -155692 -261280 -27259 221601 154253 -104918 -174352 25041 173966
270 173966 37381 -185618 -149793 118846 245584 44777 -215227 -187177 74969 201514
280 201514 38928 -148988 -87288 115575 139368 -68768 -203976 -51987 188740 186784 -56620
291 -56620 -210454 -77762 133642 127328 -57901 -130935 17216 155263 56742 -150796 -165251
302 -165251 48484 203699 90480 -129780 -155378 24883 135464 26637 -119287 -67576
312 -67576 111900 141172 -44699 -189985 -83833 135600 169939 -17524 -154227 -59336 105541
323 105541 89584 -76872 -129260 30616 173923 78427 -138502 -178023 18195 179769 90447
334 90447 -106896 -128068 40814 135031 6759 -151671 -90216 120642 180959 -7544 -192751
345 -192751 -121801 102751 170261 2684 -146114 -64535 115024 115940 -72392 -172223 -22723
356 -22723 177127 145470 -81264 -194869 -46819 147322 120473 -69241 -137247 10152 145372
367 145372 57154 -133970 -146321 50739 186852 72815 -133259 -149986 30467 143159
377 143159 39579 -110161 -79661 82240 126031 -24843 -155219 -72885 113372 148062 -12030
388 -12030 -139394 -65190 85461 92078 -41606 -104907 4481 122838 63822 -98195 -134185
399 -134185 11441 139498 75074 -81582 -107100 18918 100434 17374 -100370 -64553 82484
410 82484 123204 -11835 -140327 -82128 84829 128303 -3297 -112735 -47698 85726 82031
421 82031 -58373 -120110 1262 136311 88606 -84350 -144492 -8552 127488 76681 -73246
432 -73246 -102303 25868 113753 21845 -116462 -93074 68712 145504 24096 -130540 -103599
443 -103599 57942 123463 11162 -107891 -56494 87462 101878 -42460 -137369 -40027 121716
454 121716 121153 -42194 -138857 -42539 101382 90052 -52606 -109430 6172 118737 57692
465 57692 -96094 -125422 19508 139808 68411 -89225 -114781 16593 110524 33536 -91756
476 -91756 -74016 60980 114612 1305 -123392 -78160 74219 119624 5070 -102187 -57058
487 -57058 64320 78912 -29616 -92307 -12137 96140 71033 -59360 -110310 -11369 95933
498 95933 66250 -50645 -83277 10885 80791 18626 -78715 -62316 51808 101143 8736 -97757
510 -97757 -70199 49362 93341 4225 -82947 -38600 66994 72208 -37281 -103792 -19304 104247
522 104247 86304 -51383 -115111 -19387 95998 67087 -57496 -89827 16284 101157 35148
533 35148 -91579 -94287 36640 118818 39843 -89771 -92709 30507 100950 20362 -86228
544 -86228 -60075 60535 97433 -9889 -110350 -57466 76666 105473 -8339 -102414 -47500
555 -47500 68436 76123 -29233 -89488 -13549 89843 65452 -57841 -104679 -7368 97729
566 97729 64946 -54535 -88439 5392 83277 31455 -70063 -67279 39495 94694 16101 -87224
578 -87224 -71502 40880 93148 15572 -76085 -50670 48650 71919 -16685 -84495 -26244 76514
590 76514 73478 -33631 -93229 -23208 72383 58924 -35419 -69897 1655 68777 29407 -59712
602 -59712 -65838 24774 84517 26952 -67519 -65871 26134 74171 12012 -63749 -38689 49117
614 49117 65905 -18094 -81980 -29785 68276 73733 -21925 -83894 -26466 65090 57707 -36454
626 -36454 -76262 874 82847 44691 -64797 -87772 12992 95780 43946 -66365 -78235
637 -78235 20313 83104 20788 -71690 -57545 43720 86359 6787 -85044 -60316 47003 88410
649 88410 8899 -77528 -49557 48224 71543 -12802 -79429 -28059 68574 68627 -30311 -87280 -23300
662 -23300 68381 59983 -30521 -70538 -6615 62905 35802 -47158 -62812 15067 75184 29518
674 29518 -57951 -63431 19256 70518 18832 -55320 -42066 35251 59318 -7146 -66597 -29474
686 -29474 52806 62389 -14673 -69878 -26668 50942 50812 -23826 -60720 -4992 60410 35552 -46600
699 -46600 -64802 10280 71419 32048 -50342 -58367 15844 61978 15277 -52036 -40150 34220
711 34220 61791 -849 -65415 -38612 43383 65528 -3437 -64677 -30855 46006 52054 -20800
723 -20800 -63995 -11085 62156 46333 -38705 -71532 -4628 67498 42910 -41090 -62731 6767
735 6767 63882 25017 -52961 -54133 26227 72255 16152 -63323 -53997 30330 69828 10542 -59201
748 -59201 -40066 36893 58646 -6765 -64111 -28879 49547 59420 -14009 -68035 -27259 48883
760 48883 52043 -18684 -59038 -11738 52009 37217 -34711 -57410 3034 59990 32414 -39591
772 -39591 -53333 7933 53579 20250 -39783 -37872 22190 50266 3178 -50501 -31638 33797
784 33797 51910 -3508 -51881 -24171 36199 39972 -16565 -47959 -6264 46713 30859 -32435
796 -32435 -51522 2292 52835 27940 -35618 -45893 10219 49494 14457 -42992 -36741 26160
808 26160 53977 4483 -52855 -35964 31921 54320 249 -51498 -27256 36121 45637 -13241
820 -13241 -54455 -16214 47517 44539 -22645 -59243 -13066 49946 40188 -26384 -52635 -1756
832 -1756 50901 27703 -37732 -49065 11460 57179 22383 -43507 -46983 15610 53610 14321
844 14321 -42881 -35271 24720 48378 308 -49434 -28108 34081 48417 -5521 -50798 -23590
856 -23590 34799 40157 -12795 -45861 -10833 40504 31823 -24738 -46953 -2427 45974 29364
868 29364 -28070 -43452 3452 43139 19084 -32286 -34695 16074 44490 8078 -40778 -31674
880 -31674 23081 44832 2511 -41199 -24014 26618 36374 -8896 -41595 -12087 36078 31901
892 31901 -19299 -44386 -6427 39891 27569 -23445 -38531 2840 39534 16709 -32044 -33457
904 -33457 15317 43792 10350 -38573 -32265 20339 42841 4164 -38956 -24453 26933 38818
916 38818 -7637 -44194 -17381 35556 39077 -13750 -47624 -14053 37751 34331 -18413 -44325
928 -44325 -4876 41884 26984 -27806 -43979 2845 47143 24567 -32125 -41547 7546 44435
940 44435 17050 -34035 -33515 16707 42354 6836 -39114 -29243 22742 41451 1482 -38479 -23288
953 -23288 23771 34396 -6271 -36726 -12584 29611 28603 -14847 -37766 -6274 33286 24612
965 24612 -18095 -33428 337 32846 15649 -24335 -27687 10545 35391 9106 -31388 -26358
977 -26358 16631 35355 3438 -32874 -20246 22340 30916 -6958 -35643 -12654 30012 29569 -14258
990 -14258 -37867 -8081 31987 25691 -17645 -34600 -345 33987 18391 -24662 -32519 7637
1002 7637 37869 14210 -28935 -30209 11625 36189 8082 -30609 -23120 18374 33142 -721
1014 -721 -34725 -18748 24527 32611 -5863 -35908 -14693 26781 28031 -11993 -34283 -6352 31406
1027 31406 23446 -19646 -35173 -157 35293 20876 -22785 -33081 4514 35124 14537 -26792
1039 -26792 -28526 12298 36213 7828 -32085 -26097 17038 35433 3204 -32489 -20705 19863
1051 19863 29984 -3970 -31933 -13398 24266 26543 -9516 -32013 -9073 25715 22917 -12069
1063 -12069 -28217 -2893 26009 16042 -17531 -24831 4956 28298 10838 -22094 -22541 9531 27245
1076 27245 5270 -23866 -17132 15304 24910 -3003 -27729 -12345 21963 24776 -9058 -30255
1088 -30255 -7985 25404 21250 -14491 -28738 -393 28710 16075 -20439 -28095 5048 31502
1100 31502 13557 -22872 -26455 7716 30897 9461 -25348 -22866 13181 30842 3760 -29544
1112 -29544 -20393 17764 29944 -439 -29769 -16239 19845 25646 -6029 -28426 -9793 23065
1124 23065 22554 -10993 -28753 -5491 25332 20045 -13699 -26748 -218 26060 14074 -18129
1136 -18129 -23655 6296 27865 8889 -22609 -21468 10188 27089 4712 -24165 -17321 14286
1148 14286 24451 -1607 -26323 -12694 19629 23048 -6851 -27000 -8771 21638 19915 -10444
1160 -10444 -24341 -2703 22410 14993 -14297 -22488 2167 23826 12025 -16500 -21161 4988
1172 4988 23486 7646 -18656 -17356 9808 22862 1507 -22650 -13778 14907 21886 -3164 -23894
1185 -23894 -9704 17966 18538 -8171 -23248 -3970 21824 15578 -13874 -23540 848 24725 13196
1198 13196 -17368 -22037 5511 24870 8283 -20319 -19184 10396 25282 3947 -23184 -17731
1210 -17731 12965 25136 1206 -24229 -14933 15388 23189 -3222 -25343 -10714 19302 21344
1222 21344 -7337 -25562 -7136 21000 18497 -9905 -23007 -2706 21288 14179 -13202 -20965
1234 -20965 1954 22328 10843 -16150 -19458 5373 21819 6365 -17983 -15621 9624 20213
1246 20213 422 -20268 -11435 13908 18756 -3922 -20868 -7595 16176 15866 -7650 -19677 -2494
1259 -2494 18599 12487 -11977 -18934 1924 20436 9731 -14626 -17281 5225 19979 5737 -16609
1272 -16609 -14573 8948 19617 1686 -19124 -12800 11804 19429 -1196 -20329 -10097 14402
1284 14402 17538 -5404 -20772 -5696 17859 15426 -9550 -20802 -1946 19904 12905 -12324
1296 -12324 -18931 2065 20045 9045 -15102 -16949 6262 20620 5435 -17620 -15370 8950
1308 8950 19981 2045 -18513 -12420 11499 18378 -1987 -19671 -9027 14322 17130 -4779 -20018
1321 -20018 -6496 16030 15166 -7260 -18873 -2794 17514 12271 -10477 -17783 727 18681 9869
1334 9869 -12928 -16446 3659 17960 6347 -14322 -13887 6931 17206 2181 -16188 -11333 9906
1347 9906 16425 -1170 -16699 -8082 11837 14164 -4540 -16360 -3669 14255 11348 -7990 -15677
1360 -15677 -203 15697 8828 -10328 -14038 2854 15749 5404 -12741 -11959 6268 15733 2392
1373 2392 -14998 -10807 9012 15499 -435 -16009 -8605 11333 14489 -3811 -16840 -5693 14033
1386 14033 13753 -6761 -17519 -2975 15776 12125 -8837 -16792 42 16956 9362 -11500 -15691
1399 -15691 3064 17705 6801 -13557 -14273 5194 16960 4098 -14646 -11863 7668 15542 806
1412 806 -15362 -9482 9910 14568 -1781 -15334 -6906 11329 12789 -4252 -14533 -3514 12640
1425 12640 10629 -6862 -14105 -478 13897 8394 -8868 -12983 1968 14002 5491 -10856 -11316
1438 -11316 4869 14046 2409 -13018 -9655 7453 13630 -96 -13917 -7488 9669 12347 -3149
1451 -3149 -14082 -4447 11823 10903 -5797 -13913 -1840 13064 9172 -7692 -12856 856 13232
1464 13232 6509 -9582 -11629 3471 13572 3997 -11326 -10345 5472 13145 1569 -12332 -8354
1477 -8354 7644 12305 -1300 -13279 -6011 9972 11569 -3630 -13711 -3987 11668 10470 -5856
1490 -5856 -13520 -1245 13192 8710 -8425 -13341 1296 14369 6823 -10549 -12590 3527 14301
1503 14301 4286 -11857 -10867 5685 13753 1730 -12875 -9066 7453 12935 -84 -12849 -7145
1516 -7145 8580 11644 -2012 -12405 -4580 9854 10006 -4109 -11848 -2254 10595 8121 -5794
1529 -5794 -10818 95 10640 5518 -7553 -9466 2511 10746 3015 -9356 -8192 4767 10573
1542 10573 559 -10519 -6178 7144 9843 -2210 -11256 -3735 9489 8917 -4646 -11384 -1518
1555 -1518 10794 7636 -6461 -10922 661 11541 5886 -8304 -10405 2711 12061 4116 -9772
1568 -9772 -9634 4347 11810 1994 -10621 -7946 5992 10991 -127 -11116 -6181 7453 10221 -1723
1582 -1723 -11126 -4432 8579 9098 -3412 -10808 -2315 9823 7727 -5548 -10581 -67 10752 6074
1596 6074 -7341 -9910 1959 10935 3911 -8917 -8780 4191 10914 1658 -10201 -7460 5981 10587
1610 10587 -319 -10661 -5566 7406 9505 -2142 -10469 -3566 8448 8392 -3580 -10179 -1997 9036
1624 9036 7123 -4752 -9467 -396 9244 5422 -6219 -8638 1564 9336 3414 -7531 -7460 3293
1638 3293 8919 1308 -8264 -5730 5080 8206 -920 -8794 -3728 6912 7522 -2946 -9079 -1713
1652 -1713 8392 6329 -4925 -8803 441 9363 4792 -6783 -8491 2304 9943 3278 -8170 -7914
1666 -7914 3672 9939 1761 -9175 -7050 5201 9795 110 -9947 -5868 6516 9400 -1225
1679 -1225 -10052 -4347 7469 8472 -2532 -9593 -2734 8098 7423 -3682 -9302 -1388 8596 6295
1693 6295 -4945 -8785 170 8801 4547 -6341 -7915 2072 8851 2486 -7578 -6629 3774 8419
1707 8419 610 -8103 -5006 5280 7696 -1220 -8342 -3222 6662 6899 -2834 -8292 -1592 7527 5811
1722 5811 -4171 -7781 -14 7820 4365 -5327 -7261 1253 7961 3181 -6258 -6750 2417 7983 1836
1737 1836 -7083 -5801 3862 7794 207 -7799 -4414 5397 7269 -1479 -7946 -2717 6457 6262 -2991
1752 -2991 -7665 -989 7281 5015 -4474 -7411 534 7840 3768 -5775 -6976 2025 8046 2230 -6972
1767 -6972 -6120 3572 8004 691 -7771 -5097 4827 7707 -541 -8016 -3920 5796 7189 -1644 -8037
1782 -8037 -2736 6642 6611 -2841 -8056 -1563 7206 5679 -3886 -7657 -360 7376 4403 -4968 -7092
1797 -7092 910 7373 3067 -5729 -6334 2062 7247 1679 -6328 -5125 3468 6789 106 -6676 -3578
1812 -3578 4741 6154 -1373 -6660 -1965 5642 5005 -2716 -6190 -470 6050 3777 -3923 -5833 795
1827 795 6281 2623 -4924 -5382 1906 6330 1429 -5757 -4711 3125 6336 190 -6421 -3834 4307
1842 4307 6243 -922 -6790 -2769 5371 5795 -2096 -6880 -1519 6190 5041 -3266 -6814 -361 6709
1857 6709 4081 -4350 -6421 786 6797 2906 -5238 -5797 1930 6728 1728 -5848 -5037 2960 6479
1872 6479 569 -6122 -4000 3879 6027 -532 -6212 -2803 4663 5452 -1538 -6131 -1754 5185 4685
1887 4685 -2480 -5959 -716 5556 3755 -3484 -5662 337 5826 2759 -4409 -5254 1412 5868 1696
1902 1696 -5047 -4453 2568 5758 580 -5463 -3503 3581 5443 -524 -5600 -2405 4365 4811 -1620
1917 -1620 -5513 -1210 4876 3893 -2716 -5264 -111 5079 2826 -3532 -4813 824 5052 1786 -4158
1932 -4158 -4148 1760 5008 861 -4658 -3469 2754 4977 -47 -5038 -2638 3745 4776 -1094 -5284
1947 -5284 -1668 4583 4351 -2137 -5477 -747 5178 3701 -3084 -5419 100 5505 2883 -4005 -5211
1962 -5211 1024 5696 2017 -4667 -4698 1882 5611 1172 -4979 -3940 2679 5364 328 -5023 -3074
1977 -3074 3307 4950 -414 -4947 -2242 3687 4318 -1181 -4779 -1336 3970 3500 -2011 -4547 -458
1992 -458 4182 2631 -2739 -4139 434 4251 1676 -3394 -3566 1433 4310 783 -3977 -2923 2450
2007 2450 4294 -157 -4341 -2133 3378 3993 -1177 -4557 -1175 4044 3474 -2160 -4581 -345 4363
2022 4363 2739 -2841 -4361 357 4492 2024 -3370 -4036 1052 4538 1385 -3778 -3530 1746 4502
2037 4502 734 -4032 -2844 2473 4215 -28 -4185 -2148 3086 3856 -845 -4222 -1424 3522 3376
2052 3376 -1701 -4268 -651 3933 2742 -2566 -4245 248 4297 1997 -3350 -3942 1144 4459 1168
2067 1168 -3810 -3332 1970 4402 474 -4072 -2693 2608 4224 -79 -4175 -2137 3020 3896 -686
2082 -686 -4157 -1596 3286 3389 -1364 -4066 -924 3460 2743 -1953 -3804 -258 3464 2030 -2410 -3338
2098 -3338 512 3468 1274 -2794 -2813 1284 3489 573 -3147 -2122 2142 3311 -362 -3450 -1332
2113 -1332 2844 2938 -1279 -3612 -574 3354 2395 -2105 -3568 126 3664 1859 -2748 -3455 773 3852
2129 3852 1291 -3221 -3171 1388 3929 832 -3464 -2799 1933 3884 323 -3625 -2260 2320 3652 -161
2145 -161 -3667 -1863 2636 3302 -765 -3670 -1310 2913 2840 -1372 -3622 -673 3182 2308 -1988 -3385
2161 -3385 137 3339 1601 -2500 -2940 929 3396 865 -2855 -2325 1620 3306 233 -3086 -1772
2176 -1772 2160 3023 -421 -3218 -1286 2503 2654 -1036 -3244 -821 2760 2268 -1557 -3194 -326 2896
2192 2896 1860 -2005 -3022 279 3046 1328 -2298 -2597 865 3051 818 -2513 -2128 1414 2952
2207 2952 245 -2719 -1558 1945 2692 -385 -2886 -1003 2352 2286 -1122 -2936 -434 2659 1793 -1802
2223 -1802 -2793 182 2894 1258 -2294 -2591 832 2973 838 -2594 -2280 1357 3027 363 -2739 -1906
2239 -1906 1788 2986 -37 -2904 -1532 2089 2803 -433 -3011 -1186 2287 2488 -851 -3020 -853
2254 -853 2490 2195 -1264 -2906 -443 2633 1756 -1687 -2661 166 2723 1269 -2001 -2280 774 2640
2270 2640 710 -2162 -1787 1261 2429 76 -2273 -1261 1621 2137 -451 -2355 -837 1884 1825 -927
2286 -927 -2352 -393 2052 1429 -1305 -2239 38 2256 1135 -1659 -2052 493 2373 840 -1921 -1816
2302 -1816 973 2394 444 -2146 -1552 1385 2342 -56 -2318 -1209 1669 2102 -531 -2421 -815 1909
2318 1909 1813 -999 -2440 -387 2138 1487 -1382 -2273 94 2285 1124 -1683 -1992 585 2360 716
2334 716 -1846 -1673 966 2298 374 -1966 -1372 1222 2144 32 -2121 -1145 1442 1975 -392 -2195
2350 -2195 -896 1657 1737 -763 -2238 -572 1864 1495 -1081 -2141 -112 2020 1213 -1349 -1944 353
2366 353 2112 853 -1599 -1650 737 2067 459 -1754 -1321 1110 1907 -27 -1855 -946 1301 1645 -426
2383 -426 -1851 -620 1456 1335 -747 -1801 -259 1562 1107 -1012 -1679 49 1705 886 -1236 -1519
2399 -1519 453 1778 562 -1472 -1313 801 1805 230 -1667 -1099 1078 1724 -121 -1829 -890 1372
2415 1372 1655 -509 -1971 -570 1599 1417 -841 -1949 -235 1793 1208 -1106 -1837 127 1919 939
2431 939 -1322 -1594 394 1901 675 -1446 -1458 658 1782 374 -1538 -1212 830 1625 101 -1594
2447 -1594 -1026 936 1495 -193 -1623 -801 1084 1335 -353 -1585 -470 1328 1162 -668 -1494 -101
2463 -101 1501 932 -910 -1367 258 1584 602 -1172 -1157 606 1549 263 -1383 -983 829 1414 -103
2480 -103 -1506 -772 1042 1276 -366 -1521 -542 1198 1135 -575 -1492 -260 1288 980 -713 -1339 -34
2497 -34 1388 821 -864 -1247 215 1403 613 -1000 -1115 413 1414 378 -1214 -948 690 1314 28
2514 28 -1321 -780 883 1212 -266 -1380 -535 1096 1084 -547 -1391 -229 1236 916 -744 -1328 58
2531 58 1392 758 -909 -1225 249 1403 570 -1057 -1117 419 1343 339 -1129 -979 545 1237 197
2548 197 -1148 -853 633 1162 44 -1137 -664 772 1064 -113 -1106 -473 896 921 -300 -1017 -200 974
2566 974 754 -551 -981 77 1042 435 -780 -880 304 996 189 -962 -673 547 946 -88 -1058 -502
2584 -502 765 885 -248 -1085 -358 896 896 -390 -1058 -192 977 824 -472 -1036 -37 1074 729 -618
2602 -618 -1005 66 1091 581 -730 -1003 148 1045 403 -836 -953 279 1001 213 -913 -774 468
2619 468 919 12 -941 -559 650 834 -154 -880 -264 792 730 -345 -849 -40 866 581 -490 -802 102
2638 102 894 378 -649 -740 230 892 235 -766 -702 340 885 131 -812 -631 431 846 25 -840 -532
2657 -532 534 841 -44 -825 -406 617 755 -171 -804 -246 663 630 -307 -778 -72 711 441 -454 -695 127
2677 127 714 207 -596 -553 286 672 66 -638 -399 468 655 -95 -672 -266 580 631 -230 -701 -131 678 552
2698 552 -339 -710 -95 671 495 -399 -737 -17 738 411 -530 -758 58 727 356 -596 -686 144 765 257
2718 257 -620 -572 271 727 115 -606 -412 408 672 31 -547 -261 471 526 -145 -534 -132 468 370 -247 -511
2739 -511 -31 468 225 -369 -480 53 452 120 -417 -403 173 473 49 -455 -331 243 507 33 -438 -264
2759 -264 354 546 -30 -475 -219 451 509 -117 -534 -162 492 419 -234 -528 -54 501 318 -306 -521 22 489
2780 489 181 -397 -402 113 443 97 -390 -322 203 424 36 -375 -219 277 374 -58 -394 -175 293 364 -65 -381
2802 -381 -149 333 330 -142 -437 -90 386 311 -223 -411 -51 409 302 -243 -421 14 415 241 -278 -388 102
2823 102 442 185 -305 -306 116 397 78 -350 -261 186 344 30 -307 -202 156 247 -41 -291 -154 175 215 -67
2845 -67 -275 -86 229 201 -97 -232 -23 247 173 -101 -240 20 293 173 -131 -193 89 281 115 -219 -200 104
2867 104 259 23 -266 -229 164 275 -42 -338 -207 191 240 -101 -311 -115 223 223 -100 -288 -26 285 227 -89
2889 -89 -254 14 263 225 -128 -236 21 293 186 -138 -252 -8 284 154 -171 -297 0 283 125 -224 -305
2910 -305 52 298 95 -265 -241 107 316 88 -298 -186 134 314 -12 -255 -130 196 246 -21 -221 -97 171
2931 171 188 -57 -233 -57 203 182 -118 -237 -22 203 142 -123 -214 47 227 105 -168 -195 57 252 78 -194
2953 -194 -154 123 237 52 -217 -154 176 272 -13 -278 -166 201 273 -78 -324 -96 263 197 -166 -339 -84 251
2975 251 205 -183 -305 30 313 180 -177 -229 82 310 127 -199 -202 127 278 102 -206 -178 155 308 47 -262
2997 -262 -195 172 276 -42 -333 -200 195 281 -94 -386 -166 305 307 -156 -436 -101 356 310 -176 -383 -10 402
3019 402 296 -217 -376 52 420 235 -249 -329 69 409 157 -295 -320 75 360 120 -294 -248 90 315 33
3040 33 -316 -248 110 319 -28 -300 -192 214 257 -85 -303 -83 280 255 -143 -317 -16 348 209 -242 -308 87
3062 87 401 129 -318 -328 162 407 86 -387 -295 238 432 7 -409 -247 288 432 -81 -458 -177 345 401
3083 401 -121 -449 -140 380 387 -144 -433 -76 412 299 -238 -431 -21 412 246 -285 -428 29 432 196 -350
3104 -350 -394 130 474 98 -377 -320 266 498 28 -424 -232 341 479 -49 -444 -169 402 441 -160 -484 -93
3125 -93 448 341 -292 -514 -47 435 272 -358 -479 2 480 172 -369 -420 110 472 144 -405 -339 181 476
3146 476 114 -376 -261 271 475 20 -397 -170 348 405 -98 -427 -93 408 329 -236 -441 -10 467 236 -323
3167 -323 -463 69 497 143 -489 -423 243 509 62 -516 -365 350 554 -51 -533 -272 395 537 -54 -557
3187 -557 -200 468 488 -152 -559 -139 465 459 -243 -579 -67 498 368 -293 -549 18 532 287 -362 -498 94
3208 94 538 171 -430 -426 181 542 106 -486 -354 290 509 -45 -511 -241 375 438 -148 -550 -154 441 363 -241
3230 -241 -546 -86 476 305 -317 -505 51 513 244 -346 -426 134 540 167 -414 -379 243 537 97 -472 -299
3251 -299 311 510 -5 -504 -265 366 445 -163 -575 -191 470 401 -223 -601 -88 508 318 -366 -536 65 571
3272 571 228 -431 -482 163 600 158 -498 -396 315 622 121 -516 -347 391 587 12 -574 -278 442 531 -114
3293 -114 -564 -230 459 474 -228 -619 -160 506 408 -282 -593 -63 548 346 -354 -578 67 570 276 -420 -476
3314 -476 150 591 159 -486 -409 248 547 32 -527 -301 337 531 -75 -533 -210 398 433 -181 -503 -126 472
3335 472 386 -268 -479 18 553 295 -361 -459 103 554 203 -434 -423 181 569 81 -507 -397 296 530 18
3356 18 -572 -346 378 528 -121 -596 -212 470 502 -205 -620 -104 579 458 -309 -565 23 614 345 -405 -545
3377 -545 127 641 256 -481 -490 219 645 116 -567 -466 283 593 32 -643 -379 357 557 -65 -647 -275 447
3398 447 509 -204 -646 -209 539 471 -248 -577 -91 552 429 -331 -533 79 642 332 -404 -495 171 619 171
3419 171 -500 -443 266 574 62 -587 -356 356 545 -93 -614 -274 442 470 -223 -604 -125 502 379 -285 -575
3440 -575 2 572 341 -386 -542 106 635 236 -484 -465 192 610 132 -561 -397 351 617 38 -606 -339
3460 -339 416 592 -106 -671 -248 545 535 -221 -644 -153 595 479 -318 -661 -35 650 396 -428 -660 95
3480 95 685 260 -524 -613 195 698 176 -583 -496 282 641 88 -608 -430 382 626 -36 -645 -310 481 573
3501 573 -122 -628 -209 548 507 -209 -608 -96 569 432 -280 -595 22 604 298 -460 -539 135 581 195 -532
3522 -532 -484 240 580 49 -611 -425 371 585 -86 -630 -263 479 536 -184 -602 -119 581 451 -286 -597 4
3543 4 641 398 -374 -550 80 652 276 -476 -518 183 669 171 -571 -494 288 637 48 -652 -392 374 620
3564 620 -55 -690 -330 470 568 -153 -684 -231 584 520 -261 -652 -83 654 463 -375 -651 39 671 358 -484
3585 -484 -589 140 714 225 -561 -554 251 678 144 -599 -450 364 650 17 -610 -348 429 601 -102 -638 -301
3606 -301 499 539 -243 -645 -150 537 468 -291 -616 -33 614 342 -430 -563 135 607 212 -514 -491 264 633
3627 633 137 -558 -358 397 631 -35 -606 -265 502 581 -167 -644 -173 582 505 -302 -666 -93 639 402 -423
3648 -423 -667 44 659 310 -499 -611 164 703 208 -593 -582 251 712 137 -641 -470 384 711 9 -684
3668 -684 -391 508 714 -78 -665 -265 584 624 -242 -701 -121 628 490 -382 -697 -30 679 359 -464 -656
3688 -656 105 683 219 -567 -610 193 681 141 -614 -472 336 659 29 -650 -376 426 641 -85 -638 -271
3708 -271 515 572 -188 -661 -127 607 474 -333 -623 -5 634 377 -434 -592 114 660 233 -528 -527 248 681
3729 681 110 -608 -451 373 642 -35 -674 -339 470 596 -158 -685 -230 596 520 -284 -706 -98 666 450
3749 450 -407 -681 -1 714 379 -505 -653 128 768 291 -560 -571 254 727 173 -638 -515 374 737 42
3769 42 -661 -416 468 680 -59 -743 -311 541 572 -221 -740 -200 588 503 -352 -686 -74 636 392 -435 -633
3790 -633 84 691 309 -505 -567 199 691 188 -557 -457 345 683 53 -601 -371 433 644 -35 -648 -261
3810 -261 506 552 -200 -649 -166 558 460 -330 -679 -63 604 355 -432 -644 96 649 248 -530 -530 229 685
3831 685 126 -630 -469 357 662 39 -656 -342 486 651 -117 -688 -248 556 559 -258 -699 -139 620 477 -356
3852 -356 -687 -24 681 406 -476 -643 93 678 289 -545 -603 190 717 188 -612 -549 318 669 119 -651 -427
3873 -427 381 648 -47 -700 -357 483 586 -134 -710 -219 550 536 -281 -683 -60 613 460 -386 -616 58
3893 58 686 300 -457 -549 192 685 198 -544 -493 276 653 63 -598 -414 378 574 -60 -677 -315 465 549
3914 549 -185 -674 -200 553 483 -312 -656 -42 621 407 -390 -612 90 705 309 -480 -548 210 705 215 -555
3935 -555 -482 344 699 65 -681 -419 420 651 -55 -723 -346 504 591 -197 -711 -243 573 529 -312 -717 -82
3956 -82 638 443 -378 -666 11 689 355 -465 -627 142 682 266 -538 -554 258 706 130 -576 -483 354 664
3977 664 21 -658 -349 471 612 -127 -673 -237 514 512 -248 -662 -113 576 442 -366 -629 -8 625 316 -459
3998 -459 -572 110 624 187 -539 -502 266 643 91 -576 -389 374 594 -42 -616 -336 454 598 -131 -640
4018 -640 -165 550 527 -238 -657 -85 624 432 -370 -621 49 667 321 -484 -595 161 685 232 -569 -537 248
4039 248 684 81 -614 -466 390 640 -35 -671 -339 466 610 -102 -679 -230 557 554 -189 -676 -108 624 493
4060 493 -331 -633 -4 645 372 -386 -591 92 653 277 -487 -540 190 613 156 -549 -476 283 598 39 -601
4081 -601 -371 385 566 -85 -615 -254 463 508 -204 -618 -143 518 390 -282 -580 -5 593 345 -376 -531
4101 -531 123 601 222 -467 -448 247 595 97 -529 -403 325 568 -27 -576 -315 408 546 -134 -617 -234
4121 -234 463 460 -240 -650 -114 534 425 -308 -571 3 592 312 -425 -554 83 609 255 -478 -482 228 638
4142 638 141 -543 -411 300 613 48 -570 -337 383 573 -95 -595 -230 488 506 -158 -598 -146 545 444
4162 444 -261 -608 -92 540 356 -381 -568 41 568 285 -436 -515 131 580 151 -472 -442 245 564 98 -515
4183 -515 -343 333 538 -14 -531 -235 419 501 -137 -541 -157 485 392 -238 -534 -34 508 334 -324 -504 90
4204 90 547 203 -456 -450 203 554 109 -505 -439 263 522 2 -535 -305 358 523 -54 -554 -241 463 509 -193
4226 -193 -535 -121 522 430 -280 -550 -33 589 362 -351 -549 43 595 280 -412 -537 155 575 157 -501
4246 -501 -438 259 564 50 -526 -363 320 556 -41 -562 -281 405 521 -104 -592 -197 474 444 -223 -549 -105
4267 -105 499 339 -279 -520 17 555 288 -351 -472 120 573 200 -415 -436 196 549 75 -470 -365 284
4287 284 517 6 -492 -239 400 436 -140 -546 -169 429 370 -239 -522 -106 490 310 -330 -487 15 529 243
4308 243 -391 -459 150 529 141 -440 -391 265 556 60 -486 -322 355 539 -27 -511 -269 425 503 -112 -554
4329 -554 -168 481 405 -232 -577 -106 485 367 -312 -547 -3 518 291 -382 -521 95 530 207 -452 -438 185
4350 185 545 106 -479 -348 279 509 41 -511 -257 377 497 -59 -490 -196 389 429 -143 -532 -125 461
4370 461 356 -258 -491 -34 490 297 -320 -494 42 493 200 -379 -433 161 480 88 -451 -376 235 500 14
4391 14 -463 -277 351 491 -61 -477 -182 408 396 -180 -503 -79 433 336 -256 -485 -7 464 265 -318 -428
4412 -428 88 514 206 -379 -416 178 518 100 -445 -367 261 497 21 -489 -328 316 493 -83 -527 -243 355
4433 355 439 -152 -523 -149 477 408 -234 -511 -37 507 319 -277 -494 64 519 251 -349 -420 166 512 180
4454 180 -388 -383 204 489 86 -429 -302 290 433 -32 -497 -241 332 402 -129 -500 -184 385 364 -225 -503
4475 -503 -78 430 328 -286 -448 2 495 253 -368 -399 110 502 135 -406 -356 227 514 59 -445 -290 304
4496 304 475 -37 -461 -198 388 401 -137 -508 -144 409 347 -249 -465 -46 454 300 -322 -460 46 469 174
4517 174 -390 -447 173 492 138 -412 -353 222 526 51 -476 -303 312 488 -55 -488 -226 377 445 -111 -495
4538 -495 -147 450 374 -180 -480 -80 470 321 -278 -473 29 459 227 -330 -432 95 468 160 -397 -409 195
4559 195 455 87 -432 -326 247 457 -13 -460 -230 331 420 -116 -448 -141 399 354 -181 -448 -16 429 316
4580 316 -237 -397 29 456 226 -345 -354 138 465 99 -401 -349 212 408 36 -449 -294 267 398 -42 -474
4601 -474 -186 342 345 -148 -459 -103 400 332 -200 -441 -11 437 263 -263 -424 70 449 209 -351 -353 169 472
4623 472 129 -396 -340 212 469 49 -445 -290 289 465 -62 -463 -200 333 393 -130 -464 -140 370 341 -215
4644 -215 -461 -84 432 284 -271 -410 7 443 223 -297 -378 108 445 136 -347 -315 218 406 48 -369 -236
4665 -236 240 398 -22 -403 -176 287 388 -122 -431 -72 372 332 -195 -399 -7 404 256 -282 -395 56
4685 56 423 144 -349 -368 159 407 80 -358 -281 240 444 -26 -415 -213 331 373 -86 -419 -147 377 337 -145
4707 -145 -389 -29 395 333 -221 -385 29 444 247 -290 -383 94 437 135 -347 -313 177 420 75 -386 -299
4728 -299 217 414 -1 -411 -256 292 391 -84 -397 -148 324 369 -130 -433 -85 385 327 -189 -384 6 433
4749 433 281 -235 -392 78 406 180 -298 -310 154 407 87 -345 -270 211 364 -6 -340 -227 233 347 -80
4770 -80 -368 -165 299 303 -134 -381 -76 332 271 -214 -387 24 415 242 -271 -362 87 405 127 -324 -328 196
4792 196 412 49 -346 -235 260 409 -3 -377 -170 304 370 -89 -403 -114 317 312 -152 -405 -31 376 237
4813 237 -216 -365 -2 380 170 -301 -328 106 375 121 -336 -307 159 410 68 -353 -258 233 388 14 -359
4834 -359 -233 309 361 -46 -350 -148 340 326 -129 -372 -50 369 283 -196 -382 -12 365 189 -258 -335 52
4855 52 364 103 -327 -326 141 349 33 -353 -259 184 337 -22 -372 -152 268 316 -102 -350 -94 324 284 -155
4877 -155 -310 25 371 213 -209 -335 63 374 153 -278 -303 133 368 104 -342 -283 172 351 -15 -373 -246
4898 -246 241 330 -61 -374 -188 272 337 -106 -407 -85 305 298 -172 -383 -63 356 248 -208 -356 54 381
4919 381 182 -260 -309 114 404 111 -309 -274 184 385 51 -318 -217 219 356 -2 -369 -167 265 326 -103
4940 -103 -355 -116 315 272 -164 -372 -51 313 211 -218 -333 24 336 136 -269 -315 139 345 75 -288 -244
4961 -244 181 350 35 -315 -168 251 325 -57 -303 -111 281 281 -100 -313 -42 311 203 -191 -332 -1 329
4982 329 181 -254 -296 45 328 124 -301 -285 125 346 43 -349 -257 177 340 4 -314 -185 240 352 -30
5003 -30 -336 -127 318 302 -114 -336 -18 359 270 -158 -325 -19 356 219 -222 -326 40 360 141 -276 -284 101
5025 101 329 68 -275 -250 163 347 6 -323 -181 240 294 -26 -334 -107 267 293 -87 -329 -77 277 252
5046 252 -153 -319 17 312 184 -207 -271 86 360 120 -264 -247 103 341 50 -292 -212 156 306 -7 -308
5067 -308 -155 225 274 -57 -326 -102 261 251 -142 -300 -23 293 218 -213 -288 19 348 144 -242 -284 80 329
5089 329 100 -245 -250 162 344 73 -299 -203 221 347 -9 -318 -158 260 302 -56 -335 -130 294 276 -145 -342
5111 -342 -63 278 217 -183 -334 -14 323 158 -209 -314 37 328 105 -287 -249 127 342 86 -319 -193 214
5132 214 334 34 -287 -153 243 306 -50 -312 -70 265 274 -128 -297 -20 324 217 -198 -307 32 313 101
5153 101 -243 -281 73 304 58 -275 -264 127 289 -9 -321 -175 209 293 -52 -298 -102 260 254 -85 -314 -48
5175 -48 321 255 -161 -292 24 312 183 -210 -285 70 356 126 -277 -260 96 349 36 -315 -222 178 323 12
5197 12 -337 -189 216 314 -71 -334 -163 295 299 -137 -346 -53 305 217 -156 -326 11 323 170 -216 -287 46
5219 46 314 135 -238 -256 110 340 90 -285 -212 181 320 -3 -293 -153 240 304 -73 -322 -95 222 251 -120
5241 -120 -314 -62 297 168 -208 -301 5 261 129 -226 -289 77 308 84 -274 -219 119 346 21 -295 -185
5262 -185 202 344 -29 -297 -127 267 294 -91 -325 -72 271 255 -134 -323 -26 295 200 -198 -305 18 301
5283 301 146 -257 -277 98 313 71 -283 -262 152 330 38 -304 -200 203 336 -6 -311 -162 257 305 -71
5304 -71 -321 -63 297 242 -97 -303 -34 340 228 -184 -315 39 324 152 -190 -246 76 314 117 -274 -244
5325 -244 127 281 13 -274 -202 155 272 -53 -303 -166 206 244 -109 -314 -78 279 232 -168 -302 12 287
5346 287 177 -187 -267 36 311 128 -228 -231 123 326 64 -257 -161 183 335 17 -333 -170 233 295 -57 -321
5368 -321 -97 264 268 -151 -326 -45 282 209 -188 -355 -4 316 128 -247 -312 43 342 90 -295 -254 139 323
5390 323 58 -277 -213 202 337 6 -287 -130 208 303 -57 -328 -113 288 250 -118 -339 -63 322 173 -200
5411 -200 -322 28 309 138 -243 -292 75 291 104 -281 -252 126 294 17 -284 -186 181 316 -10 -275 -108
5432 -108 260 283 -79 -292 -72 293 227 -152 -312 -3 316 178 -183 -284 72 353 135 -244 -277 125 337
5453 337 80 -279 -229 169 319 -9 -337 -182 199 291 -76 -341 -123 267 249 -118 -322 -75 273 241 -196
5474 -196 -311 6 343 183 -227 -288 90 357 148 -245 -271 144 344 79 -272 -206 192 321 14 -306 -168
5495 -168 249 295 -50 -335 -128 264 273 -124 -323 -57 278 204 -172 -300 -35 301 165 -223 -279 62 328 105
5517 105 -251 -233 146 342 66 -264 -172 192 297 -8 -282 -135 244 286 -63 -321 -84 299 221 -166 -301
5538 -301 -32 268 165 -222 -315 0 301 138 -238 -267 58 321 61 -288 -240 134 311 16 -296 -172 227
5559 227 326 -28 -318 -134 267 301 -96 -323 -69 292 235 -132 -328 -14 284 191 -206 -308 40 313 140
5580 140 -258 -274 66 319 66 -285 -251 134 323 26 -308 -182 195 265 -34 -319 -146 233 218 -112 -303
5601 -303 -59 272 200 -148 -283 4 314 221 -183 -238 64 310 127 -215 -238 97 317 89 -252 -194 190 290
5623 290 -13 -271 -170 221 279 -73 -335 -110 233 238 -144 -313 -71 271 164 -170 -303 8 312 146 -229
5644 -229 -270 109 288 116 -237 -196 163 320 53 -264 -203 207 316 31 -280 -156 231 285 -28 -317 -97
5665 -97 267 267 -119 -315 -81 274 181 -185 -304 -7 298 146 -215 -285 67 301 88 -261 -221 143 307 51
5687 51 -285 -193 167 279 3 -266 -131 228 300 -46 -307 -79 264 231 -122 -310 -18 297 191 -153 -285
5708 -285 7 312 103 -225 -242 98 272 40 -282 -192 149 273 -7 -302 -146 202 244 -62 -280 -106 248
5729 248 233 -124 -298 -83 276 202 -166 -268 -13 305 168 -198 -233 71 319 115 -272 -227 146 308 58
5750 58 -268 -196 199 296 -6 -349 -159 176 279 -79 -326 -126 223 232 -142 -301 -57 259 210 -174 -304 -4
5772 -4 285 137 -196 -277 70 338 98 -225 -222 131 327 57 -274 -185 203 287 -4 -264 -136 217 247 -92 -289
5795 -289 -78 262 178 -105 -295 -25 260 154 -191 -287 33 299 110 -243 -265 83 293 74 -280 -200 155
5816 155 287 3 -279 -134 219 308 -40 -254 -93 261 235 -77 -283 -14 316 220 -167 -286 31 279 135
5837 135 -216 -263 65 279 90 -246 -216 121 286 29 -262 -209 169 305 -32 -290 -157 217 279 -52 -310
5858 -310 -117 264 255 -104 -302 -72 290 242 -146 -291 -8 299 179 -199 -250 62 302 74 -222 -228 106 291
5880 291 67 -279 -189 151 328 -5 -312 -131 212 221 -82 -277 -90 247 206 -118 -298 -47 256 140 -173
5901 -173 -249 28 261 131 -213 -202 107 299 101 -247 -203 143 288 33 -257 -150 232 288 -25 -283 -118
5922 -118 251 266 -64 -311 -81 245 222 -156 -319 -44 290 166 -187 -294 34 276 117 -216 -269 81 307
5943 307 97 -257 -212 143 312 24 -273 -161 219 275 -1 -288 -137 227 257 -75 -266 -65 294 223 -133
5964 -133 -278 -3 279 154 -197 -283 42 269 134 -259 -261 99 286 51 -239 -212 136 272 -8 -265 -155
5985 -155 167 271 -61 -286 -123 223 216 -105 -267 -65 280 187 -141 -249 6 297 169 -206 -250 73 312
6006 312 110 -224 -204 114 256 42 -258 -211 166 267 -35 -296 -156 192 276 -86 -297 -109 218 220 -132 -302
6028 -302 -41 278 180 -171 -281 10 276 160 -190 -261 75 320 122 -221 -228 127 317 66 -252 -181 184 289
6050 289 -17 -292 -148 176 265 -89 -287 -63 234 216 -127 -302 -58 247 173 -169 -273 -2 282 121 -210
6071 -210 -263 74 298 97 -249 -203 129 295 49 -266 -145 208 279 -22 -268 -87 217 232 -44 -282 -48
6092 -48 249 226 -145 -283 13 274 146 -172 -263 28 249 87 -210 -252 92 289 48 -261 -217 148 271 -6
6114 -6 -273 -167 179 274 -45 -287 -84 237 224 -110 -320 -70 264 219 -113 -278 0 294 177 -182 -242 30
6136 30 280 119 -232 -213 100 307 51 -241 -202 140 273 -13 -286 -180 166 229 -40 -279 -120 203 198 -93
6158 -93 -264 -72 236 189 -150 -226 8 248 141 -152 -232 60 292 118 -186 -197 116 278 64 -234 -172 153
6180 153 276 -6 -262 -141 175 235 -45 -272 -105 206 206 -122 -263 -40 236 179 -162 -277 13 273 113
6201 113 -214 -237 71 265 76 -237 -217 124 306 49 -246 -183 155 307 -13 -243 -129 212 272 -57 -264
6222 -264 -90 224 231 -114 -281 -39 272 176 -190 -267 -2 261 130 -196 -248 34 263 75 -229 -192 119 241
6244 241 40 -236 -180 156 237 10 -247 -127 201 241 -72 -246 -55 246 219 -72 -228 -6 251 141 -143
6265 -143 -237 -3 265 109 -183 -198 77 276 85 -226 -176 131 220 10 -267 -163 147 215 -24 -272 -99 177
6287 177 208 -98 -258 -63 224 182 -119 -243 -5 271 163 -143 -229 73 276 134 -177 -200 72 271 74
6308 74 -226 -187 129 244 4 -258 -164 172 211 -27 -264 -122 181 211 -109 -281 -65 216 173 -142 -248 9
6330 9 213 147 -159 -221 45 251 122 -180 -207 111 272 52 -175 -172 157 262 35 -229 -113 129 224 -46 -254
6353 -254 -93 194 203 -84 -241 -46 195 159 -163 -215 -2 216 113 -179 -206 69 267 71 -197 -180 95 217
6375 217 19 -220 -150 149 236 -39 -216 -100 202 229 -69 -229 -46 213 154 -86 -230 10 241 120 -141
6396 -141 -215 25 242 90 -185 -211 67 237 37 -210 -164 123 230 -19 -201 -152 144 235 -43 -239 -124 182
6418 182 202 -81 -240 -40 198 164 -116 -212 -10 244 144 -135 -198 35 257 113 -167 -184 65 231 50 -188
6440 -188 -144 119 240 6 -223 -97 133 214 -57 -220 -104 150 167 -70 -225 -44 181 142 -126 -206 20 158
6462 158 124 -158 -193 70 207 84 -148 -150 121 201 42 -180 -104 120 196 -11 -201 -80 156 183 -47 -256 -49
6485 -49 182 140 -83 -201 -33 183 135 -180 -209 4 210 91 -130 -198 75 219 67 -195 -165 117 194 23
6507 23 -189 -145 136 221 -40 -202 -73 187 206 -26 -179 -46 172 168 -81 -165 -18 200 129 -100 -167 22 191
6530 191 77 -159 -184 65 187 36 -185 -160 70 176 4 -174 -124 105 154 -40 -170 -68 170 167 -70 -180
6552 -180 -44 159 122 -89 -134 14 193 111 -105 -136 47 191 81 -135 -106 64 173 11 -159 -95 95 188
6574 188 -37 -189 -90 133 141 -81 -216 -55 149 132 -94 -170 -20 174 112 -131 -182 14 177 103 -149 -123 59
6597 59 211 48 -140 -117 118 208 27 -155 -53 103 164 -23 -182 -46 140 141 -62 -155 -47 160 110 -115 -152
6620 -152 -1 146 83 -121 -145 25 149 25 -140 -120 58 171 31 -175 -101 98 156 -12 -174 -44 116 135
6642 135 -50 -155 -21 167 108 -64 -173 -14 161 95 -111 -128 26 166 72 -125 -114 68 179 18 -134 -116
6664 -116 64 124 7 -162 -83 120 130 -32 -156 -51 131 135 -76 -160 3 130 87 -84 -147 37 166 103 -101
6687 -101 -130 55 188 53 -112 -139 47 160 34 -130 -96 97 148 -9 -171 -64 117 105 -81 -191 -54 138
6709 138 103 -72 -170 -13 127 61 -91 -133 40 137 79 -98 -114 59 124 54 -146 -84 83 144 -12 -119 -53 112
6733 112 125 -34 -120 -10 129 136 -63 -128 -2 123 99 -98 -157 -5 157 35 -119 -148 49 130 20 -138 -87
6756 -87 83 122 16 -168 -90 98 107 -38 -166 -33 113 114 -68 -141 -37 132 103 -86 -132 30 164 64 -87
6779 -87 -100 52 150 39 -136 -97 61 147 -6 -144 -87 92 127 -6 -158 -72 103 101 -70 -150 -41 107 81 -70
6803 -70 -161 19 164 46 -99 -136 24 185 47 -119 -92 51 174 33 -114 -64 111 149 16 -131 -40 109
6825 109 151 -20 -148 -38 117 99 -50 -127 -1 113 82 -113 -168 16 130 68 -133 -158 39 148 0 -123
6847 -123 -105 91 132 6 -162 -55 108 127 -13 -137 -38 132 127 -53 -135 -5 142 108 -66 -128 29 168 74
6870 74 -132 -136 46 174 27 -139 -141 86 174 -17 -149 -99 100 117 -33 -151 -76 123 114 -61 -179 -35 152 120
6894 120 -79 -163 -18 149 116 -75 -143 28 168 65 -107 -131 82 186 40 -146 -100 107 166 -14 -152 -74
6916 -74 107 150 -35 -163 -44 140 111 -94 -168 -46 133 47 -103 -148 3 144 59 -135 -138 42 180 54 -151
6939 -151 -131 98 171 25 -148 -77 103 173 23 -150 -58 145 161 -47 -194 -20 158 118 -79 -178 10 137 90
6962 90 -126 -182 32 168 76 -156 -164 57 177 20 -184 -162 96 152 -3 -197 -123 111 180 -35 -196 -67 159
6985 159 158 -62 -186 -20 197 153 -90 -183 1 202 92 -135 -168 44 168 77 -177 -157 93 164 18 -194 -117
7008 -117 110 154 -24 -205 -110 128 160 -58 -206 -45 167 155 -82 -176 21 176 138 -128 -175 36 214 100
7030 100 -141 -134 75 221 55 -137 -122 106 227 30 -201 -95 155 190 -31 -227 -79 162 146 -98 -232 -61
7052 -61 168 162 -102 -233 -22 201 113 -160 -215 19 226 81 -206 -173 97 238 57 -206 -153 143 222 -13 -215
7075 -215 -94 152 205 -12 -218 -87 197 185 -73 -232 -25 206 155 -89 -225 -8 193 97 -151 -192 44 207
7097 207 51 -201 -185 95 226 23 -204 -158 129 237 -8 -204 -111 163 225 -28 -207 -60 206 188 -87 -220
7119 -220 -18 223 148 -136 -208 27 222 81 -204 -201 61 247 56 -203 -201 73 210 -4 -212 -167 151 209 -57
7142 -57 -275 -118 169 209 -97 -256 -76 224 172 -115 -247 7 255 179 -143 -238 15 253 118 -181 -226 102
7164 102 292 59 -233 -187 126 257 28 -266 -145 156 252 -22 -263 -110 182 217 -94 -278 -85 228 173
7185 173 -117 -258 -63 235 158 -164 -251 12 247 124 -197 -240 76 270 65 -254 -189 122 262 29 -241
7206 -241 -127 189 252 -28 -246 -69 209 245 -97 -285 -40 225 171 -146 -269 -17 252 122 -179 -269 42
7227 42 255 93 -213 -232 110 288 21 -250 -170 169 270 -3 -244 -135 219 278 -34 -278 -106 253 258 -75
7249 -75 -249 -47 276 227 -163 -278 23 279 150 -227 -276 58 310 101 -265 -246 98 274 54 -279 -230 149
7271 149 287 -7 -302 -170 192 247 -81 -297 -112 202 245 -102 -296 -54 283 211 -137 -267 21 314 169
7292 169 -183 -265 73 331 135 -244 -231 120 315 53 -273 -192 161 283 -4 -316 -152 228 259 -67 -326
7313 -326 -118 258 233 -150 -312 -64 271 179 -169 -284 31 319 154 -224 -273 88 335 112 -250 -205 115
7334 115 317 47 -293 -180 223 317 13 -311 -140 254 293 -96 -328 -94 284 268 -132 -352 -53 282 187
7355 187 -203 -324 3 303 140 -242 -307 72 324 87 -299 -226 130 336 37 -307 -166 215 329 -2 -310
7376 -310 -142 243 314 -61 -322 -74 288 272 -154 -329 -27 294 196 -193 -282 32 309 166 -259 -274 111 331
7398 331 83 -315 -272 137 300 8 -323 -197 196 282 -46 -323 -154 238 294 -126 -354 -40 329 261 -159
7419 -159 -330 -23 338 218 -221 -323 48 357 126 -271 -291 124 357 82 -313 -263 176 338 -3 -354 -196
7440 -196 222 308 -74 -371 -162 233 276 -108 -348 -83 290 233 -194 -340 -5 311 200 -212 -318 54 366
7461 366 171 -248 -295 110 357 102 -300 -247 170 355 3 -349 -190 239 316 -80 -340 -174 268 253 -123
7482 -123 -333 -84 279 209 -201 -372 -12 330 189 -223 -345 38 374 106 -251 -273 152 362 68 -322 -226
7503 -226 188 364 2 -364 -174 261 299 -95 -333 -142 313 267 -152 -354 -81 341 237 -196 -368 6 345
7524 345 150 -258 -334 80 368 121 -306 -299 134 340 29 -320 -221 210 339 -35 -351 -169 264 329 -77 -350
7546 -350 -122 317 276 -175 -350 -29 365 228 -221 -363 47 390 167 -268 -316 91 364 100 -331 -301 156
7567 156 369 44 -375 -240 226 364 -47 -377 -203 249 320 -106 -384 -139 321 296 -154 -390 -33 373 195
7588 195 -237 -323 57 383 178 -256 -311 111 389 132 -320 -249 203 367 18 -373 -239 252 344 -53 -386
7609 -386 -178 285 315 -141 -404 -104 336 288 -218 -408 -22 355 205 -244 -385 51 419 184 -306 -299 129
7630 129 390 101 -336 -248 187 398 43 -348 -224 261 346 -55 -384 -144 297 339 -133 -390 -98 342 257
7651 257 -198 -385 -28 371 195 -237 -368 32 360 133 -315 -327 107 397 72 -363 -282 176 402 3 -353
7672 -353 -213 253 352 -67 -360 -136 299 303 -127 -389 -76 340 290 -197 -373 3 370 204 -258 -357 54 387
7694 387 139 -326 -308 148 381 40 -376 -256 205 360 6 -381 -222 243 341 -111 -386 -161 311 306 -151
7715 -151 -382 -71 367 277 -215 -399 1 398 213 -262 -316 102 400 129 -308 -275 151 414 54 -375 -243
7736 -243 200 369 -17 -390 -205 275 345 -111 -387 -136 323 307 -150 -390 -60 359 239 -202 -351 39 385
7757 385 180 -256 -325 124 398 115 -310 -297 188 414 64 -361 -239 239 391 -9 -370 -185 284 321 -121
7778 -121 -416 -125 320 269 -193 -412 -69 356 252 -249 -379 7 385 161 -292 -342 106 384 91 -330 -285
7799 -285 179 397 33 -374 -249 231 386 -25 -385 -168 307 367 -83 -378 -103 361 300 -162 -402 -29 369
7820 369 234 -268 -389 37 381 164 -302 -363 100 402 78 -329 -296 164 383 23 -366 -267 243 345 -55
7841 -55 -397 -155 312 330 -105 -374 -80 323 297 -183 -363 4 368 238 -238 -327 52 403 158 -284 -329 156
7863 156 390 89 -358 -303 177 404 28 -395 -249 227 377 -70 -421 -193 295 338 -127 -422 -99 348 265
7884 265 -214 -393 3 399 218 -248 -329 58 410 174 -296 -294 156 388 103 -344 -230 202 371 -7 -368
7905 -368 -204 251 378 -55 -412 -152 302 343 -142 -371 -102 330 269 -231 -411 -23 351 198 -273 -348 59
7926 59 369 154 -325 -306 134 393 88 -347 -250 211 387 8 -386 -184 262 350 -86 -380 -110 311 314 -127
7948 -127 -383 -67 348 242 -225 -383 -17 381 188 -283 -343 75 364 118 -340 -322 167 387 74 -384 -270
7969 -270 204 362 -22 -398 -166 303 356 -55 -393 -120 338 302 -154 -374 -41 391 289 -210 -378 1 409
7990 409 196 -268 -337 75 397 117 -305 -300 144 365 28 -336 -252 213 356 -18 -371 -192 272 337 -118 -375
8012 -375 -105 308 308 -133 -386 -29 367 250 -207 -368 39 366 185 -269 -317 108 392 124 -320 -273 167
8033 167 366 69 -386 -253 211 350 -18 -397 -179 256 315 -101 -375 -89 306 286 -177 -402 -53 349 241
8054 241 -219 -379 32 375 185 -254 -328 105 389 133 -289 -282 180 411 68 -362 -229 263 406 -25 -365
8075 -365 -174 308 350 -93 -366 -114 342 311 -175 -394 -58 350 252 -262 -397 8 362 184 -309 -346 93
8096 93 402 114 -330 -287 152 359 29 -326 -221 232 373 -23 -364 -168 280 343 -81 -373 -103 338 279
8117 279 -151 -371 -12 382 220 -231 -386 44 375 155 -284 -317 96 381 93 -339 -276 180 365 34 -360
8138 -360 -228 237 360 -43 -368 -151 274 347 -92 -368 -79 331 262 -158 -363 -22 374 246 -237 -358 58
8159 58 388 148 -308 -318 110 383 109 -323 -287 194 366 28 -376 -219 246 340 2 -393 -178 268 290 -113
8181 -113 -394 -105 345 269 -167 -378 -4 362 241 -234
8191b34
$$ Imaginary data points
##PAGE= N=2
##DATA TABLE= (X++(I..I)), XYDATA
0 0 0 0 0 0 0 0 0 8 0 8 -8 8 -9 16 -24 24 -32 40 -48 56 -72 86 -99 120 -141 161 -190 221 -255 289 -334
31 -334 381 -430 488 -553 620 -699 782 -876 975 -1087 1210 -1341 1482 -1643 1815 -2002
47 -2002 2210 -2434 2679 -2953 3254 -3586 3957 -4371 4841 -5368 5979 -6688 7519 -8519
61 -8519 9741 -11277 13273 -15991 19916 -26120 37448 -64837 274427 38882 -686711 -338365
73 -338365 242491 437602 -47813 -345297 -29535 420673 228923 -349268 -572878 -20711
83 -20711 561314 443300 -172609 -501375 -193959 321288 235347 -226305 -246334 199461 409491
94 409491 46026 -481530 -412717 193886 524504 194600 -300937 -314403 95810 235407
104 235407 -55586 -257884 -45403 340402 335527 -188129 -506956 -163796 334712 366738
114 366738 -38077 -303413 -74415 220311 90220 -249583 -254357 170487 442049 118653
124 118653 -358810 -375149 33430 353760 184999 -198064 -192898 134967 221500 -81675 -345129
135 -345129 -131766 334043 393322 -53404 -414538 -236052 215171 295988 -50868 -234973
145 -234973 -6375 251399 131252 -256528 -348804 54068 408940 243614 -206774 -363000
155 -363000 -46082 267418 142302 -174717 -184670 139099 304889 -2446 -372017 -254616
165 -254616 201922 402528 98491 -301080 -256244 119009 248716 -17778 -244941 -68572
175 -68572 271271 246223 -153012 -379172 -119951 288572 310796 -59266 -285856 -93459
185 -93459 178235 134058 -137952 -206928 70824 295682 117208 -239625 -299220 20082 289790
196 289790 162445 -139517 -186266 40845 171240 -2489 -207007 -96516 195511 248821
206 248821 -29982 -277248 -164806 141059 217691 -256 -164311 -45947 145863 88467
216 88467 -152229 -203193 46921 265658 143338 -166120 -247318 -8272 197703 97622
226 97622 -123621 -120467 98957 183330 -28803 -244670 -136078 174670 269842 18171 -236589
237 -236589 -158886 112293 182342 -26714 -178903 -31371 197694 147366 -142826 -268376
247 -268376 -36513 247836 204091 -94802 -235075 -47198 171348 104940 -126628 -159247
257 -159247 73586 232749 63314 -219036 -221844 67461 260298 106391 -162701 -172498 59122
268 59122 172035 3338 -182049 -87381 167409 208121 -44139 -249856 -129067 149942
278 149942 209148 -9276 -177234 -68843 127897 107953 -100350 -175750 16730 211801
288 211801 126243 -132523 -215961 -18417 178898 114083 -89345 -127934 37769 141912 13218
299 13218 -161852 -111268 112311 200067 24902 -177498 -136229 73532 150477 6944 -124014
310 -124014 -44427 117701 100495 -90110 -176343 -18293 175543 138198 -77971 -173087 -29917
321 -29917 128252 76642 -88936 -105418 61317 156738 18784 -168994 -135722 85017 193736
332 193736 44832 -146316 -116615 70234 131294 -18099 -143981 -43105 146234 139639 -73238
343 -73238 -201961 -63371 155518 157631 -46842 -163650 -39237 128752 88067 -98713 -145927
354 -145927 32347 186399 87119 -139557 -183322 15226 181056 93955 -106129 -131658 38707
365 38707 141869 20473 -145407 -101626 102295 177733 11298 -171435 -122532 81389 153969
376 153969 9959 -126869 -61391 95953 100787 -60588 -147461 -22143 144445 118576 -65356
387 -65356 -153962 -33392 113989 83865 -60083 -96654 25983 116260 26440 -118221 -102652
398 -102652 60815 147822 37329 -114753 -98451 47117 104806 574 -99871 -38377 96090
409 96090 94310 -54686 -141566 -37839 119445 113528 -43247 -126010 -27022 98030 64701
420 64701 -73569 -100618 35861 135185 43494 -118511 -124316 39501 145133 49425 -100571
431 -100571 -92707 48463 108494 -4090 -118523 -55695 100248 125295 -25453 -148334 -70583
442 -70583 96957 120030 -20877 -118069 -36265 97881 77857 -70394 -123643 4690 138471
453 138471 85538 -86956 -138907 -2986 124830 72138 -75475 -100628 31086 116577 23663
464 23663 -113284 -94065 63643 142042 27059 -120955 -99178 51392 116338 10933 -102307
475 -102307 -54173 78540 94691 -34810 -126394 -41517 105296 105918 -34548 -116789 -36094
486 -36094 83455 70664 -46136 -85051 11844 98128 41609 -83141 -95572 26092 110285
497 110285 43964 -74072 -78814 28739 82330 3227 -80939 -39058 69441 84292 -25281
508 -25281 -107024 -43244 76407 86774 -21192 -90804 -23551 74972 54466 -55150 -89540
519 -89540 12684 110763 55111 -82807 -106822 15702 110867 47986 -76615 -79847 37937
530 37937 97150 7664 -100844 -65971 69462 112981 1461 -110973 -72282 60406 100898
541 100898 -3693 -95624 -41331 74819 79208 -39204 -109236 -23721 99740 86928 -43683
552 -43683 -109762 -22779 87738 65334 -48106 -83205 9725 93039 39555 -78478 -88786
563 -88786 27697 107731 39766 -78891 -81577 28474 87383 13541 -78238 -49836 57328
574 57328 82998 -14718 -97184 -46872 67221 87562 -11524 -87945 -35978 62673 62527 -33283
586 -33283 -79120 -2516 85070 51771 -58425 -87983 5025 87459 45292 -53770 -66486 17811
598 17811 69979 13170 -66561 -48172 45378 78612 125 -81182 -50548 47377 73006 -5950
610 -5950 -70375 -26380 57053 52101 -36408 -76542 -4296 80205 54945 -47150 -83029 -3303
622 -3303 77404 44915 -50727 -67602 20395 81972 21056 -77957 -68637 41940 97106 16751
634 16751 -85158 -65493 43078 82985 558 -79584 -40048 59890 73697 -21135 -90949 -35248
646 -35248 69984 79234 -18782 -86716 -31666 64403 62993 -30517 -76613 -6273 77759 50062
658 50062 -52383 -81928 3665 82184 45166 -50359 -68470 10703 67669 21291 -56888 -50442
670 -50442 32963 71518 6241 -70969 -49793 39543 70246 1078 -64570 -32012 45771 51440
682 51440 -22243 -64454 -9946 63608 48488 -35274 -69465 -6785 63184 41579 -37236 -56836
694 -56836 9724 61799 19768 -56282 -51855 30459 71461 11183 -64348 -48733 32880 62059
706 62059 161 -58431 -28415 44359 51830 -19484 -66689 -19044 57881 55386 -23769 -67935
718 -67935 -14868 57127 43409 -33502 -58661 6189 65740 29112 -53413 -61583 18244 73210
730 73210 25508 -56458 -55833 23527 64601 8925 -60501 -40606 41444 65255 -6480 -71835
742 -71835 -37240 48949 65425 -9266 -66787 -26709 49300 51086 -22315 -62938 -10191 60295
754 60295 46348 -33387 -66995 -7249 61381 42394 -34183 -57601 2816 56578 24628 -45397
766 -45397 -49060 19950 61149 14930 -52733 -45946 23705 55548 7144 -47722 -30129 31592
778 31592 45023 -10294 -52039 -17198 44850 44303 -18935 -54064 -11116 45602 33821 -26257
790 -26257 -44575 5720 48765 18404 -41799 -42922 18372 54655 13413 -46424 -39316 22685
802 22685 48722 1984 -47738 -26208 35961 46572 -12216 -56187 -21025 44786 47883 -15811
814 -15811 -54864 -14462 45355 37974 -25090 -51038 -519 53670 31542 -37022 -54456 4950
826 4950 57273 28274 -39432 -48603 11934 52876 14633 -46319 -39780 25744 55111 5137 -53235
839 -53235 -36909 30441 52714 47 -49661 -25756 34825 43227 -12584 -50354 -13928 44363
851 44363 40463 -20386 -51864 -9705 44602 33731 -23981 -44285 811 44304 21479 -34474
863 -34474 -41159 11682 48426 16419 -39058 -38816 15553 44614 8293 -38760 -27690 25061 40769
876 40769 -4548 -44329 -20312 33823 40598 -10079 -44554 -13924 35045 31582 -17741 -39720
888 -39720 -1125 40447 22475 -29238 -39958 6587 43965 17863 -33042 -34823 12773 39687
900 39687 6812 -37225 -25866 24751 39872 -3127 -43288 -22411 30865 39599 -7887 -42032
912 -42032 -14705 34174 32866 -17803 -42591 -4168 42151 29591 -25822 -45470 -254 44573
924 44573 25413 -28970 -40993 6615 44284 15855 -36793 -37026 15993 47444 11083 -41890
936 -41890 -35068 20232 44714 5401 -40401 -26137 26398 39368 -5111 -42053 -18384 32825
948 32825 37534 -10644 -41512 -13106 32245 30368 -15067 -36624 -3227 34148 20931 -23483
960 -23483 -34867 4253 36917 15980 -26907 -30711 8787 33927 7783 -29595 -22197 18166
972 18166 32558 -968 -34837 -18266 25405 32576 -6315 -35023 -12212 28669 26632 -14938
984 -14938 -33982 -2430 34385 21911 -23369 -35371 3083 36284 17660 -25837 -31656 8503
996 8503 35028 9195 -30741 -26493 16815 36586 3159 -35110 -23368 20998 34784 -1349
1008 -1349 -34340 -15981 25515 29245 -9733 -34909 -8872 31390 27069 -15718 -35722 -4724
1020 -4724 32564 22346 -19988 -32294 2771 33686 14939 -27028 -30724 10082 36613 10785
1032 10785 -30559 -28528 13831 35351 5292 -31961 -22129 20469 33715 -2330 -35447 -17350
1044 -17350 26042 32567 -6711 -35157 -12511 27174 26554 -12052 -31937 -4843 29158 20612 -17888
1057 -17888 -30831 -123 29892 16669 -19729 -26966 4173 27705 9602 -22586 -21137 11658
1069 11658 27523 3001 -26247 -17326 16598 26179 -1748 -26076 -11354 20401 21837 -9338
1081 -9338 -26935 -4382 26102 19287 -16292 -28715 451 28798 15097 -20783 -26113 7050
1093 7050 29435 8054 -25935 -23159 13224 31048 4252 -28626 -21063 15827 30007 1119
1105 1119 -29027 -16511 20241 28038 -4774 -31237 -12265 25069 26593 -9193 -31002 -8374
1117 -8374 25782 21886 -13339 -28060 -2062 26497 16537 -18086 -27055 2654 27992 13159 -20455
1130 -20455 -24689 6635 27241 7404 -22818 -19436 12816 26872 1393 -26170 -15589 17322
1142 17322 25627 -2423 -26378 -11317 20027 21759 -8076 -26188 -5618 23952 18457 -14024
1154 -14024 -26283 -1295 25096 14880 -16795 -23244 3643 23871 8976 -19202 -19600 8615
1166 8615 24147 5115 -20979 -17301 11239 23487 1737 -21528 -12706 14888 20987 -4169 -23401
1179 -23401 -7613 19739 18622 -9326 -23824 -3585 21577 14544 -13636 -21733 1989 23089
1191 23089 9725 -18963 -20508 7585 24992 6297 -22050 -18449 11844 24358 1544 -23270
1203 -23270 -14039 16246 23341 -3252 -25070 -11026 19173 22686 -5922 -25591 -8368 20605
1215 20605 19851 -9641 -25244 -3933 23128 16453 -14128 -24729 -230 24079 13246 -16183
1227 -16183 -21862 3424 22822 8759 -17899 -18231 7958 22594 4773 -19898 -15625 11363 21754
1240 21754 921 -20351 -11227 14410 18675 -4658 -20832 -6003 17786 15673 -9341 -20784
1252 -20784 -2168 19022 12059 -12451 -18620 2401 19571 7490 -16091 -16409 7188 20444 4017
1265 4017 -18264 -14069 10344 19532 484 -18747 -10309 13497 17933 -3635 -19990 -7300 16319
1278 16319 16933 -6727 -20695 -4689 17961 14253 -10360 -19973 -351 19870 10683 -14537 -19050
1291 -19050 3791 21042 7635 -16836 -16658 7335 20183 3701 -18161 -13333 11292 19683 -243
1304 -243 -19725 -10666 14042 18683 -3352 -19876 -7463 15602 16024 -7002 -19793 -3659 17607
1317 17607 13448 -10118 -19590 -1141 18599 11147 -12253 -17913 2073 18739 7734 -14623 -15601
1330 -15601 5872 19043 4909 -16341 -13611 8783 18118 1689 -16504 -10333 11184 16287 -2331
1343 -2331 -17230 -6964 13618 14458 -5810 -17342 -3751 14607 11433 -8601 -16061 246 15647
1356 15647 7534 -11747 -14189 3954 16294 4678 -13537 -11874 6851 15541 1483 -14574 -8798
1369 -8798 10112 14548 -1867 -15827 -6681 12730 13822 -4818 -16314 -4216 14183 11941 -8023
1382 -8023 -16353 -1047 15910 9887 -11098 -16503 1838 17205 7737 -12894 -15180 4518 17495
1395 17495 4815 -14708 -12930 7678 17558 2102 -16161 -10844 9909 16478 -306 -16273 -8225
1408 -8225 11661 14304 -3534 -16081 -5418 13119 12439 -6192 -15755 -2956 13633 10126 -8199
1421 -8199 -14351 188 13951 7223 -10197 -12900 3299 14607 4693 -11730 -11040 5707 14190
1434 14190 2035 -12679 -8528 8317 13298 -1185 -13992 -6149 10676 12115 -3886 -14387 -3984
1447 -3984 12109 10169 -6802 -13847 -829 13271 7755 -9368 -13053 1952 13954 5717 -10785
1460 -10785 -11451 4437 13613 3042 -11679 -9269 6945 13290 449 -12802 -7328 8888 12376
1473 12376 -1893 -13159 -5117 10325 10670 -4698 -13364 -2559 11974 8954 -7289 -13325 -324
1486 -324 13062 7354 -9239 -12536 2314 13799 5121 -11211 -11357 5221 14562 2998 -12846
1499 -12846 -9970 7462 14214 607 -13459 -7760 9228 12874 -2020 -13840 -5675 10527 11475
1512 11475 -3996 -13589 -3865 10958 9641 -5616 -12623 -1509 11399 7490 -7328 -11456 946
1525 946 11718 5480 -8405 -9781 3086 11262 2997 -9220 -7606 5345 10606 347 -10323
1538 -10323 -5720 7400 9784 -2166 -10920 -3561 9067 8158 -4930 -11041 -908 10644 6405
1551 6405 -7499 -10695 1545 11489 4715 -9010 -9619 3746 11701 2743 -10246 -8314 5880 11838
1565 11838 869 -11234 -7037 7462 11297 -1069 -11606 -5157 8631 9850 -3207 -11577 -3237
1578 -3237 9560 8420 -4900 -11272 -1587 10098 6924 -6309 -10463 472 10671 5198 -7941
1591 -7941 -9494 2894 11202 3362 -9252 -8194 4970 10986 1158 -10164 -6446 6928 10304 -1280
1605 -1280 -10952 -4746 8411 9334 -3345 -11164 -2902 9241 7709 -5108 -10588 -915 9757 6098
1619 6098 -6333 -9729 783 10002 4767 -7108 -8561 2310 9802 3148 -7854 -7144 4161 9471
1633 9471 1112 -8625 -5587 5671 8547 -956 -8875 -3706 6827 7121 -3223 -8922 -1560 8023
1647 8023 5691 -5268 -8776 532 8956 4092 -6933 -7899 2800 9481 2254 -8338 -6768 4860
1661 4860 9719 613 -9322 -5690 6282 9411 -896 -9855 -4528 7521 8786 -2679 -10358 -3180
1675 -3180 8511 7866 -4142 -10265 -1777 8960 6594 -5293 -9474 -170 9144 5280 -6151 -8702
1689 -8702 1241 9356 4089 -6935 -7738 2739 9255 2427 -7727 -6367 4440 8810 289 -8464
1703 -8464 -4775 5875 7786 -1640 -8631 -3029 6783 6477 -3455 -8436 -1141 7669 5118 -5011 -7966
1718 -7966 579 8199 3863 -6058 -7060 2208 8206 2398 -6708 -5909 3559 8032 1106 -7318 -5089
1733 -5089 4566 7700 -255 -7821 -3995 5627 7007 -1980 -8219 -2513 6736 5945 -3710 -8021 -746
1748 -746 7378 4586 -4957 -7268 1017 7748 3137 -6041 -6359 2715 8033 1819 -6935 -5468 4167
1763 4167 7913 225 -7727 -4232 5563 7345 -1501 -8218 -3062 6477 6586 -2913 -8285 -1883 7051
1778 7051 5657 -3992 -7995 -653 7599 4830 -4987 -7653 662 7982 3853 -5711 -6870 1903 7932
1793 7932 2625 -6306 -5859 3120 7628 1191 -6754 -4867 4075 7038 -188 -7073 -3630 4984 6085
1808 6085 -1805 -7083 -2040 5787 4957 -3204 -6688 -377 6329 3629 -4271 -5766 1191 6407 2304
1823 2304 -5087 -4905 2565 6414 1032 -5758 -4075 3623 6149 -194 -6273 -3201 4582 5701 -1597
1838 -1597 -6706 -2150 5456 5118 -2813 -6883 -1057 6185 4402 -3902 -6623 298 6787 3432 -4888
1853 -4888 -6116 1591 7133 2399 -5676 -5342 2771 6948 1195 -6164 -4463 3759 6558 -78 -6594
1868 -6594 -3556 4563 5923 -1288 -6673 -2514 5079 5139 -2365 -6460 -1234 5598 4239 -3255 -6055
1883 -6055 -100 5940 3426 -3884 -5451 1023 6067 2435 -4589 -4805 2072 6074 1315 -5268 -4160
1898 -4160 3027 5778 138 -5699 -3248 3869 5214 -1111 -5893 -2175 4603 4564 -2225 -5803 -1024
1913 -1024 5141 3749 -3120 -5333 247 5437 2730 -3884 -4689 1418 5487 1645 -4395 -3878 2319
1928 2319 5174 558 -4765 -3050 3089 4719 -543 -5096 -2286 3795 4314 -1537 -5281 -1454 4500
1943 4500 3785 -2579 -5263 -322 5141 3107 -3472 -5067 762 5602 2381 -4180 -4649 1793 5748
1958 5748 1536 -4866 -4153 2644 5679 547 -5432 -3549 3350 5331 -432 -5573 -2768 3870 4769
1973 4769 -1293 -5468 -1864 4264 4132 -1941 -5142 -944 4490 3465 -2456 -4668 4 4640 2625
1988 2625 -2980 -4108 858 4601 1684 -3576 -3502 1649 4328 638 -4008 -2780 2427 4008 -396
2003 -396 -4378 -1985 3254 3639 -1445 -4540 -1075 3976 3137 -2364 -4435 45 4525 2464 -3182 -4098
2019 -4098 1009 4719 1727 -3655 -3678 1756 4685 916 -4059 -3150 2299 4442 150 -4370 -2624 2800
2035 2800 4087 -619 -4531 -1961 3302 3623 -1374 -4392 -1139 3747 3132 -2006 -4171 -264 4071
2050 4071 2546 -2641 -3886 603 4348 1839 -3319 -3571 1509 4460 913 -3952 -3076 2273 4336
2065 4336 -48 -4367 -2408 2919 3964 -857 -4481 -1724 3443 3538 -1424 -4355 -1048 3744 3154 -1900
2081 -1900 -4137 -414 3926 2649 -2351 -3836 297 3963 1956 -2749 -3366 878 3775 1185 -3055
2096 -3055 -2834 1441 3482 358 -3280 -2175 2043 3203 -434 -3480 -1427 2696 2809 -1272 -3473
2111 -3473 -477 3287 2272 -2087 -3337 426 3698 1625 -2795 -3054 1225 3799 942 -3298 -2716
2126 -2716 1837 3788 240 -3730 -2395 2330 3653 -344 -3924 -1925 2763 3404 -889 -3962 -1379
2141 -1379 3079 3092 -1275 -3785 -843 3337 2756 -1661 -3565 -244 3488 2283 -2131 -3336 410 3558
2157 3558 1555 -2647 -2958 1053 3489 732 -3075 -2415 1693 3239 -94 -3350 -1758 2261 2887 -747
2173 -747 -3348 -1068 2718 2500 -1302 -3221 -409 3026 2110 -1816 -3020 162 3209 1666 -2169 -2800
2189 -2800 667 3207 1110 -2550 -2542 1096 3105 527 -2830 -2133 1562 2921 -57 -2949 -1582 1972
2205 1972 2626 -632 -2970 -930 2392 2219 -1183 -2824 -288 2769 1779 -1751 -2637 411 2944 1207
2221 1207 -2307 -2347 1054 2942 548 -2708 -2072 1587 2836 -56 -2938 -1673 1988 2690 -598 -3050
2237 -3050 -1193 2357 2548 -960 -3067 -753 2632 2324 -1259 -2974 -324 2839 2010 -1551 -2830 8
2253 8 2916 1608 -1937 -2647 441 2843 1118 -2268 -2330 908 2703 508 -2473 -1912 1386 2500 -99
2270 -99 -2492 -1295 1762 2213 -588 -2407 -667 2041 1831 -998 -2284 -146 2252 1422 -1402 -2092
2286 -2092 297 2320 952 -1750 -1931 691 2291 515 -2108 -1725 1048 2252 127 -2291 -1423 1450
2302 1450 2182 -298 -2382 -1022 1822 2034 -709 -2388 -541 2101 1759 -1088 -2279 -91 2273 1432
2318 1432 -1471 -2174 333 2392 973 -1843 -1976 751 2353 480 -2101 -1687 1158 2232 4 -2235
2334 -2235 -1294 1462 2032 -325 -2187 -897 1700 1863 -593 -2153 -567 1882 1656 -923 -2126 -243
2350 -243 2039 1411 -1231 -2045 99 2124 1021 -1543 -1931 460 2129 649 -1804 -1686 824 2083
2366 2083 269 -1940 -1346 1211 1962 -167 -1989 -899 1498 1724 -534 -1924 -420 1689 1395 -841
2382 -841 -1762 -81 1735 1023 -1136 -1621 219 1745 691 -1383 -1511 516 1699 371 -1603 -1312
2398 -1312 851 1674 33 -1690 -990 1168 1611 -264 -1748 -680 1452 1552 -580 -1796 -353 1703
2414 1703 1356 -927 -1841 -18 1867 1038 -1280 -1758 280 1921 706 -1562 -1617 586 1906 389
2430 389 -1740 -1365 853 1818 137 -1745 -1113 1102 1720 -100 -1687 -821 1281 1550 -350 -1652 -544
2447 -544 1377 1350 -563 -1590 -322 1373 1116 -779 -1567 -120 1458 797 -1068 -1440 227 1533 520
2464 520 -1271 -1191 620 1499 187 -1423 -896 966 1401 -160 -1462 -621 1195 1290 -430 -1495 -313
2481 -313 1324 1102 -714 -1439 -85 1361 856 -938 -1411 110 1396 616 -1089 -1278 320 1376 415
2498 415 -1173 -1081 552 1396 224 -1235 -858 781 1339 27 -1296 -659 1006 1201 -296 -1358 -404
2515 -404 1151 1031 -603 -1352 -161 1247 796 -890 -1345 111 1331 565 -1059 -1214 398 1398 340
2532 340 -1185 -994 629 1394 196 -1233 -820 776 1345 -3 -1254 -668 896 1220 -139 -1243 -543
2549 -543 962 1075 -345 -1209 -351 927 888 -480 -1183 -208 1000 713 -653 -1065 22 1018 495 -783
2567 -783 -884 355 1063 224 -922 -643 636 998 -34 -963 -416 823 855 -313 -1022 -202 899 728
2585 728 -538 -1054 -71 983 581 -728 -1070 82 1039 487 -790 -1007 216 1113 415 -839 -892 369
2603 369 1106 302 -907 -789 495 1085 181 -959 -653 599 1018 -38 -1004 -500 694 863 -261 -1014
2621 -1014 -291 776 688 -443 -958 -56 858 517 -600 -815 152 891 320 -691 -687 361 933 153 -760
2640 -760 -545 492 864 47 -852 -507 565 837 -115 -885 -427 612 749 -206 -898 -321 685 700 -328
2659 -328 -883 -218 733 623 -403 -829 1 818 507 -499 -682 140 815 308 -586 -538 329 730 85 -684
2679 -684 -381 452 595 -153 -709 -251 532 477 -334 -724 -118 633 411 -432 -691 54 697 386 -485 -652
2699 -652 171 783 336 -539 -631 285 821 261 -625 -590 329 803 167 -669 -568 355 736 17 -731 -442 412
2720 412 656 -98 -723 -318 486 551 -185 -624 -156 549 428 -271 -556 25 520 296 -374 -440 152 546 144
2741 144 -387 -375 214 468 34 -441 -276 312 432 -60 -506 -233 336 405 -152 -539 -192 424 415 -186 -546
2762 -546 -85 496 391 -271 -516 25 545 314 -351 -495 109 548 223 -412 -407 184 501 86 -459 -328 221
2783 221 420 -32 -446 -243 288 354 -126 -409 -129 338 329 -143 -369 -56 389 292 -178 -367 -10 401 270
2804 270 -236 -359 34 423 203 -299 -398 98 422 149 -389 -395 113 403 84 -406 -345 178 406 28 -362
2825 -362 -266 220 378 -7 -360 -166 266 353 -43 -294 -82 267 292 -75 -266 -15 238 193 -135 -261 -28
2846 -28 232 117 -161 -257 -4 232 102 -199 -226 66 234 70 -211 -177 114 250 7 -232 -137 192 296 1
2868 1 -260 -95 243 248 -91 -328 -62 276 234 -169 -305 -28 291 147 -219 -293 26 252 120 -212 -260 44
2890 44 298 95 -228 -237 104 321 122 -200 -215 101 297 73 -250 -244 109 284 36 -269 -229 137 284 -34
2912 -34 -321 -215 158 278 -43 -322 -157 215 236 -90 -292 -60 234 220 -92 -232 -12 256 161 -139 -209 72
2934 72 237 147 -151 -178 68 209 45 -156 -160 58 187 17 -231 -177 112 192 -29 -254 -144 158 201 -53 -241
2957 -241 -102 172 226 -43 -252 -53 260 229 -114 -264 -6 319 192 -185 -288 56 322 129 -273 -265 85
2978 85 284 48 -258 -236 108 269 -11 -311 -182 187 251 -28 -284 -114 222 270 -34 -291 -89 250 273 -83
3000 -83 -309 -58 272 255 -144 -354 -43 338 231 -241 -376 12 377 203 -273 -359 73 416 150 -301 -355
3021 -355 156 416 95 -328 -269 166 372 63 -302 -227 211 375 32 -323 -186 214 319 -33 -313 -128 205
3042 205 259 -113 -358 -89 241 208 -170 -305 -35 268 165 -225 -287 78 357 135 -286 -263 194 404 69
3063 69 -353 -215 278 395 -57 -418 -210 304 351 -120 -460 -136 346 326 -198 -490 -68 388 298 -263 -478
3084 -478 -13 413 269 -252 -398 65 459 225 -295 -380 126 462 160 -326 -341 175 422 111 -402 -282 239
3105 239 428 -6 -474 -267 326 394 -135 -493 -171 384 339 -207 -465 -68 444 308 -293 -457 75 499 231
3126 231 -343 -427 117 502 209 -404 -376 188 498 89 -439 -312 221 447 4 -456 -267 279 404 -67 -448
3147 -448 -236 326 393 -145 -408 -96 385 336 -207 -427 17 452 203 -329 -381 117 466 141 -417 -343 221
3168 221 487 -5 -492 -299 308 453 -120 -562 -222 418 431 -195 -568 -128 470 418 -230 -535 -27 542 385
3189 385 -298 -541 37 578 309 -343 -502 103 567 234 -416 -470 136 541 148 -502 -440 210 529 45 -520
3210 -520 -373 311 492 -46 -538 -248 392 470 -154 -551 -140 448 391 -258 -474 3 538 305 -348 -435 85
3231 85 518 177 -407 -386 192 495 80 -474 -380 240 497 18 -512 -297 339 462 -90 -537 -191 387 450
3252 450 -181 -523 -115 471 396 -234 -510 -4 543 291 -355 -490 106 540 209 -447 -454 223 551 105 -514
3273 -514 -378 343 546 -22 -562 -299 409 521 -98 -613 -231 488 456 -199 -588 -117 529 438 -250 -579 -48
3294 -48 545 371 -353 -576 35 563 289 -409 -547 91 559 206 -463 -498 178 575 125 -527 -394 279 568
3315 568 3 -521 -272 376 516 -71 -563 -164 463 450 -227 -512 -75 487 327 -287 -510 32 523 235
3335 235 -382 -469 114 490 133 -475 -419 215 537 42 -483 -322 327 515 -25 -546 -223 445 514 -146 -544
3356 -544 -153 498 463 -234 -584 -65 534 363 -375 -572 55 598 268 -453 -524 157 629 169 -553 -454 246
3377 246 618 50 -614 -410 350 590 -37 -634 -311 436 546 -153 -639 -222 493 496 -229 -606 -104 552 412
3398 412 -307 -602 -30 555 335 -415 -557 90 588 234 -493 -513 192 609 146 -535 -392 313 619 10
3418 10 -575 -304 424 547 -89 -607 -214 499 469 -216 -607 -106 540 349 -350 -588 36 557 260 -423 -546
3439 -546 139 595 143 -502 -421 266 601 56 -534 -363 381 597 -44 -559 -280 472 539 -155 -635 -154 559
3460 559 463 -289 -676 -97 591 398 -404 -619 24 618 310 -507 -599 165 698 220 -555 -520 282 681 106
3481 106 -618 -446 379 654 8 -647 -349 447 624 -84 -692 -233 532 545 -197 -685 -153 575 464 -304
3501 -304 -629 -24 579 347 -418 -625 31 587 287 -448 -517 153 596 158 -518 -456 295 596 38 -571 -347
3522 -347 447 550 -98 -587 -230 505 494 -221 -614 -94 555 390 -375 -605 18 590 308 -456 -546 144 636
3543 636 213 -493 -505 267 641 129 -553 -428 338 632 -1 -622 -362 445 585 -125 -649 -243 526 523 -233
3564 -233 -695 -152 567 447 -341 -688 9 646 367 -458 -649 94 680 263 -529 -539 243 692 195 -599
3584 -599 -467 327 685 70 -667 -413 426 648 -83 -661 -320 471 574 -175 -701 -223 524 507 -292 -653
3604 -653 -90 598 428 -356 -614 15 653 308 -482 -534 153 650 204 -526 -463 300 615 64 -569 -386 398
3625 398 594 -83 -645 -269 477 524 -248 -664 -136 547 430 -370 -640 -19 640 346 -471 -594 127 686
3645 686 265 -556 -557 223 705 164 -602 -492 331 696 4 -656 -410 450 659 -90 -706 -331 530 592 -211
3666 -211 -706 -208 604 506 -321 -699 -92 657 453 -402 -654 55 708 333 -526 -604 184 691 202 -567 -542
3687 -542 302 674 53 -667 -434 403 650 -57 -696 -349 482 614 -160 -669 -210 536 532 -272 -669 -106 645
3708 645 447 -363 -607 43 667 332 -466 -565 149 661 198 -532 -529 253 628 45 -611 -380 390 577 -91
3729 -91 -660 -290 518 567 -235 -680 -150 572 477 -333 -652 -3 658 414 -447 -643 120 726 284 -536 -590
3750 -590 218 720 175 -629 -524 326 727 80 -685 -463 434 675 -55 -730 -383 463 644 -160 -773 -277
3770 -277 597 570 -303 -735 -114 681 483 -378 -673 28 689 389 -475 -611 158 699 220 -580 -572 261 681
3791 681 93 -619 -449 369 633 -58 -670 -348 452 550 -146 -688 -221 553 529 -245 -653 -91 607 412 -385
3812 -385 -620 12 634 325 -465 -606 140 672 221 -562 -515 289 675 81 -635 -437 382 653 -47 -638
3832 -638 -294 523 588 -166 -697 -167 561 521 -292 -674 -82 653 423 -405 -689 70 706 320 -519 -624 157
3853 157 721 205 -583 -517 261 688 113 -658 -460 396 679 18 -704 -381 446 650 -114 -731 -259 560
3873 560 588 -217 -687 -137 602 478 -306 -662 -12 665 404 -433 -634 109 679 259 -534 -567 222 639 119
3894 119 -616 -468 297 614 19 -656 -372 435 568 -117 -649 -228 525 548 -209 -639 -112 594 439 -361
3914 -361 -616 1 641 352 -424 -589 123 660 239 -527 -548 230 651 107 -615 -456 371 682 -19 -687
3934 -687 -351 462 624 -133 -707 -274 527 595 -246 -722 -153 625 495 -383 -670 -19 684 382 -471 -641
3954 -641 84 713 294 -539 -596 201 696 154 -611 -509 316 674 76 -641 -391 415 665 -49 -654 -289
3974 -289 506 572 -168 -686 -176 549 490 -298 -669 -108 627 391 -427 -638 48 623 281 -499 -548 162 644
3995 644 179 -558 -437 297 640 71 -608 -382 395 600 -73 -600 -242 500 539 -185 -665 -167 557 444
4015 444 -328 -631 -28 610 345 -413 -591 79 645 281 -504 -567 200 666 183 -579 -496 335 663 44 -645
4036 -645 -386 456 607 -96 -691 -292 531 575 -219 -691 -176 598 503 -316 -680 -54 667 394 -398 -641 64
4057 64 640 305 -485 -584 162 666 205 -551 -518 262 662 110 -580 -412 357 603 -59 -616 -308 432 561
4078 561 -141 -648 -222 493 467 -256 -599 -100 552 382 -362 -591 23 598 287 -446 -514 168 601 188 -511
4099 -511 -434 259 589 40 -550 -357 332 532 -47 -609 -260 444 491 -179 -588 -191 494 453 -266 -620 -49
4120 -49 592 394 -370 -574 61 601 274 -433 -533 191 632 190 -511 -471 286 609 66 -548 -370 376 600
4141 600 -32 -597 -277 443 536 -141 -614 -204 473 438 -271 -595 -88 532 385 -354 -595 21 592 305 -424
4162 -424 -517 104 602 236 -474 -475 189 597 137 -489 -381 321 565 19 -536 -320 372 529 -73 -596 -228
4183 -228 408 472 -190 -552 -102 464 382 -308 -530 6 530 248 -397 -484 116 560 176 -458 -400 206 533
4204 533 58 -507 -342 303 514 -29 -559 -269 399 494 -141 -565 -184 450 455 -212 -555 -74 532 373 -323
4225 -323 -560 19 572 289 -405 -539 127 611 227 -484 -484 215 571 102 -526 -384 297 547 -17 -584 -322
4246 -322 397 550 -104 -561 -231 436 462 -208 -574 -129 483 404 -282 -534 3 534 329 -350 -493 92 545
4267 545 253 -405 -461 153 541 165 -478 -394 235 513 23 -512 -317 335 482 -52 -527 -247 375 428 -172
4288 -172 -546 -115 462 376 -249 -507 2 484 283 -354 -480 75 513 208 -406 -417 196 554 106 -458 -346
4309 -346 290 534 -5 -522 -301 350 487 -109 -543 -201 414 450 -188 -543 -132 497 387 -265 -561 -13
4329 -13 539 301 -364 -540 56 574 231 -409 -463 172 599 138 -461 -410 251 569 65 -540 -341 321 514
4350 514 -35 -554 -248 391 485 -109 -517 -145 435 409 -217 -515 -35 481 339 -276 -478 38 487 268 -374
4371 -374 -450 113 507 172 -432 -398 188 490 75 -465 -321 298 477 -30 -479 -223 360 425 -94 -489 -125
4392 -125 432 409 -186 -510 -53 478 310 -302 -458 58 510 226 -360 -413 112 489 135 -420 -376 229 476
4413 476 55 -484 -339 284 474 -49 -496 -242 366 451 -128 -505 -154 451 409 -213 -503 -77 473 369 -259
4434 -259 -476 23 518 263 -371 -483 96 500 221 -405 -421 175 504 89 -432 -381 257 489 36 -487 -285
4455 -285 320 457 -68 -501 -199 396 412 -167 -490 -124 437 367 -230 -484 -13 486 292 -323 -462 65 483
4476 483 195 -389 -389 156 478 103 -413 -347 225 489 9 -447 -273 322 452 -59 -450 -170 389 403 -162
4497 -162 -480 -81 421 338 -272 -479 3 453 256 -337 -469 111 478 145 -393 -410 179 501 107 -445 -304
4518 -304 280 507 22 -470 -265 357 454 -106 -492 -175 412 415 -154 -509 -66 472 349 -249 -483 -3 465
4539 465 295 -322 -467 60 482 194 -377 -411 139 483 96 -427 -325 228 486 22 -455 -245 320 470
4559 470 -41 -457 -177 389 416 -140 -463 -92 429 329 -222 -459 -38 453 268 -255 -401 65 450 179
4579 179 -341 -357 174 458 114 -395 -329 244 454 1 -415 -236 294 402 -81 -459 -152 374 387 -168 -426
4600 -426 -60 445 329 -262 -420 34 451 215 -331 -390 108 465 170 -382 -357 203 463 86 -431 -279 250
4621 250 477 -1 -446 -242 329 407 -66 -451 -141 364 381 -169 -456 -77 403 308 -267 -454 -14 455 242
4642 242 -287 -401 55 462 187 -333 -391 144 451 79 -389 -292 217 401 24 -405 -248 297 396 -65 -443
4663 -443 -162 332 338 -137 -420 -92 387 267 -227 -402 -3 413 208 -287 -364 101 439 141 -358 -295 160
4684 160 416 52 -380 -241 274 420 -35 -439 -162 314 358 -124 -418 -101 366 326 -163 -389 -32 398 241
4705 241 -257 -400 45 413 162 -303 -345 132 413 110 -347 -296 213 406 38 -392 -243 282 420 -19 -407
4726 -407 -189 319 375 -118 -445 -93 352 324 -209 -402 -48 393 277 -266 -387 18 423 216 -270 -367 107
4747 107 446 146 -324 -322 163 392 48 -374 -251 236 386 1 -386 -176 303 344 -104 -368 -101 338 292
4768 292 -159 -378 -29 382 241 -222 -350 44 399 158 -295 -338 114 395 75 -324 -247 218 389 25 -357
4789 -357 -191 265 374 -63 -409 -151 328 322 -130 -404 -113 331 268 -217 -391 -35 387 224 -271 -349 75
4810 75 394 189 -303 -309 138 409 95 -352 -277 214 406 14 -372 -239 265 383 -35 -396 -188 327 357 -91
4832 -91 -399 -94 337 291 -212 -393 -44 364 203 -238 -337 38 397 173 -309 -328 128 390 113 -324 -288 199
4854 199 393 49 -359 -232 228 335 -45 -380 -120 289 279 -106 -362 -67 316 239 -181 -340 11 331 208
4875 208 -247 -289 71 334 125 -290 -277 137 366 65 -332 -243 208 344 18 -358 -170 248 341 -84 -382
4896 -382 -144 315 311 -143 -390 -48 339 244 -187 -360 13 380 204 -247 -315 98 403 113 -308 -279 133 402
4918 402 96 -336 -227 207 346 7 -361 -198 262 309 -72 -358 -157 296 317 -109 -379 -70 321 255 -185
4939 -185 -359 4 365 204 -232 -335 79 376 114 -265 -258 124 322 55 -311 -198 181 339 8 -336 -156
4960 -156 249 283 -71 -330 -82 247 233 -144 -337 -44 287 195 -216 -309 36 335 129 -239 -252 106 335 86
4982 86 -300 -256 166 341 38 -330 -186 230 343 -26 -355 -171 278 309 -121 -343 -106 277 265 -142 -351
5003 -351 -31 322 216 -197 -321 26 377 171 -240 -302 80 350 102 -293 -294 158 343 42 -326 -212 178
5024 178 299 -8 -336 -181 234 308 -66 -344 -126 276 261 -137 -330 -60 308 217 -155 -304 44 332 181
5045 181 -228 -276 91 331 107 -272 -219 121 310 40 -316 -190 180 305 -43 -318 -153 239 286 -106 -330
5066 -330 -89 274 229 -153 -342 1 301 177 -193 -280 68 315 150 -236 -274 112 355 62 -288 -219 207
5087 207 347 11 -310 -182 219 309 -72 -358 -130 272 253 -100 -341 -77 305 215 -194 -332 -26 332 210
5108 210 -213 -316 56 330 112 -252 -263 109 332 90 -281 -217 129 340 1 -297 -199 211 291 -59 -327
5129 -327 -157 267 256 -114 -321 -63 297 230 -147 -305 -1 309 182 -204 -276 58 296 126 -262 -277 133
5150 133 315 61 -274 -195 169 290 3 -324 -142 234 276 -101 -331 -74 273 249 -117 -323 -19 293 169
5171 169 -179 -281 35 334 151 -232 -283 94 323 70 -297 -217 117 322 40 -329 -194 224 314 -39 -332
5192 -332 -157 256 315 -78 -351 -119 291 256 -154 -330 -47 331 252 -205 -306 26 347 163 -251 -299 70
5213 70 332 108 -281 -271 149 336 41 -308 -188 176 303 -18 -294 -146 242 257 -78 -320 -59 258 221
5234 221 -159 -294 -31 261 192 -189 -293 39 275 141 -224 -256 106 318 100 -258 -190 162 301 19 -304
5255 -304 -173 209 284 -69 -321 -109 245 246 -117 -320 -54 274 232 -177 -285 9 299 186 -202 -272 51 323
5277 323 140 -277 -265 130 313 63 -296 -223 167 289 -8 -337 -191 231 274 -25 -331 -144 245 279 -103
5298 -103 -322 -75 290 282 -143 -327 -8 320 182 -228 -283 76 313 123 -248 -262 111 301 63 -285 -241 176
5320 176 293 34 -319 -168 206 295 -40 -318 -114 245 253 -107 -313 -63 282 209 -169 -286 38 298 147
5341 147 -212 -274 61 323 82 -273 -257 119 307 25 -265 -204 181 301 -8 -317 -128 222 261 -104 -321
5362 -321 -95 269 258 -149 -322 -24 343 190 -199 -298 29 327 159 -246 -259 118 315 84 -272 -221 172
5383 172 312 -25 -304 -173 203 294 -37 -330 -151 269 298 -84 -340 -94 293 257 -150 -322 -32 317 239
5404 239 -196 -325 34 308 144 -250 -281 99 317 90 -270 -252 169 323 17 -320 -178 213 310 -69 -308
5425 -308 -103 258 280 -119 -280 -81 313 218 -162 -299 -2 321 145 -210 -289 47 331 86 -256 -253 127 323
5447 323 39 -309 -218 217 328 -4 -335 -177 238 260 -81 -322 -87 273 268 -111 -292 -16 350 198 -208
5468 -208 -308 27 336 158 -258 -299 97 325 96 -303 -270 158 319 21 -306 -220 205 313 -22 -313 -179
5489 -179 242 270 -97 -313 -98 288 244 -166 -328 -27 305 210 -184 -317 18 335 153 -242 -279 74 329
5510 329 91 -271 -226 148 306 28 -306 -165 191 282 -43 -295 -129 268 258 -104 -336 -72 267 215 -167
5531 -167 -317 32 306 182 -231 -287 61 318 106 -275 -246 106 320 41 -284 -205 176 305 6 -293 -166
5552 -166 232 300 -80 -310 -108 255 276 -121 -334 -18 292 226 -182 -319 4 340 201 -195 -278 48 340
5573 340 137 -239 -266 127 346 47 -315 -230 156 298 -2 -315 -181 226 289 -83 -304 -116 272 248 -112
5594 -112 -314 -16 290 209 -140 -324 12 279 163 -189 -269 70 290 89 -256 -223 133 286 43 -261 -178
5615 -178 192 291 -40 -293 -147 198 264 -87 -318 -72 270 224 -137 -308 -3 308 176 -199 -251 41 298
5636 298 140 -231 -270 119 331 65 -279 -185 170 292 1 -285 -191 201 283 -65 -322 -127 258 253 -64 -308
5658 -308 -99 289 220 -161 -308 -28 298 151 -194 -270 50 323 109 -259 -277 89 308 90 -302 -195 181
5679 181 314 7 -295 -147 208 291 -39 -301 -99 259 233 -107 -289 -77 271 208 -162 -273 -5 283 150
5700 150 -206 -271 45 293 88 -253 -209 113 274 41 -259 -189 167 299 -8 -300 -136 227 256 -91 -306
5721 -306 -73 219 243 -148 -278 -14 288 194 -182 -270 57 300 118 -215 -240 96 287 115 -255 -205 140 304
5743 304 16 -290 -198 188 277 -65 -322 -129 236 231 -81 -299 -59 297 234 -116 -305 -28 304 196 -195 -288
5765 -288 49 331 126 -242 -264 90 297 92 -273 -231 133 312 16 -287 -153 206 306 -54 -291 -117 237
5786 237 264 -112 -295 -31 247 193 -147 -277 18 284 143 -205 -256 80 294 109 -216 -199 106 273 65
5807 65 -243 -192 173 282 24 -284 -146 236 278 -63 -302 -79 257 210 -128 -300 -23 274 175 -191 -263 57
5829 57 322 135 -240 -252 114 297 77 -264 -219 164 309 11 -302 -187 215 274 -61 -317 -121 250 229 -80
5851 -80 -309 -75 293 256 -139 -297 -37 295 212 -175 -266 17 314 148 -235 -260 73 285 87 -240 -221 114
5873 114 264 57 -277 -180 183 262 -18 -248 -117 216 246 -92 -294 -76 261 203 -152 -299 -7 286 166
5894 166 -171 -253 59 280 116 -216 -225 133 283 59 -235 -200 167 273 13 -283 -155 202 253 -46 -282 -120
5916 -120 245 237 -126 -278 -37 288 212 -145 -258 2 292 162 -197 -266 65 328 98 -264 -239 109 295 49
5938 49 -254 -183 190 289 -13 -290 -157 219 280 -53 -300 -99 254 254 -97 -313 -30 282 203 -161 -291 -14
5960 -14 273 177 -186 -238 69 286 104 -239 -247 112 306 46 -272 -178 169 289 -3 -259 -142 211 257 -51
5982 -51 -278 -70 245 222 -115 -307 -18 265 192 -168 -237 40 305 123 -234 -219 89 280 75 -266 -193 144
6004 144 280 10 -266 -143 177 277 -45 -281 -133 219 260 -86 -274 -56 273 195 -139 -270 -14 276 203
6025 203 -200 -264 48 322 128 -196 -255 100 299 82 -287 -207 138 301 37 -290 -166 166 272 -21 -277
6046 -277 -103 237 250 -113 -298 -63 255 238 -136 -282 -9 281 162 -203 -267 50 283 117 -232 -233 100 301
6068 301 64 -251 -184 156 293 46 -246 -159 193 248 -43 -254 -115 229 240 -93 -268 -52 261 191 -142 -230
6090 -230 20 265 148 -182 -235 66 263 74 -218 -221 112 290 33 -258 -158 175 274 -44 -282 -111 239
6111 239 243 -89 -282 -70 262 236 -93 -286 -18 268 189 -142 -276 32 297 134 -230 -274 79 271 116 -229
6133 -229 -227 112 292 47 -249 -157 160 279 -6 -246 -131 181 263 -56 -275 -60 256 210 -114 -266 -9 257
6155 257 194 -150 -236 -4 285 119 -189 -238 61 272 75 -238 -196 114 254 36 -230 -163 132 263 -20 -257
6177 -257 -120 180 248 -112 -260 -72 230 202 -143 -262 0 259 169 -174 -242 57 280 121 -212 -196 85 247
6199 247 67 -231 -191 168 253 1 -268 -151 191 261 -30 -274 -95 225 264 -70 -243 -51 251 198 -141 -292
6221 -292 -5 277 147 -196 -262 16 300 98 -235 -227 60 291 69 -247 -194 114 262 26 -236 -133 180
6242 180 253 -27 -255 -128 198 223 -85 -267 -67 241 171 -139 -232 -22 240 131 -184 -266 44 261 91 -195
6264 -195 -187 118 248 44 -217 -140 123 248 4 -235 -107 170 220 -53 -245 -97 213 205 -116 -252 -73 274
6286 274 201 -144 -230 6 286 122 -196 -237 76 272 62 -198 -221 105 271 25 -249 -162 148 254 4 -251
6308 -251 -119 198 234 -37 -257 -79 248 210 -110 -283 -41 263 154 -138 -226 28 270 129 -184 -256 75
6329 75 236 87 -188 -197 89 237 20 -238 -125 152 241 -2 -248 -100 211 230 -65 -244 -103 187 175 -103
6351 -103 -251 -23 226 125 -147 -214 28 229 111 -185 -196 71 230 73 -192 -164 140 232 4 -208 -131 173
6373 173 228 -20 -241 -101 209 203 -57 -237 -15 214 196 -125 -227 10 241 127 -133 -198 35 240 86 -191
6395 -191 -214 78 262 54 -226 -148 143 236 38 -203 -89 189 222 -36 -230 -66 194 195 -90 -217 -21 217
6417 217 182 -117 -213 39 216 115 -174 -193 67 214 61 -159 -180 87 246 37 -211 -136 122 228 -8 -210
6439 -210 -107 153 200 -39 -218 -68 191 160 -99 -215 -17 193 162 -127 -171 27 210 94 -161 -192 44 218
6461 218 54 -188 -149 126 209 40 -194 -133 139 191 -26 -185 -70 154 199 -49 -202 -40 207 155 -93 -214
6483 -214 -5 200 87 -142 -206 41 214 48 -179 -163 77 205 45 -186 -176 101 225 14 -191 -106 150
6504 150 201 -29 -197 -84 175 154 -60 -195 -55 199 159 -111 -200 -13 204 91 -144 -200 27 171 70 -137
6526 -137 -151 78 174 36 -171 -111 110 176 -11 -199 -74 140 176 -37 -206 -35 169 128 -62 -181 -18 153
6548 153 112 -86 -179 4 178 77 -123 -156 45 172 38 -146 -133 86 149 -23 -166 -95 115 167 -22 -197
6570 -197 -46 156 165 -58 -168 -30 188 145 -90 -197 23 196 105 -148 -149 22 193 59 -158 -155 46 197 9
6593 9 -164 -120 105 185 -12 -168 -79 130 179 -60 -180 -56 143 126 -92 -157 -23 165 95 -84 -168 2 169
6616 169 70 -127 -146 36 157 46 -145 -114 88 167 26 -149 -130 108 188 -11 -183 -71 143 140 -43 -173 -36
6639 -36 137 97 -83 -169 -2 143 73 -108 -154 57 165 82 -130 -147 72 175 23 -154 -98 104 129 13 -147
6662 -147 -71 119 133 -51 -172 -35 145 136 -87 -142 -11 158 83 -106 -167 13 146 44 -132 -126 33 177 48
6685 48 -143 -111 78 155 -13 -142 -97 123 135 -17 -158 -59 131 134 -36 -128 -19 133 121 -82 -155 15 148 101
6709 101 -101 -107 24 156 66 -131 -91 55 174 50 -118 -80 72 165 -4 -157 -50 100 123 -31 -115 -41 116
6732 116 101 -68 -150 4 158 64 -99 -148 12 162 45 -104 -91 79 154 8 -136 -93 85 116 -7 -146 -63
6755 -63 129 119 -61 -146 -36 132 130 -84 -169 18 148 88 -90 -125 50 149 48 -101 -85 64 141 32 -137 -120
6779 -120 47 135 -17 -149 -87 111 126 -57 -144 -39 123 127 -44 -153 -11 141 120 -97 -134 23 164 105 -92
6802 -92 -110 38 129 40 -94 -91 61 135 -2 -132 -76 112 95 -20 -151 -34 129 120 -43 -149 -30 145 91 -70
6826 -70 -142 -2 155 58 -114 -131 35 160 66 -138 -109 58 143 5 -108 -66 81 128 -13 -150 -58 120 135 -22
6850 -22 -160 -50 123 110 -109 -143 -5 131 79 -88 -127 12 168 58 -127 -105 92 139 41 -150 -98 83 142
6873 142 -4 -174 -93 103 148 -40 -156 -33 107 133 -48 -161 -4 152 101 -80 -143 11 190 109 -72 -148
6895 -148 26 194 67 -124 -137 88 182 13 -163 -122 97 156 -10 -146 -77 122 151 -54 -166 -2 154 127
6917 127 -94 -134 4 144 93 -94 -168 52 159 25 -121 -116 53 140 12 -140 -83 133 151 17 -129 -77 127
6940 127 148 -18 -166 -58 139 97 -83 -172 -51 176 114 -104 -173 15 166 95 -149 -124 36 179 64 -149
6962 -149 -129 94 214 46 -168 -112 95 190 -21 -159 -72 129 174 -72 -185 -59 154 147 -54 -196 -3 147
6984 147 119 -80 -173 32 220 106 -145 -178 57 204 57 -182 -146 109 184 9 -188 -137 101 164 -21 -200
7006 -200 -92 147 150 -70 -197 -27 164 168 -85 -185 20 219 116 -147 -133 28 210 73 -151 -146 68 200
7028 200 38 -181 -123 121 161 -20 -175 -78 147 186 -48 -191 -56 193 185 -95 -219 -49 202 151 -141 -218 9
7051 9 215 80 -156 -182 82 232 87 -184 -168 95 232 34 -208 -121 149 224 -20 -200 -101 161 184 -53 -228
7074 -228 -77 211 146 -99 -220 -45 213 152 -132 -224 41 222 128 -172 -208 86 225 95 -174 -152 85 233
7096 233 44 -217 -176 159 221 17 -208 -94 156 217 -61 -247 -40 214 194 -125 -234 -4 203 143 -144 -177
7118 -177 -1 255 103 -160 -202 41 241 63 -198 -160 112 226 3 -222 -145 186 196 -62 -242 -74 198
7139 198 159 -88 -227 -28 213 165 -143 -240 16 262 129 -163 -231 61 250 86 -202 -192 108 250 49 -226
7161 -226 -192 158 243 -18 -247 -117 186 215 -52 -251 -90 209 234 -122 -242 -32 235 182 -141 -240 28 264
7183 264 150 -172 -198 66 268 123 -212 -209 87 250 46 -246 -156 143 270 1 -266 -144 207 222 -58 -244
7205 -244 -92 223 213 -107 -264 -58 231 166 -151 -253 25 232 107 -194 -241 78 277 67 -225 -189 122
7226 122 264 33 -256 -169 192 248 -8 -274 -115 210 268 -78 -290 -88 241 207 -152 -305 -20 258 183 -170
7248 -170 -239 27 268 136 -230 -225 88 279 96 -245 -239 148 292 1 -265 -178 205 286 -13 -302 -149 255
7270 255 271 -66 -280 -56 282 223 -128 -307 -15 278 201 -180 -251 27 314 155 -244 -264 108 305 62 -246
7292 -246 -222 124 297 33 -296 -193 174 273 -59 -289 -153 243 277 -87 -272 -81 258 196 -154 -286 15
7313 15 327 186 -179 -270 68 303 137 -220 -245 113 333 77 -272 -196 171 333 8 -319 -160 210 299 -84
7335 -84 -317 -96 242 247 -95 -322 -73 285 242 -158 -317 -20 312 158 -218 -311 51 333 158 -268 -255 107
7357 107 322 62 -294 -226 169 341 15 -330 -183 245 299 -43 -324 -141 253 273 -111 -325 -57 316 244
7378 244 -162 -285 -11 319 175 -212 -311 44 325 108 -290 -276 111 324 40 -291 -217 189 346 10 -323
7399 -323 -157 233 324 -54 -340 -116 287 270 -129 -337 -52 313 218 -177 -318 27 333 178 -243 -309 86
7420 86 359 102 -287 -259 145 331 26 -328 -240 211 310 -29 -333 -172 251 294 -71 -343 -70 320 250 -155
7442 -155 -348 -17 337 238 -199 -360 36 356 167 -236 -312 97 325 103 -309 -265 150 367 56 -336 -213
7463 -213 197 367 -5 -344 -174 253 306 -61 -353 -107 304 291 -141 -353 -37 315 208 -193 -340 47 335
7484 335 158 -280 -315 70 363 73 -303 -252 170 375 40 -309 -184 225 336 -60 -364 -155 288 305 -108
7505 -108 -367 -86 314 271 -188 -344 -19 373 214 -221 -325 36 364 173 -300 -317 128 387 93 -383 -296
7526 -296 180 374 21 -345 -229 223 324 -45 -352 -123 327 311 -139 -389 -57 342 280 -184 -363 -15 380
7547 380 221 -249 -334 38 382 138 -295 -283 144 388 79 -331 -264 237 392 30 -359 -193 299 343 -65
7568 -65 -335 -135 318 324 -132 -364 -72 340 250 -170 -363 16 385 195 -230 -351 68 381 119 -306 -265 135
7590 135 386 59 -328 -234 212 363 7 -363 -165 297 323 -78 -381 -120 284 267 -132 -369 -47 368 252
7611 252 -184 -379 30 342 211 -273 -339 92 395 94 -298 -313 148 387 47 -347 -258 203 368 -16 -384
7632 -384 -181 290 344 -94 -396 -103 335 305 -157 -363 -42 337 250 -239 -376 21 399 187 -275 -323 85
7653 85 374 148 -309 -280 173 365 83 -338 -223 240 367 -59 -380 -182 289 328 -89 -389 -135 314 327
7674 327 -168 -377 -41 344 261 -242 -359 36 375 165 -275 -324 108 392 111 -341 -285 188 407 30 -327
7695 -327 -237 258 361 -46 -354 -172 283 352 -80 -380 -83 340 309 -170 -384 -47 385 238 -233 -371 58
7716 58 364 164 -309 -349 126 415 96 -350 -288 186 386 32 -364 -204 281 356 -49 -368 -172 293 342 -120
7738 -120 -380 -84 345 276 -185 -362 15 364 178 -250 -330 67 387 153 -304 -300 126 395 78 -329 -260 209
7760 209 392 33 -349 -223 250 339 -96 -413 -140 319 318 -146 -366 -85 361 286 -203 -387 -9 401 203
7781 203 -257 -338 50 420 148 -302 -309 130 405 89 -346 -269 214 414 -22 -363 -203 249 349 -71 -362
7802 -362 -110 319 290 -118 -396 -75 366 266 -228 -385 -24 379 210 -285 -376 60 371 132 -316 -328 155
7823 155 406 54 -362 -282 212 390 17 -381 -173 272 352 -58 -396 -150 319 315 -139 -411 -72 367 228
7844 228 -191 -386 21 361 204 -233 -345 90 382 126 -307 -290 134 376 74 -347 -254 231 360 -22 -375
7865 -375 -183 291 342 -81 -409 -111 329 280 -168 -375 -70 372 257 -228 -363 41 398 180 -290 -354 91
7886 91 412 120 -323 -326 192 397 26 -376 -247 243 366 -26 -375 -186 299 322 -138 -370 -96 339 299 -150
7908 -150 -374 -63 347 242 -237 -363 50 359 179 -283 -360 132 384 123 -340 -298 145 409 42 -348 -199
7929 -199 251 377 -31 -376 -179 286 327 -112 -397 -113 331 276 -206 -395 -29 345 211 -233 -359 39 387
7950 387 155 -266 -315 121 404 102 -303 -272 183 380 26 -363 -230 266 356 -50 -380 -143 303 351 -96
7971 -96 -384 -71 348 271 -187 -402 -18 381 243 -235 -343 47 401 147 -294 -354 146 374 93 -324 -280
7992 -280 181 363 23 -340 -206 255 350 -33 -393 -148 306 313 -110 -368 -92 340 257 -198 -369 -10 373
8013 373 214 -238 -345 62 402 176 -302 -308 149 394 88 -317 -288 196 402 10 -393 -225 230 356 -65
8034 -65 -396 -118 294 298 -120 -378 -110 342 258 -193 -369 -19 366 214 -237 -328 96 371 130 -288 -306 156
8056 156 393 83 -329 -255 181 368 1 -374 -201 256 327 -80 -396 -110 312 322 -147 -396 -63 339 271
8077 271 -214 -390 9 390 194 -252 -366 103 421 157 -313 -297 124 412 83 -320 -260 232 369 -4 -379
8098 -379 -218 260 342 -102 -397 -111 314 320 -112 -362 -51 327 264 -206 -359 -9 342 220 -274 -323 87 369
8120 369 139 -289 -274 135 398 53 -346 -233 192 370 -17 -363 -201 267 348 -87 -371 -107 304 298 -158
8141 -158 -383 -64 335 262 -185 -348 28 385 145 -259 -312 108 375 112 -326 -294 142 398 61 -349 -207
8162 -207 208 367 -4 -381 -165 262 345 -69 -381 -101 332 288 -157 -368 -46 362 244 -201 -374 38 381
8183 381 205 -281 -340 87 405 141 -307 -268
8191b68
##END NTUPLES=NMR FID
##END=
