##TITLE=1H_AM_NV1891
 200.13MHz,,
 8 sc
 
 22.4.2025
##JCAMPDX= 6.0         $$ Bruker NMR JCAMP-DX V2.0
##DATA TYPE= NMR FID
##DATA CLASS= NTUPLES
##ORIGIN= UXNMR, Bruker Analytische Messtechnik GmbH
##OWNER= pz
$$ XWIN-NMR		Version 3.5
$$ Tue Apr 22 14:58:32 2025 Russian Standard Time (UT+4h)  she@DPX200
##.OBSERVE FREQUENCY= 200.1313
##.OBSERVE NUCLEUS= ^1H
##.DELAY= (6, 6)
##.ACQUISITION MODE= SIMULTANEOUS
##.ACQUISITION SCHEME= undefined
##.AVERAGES= 8
##.DIGITISER RES= 18
##SPECTROMETER/DATA SYSTEM= spect
##.PULSE SEQUENCE= zg30
##.SOLVENT NAME= CDCl3
##.SHIFT REFERENCE= (INTERNAL, CDCl3, 0, 14.3821)
##AUDIT TRAIL= $$ (NUMBER, WHEN, WHO, WHERE, WHAT)
$$ ##TITLE= Audit trail, XWIN-NMR		Version 3.5
$$ ##JCAMPDX= 5.01
$$ ##ORIGIN= Bruker BioSpin GmbH
$$ ##OWNER= she
$$ F:/spectra/data/she/nmr/H-C/1/audita.txt
$$ ##AUDIT TRAIL=  $$ (NUMBER, WHEN, WHO, WHERE, WHAT)
(   1,<2025-04-22 14:57:33.59 +0400>,<she>,<DPX200>,
      <created by zg, POWCHK disabled, PULCHK disabled
       configuration hash MD5:
       00 E9 B6 7A A2 85 ED C7 34 08 36 98 17 FE 4E 26
       data hash MD5: 16K
       21 82 57 BF BD 0D 99 CB 6F 13 E4 A3 A5 E5 13 49>)
$$ ##END=
$$ 
$$ hash MD5
$$ 7C B5 E3 CD 9F 8C F2 54 A4 93 B1 1D 97 33 A2 57
##$RELAX= 
##$RELAX= 
##$RELAX= 
##$RELAX= 
##$RELAX= 
##$RELAX= 
$$ Bruker specific parameters
$$ --------------------------
##$DU= <F:/spectra>
##$EXPNO= 1
##$NAME= <H-C>
##$PROCNO= 1
##$TYPE= <nmr>
##$USER= <she>
##$AMP= (0..31)
100 100 100 100 100 100 100 100 100 100 100 100 100 100 100 100 100 100 
100 100 100 100 100 100 100 100 100 100 100 100 100 100 
##$AQSEQ= 0
##$AQ_mod= 1
##$AUNM= <au_zg>
##$AUTOPOS= <>
##$BF1= 200.13
##$BF2= 200.13
##$BF3= 200.13
##$BF4= 200.13
##$BF5= 200.13
##$BF6= 200.13
##$BF7= 200.13
##$BF8= 200.13
##$BYTORDA= 1
##$CFDGTYP= 0
##$CFRGTYP= 5
##$CHEMSTR= <none>
##$CNST= (0..31)
1 1 145 1 1 1 1 1 1 1 1 1 1 1 1 1 1 1 1 1 1 1 1 1 1 1 1 1 1 1 1 1 
##$CPDPRG= <>
##$CPDPRG1= <>
##$CPDPRG2= <>
##$CPDPRG3= <>
##$CPDPRG4= <mlev>
##$CPDPRG5= <mlev>
##$CPDPRG6= <mlev>
##$CPDPRG7= <mlev>
##$CPDPRG8= <mlev>
##$CPDPRGB= <>
##$CPDPRGT= <>
##$D= (0..31)
0 0.7 0 0 0 0 0 0 0 0 0 0.03 0 0 0 0 0 0 0 0 0 0 0 0 0 0 0 0 0 0 0 0 
##$DATE= 1745319453
##$DBL= (0..7)
120 120 120 120 120 120 120 120 
##$DBP= (0..7)
150 150 150 150 150 150 150 150 
##$DBP07= 0
##$DBPNAM0= <>
##$DBPNAM1= <>
##$DBPNAM2= <>
##$DBPNAM3= <>
##$DBPNAM4= <>
##$DBPNAM5= <>
##$DBPNAM6= <>
##$DBPNAM7= <>
##$DBPOAL= (0..7)
0.5 0.5 0.5 0.5 0.5 0.5 0.5 0.5 
##$DBPOFFS= (0..7)
0 0 0 0 0 0 0 0 
##$DE= 6
##$DECBNUC= <off>
##$DECIM= 32
##$DECNUC= <off>
##$DECSTAT= 4
##$DIGMOD= 1
##$DIGTYP= 9
##$DL= (0..7)
0 120 120 120 120 120 120 120 
##$DP= (0..7)
150 150 150 150 150 150 150 150 
##$DP07= 0
##$DPNAME0= <>
##$DPNAME1= <>
##$DPNAME2= <>
##$DPNAME3= <>
##$DPNAME4= <>
##$DPNAME5= <>
##$DPNAME6= <>
##$DPNAME7= <>
##$DPOAL= (0..7)
0.5 0.5 0.5 0.5 0.5 0.5 0.5 0.5 
##$DPOFFS= (0..7)
0 0 0 0 0 0 0 0 
##$DQDMODE= 0
##$DR= 18
##$DS= 0
##$DSLIST= <SSSSSSSSSSSSSSS>
##$DSPFIRM= 0
$$ [...]
##$SUBNAM0= <"">
##$SUBNAM1= <"">
##$SUBNAM2= <"">
##$SUBNAM3= <"">
##$SUBNAM4= <"">
##$SUBNAM5= <"">
##$SUBNAM6= <"">
##$SUBNAM7= <"">
##$SUBNAM8= <"">
##$SUBNAM9= <"">
##$SW= 18.0517328524113
##$SWIBOX= (0..15)
0 0 2 0 0 0 0 0 0 0 0 0 0 0 0 0 
##$SW_h= 3612.71676300578
##$TD= 16384
##$TD0= 1
##$TE= 0
##$TE2= 300
##$TE3= 300
##$TEG= 300
##$TL= (0..7)
0 120 120 120 120 120 120 120 
##$TP= (0..7)
150 150 150 150 150 150 150 150 
##$TP07= 0
##$TPNAME0= <>
##$TPNAME1= <>
##$TPNAME2= <>
##$TPNAME3= <>
##$TPNAME4= <>
##$TPNAME5= <>
##$TPNAME6= <>
##$TPNAME7= <>
##$TPOAL= (0..7)
0.5 0.5 0.5 0.5 0.5 0.5 0.5 0.5 
##$TPOFFS= (0..7)
0 0 0 0 0 0 0 0 
##$TUNHIN= 0
##$TUNHOUT= 0
##$TUNXOUT= 0
##$USERA1= <user>
##$USERA2= <user>
##$USERA3= <user>
##$USERA4= <user>
##$USERA5= <user>
##$V9= 5
##$VALIST= <valist>
##$VCLIST= <CCCCCCCCCCCCCCC>
##$VD= 0
##$VDLIST= <DDDDDDDDDDDDDDD>
##$VPLIST= <PPPPPPPPPPPPPPP>
##$VTLIST= <TTTTTTTTTTTTTTT>
##$WBST= 1024
##$WBSW= 4
##$XGAIN= (0..3)
0 0 0 0 
##$XL= 0
##$YL= 0
##$YMAX_a= 181492
##$YMIN_a= -569243
##$ZGOPTNS= <>
##$ZL1= 120
##$ZL2= 120
##$ZL3= 120
##$ZL4= 120
##$ABSF1= 10
##$ABSF2= 0
##$ABSG= 5
##$ABSL= 3
##$ALPHA= 0
##$AQORDER= 0
##$ASSFAC= 0
##$ASSFACI= 0
##$ASSFACX= 0
##$ASSWID= 0
##$AUNMP= <proc_1d>
##$AZFE= 0.1
##$AZFW= 0.1
##$BCFW= 1
##$BC_mod= 2
##$BYTORDP= 1
##$COROFFS= 0
##$CY= -3
##$DATMOD= 1
##$DC= 2
##$DFILT= <>
##$DTYPP= 0
##$F1P= 0
##$F2P= 0
##$FCOR= 0.5
##$FTSIZE= 0
##$FT_mod= 4
##$GAMMA= 1
##$GB= 0.15
##$INTBC= 1
##$INTSCL= 1
##$ISEN= 128
##$LB= 0.25
##$LEV0= 0
##$LPBIN= 0
##$MAXI= 10000
##$MC2= 0
##$MEAN= 0
##$ME_mod= 0
##$MI= 1.114404
##$NCOEF= 0
##$NC_proc= 0
##$NLEV= 6
##$NOISF1= 3.799351
##$NOISF2= 2.8
##$NSP= 1
##$NTH_PI= 0
##$NZP= 0
##$OFFSET= 14.38212
##$PC= 1
##$PHC0= -835.1979
##$PHC1= -3.007792
##$PH_mod= 1
##$PKNL= yes
##$PPARMOD= 0
##$PSCAL= 0
##$PSIGN= 0
##$REVERSE= no
##$SF= 200.129724274929
##$SI= 16384
##$SIGF1= 3
##$SIGF2= 2
##$SINO= 400
##$SIOLD= 16384
##$SREGLST= <1H.CDCl3>
##$SSB= 0
##$STSI= 0
##$STSR= 0
##$SW_p= 3205.1282051282
##$SYMM= 0
##$S_DEV= 0
##$TDeff= 0
##$TDoff= 0
##$TI= <>
##$TILT= no
##$TM1= 0
##$TM2= 0
##$TOPLEV= 0
##$USERP1= <user>
##$USERP2= <user>
##$USERP3= <user>
##$USERP4= <user>
##$USERP5= <user>
##$WDW= 1
##$XDIM= 8192
##$YMAX_p= 0
##$YMIN_p= 0
$$ End of Bruker specific parameters
$$ ---------------------------------
##NTUPLES= NMR FID
##VAR_NAME=  TIME,          FID/REAL,        FID/IMAG
##SYMBOL=    X,             R,               I
##VAR_TYPE=  INDEPENDENT,   DEPENDENT,       DEPENDENT
##VAR_FORM=  AFFN,          ASDF,            ASDF
##VAR_DIM=   8192,          8192,            8192
##UNITS=     SECONDS,       ARBITRARY UNITS, ARBITRARY UNITS
##FACTOR=    0.0002768,     1,               1
##FIRST=     0,             0,               0
##LAST=      2.2672688,     0,               0
##MIN=       0,             -569243,         0
##MAX=       2.2672688,     181492,          0
$$ Real data points
##PAGE= N=1
##DATA TABLE= (X++(R..R)), XYDATA
$$ [...]
1346H7k8k50K55q8L5K16k95K20j67j5j42J81J69n9p1L5r6j54J40R8l1n5N6L8K
1371H1L0j32m7J76k03J80j94j37J56O0m0l4J99m6k8J16j85N0R8k21L4K9M9j02
1395a11l3J77q3j08J96j41M5R8N7r9N9l4J78j21j80J82j85J55o7j29NJ19j5J15
1419H0o9Pj9o4P0M2J31k03ON1j0N2l8p0N7j01J63r7L4K3l0J12j34o4K7J0J75j49
1447hl1j35J48P5j24O1q5J68j57M1QJ65j36L4n3j7J10j11O6K0l9r0J55J2R1j92
1473b4J5p2J6N3J03l3j19Q8j57L39j34j37O5m2m3R9j02J38j06M0K5j30K48q2Q
1498E6j46P8r0K85k45q8J03N1j27j7J43p4O9j94K20J63l76R6J7K21j47J50j67
1521a9Nj38L58k10j28J10J6pk1J67j27J53j06j15M5KJJJ32o6k51J21o3J12J28
$$ y = [87, 59, -191, 64, -24, 11, 227, -68, 152, -15, -30, -172, 9, 178, 119, 48, 83, -13, -167, -27, 71, 40, -15, 41, 79, 81, 111, -21, -68, 108, -95, 85, -109, -246, -90, -30, -70, -104, 95, 49, 21, 137, -48, 2, 100, -121, -87, -58, -9, -111, -144, 33, -50, -158, 38, -103, -58, 40, 97, -2, 57, 23, 201, 80, -100, 82, -103, 52, -15, -144, -139, -20, -35, 80, 11, 18, -1, -65, 5, 47, 178, -25, -19, 32, 22, 74, 36, -34, 23, -78, 85, -12, 22, 45, 15, 127, -7, -71, -44, -34, 141, -8, -39, -174, -26, 49, -75, -14, -99, 69, -88, -47, -39, 126, -10, 24, -29, -46, 64, -47, 19, 39, 0, -90, 65, 77, 168, -24, -9, -81, -65, -12, 91, 58, -61, 27, -130, 209, 75, -62, 3, -39, -82, 17, -85, 53, -53, -13, 12, -118, 130, 48, 56, -90, -12, -102, 183, -62, -150, -47, 4, -123, -140, 3, -71, -2, -196, 24, 187, -189, -93, -76, 145, -2, 148, -19, -14, -152, 206, -4, -132, -22, -6, -13, -34, 133, 6, 159, 53, -62, -17, -15, -14, -13, 119, 53, -198, -77, -140, -28, 100]
1546A00l02K30L9l5r8R6n7j53J36N0N6o5M2j2J7k3j15K17j83L6J10r6l1J7J05
1571H1j67J40qm0Q7n9n0K3K6Pk03J4J8QJ24j00Q2j50J99nj16P7j00R8K1j61J99
1598D5J03j02p8M8q4J3k6P1l1L6j29K19r3N6o7j04Q3J28j69p4P3J34K2o9n1j03
1624a49J25Q9N4j27Klq2J25J31j22l0K8n5k57J56N6k2N9K4k14Q1LJ93j84P6Q6
1650D3qj17J89J44k69r6K65k48J16l8n7J12n4p1k1m3K55o1q8j39J78N1j00QP7
1675B8n9k1O8k5j2l5p7q2L81j63r9M2J35N0l10K35j71J03R1J7j08J06j29j77K95
1700H3l1p6J19j54j10J98P9j00O3j98O2N7n8k1P3j07M7J44j64M3L6K4k59L19m3
1725B6L4j3o1Qn4O2j4J49o3j12J41n6O7r2J29M0l90K14k1Pj2n4J09n2q6P9k0m
$$ y = [100, -202, 28, 67, 32, -66, 30, -27, -180, -44, 6, 62, -3, 39, 27, 44, 21, -94, 123, -60, -24, 86, -10, -41, -24, 81, -86, 54, 46, 6, 93, 34, -16, 7, 33, 40, -163, -149, -131, -123, 1, -99, -17, -167, 32, 27, -89, -12, -112, -14, 7, -154, 45, 148, 46, -32, 16, -68, -55, -81, -10, -41, -5, -134, 85, -8, 48, -19, -123, -40, 88, -81, -155, -82, 52, 74, 5, -46, -149, -24, 65, 119, -8, -6, -9, -91, 34, 165, 43, 13, 41, -14, -271, -115, -59, -81, -22, 2, -212, -131, -128, 65, -119, -43, 43, 35, -82, 107, 251, -18, -114, 151, -97, 19, -19, -76, 36, -18, -89, -110, -153, 102, 41, -47, -186, -8, 43, -57, -49, 28, -31, -52, 16, -9, -21, -56, -133, -215, 166, 3, -96, -54, 81, 131, -179, 56, -115, -12, 79, 96, -12, 94, -35, -212, 83, 52, -24, 95, -59, -169, 29, 108, 8, 71, -127, -65, -8, -66, -87, -14, -121, -74, 70, -94, -51, -15, 9, -250, 69, 26, 60, 47, -14, -6, -60, 2, -12, 137, 74, -38, 103, 47, 114, 22, 151, 191, -199, 15, -6, 1, -11, -65, 44, -8, -94, -15, -35, -39]
1753c9J02L1n0j12J14l5j39J46Q9k02J52r4J12j02j75J97J09j78o5K78n4k18J60
1776B7R8j22Mp1L5N7j24J34pj68J05M6J0L7j40J39j19k6J35m4J12j61R3l1j12
1801i3J13n3K31k32J03m1P7k02J20J24j38n2K8K05j35j01N4R5j06N9r2N8o5L9
1825dK3p3L3N2L6j82O5l6J74r9j5m0p2J16O8j28K16j81J65j18m4K0M0O7j48L5
1851c0k05M54j64j69J75j73J40O7O3j41j07J63n6N7L8k89K05o3j33J23m9O8J25
1874I9j11N2j52K16p3j31N5J18j86J04K1L3L1k66J56J51j31r2J49K6o6J49j84
1897c2j8l9N5n1J08q8K11l3r0r6n4K58j41j08K35J9Q1k28r1L9o0N5n7Q5M7J05
1923A12m8J71l29J03J7j20m3P3J5J7K4n1J28j00k1K18j38J40q6o8J05j64J20j26
$$ y = [-39, 63, 94, 44, -68, 46, 11, -128, 18, 107, -95, 57, -37, 75, -27, -202, -5, 104, -74, -139, 139, 85, -133, 27, 125, 3, 7, -64, -29, 28, -96, 38, 31, -137, -32, 14, 24, 61, -79, 60, -59, -85, 50, 6, 118, -43, 50, 19, -93, 20, -33, 198, -34, 69, 28, 105, -97, 23, 147, 9, -43, -15, 190, 55, -46, 8, 103, -3, 56, -36, 22, -43, -4, 19, -54, -21, 31, 67, -115, -50, -86, 88, -11, -26, -66, -138, -22, 46, -82, 134, -47, 118, 0, -44, -24, 16, 83, -65, -30, -235, 219, 55, -114, 61, -112, 28, 95, 158, 17, -90, 73, 17, 74, 112, -177, 28, -35, -168, -45, -94, -26, 99, -12, 40, -112, 104, 31, -100, -45, 73, -113, -9, 12, 45, 76, -190, -34, 117, -14, -106, 43, 69, 3, 152, -32, -50, -89, -34, -85, 23, -65, 146, 113, 23, -73, -127, 131, -10, -118, 117, 136, 217, -11, -102, -63, -123, -68, -125, -40, 7, 112, 64, 235, -94, 9, 26, -94, -137, -64, -49, -32, -8, -59, 69, -31, -52, 166, 28, 168, 82, 14, 119, -45, 75, -51]
1947e1L5Q2j95P9NN1Pp5J19j08O8m1p4J32j18J61o5j57O4MJ23j00P3L9%m3p0J00
1975D5Km0r6n1m3J8K94J7k31J82j74K2mJ59m2r4m1K0J11mJ22j54J48q0j14rO5
2002B8r0K9M7lp1j3J2P8j24J71m2k28J49J15j70R0o0M3K81k27k7n6kK6J59k62
2028a47L22j27M0j40n3K8L1K4NJ58j51pk0J82k4k44O6j2J15j23L2j71J37N5J43
2053A19k11J09j6r7N7k6N4L9j2Jj72Q3J46p4q6J48j62O6J31j33qJ5O8n6J64j80
2079c3J9J04p9j71P7%Q5J07j11n8J01j35l7K38r9j1j46L07j75J1O9q7n5m4R5J04
2105G6l9j64L10k75J83k28J66r1N6K03m16K07o5QJ93k28J17k2Nk2J1N5j34Q7o8
2130g5l7N0j86J37K28k28r3J89J37j85O1k10K28j6ll6l4J05k37J68J27k28L0M9
$$ y = [-51, -16, 66, -129, -50, -45, 6, 13, -62, 57, -51, 17, -24, -98, 34, -84, 77, 12, -145, -81, -77, 46, -54, 19, 58, 58, 15, -55, 45, 47, 7, -89, -140, -183, -165, 129, 146, -85, 97, -77, -55, -59, 100, 58, -36, -77, -57, 54, 50, 172, 18, 166, 86, -28, -37, 28, -62, -33, 14, 11, -60, -73, -61, 17, -107, 64, 22, -206, -57, 58, -112, -22, -82, -39, 242, 15, -12, -68, -70, -44, 115, -147, 175, 48, 88, -52, -105, -77, -46, -22, -17, 141, -10, -17, -37, 145, 121, -123, -57, -69, 46, -77, -45, -216, -79, -24, 119, -92, 17, 1, -96, -39, -65, -11, 28, 16, 17, -155, -72, 74, 0, -86, 62, -100, -34, 97, -36, -44, -29, 39, -17, 147, -33, -14, 90, 11, -160, -83, -83, 2, 109, -2, -60, 41, -94, -131, 107, 8, -3, -149, 158, -17, -6, 63, -24, -79, -123, -28, 76, 37, -127, 183, -92, 91, -137, 29, -62, -6, 197, -219, -12, -77, -69, 124, -104, 13, -9, -4, -26, -15, 40, -94, -7, -75, -112, -62, -248, -111, 117, -111, -204, -15, 122, -63, -2, -212, 16, 0, -3, -39, -73, 32, -205, -37, 90, -138, -108, -59]
2154e9L2M2j07J38p4j1L4L0q0J43q7N5r8O8j05rM0k1J5J4m4j0L1J09Nq0N8j74
2182a45n6K78j56qJ90k42J74k32M53k52j71L39k0j69l1M9J11k0o4j63J65j1J0
2205B9K5j5j51kJ29j45J81O7j96P5J3j17K16j64J4j51J47j46K82j54P3l4J20j94
2229i8QQ4O8p3q8K25n5r0Q3p9j26%K52k82L02j68K9p1K8n2k9J91p7km9m3N1Pk7
2258h1R5J27j19k4J05r2j32O8J70n8Kl1p3k9Q6K18j70j29P8l2J22Rn7o2N6q4J63
2285A26j01m1j02MM2Jn2j0J3Kn5J42l3L7L3j1k8J2p7p5Q5J89N1j62N0k35J59J38
2313A02k65PK29l6j50K89l34J20N3j3O9j66L8J25J8M2j76J66j70J57j83J43N5
2336A20o3R7k00QJ9N3K2J29j07J25l05O4M4N6k43K22N7k5j70J13k35J94j3M2j01
$$ y = [-59, -27, 15, -92, 46, -28, -39, -5, 25, -55, 88, 1, 56, -42, 26, -79, -88, -48, -69, -54, -40, -84, -94, -63, 46, 51, -29, 29, -145, -201, 77, -79, -87, 103, -139, 35, -197, 256, 4, -167, 172, 152, -17, -48, 1, 112, 92, 28, -135, 30, 19, 29, 54, 39, -112, -114, 15, -130, 51, 118, -78, -3, 10, -107, 109, -55, -41, -192, -45, -191, 91, -63, 10, -24, 96, -98, -90, -6, 62, -11, -99, 126, 71, -19, 64, -15, -141, -141, 111, -171, 131, -37, -8, -79, -51, -103, -132, 59, -18, -20, -69, -112, -61, -54, -81, 14, 141, 22, -2, 103, 11, -121, -53, 117, 59, 61, 30, -43, -72, 14, 232, 62, -67, 11, -21, 101, 110, 53, -9, 47, -37, 126, 25, -16, -118, -114, -72, -71, -123, -133, -120, -118, -173, -31, -64, -27, 6, -5, -33, -21, -98, -173, -88, 101, 152, -10, 40, -195, -36, 102, -163, -156, 73, 37, -113, 176, -158, -38, 15, 2, 71, -95, -57, 68, 86, 128, -48, 118, -52, 105, -78, 65, 120, 57, 154, -46, -38, -19, 34, 56, 185, 78, 203, -102, -38, 6, 62, -181, 41, 98, 73, -97, 16, -219, -25, -38, 4, -97]
2361i7o3J37Mn6k01L28j15j65K87p1J53n5r7J02o3j90J45O7l2k1N7j51J08m9P5
2386C7P3j42O8P8j82j56L94k15n1J03J28l07K70O0o1q3J71k51J66j33n4OJ49r5
2410b7K4j40J85J15o0Mk52M9J53j81J85k67K73j18o0L2L8J66j97J73l08K75%j17
2434e5J07j72J8J22Q8k21J78mn1Q2l6o6rr6J01j27Q4k01L42o6K5Pp7m6K4P7q8
2461f0K06Kj52l8k0jj78J52J78j67P9J07j10L00k43l1P4m4J5j74K37j59JO8j42
2486a00J04K6o9R7j27J5J7J87j27j36P8K33k01n0O5l7j37P6rJ25R7j06J0Oo1r9
2512a23J77J00k60K08j3n5n4p9k2J34P9p4j5K4M9r9m1L3N7k6J61j8j32oJ0q9J8
2539e6L2rP2nj13O4j95K86j37%l0J56r1L4k28J90Q4k0l2Q1o2o7K01j37o0l8J68
$$ y = [-97, -160, -23, -19, -75, -276, 52, -63, -228, 59, -12, 141, 86, -11, 91, 28, -162, -17, 50, 18, -3, 54, -97, 11, -38, 37, 110, -32, 36, 114, -68, -224, 170, -45, -96, 7, 135, -172, 98, 158, 97, 14, 185, -66, 100, -33, -87, -81, 68, -27, -3, -143, 42, 157, 97, 101, -151, -102, 51, -130, 55, -212, 61, -57, -117, -85, -47, 119, -78, 95, -213, 62, 62, -55, 52, -120, -102, 20, 108, -113, 65, 61, 10, 92, 56, -10, -19, -115, -14, -141, -57, -258, 84, 18, 43, 50, -27, -73, -49, 28, -60, 146, 148, -4, -42, -62, -63, -241, -89, 89, -78, 1, 108, -2, 298, 55, 24, 98, 54, 69, -105, 132, -27, -26, 42, -100, 4, 30, -39, 58, -69, -54, -37, 150, 23, -113, -35, 198, -3, -53, 12, -25, -162, -86, -95, 30, 127, 21, 31, 37, -24, -123, 54, 154, -106, 102, 89, 34, -20, -99, -121, 13, 92, 18, 3, 27, 76, -23, -64, -31, 26, 0, 161, 143, 11, 5, 15, -74, -56, -24, -33, 39, 34, -79, -15, -210, 76, -61, -61, -91, 65, -26, 8, -220, -30, 54, 34, 2, 83, 21, -46, 155, 18, -42, -80, 88]
2566H8j9j8l8kK3m5M6Q8k21J87j30m9P6n6N7J67o5qp1m0J55j63J10OK3m7Q6m6
2594I4p7l8L2m7k00l8L34j19N8M4o2klj36K31J3N3p0j28R1j55K18m0np1k1Q4j6
2622B4l1k3O6R5j20r7K27k01J84j93N7O0j73J38k4nN2k6o3J44k70N8K04j37l3
2647h7J42n2N2K5k6n4nn9Q5Q4N8j20J58j94o8J36j58N4J2o7p7m0K45m5O1j61K8
2674g3jK00j10j73J28j06R2J46j61m6P5M1j49RR0J09Rj51l1J28l9L6m6J7j93K82
2700H3j10P4rj38J61j66KJ23P1j17Q6n6k9j44L24l83J90J06N1j69J69n9j04J13
2724F9j24P2m0K2N9j83J92j22o9P7mJ57j90o8L23k58K7L6O1j4p0K23k12N7j52
2749a31J58oPn3J57m2k98J22J48j35J28j31n6K04r8J93k63PJ68m9j7K4j22L7m5
$$ y = [88, 69, 51, 13, 11, 34, -11, 35, 123, -98, 89, -41, -90, -14, -70, -13, 154, 89, 81, 10, -30, 125, -38, 72, 78, 101, 54, 140, 94, 17, -21, 11, -36, -236, -274, 60, -59, -1, 43, -19, -21, -24, -160, 71, 84, 137, 67, -61, 30, -125, 93, 53, 48, -23, -44, 40, 24, -7, -30, 36, 131, 11, -86, 141, -60, 124, -69, -12, 48, -125, 13, -11, -16, 36, 10, -53, 91, -179, -121, 83, -54, -87, 55, 3, 55, 80, 54, 0, -5, -64, 21, 105, 163, 43, 201, 7, -61, 75, -83, -29, -17, -84, -161, -201, 44, -1, 60, -101, -73, -74, 126, 16, -157, -29, -135, -43, 103, -58, -104, -29, 12, -137, -128, -38, 71, 80, -71, -102, 26, -13, 23, -23, -6, -199, 83, -27, 47, 38, -100, 61, -105, -103, 20, 91, -26, 60, 4, -25, -169, 155, -228, -38, 68, 119, -50, 119, 60, -44, 69, -55, 17, -23, -1, 58, -125, 67, -55, -124, -47, -51, 106, -84, -152, 171, -87, -60, -24, 37, 23, -47, 176, -36, 21, -131, 27, 21, 28, -25, 132, 90, -208, -86, 62, -73, 55, -76, -132, 72, -26, 167, -96, -89, 79, 30, 13, 37, -85, -48, -93]
2774i3O0J76l63K08K35k99O7j9p5J14N8r0J00m7J74k00m6j5J53p8n7m0K24k82
2798a35J96l3P0j10m8O9PL4j8j30J82j82R2m2J49j04j69K01j47O9J95n6o1L1P
2823F7M8L2j79q4J01J36j50r3K80j25r3lJ28j29J5J75p5j06J12j95J59J06j79
2846e2M4n0j05R4Op3m3J63L8J2q3J05r6j01J11N7J9L8j71j7K11k47Q3J23O8k11
2872g7K41j00Q5k12L3M6p0l6J25m3r6J89j27K8L1N7o0JJ28q8n0o9o2K16j21J88
2898A57j05j10J34j77K03j54P8jo2J16ql0M9j3m2j59L16k94J56j16Q3p8J26p6
2922gR5n1P2k45L0K19j89K6m5J18Ro6o3l1K56n9j83r8K69j20n2rJ94oj46R4r6
2949h4K57k25J74j59R8L1m1N1j30j54R9J71j6k32K53K4j25J10j11J43q5n1j28
$$ y = [-93, -33, 143, -220, -12, 223, -76, -9, -28, -103, 11, 69, -21, 79, 32, 206, 6, -40, -55, 98, 20, -37, -77, 147, -135, 61, 28, 98, -12, -60, 9, 16, 50, 32, -98, 84, -98, -6, -48, 101, -3, -172, 29, -118, -49, 146, 90, 29, 60, 67, 115, 147, -32, -116, -15, 121, -29, -122, 158, 33, -60, -63, 65, -64, -49, 126, 51, -55, 57, -138, 21, 127, -52, -8, -58, -163, -69, -63, -136, -179, -16, 22, 34, -49, 56, -40, -141, -30, 27, 46, 84, -87, -104, 107, -140, -57, 66, 134, -77, 164, 64, 149, -63, -30, 16, -54, -90, 35, -8, -104, 85, -42, -14, 17, 74, 14, 15, 143, 55, 5, -64, -126, 90, -31, 157, 52, -58, 76, -101, 102, -52, 26, 25, -37, 79, 71, 41, 90, 77, 35, -124, 192, -102, 54, -62, 21, -57, 69, -7, 88, 37, 109, -136, -106, 113, -76, -50, -95, 23, 32, -34, -97, -128, 128, 69, -114, -212, 57, -63, -115, -124, 70, 64, -82, 12, -84, 173, -52, 122, -37, 61, 92, 51, 102, -28, -182, -83, 88, 72, -160, 93, 117, -8, 102, -9, 134, 49, -2, -130]
2972a30j1J2J29mJ52j78KL2j9qj2Ol8M6O9l1P1P9l04p7J10J33j15J60j99J30q5
2999h0O1j3p5J91O9m1j08J30k17J29j02l5O6l4L7J06q0k0N0j55J57mrq8j06K16
3025D5o9j16J52n5N9L5K14l24J31p3p9J48J4j14n3J42k5o1j28K41l7o3N1j76j06
3050b47L79j70lO3j5M3q8k2J65r6j49J39k19J91P2O9n8j08J64j51j0J47K7j81
3074e8M6q0K25q8Lj25J32q5J24n7o2j4K0Q8j19J45j13q6K21j37l1P%m0n4J69J4
3101D5j22J09Ol0O8l08L00J08j23q4l6J72j24M5q5o1mQ8J2o6J24n9L5pl9Q3o0
3128a3j8Q0n7r1o4J27jK0m9k5Q0k6j29L41j67K32j92j53N1J0J79r5n9M8J34j74
3154a1J18p7pLj06K9J05n5q5J89j5N1j70O2j01R5j45L4j1K5J91o2o9o2J28P9j51
$$ y = [-130, -141, -129, 0, -4, 148, -30, -28, 4, -15, -23, -35, -29, -67, -21, 48, 17, 88, 167, -137, -214, -104, 29, -86, 74, -125, 5, -80, -19, -32, -107, 84, 153, 112, 4, 134, -83, 46, -56, -91, -25, -59, -22, 84, 4, -16, 34, -121, 36, 32, 23, -65, -171, 45, -24, -140, 12, -43, 16, 51, 265, -59, 72, -1, -80, 68, 82, -32, -85, 57, 32, -29, -157, 84, 47, -16, 35, -141, -247, 132, -38, -41, 22, 7, 50, -38, -60, 105, 9, -140, -1, -220, -29, 43, 112, 54, -54, 110, -41, -51, 96, 123, -58, -12, -92, 133, 45, 48, -77, 55, -30, 94, 37, -25, -39, -19, 69, -50, 95, -18, -104, 117, -20, -51, -44, -44, -84, -138, 31, 45, -77, 32, 38, 8, 76, -232, 68, 176, 53, -31, -67, 105, -19, 26, -59, -120, -124, -36, -24, -90, 34, -25, 10, 3, -36, 47, -13, -31, 49, -8, -99, -163, -36, -37, -17, -66, -91, -11, -37, -166, 175, 8, 240, 48, -105, -54, -44, 135, 40, -19, 29, 163, -11, 107, 30, 23, 26, -80, -51, 54, -1, -86, 103, 88, 139, -31, 31, -70, 25, -120, -86, -97, -72, 119, 57, -12, -74, 54, 133, -18]
3181a8R7n1%k06K13m0OP0n5M7l2j84J14j15J93m4N8J8J04k10k8J09k16K16j50
3206a04K8J6J07J21j25k4L2j48J27M7j42J56j39O2N9l8j85R0K0p6P0O8k7k59L19
3231E5Rp2K6j01l3J55O8P8k8k80J32l0J8J3K0J21l80K54J07l2k28J59M5j85J11
3256Bm1j4K4J42j27K3J15J8j28J32j39O8l3Q5k07K9J05q4J4j9k2O1M6o5k00J64
3282e1J3n2P2J16j06p2J36l0N4l2l27K46N1j92J5P5J95j94j22J05l0P7l2Q8o9
3307f6J95l9j04m4N7J36k71K00K2m8k1j06K16j24J22q7J23k47J60l8M4j13r3K62
3331A36j86J23j41N4M4M2%j88J46j1r1J1K3R4j61L7P5k28K41O4r2K11j90l4l7
3356e8k9L0O7Q0l7q9m0Q4j19P2p1K20k44J90k2q1J2p3J94j6q1j24K45L0j92N5
$$ y = [-18, 79, 28, 28, -178, 35, -5, 1, 71, 16, 63, 31, -153, -39, -154, 39, -5, 53, 71, 175, -35, -63, 46, -170, 46, -104, -76, -60, 47, 168, 43, 19, 51, -97, 30, 77, -65, 91, -48, 14, 73, 35, -150, -60, -40, -116, -46, 22, -5, -264, 55, 64, -8, 18, -83, -116, 39, 107, 185, 157, -123, 9, -21, -3, 10, 30, 151, -229, 25, 132, 100, -128, 31, 76, -109, 2, -39, -53, -29, 113, -14, 9, 124, 142, 14, 146, 7, 75, 42, 127, -80, -51, 54, -30, -16, -35, -57, 4, 50, -15, -215, -51, -38, -90, -18, 98, -8, -80, 56, 26, 80, 48, -279, -33, 18, -174, -159, -84, 111, -83, -205, -100, -130, -53, -85, 3, -66, 129, 90, -14, -58, -1, 135, -136, 64, 86, 38, 17, -89, 127, 3, 125, 38, 161, -86, 74, 36, 80, -33, -126, 136, -50, 73, -68, -14, 30, 72, 72, -116, 30, 19, -72, -61, -38, 56, -105, -68, 7, -221, 20, 84, -8, 203, 13, -21, -58, -87, -57, 10, 90, 53, -36, -76, 8, -111, -39, -110, 110, -134, 56, 34, -47, -35, -108, 86, 70, -11, -135, 110, 140, -52, 3]
3382Cj42K20j69J49k39L33j71l7P0N8j03J2j07L4m7J22p7J6J06J0k04n9L28q8
3406A8K6O6r4J34r0rk23J18Q8j37J77j17Q1j36K09k07J05qj1K2J50j05k89J28
3430a04R1m7N3j08J15m0kp3J12K26j34m8k9l3J2o4J93j30MK3N3N8j44jQ7r0O8
3457D8j39j3J47k4JL6j39J2n5K9M7L5k2jJ03j7k50K58K04l30M7j5n9J99k9K4n8
3484C9J2p7O5J9j19J97l6j72J5J50k7j11O1k8J39l4j80K14j2l12J28K44p1j68
3508f4j2o8j6K77o0R3j63k1N1j17q2J81L0O2Rm01K52j4R7K2Qm9J4m0K82l14Q3
3535D0q5K09j05j47J33J00k69J72O7j27K4k5J31j29M9R8%j31j2m1J67K3l61K44
3559B5r0k4o4K29n9P8Jn7j65J15j1J7k7K02r1j34pN5k0p9J65r8K24k55J43JR4
$$ y = [3, -139, 81, -88, 61, -178, 155, -16, -53, 17, 75, -28, -16, -123, -89, -136, -14, -91, -75, 31, 41, -163, -222, 106, 18, 44, 110, 16, 150, 60, 51, -172, -54, 34, -103, 74, -43, 38, -98, 111, -96, 9, 1, -10, 12, 162, 57, -232, -104, -13, -60, -7, -115, 0, -40, -42, -115, -3, 223, 89, 41, 12, -21, -9, -73, 120, -10, -6, 17, 70, 128, -16, -17, 70, -20, 48, -91, -104, 43, 19, 20, 56, -83, -71, -126, -97, -50, -15, -37, -38, 65, 48, -202, 56, 260, -70, -23, -38, -97, 102, 73, 97, 39, 51, -26, 39, 58, -61, 136, 100, -72, -57, 93, 66, -45, 16, -12, 127, 93, -87, 127, 115, -197, -69, 175, 104, -64, -76, -144, -160, 117, 57, 150, -13, -34, 17, -100, -182, -1, 29, 91, 100, -301, -49, -63, 34, 56, 64, 15, 29, -11, 271, -43, 40, -45, 164, 59, -88, 45, 145, -124, 48, 115, -12, 12, -13, 118, -11, 38, 136, 136, 5, -7, -48, 119, 142, -219, 25, -65, -89, -153, 76, 17, 95, 96, 39, -126, -11, -22, -5, -32, 170, 79, -55, -62, -7, -27, -106, 59, -39, 185, -70, 73, 74, 168]
3586A68k53r9J78m0J13L7k35O7J75o5M4l1M2j5R2k38J99j58m4O3j06P9J32n6m3
3611Fj5N2p3J4J57q3n3J98k27m7MJ20K0j03k6l8J43R1n0MJ1k53J12j52J90j8r6
3638a12R0l1M8r4L3K9J03n6PO4k20J51P3L2j73P4L2q7Q4Kj11Q6N0jp1K4Oq5K74
3667B21k85J88K6j25K8l5K8o7j6j30K27j06O4Qj7k13J05J19J86k86N3J80l26K48
3691G5L9p9o3J4kK0J46j18p9J9MJ6J95j06j24j6P3K8j34J4j7K02j86Q7l5P6Nj6
3719C8MO1j0j30M4L6n3O0j8N5n5q5q1oL39k07KJ08j69M8Q4p1M4q9J46K3j25K63
3747B56j56Qj21Q0p5M0j89J53j07R3k4n2J46j29K16r4j87J90J6K4j62R1r2j4l
3772i2N6n1J81r4J59j62l7J53j21r0J31j50o8K03j64K17j67K50j37q6J19K2j8
$$ y = [168, -85, -184, -6, -46, 67, 104, -131, -64, 111, 46, 90, 59, 101, 86, 178, -60, 139, -19, -63, 0, -106, -27, 105, 49, 6, -9, 43, -30, -16, 141, 58, 5, 203, -24, -71, -67, 53, 73, -30, -56, -94, 49, 140, 90, 94, 105, -148, -36, -188, 2, -16, -112, -22, -53, -5, -99, -66, -37, 66, 10, 17, 81, -139, 12, 85, 117, -56, 18, 50, -37, 47, 49, -62, 24, 74, 73, 2, 26, 32, -53, 221, -64, 124, 150, 25, 53, 18, 46, -21, -37, -167, 60, -46, 18, 26, 9, -204, -99, 20, 206, -80, -27, 153, -173, 75, 114, 35, -28, -14, -16, 4, 150, 32, -47, -28, -24, -8, 187, 81, -43, -59, 14, 42, -92, -78, -95, 107, -79, 8, -27, 49, 54, 38, 42, 103, 93, -37, 7, 43, -10, 50, 32, 87, 32, -53, -134, -140, 199, -8, -6, 102, -67, -19, 65, -6, 38, -51, 95, 118, -7, 256, 100, 108, -13, 67, -8, 32, -157, -4, -111, -18, -42, -94, 52, -77, 139, 45, -142, 48, 64, 88, -74, 17, -75, -89, -92, -36, -87, 94, 0, 159, -3, -40, 113, -8, -98, 33, -117, -185, 18, -146, 71, -96, 154, 17, -69, 50, 72, 54]
3795E4r2O3j11J07k14L52j49l8o8K01j76m8K50k22L5p7J14O7q9l9J60k08K44j33
3819a7J6N5rmj4j47K37k54Q4J51o5j11J46Nj27j13mR0J01j26R6r6J02k0k22L27
3845H1k76J48K03j54J00k09Q7O2J2o1o9Q7j35K7J84r0O8j30J13Km8J57j03R8j64
3870a0k8j25K67j23J08p1L5k29L57j68J3j72L46k31J97p3l01L46j61O0j5o1m1
3893h0J89jo7k3J31q1J7j90O6n5J87l7j53j1J97m8p8p7P1n9K07j8o5K3k9k1Q2
3920G7j2pm5P8q6J22k19J35K9q3k6J91p6L9j73P2M0j02J10j53J95j70R3N8j20
3945c3jj49K91m0k9J16j56J6q1n6J19k5j24J27K1k2p5J44L7j59L0J74j82j26K43
3970F0M7j46M8J10j47M5J8R7j20k9N6mr6J63n8o2r9Q1J16n4j8nN8L1j22J17Mj00
$$ y = [54, -38, 25, -86, 21, -193, 159, 10, -28, -96, 105, -71, -119, 131, -91, -56, -133, -19, 48, -41, -80, 80, -128, 116, -17, -1, 54, 45, 41, 27, -120, 117, -137, -53, 98, 33, -78, 68, 73, -54, -167, -171, -81, 20, -106, -10, -106, -4, -24, -246, 81, -195, -47, 156, 2, 102, -107, -20, 42, 54, -7, -76, 11, -124, -97, 87, -3, 65, -65, 48, 50, 2, 159, 56, 154, -10, -38, -163, 104, -19, 89, 18, 53, -176, 181, 13, 26, -146, 200, -31, 166, 93, -208, 138, -23, 37, 22, -39, -80, 109, 108, 41, 18, 149, 68, 85, -105, -39, -94, 93, 56, -97, -108, 89, 41, -37, -114, -43, -102, 105, 87, 22, 45, 16, -5, 77, 65, 58, 13, 91, 5, 127, -92, 43, 72, -11, -37, 154, 78, 117, -56, 16, 56, -46, 64, -89, 106, -64, 29, 87, -33, -34, -183, 108, 68, 39, 155, -1, 15, -66, -122, -3, -28, -152, -25, -4, -26, -101, 43, 80, -79, -49, 125, -57, -183, 60, 107, -39, 9, 119, -28, 17, 35, 132, 12, -17, 39, 35, -61, 102, 44, -18, -117, -36, 80, 26, 8, 3, 61, 92, -30, 87, 91, -9]
3998iQ9jK7j58N1j00L5n8K79j44P7j46n0O1L1M2j2j47K2J36K8j74K02n0j56Q0
4024d5J47j78N2J10r2RL0n8J38o8o2Q5j97J66j40K30J00k48j2K1O2L3q0LJ3J74
4050A93j16j55J14J92k07J45k51Ll2M3O0o7R0K8J07r2J5Nl1J34j35K9m4j02J83
4075A09Q9k62K21o8M6j74J54j66P2j1L4j0nL7J0j16Rqm8R2k7Qn4J06n6r7J59q1
4103c7K5J74j44j56Q0l3J59j59N0N1j47Q7N2j5P0j34M3l6M8J33n9r7K8M8J35k67
4129a01J70J3r8L3O1j31L9K7j61J38L5K08m09K34J93o4j48j42J02J3q8J10j66
4152a32K03k12J30L5k6Oj63L0J29R5j09J78k60J25N6K2j54Q1r6R0K7j72K05j65
4176g7R0J80l52J82J18j62K4lK0k5ML8j03J39j26P8j69M9N1JK5M2m7K51j35o7
$$ y = [-9, 80, 79, 106, -52, -1, -101, -66, -124, 155, 11, 88, -58, -108, -47, -16, 26, 14, -133, -111, 25, 53, -121, 81, 31, -125, -45, 102, -76, -24, 86, -6, 3, 33, -25, 113, 45, -17, 68, -129, 37, -103, 127, 227, -21, -33, -12, 50, 83, 3, 6, 19, 193, 77, -78, 36, 228, 21, 166, -85, -82, -114, -71, -11, -78, 12, 40, 147, 55, 70, 75, 44, 178, 43, 72, 28, -74, 109, 198, -64, 157, 89, 135, -39, 115, -51, 21, 10, 44, 34, 29, 66, 76, -40, -31, -39, -87, 5, -22, -14, -68, 38, -18, -115, 44, -37, -12, 162, 18, -138, -58, -91, 68, -91, -41, 10, -137, -50, 2, -13, 57, -77, -34, -70, -22, 111, 52, -45, -17, 31, 166, -101, 69, 82, -16, 17, 78, -53, -14, 13, -148, -10, 25, 233, -176, 58, 251, 187, 39, -103, -1, 12, -76, 34, -132, 71, -141, -11, 24, -2, 4, -159, -129, 0, 95, -14, 164, -96, 29, 85, 107, -47, 34, -62, 28, 55, -117, 88, -77, 13, 193, -159, 23, 141, -21, 3, 0, 20, -5, -1, 37, -66, 73, -53, 25, -144, -95, -44, -43, -18, 24, -23, 228, 93, 26]
4202B6j0km0N8K5JJ03j77J30K9k07R8n6r1J71j12j3PJ6Q9j44jP8p3J04JJ27j81
4230d4J93k33J03J9J57k68P3M5l2j7J81o3j29r9p9K84j61J35k21J55o3J54k7n8
4254Er2K29k10KJ45j44J14j59J12L8K2j76J78kj07J08K0j44K5J74r7j30J64J18
4278A93r4q3Q2q9jPL4J09n8p3r1K5o1O1K06j04l7O4M4j73O3n9n3O8M2j13J52j0
4306E1j06r4J6J78J41k19J04M8j34mR5j51k0OR0J57j23o5J41j92J09p3j0L1J37
4331A13l9j98J51j32K70j5j89j27N9j36J88K0J02l2j25J28rkJ5q8k2J38j90J44
4355B4n0n8J59j9j61Q7m2l8P2j61K26m6J76k11J34o6q5J02m9J84l11K37q2o9j1
4380e8J13k07J40N5o2M2P8p2j10J02R9k47J29J71j46K0k02J7L13k75O0R6j49J37
$$ y = [26, 16, 14, -26, 32, 57, 58, 161, -16, 114, 143, -64, 34, -22, -113, 58, -54, -67, -60, -44, 45, -99, -100, -22, -95, 9, 10, 137, -44, 149, -84, 19, 38, 195, -73, 0, 45, 13, -4, 177, 114, -15, -114, -193, 91, -70, 65, -156, -1, -64, 90, 63, 5, -87, 142, -68, -66, 79, -65, 49, -110, 2, 40, 62, -114, 64, 62, -45, 63, 83, -61, -36, 138, 41, -89, 75, 193, 99, 16, 98, 9, 8, 15, 49, 158, 100, 27, -64, -39, -100, -39, 167, 63, 26, 90, 134, -39, 24, -35, -88, -20, 22, -91, 61, 51, -55, -149, -133, 45, 186, -33, 71, 119, -15, -19, 76, -75, -95, -89, 1, 158, 35, -30, 111, -81, 28, -45, -55, -24, 113, 74, -124, 27, -105, 165, 150, -39, -166, -107, -243, -55, -35, 67, 35, -90, 38, 29, 27, 42, -46, -68, 70, -120, 24, -26, -84, 75, 56, -105, -18, -60, -98, -26, -187, 39, -7, 169, -42, 92, 26, -59, 43, -6, 178, -133, 104, 22, -47, -58, 55, -152, -12, 43, -19, 23, 101, 29, -81, 21, 120, -127, 2, 173, 27, 47, -155, -138, 175, -100, -40, 56, -93, 44]
4404D4jp2j14K92j22K3N2lj26Q1O6O9j93J70j77k8K17k24l3L8R6k06K1J69n9l2
4430e2J62j74K9k06L14j37n7J33k11M0O8L11j60%p0O5n1o4K21k99L32k98Q0l5
4454e9L01k68M4q9J3m0P7K20j33r1K54k59J17j88j4Q2j04L3l9K28j63J39j1R2
4478A42q8M0j34m5j51L29q3n8L7N3k54K07o1l9K53o3j68O2pN8j17K17q3r2L04
4503B59j71lOj38M4o9J51n2N3j49j7L9Q0m9J5j24m8L35k61Q1j18M3J4l3L6L8m8
4530h6J51j02J57j02j82j7L15j56m7l0J99k53J86O2q5lj3K3m6J93k12O6R7j58
4554d3J4o1R3o4q9J65M1j74j3J44r0J08n2j98K9K42j96J95P3q6m0jk83K64K7J19
4580A24j51jN2P7j31r3K77kr4j16l3J18L1l1J74l57O9J50Qq8qJ53M8k16J73n6
$$ y = [44, 43, -29, -143, 149, 27, 50, 102, 99, -27, 54, 120, 189, -4, 166, -11, -39, 178, -46, -79, -41, 55, -151, -130, 39, -20, -52, 110, -64, -35, -241, 73, -64, -121, 12, -199, -159, -91, 220, 60, 60, -10, 55, 4, -60, 161, -138, 194, -104, -24, -59, 242, -26, 18, -71, -58, -98, -21, 199, 66, -25, 229, -30, 87, -101, -115, -33, -137, -104, -143, 85, -78, 61, 50, 142, 54, 94, -40, -85, -236, 93, 10, -48, -11, 42, -212, -5, -66, -105, 148, 85, -83, -21, -28, 30, -87, 130, 47, -45, 259, 88, 85, 91, -47, -3, -72, 79, 27, 80, -69, -86, -47, 33, -16, -1, -125, -173, 162, -99, -18, -136, -93, -79, -112, -76, -38, -86, 65, -37, 120, 18, -164, -181, 134, -22, -69, -99, 100, -153, 33, 95, 10, 7, -6, 17, -29, 164, -48, 18, 115, -43, -29, -90, 3, -61, -150, 15, 56, -118, -131, 13, -77, 31, -21, -219, -190, 52, -144, 51, 124, 38, -2, -3, -286, -22, 5, 124, -27, -28, 24, 101, -30, -123, 154, 152, 58, -58, -91, 27, 58, 27, 201, -156, -87, 63, 71, -17, -25, 128, 176, -40, 133, 77]
4606G7j64R0j56K5J88n0n5J11l7m2j65J17l9K1J90j75J43P6l02N1K35j44J6P4
4630H5P3j9Lj62m5j15J30J50j50o5J25J9m8R1r0k01J61L2m2k3J99j91N4l6m5J82
4656G2j02J97oj15l26K29K1o0J30J7J16l5j4p1mQ7j68p3K95j8j29j6j82K90j83
4681d8m5J85p8k5P9K7j36K5r4L1MN6O1n3J36p8l9N1j20P7r6O9J61j17k13K79m
4708I5Jo6o5Q9j69J5pjK47r9j5k6k1O0O0j57m6N3K4J39q8n0K58k43rJ2l1J88j1
4737A37j11l4j5o2P0n7o7M6M4J33rr9M8M9j0j62P5J16k06Q5L1O9j54J63o8J53
4763A65j24o0J3J0L6k41J35K26n2j83o7R2N2R5k05K22j96R1OO0K6k78Q7L7Q3j84
4789a54J72j09O7O0pj7J20j10m8o7J9J27K9j3J84k45n8o7J81m3l3L2j2K3n9n7
$$ y = [77, -87, 3, -153, -128, 60, 10, -45, 66, 29, -13, -178, -61, -100, -79, 111, -64, 79, 155, -147, -96, 139, -5, 11, 85, 158, 139, 142, -20, -65, -180, -50, 100, -50, -115, 10, 29, -19, 72, -18, -219, -58, -26, -68, -91, 108, -83, -29, -65, -110, 72, -30, 167, 161, 46, -280, -51, -30, -90, 40, 57, 173, 138, 124, 53, 49, 136, -32, -105, 190, 172, 43, 27, -155, 135, -48, -93, 92, 14, -11, 68, 95, -41, -16, -110, -79, -75, -19, 42, -11, 125, 47, 8, 59, -61, 16, -80, -11, 150, 33, -180, 99, 95, 96, 30, -35, 54, -115, -100, -107, -108, 139, 40, 25, -1, -22, 38, 98, -59, -105, -52, -28, 111, 23, -27, 231, -12, -21, -9, -40, 148, 137, 26, -8, -23, -85, -15, -72, -139, -93, -49, 84, 75, -24, 24, 73, 63, -99, -24, 92, -114, -29, 2, 71, -83, 80, 12, 165, 41, -19, -6, 4, 40, -201, -66, 160, 108, -75, -142, -50, 2, 97, -108, 114, -82, 9, 15, 75, 101, -177, -90, -53, 30, -154, 18, -91, -24, 36, 29, 12, 132, 22, -26, -93, -74, 53, 82, 69, 253, 8, -50, -117, 64, 21, -12, 20, 8, 31, -28, -85]
4815h5J59K2P1j95P2j96J04n7J00P9j30J8m6P6r0J17j6j5L4Qj39LJ73p8j73L82
4841A98m25J32M6J23j91K53k55P3Ol0J57j45P6O0p6M0j47P6Q5j37J88j49L1n6
4865f7J29N6j83r1q4J85J46j93J8K92j11r1R7j98m0O0N0P4j42J64j6o5K6M5j17
4890e6L8R8q0p4K4j16J18K8l4j48K08k8M1J2p1k4O7o3K7q4K97l09J48j3O1J25
4916A92o9j26J74K6j51j97K62j6j21K8l6l2J73j32j04J21Q9k4j25O1j2j44k8K47
4940E6r9J78j34R7j23kLJ09j28R4j4o8r5j86K17Q8J9M4o4o5J52L9Ml39K08P4l8
4967B7m7n3J28o5J6J67J5k07J05j17J37nj51O4kn9J72k3J72k72k47L88j82J65
4991A26j78K25k7mj60R0n2k0j0O6R8j09RO1j02j75M2M6j8J68j20J19n9j60J48
$$ y = [-85, 74, 96, 167, -28, 44, -152, -48, -105, -5, 74, -56, -38, -84, -8, -98, 19, 3, -12, 22, 30, -109, -106, 67, -11, -184, 198, -227, -95, -49, 74, -117, 136, -119, -46, -40, -70, 87, -58, 18, 78, 2, 42, -105, -29, 56, -81, 107, -42, -11, -67, 62, 118, -65, -156, -240, -55, 91, -102, -84, 208, 97, 6, 103, -95, -135, -75, -25, 49, -93, 71, 55, -10, 16, 61, -56, -18, 80, 0, -74, -50, -166, -48, -20, -54, -202, 6, -22, 19, 31, -40, -64, 3, -60, -33, -117, 180, -129, 19, 6, 67, 192, 123, -3, 171, 197, 46, -151, 111, 95, -26, 2, -34, -66, 107, -25, -129, -8, 81, 57, -68, -7, -19, -163, -191, 56, -43, 135, 1, 98, -25, -27, -24, 85, -43, 51, 37, -31, -126, -312, -95, -7, 12, 56, -8, -73, 79, 118, 122, -217, -9, 65, 27, -20, -73, 55, -10, 6, 173, 188, -19, 86, -31, 106, 101, -50, 14, 12, -47, 125, 102, 274, 2, -245, 143, -39, 126, -52, 173, 146, 142, -18, 72, 20, 0, -10, 56, 154, 45, 54, 115, 13, -162, -120, -74, -92, 76, -44, 75, 16, -144, 4]
5016DL2N8j75P0j40KK89j10m0o6P3Pj5J52n1K7m0j06J11l9K0k32J39M8j57J67
5042B8p1o6K49j04j19%L3Q1k8J22p7l7Q5k3o1M7P0j68J08j67J64O8k11K41k13
5067d9J16N4j25j27J16q9o3Q0N6n5PJ36r5O8k18K23n1J20j17J65l20K33k81L44
5091A28j07M0L3l0qr2P6p9mJ43j74Q4j07R3K34l66O6j20J55P3%k16J81m4J09j63
5117i5J22j8P6q4RJ2LR1l8J46j96O5k42L67j64o8R1M8n4k4j25K91q5p1r6K8j30
5144a41J23J59p0j52K23r8k00J61J91k71m0J57l3k9J33p4O6M4j02J40j55m7L9
5167B4o3m3Q6k7R3J8m3l0JQ0j41l1l3L03j36o6q6M9J34o2J0N4n3K0j58M7R3k04
5195a64J65j60R2p1P5J22o2O6k40L34k27J34k8n4J57j5j76K7M0l5r8K08R6k53
$$ y = [4, 36, 94, -81, -11, -151, -149, 140, 30, -10, -76, -3, 4, -11, 141, 90, 117, 77, -29, 82, 43, 63, -169, -30, 18, -139, 28, -43, -109, 140, 36, -83, -83, -50, 31, 3, 125, 48, 11, 96, 73, 12, 59, 129, -39, 69, -98, 66, 134, -77, 164, -49, 67, 121, -4, -131, -15, -104, -167, -87, -31, -86, -79, 57, -38, 30, -188, 35, -16, 104, -13, 152, -168, 65, -216, 128, 21, 61, 94, 64, 56, -36, 40, -39, -43, 100, -74, 10, -97, -4, 230, -136, -70, -190, -35, 38, 38, -178, 3, -41, 68, -95, 27, 9, 85, 1, 10, 22, 25, 116, 78, 224, 28, 93, -149, 218, 54, -14, 77, 125, 71, 47, -78, 213, 128, 57, -39, -11, -141, -18, 141, 71, -81, 142, 44, -156, 5, 196, -75, -115, 42, 9, -20, 113, 39, 105, 149, 47, 187, 32, -15, 24, -39, -82, 4, -23, 70, 88, 45, 15, 16, 96, -45, -76, -109, 194, 58, -8, -94, -45, 89, 27, 37, 91, 38, 58, -100, -53, 40, -164, 1, -159, -67, -138, -63, 59, -3, 63, -177, 157, -70, 64, 36, -18, 139, 124, -52, -25, 15, -20, -118, 90, 186, -67]
5219f7k5J78j42k13L29Q2K6k16Q4p0RM5o7j08J83n2P2j16o6j9K46J1j26m2lL7
5245c0j05J39L2Ln5j41J05mJ38r8p4L2k0J94j45J25k03N9J05r6J63j54L1K3l9
5270a5Kj05N1j2kJ22j33m9J78K9Jq1N3n6r4j09J87J10j48M3j24K02K4K5K1n0k14
5297a44P9r7K13j24O4J9P7p3J7m3L3N4j45j5K32j04l3pl9J83j16Q6k64K75j62
5322c4O2n5n5J42J4lj38P7oj40m3PM8Q6j8J25n1q7O1r3J41n9nr2J36l0N2K5j32
5351f5O8J7M6j11J53j01q2J50m4r8N7J0J61l16K21m6L3J1j45J79q7j93J40JPj8
5377e2J23J03j78l6oq6K10k22N7J52j39l7j8Q7K84l66J53J75q7p1o1oj64L45k20
5402f0J84k57J46j09j2K01j1p1R8j59J98q3q5j2Q4j62J46LP4j06Mj4L9J8o2MM
$$ y = [-67, -92, 86, -56, -269, 60, 142, 168, -48, 36, -34, -25, 20, -47, -155, 28, -24, 48, -68, -134, -153, 93, 104, -22, -64, -67, -30, -135, 4, 36, 39, -16, -157, -52, -56, 82, -16, -90, -58, -78, 116, -29, 96, -107, -48, 57, -39, 124, -30, 1, 24, -15, -13, -118, -67, -79, -81, 41, -92, -141, 37, 66, 67, -14, 39, -17, -111, -220, -33, 77, -71, -28, -152, 50, 74, 99, 120, 70, -144, -65, -162, 51, -73, -9, 10, 87, 14, 31, -12, 21, 75, -70, -85, 147, 43, 10, 3, -36, 147, 31, 117, -147, 128, -34, 28, -27, -82, 60, 74, 71, -67, 10, 4, -136, -179, -172, -124, -38, -56, 69, 18, -69, -8, -101, 40, -19, -24, -116, 20, -10, 42, 67, -65, 3, 20, 66, -45, 108, 7, -75, 75, 31, -67, -10, 0, 161, -155, 66, 20, 53, 64, -81, 98, 11, -182, -42, -41, -34, -52, 71, 174, -4, -40, -46, -132, 78, -144, -87, 65, -74, -111, -129, -42, 242, -124, 29, 204, 117, 46, -15, -21, -185, 160, -60, 124, -133, 13, -96, -108, 93, 82, 11, 109, -50, 148, 65, -20, -32, 52, -110, 36, 39, 113, 7, 11, -3, 36, 54, -8, -4, 0]
5429@M6j55J47J32r7l1N1k03O7L0P3j0j4Q6j83Q8r6p1J96m2M9q6M6j67O2P2J59
5456A49j7m7j49J62j29N1oj49K05j07m9K66j09q2J55k38o1J85k4J24k18k4K10
5479I8j02j7J73j84j6J7Q6k65J76J98k51l2P8q4R9J41j57j54K38j67M6q7K05L
5503D2j2K3q2KR8k7m0Q8N1o3j46J50l2L2j9L8l28Q6N7P1j2m6J02j6M6k0j41J04
5531FO0j54L9K7Q7o2j84K32K5o0K3m5J59j28j14O2J25P8k15k6R8k4Pr6J13N8j03
5558a2pj2J72l9j33MM6j31N7M2m1J12k5j48K42j48RJ29j00J18j77N7jl5N4J6j49
5585a00P1o2k9j5J87q2ko3k2O5J68k2j23k0J3N8J71l3j68J65k74N0K55l61K61
5610H8m5q0r3K9jJ68k9m1k31M08l17N5R9o2J65Pl4J7j15j37M5J19j9P8j09J4J52
$$ y = [0, 46, -109, 38, 170, 73, 42, 93, -110, -43, -13, 60, 50, 36, 122, -61, 27, -69, -140, 56, 14, 63, -23, 23, -144, -82, -10, 149, 132, 85, -64, 98, -31, 20, 14, -135, 70, -37, -86, 180, 71, -11, 144, -94, -155, 30, 6, 130, -88, -112, 98, -4, -21, 152, -32, -48, -31, 55, -210, -34, 164, -87, -119, -41, -125, -26, 115, -42, -196, 42, -125, -79, -166, 39, 42, 30, 53, -29, -27, 71, 44, 4, 92, 143, 80, -66, 84, 52, 84, 65, 103, -225, -139, -82, -11, -23, -69, 33, 17, 63, 43, -98, 6, 66, -88, -49, -22, 65, 3, -181, 51, 76, 16, 39, -6, 153, 25, -89, -27, 98, 176, -39, -65, 33, 9, 16, -80, 33, 91, -12, -19, -31, 141, 102, -31, -27, 19, -112, -55, -13, -54, 58, 33, -115, 127, -21, -12, 117, 17, 135, -42, 15, 14, -21, 33, 49, -100, -29, -91, -120, -135, 52, -30, -32, -95, -117, -52, 116, 94, -29, -49, -36, 22, 193, 160, -8, 157, -117, -67, 188, -173, 88, 43, -37, -130, -101, -102, 66, 37, -4, -235, 173, -144, -89, 10, -52, 113, 120, 86, 103, -12, -149, -104, 15, -4, 74, -35, -21, 131]
5637A31r2R9j06n1O0k6J01r1J04j67K6j0k5p1O2J48j35kl2J06o1j2Mj5J8j58K47
5664E2q0K6K17r8j37m5K16k3r8n9Q4M9j01l0N3j41J33J60j02r7k3j82L87j68L4
5689B7j88J52J20k30K09j85J23R1j02m7l2Q9Kj56J10J13j67l6J97k29J27jm2J91
5713A36q9m4R2l1J2Rj73L1n9J12L7l0k18L70k62Q8J79j97m2j17K72j54L8L4J44
5738A38j23j9mp5K46q5l7k2p0k0n7K62k2j97Q3j4o1J47rj32K4J63j77j65L17m6
5764D5J7k8j46J58pJ7J8j79J20k3J38l06K62k48L27L0k28n7L3J43n0n9m2L8oJ28
5790I5k0J15j55j33J57L3k29J35K3k4J0N4J90k14o6J7K13l17J06j24J45N0k04
5813a43J01P3j48J31j01Q9Q1o6J4j60K42j87J29p1Q8j98K31k37J74j02M6J17j64
$$ y = [131, 39, 138, 32, -19, 41, 15, 116, 25, 129, -38, -12, -22, -47, -118, -56, 92, -43, -45, -77, 29, -32, -44, -40, -55, -37, -195, 52, -28, -2, 215, 117, -20, -65, 151, 128, 30, -29, 55, 104, 3, -27, 26, -115, 18, 178, 76, -21, -44, -226, 161, -7, 27, -161, -9, 111, -119, 90, -95, 28, 119, 17, -30, -62, 27, 29, -127, -17, 96, -71, -107, 90, -139, -12, -13, -55, 136, 47, 3, 95, 64, 76, 85, -88, -57, -116, -4, 33, 3, -215, 155, -107, -19, 160, -37, -79, -196, 76, -78, -40, -6, 138, 15, -4, -8, -83, 163, 78, 41, 19, -51, -71, -128, 134, 112, -85, -2, -16, -77, 70, 61, -71, -47, 116, -61, -226, 91, 45, 62, 34, -112, 46, 39, 56, 74, -105, 15, -8, 130, -176, 86, -162, 165, 195, -33, -90, -57, 86, 36, -23, -65, -27, -33, 95, 75, 190, 35, -98, 59, 92, -137, -2, 21, -3, 7, 61, 251, 37, -29, -12, 201, -116, -10, -134, 11, 61, -143, -42, 31, -117, 14, -87, 2, 83, 17, 31, -129, 113, -74, 55, -16, 72, -126, 105, -132, 42, -60, -14, 103, -61]
5836f1Q7K7K6o4l5j6J18p5M1pj87J05r4K80j05kj74P0J69j75J52j57j4J12Q8k89
5862a80J78j26K10m0Lq9J20n3kJ07k61K34j15J83k01J96K2j83O3j19K8J36j97
5885h6O5J12k22J09p0J21k5K64l73J4jK7J67l01K52o9J0J05j70J1J11O4l9r9J14
5910I1p5r3J28o0j51K77j83m4J40J99j12j74K34k70K07r9R9j34J8J7J5M8j31J87
5934A34j0j49K94k20n3Rk6QoP3lq4R0k8jm6m4j3J52N7k39RN7R1j94K3J4P3J01
5963F9l6m4J87j19j13N1m9Q8K6j29J98r8j2M2rr3J05j34K21k18K40j78N5l6j65
5988a51J44o6J26r8q4P8J06K0O9o8p6j5k4K3r2Q7K0J27P0j71m5j0r9R3K5J3O9
6015G1n8r0Rqj8K27l62L82j98j22P5o7K72j86J58j04J13j30K4l4k3n2p9j0J08
$$ y = [-61, 26, 53, 79, 15, -20, -36, 82, 7, 48, 41, -146, -41, -135, 145, 40, 38, -136, -66, 103, -72, 80, -77, -91, 21, 109, -180, -2, -128, 82, 42, 45, -44, 76, 23, 21, 128, -133, 101, -14, 169, -32, 164, 186, 3, 66, -53, -25, 111, -86, -21, 91, -131, -22, -92, 29, 4, 268, -105, -91, -92, -65, 102, -199, 53, -16, -6, 99, -71, -60, 51, 115, 76, -23, 91, 16, -77, 51, -9, -160, 117, -66, -110, 30, 229, 117, -57, 177, -93, 114, 15, 114, -20, -2, 15, 30, 78, -53, 134, 124, -25, 269, 49, -4, 5, -21, -13, -19, 54, 51, -33, 57, 29, 28, -18, -62, -75, 77, 134, -105, -96, -39, 52, -142, -119, -105, -32, 69, 33, -11, 176, 57, -56, -5, -54, 34, 60, -69, 129, 31, 19, 61, 52, -41, 64, -70, 151, -67, 173, -5, 50, 14, -151, -7, -73, 53, -45, -129, -51, 55, 75, 144, 76, 0, -15, -39, -16, -108, -21, -1, 126, 196, 25, -20, -30, -129, -36, -11, 2, 71, 13, -77, -68, -76, -94, 133, -229, 153, -45, -167, -92, -159, 113, -73, 85, -19, 94, -36, -12, -46, -69, -121, -200, -210, -102]
6040a02K10j99K9l3R4O6j2L6j07o1M2P8J39j43P9k30nlQ6MJ44p0P0k8j08k4q5
6067a33n1R6P4qJ03N0j47N4k35M8K45j28J20j23j35J95J14r3K4q3k3OJ18o3j05
6092h0R4K0m4q1K54j74o4J30Mp3Q5j18Qo6Q8M6n6M6J2Oq2J79j26k9m5N5J04j48
6120e5r0n2J83P7o1q3O4Qr3J10L4l6l8J61J1k37K09p1k7l6k2P5J01j91J23J83
6146B47k48m2P1K6n9j21M0M4J9R7k39K01j21N0R4j82J54j32J17p6J21p7Q9l9j4
6171B0j41J69j06O5J19j98K5lJ57j95K54j55j2j1P4j54j34M43k13l0q1J16P4j40
6195e7QN9n0R6k7j66J56k31K21q8m7J12J53K7j50KJ78r4j77P3m6m4J55K3J0o6
6221C0J2j05O5M4r1O2j45J89mO0j15n4Q0M3k97L45q2p9J03o6n6M4J38j62Q5n3
$$ y = [-102, 108, -91, -62, -95, -1, 65, 53, 89, -18, -79, -37, 41, 180, 37, 116, -114, -119, -122, -36, -32, 112, 42, 112, 84, -24, -48, -133, -184, -88, -14, -22, 81, 131, -16, 38, -197, -149, 96, -32, 88, -35, -170, 25, 139, 46, 70, -13, -36, -30, 88, 25, -80, 14, 34, -10, -91, 163, -11, -75, 55, 59, -14, 71, -47, -39, -105, -17, 29, -27, 19, 31, 37, -45, 134, 8, -21, -66, -11, 93, -55, -145, -197, -14, 63, 2, -81, -17, -9, -102, 8, 42, 6, -32, 129, 140, -97, 112, 41, 14, -22, -44, 31, 132, -59, 64, 247, -1, -43, 28, 54, -5, -126, -86, -42, -23, 74, -165, 36, -85, -35, 59, -123, 31, -101, 16, -60, 61, -16, 73, 34, 20, -121, 48, -58, 7, 126, -72, -47, -50, 107, -88, 166, 11, -1, -12, 62, -92, -226, 217, 4, -26, -107, 9, 83, -57, -49, 10, -40, 56, 29, -137, 19, -212, 9, -79, -126, -14, 139, 166, 16, 18, 196, 102, -75, -2, -48, -92, 63, 86, 96, 30, 42, -63, 2, 46, -45, 17, -128, 61, 57, 117, 2, -52, 28, 71, -226, 119, 37, -42, 61, -5, -61, -17, 121, -41, 44, -9]
6247iN9k3lj08P1Q0p0n8Q0j3K59mk74M9K4M3m2o2J25j10j0J93k27J8J01qL4j33
6275a8M3L8j16J46k07L46j16j16K9j23K78j71l9p9j11L41k97J24J43j00O6n9j61
6298a59Q0J52L3Kj45J69j25k5l6J26k22J02k9K8L0r8J10N7M1j63J21k39J17R4
6322B1j32K36n2j85J29K31k87KKNMj65L26k13j2Q7m9O3j8o9K13N4j93n5m5J01
6348aj16K89l02J79j08P6J54l06N2J5M0rm5n9J01L3lnR1j85J01j34J63p7Pj5j0
6375g4O4P3pr8j78J40P2j18O2m0J62k1o9j5R6p5j57K41l3j36m1J20N0m3P2n3k5
6402c1l4J54k48J05J05mp1N5L1j80L12j30k14J39j79R0R5n8j1m8J70j9K9L3j29
6427c8k1J59M4j37l9J68r2N2j26J16r6p9L1l5J85L9P7l00J19K6j25K0K03j94Q1
$$ y = [-9, 50, 27, 24, -84, -13, 67, -3, -61, 19, 6, 265, 261, -13, 36, 60, 103, 61, -1, 124, 14, 4, 197, -30, -12, 89, 81, 115, -18, 25, 63, -53, 93, -114, 232, 116, 0, 29, -94, 184, 13, -26, -105, -216, 125, -172, -48, 95, -5, 61, 2, -159, -79, 73, 106, 108, -37, 132, 7, -18, -54, 72, -150, -48, -77, -49, -19, -117, -7, 50, 91, -72, 49, -190, -73, 21, -111, 125, 73, -112, 17, 248, -39, -37, -35, -30, -26, -191, 135, -78, -90, -3, -52, 11, -7, -76, 137, 191, -2, -57, -102, -1, -117, 172, -130, 49, -59, 17, 171, -135, -83, -68, -28, -37, -82, -141, -40, -7, -10, -15, 76, -109, -8, -142, 21, -56, -49, -64, -74, -10, 63, 56, -42, -220, -80, -8, -126, -64, -104, 58, 37, -32, -47, 49, -26, -183, 58, 25, -111, -152, -32, 18, -25, 47, -6, -31, -65, 89, -159, -54, 51, 47, -24, 31, 62, -118, 194, 64, -150, -11, -190, -100, -5, -63, -74, -122, 48, 29, 58, 91, -38, -59, 100, 144, 7, -32, 136, 44, 96, -30, 86, -10, -89, -58, -93, 92, 131, 208, -92, 27, 53, -72, -52, 151, -43, 38]
6452C8J3j58J2J0J37k06K12j43m1K24K3p1q6P7j29K03k5M7j6q7j13ojJ64L9k19
6478a02O0R5J02q9l4R5p9j29L51k97L2J37r5j1J10m19L20j58J93J63k87M5J49
6501A52j28p0J39p8r8KJ56j40o0P8N1J09j49k1L7L3K6M6j52N3o8N0O0j47L8L7
6527d4R0j38J95j67J12j70M9J28r9P9J05q1j46Q1J00k05J62n1o3O9J6N4j81J03
6551bQ1j04J63j29M0j17K20k52J09J34j58L5p3J58k4k4n0p8O7P1o4P1j93J35j62
6576a46J55j21J21L2r4J48m6L3q2J8n6J66k70N9K21j00j14J13l0O6M6j67j68J98
6600a8O4Lo8L5j33K62j63N4K5j93J80k27L3N3Q1p4LlJ23R4n7q1j7O9m2Q8j18R6
6628F9N6j5k55P6J37j68J37n5j29K77j82K3R7j0k76K46Kj2l0J43m8L1r6j26J58
$$ y = [38, 51, -107, -95, -85, 52, -154, 58, -85, -126, 98, 121, 50, -36, 41, -88, 115, 90, 137, 121, 34, -79, -85, -86, 78, 117, -102, -42, 53, 155, 66, 32, 127, 48, -81, 270, -27, 5, 142, 47, 36, 146, -273, 47, -111, 82, 245, -42, 3, 152, 24, -46, 93, 15, -83, -81, 75, -65, -125, -47, 4, 113, -36, -57, -20, 13, 39, 85, -67, -14, -82, -32, 28, -119, -81, -44, 46, -92, 103, -64, 48, -122, -73, 55, -44, 35, 140, 59, -87, -6, 94, -111, 51, 0, -63, 6, 22, 76, -105, -2, 79, -25, 138, 9, 49, -68, 152, -100, 9, 143, -15, 20, -53, 105, 81, 57, 7, -71, -4, 67, 3, 74, -119, 16, -146, 9, -112, 9, 41, -53, 95, 49, 82, 0, 18, -38, 128, -142, -83, 138, 38, -76, 37, 7, 73, 119, -48, -216, -18, 46, 49, -19, 16, -117, 145, -18, 36, 61, -132, 48, -179, -146, -93, -12, -86, -83, -86, 37, 131, 74, -7, -24, 45, 3, 91, -27, 69, 125, 110, -145, -69, 68, -100, 37, -18, -147, 130, -52, -29, 68, 58, -218, 28, 30, 18, -12, 131, 83, 114, 18, -108, 50]
6653E0po0o2J51l0j61J87n7q2M3lP5j4r7J02j99J42p8J24J46k41j00L48k99J61
6678C9j13J23j12Nj8J54k50j04K93J16j16m4J16r4L1K92l35m6KL6j61K29N3j04
6702ho4J2pJ53k0j93N3K9m5L30k45LJ80l05J92Nk8n7K05k46J8J09Kq5P7K0j33
6729d8j8J06n0J35Pp9m1L5j96J45O7p6J52k72J25J71j19Ok2R1r7k2M3j4k0m3p
6756d1JP9k9K0l2m2l1QJ74j50q0jJ33r4o1J27OR9r3m6K32k61oL6J18L0o7j35R6
6785a0j7J68j34n8K5P9L5o9J9k85K96p0m0R4K3J01k39n8P0J05k3N7j23K17j12
6810E1j8k1K0J19j95J67k6k6JJ0j47R4Q5j17P8j38j26K22j50J61j71J45j39n4
6834a75K42k38J73j2j23R2p2J22k8Q1M6r7n9J50j59m1J14l4J59j37J36n9p6J2
$$ y = [50, 43, -17, -79, 72, 42, -119, 68, 11, -71, -28, -31, 44, 30, -67, 35, -164, -22, -100, 24, 170, -71, -171, 177, -122, 39, -74, 49, -63, -58, -76, 78, -172, -276, 17, 133, 17, -27, 89, -5, 26, 318, -17, -63, -61, -25, -186, 43, 96, -8, -72, -60, -67, 86, 66, -127, -74, -45, -90, 240, -5, -2, 178, -127, 65, 70, 42, -15, 190, -56, -38, 71, 73, -12, 65, 85, -48, -66, 40, -10, 125, 132, 53, 12, 47, -149, -4, 63, -13, 139, -133, -8, 163, 44, 50, 28, 119, 22, 0, 43, 29, 9, -34, -41, -40, 39, 10, 30, -2, -44, -75, -67, 107, -43, -123, -124, 9, -85, -146, -19, -13, 86, -7, -53, 179, -82, -88, -52, 66, 96, 29, -106, -10, -27, 141, 7, -51, -26, 53, 88, 19, 38, -247, 49, -21, -61, 33, 56, 157, -82, -140, -70, 35, 12, 69, -54, 163, 51, 33, 12, 32, 151, -44, 123, 97, 71, 72, 82, -65, 29, 114, -3, 75, -63, -189, 33, -117, 44, -127, 18, -121, -175, 67, -171, 2, -10, -133, -41, -113, 9, -19, 62, 108, 11, -48, 102, -57, -98, 16, -18, 141, 4, 140, 81, 5, 17]
6858A7p9R4J63k18k3P0j84O2K34k43J26J12n5n5rM2j76J7J19J05j7Q0r2m5q2J44
6884A07k75J88k28L11o7o4R3j25K38l56J11R1M0j99J22l2J25j00J45q0n4j23P3
6907e9J73j41J63j07j04R5J0J16o9j46O8j5n8QK10k09L4J82l3j88j4Q4j50P2p
6932h5K36j45J73j21k8n1k6J90k55K1P2J4J08k24J50k1m2q5J67Nj35j04J40M6
6956@j8L3n1O2M4O1l3n0K8q6J3J08j49O5j66J11k4L0l4l8o3J12j3K87j08k18J07
6983A0j44K57p6o3K0L9p5Q8k9j08M4j04K21j66%j9R5J15l10L50j9q8q7N9K25l14
7009g9J08K7m6L2o3m0k1J46n1J14j33M0J36j14k02J60j16J04Q2q4J36m0q4j43
7033a31J39M2k07J55j3Q3j5j09K3L8N9j74M0P4k65M38J54l67J75m8l4j12J4K6
$$ y = [17, -62, 32, 195, -23, -46, 24, -160, -98, 136, -107, 19, 131, 76, 21, 12, 54, -122, -105, 14, 119, 102, 182, 90, 45, -37, 107, -168, 20, -208, 103, 36, -28, 65, -60, 178, -178, -67, 24, 64, -135, -13, -45, 80, -20, 125, 45, -9, -132, -59, 114, -27, 136, 29, -75, 20, 30, 146, 77, -69, -1, -16, -74, -66, 144, -65, -31, 151, 118, -70, -84, 0, -150, -78, -85, 151, 6, 179, 58, 30, -21, -47, 143, -112, -91, -19, -5, 103, -121, 29, 8, -34, -119, 48, 53, -82, -186, -46, 0, -18, 15, -36, 26, 70, 131, 98, 48, 76, -10, 3, 111, -38, 27, -139, -28, -52, -22, -56, -94, -157, -45, -58, 229, 121, -97, 10, -134, 123, 47, -16, 4, 43, -32, 56, 27, -81, -37, -141, 80, -86, -86, -105, -10, 105, -205, 145, 126, 38, -49, 10, 235, -79, 29, 56, 10, 42, -21, -61, -82, 64, 13, 127, -6, 34, 170, 56, -146, 14, -102, 2, 84, 0, 136, 96, 12, -131, 8, 50, -157, -2, -15, 68, 53, -56, -33, 5, 64, -110, -70, 4, -261, 177, 331, -36, 139, 91, 57, -55, -41, -15]
7057a5J9J93l54K93n2j90J02j50J22j25P1O3j05Q5J47o3r8J61j61O3j05J37o2
7080b4%o4L7jJ44j7p0j07J67L7J2m8j63J23k3J5N0M7l84J86n1L5J3J04q7p8L26
7107A79j81j5m6M8l6O8rj99P7J02J7M0j75K96j55m8M8Q1l7J05p0m7k21K62k6r2
7133c4J44j78N8q1J9L7J66l0j90J73j68J49o4J09P7j67l4J66j93j1J34k02J08
7156a2r7M8J17j8k8q0l2JK53r7o3J17k78J17k0J47N5q1J6J39j76J97l49K9J60
7181F5o8Q9j04j44Q8J52K1j93J51J32k50J05%q0k9M3M3n1M4K0j71K21j69m7J40
7206Hj09J89o0p8M3J00l7j64k8J64l6J26j4n6j31M2o6K6J03r9j2Q6j08J02M6r0
7232e3N9J13j19K41j90m5qL8lQ0M5k69K00k45J6J47o0Jj9J42n3j9j01K08lr8k01
$$ y = [-15, 4, 197, -157, 136, 84, -106, -4, -154, -32, -157, -86, -23, -128, -43, 104, 41, -57, 104, -57, 6, -99, 38, -24, -24, -88, -51, -52, 92, 75, 5, -102, 65, 102, 114, 66, -97, 26, 3, 18, 68, 115, -269, -83, -134, -99, -86, 18, -69, -147, 179, -2, -17, -63, -15, -51, 17, 8, -191, -114, -12, 5, 45, -130, 166, 11, -37, 11, 92, 55, 160, 90, 43, -178, 84, 58, -34, 110, -68, -10, -91, -72, -35, 131, 101, -89, 84, -84, 65, 1, 110, 187, 20, -14, 152, -41, -52, 82, -120, -12, -109, -61, 56, 38, 10, -70, -102, -101, 152, 55, -8, 109, -169, -52, -72, 75, 130, 49, 65, 204, 28, 225, -124, -95, 65, -3, 86, -18, -162, -74, 78, 99, -94, 57, 189, -61, 44, 44, -36, -65, -22, 21, -30, 14, 34, -137, 84, -85, -132, 8, -101, 88, 28, -50, -7, 93, 56, -108, -136, 28, -8, 118, 104, 48, -83, -41, -107, -81, 22, -77, -89, -3, -111, -9, 37, -53, 6, 119, 0, 241, 51, 6, -2, 36, 33, 113, 158, -111, 89, -156, -140, 7, -53, -52, -71, 71, 18, -1, -102, 106, 103, 5, -196]
7259a96K17K6j03Q7k02K56m3N5k48K76j55L3q7J08J17j26rm0l4N6P1j97J26j07
7283a19J19J52l75J46J01p9J9P6j90P5P8L4J2q0k6m5K9R9j43Q2J50r8N2k05J88
7308E2K1j78N5J29j32N2lO4J96k63j54J38J86l12K09m7r7Mk4J06n8M7L8j87K05
7333D7kKo6j10J51o0J4K9lp7J54j9l8L0k10R3N8N2m5O3k25j37M58n2J6j44J86
7360A65k6k0k17J08kP5n8k28K94n2k3k04J46P3m7QrL1N3l5j52J84Mm5o4q9N3r0
7388a67p1K18K4k5J47j81N3Q5o5P9J33l83L86k09K9j84R3m2K06j46ok3q3K70j7
7413A21j38j7kQ4j40R4p5J11J10j81Q6j04j43K58J12j27j54J1P3L1j6Q5L5l04
7437a90J88J19j06j66K25l2jP3p4q3P5ol6M5n5M5j15J15l9j74J10j6J98L8j9k5
$$ y = [-196, 21, 47, -56, 31, -171, 85, 42, 97, -151, 125, -30, 3, -84, 24, 141, 15, 6, -34, -68, -12, 59, -138, -12, -119, 0, 152, -223, -77, 24, -55, -36, 40, -150, -75, 3, 37, 49, -31, -57, -102, -73, 26, -117, -35, 115, 17, 69, -136, 52, 73, -105, -50, 79, -53, -1, -4, 60, 256, -7, -161, -23, 163, -149, 60, 13, -84, -80, -104, 2, -56, -9, 29, -158, 47, 45, 47, -19, -129, 22, -38, -24, 5, 2, -75, 79, 60, 22, 52, -158, -65, -7, 45, 0, 63, -162, -299, 159, 107, 123, -21, 165, 139, 119, -98, 10, 8, 83, 25, -203, 91, 39, 16, -188, -42, 31, -16, -8, -17, 14, 67, 32, -120, 64, 68, 23, -41, -130, -77, -167, -238, -20, 4, -21, 126, -55, -2, 83, 18, 97, 230, -153, 233, 24, 53, -131, -38, -80, 126, -20, -26, -49, -132, 138, 121, -17, -34, -36, 48, -92, 2, -73, 38, 148, -33, 53, -51, -194, 64, 176, 49, -105, -94, -21, 10, -6, 79, 114, -190, -2, 117, 11, -155, 70, 38, 37, 110, 36, -47, 28, 22, -14, 31, -24, 21, -94, 21, -18, -192, -82, -98, 100, 138, 119, 94]
7463I4K2k67K05n7J99k41J74j17K23k36M4J03j44j9J50j89n7J88j23P3P1j39L6
7486gK57l35J18Q2j27m7j36J43j00J98k13R2K25j74K0j14N3R8P3k01n6K02q8m3
7510h0j3K58l24K21m1jq2J15q6n5J30j19J75k62P4P3k5j36K92j22J13r0pl9J49
7535A18rk40J35P0K1k50J08k1n8J18P1j62j8J91m5K1j60J43N2L6j97K21k49l7
7559a41K15J67l32J18r9O3J11k24J12o2J7J85l2j38j6P5p7L7j96L38l59K59K9
7582E0j48Q7q9K43j87p6K58r4n1J1J03j19J7R8p9r5K5j43J59J07n9k0J64k82J35
7607A5J03k13P9o1Q7K4j2Q2j26N7J09r1j00q2J34J8p2k9N1n6k9J78o2N4p9j8j43
7634a82O8K33q3q1O4p5J58j39J49j37J27j06P4J7j96r4K03j9p7J27o9J83j84j
$$ y = [94, 116, -151, 54, -3, 196, -45, 129, 12, 235, -1, 43, 146, 2, -17, 133, -56, -113, 75, -48, 25, 96, -43, -7, 250, -85, 33, 115, -12, -59, -195, -52, -152, 46, -167, -75, 150, -24, -4, -118, -65, 33, 106, -95, -151, 51, -37, -80, -93, 165, -159, 62, 21, 20, -62, 53, -33, -88, 42, -77, 98, -164, -90, -17, -42, -178, 114, -8, 105, 15, 8, -31, 118, 109, -131, 4, 74, 95, -155, -47, -68, -126, -8, 63, -99, -117, 74, 29, 50, -110, 33, 85, 121, -76, 145, -104, -141, 74, 241, -91, 27, -72, -9, 102, -122, -10, -72, -55, 130, 98, -40, -56, 19, -58, -21, -217, 121, -238, 21, 50, -98, -11, -100, 143, -44, -120, 138, 44, -7, 4, 107, -12, 5, 103, 24, -71, -46, -189, -30, 77, 18, -2, 162, -120, 15, 118, -95, -16, -77, 10, 34, 22, 104, -22, 35, 144, 53, -47, -129, 5, 23, -49, -78, -27, -83, -112, 66, 4, 58, -21, -39, -182, -114, 119, 36, -45, 19, -56, 102, -37, 112, -25, 102, -4, 70, 87, -109, -203, 0, -19, -96, 31, -38, 145, -39, -40]
7658d0k4M0k9Pq3K85o2j6j02Q5j30n4L35j05j24J33j92R7q7R0j11J31j3j21J32
7683D2r4K01k35J10J6J79j08p9j71J78N6r5j9M2k9J9j5K34l12l7j5J25J05j60
7707f2J28k12K02N6lk14L3q5K29l4j38J36j6j5p3j0LR9K5p3K7j77J62j20K43n1
7733F0l8j05J78k33J96m0j41J09j04K29K4k76J36J41k13k3K48o0j23P4j63R6K1
7756gk5o3Q0l7K27j10j0J11j72j83J86%j35K20m7K4lo9n8O6k1J81j29n1J09k67
7782a83K07OP2j10pN0N7m8l4J55j43jk56K78j1J01k38rN0O9J80l41R1k1J01k0
7808ek1N6m2l3j38K08J02j33k17K42n9J7J41r5k1j11K61o3l19K35N1j84J07N6
7832C5m0p0K4J10j53J88j89J54j02J02j53J92j75j0R2L3L7P5j36j05RP3Q0j45
$$ y = [-40, -64, -24, -53, -46, -129, 156, 94, 78, -24, 61, -69, -123, 212, 107, -17, 116, -76, 21, -66, 24, -87, 44, 31, -90, 42, -52, 149, -86, 24, 40, 219, 111, 32, -139, 39, 95, 0, -19, 23, -6, 13, -2, 232, -80, -117, -132, -7, 98, -62, 66, -146, 56, 112, 109, -105, -72, -157, 72, 38, -100, 36, 20, 5, -68, -78, -75, 24, 49, -24, 3, -174, -12, -132, 111, 60, 22, -83, 95, -138, 58, 18, -123, -14, -118, 111, 135, -141, -5, 136, -77, -100, 148, 88, -35, 39, -124, -28, -7, -32, -95, -15, -52, 175, 65, 55, 166, -6, -189, -3, -3, -138, 82, 35, 59, 56, -13, -71, -5, -26, 155, 26, -25, 84, -183, 24, 30, 102, -8, -15, 35, 92, 44, 10, 165, 22, 21, -235, 43, 32, 133, -105, -114, -64, 5, 185, -156, -65, -86, 15, -5, -26, 30, -12, -45, -183, 25, 127, -6, -223, 19, -40, -23, 118, 23, 2, -109, 152, 89, -230, 5, 56, -128, -21, 35, -5, -75, -51, 59, -94, 94, -95, 59, -43, 59, -94, 98, -77, -87, 5, 38, 75, 150, 14, -91, -82, -9, 71, -74]
7856g4o9J50J72j15L0J10o3j03k07J90pk8M5j01l1l1J36j51R8o4N8R1kM8k55Q8
7882h5J17j26J49j11m8J48k07L51j50p8M8l7J77j48J18j99O2j04J03q9K10j75
7904g4J69j54P1N9k25J45j09J97M8l04M8J78r5J2j2J07j29NJ33l6j55J67o7N4
7928C3J8k77K53k27O5K01Q7j80J40N7j15k96J90M5J69j69N3RO5j31rQp2J40o3
7953foL4Q9l6L5j11j05P5L9J28n5j11r2J55o2nJ01j20MO5n8J32k07K64ok86K66
7980A21J3j45k4M0J04J22j42j10J48j26J70j22J12p7k33J90k22J25J33J8j87l8
8002a30K60k89J23J44j81J65p7j02j23M66l08Q9K8j90J19RK47j47k07PK88k05
8024a4J64j29K21j50l3p3M5R8k77j5Q6J42l9m7J05j63l5q6L61r0q6j11J78n7M4
$$ y = [-74, -143, 7, 179, 64, 94, 204, 141, 38, -169, 21, 14, -14, 31, -70, -101, -132, 4, -147, -49, -113, -55, 36, 34, 82, -173, -85, 32, -94, 55, -56, -104, 44, -163, 188, 38, -40, 8, -29, 148, 0, 118, -81, -19, -123, -20, -109, 101, -74, 95, -59, 12, 71, -154, -9, -118, 79, 127, -177, -129, 49, -46, -34, -46, 61, -68, -63, 70, 34, -121, 46, -21, 33, 51, -226, 27, -200, -135, 66, 153, -27, 113, 170, 55, -241, -51, -6, 163, -6, 47, 56, 121, -10, -19, -11, -83, 57, -6, -12, 22, 111, 75, 110, -1, -106, -31, 8, 136, 81, -30, -122, 33, -29, -34, 67, -53, -49, 16, -42, 90, -117, 147, 141, -145, 121, 134, -11, -35, 5, 109, 231, 89, -21, 127, 1, 171, 49, 161, 84, -149, 41, -181, -56, 77, 95, -92, -130, 130, -159, -36, 108, -73, 92, 15, -87, -210, 256, -52, 37, 65, -125, -6, 3, 250, 103, -104, -97, 191, -14, 150, 21, 242, 92, 59, -14, 31, 129, -148, -163, -77, 65, 26, -21, 84, -79, -114, -200, 161, 71, -15, -126, 52, -5, 39]
8049C9O8n0j21o0N0J42M1j44J56j89O4J21j40pk5J47M4j72J25q3N2r3J14M8n8
8074F9PJ41j36J8j34J77j46M5nj30LL3j4J53l0m8r8J17L7q7M5m9J00n6n0J2N8
8101C2p8R1j42P8J23j08K04k67P9P9j56J21r2O8k13L17j24r0N2J22j41k9J7O0
8125CJ51j48j0m0j3p7K64o3k60N7J01J13j07q0R8J75r4r8P5njl9J59j12J07j24
8151C2k%k4k1J01j3q0nm0K8L1K29j85m0N5j16o6R2O1k1m8J05j18o2J7J18q1P6
8179B3j33J44N4k8r3R5K5j49K1J11l2j16
$$ y = [39, 107, 57, -64, -124, -74, 68, 109, -35, 121, -68, -4, 117, -23, -30, -55, 92, 136, -36, 89, 6, 58, -35, 79, 127, 69, 76, 217, 81, 99, -35, 142, -4, 41, 36, -94, -91, -58, -72, 81, 51, 3, -95, 22, 59, -28, 17, -32, 68, 12, -38, -26, 32, -46, 45, -97, -19, 104, -4, 200, -67, 12, 91, -65, 56, -36, 32, -181, 136, 12, -78, -26, 96, -45, -74, -57, 3, 154, 6, -4, -44, -57, -134, 130, 67, -193, -136, -35, 78, -29, -109, -11, 164, 70, -28, 47, 42, 41, 2, 161, 49, 156, 32, 30, 30, 6, -15, 86, 73, -7, -12, -52, -24, 7, 236, 51, 11, 66, -50, -116, -24, 37, 16, -32, 73, -45, -107, -90, 28, -53, 23, -110, 34, 88, 60, -33, 62, 87, -62, -41, 70, 38, -78]
8191g8
$$ Imaginary data points
##PAGE= N=2
##DATA TABLE= (X++(I..I)), XYDATA
0@%%%%%%%%Qj6J6k4L2m0M8n6P2r2J16j43J73k06K41k82L36l98M63n35O18p13Q18
31D36r33J062j206J364j538J730j942K174k429K710l013L344l708M105m538N011
47B629n529O096o715P398q151Q979r901J0933j2088J3396j4888J6608j8619K1003
61A1151k3889K7463l2026L8091m6592N9463q1522J29648m24330J97777L26258
72A81492o08870K50002L01337r8791j37709J62353K2081k1188m3764J5941K5987
83D8871L934p8351L5072L0836l9381l1010M9409r802k5510P695K1812j9215J013
96d627O439K616o760M718j908K520k191K63q82K354k860O05J10L74j846J490l63
113E2l49q2P63p64L15j35K02j03J58k60J38l5J03J05j4O4m04L39k3J70k42pJ22
$$ y = [0, 0, 0, 0, 0, 0, 0, 0, 0, 8, -8, 8, -16, 16, -24, 24, -32, 40, -52, 64, -79, 94, -112, 129, -153, 183, -215, 248, -287, 331, -382, 436, -497, 565, -641, 723, -815, 915, -1027, 1147, -1282, 1428, -1585, 1759, -1949, 2156, -2382, 2629, -2900, 3196, -3519, 3879, -4272, 4707, -5194, 5739, -6349, 7047, -7841, 8767, -9852, 11151, -12738, 14725, -17301, 20790, -25802, 33661, -47861, 81787, -342543, -144766, 181492, -427378, -177376, 123961, 25170, -112539, 49814, 71895, 50707, 6943, 22884, 48871, 52805, -25546, 9526, 40362, 981, -30029, 19380, 9578, -15932, -8237, 13575, -5640, -4627, 1812, 4428, -2332, 2386, 478, 2998, 807, 1070, 188, 2542, -318, 287, 397, 771, -1075, 415, 52, -297, -379, 384, -380, -65, -200, 2, -101, 57, -203, -65, -100, 3, 108, 94, 158, -246, 93, 70, 240, -2, -9, 113]
136A13j07l7k6J50j59L7M5j8L8j22M8j12J95pj08R7o9K24k86JK08k08K46j40P
161A0J57j42q0J34k10l2J70l0k9j4q2L1M7o5q7L70j31n2R1j2j5no9J08k18J04
187e1J01j87J40l9L9Kj27K96j78M2M8p5Oj60j9N1O0N0J5k7O6j37P3K13j43p3j47
214a61K52j2j34R0m0L6J9o4J21q0l4O2O8j12J45j58j69M6K33L0M7j24k39K79q3
239A8j4j39K3J25nJ4O4q6N9m9Oq5J30p1o9J50m4P7j65M7j7O4j45M3K13j65n0j27
267a98J34J24j13R9P1k17J73r6K7K43j36j64Pj10K54k02J00J06j47J06k04J36
289goM6rO5j98R0Q2k1j2J05j41j79K23j85j35L00m1L9j3K5r0q0J90m9k5M2k50
316b34J79K17o6p4j58J66o4K00k9j90M5J26n9j48J55pO0j00l0Q4j18K30qk67j9
$$ y = [113, 6, -31, -57, 93, -66, -29, 16, -2, 36, -86, -38, -150, 45, 38, -70, 27, -42, 182, -104, -103, 105, -103, 143, 3, 10, 167, 25, -55, 79, -131, -163, 7, -23, -52, -66, -148, -117, -70, -135, -222, 148, 17, -35, 56, 44, 29, 24, -45, 63, -155, -51, 50, -137, 3, -36, 3, 5, -122, 174, -4, 38, 86, 11, 17, -143, -162, -111, -51, -1, 14, -13, 53, -84, -11, 202, 59, -14, -161, 91, 79, -55, 35, -5, 31, 50, -14, 107, 27, -7, 55, 123, 11, 156, -2, -171, -125, 108, 138, 185, 61, -178, 101, 18, 4, -135, -112, 13, 8, 22, 86, 0, 59, 10, 16, -69, 61, -10, -79, 71, 27, 104, -61, -14, -31, 33, -112, -69, 144, -21, -71, -198, -64, 60, -53, 46, 117, -100, 73, -23, 4, 247, 111, -53, -46, -156, 98, -104, -4, 102, -45, 61, -143, -7, -13, 33, 24, 89, -109, -19, 63, 42, 30, 135, -6, -185, 38, -147, -282, 18, -23, 16, 3, 28, -62, -142, 48, -1, -26, 16, -234, -55, 162, 96, 22, -136, 30, -34, 166, 137, -53, -8, 118, 59, -89, 66, 59, 119, 19, -11, 73, -45, 185, 177, -90, -109]
341a09J75q1j30J36RJ3K1J6r2j9J3J56r0Ok9M6r1P9k3R0r4L5J34qk18m0k0J73
369E8j12Q6k3k3j34J27j1Q2j2j21O1k15J13N8l6L0Q3P6k32lJ22K0O7k41K60k27
395a47J31j05J36O0k21J13p4R0q1J84j28r6J67l9j6J95k26J10p1J35Kj71Q9N5
419I2n8j50Q2o5n7K40pj13M6o2L8K8O4O3k13J10J46j88L9R5m4l4K7oL4m9Kl1r9
448g0n2J20lp5P4j14K85k12N6K8J03l50J14K04k18L67j57j79J04l4k4O6q4J83
472A32j21m2NK57j48L1p2N2l5M1j52m9J99j4j9o0q8kkJ70q5KJ00k3j52J57l00
499b18J40R3q4N7L0l3RK44j45p3p2Q3Kj3J08j48J0j09J26P3J12k11j0MO3R1k51
526a22o3J80l6L5r8J08j03m0L6J48j33O9Q5k8L5l5r2n3R6N2j20N6j55P9K53j20
$$ y = [-109, 66, -15, -145, -9, 0, 13, 34, 50, -42, -61, -48, 108, 18, 24, -5, 41, -50, 29, 6, 96, 2, 37, 171, 163, -55, -95, -115, 58, -54, 32, 9, -14, -148, -21, -32, 50, 38, -83, -22, -237, -124, -66, -102, -72, 11, 87, -145, -148, -26, -6, 61, -180, 80, -147, -16, -121, 15, 75, -146, -33, -107, -17, -98, 86, -42, -138, 29, -10, -26, 169, -57, 53, -18, 117, 119, -52, 37, 92, 34, -116, -34, -99, -156, 84, 77, -36, 10, -52, -14, 14, 78, 141, -72, 38, 184, -4, 35, 130, 86, 52, 79, 73, 107, 58, 60, 29, -70, -122, -2, -5, -80, -6, -120, 165, -47, 9, 37, 140, -210, -96, 108, -110, 257, 100, -79, 25, -9, -33, 33, -51, 132, 11, -31, -26, 231, 83, 114, 42, 94, 59, 100, -52, -101, 98, 84, 65, 5, -83, -85, -87, 83, -2, 0, 100, 77, -75, 82, -218, -78, 15, -69, -12, 18, -15, -6, 238, 93, 20, -52, 31, 33, 20, 128, -20, -10, -119, 7, 80, 192, -19, -29, -25, 38, 129, -122, -185, -5, -41, -6, -104, 4, -99, -139, -103, 45, -88, -19, 66, 38, 73, 38, -54, -107, -11, 41, -79, -23, -178, -99, 154, 34]
552C4OO3J7j4j56p6K90k75J76k8j48J70N1p8k5N8q8J12l9p0J1J72k45K6K06k37
578h7M7l4O5l1P3k38L14r6j7q0J83j73J09j29J10k8j00J08J8M0P3k18J03Kj2l6
604c4r5J60l3O2m3j3L1p2L2j27O0J8M7j4L6K1j65J61o4J50j93o4N2N6j6M3J43
631A39j96J09L6n6j27P1j14K74j04MP6j09j77J58J3P0q3J3J47k13N0L9j69R1j7
656g5k8P4K2J9J6O0j81Q3J20O0l02J01R0j65J03m7J33Qj6j18J77j25j81J94N0
681G2j7k38J54J21j17L6k32K72N1j8K1l18J07J57O4l18N8L38l01J47O3k08J15
704IO7k12R8J46j19q0Q8R8j79J19p3n6J58n4J5r4J6O0J82j8k10K13k08j5J44j46
730e1K76k30N0p1M9j07J23p0N1M5j08L5M9j5n5n7Mn8N1JJ06O3K8j71j14L45j97
$$ y = [34, 40, 103, 120, 106, -50, -126, 164, -111, 65, 37, -111, 59, 110, 32, 7, 65, -23, 89, 50, -20, -9, 163, -82, -56, 150, -87, -40, -74, -9, -40, 33, -205, 109, 13, -4, -84, 99, -74, 35, -94, 16, -12, -112, -4, 14, 54, 127, -91, 12, 14, 2, -34, -129, 31, -2, 60, 17, 4, 35, -37, -5, -132, -72, -54, -7, -21, 15, 36, -129, 32, -32, 118, -75, -139, -87, -31, -47, -4, 139, -57, 52, 88, 32, -95, -24, -138, 136, 32, 36, 112, 3, -174, -16, -3, 67, -16, -3, 144, -69, -19, 20, -149, -58, -75, -103, -29, -7, 12, 28, 88, -93, -10, 110, 170, -132, -31, 59, -106, -3, -50, 83, 91, 75, -43, 134, 9, -172, 22, 72, 55, -183, -29, 92, -25, 11, -221, 51, 102, 84, 105, -213, -106, 51, 115, -203, -145, 193, -108, 39, 102, -106, 9, 76, -136, -38, 108, -11, -91, -3, 95, -84, 35, -38, -94, 64, 10, 25, -69, -53, 7, 189, 171, -39, 174, -34, -49, 95, -51, 225, -5, 45, -26, 23, -84, 39, -31, 20, 65, -43, -8, 41, 26, -29, -86, -82, -140, -89, -88, 18, 81, 109, -62, -176, 169, -28]
757b8J24j71J63l8K9p4j09K7Q2j01l9J22l9j20N9m9K12r4Q2k28LK05j5J5k84K52
783a4k5p1K36k16J46M0j37K12k16M3J6nq2J51l4m9J10j64N9J4O3L4k77K02j89
808a53j4K07j01R2r4mo3J36r2P2o2J35k06Q5m0Q2J36j24J35j99j7P8N1l8N6j37
834g9N1J84k31p4J04m7k7M3L13k61k3k3o9J35On3j3kO5j51K10M8j55NO7o1r7k4
862a59J91j3j35M6J18j85K35m6k0j05J22P1j12j30K71k53J85p3J91j14L1j90J12
885C8o2mk9p0J15k4j27j3M8K34j91J01o3M1O2jq0N7J25k48Q4j09L1o3L10j26k48
912b12J76J17j9L7o8r0O0o1O8p8M2J42o8j34l1J15m6o7J95j69Q1K8o2K38l51J76
938A9O4k18J83p0J38o3j50J09k39L0J26l8J63q8k3N8m9L2J55j17mO5k6k00O8P7
$$ y = [-28, 96, -75, 88, 50, 79, 5, -104, -77, 5, -96, -135, -13, -52, -172, -113, -162, 50, -44, 38, -190, -187, 18, 3, 18, -266, -14, -39, -110, 126, -90, 56, 96, -41, 171, -45, -2, 14, 9, -73, 78, 44, -5, 105, -59, 0, 14, 77, 111, -166, 36, -153, -167, 40, -61, 31, -63, -67, -130, 6, -86, -14, -76, 59, -147, -62, -102, -20, 116, -8, 127, -72, -89, -11, 40, 2, 58, -79, -28, 156, -75, -149, -45, -92, -119, -76, 237, -24, -47, -70, -139, -4, 2, -51, -64, -66, -1, -152, 58, 106, -49, -44, 23, -38, -135, -159, 32, 19, -116, -70, 48, -137, 98, 52, 32, -73, 49, 120, 8, -122, 149, -104, 81, 8, 199, 85, 116, -74, 38, -24, -28, -57, -127, -12, -36, -163, -176, -128, 106, -85, 16, -47, -6, 56, 55, -25, 32, 157, -91, -7, -116, -85, -148, 162, 36, -212, -36, 81, 62, 99, 31, -59, 1, -60, 8, -70, -28, 114, 46, -88, -119, -4, -50, -117, 78, -91, -10, 18, -44, 194, -157, 19, 83, -135, 48, -22, 116, 53, -97, 12, -227, -197, -71, -109, 54, -34, -57, 1, -48, -16, 139, 22, 18, 83, 57, -143, -75, 2]
964Br5J71j51L51k91N5j25m0M9J70Lj36o4R1j17P7M5K55k34J6O4P7j32k2j7J4
990A6O5k1M7j38J16n0Rm5j06J22j32J86M2n0k76J9J87r6J69Nj61K24j86P6n0K7
1016alq3RJ39l5j6o8lQ3RJ52k25P1k71L18m5j8j16J91j60j4j08K01O2p3R8k1P4
1044A47j18NJ8l5j46J74j59N2J34j3j0l0n5J1Q6N8q5Pk0l5O3j2J07k42J3jp7K57
1072I4k40K50O6j16k20J36K8P4j9Qj03M2m9j43N6K36l6Oj45J05n2o4R0K6k1M5
1098E4l7j1LM6P6k76J67k0%P2n9m3J5J1R2q2P2j57J01k1j20J7J65j25R9N9l6j64
1126a02R2P6o4q6mJ66k01m5J70j95j9K13P9qK1k73J42J22j11Q7j08KP2j8l9o3
1152i4M5J09o3j20J45J3k4P5q0lp7j1m7K03j45%J47K7n3j03pn7J13l8K5o2J23
$$ y = [2, -93, 78, -73, 278, -13, 42, -83, -123, -74, 96, 99, -37, -101, -10, -127, -50, -5, 250, 16, 32, 96, 173, 41, 19, 2, 16, 81, 60, 107, -31, 85, 35, 44, -1, -107, 15, -117, 69, 111, 61, -215, -196, -9, -105, 64, 69, -92, 132, -54, 22, -28, -1, -4, -87, -78, 61, 26, 10, -58, -61, 22, 31, 183, -42, 29, -242, 76, 31, 13, -103, 88, -72, -86, -194, 7, 69, -4, 94, 73, 147, 29, 34, 52, 17, -129, 45, -114, -62, 72, 59, 49, 19, -36, -25, 61, 119, 34, 41, 21, -14, 49, 37, 144, -98, -85, -86, -163, 94, -146, 104, 170, 54, -166, -30, -2, 72, 53, 61, -42, 0, -49, -192, -136, 100, 64, 70, -75, 30, -22, -86, 4, 30, 9, 54, 17, 6, 9, 55, 131, -145, 22, 2, 2, 74, 15, -28, -13, -2, 90, 8, 80, -77, 24, 3, -117, -100, 65, -60, 39, 98, 62, -102, -10, 66, 2, -84, -88, 78, -123, -168, 2, -193, -212, 1, 80, 72, 93, -180, -38, 84, -27, 60, -48, -46, 26, 8, -31, -94, -49, 60, -3, -123, 22, 35, 11, 86, 6, 3, -74, -85, -132, 71, -74, -74, 73, 100, 47, -56, -63, -120, -7, -45, -20, -82, 41]
1179D1K2j16m9o9K33K0J27l23L41o8j03j00nkL6K0M9n8j1J28j88m5P0j0J44l4
1205E0n6n1J7n5J56O3j79O4q6Q3l5m6j3K2N9nj15M7J21j97J26J96k51k8J67l7
1231A7k08P6J35o2j12R4j07J01LJ06J49j65%j47J78k2m7J36j39l6K57j25j03J55
1255A34q4m4K0O2j01K5R9k23K70l2j22P5k6q2nJ67j00j00J20q4p7R6J78j27J19
1280A58j66P0K6p1O7QQ6k26k8Q8R4j92O3L8R6n0r4P3o2Q3p0p9J01r3P2P1j3j72
1308a22J29j70J12P0Or6o1Mj7l5L31p2k23L4QJ69k6J07j72O8J33j71O8j77K00
1333I7j02L9R1j55j11J68rJ00j48J59j09j02JK29l26K63j38j02J95N8j40j63J56
1356d9N5j2mP8j93J31l4O9j18K0P8J43j09n3J78j50k55J88J05r9J08j8J6r8r5
$$ y = [41, 63, -53, -102, -171, 62, 82, 209, -114, 227, 159, 56, -44, -49, -51, -15, 5, 54, -4, -15, 113, -75, -120, -50, -60, 84, 50, -6, -57, -40, -95, 61, 124, -55, 9, -77, 6, -29, -75, -88, -66, -7, -12, -127, -80, 41, -156, -30, 166, -85, -113, 54, 17, -191, -115, 20, -42, -154, -60, -167, -66, -63, 43, 192, 27, 27, -120, 58, 36, -11, 125, -14, -50, 207, 82, -21, 134, 50, 6, 26, 88, -13, 12, 111, -112, 158, 126, 4, 79, 53, -29, -34, 133, 33, -67, 53, -31, -108, -12, 166, 39, 158, -8, 62, 88, 17, 84, 92, 178, -48, -76, 12, 106, -86, -23, 15, 111, 61, -33, 40, -22, 61, -9, -88, 13, -80, -8, 63, 50, -122, 7, -163, -51, 19, 25, -71, -132, -128, -145, -180, 151, 79, -144, -110, -102, 67, 41, 148, -24, 44, 177, 6, 74, -103, 97, -5, 34, 125, -30, -141, 27, 18, 118, -30, 129, 20, -82, -81, 148, -178, 85, -53, -155, 40, 98, -42, -205, -49, 6, -6, -10, 68, -125, 6, -28, 41, -77, -57, 21, 164, 55, 2, 180, 30, -225, -37, 68, -31, 77, 59, 75, -23, -118]
1381a18k2K52l7K3J06k1l63K50j17L2o9l5K19q5J20k9q0k1j23J55M3q4n1J23P7
1406A45k77Q7R2j28O7l8%J51j55K6R0m4o6RJ51n9K8j29j16O7J16q4O6l6L8jRq9
1434h0J0P8P2J37j41j23K49M0l82P3O3Lm6R5k2j20K11l6l9m1r3OJ31n0j70J26
1460d9K7l0n0K40p1k02J56j2q1K50L2l92Q9J54KKq3L0Rl7Lr2J74r0j03J8n0O2
1488i4R2o3Q1j66K44k16MJ64mJ2j44J21J09j32j14J98rj75O0O8n2o2L3k1M2K2
1514bj06J32j46j6J23r7K28pO0j94m3M2O2j3j89J03Q3n5N7O3r7l2M0Q0j41R0n1
1541b6j58M9J98j86m1R6m3J38mJ32j39J13q5Pj95J86o4J41k08n0K09j47K75j94
1565DlJ8k9J66%K6j79O4ML1J2o7oJ65j50j67J28j84J54J96k31LM1p2O1q6J80p3
$$ y = [-118, -140, 112, 75, 98, 204, 183, -180, 70, -47, -15, -84, -119, 100, 15, 135, 106, 26, 5, -118, 37, 80, -4, -55, 68, 145, -132, -45, 47, -81, -14, -52, -52, 99, -56, -30, 60, 16, -50, -41, 110, 51, 79, -50, -166, -99, 17, -67, -1, -37, 1, 0, 9, -80, -70, 8, 80, 217, 76, -47, 202, 242, -140, -67, -4, -1, -47, 48, 26, -94, 117, 81, 42, 1, -92, -86, 45, -5, -175, -49, -22, -52, -102, 138, 67, -135, 21, 9, -72, 178, 210, -182, -93, 61, 63, 65, -18, 12, 21, -16, -13, -105, 69, -21, -124, -106, -156, -94, -2, -65, 16, -150, 94, -122, -118, 46, 42, 54, -90, 31, 140, 8, -106, 92, 83, -92, -32, 36, -16, -78, -45, -66, -24, -2, -108, 24, -122, -138, -15, -112, 116, 109, 169, -25, -68, -26, 36, 23, -166, -63, 20, -35, 22, 85, -12, -44, -4, 76, -65, 25, -26, -184, -135, 63, -123, -164, -68, -111, 27, 23, 155, 16, 129, 44, 51, -144, 42, -22, 119, -89, -139, 70, -77, 198, 4, 1, 19, -10, 156, 156, 182, 3, 67, 71, 102, 114, 47, 41, 206, 56, -111, 17, -167, -13, 183, -48, -45, -4, -76, -15, -101, 79, 6]
1593Fj4j03K27k08K1n1R6o2P4j87J39O4q3J40r1Q2O7o6J35j70J69j00j12R7j89
1618a19J36%N9q7rn1K55j96K05j29p5J38j72J78m5n5J87j85l7m6M6R0N8p3N2j86
1644f1O7J99j98N0j38k1R4m7J43r4m7J42j64j00J67L8j29K63j78J60K0k25k8K06
1668A19m3j9R6j01oL2k46K97rk08L10j81J5j28Q5lP6j15rO2j83K78o0p2O0l9n9
1695e1J35o0j15J10k64J59J24r9J02j05P5j57R0l4L4J53LK3j57O4k9K07j44j42
1719g8J39j2l5J42j2l7k04J93j42P7J68j66KMj0J43k34L6on7O6l7J24o4K90k03
1745H7k20K34jQ6j13n2R7n9P6j16j19J05j0K8pl7j3j56J10LP4qmj89K36J4j62
1772a16K27p5j07M8J67k12r5J42M0N7j60K75l28O4J49k99K28nMOJ0k83K93o3J47
$$ y = [6, -8, -111, 116, -92, -71, -122, -26, -88, -14, -201, -62, 2, -81, 59, -32, 50, 117, 51, 186, 16, 185, 85, -27, 70, -119, 17, 17, 76, -11, -20, -71, 184, -12, 193, 64, -11, 127, -45, 133, 88, 33, 220, 35, -2, -48, -2, 88, 146, 73, 125, -61, 6, 205, 7, 57, -81, -102, -8, -55, 88, -6, -53, 89, -75, -175, -8, 30, -99, 164, -14, 146, 166, -59, -87, 119, 76, 57, 153, 52, 46, 78, -168, 129, 120, -88, 222, 41, 56, -72, 13, 10, 86, -29, -38, 24, -159, 119, 59, -13, 47, 8, -51, 84, 24, -91, 19, -245, -86, 38, -61, 41, -64, 11, -146, -56, -90, -56, 97, 100, 123, -34, 30, 1, 208, 64, -78, 61, 49, 14, 156, 144, 107, -97, 96, -46, 31, 199, 33, 35, 39, 29, 172, -62, -26, -32, -89, -23, -60, 64, 0, 290, 87, -133, 101, 100, 186, 73, 21, 118, 59, 135, 19, -100, 5, -5, 23, 16, -21, -34, -190, -80, -77, -3, -11, -15, -204, 32, 46, -116, 111, 36, -71, -23, 144, -68, -163, -21, 19, 76, -84, 191, -137, -73, 76, -223, 5, 0, 4, 10, 20, -263, 30, -33, 114]
1797A14l08J28J07k53J52n3L14k46K3L6l6P0p3j27J01n5K07q1L9j67J45P5m3n5
1821A4j11l9l6K35j23on4N4P5M7q4J11j14nL9q6R0L1p5O6Mo8J03q5P0M2K5j54
1849c4O8l1kM0k9N3n0O8L9j48OJ13j34J31j10O5k19K72j29o4O5M4J02j47L1q4
1875h4J23R9j20K00j42R6k21k9K26l44J33O7j16K31j50j16L7J67O9j58k1J33j69
1898h9N4M0r0P3m2m5K4k2p9J51j5J03J45j15j00R2j90R7kL6l9o9N3Q5K8k84J58
1925d2J23Q9k58J13J57l35Q1J09P0m0M2j78NN3Q8o1J30p1k09j1J87q0L5l7M8k5
1951a7K5%J20j01J48q6j64J69j06j42J06j2J47j86RM7P6Jo2l2N3K9%K9M4k47J79
1978B7n5m7K81k61M9M9o9J06j74N1O8nR3j29J59k03P7R2j81M4O1j27K10j76l1
$$ y = [114, -194, -66, 41, -212, -60, -113, 201, -45, -22, 14, -22, 48, -25, -152, -51, -106, 101, 20, 59, -108, 37, 112, 69, 14, -97, -136, -172, 63, -60, -66, -120, -66, 9, 56, -28, 83, -31, -36, 3, -83, 7, 38, -37, 29, 33, -35, 68, -17, 53, 95, 120, -34, 34, 3, 1, 41, 12, 65, 15, 83, 122, -26, -20, 93, -41, 90, -20, 45, -174, 98, -31, -95, -30, 14, 116, -31, 0, -84, 39, 138, 18, 218, 76, 172, -49, -78, 148, -196, -63, 4, -112, 119, -31, -147, -110, 57, 126, -32, -53, 80, -89, -35, 5, -85, -12, -54, -99, -75, -97, -176, -25, -40, 63, 208, 93, -7, 85, -105, -8, -10, 26, -13, -82, -29, 56, 84, -200, -42, 81, 170, -88, 25, 182, -153, -72, 37, 107, 67, 109, -69, -64, -11, 77, 16, 146, 75, -134, -145, 42, -38, -3, -40, 8, -17, 8, 8, 128, 27, 175, 89, -75, 94, -12, -154, -48, -60, 87, -99, -90, -43, 33, 34, -28, -60, -7, 22, 22, 51, 95, -152, 27, -28, -75, 206, -55, -6, 43, -26, 80, -94, -43, 25, 20, 113, -16, 143, -60, 17, 109, -72, -28, 33, -94, 116, -60, -91]
2003i1k0K35m6PJ37j79N3q8m3K3r7P3j5Q6q6J60L0j97M1O5l2K3L0j70J0kQ7l6
2031d2l9Q6q3J88j36j17J66K9r4J12k50J20Q4P1r1l5R7l9n5J7R2K0k16K77L2l18
2057a24J14j51K08j51J13r4J43k16J03k1J43o7j3K0k8QR3n0j53O4k5J34L6K2r5
2082A3q7J38j48J09p1L7M4o8J08r8Q8k5rn4j99J90J33j75P7J08m8j55r2P2K52
2107A40L9l8o2j39m8J80n1q8J34k1mk17J45O9N8m4k4p0j50J32q5K64j73m3ML01
2133B09k33J21m6q7J29k04K0L9J30L2N0k07J21P1K1k14P8o8j3mJ92p4k25J38J68
2158A44k03J7J17j45J40j0m1p7Q1j12J22k5RO7j07O0j57J80r2j2N9n0J83k07J42
2183H3q8J78j53j60K50j4j57J46j7j97O8j10K15r1J43k4j9QO6ol8p9rJ75k1j72
$$ y = [-91, -111, 124, 78, 85, 222, 43, 96, 8, -35, -12, -109, -36, -51, 35, -51, 109, 139, -58, -17, 48, 16, 39, 69, -101, -91, -93, -6, -42, -81, 5, -78, 110, -26, -143, 23, 52, -42, 70, -180, -60, 24, 95, 4, -31, 66, 27, -28, -11, 81, 101, -115, 162, 194, -124, -10, -161, 47, -104, 9, -85, 58, -158, -55, -76, 67, 0, -13, 7, -21, -13, 80, 30, -123, -59, -84, 50, 86, 108, 13, -74, 64, -84, 25, -46, -9, 35, -33, 75, -23, 65, 40, 31, -23, -222, -32, 101, -74, 3, 111, 63, -92, -184, -112, 140, 179, 141, 79, -60, -108, 72, 21, -67, 67, 46, 42, -175, -30, 39, 97, 53, 29, -41, -191, -59, -144, 120, -53, -96, -92, 209, -24, 97, 51, -36, 93, -111, -91, -52, 78, 110, 160, -47, 74, 145, 166, -48, 30, -38, -51, -55, 137, 63, -162, -24, 144, -59, -42, 75, -70, 70, 60, 19, -58, 23, -89, 33, 8, 17, 84, -23, 37, -120, 60, -32, -44, 15, -35, 148, -59, 83, -5, 173, 20, -140, 110, 96, -61, 85, 68, -129, -61, -171, 44, -47, 96, 72, 53, 61, 127, 121, 83, 4, -5, 170, 149, -23]
2209b3M4p3jj1J40j32M1J17l8k61L20o6j43L26k33j17j1l8L35j63K0p5k3K79j91
2234B3r4J90k5k14J69m2L5j68J24Q1p7N6k30J71Jnl6M9J19r0n6J41k7n6j6j11
2260h8R9Q1j16j47L4K74M0k89J93k60K60j80N3J63j36j1K7P4k08J73k8m7K21k84
2284a02j57K79L8J04q2o9K6n1L3O4j22J6P3L8m1r7J22j56J42j4j9J06k26K20j47
2309b2o4J85m3l6M0L8m9j1j29N7J36k9j13J0Pr6J3K36j74J18K4k5p1J6N1J59j76
2336E2q4l0J47j13PM6p0Q3m8p3K45k37M2J29j62J07j26J6J36j40r5P6N6L1j4N6
2362C7mj06JJ00n4J47j70M3J26k50R7N9j40L3p9Q5P3n1j6K63l54J20k1L6K5P7
2388G7k41J98k2j39P2P2J17j95R0l2j6r3J15m2K71j28k28J14J7j2R5j6P7k15O9
$$ y = [-23, 21, -52, -53, -64, 76, -56, -15, 102, 64, -197, 123, 57, -86, 240, 7, -110, -121, -159, 176, 13, 33, -42, -65, 214, 23, -71, 119, 94, -120, 49, 7, 42, -126, -2, 79, 2, 58, -172, -1, 0, -5, -41, 8, 127, 37, -19, 122, 95, 39, 23, -88, 11, 92, -24, -171, -137, 137, 177, -112, 81, -179, 81, -99, -46, 117, -19, -30, -3, 71, -137, 36, 8, -39, 182, -102, -259, 20, 58, 162, 80, 11, 37, -14, 19, 83, -39, -23, 50, 88, 47, -50, 72, -84, 58, 44, 25, 131, -95, 125, -22, -86, 99, 56, 20, 60, 98, 49, 38, -91, -34, 102, 73, -40, -30, -23, -119, -106, 130, -44, 74, 98, 73, 2, 18, 69, 228, 52, -32, -62, 85, -28, -21, 25, -45, 38, -10, -83, 162, -75, -33, 96, -66, 41, -85, -69, 67, -73, -168, -92, -36, -5, -19, 37, 33, -73, -72, 28, -26, 121, -49, -6, 120, -130, -33, 26, -114, -81, -160, -75, -2, -53, -69, 194, -160, -40, -61, -25, 0, 77, -164, 34, 12, -127, -55, 17, 134, -61, 29, -3, -19, -112, 3, -39, 232, 104, -124, -10, 7, -5, 90, 74, 151, -64, 5]
2413EJ40r6j73J52n7ML4j4k2J13L2n0j51J38L5N4l8k4j87K50p6J12k67J19J14
2438A47o9m1j60m9J52R0o4O4m2j48j0Q6J05R2r6N9pN7j22rn0N9N5J73k94L6J25
2465A39l05K10j21j75K67n1L1J04l4L9l0N2j11K2O3j71J13O7o8j15l7J45j52O2
2489e6J48l7J25l63K22K00m53K53j2JJ5j58P3m0J9m3j4L2O2J54r1Pj00j0J53O
2515I3j49J3Q3p5R6L4n3j42K11j0o4mQ9j01p2J30N2l09K79k9k62J38NJ76k4J8
2541A23j69P2O8k1n4j91J21M6J17J6j00j97K02nk4Qm0M8j50J99j23M1m9J61%j65
2567f6K16k20O0J32j26Mj14K85k92J64j71J59l4r3j9j11J8L49p5k67K79n7J69
2590A90k81Q5q5N9J0j24J67l2R2j35J25O3l06K97j59N7k5P1j11O4j9m1R2n3j3
$$ y = [5, 145, 49, -124, 28, -29, -25, 9, -5, -27, 86, 118, 68, -83, 55, 90, 144, 106, 82, -105, 145, 69, 181, -86, 33, 147, 78, 37, -123, -172, -20, 70, 6, 70, 28, -120, -130, -44, 61, 153, 57, 116, 109, 166, 44, 35, -15, 44, 99, 272, -22, 14, 139, -166, 44, -77, -252, 15, -36, -5, 99, 65, 104, 74, 126, 15, 37, 100, -71, 42, 109, 41, -74, -111, 34, -118, -56, 92, 55, 180, -183, 39, 239, -214, 39, 27, 28, 43, -115, -42, -82, -63, -106, -120, -88, -26, 128, 37, 44, -56, -66, 87, 93, -56, -43, 40, -35, 61, 95, 42, -100, 111, 101, 37, 33, 122, 21, -51, 79, 131, -178, 101, 72, -190, -52, -47, 129, 105, 123, -46, 26, 94, 73, 19, -172, -51, -5, 112, 128, 28, -169, 33, 28, 4, 12, -28, 20, -130, 69, -54, -13, -62, 99, 99, -66, 150, -70, -10, 122, -4, 0, -114, 171, -121, 43, -128, 31, -3, -96, -115, -226, -208, 141, 66, -201, 78, 21, 190, -91, -6, -91, -32, -22, -146, 21, -11, 81, -54, 71, 134, -172, 125, -34, 23, -2, 69, -42, 22, 3, -38, 54, 1, -12]
2615a2K8Q0j52O0N4o9J9O5M2o4M4r1m1J27j43J45j26J11j67J57p0j01J21J85j70
2640C2pl1n7J46k86K33oj34k6J18k6o9M7N5r1j1P3l2m4J93j77q5J81J6K2o7N9
2667B6J12j90K0n6R7l3J21j19oO0j01J38K0j74J09j1j05J78j09MK7p2K53j42n1
2692dK7j15J58l2n1j15K06lj47n8J02J54j48M2Q5p9Q8j82J22pk0O0j33m2N1j8
2718e9R2M3q4N1J83j29l6jj65K00o3m9L7j67%Q1N7l6M9p4P8k39K25K3j78J4N5
2745i2J42j48K82j03j29KJ14n1p9J02J59j74q5J07J44j75R9k5j63J88o8K1r5K3
2769dJ13j37J3M8p3K4j50J41o9J11j11J93o4q3N9L3K2J2j00k0R6j45J78mo9j03
2795h9J83j85J99k7r3K2M3n4J55r8j16n1J61mk64M32k04n%l0nj8P3p7J98k25J97
$$ y = [-12, 16, 96, -56, 4, 58, -11, 8, 73, 115, 51, 95, 4, -37, 90, -53, 92, -34, 77, -90, 67, -3, -104, 17, 202, 32, 25, -6, -63, 83, -203, 30, 24, -110, -136, -18, -44, -113, -66, -11, -102, -113, -40, -72, -116, 77, -100, -185, -4, 12, 34, -33, 26, 138, -52, -32, -88, 9, -24, 97, -22, -28, 32, -69, 69, 89, -85, 24, 13, -92, 86, -23, -19, 8, -64, 189, 47, -4, 23, -92, 66, 34, -17, -132, 74, 71, -76, -134, -32, 122, -26, 16, 101, 22, 110, -72, 50, 43, 23, 83, -50, -92, -41, -59, 33, 76, -8, 43, 226, 97, 61, 60, -105, 95, 32, -17, 20, -147, -147, -66, -9, -45, 4, -70, 8, -231, -6, 17, -161, -147, -92, 50, -98, 184, 81, -48, -46, 68, 17, -62, 40, 199, 25, -60, 47, 191, 16, 115, 90, -73, 115, 47, 68, -27, -4, 109, -28, -15, 33, -40, -16, -166, -25, -94, 17, -94, 99, 35, -48, 11, 44, 66, 78, -22, -42, 54, -91, 87, 83, 14, -89, 94, -91, 108, 81, -12, 10, 53, -1, 154, 56, -60, -111, 50, 46, -218, 214, 10, 5, 5, -25, -30, -48, 25, -52, 146, -79, 118]
2822A18M8j44j06P4n1p1K16rj20J97m1j08Oj28J07Q0m1j6k15J32o7L8K54j90J14
2847G7L1j43K36l28J68J30k56QJ32l5o7q0J94k0j47N3Q2K3o9K3Q3j53M4q4J50
2872E2k6k7j05l8J79K0p7n3K1P9j31K95q9j03Ll3J08j72M9K2O6r6p4M3j0R2L2
2899B7q1J95r3J3j34P6o2l6P1J12q7m8q0J64P8q3l2j03O2K3L5J39j52j06R9l3
2925c6J90kj48j3ok3K3O2k6Q2j79J54o5k2k1J12k04J0J41j19L24l0j37Pp4j4J11
2952I7j67o8J41K7r1j9K55j10p7O4j74J47K8k1j24N4l8m0J63K4r7q8R2j0K26j98
2978dP5O0q2r7L5J00j50J00p2K5J76k82J80m7m9J02k09J35k3J10N4j18o4jJ61
3003A15j56n1J62j19M3L1L2r6j52K89k50R6l8R5P9j83J04L8k5j23N8pJ20L2p3
$$ y = [118, 166, 22, -84, -10, -61, -132, 84, 75, -45, 152, 111, 3, 9, -119, -12, 68, 27, 11, -204, -72, -139, -101, 153, -37, 77, 108, -35, 201, -127, 41, 171, -85, -77, 55, 20, -47, -127, 67, 47, -100, -47, 35, 58, -11, 12, 95, -58, -14, -98, 52, 26, -1, -106, -144, 35, 55, -22, -75, -54, 25, -106, 189, 100, -3, 0, -33, 75, -97, -48, -26, 40, -56, -130, -87, -97, -5, 27, -54, 141, 48, 61, -73, 3, -59, -95, -24, 88, 1, -47, -127, 37, 115, 32, 0, -103, -41, -18, 17, 156, 4, -102, -3, -36, 154, 152, 4, -9, -15, -38, -15, 47, 21, 103, -76, 78, 13, -9, -30, 82, -122, -112, 29, -90, 234, 204, 67, 74, 0, -14, 97, -70, -138, 3, 30, -61, -80, 175, 65, -12, 52, -122, 25, 53, 32, -92, -38, -76, -116, 47, 71, -26, -114, -22, -32, 194, -4, 71, 131, 49, -48, -13, 87, -63, 37, -35, -10, 166, -116, 64, 17, -32, 70, -139, -4, -27, 83, 137, 19, -45, -46, 115, -41, -92, 70, -49, -6, 25, 57, -39, -191, 98, -152, -56, -94, 1, 80, -103, 1, 39, 14, -109, -51, -58, 62, 94, 21]
3028B1L6N6j14lQ0j43J31k93J16J10n9k2J74k16L55k55O1N2q6R4j26J41o3j33
3052h6k7J63m3R0k45J69M7n2o4nK9o3J2N3k5J05j77K33m3l52K45J54j83L1K23
3077A89k11k0J26k9k03L7P0o0J72j92J48j05L6J52rq1r3J03J07j29J53j75N6L6
3101G8Q6j16j50O8N5P2r9M4j14M6L4j11K63k75nM5R7j21l8Q4RJ57j81M3J66N7
3127A94k62O9j07L4R6j07K0M6m0o6J04o9J09o2J23j93P1K9P8omo3o1J01j37J05
3153BJ7l2M1j3Jm2k22L82n1k21J46rl9j67K45n1J9J5j34J4J91n2j42J07rJ5j10
3180i9J38n8m1O0J2J22o9j01K7L3P3j2j69K21k71J51k0P4o9k5J9l4P9r2J93j48
3206fr9Q1m2l9O1J99j53r3PL1p8Q1L6q0P3M2M7q3P0P8j75J02k09J87J06j48K7
$$ y = [21, 57, 113, -1, -4, 76, -67, 64, -229, -113, -3, -62, -84, 90, -126, 229, -26, 35, 87, 1, 95, -31, 110, 47, -86, -113, 50, 7, 97, -148, 21, 68, 16, -48, -53, -24, -87, -75, -22, -47, 58, -119, 114, 71, -281, -36, 118, -65, -34, 189, -22, -42, 84, 55, -148, -111, -41, -101, 71, -121, 27, -78, -42, 110, 101, 20, -73, 30, 137, 8, 161, -14, 42, 78, 164, 48, -102, -34, 21, 93, -6, 38, -76, -30, 4, -107, 156, -119, -124, -79, 18, -103, -141, -57, -48, 109, -72, -29, 137, 194, -68, 1, -106, -72, 24, -83, -63, -17, -57, -123, -19, -88, 21, -41, 82, -111, -40, -11, 67, 61, 57, -6, -67, 34, -103, 2, 19, -13, 28, 15, 16, -26, -248, 134, 83, -138, 8, -1, -40, -207, 38, -13, 6, 21, -113, -99, 92, 40, -102, 5, -4, 11, -99, 39, -19, -60, 0, 12, 134, 65, -36, -9, 24, 97, 85, -84, 137, -134, 17, -3, 71, 2, -23, -4, -38, 41, -51, 142, -6, -105, -24, -66, -105, -44, 155, 2, -91, -84, -53, -131, -50, -14, -94, -21, 21, 68, -15, 55, 133, -42, 60, -149, 38, 144, -4, 23]
3233B3J88k91J2J59J9k20M1J59j19N5K4qj44P3J3l4m9J63p6l9O6O7k9l02J70r
3259h8J21j26Q9j02j8j5J14n0O4L9qk8j05L93k12n9j23J76j04J78o8Rr8l8J42
3284H3p4j10J20N8P5q0j24J20nj90P5L7j77K13Qpj15J08r7J12j32M6mL5J04l0
3310D9K7n8K29l31R1j03J87j29J06j91J62m7R9j22P7j48K16j98j48J77J47nj48
3333f1J74p2m7p4%J16k8%o8NQ5P6j64R1K8l8j51rJ32K8q9J78j67k6J74q4M5R5
3361A49k38J51j18K7j6L6%j61K64m0Jj71J41J45k12K7K7l3J47l1p3n6K21k90r
3386a12j8K70j94J23L0q9j00K3J36o4oNQ0j86J35J28l54J10r5M0J11J15k47J53
3410fk03J65Q2l25L72j65Q8M1O7j9j49J85k69N7J76L8k07j50L28l5K4j42P0p3
$$ y = [23, 211, -80, -68, 91, 110, -110, -69, 90, -29, 26, 50, 42, -102, -29, -16, -50, -99, 64, -12, -51, 15, 82, 53, -249, -79, -88, 33, -93, -4, -106, -124, -139, -25, -75, -11, 28, 20, -8, -113, 280, 68, 9, -114, 62, -42, 136, 68, 77, -21, -59, 83, 9, -101, 19, 77, 152, 72, -52, 68, 63, -127, -52, -15, -192, 21, 29, 22, -93, 15, -82, 30, -102, -56, -60, -25, 79, 49, 76, 18, 247, -84, 7, -96, 91, -38, 68, -123, 39, -8, 91, -31, 46, -102, 114, -84, -232, -55, 92, 87, -61, 113, 41, -6, -80, -80, 36, 8, 8, -60, -55, 30, 106, -58, 33, 61, 23, -128, -137, -5, 23, -66, 112, -55, -81, 93, 9, 54, 149, -89, 62, -56, -29, -45, -9, -9, -170, 94, 54, 55, -116, 25, 170, -42, -15, 12, -21, 126, 95, 22, -34, 187, -103, -112, -130, 140, -54, 69, 99, 10, -90, -67, 69, 5, -1, 4, 84, -102, 33, 161, -193, -83, -178, -138, -27, 88, -159, -6, -209, -44, 38, -287, 85, -80, 8, 49, 116, 97, -52, 133, -136, -79, 97, 135, -72, -222, 106, 71, 95, -47, 23, -50]
3434e0K5R2m3j48K9Q5q6j1QQ1l7r4Q5O5j2K5k00J45l5J56k00J59m8J15L0l0n8
3461D8Q1r3j95K87p0j24J15j28J6o1J42J4K62j17k03J88k03j52Q5o4M2J43n8n6
3485a01K5J39m1p5l8J66j9R5j6j61J65k21J01P1j66J22J09j50k0k9K49j43q9j85
3509b12K74M4j52Q5k2L6j80K53j14k9P6K8k22P8J71o8l7l3K9p2J27o4R8O9j87
3534b4j50M0L00l10kJ36R3k10o6J83K24j03J7j27J19q5j9jo5M2J15N9m8Pq5Q5
3560A25j48lP2L6L9j31%mN6j04R7N1J9Ko2N2l0j5j25J11J8m2P5K1l01R9K55j34
3588B9K3j10O6J11j4j09k2Lm6k8K43k20p5P7J82j77K06q5j64K67q7L5j60p2K14
3613H7o0J70j83j04K73j43L5q9K13j77l1Nq6K15j16j27K40L1k33R4q7LJ16j75
$$ y = [-50, -25, 67, 24, -124, -95, -10, -96, -107, -99, -18, -55, -149, -64, 1, -11, 14, -186, -41, -76, 80, -120, 39, -9, 106, 136, 106, 48, 129, 36, -159, 128, 58, -66, 49, -79, -63, -124, 18, 32, 294, 177, -26, 162, -41, -193, -108, -172, -130, 13, -45, -101, -76, 63, 22, -53, -91, 75, 56, 151, 135, -26, 139, -82, 19, 90, -76, 46, 155, 5, -15, -44, 205, 62, -27, -212, 62, 106, -46, 39, 17, 53, -127, 126, 12, -17, 59, 87, -135, -57, 114, 46, 9, -24, 5, -67, 60, -4, 94, 163, -24, -174, -134, 166, -144, -146, -10, 83, -127, -193, -10, 214, 111, 128, 1, 120, 35, 16, 15, -50, -8, 107, 166, 118, 125, 40, 125, -23, -26, 46, 82, 121, -10, -10, -14, 42, -62, 35, 86, 105, 107, 45, 97, 67, 52, -73, 38, 56, 14, 89, 110, -191, -92, 163, 29, 52, -58, 8, 119, 105, -4, -26, -23, -69, -97, 146, -74, -149, -72, 110, -67, 139, 54, -110, 157, 70, 105, -55, -127, 87, 27, 197, 14, -90, 183, 40, 75, -14, 199, 22, -9, -4, -90, 125, 9, -118, 122, 153, -80, 14, -73, -70, 46, -129]
3637a29r0J10J00O6k2n0J3J20j38Q7o0j04Q9R4k16L8N3J00o1j02K58j81n4J35
3661E6j1j06J03l3k3R6Q4k11R8J3n0J21j21J08j26k00J91Lo8J63k1O1k62k5K83
3686A23o6K3n4o9J52r6j4NJ7r6K02P4l39J54j81J32Pj51K76k02O6K3l0P6N6r4
3712fJ01j53Q0L3j53M2N5L2Q8l8k40K17M0pn2M0j26J95j07J4j07J76j82m7k6J40
3738Il1j98K27L2j56J73j02q2J42l1p4K48j63K9J02p3j9L2M8l1o8J24k19L07l25
3763i9J22J8n1Q9j74R8k3j17R6q0J28r6m1O7K8k7J52r1J4r1P0P6P0r6j17K13n7
3790H1k01J53p4l5r6J62O2j53M8K89j28L6k50K30j27j2J52j52J42j88J09%N2k03
3814a03N2J85j49L9l0L0j1k19K98n8j18j5J20j84J38J17j26Nj54J70J1L8q3J50
$$ y = [-129, -219, -109, -9, 57, 35, -15, -2, 118, -20, 67, 7, -97, -8, 86, -130, -92, -39, 61, 0, -102, 156, -25, -79, 56, 45, -61, 42, 9, -14, 82, 166, -45, 53, 66, 16, 137, 16, 124, -2, -202, -11, -8, -76, 87, 66, 127, -135, -160, 123, 57, 80, 26, -43, 109, 13, -1, 4, 21, -75, 127, 201, -138, 16, -165, -33, -26, -177, 99, -103, -37, -14, -44, 32, 88, -6, 95, -58, 22, 55, -98, -56, -1, 31, 119, 81, -159, 58, 98, 91, 39, 79, -47, 148, 41, 55, -52, 124, -58, -105, -131, 9, -22, -220, 7, 39, -117, 56, -46, -128, 14, -17, -91, 157, -6, 23, 125, 52, 33, 65, 113, 82, 14, 138, -81, 226, -99, 23, 41, -10, 79, -95, 3, -20, -137, -41, -121, 7, -89, -130, -63, -35, -62, 90, -1, 13, -78, -8, 68, 138, 42, -75, 138, 81, -120, 33, -41, -76, -172, -10, 52, -101, -53, 236, 108, 144, -106, 124, -3, -15, 137, -15, 127, -61, 48, 48, 100, -103, -51, 134, -15, 24, -6, 24, 13, -206, 92, 34, -84, -99, 21, -163, -25, 92, -34, -29, -183, -13, -2, 36, -47, 103]
3838A03l00K44Rp3l3N6n9J83j18q9J54j25K6j47J26M9mn8Q0Q0k6q9n8m4L04k47
3864e6K93j77q7n9P0j23Q9M0p9J40j07J43j6l2q7l8N3LJ68k44N2R6K00l96M6K72
3890A64k16J67j72Nj18J56k70L49j25Q7j36J51k8j03L56k16j17m7N5P8J17k1o5
3913E1J24l61J78k3P9j72K82j51N0j19N0J79j26m3J21o4r1K4K1n8K5n4J11m0Q9
3938H2j20M8j8j44K52j92K21k9j04J2J14l6p1p7J18p7J08k42R5Mn1K47j48lk9
3963d0j2r4J26J38k06J51j64j60L07%K09j43j32J09j9M3j37J49j21J9q2J77m8
3986G0m5J22j07k00J99j00K01k12J35k9l3r8J22R4j17J91k46J75j02N2m6j9o6
4009e9Q1q1J1r4O5Q7Q3R1k64R0nn1o0QQ9Q2j0k7PQq1j49J07J14N5j64j1J72P3
$$ y = [103, -197, 47, 56, -17, -50, 6, -53, 130, 12, -77, 77, -48, -22, -169, -43, 6, 2, -56, 24, 104, 78, -11, -69, -113, 191, -56, 237, 60, -27, -86, -16, -139, -50, -10, -89, 51, -56, 87, 71, 39, -48, -86, -33, -30, 138, -106, -54, 42, 242, -154, -108, 164, -52, 115, -57, -52, -170, -14, -284, 65, -60, 27, -109, 42, 14, -89, 267, 51, -66, -113, -58, 20, 137, 116, 51, 175, -186, -8, -31, 48, -124, 158, 7, 57, -62, -12, 167, 41, -2, 119, 55, -36, -12, 9, -49, -24, -78, 33, -7, 82, -38, 10, -8, -152, 100, -92, 129, 100, -4, 8, 122, 86, 15, -62, 56, -21, 87, -155, -60, -56, -107, 140, -8, -11, -40, -52, -146, -20, 118, -88, 63, -101, -261, 46, 46, 255, 112, -20, 89, 70, 113, -24, 125, 4, 23, -59, 118, 70, 25, 147, 40, -160, 39, -61, 140, -72, 63, 34, 1, -97, 25, 119, 2, 193, -53, 122, 20, 72, 26, 7, -59, 22, -59, -48, -142, -77, 10, 93, 184, -80, 10, 5, -46, -106, -98, -9, 73, 63, 36, 43, 51, -30, -179, -72, 42, 97, -67, -78, 94, 167]
4038A67r1j13lP0l2M9rj88J16J97j03N1k7j71N0l3Q6J63k86J67j45K7j9R6L37
4063C56m13q1K33J1k17P4Q7p8j2L7P9k25Q1M0M8r5J16O8k56L18l49J59j13J18
4087a4Jr8q0O8R2J64j17j95J31K18m7j61J61K1p3K6j66R3p9R7k9pM2m1l8n2J33
4114E0o3J08n8K8J09p4k55K18j13J21m3p4J15j56J22j36j9O2O9j13J19jP7m7q
4139C8j6J42j01o1k2K9P7k42J30R6m7q0J54K1q5J2N9m5M9j26K24k64J74j58P2
4164C0J14j42R4k49K98j57n0qL9N3P2j36j6p6K25m0o2m7J73l9k46J31J00r5N1
4189A7k6L6j23P0J11k9j19j3N6k0o3M7P7J19j59j17J28j52J29k1R7j38J07K56
4213B70l13O5Lj03l8J34J02O2j41R0P0k55k44J83J29Q2K6j32K8j06J85k04J38
$$ y = [167, 76, -37, -40, 30, -2, 47, 38, -150, -34, 163, 60, 111, 84, -87, -37, -70, 16, 179, -107, 60, -85, -58, -77, 19, 356, -57, -138, 95, 106, -111, -37, 50, -28, -40, -3, 76, -149, -68, -28, 20, -75, 41, 109, -147, 171, -178, -19, -132, -14, -13, -111, -191, -123, -31, 133, 16, -179, -48, 170, 123, -38, 123, 144, 71, 97, -69, 24, -55, 42, 13, 6, 48, 7, -31, -83, 50, -13, 95, 37, 65, 174, 100, -155, 63, -50, 71, 28, -46, 69, -87, 35, -101, -120, -58, 11, -102, 17, 16, 93, 46, 38, 22, 164, 63, 2, -20, 9, 86, -156, -26, 70, 23, -57, 97, 118, 33, 45, 104, 59, 108, -18, 206, -58, 116, -42, 30, 144, 2, 96, -153, 145, -12, -62, -70, -31, 22, 94, -42, -58, -134, 91, 51, -11, -58, 115, 76, -170, -39, 61, -34, 17, -9, 27, -96, -26, 85, 56, -63, -76, -20, -40, -103, -56, 21, 140, -19, -136, -8, -160, -31, -52, 45, -93, 14, 270, -43, 22, 25, -78, -116, 18, 120, 182, 41, 131, 201, -54, -298, -115, 14, 96, 122, -10, 18, -88, 97, -107, 31]
4236C1JP3Qj48J27r4K7k2p5J6J13J32j59q9j56J37J24J3k8j07m3J15L6J06k92
4261a54J04J45J4O6m09J24M1P9L0m7N5P9rk71NJ13K2n9P9L6R2j66l8l1J76j73
4287i7J35K0O7N5j16k09K43q9nq1l5j0JQ3k0J84k69K12j79J62j45n5J24o4J05
4312A7p7K15r0j17p3J55J30k68J04r4J31oJ8J21k73J70J06k10n9N8l5J2J56m7
4336D4nJ40j78j3K0j37P4J19j89K11R5l13J80j32Q8J67k39R5m7o6O2j5%N3o1J4
4362c3R0j49L8N8l9R8j1R0k02O1k3N1L7j11J23k63P1J4Q9N5P7j12j00O5o3J55
4388F6j09j03J55J09Kl5k9n5K34j96R1jj09q8J16P4k31m0K02M4j62K08J05j82
4412F6j00O9k2j48K08j32J32j13O4j20L4N8j2N5k84K19r9J01M0p3Q2j45J34k1
$$ y = [31, 32, 105, 113, -35, 92, -2, 25, 3, -72, -56, 57, 189, 30, -59, -215, -78, 46, 59, 31, -76, -119, -4, 32, 138, -154, -50, 95, 109, 175, -234, -110, -69, 10, 40, -7, 48, 127, 118, -153, -148, -35, -13, -72, 7, 43, 135, -31, -69, -100, 76, -97, 38, 58, 125, 180, 64, -145, 98, 9, 4, -77, -112, -122, -121, -38, -58, 126, -143, 69, -110, 52, -93, -148, -24, -88, 17, -60, 155, 65, -52, -125, 30, 160, -108, -4, -98, 33, 27, 45, 166, -107, 63, 169, -41, -100, -42, -77, -65, 91, 44, 39, 179, 1, -12, 8, -129, -55, 64, -125, 86, 181, -132, 48, -84, 4, 171, -68, 27, -20, -86, -24, -39, -39, 14, -47, -33, 57, -92, -54, 4, -35, 63, 52, 142, -60, 1, -22, 29, 66, -45, 78, -185, -114, -100, -11, 44, 121, 9, -91, -26, -89, 66, -43, -146, 9, 118, 120, 85, 56, 1, 235, 39, 130, 129, 20, -68, 48, 122, -109, -149, 53, 97, -65, 143, 248, 66, -34, 35, 13, -135, 73, -59, 73, -40, 24, -96, -62, -4, -16, 39, -245, -26, -125, -24, 16, -57, 25, -120, 14, -7]
4436gN4J41q9l02J75j77J71l7K27l2j87OK19j00J94l74O3o6P1K06j63J57j54j24
4460a28J67l9Lj45Q8R3K7p6l5jJ5q4L5K67j79K6O1l8J4j83J76n7N9Q1k14M6Q5
4487F4J2k20L01j48p2O6j22J61r4n3Q8J7L3k01J15K29j95j4K40k67j9P1oJ73j56
4512Cm8Mj05K85j63m9L2J1j67J55L5l05K36K14j57o8J01L3r4J09N1j68O1J42j42
4537FK9p0k4J1QJ63j8j74M4L8r5J25k9j59L22j29L7l39L65j99O9Q4Nl5R5j02Q9
4564A17l15K55J14l26K67j29j19K34j8j07J74j47J31m8q6J70j90K7l2J55k07m5
4586a25J04o7o2J06QN9M5N1n8n1l0N9k8l2Op0J74j9j56L4Q9n8R6j06J04r0Q0l5
4614B8k7N4k13R0P7o5MK7J06n7n3N4M8N5j20J20q0r4M2K7m5Jj3k5q1L18j27N3
$$ y = [-7, 47, 188, 99, -203, -28, -205, -34, -71, 156, 124, -63, -57, 162, 62, 256, -118, -55, -121, -50, 156, -7, 150, -4, -128, 39, 0, 3, -142, -54, 39, 66, -10, -45, -46, -31, -115, -80, 187, 8, 34, 95, 57, 71, -112, 64, 7, 66, 147, -67, -21, 64, 76, -144, 157, 9, -63, 3, -119, 42, -52, -105, -17, 0, 33, -168, -53, 176, -19, -33, 207, -60, -79, -8, -14, 159, 3, -45, -41, -146, 139, -24, -73, -41, -30, -197, -42, -7, -312, -76, 138, -19, -87, 14, 47, -47, 62, 113, -55, 6, 148, 6, 35, -35, -59, -48, -40, 123, 105, -69, -25, 13, -82, 43, 14, -145, 177, 48, 85, -254, 111, -88, -19, 65, 70, 35, 130, 28, 117, -198, 57, 171, -155, 112, -17, -136, 98, 80, -27, 147, 0, 131, 83, -3, 167, -23, 4, -28, 127, -80, -125, -21, -88, -150, -44, -36, 23, 68, 119, 61, 10, -20, 39, 11, -21, -15, -85, 89, 70, -86, -52, 37, -21, 75, -31, 73, -17, 63, 28, 1, 55, -158, -68, 9, -56, -52, -25, 81, 24, -29, 25, 73, 128, 8, 128, 48, -46, -4, 23, -22, -21, -34, -59, -140, 178, 51, 104]
4642A04k8q8M8q6P6QLP5r1PN3m7J1NP4j26l0j16J59J5l06L35m1L0M1j27J58q0
4670C6K3J8k57J46J01j58O2M6Kk8J49k99R4J9o8l4k6J49q1N5J78q3O0r7R5j96
4696i4J11N3J3k3kN6j44J73rj24j20K3K16k33L5J92j22o8jK57l34J48K24k05j6
4721FM4j0J37q1j68K08n5Q1n7p2q3J71k59R2J13K0L3k8j78K38j72j8q6k7K24P1
4747A44l01K50L3k34Lj6J10R0n8q2j24J36n2L00k23J68j25OJ02M1q4m8N5j26J43
4772A08k29J42j09Q1j33K20k52K19J65k39K6m8j23J75L3o8o5K18j5o9K10j60l44
4795b57J16J24R0j93j7P9O0J39j11l7k8R8j1r4p3J97j62J42m3j51J00p0M9J01
4819D8L4j78J81k38K64j37o8N1mM6mJ53k73Q6j03K3J49J31k30K7n9o2k4J62R0
$$ y = [104, 76, -12, 36, -50, 26, 34, 37, 112, 21, 28, 81, 34, 45, 50, 124, -2, -32, -148, 11, 26, -280, 55, 14, 44, 85, -42, 116, 36, 59, 77, -180, -34, 67, -91, -29, 17, 19, -9, 140, -159, -65, -46, -114, -148, -174, -25, -106, -51, 127, 44, 104, 7, 102, -94, 17, 70, 83, 60, 58, 114, -30, 143, 134, 10, -110, -87, 129, -104, -69, 123, 1, -67, -68, 189, -145, 3, 227, 22, 6, 50, 40, 177, 96, -72, 136, 81, 162, 105, 33, -50, 121, -138, -46, 67, 87, 120, 92, -86, 152, -20, -38, -124, -151, 73, 144, -157, 93, 126, -108, -105, -121, -11, 79, 21, -61, -185, -49, -101, 199, -24, 144, 19, 25, 127, 168, 84, 36, 91, -35, 108, -121, 21, -88, -7, -140, 80, -172, 47, 212, -27, -1, -49, -172, 3, 36, -32, -97, 121, 106, 37, 247, 87, -257, -141, -17, 73, -120, -137, -58, 2, 141, 30, -7, -35, 63, 52, -42, -115, 82, -80, 62, 19, -132, -32, -102, -53, 48, 82, -96, 85, -153, 111, -26, -94, -43, -47, -1, -5, 148, -125, -39, -142, -119, 30, 161, -69, -42, -101, -163, -187, -25, 65]
4844F5K1l47L72j95L2JM7K2M1J06j18l7j61K0J01n7J39k82K87j19N4q1J22j57
4868a24m0m2K71%L7m9j39Q5N0N3o4J3q5LQ2N2M9r2K6J3j78L5K1J07j10J56j23
4895GN5j63O2J17Q4l1m4q4J5j04K28p9k0J8j77R6O1j11J04K7j56J78k9m1NK3M0
4922H1q2k9J12j9k24J76q6J86Ln9lM9K5p0r4j9l7R0%J99j47l6J8n7KQ0j6Pm3k0
4952a3qK8k9O0k18J3K19k6j89K16N0k7J34k41N7k87K88j8L1j40M9k6Rq2K05K9
4978H4MO3L7n4j14J14o5N4k13J8K6K0J84k81J4K53l5q3Mq7N7r4J10n5p9L9J14
5005C5Mj12J76j89RP9Q9j26j6m1J05r2RJ06m7l1J2qJ96j75K02p9p1N8ql3l5n6
5033c9p1J94j95K15j9r4J1R4j71K32k20J52m3j05o4J39k27J96J03o5K19l18o8
$$ y = [65, 86, -261, 111, -84, -52, -51, -4, 18, 59, 165, 47, 10, -151, -131, -30, -87, 52, -230, 57, -62, -8, -89, 33, -124, -164, -206, 65, 65, 102, 53, -86, -1, 49, 102, 38, 51, -34, -31, 51, 103, 152, 60, 86, 99, -79, -44, -23, 84, -26, 130, 7, 62, -101, -39, 78, 162, 131, 87, 3, 18, -86, 142, 63, 43, 61, -116, -20, 41, -70, 34, 61, -95, 83, 54, 13, 18, 41, 81, -1, -30, 82, 63, -161, 15, -71, 115, 118, 59, 56, 105, 130, 60, -34, -53, -90, 0, 0, 199, 52, 16, 34, -23, -21, 59, 43, 50, 7, -13, -21, 7, -22, 38, -180, -167, 52, 26, -163, 53, 103, 76, 210, -31, 26, -261, 27, 9, 40, -100, -51, -77, -68, -150, 55, 84, 88, 151, 188, 134, 20, 134, 69, 123, -90, -72, -46, -26, 158, -123, -109, 144, 109, 26, 30, -57, 0, -94, 16, -39, -118, -79, 35, 39, -73, 103, -86, -77, 2, 91, -35, -51, -92, 13, -79, -70, 36, -11, -42, -30, -38, 158, -17, 185, 106, 35, 93, 85, 52, 17, -39, -110, 84, -111, 104, 85, -9, 2, 96, -75, 157, -63, 89, 46, -59, -123, 16, -211, -15, 88, 23, 242, -76, -144]
5056a44M04j56k75K74j70J68j51m6O9j5J20M7p0n4k06J77pJ86j56J0M6N3p9r5
5080g0jJ61j23L0K87l54O5K16k06Oj36Q8j13Q2K58l19K94j71j34Q3K91k16j36
5103a18K88k2j81Q5J08k30K9P0j92K41j05R9j60J31K9j60Q2J7R0j69O0LP0n4p3
5128f2O9R1j89M2J11q9rJ30M2j30m6m8L05l60K01qq8J43j30K6k7K3J08K1k09K3
5154f0j16J12L0J47j57M0J37j56J13n5MJ13j21j50J29n0m7k0J72L0k15N6J63j27
5178b8j02J09M4N6q9M1R1j85J45O0l8n1o5l9J15p7J15m0o6k6Mr5L37l23K61j72
5204a8N3K0l2j81P4n7k6L02n9j25L5J22j25k27J80P6O0M8k34J71n7r4J0l7J77
5229E6j12K05j91J9r2J02Q1q7Q6j46j02K61Lj7j69J44r5K76j82O3j29o4J78j12
$$ y = [-144, 260, 104, -171, 103, -67, 101, -50, -96, -27, -42, 78, 125, 55, 1, -205, -28, -35, 151, -5, 5, 51, 104, 25, -70, -71, 90, -33, -3, 284, -70, -5, 211, 5, 11, -125, -37, -150, -68, 190, -129, 165, -6, -140, -57, 234, 18, -118, 170, 148, -33, 52, 160, -70, -41, 29, -163, 78, -27, 72, -88, 43, 72, -88, -6, 11, 101, -68, -8, -5, 65, 11, -62, 7, 98, -91, -49, 62, -27, -36, 94, 136, 6, -40, -88, 217, -143, 58, 50, -38, 105, -25, 1, -26, -3, 105, 126, -83, -60, -176, -64, -34, 113, -44, -4, 133, -23, 90, 35, 39, 152, 31, -119, 10, -40, -87, -107, 65, 95, -120, -64, 99, -28, -130, -21, 23, 79, -10, 31, 122, -63, 82, 142, 104, 53, -12, -51, 64, -13, 102, 62, -4, -30, -26, -121, 216, -107, 154, -18, 35, 55, 23, -158, -84, -141, -167, 135, 76, -49, -14, 108, -17, -244, -64, 12, 72, 120, -114, 57, 0, -94, -84, -121, 56, -56, 149, -42, -23, -115, -13, 68, -19, 67, -79, -181, 80, 83, 66, -103, 41, -54, 222, 40, 103, -26, -90, 88, -24]
5253b4j68J48p1J20n6r0Q0M8n5P0j12r5K24j36K81k01K6j4pM3m6r1J03M5Q5j20
5279a3j8P4kr3m7J83Pj10J6k8K39j75q2J9m9JN3O5J26r4n3P2j60N6r1K24n1k9
5307D0J00p4o4Q0k1L2j57M2lo7m3J01r6K30L8k5j00r0J01j00L4R7M7r8j89P7n
5334a13L0J84L0Q0j70l0L8O6j72P7n7j4m6m4k3J75N9o2l9j9l1J67m6j44J04j6
5360a6K03Oj02p9j35J4J60l7omj4N2j10l7K97j33l7J99p4j51Pp5O6q2K04Om3j18
5388c9J28j34j31L23j36O8Q9j14M9j96q2K01K03j22q0m6K0L1j61L70j01M8l56
5411a68J94Q7j46j6r1K20j52J72j57J10p1M7k27K41j50J30l9p1J29j30K22j07
5433B7J33j67J9J30q0j99K27k02k8J38K1j36R3l1P1M3l0l2R1m5l8j3j29J42MP9
$$ y = [-24, -192, -44, -115, 5, -51, -141, -61, -13, -68, 2, -110, -205, 19, -117, 164, -37, -11, -25, -32, 11, -35, -126, -23, 22, 107, -13, -31, 43, 41, -52, -99, 84, 91, -19, -3, -31, 208, 33, -49, -30, -79, -78, -25, 40, 166, 72, 19, 91, -69, -13, -104, 120, 69, 40, 140, 66, 2, 82, 61, 93, -64, -22, -25, -92, -135, -34, -130, 100, 138, 113, 13, -77, 24, -76, -42, 55, 102, 4, -185, -108, -113, -83, 101, 131, 211, 41, 11, 49, 115, -57, 20, -37, -51, -97, -141, -164, 11, 70, 8, -31, -50, -81, 86, 40, -104, 0, -16, 187, 193, 91, 12, -123, -109, 51, 14, 8, 4, -10, 42, -68, -105, 192, 59, 22, 221, 147, -4, 3, -72, -6, -88, 116, 122, 79, -39, 89, -45, -176, 147, 11, 79, 168, 54, 103, -93, -175, 26, 229, 107, 27, -19, 1, 32, -129, 241, 140, 188, -168, 26, 113, -33, -49, -140, 80, -72, 100, -57, 53, -18, 29, -198, 43, -107, 23, -16, -87, 42, -88, 134, 27, 160, -7, 12, 142, 62, -137, 90, -112, -140, -2, 19, -117, -24, -55, 16, 59, 29, -3, 88, 43, 5, -8, -137, 5, 9, 88]
5459H8k44J61R4l7j99J52mj21K9J53j21J17n3k6J49o4m8o1J58k59Q5R9o6j2j0
5484d0k2k5J06j03J89o7k40K72o7J01n7m0q5J52k08K00N7Nm9j06L3nJ66j44K3
5509D6J89k04q0Q1P3q2j17J2J39K1J5j48L1P4j12n5J77k04J07m8j0R3O7Rj16J32
5535I0pk8j78J22j1j51J60J08j80r5J8J10M7o2J21j07P1m3jM4K8J2q7J96j23j03
5561d9L7j1N0mj90J91m1M8Qj45N1O5J92o8j00P1k24K1J03O1k8M0k04K07j5j06
5587d0p8K4j9M8M8K01j47O6j74P9P5j95J21J6rJ13j97J04J1q2J42j17j3r2q3J29
5613f9L3k3n3O9M7l3M2rO8N0j09J3l7j39J13P6j19N5L6J9qmP0k4k26k2J48K20
5641A84k00j21K55j55K15j77K04J6k35j6J11l3M8j87N1N8N0J9j26M1J25j97M3
$$ y = [88, -156, 5, 99, 62, -137, 15, 11, -110, -81, 72, -49, 68, 15, -11, 138, 74, 26, -35, 123, -136, -51, 48, -18, -30, -40, -62, -87, 19, -84, 105, 38, -202, 70, 3, 104, 47, 7, -78, 74, -134, 66, 123, 128, 79, -27, 6, 1, 167, 23, 46, 235, 31, -49, 32, 105, 23, -94, -82, 57, 78, 93, -55, -24, 50, -62, -117, 60, -144, -37, -85, -95, -2, 65, 74, -42, 90, 83, 55, -123, -1, -12, -163, -3, 105, -75, -170, -152, -42, 5, -57, 64, -43, 28, -15, -16, 28, 56, 68, -19, 177, 54, -49, -12, -23, 27, 23, -167, 24, -17, 31, 39, -106, -55, 10, 202, 134, 34, 105, -119, -98, 5, 66, 38, 78, -126, 81, 66, -40, -118, -94, -113, -65, -17, 184, 37, 103, -71, 8, 83, -112, 9, 25, 16, 129, -68, 36, 47, -35, 107, -10, -23, -115, -198, -69, -36, -59, -112, -43, 4, -29, 13, 4, 72, 122, 13, 26, -11, -150, -37, 39, -80, -25, 11, 30, 22, 18, 88, 64, -162, -184, -36, 184, -16, -137, 118, -37, 178, 1, 205, 221, -14, -30, 81, 48, 96, -91, -40, 18, 68, 87, -39, 2, 127, -70, -27]
5664b7nQ7j38O2j5o2J01r7j5J45l3K4j14%O2J1l4j2M5n5K09Lj28k5o5J72M4k52
5692a12J48j03K9m0j51K58l1o1J63O9j45r9J8k6J63r3J21k0j24j7P6j42J11J34
5716A26p5r5Q8M9j1j33J8O2K22l23J93K2j28K03j53K03j06j00m1M1j28J30j8j07
5740f1M5j18NM0Q7j68J75j98K40J19j53k08J62K3N7j15J28O8j13l1p5l7M2J67
5764H1k9k2r9N1R5m5j07J82j24O9j01N1J47j21l6J41j29J55k5j22J50k23J44m7
5788C6j46J12j0L7k1q3L6N7p9%R4j6M8K8M1n1l2m1O2j58KK57m4k20P2J21j10m6
5816e4j06J33Q0k7j3p7J90j31J61k25J79n0m3j37M9J20J52q0J1n3O3Jk48K63k00
5841d2P6R1J7j37j04P8R4j72K77j22o8Q4Nk00K1K06k83J4K49j90J29j1J2j48J07
$$ y = [-27, -32, 55, -83, -21, -36, -98, 3, -94, -109, 36, 3, 27, -87, -87, -25, -14, -48, -60, -15, -70, 139, 142, 14, -11, -76, 96, 140, -112, 36, -67, -38, -78, -229, 29, -2, -63, 100, 169, 24, -75, -57, -83, 80, -13, 108, 88, -36, -53, 23, -119, -8, 126, 51, -44, 44, 93, 82, -51, -33, 29, 251, -72, 121, 143, 15, 218, 65, 268, 162, 62, 21, 62, -66, 64, 46, -61, -16, -134, -129, -89, -2, -170, 5, -193, 47, 166, 13, -195, -33, -10, 47, -68, 60, 128, 15, -16, -91, -128, -86, 81, 52, 30, -69, -18, 77, 32, -75, 107, -17, 52, -49, 2, 149, 28, -8, 133, 4, 159, 134, 12, 162, -61, 83, 36, -110, 2, -8, 29, 8, -75, -39, 18, -61, -61, 33, 17, 65, 93, 134, 83, 51, 10, 72, -86, -84, 173, 129, -91, -19, 102, -8, -54, -160, -27, 53, 26, 13, -64, 126, -5, 156, -69, 110, 60, 17, -120, -71, 49, 201, 121, 132, 79, 142, 143, -105, 158, -42, 34, 125, 142, 5, -99, -21, 73, -99, 178, 56, -12, 72, 77, -123, -102, 104, -179, -165, 84, -106, 23, 12, 24, -124, -17]
5866a7J39j26J2q0L7M0P5k97N0J68P3k32K06J73k17m8j7R3j34J38J52lm3p1k10
5891a39pJ70J09M9k00n7J27k7n7L2m9J76l3j96J84n4L7j4o5J20k13L4J19J02k73
5916a25J52P0j82j5K29k21k6K50k81K47m8n5jk27K22Qm8n6J01J61p5j1j88J71
5940E2j34O9R5p3P2o5K1K4k01J20k5P6Jj36J23j64K38r8K3j25J78P3j47l5j75
5965b13L04j72J83p9j03J15n3k3oO8q1M0N6J10N1j30r8N6M8j03PK44k05m0L2N
5991A3r3j1R3J35j33k5q9Q0Lj84J62J77j96j4K14k6P4j63O0Oj63K2K40k63J65
6016H4j56O8r7OJ70o1l6O9r0Q6n4Rj33L42k88m7K34l21K58o4JL3j36K2q9J96K0
6043B6l5k4O3j03P1L0q2o7P2J93m0j12J40j61lJ07K0Mj02N8J08k31K0K6Oj08P1
$$ y = [-17, 122, -4, 8, -72, -35, 5, 80, -217, -167, 1, 74, -158, 48, 221, 4, -44, -61, 32, -102, 36, 188, 185, 142, 71, -139, -146, 24, 133, 182, -18, -75, 52, 25, -32, 0, -49, 127, 94, -102, 82, 28, 65, 51, -14, 106, -107, -73, 46, 148, -125, 27, 97, -85, -100, 129, -92, -118, 132, -149, 98, 50, -5, -6, -233, -11, -3, -51, -107, -6, 155, 80, 69, -119, 52, -82, -13, 82, 9, 81, 16, 37, 61, -140, -20, -45, 31, 32, -104, 19, -145, 93, -5, 18, -107, 71, 144, -3, -38, -213, 91, -81, 102, 23, -80, 35, -18, -41, -47, 21, -60, -20, 36, 146, 197, 67, -31, 25, 73, -30, -23, 221, 16, -24, 8, 13, -80, -91, 2, 137, 4, -21, -110, -30, -27, -211, -49, 128, -68, -82, 132, 106, 180, 17, 77, 83, -80, -58, 182, -81, 84, -72, -4, -101, -95, 75, 14, -22, 47, -43, 43, -11, -2, -135, 207, -81, -128, 106, -215, 43, -21, -20, 13, -123, -101, -190, 6, 26, -9, -33, 30, -73, -2, 28, -54, -121, -49, 144, 104, -8, 132, -29, -32, 75, 95, 99, -3, 55, 163, -68, -48, -22, -16, -124, -53]
6070e3J64l5j15M2m0J09M7q2J05j44L2k4j4j17K30q9r9K6O3mr0L0J2joP8q5J76
6098A16j7o9l5J53m3j97O3K0J66j22J14j43J12j67J08j70J25j43J96O0j69q6J53
6121B5o3P4k5Q2j11J02P6j57j49J92j70J42n1L7k22J77J59j90M8J2P7j64N8P2
6145C1r4P1PK3J93l33Q7J20n6L3j07k0Q3pq5P4J2o3l0K0R7P8k22P2l1o5Q7j6N1
6174A0o0N9j8qK44l90O9R0L0j33J09p4J75j54J03q5P2P5R0n9J4q9p6J09j46m1
6200h4J20j75J37n2j1J73p1k12P8J34p5O2J84k31ln7J50J03j16o9j3K9K0r5J2
6225f2J14Q8q5r6p7K40j75J55k42N2J37m3PJ75j53l6j18Q1K61p6k01m5l1K14k19
6250a35rK11j93K25k51K80j72j57K46j37J07m3L4q5j34L01NJ2J7j02Q8j84m7J51
$$ y = [-53, 111, 76, -39, 3, -37, 72, 119, 37, 142, -2, 30, 6, -8, -125, 105, 16, -83, -57, 6, 2, -88, -58, -46, -47, -53, 25, -60, 116, 99, 30, -5, 148, 105, -92, -29, -9, 157, 35, 149, 6, 118, -49, 59, -111, 14, -129, 67, 127, -42, -128, 25, -38, 36, 11, 93, -18, 84, 160, 3, -146, 46, -124, 18, -33, 4, -218, -41, 118, -72, -24, -12, 65, -99, -41, 31, -63, 8, 15, 38, 231, -102, -15, 105, 49, 82, -25, -45, 38, 31, -54, 20, 32, -31, -61, -41, 56, 134, -88, -16, -47, -112, -25, -41, 10, -50, 9, -9, -17, 227, -163, -94, -4, 26, -107, 2, -72, 103, -51, 52, -33, 39, 114, 204, 145, 159, 70, -6, 103, -43, -84, 36, -139, -2, -54, -65, 108, 37, -175, -97, 37, -38, 24, 208, -23, -26, -83, 67, 170, 54, -15, -28, 1, 21, -74, -62, 52, 140, 55, -41, -118, 122, -53, 102, -140, -88, 49, 6, 13, 188, 35, -1, -119, -38, 223, 147, -54, -99, -130, 84, -135, -144, 67, -126, 99, -152, 128, -44, -201, 45, -92, 15, -28, 6, -79, -213, 88, 93, 105, 122, 20, 108, -76, -123, 28]
6274B8m2K10n2j71lM6J11p3l5p2L1J84r2n5p5J41j09j17J30j9j03K26Nn2q8M9
6300CM8o6o4JJ32j6l2R1n5q0Lq4O2p6R7J67j39p0l7K01M1j25L9o7R8j47P3r5O9
6329b8O8o3LN4o0L7n9R1j37K03J64l79K14ql7n6j92J19O2j75J33p5P0N0k5nJ27
6356I6q2k8J8J3p1O1j60N4L21p0l3j39N3j25J23o5Q2n5r2QJ83L2j17j50J94q8
6382c7M3q8j28K01K27j55m5J58q9J4l3j16K3N0j66J26O1K0k45K22q6Q7jL5j4q6
6408b2R3n7j7J07k76J55o4J58L8j86L7J78j53PL2j29P5K75r2k29P7MK5p9%O4q0
6435e9J99Nj35j89K28j29M1l7N3Rq1K6J57k65K93k35J52L6j52J88j51j6R9k7n1
6460d1k9KJ70m5K8j67M2p6L7J40j8j61J61K0j81K18k29K26j29Q2j27J19J07j94
$$ y = [28, -14, 196, 144, -27, -30, 16, 127, 54, 19, -53, -22, 162, 70, 15, -60, 81, -28, -145, -15, -34, -137, 89, 94, 42, -46, 3, 51, -15, -79, -78, 54, 38, 6, 97, 42, -38, -35, -119, -57, -133, -36, 131, -8, -78, -115, 86, 127, 2, 41, -26, 72, -75, -2, -97, -28, 40, -23, -20, 34, -26, 11, -48, 43, -94, 109, 273, -106, 108, 100, 63, 7, -185, -66, -4, -179, -46, -121, -51, -1, -26, -31, 96, 14, -14, 4, 17, -54, 7, -153, -99, 222, 152, 119, -20, 33, -92, 31, -34, 48, -7, -99, -91, 92, 124, 7, -143, 51, -37, 6, -82, -210, -9, 218, 63, 18, 176, 87, 101, 68, -48, -25, 25, -141, -15, 46, 66, -179, 43, -43, 44, 43, 78, 64, -22, 71, 14, -3, 104, -172, -17, -81, 77, 115, -71, -34, 144, -9, -2, 30, -99, -24, 251, 159, -70, 7, 11, 36, -43, -43, 21, -59, 140, 145, 10, -179, 49, -80, -39, -76, -23, -14, -95, -69, 88, -177, 116, -119, 33, 69, -83, 105, -46, -62, 37, 10, -41, -70, -68, 102, 57, 85, -82, -40, -116, -79, 61, 43, -118, 43, 63, -118, 100, -129, 97, -32, 50, -77, 42, 149, -45]
6484d5J5M1pJ43k31O5l8O0J67j09J5Pm1M6n4p5j22J06k9J25M2j56m2J97o9l2O7
6511D6k07K76j64J28n2n8J0K5j93K43N0q9j29J3J38j89J83q8J15q6K1n3J67pj51
6536e1M2K8lj05K25J7j45j03k6J42k2J52j58m7QRo2RK72j14m3o1j6J36j93o2J17
6563e4O0k3J05l1K7j77K09m9nK2p7j7M4M4j2j44Q6o8j29J64j10J50K4L8P5j43
6589Im9j08J64P5p1k2J20K4j63RL8J62j87J5l8j4j8K07n7j04N3L4j43n3K5N1m
6616d5m3P4j22J50%j09J20k1k6R8p5L7N1j33M3r1j7L6R0J77j84j3k2m3J00k02
6642a70L8Q9J0J89q6j00nQ9j01j2J50j68Q5m8J41j8j3k8Qq5J01L9m0R1j71p1k0
6669a06K83k94J89N6p2k01J65Q6pj48k8J19PL8k48J2J20o1J57K5p6J06Jk7k07
$$ y = [-45, -30, 11, 4, 147, -84, -19, -57, 3, 170, 61, 76, 83, 42, 88, 34, -41, -163, -57, -86, 39, 81, -75, -117, 80, 11, -21, 46, -161, 115, -49, 79, 27, -31, -21, 4, -189, 54, 104, 15, -114, -101, 37, -152, 31, -57, 58, -28, -7, -60, 107, 100, -51, -9, 19, 16, -89, 136, 153, 8, -95, -121, 21, -1, 151, -7, -54, -46, -37, -99, -90, 182, 68, 25, -36, -52, 84, -109, -171, -54, 6, -17, 88, 57, 84, -93, 116, 67, 62, 84, 7, -10, 34, 78, 66, -78, 8, -60, -189, -25, -135, 15, 39, 77, 152, 9, -40, -148, 16, 91, 20, -2, 118, 142, -21, -12, 26, 188, 1, 16, -22, -36, -54, 153, 96, -8, 45, 79, -64, -117, -92, -41, -45, -88, -14, -136, 14, 14, -95, 25, 4, -22, 76, 1, 38, 89, -44, -1, -92, -109, -73, 17, 194, 10, -3, -25, -68, 32, -170, -132, -43, -33, 156, 70, -30, -35, 54, -47, -59, 91, -77, 8, -40, 101, 83, 70, 42, 50, -35, 66, 105, 65, 156, -15, -86, -106, 177, -117, 72, 128, 56, -145, 20, 106, 99, -49, -77, 42, 49, 87, -161, -149, -29, -90, 67, 92, 16, 122, 123, 96, -111]
6694a11K9J83p4j71L76k43J3J75q5Jr2N7p9K5k1p9k0JJ9J68o0j09K39j79j46L12
6720A29n0j8O3J00k13J24k15J30k5J05k6n1J17p6j13r1J02r8P3j64K09q4M5O5
6744C8P7Qj14O4l6j37J2L0L0J25k14J48q2r7L10j0k33J98k30J20K12m6k35NJ45
6769H8N5q7l7l7O1k02K02j80K78J8k20O5J6o1N0Q2k01J85Pn2J17mj04m2K76j61
6795A12q8j83J47J90j25l8n2r2K20Rj42JJ53k05j4J68K7j67m5K98j98J02N7j16
6819A9p8J38m8P0k65K49qq6j50J39J52j12n7M9p2K20p8k9j09O1J8j31K13j37J29
6844I7L7q9J09m00K45J15q3J17m8p2k1M9o0R0k11K31l4q7P3l2O7r1O2j10J75l0
6870I9k0q8L7l8J20j85lQ7k1J1K21j25r1O7j04Q3K3k6qJ78k96J86j04J05L9j71
$$ y = [-111, -82, 101, 27, -144, 232, -11, 2, 177, 92, 93, 1, 58, -21, 4, -17, -96, -116, -115, -96, 72, 12, -97, 142, -37, -183, 129, 79, 61, 124, 224, 11, 135, -80, 50, 25, 130, 104, 53, 170, 94, -19, -110, -8, -106, -33, -197, 12, -72, -27, 38, 115, 123, 9, 73, 37, -100, -88, -58, -28, 97, -117, 31, -51, -148, 162, 152, -81, 117, -113, 7, 219, 173, -62, -57, 88, 143, 56, 19, -18, 43, -159, 43, -137, 141, 159, -61, 4, 20, -41, 9, 91, -110, 75, 82, 30, 147, 143, 39, -3, 273, 112, 24, -159, -12, 178, 53, 15, -37, -129, 91, 100, -42, -41, 112, -93, -107, 61, 88, -79, -124, 174, -24, 78, 135, 19, -59, 79, 31, 101, -164, 85, 77, -9, -159, -20, 132, 20, -37, 12, -60, 160, 82, 53, -56, 5, 23, -108, 105, -32, 97, 134, 45, 154, -246, -1, 114, 31, 148, 100, 28, 7, 56, -4, 86, -125, 106, 72, -15, 58, 26, 93, 2, 64, -46, 129, 99, 79, -9, 28, -10, 110, -75, -78, 9, -12, -1, 220, 95, 4, 71, -33, 50, 73, 47, 39, 217, -79, 107, 3, 108, 147, -24]
6896b4kq6L2j2J18J36jj83J29j59m3L7M5Op6J37j76P4j1N9J5r2q1J51J8j82K41
6923G0K9o6m2J30j06R5k3j78N0o3R0K7M7o4m4J4l5J04M3NQj96J67j29K8J45j59
6950e3N3j2M6Ro7K28k95K66k85P3K25k00O9Lmj47R4R1q5j11J40j19J88j35J5J68
6976A55k06k8J8l7R6R8j07J60k4k02J60j72j4J47o5M0M8k4k03J35P9Q2l12J30
7000d6j23J19J27j50J9J03j4J44k32K56n0k61K35j88n6L1J12po4K05j96O0n6n6
7024h8m0n9K09Q4l4j81J26O2j48N1J07j43L5n0K09q1j19J9oj01J38L9oN9o3j3
7050Fj34L18j66M8j91J97m7n5m0J01L7R8k53J26j66Q5P3r5J13m1j71LJ82Q9j07
7075A0J04l1j76J16K3m2j72K25j37N9k7R7q5K16j34m9k5mj07K29r8r1J7rJ03j92
$$ y = [-24, -26, -112, -80, -92, 26, 162, 161, -22, 107, -52, -95, -58, -13, -7, -83, 54, -122, -48, -59, 0, 15, -77, -158, -7, 11, -171, 70, 99, 33, -9, 121, 15, 110, 87, -91, -41, -104, -14, 13, 60, -4, -48, -34, -69, 35, 78, 83, 91, -105, 62, -67, -39, 106, -53, 0, -12, 34, 43, -24, 204, -91, 175, -110, -37, 188, -12, 57, 60, 56, -91, 3, 94, 9, -102, 38, -81, 107, -28, -13, 155, -51, -79, -61, -98, -2, 96, -11, 149, 125, -77, 83, -89, -103, 44, -21, 19, 67, 43, -160, -25, 54, 136, -176, -46, -169, -50, 77, -73, -54, 49, 35, 179, -53, 203, 153, -108, 127, -61, -117, -86, 26, 19, -45, 160, -36, 24, -32, -88, -128, -187, 22, 106, 72, -109, 17, 79, -69, -18, 89, -54, -19, -69, 140, 59, -60, -41, -47, -148, -10, 29, 23, 82, 19, 6, -128, 190, 24, 72, -119, 78, 31, -24, -64, 37, 74, 172, -81, 45, -121, -36, 37, -58, 55, 14, -157, -154, 28, 117, 10, 114, 83, -93, 23, 46, 4, -168, 57, -80, -21, -48, 49, -36, 180, 46, -3, -28, -32, -139, 90, -8, -99, -82, -91, 12, -180]
7101a80L05k70R5K02j58K2m3JO0J4M5j01N3K7r3J04m1l3M3P4r1j33P2Q3q2mJ00
7128G1Op0q2j4J5P2J31n7j13Q0J49k55Q2Q5j00k2M2o1j16J29%j08K05j56J4O5
7154hn5O7n0p6K20l00K18N7q1J5k6N0P3k3j36J47j50J82j36%j17J87j40J46qn7
$$ y = [-180, 125, -145, -50, 152, -6, 16, -27, -26, 34, 48, 93, -8, 45, 72, -21, 83, 42, 9, 52, 126, 35, -98, -26, 57, -25, -29, 71, 77, 7, -75, -89, -74, -2, 129, 72, -41, 39, 188, -67, 15, 100, 0, -22, 20, -41, -157, -28, -28, -136, 69, -87, -73, -8, -63, 4, -46, -122, 98, -202, 16, 73, -8, 7, -19, 31, 104, 81, -55, 92, -58, 124, -12, -12, -129, 58, -82, 64, 56, -1]
$$ [...]
8191i4
##END NTUPLES=NMR FID
##END=
