##TITLE=1H_AM_NV181
 200.13MHz, ,
 8 sc
 
 28.3.2025
##JCAMPDX= 6.0         $$ Bruker NMR JCAMP-DX V2.0
##DATA TYPE= NMR FID
##DATA CLASS= NTUPLES
##ORIGIN= UXNMR, Bruker Analytische Messtechnik GmbH
##OWNER= pz
$$ XWIN-NMR		Version 3.5
$$ Fri Mar 28 15:45:47 2025 Russian Standard Time (UT+4h)  she@DPX200
##.OBSERVE FREQUENCY= 200.1313
##.OBSERVE NUCLEUS= ^1H
##.DELAY= (6, 6)
##.ACQUISITION MODE= SIMULTANEOUS
##.ACQUISITION SCHEME= undefined
##.AVERAGES= 8
##.DIGITISER RES= 18
##SPECTROMETER/DATA SYSTEM= spect
##.PULSE SEQUENCE= zg30
##.SOLVENT NAME= DMSO
##.SHIFT REFERENCE= (INTERNAL, DMSO, 0, 14.3821)
##AUDIT TRAIL= $$ (NUMBER, WHEN, WHO, WHERE, WHAT)
$$ ##TITLE= Audit trail, XWIN-NMR		Version 3.5
$$ ##JCAMPDX= 5.01
$$ ##ORIGIN= Bruker BioSpin GmbH
$$ ##OWNER= she
$$ F:/spectra/data/she/nmr/H-C/1/audita.txt
$$ ##AUDIT TRAIL=  $$ (NUMBER, WHEN, WHO, WHERE, WHAT)
(   1,<2025-03-28 15:44:10.95 +0400>,<she>,<DPX200>,
      <created by zg, POWCHK disabled, PULCHK disabled
       configuration hash MD5:
       00 E9 B6 7A A2 85 ED C7 34 08 36 98 17 FE 4E 26
       data hash MD5: 16K
       0A 71 46 76 A7 02 6F C1 5E 2A 8B 35 10 EB 67 6E>)
$$ ##END=
$$ 
$$ hash MD5
$$ CC 32 B7 A3 B8 E8 74 60 A5 ED D1 E8 59 35 0C AF
##$RELAX= 
##$RELAX= 
##$RELAX= 
##$RELAX= 
##$RELAX= 
##$RELAX= 
$$ Bruker specific parameters
$$ --------------------------
##$DU= <F:/spectra>
##$EXPNO= 1
##$NAME= <H-C>
##$PROCNO= 1
##$TYPE= <nmr>
##$USER= <she>
##$AMP= (0..31)
100 100 100 100 100 100 100 100 100 100 100 100 100 100 100 100 100 100 
100 100 100 100 100 100 100 100 100 100 100 100 100 100 
##$AQSEQ= 0
##$AQ_mod= 1
##$AUNM= <au_zg>
##$AUTOPOS= <>
##$BF1= 200.13
##$BF2= 200.13
##$BF3= 200.13
##$BF4= 200.13
##$BF5= 200.13
##$BF6= 200.13
##$BF7= 200.13
##$BF8= 200.13
##$BYTORDA= 1
##$CFDGTYP= 0
##$CFRGTYP= 5
##$CHEMSTR= <none>
##$CNST= (0..31)
1 1 145 1 1 1 1 1 1 1 1 1 1 1 1 1 1 1 1 1 1 1 1 1 1 1 1 1 1 1 1 1 
##$CPDPRG= <>
##$CPDPRG1= <>
##$CPDPRG2= <>
##$CPDPRG3= <>
##$CPDPRG4= <mlev>
##$CPDPRG5= <mlev>
##$CPDPRG6= <mlev>
##$CPDPRG7= <mlev>
##$CPDPRG8= <mlev>
##$CPDPRGB= <>
##$CPDPRGT= <>
##$D= (0..31)
0 0.7 0 0 0 0 0 0 0 0 0 0.03 0 0 0 0 0 0 0 0 0 0 0 0 0 0 0 0 0 0 0 0 
##$DATE= 1743162250
##$DBL= (0..7)
120 120 120 120 120 120 120 120 
##$DBP= (0..7)
150 150 150 150 150 150 150 150 
##$DBP07= 0
##$DBPNAM0= <>
##$DBPNAM1= <>
##$DBPNAM2= <>
##$DBPNAM3= <>
##$DBPNAM4= <>
##$DBPNAM5= <>
##$DBPNAM6= <>
##$DBPNAM7= <>
##$DBPOAL= (0..7)
0.5 0.5 0.5 0.5 0.5 0.5 0.5 0.5 
##$DBPOFFS= (0..7)
0 0 0 0 0 0 0 0 
##$DE= 6
##$DECBNUC= <off>
##$DECIM= 32
##$DECNUC= <off>
##$DECSTAT= 4
##$DIGMOD= 1
##$DIGTYP= 9
##$DL= (0..7)
0 120 120 120 120 120 120 120 
##$DP= (0..7)
150 150 150 150 150 150 150 150 
##$DP07= 0
##$DPNAME0= <>
##$DPNAME1= <>
##$DPNAME2= <>
##$DPNAME3= <>
##$DPNAME4= <>
##$DPNAME5= <>
##$DPNAME6= <>
##$DPNAME7= <>
##$DPOAL= (0..7)
0.5 0.5 0.5 0.5 0.5 0.5 0.5 0.5 
##$DPOFFS= (0..7)
0 0 0 0 0 0 0 0 
##$DQDMODE= 0
##$DR= 18
##$DS= 0
##$DSLIST= <SSSSSSSSSSSSSSS>
##$DSPFIRM= 0
$$ [...]
##$SUBNAM0= <"">
##$SUBNAM1= <"">
##$SUBNAM2= <"">
##$SUBNAM3= <"">
##$SUBNAM4= <"">
##$SUBNAM5= <"">
##$SUBNAM6= <"">
##$SUBNAM7= <"">
##$SUBNAM8= <"">
##$SUBNAM9= <"">
##$SW= 18.0517328524113
##$SWIBOX= (0..15)
0 0 2 0 0 0 0 0 0 0 0 0 0 0 0 0 
##$SW_h= 3612.71676300578
##$TD= 16384
##$TD0= 1
##$TE= 0
##$TE2= 300
##$TE3= 300
##$TEG= 300
##$TL= (0..7)
0 120 120 120 120 120 120 120 
##$TP= (0..7)
150 150 150 150 150 150 150 150 
##$TP07= 0
##$TPNAME0= <>
##$TPNAME1= <>
##$TPNAME2= <>
##$TPNAME3= <>
##$TPNAME4= <>
##$TPNAME5= <>
##$TPNAME6= <>
##$TPNAME7= <>
##$TPOAL= (0..7)
0.5 0.5 0.5 0.5 0.5 0.5 0.5 0.5 
##$TPOFFS= (0..7)
0 0 0 0 0 0 0 0 
##$TUNHIN= 0
##$TUNHOUT= 0
##$TUNXOUT= 0
##$USERA1= <user>
##$USERA2= <user>
##$USERA3= <user>
##$USERA4= <user>
##$USERA5= <user>
##$V9= 5
##$VALIST= <valist>
##$VCLIST= <CCCCCCCCCCCCCCC>
##$VD= 0
##$VDLIST= <DDDDDDDDDDDDDDD>
##$VPLIST= <PPPPPPPPPPPPPPP>
##$VTLIST= <TTTTTTTTTTTTTTT>
##$WBST= 1024
##$WBSW= 4
##$XGAIN= (0..3)
0 0 0 0 
##$XL= 0
##$YL= 0
##$YMAX_a= 170738
##$YMIN_a= -145997
##$ZGOPTNS= <>
##$ZL1= 120
##$ZL2= 120
##$ZL3= 120
##$ZL4= 120
##$ABSF1= 10
##$ABSF2= 0
##$ABSG= 5
##$ABSL= 3
##$ALPHA= 0
##$AQORDER= 0
##$ASSFAC= 0
##$ASSFACI= 0
##$ASSFACX= 0
##$ASSWID= 0
##$AUNMP= <proc_1d>
##$AZFE= 0.1
##$AZFW= 0.1
##$BCFW= 1
##$BC_mod= 2
##$BYTORDP= 1
##$COROFFS= 0
##$CY= -3
##$DATMOD= 1
##$DC= 2
##$DFILT= <>
##$DTYPP= 0
##$F1P= 0
##$F2P= 0
##$FCOR= 0.5
##$FTSIZE= 0
##$FT_mod= 4
##$GAMMA= 1
##$GB= 0.15
##$INTBC= 1
##$INTSCL= 1
##$ISEN= 128
##$LB= 0.25
##$LEV0= 0
##$LPBIN= 0
##$MAXI= 10000
##$MC2= 0
##$MEAN= 0
##$ME_mod= 0
##$MI= 1.114404
##$NCOEF= 0
##$NC_proc= 0
##$NLEV= 6
##$NOISF1= 3.799351
##$NOISF2= 2.8
##$NSP= 1
##$NTH_PI= 0
##$NZP= 0
##$OFFSET= 14.38212
##$PC= 1
##$PHC0= -548.2751
##$PHC1= 11.39221
##$PH_mod= 1
##$PKNL= yes
##$PPARMOD= 0
##$PSCAL= 0
##$PSIGN= 0
##$REVERSE= no
##$SF= 200.129724274929
##$SI= 16384
##$SIGF1= 3
##$SIGF2= 2
##$SINO= 400
##$SIOLD= 16384
##$SREGLST= <1H.CDCl3>
##$SSB= 0
##$STSI= 0
##$STSR= 0
##$SW_p= 3205.1282051282
##$SYMM= 0
##$S_DEV= 0
##$TDeff= 0
##$TDoff= 0
##$TI= <>
##$TILT= no
##$TM1= 0
##$TM2= 0
##$TOPLEV= 0
##$USERP1= <user>
##$USERP2= <user>
##$USERP3= <user>
##$USERP4= <user>
##$USERP5= <user>
##$WDW= 1
##$XDIM= 8192
##$YMAX_p= 0
##$YMIN_p= 0
$$ End of Bruker specific parameters
$$ ---------------------------------
##NTUPLES= NMR FID
##VAR_NAME=  TIME,          FID/REAL,        FID/IMAG
##SYMBOL=    X,             R,               I
##VAR_TYPE=  INDEPENDENT,   DEPENDENT,       DEPENDENT
##VAR_FORM=  AFFN,          ASDF,            ASDF
##VAR_DIM=   8192,          8192,            8192
##UNITS=     SECONDS,       ARBITRARY UNITS, ARBITRARY UNITS
##FACTOR=    0.0002768,     1,               1
##FIRST=     0,             0,               0
##LAST=      2.2672688,     0,               0
##MIN=       0,             -145997,         0
##MAX=       2.2672688,     170738,          0
$$ Real data points
##PAGE= N=1
##DATA TABLE= (X++(R..R)), XYDATA
$$ plain form
0 0 0 0 0 0 0 0 0 0 0 0 8 -8 8 -16 16 -24 31 -32 40 -56 64 -80 94 -112 128 -152 176 -208 240 -278 318 -363
32 -363 414 -471 534 -602 678 -761 851 -952 1063 -1181 1312 -1455 1609 -1778 1962 -2164
48 -2164 2386 -2626 2892 -3183 3503 -3858 4254 -4695 5193 -5759 6407 -7158 8042 -9102
62 -9102 10401 -12032 14162 -17085 21400 -28599 44046 -145997 13049 -31531 -11428 90080
74 90080 48270 144386 -80669 90077 -84873 10746 -115874 -23301 7899 -36594 54110
85 54110 68059 29713 40767 -41155 -34641 -10578 -83964 26288 29812 52292 -51183 84691
97 84691 -25575 -44502 11583 -20678 23733 -70194 64304 -258 13616 -25592 74910 -56269
109 -56269 -31756 18059 -34770 28243 -929 62219 -30526 40730 -89450 27163 -17872 -34503
$$ packed form
0@%%%%%%%%%%Qj6J6k4L2m0N5o3P2r6J20j44J74k06K40k80L28l84M48n18N96o81
32c63P77q85J005j136J280j439J612j803K015k244K493k767L064l387L740m126
48b164M550n012N518o075O686p361Q112q949R888j0952J2166j3565J5200j7144
62i102J9503k2433K6194l1247L8485m9999P2645j90043J59046m4580K0103J01508
74I0080m1810R6116k25055J70746j74950R5619j26620R2573L1200m4493R0704
85E4110J3949l8346J1054q1922O514K4063p3386J10252L524K2480j03475J35874
97H4691j10266j8927N6085l2261M4411r3927J34498o4562J3874l9208J00502j31179
109e6269K4513M9815n2829O3013k9172O3148r2745P1256j30180J16613m5035j6631
$$ plain form
121 -34503 52158 -9503 45261 -34378 34988 -7171 -13618 -42569 25525 -5346 -38555 51760
133 51760 39590 -32912 24016 -525 -58757 -4674 -41720 53399 -11055 54373 24011 21165
145 21165 -17462 -36757 -3096 -80394 25831 -47951 47853 40315 15716 44077 32482 -29498
157 -29498 -51909 -793 -66238 -16965 13792 44340 16596 34994 14964 11012 -48056 -19950
169 -19950 2143 -56978 25043 14081 24551 15210 34365 -21520 436 -21138 -46964 12319
181 12319 -13548 6855 22714 31196 103 9752 -12412 4099 -33337 -17833 24730 -16900
193 -16900 242 29604 5194 -29673 28762 -13908 -6807 9779 -2216 4812 -1142 -1717 684
206 684 -1177 -16854 9091 -13428 11113 11557 1261 14145 8068 -29936 -7129 7584 -37271
$$ packed form
121c4503Q6661o1661N4764p9639O9366m2159o447k8951O8094l0871l3209R0315
133E1760j2170p2502N6928k4541n8232N4083l7046R5119o4454O5428l0362k846
145B1165l8627j9295L3661p7298J06225p3782R5804p538k4599K8361j1595o1980
157b9498k2411N1116o5445M9273L0757L0548k7744J8398k0030l952n9068K8106
169a9950K2093n9121Q2021j0962J0470r341J9155n5885K1956k1574k5826N9283
181A2319k5867K0403J5859Q482l1093R649k2164J6511l7436J5504M2563m1630
193a6900J7142K9362k4410l4867N8435m2670P101J6586j1995P028n954n75K401
206F84j861j5677K5945k2519K4541M44j0296J2884o077l8004K2807J4713m4855
$$ plain form
219 -37271 22991 20688 2189 7478 13815 -9262 -13802 -8342 -11083 -4416 -19346 22414 12507 5485
233 5485 29116 7027 -20553 -2874 -21813 -25768 14559 -1553 6090 22777 2251 -7898 8800
246 8800 -7072 -4719 -4199 -3203 6558 -9277 11423 17885 -11186 -7410 6586 -30091 -8473 19646
260 19646 -1892 17244 21371 -2741 -4121 -4641 -17427 -5546 -6912 -3370 4614 -2018 15374 11747
274 11747 245 14533 -4612 -25641 1322 -6593 -14802 20746 8956 -7446 9293 -1907
286 -1907 -7300 3835 1851 2167 -3104 -6608 3186 -6387 -2135 16284 -6362 -2929 11445 -11138
300 -11138 -617 16643 -7143 -5435 4086 -18419 -6802 7452 3677 11880 8731 4842 -780
313 -780 -11037 -1540 -794 -14914 3315 1804 -14627 13106 13370 -2119 14565 3312 -16762 -2920
$$ packed form
219c7271O0262k303j8499N289O337k3077m540N460k741O667j4930M1760r907p022
233E485K3631k2089k7580J7679j8939l955M0327j6112P643J6687k0526j0149J6698
246H800j5872K353N20R96R761j5835K0700O462k9071L776J3996l6677K1618K8119
260A9646k1538J9136M127k4112j380n20j2786J1881j366L542P984o632J7392l627
274A1747j1502J4288j9145k1029K6963p915q209L5548j1790j6402J6739j1200
286a907n393J1135j984L16n271l504R794r573M252J8419k2646L433J4374k2583
300a1138J0521J7260k3786J708R521k2505J1617J4254l775Q203l149l889n622
313g80j0257R497P46j4120J8229j511j6431K7733K64j5489J6684j1253k0074J3842
$$ plain form
327 -2920 -3704 -6318 5924 1953 454 -2516 -4411 6340 -579 -318 13225 -5030 -7078 10946
341 10946 -7488 -6240 11741 -9156 -9371 5625 -5395 1533 12146 4552 2769 -1528 -5289 -2113
355 -2113 -8891 1132 6214 -7783 6163 7357 -8890 5436 7931 -12150 2146 1516 -11848
368 -11848 3453 5781 832 4368 2457 -2731 -2086 -5949 4671 -2041 -5840 9212 -3344 -5813
382 -5813 9827 81 -7805 12427 -4228 -5512 6206 -3508 -2461 3091 -828 -3782 1524 -3613
396 -3613 6067 -3644 3710 6007 -7688 2677 4733 -8315 -1982 10314 -12117 4039 5140 -6154
410 -6154 -769 3048 -1742 -275 3425 -1040 4848 -5684 6667 -2107 -5442 2979 -1785 -7522 5760
425 5760 1209 -8030 13921 -2047 -2055 4259 334 -8675 4244 -589 -1395 1083 -2526 5899 -9361
$$ packed form
327b920p84k614J2242l971j499k970j895J0751o919K61J3543j8255k048J8024
341A0946j8434J248J7981k0897k15J4996j1020O928J0613p594j783m297l761L176
355b113o778J0023N082j3997J3946J194j6247J4326K495k0081J4296o30j3364
368a1848J5301K328m949L536j911n188O45l863J0620o712l799J5052j2556k469
382e813J5640r746p886K0232j6655j284J1718r714J047N552l919k954N306n137
396c613R680r711P354K297j3695J0365K056j3048O333J2296k2431J6156J101j1294
410f154N385L817m790J467L700m465N888j0532J2351q774l335Q421m764n737J3282
425E760m551r239K1951j5968qO314l925r009J2919m833q06K478l609Q425j5260
$$ plain form
440 -9361 2770 2864 -1117 -3490 11993 -6222 -2630 9915 -8279 3577 -436 -4136 -7048 4574
454 4574 -5510 6671 4995 1493 1013 -3898 3005 -3894 -1869 1172 4364 -15717 11484 -767
468 -767 -4386 8428 4088 -4049 -4546 5288 -10997 8199 -5467 6953 -3174 -3248 3810 -1524 3285
483 3285 2447 2634 -8459 6696 -13715 1678 4467 -1677 -600 9993 -2638 -5047 11583 -4665
497 -4665 2765 -8366 2107 -9722 -3674 3153 9551 -881 3199 9421 -11669 4330 -2219 -150
511 -150 -5129 4200 -11000 6041 -230 -2302 11213 -3281 3630 -8327 6706 -5950 3393 -1621
525 -1621 6686 -5097 -10118 10998 -8326 -1576 7972 4051 -7070 7193 -2638 1330 -3130 2378
539 2378 -2065 -2756 -3363 -645 6984 -5733 14255 -8824 6768 -6605 -5080 4114 -974 -864 -2182
$$ packed form
440i361J2131R4l981k373J5483j8215L592J2545j8194J1856m013l700k912J1622
454D574j0084J2181j676l502m80m911O903o899K025L041L192k0081K7201j2251
468g67l619J2814m340q137m97R834j6285J9196j3666J2420j0127p4P058n334M809
483C285q38J87j1093J5155k0411J5393K789o144J077J0593j2631k409J6630j6248
497d665P430j1131J0473j1829O048O827O398j0432M080O222k1090J5999o549K069
511a50m979R329j5200J7041o271k072J3515j4494O911j1957J5033j2656R343n014
525a621Q307j1783n021K1116j9324O750R548l921j1121J4263r831L968m460N508
539B378m443o91o07K718P629j2717J9988k3079J5592j3373J525R194n088J10j318
$$ plain form
554 -2182 11852 -14332 7179 3292 -60 -2932 1950 -417 -6001 -1606 3505 4243 -8216 9404
568 9404 -2841 -1779 -257 7047 -4255 3234 -1569 -7273 4985 -8948 3272 2537 3259 -4145
582 -4145 7415 -865 895 -1863 1203 1316 -11811 3020 715 -612 -3795 15801 -7238 -330
596 -330 4026 -4667 1020 -4188 5305 -3915 2177 -2895 4654 -2125 -701 1843 -3094 1111 -1429
611 -1429 -710 5092 946 -5467 8620 -4595 -4156 128 4172 -6525 1760 5252 -3418 2663 -3685
626 -3685 7210 -6818 35 3014 -1069 -2601 3413 1251 -4376 5137 -4967 1395 15 -1942
640 -1942 -810 5548 -3177 1107 3407 -2585 -175 -3683 4220 -3394 -1012 2652 3515 -6360 2939
655 2939 3836 -6907 2991 1373 -1562 -1402 2608 -1826 2716 -1144 326 239 -2716 180 -581 1469
$$ packed form
554b182J4034k6184K1511l887l352k872M882k367n584M395N111P38j2459J7620
568I404j2245J062J522P304j1302P489m803n704J2258j3933J2220p35P22p404
582d145J1560q280J760k758L066J13j3127J4831k305j327l183J9596k3039O908
596c30M356q693N687n208R493r220O092n072P549o779J424K544m937M205k540
611a429P19N802m146o413J4087j3215M39M284M044j0697Q285L492q670O081o348
626c685J0895j4028O853K979m083j532O014k162n627R513j0104O362j380j957
640a942J132O358q725M284K300n992K410l508P903p614K382L664Q63r875R299
655B939Q97j0743R898j618k935J60M010m434M542l860J470q7k955K896p61K050
$$ plain form
671 1469 725 534 -2202 4311 -4532 -790 5519 -2094 -2031 3966 -547 -5336 3403 -1240 -527 -1720
687 -1720 1330 1023 -1108 2481 3791 -602 -1726 1666 -6266 -818 -7 -1926 3138 3156 -2334 2630
703 2630 2461 -3410 1839 398 -2260 -3620 -25 803 441 158 4882 -840 -4937 3840 -1091 -2196
719 -2196 3226 1521 -3543 1253 -1182 -1250 2000 -506 546 11 -403 -667 1533 566 1440 -2748 -558
736 -558 494 -4621 2575 4031 -1411 405 3618 -4050 -2024 2173 -1524 -460 -74 160 -194 -358
752 -358 2869 2486 -1510 842 -1321 -3729 952 391 -1502 2647 -224 -3178 3172 497 -802 3174
768 3174 722 -2003 -1352 -477 -792 -1525 459 1800 -2078 -268 3933 -411 254 3774 -2710 -2611 140
785 140 -2829 -462 1944 514 832 1544 -350 41 -94 58 -289 -2288 715 -136 -1935 3437 1894
$$ packed form
671A469p44j91k736O513q843L742O309p613O3N997m513m789Q739m643P13j193
687a720L050l07k131L589J310m393j124L392p932N448Q11j919N064J8n490M964
703B630j69n871N249j441k658j360L595Q28l62k83M724n722m097Q777m931j105
719b196N422j705n064M796k435o8L250k506J052n35m14k64K200r67Q74m188K190
736e58J052n115P196J456n442J816L213p668K026M197l697J064L86K34l54j64
752c58L227l83l996K352k163k408M681n61j893M149k871k954O350k675j299L976
768C174k452k725O51Q75l15p33J984J341l878J810M201m344O65L520o484R9K751
785A40k969K367K406j430L18P12j894L91j35J52l47j999L003q51j799N372j543
$$ plain form
802 1894 -2438 1722 -95 -3785 747 1417 -1264 1117 1068 -776 79 -256 956 -641 -828 1099 -1586
819 -1586 -681 2313 -504 -682 2341 -2135 -1715 2185 -960 -303 2372 -260 -935 585 -285 -522 -914
836 -914 458 201 -1643 1337 1488 -1638 1511 1639 -2648 679 859 -2548 637 1045 -1465 553 626
853 626 -459 -87 349 592 -281 -218 1213 -627 -1674 2057 -1341 -1532 2181 -690 -1229 1978 141
870 141 -1509 1771 -419 -525 148 115 -217 -677 743 616 -911 32 1149 -2806 758 1488 -1251 978
888 978 1942 -1605 -355 1529 -2026 215 -216 -446 -918 327 1142 648 455 1245 -99 -2719 1330
905 1330 -1269 -1404 1641 449 -1548 1835 500 -1149 1751 -308 -724 -1129 21 -933 286 775
921 775 1766 -687 -55 1344 -2503 480 1075 -1057 -1142 1771 -2085 162 1885 -58 563 188 -45
$$ packed form
802A894m332M160j817l690M532O70k681K381m9j844Q55l35J212j597j87J927k685
819a586R05K994k817j78L023m476M20L900l145O57K675k632o75J520q70k37l92
836i14J372k57j844K980J51l126L149J28m287L327J80l407L185M08k510K018P3
853F26j085L72M36K43q73O3J431j840j047L731l398j91L713k871n39L207j837
870A41j650L280k190j06O73l3l32m60J420j27j527R43J117l955L564P30k739K229
888I78R64l547J250J884l555K241m31k30m72J245Q15m94j93P90j344k620M049
905A330k599j35L045j192j997L383j335j649K900k059m16m05J150r54J219M89
921G75R91k453O32J399l847K983N95k132q5K913l856K247J723j943O21l75k33
$$ plain form
938 -45 -1404 347 -219 663 -1405 876 -790 -1513 1749 781 -280 1471 1013 -3013 1368 -606 -919
955 -919 53 708 -1346 -354 880 263 1296 -216 2172 -2558 -234 29 -703 -352 1637 -435 -1654
972 -1654 2268 -2032 1110 903 456 -1026 527 -615 -786 582 273 459 -1886 1217 -694 -571 1106
989 1106 2261 -2073 919 153 -2513 497 157 353 -657 1779 -1307 1176 -209 824 -160 -1019
1005 -1019 239 -2273 318 475 982 -325 2883 -1391 -854 1190 -860 -1091 623 299 -2075 1058
1021 1058 -102 1186 -605 1528 32 -1242 -149 544 -690 -362 1669 -2319 816 -414 -133 214
1037 214 1788 -1066 462 867 -1740 668 -741 1127 -2024 900 239 -121 -440 1752 369 -2244
1053 -2244 2004 -1196 -835 191 1261 -940 1041 -6 -184 -241 -485 243 -740 700 -665 836 -332
$$ packed form
938d5j359J751n66Q82k068K281j666p23L262r68j061J751m58m026M381j974l13
955i19R72O55k054R92J234o17J033j512K388m730K324K63p32L51J989k072j219
972a654L922m300L142k07m47j482J553j142j71J368l09J86k345L103j911J23J677
989A106J155m334K992p66k666L010l40J96j010K436l086K483j385J033r84q59
1005a019J258k512K591J57N07j307L208m274N37K044k050k31J714l24k374L133
1021A058j160J288j791K133j496j274J093O93j234L28K031l988L135j230K81L47
1037B14J574k854J528M05k607K408j409J868l151K924o61l60l19K192j383k613
1053b244M248l200L61J026J070k201J981j047j78n7k44P28r83J440j365J501j168
$$ plain form
1070 -332 1519 -1394 778 418 -2234 530 431 -351 -864 2658 -1251 -63 482 30 -893 -419 826
1087 826 -378 -2 466 1188 -1700 1094 -505 -626 193 120 -630 589 647 -1224 1851 -516 -472 -439 564
1106 564 -806 -86 859 464 -854 -267 1422 -1920 264 849 -30 -1176 1691 -459 -524 899 -652
1123 -652 338 -832 375 -852 676 -128 496 101 249 -82 -1130 1268 -317 -354 596 778 -2184 489
1141 489 521 -980 333 818 121 -799 1053 90 260 -680 401 -1176 -1093 575 -91 535 1139 316 -647
1160 -647 1058 -1395 -375 418 -415 -832 506 529 -579 1007 583 468 -1431 340 -230 -1361 687
1177 687 1024 -372 -102 895 -993 110 506 -75 -37 160 -773 -101 208 34 165 94 314 -1001 278
1196 278 833 57 -463 1057 -796 -1631 812 5 -392 577 927 -746 149 146 268 -246 -72 250 -1031
$$ packed form
1070c32J851k913K172l60k652K764r9p82n13L522l909J188N45m52r23M74J245
1087H26j204L76M68P22k888K794j599j21Q19p3p50J219N8j871L075k367M4L3J003
1106E64j370P20R45l95j318N87J689l342K184N85q79j146K867k150o5J423j551
1123f52R90j170J207j227J528q04O24l95J48l31j048K398j585l7R50J82k962K673
1141D89L2j501J313M85o97r20J852r63J70r40J081j577Q3J668o66O26O04q23r63
1160f47J705k453J020P93q33m17J338K3j108J586m24j15j899J771n70j131K048
1177F87L37j396K70R97j888J103L96n81L8J97r33O72L09j74J31p1K20j315J279
1196B78N55p76n20J520j853q35K443q07l97R69L50j673Q95lJ22n14J74L22j281
$$ plain form
1215 -1031 34 34 191 216 778 -790 35 567 -991 682 811 -523 -597 468 -666 -654 518 648 -294
1234 -294 -42 810 -157 -577 655 213 -1343 244 -255 -518 592 674 211 289 90 -887 52 -235 -277 55
1254 55 350 82 -332 652 542 -614 45 578 -1228 -439 897 -212 -284 992 -30 -647 244 39 -122
1273 -122 -92 319 -67 -382 169 17 -343 364 -1 -446 442 130 -507 581 408 -906 211 126 -551 -113
1293 -113 560 147 -473 403 196 -444 -192 689 -382 -324 786 -258 -294 500 -189 -503 362 -192 -195 397
1313 397 206 -140 218 212 -356 -233 87 -74 -635 549 360 -541 474 375 -731 -121 432 -484 -12 538
1333 538 -83 -169 205 8 -261 -112 202 -395 -135 584 -86 109 627 -169 -692 289 -372 -523 638 271
1353 271 -213 243 275 -326 -55 216 -137 -601 124 105 -259 436 617 -389 -128 307 -798 -6 342 -131
$$ packed form
1215a031J065%J57K5N62j568Q25N32j558J673J29j334p4J065j134J2J172J30r42
1234b94K52Q52r67m20J232m42j556J587m99k63J110Q2m63P8j99r77R39k87m2L32
1254E5K95k68m14R84j10j156O59N33j806P89J336j109p2J276j022o17Q91k05j61
1273a22L0M11l86l15N51j52l60P07l65m45Q88l12o37J088j73j314J117q5o77M38
1293a13O73m13o20Q76k07o40K52Q81j071N8J110j044l6P94o89l14Q65n54lN92
1313C97j91l46L58on68J23L20j61n61J184j89r01J015r9j106O10N53r16M72N50
1333E38o21q6L74j97k69J49L14n97K60P19o70J95N18p96n23R81o61j51J161l67
1353B71m84M56L2o01K71K71l53m64P25j9l64O95J81j006K61M35j105P92L48m73
$$ plain form
1373 -131 -141 371 -176 -323 386 154 -1 -55 363 -522 -207 386 -81 -378 385 -63 -635 638 228 10
1393 10 304 279 -677 -260 -41 -277 47 296 287 -403 350 188 -175 57 344 -675 -346 374 -339 100 576
1414 576 11 -479 255 -268 -193 220 441 -105 -120 223 -398 -220 263 168 -525 438 1 -219 442 430 -351
1435 -351 -100 2 -743 -24 171 385 -68 557 20 -367 -77 118 -278 -323 492 -628 56 414 278 -113
1455 -113 456 -179 -624 135 -123 -11 3 479 -387 -22 129 66 -200 421 161 -542 304 -49 -188 -85 506
1476 506 -615 40 236 -73 96 271 247 -521 182 -240 -179 -244 485 -156 -12 485 -306 -149 134 35 -504
1497 -504 423 -158 -154 175 335 -186 -56 184 -406 -198 111 300 -354 567 108 -231 -108 209 -387 -155 420
1518 420 -340 178 109 288 -315 272 -195 -326 -9 29 -16 -107 637 -310 84 123 -122 -561 253 37 -362 395
$$ packed form
1373a31j0N12n47j47P09k32j55n4M18q85L15N93m67k97P63m48n72J273m10k18
1393A0K94k5r56M17K19k36L24K49ro90P53j62l63K32K87j019L29P20p13M39M76
1414E76n65m90P34n23P5M13K21n46j5L43o21J78M83r5o93R63m37k20O61j2p81
1435c51K51J02p45P19J95K14m53O25n37l87K90J95l96m5Q15j120O84L58j36l91
1455a13N69o35m45P59k58J12J4M76q66L65J51o3k66O21k60p03Q46l53j39J03N91
1476E06j121O55J96l09J69J75k4p68P03m22O1o5P29o41J44M97p91J57K83r9n39
1497e04R27n81ML29J60n21J30K40n90K08L09J89o54R21m59l39J23L17n96K32N75
1518D20p60N18o9J79o03N87m67j31L17L8m5r1P44r47L94L9k45m39Q14k16l99P57
$$ plain form
1540 395 140 -111 -115 439 -411 -54 -21 80 -258 218 313 -321 268 -46 -68 -293 355 -382 114 330 -109 33
1562 33 123 51 -479 291 -64 -84 -43 396 -274 -211 330 -143 -177 159 204 -503 326 62 -48 -63 84 -306 -244
1585 -244 231 -98 251 204 223 -311 159 -115 -304 20 168 -228 -80 503 -153 114 289 79 -549 68 -84
1606 -84 -232 177 303 85 -220 281 -288 -85 49 113 -256 154 32 -284 295 65 -89 -151 205 -437 47
1627 47 300 134 -84 104 52 -567 108 103 14 -88 431 -114 -138 281 -44 -98 -30 -1 -380 130 94 74 155 259
1651 259 -218 -182 135 -212 -70 203 147 -424 200 56 -230 60 291 -95 -230 276 -121 -57 88 122 -268
1672 -268 -110 21 -135 127 294 70 -28 141 -306 -156 113 0 -211 267 78 -210 206 238 -102 -206 219
1693 219 -290 -240 189 210 -125 148 173 -314 -54 47 -29 -60 183 -117 -28 85 -15 -59 84 -3 -300 164 96
$$ packed form
1540C95k55k51mN54q50L57L3J01l38M76R5o34N89l14k2k25O48p37M96K16m39J42
1562C3R0p2n30P70l55k0M1M39o70O3N41m73l4L36M5p07Q29k64j10j5J47l90O2
1585b44M75l29L49m7J9n34M70k74j89L24J48l96J48N83o56K67J75k10o28O17j52
1606h4j48M09J26k18l05N01n69K03J34O4l69M10j22l16N79k30j54o2L56o42M84
1627D7K53j66k18J88n2o19O75nq9j02N19n45k4M19l25n4O8K9l79N10l6k0Q1J04
1651B59m77L6L17l47J42K73n6n71O24j44k86K90K31l86j35N06l97O4J45L4l90
1672b68J58J31j56K62J67k24r8J69m47J50K69j13k11M78j89k88M16L2l40j04M25
1693B19n09N0M29K1l35K73K5m87K60J01p6l1K43l00Q9J13j00m4J43q7k97M64o8
$$ plain form
1716 96 -46 48 316 -226 -256 180 -126 -178 182 284 -224 111 174 -95 -106 105 -85 -197 128 21 8 89 91
1739 91 -174 74 -5 -228 51 83 -111 -9 265 -155 -171 133 2 -246 97 209 -179 -22 260 -102 -186 174
1761 174 -18 -149 103 126 -122 107 99 -91 9 15 -104 -44 182 -64 -6 174 -33 -221 87 36 -249 102 217
1784 217 -112 -87 249 -95 -144 97 -16 -240 4 171 -61 97 148 -46 -144 81 -117 -117 137 -2 -42 159
1806 159 74 -180 132 79 -147 -62 125 -119 -84 242 36 -136 38 82 -264 21 149 -84 6 140 -83 -173
1828 -173 69 -41 -76 84 29 -125 29 114 -53 22 117 -196 -182 125 -43 -76 198 84 -190 86 67 -130 25
1851 25 166 -71 -137 82 -54 -53 107 114 -162 31 55 -102 62 138 -109 -147 90 -164 -66 126 94 -70 83 56
1875 56 -214 -22 67 -58 -124 139 -76 -92 189 113 -74 57 5 -241 1 65 -36 27 179 -55 -70 81 11
$$ packed form
1716I6j42R4K68n42l0M36l06n2L60J02n08L35O3k69j1K11j90j12L25j07j3Q1K
1739I1k65K48p9k23K79L2j94J02K74m20j6L04j31k48L43J12l88J57K82l62q4L60
1761A74j92j31K52K3k48K29qj90J00Oj19O0K26k46N8J80k07j88L08n1k85L51J15
1784B17l29K5L36l44m9K41j13k24K44J67k32J58N1j94r8K25j98%K54j39m0K01
1806A59q5k54L12n3k26Q5J87k44L5L26k06j72J74M4l46K85J28k33R0J34k23r0
1828a73K42j10l5J60n5j54J54Q5j67P5R5l13J4L07j68l3K74j14k74K76j9j97J55
1851B5J41k37o6K19j36JJ60Pk76J93K4j57J64P6k47l8K37k54R8J92l2j64J53k7
1875E6k70J92Q9j25o6K63k15j6K81p6j87J31n2k46K42O4j01O3J52k34j5J51p0
$$ plain form
1898 11 -83 66 81 -199 22 96 -66 -30 157 -112 -146 98 -28 -69 70 81 -153 7 16 -107 -68 135 -27 -83
1922 -83 112 -31 -111 98 92 -170 71 13 -125 14 153 -28 -36 109 -68 -81 41 131 -115 64 48 -134 -64 116
1946 116 -14 -70 166 -102 -66 55 61 -135 49 0 -164 3 56 17 -83 164 -73 -118 19 7 -145 44 123
1969 123 -141 81 76 -33 -48 119 -93 -83 57 17 -44 60 117 -103 11 61 -80 -98 129 -70 -70 132 4 -79
1993 -79 42 48 -162 28 28 -46 -44 91 -28 -97 98 -16 -95 9 69 -145 49 68 -61 -6 84 -75 -62 116 -21
2018 -21 3 37 61 -126 19 62 -48 -24 115 -29 -110 163 -34 -66 58 39 -166 12 39 -78 59 46 -6 -122
2042 -122 65 -53 -67 57 53 -89 9 82 -125 46 64 -62 -69 110 -58 -37 114 42 -46 -17 46 -139 -2 86 27
2067 27 -45 116 -9 -114 97 -18 -84 5 34 -125 35 76 -27 21 61 -67 -116 17 -14 -49 40 85 -131 4
$$ packed form
1898A1r4J49J5k80K21P4j62L6J87k69l4K44j26m1J39J1k34J60Rj23L9K03j62n6
1922h3J95j43q0K09ok62K41n8j38J39J39j81qJ45j77j3J22R0k46J79j6j82P0J80
1946A16j30n6K36k68L6J21Oj96J84m9j64J67N3l9j00K47k37m5J37j2j52J89P9
1969A23k64K22nj09j5J67k12J0J40m0o1J04N7k20J14N0j41j8K27j99%K02j28q3
1993g9J21Ok10J90%p4KJ35j19o9J95j14p9J04O0k14J94J9j29N5R0j59J3J78j37
2018b1K4L4K4j87J45M3j10K4J39j44q1K73j97l2J24j9k05J78K7j17J37j3n2j16
2042a22J87j18j4J24mj42R8P3k07J71J8j26pJ79j68K1J51p2q8K9O3j85J37Q8n9
2067B7p2J61j25j05K11j15o6Q9K9j59J60M1j03M8M0j28m9J33l1l5Q9M5k16J35
$$ plain form
2091 4 82 -43 -1 107 -51 -89 81 -33 -9 59 60 -82 -4 32 -8 17 107 23 -102 63 -62 -70 60 61 -92 27
2117 27 59 -104 41 50 -26 -81 39 -40 -62 44 67 -47 -20 53 -103 -35 71 -3 -44 104 -58 -50 54 4 -32 23
2143 23 67 -93 38 55 11 -30 73 -6 -143 63 28 -61 48 88 -92 -3 41 -58 -24 26 -51 -53 42 -4 -23 9 40
2170 40 -83 -11 42 -81 -41 92 -19 -51 101 -25 -88 45 64 -73 34 49 -20 -30 50 27 -75 65 -13 -55 1
2195 1 57 -63 21 52 -95 16 16 -45 -30 74 -52 -59 34 12 -70 -14 68 -78 -25 81 -6 -91 87 2 -86 55 19
2222 19 -51 12 69 -30 23 24 -11 -28 35 -4 -32 54 19 -51 31 54 -99 19 84 -73 -32 62 -29 -51 68 5 -48 -17 33
2251 33 -57 -34 40 -4 -39 33 5 -72 48 25 -56 39 13 -79 60 38 -31 22 37 -42 -55 63 5 -35 34 68 -89 -19
2279 -19 72 -58 -19 55 -29 -80 49 -15 -5 34 4 -48 -23 5 -40 3 28 -25 -66 51 -4 -69 68 28 -78 14 42 -98
$$ packed form
2091DP8j25M2J08j58l8J70j14K4O8Jj42P8L6m0K5R0q4j25J65j25qJ30Jj53J19
2117B7L2j63J45Rp6n5J20p9k2J06K3j14K7P3j56O8J06p4m1J48j62QJ04n0l6N5
2143B3M4j60J31J7m4m1J03p9j37K06l5q9J09M0j80Q9M4r9L4N0p7kR5m6j9L2L1
2170D0j23P2N3j23M0J33j11l2J52j26o3J33J9j37J07J5o9j0Q0k3j02J40p8m2N6
2195AN6j20Q4L1j47J11%o1J5J04j26pR3k2q2N6Q2j46N3J06q7q5J78q5q8J41l6
2222A9p0O3N7r9N3Jl5j7O3l9k8Q6l5p0Q2K3j53J18O5j57M1R4r1k2J19o3n3L1N0
2251C3r0K3P4m4l5P2k8p7J20k3q1R5k6r2J39k2o9N3J5p9j3J18n8m0O9L4j57P0
2279a9R1j30L9P4q4n1J29o4J0L9l0n2K5K8m5M3K5n3m1J17n5o5J37m0j06R2K8j40
$$ plain form
2307 -98 12 69 -14 -24 47 8 -36 39 52 -39 -1 30 -50 -17 58 -12 -24 62 -33 -61 50 -11 -46 24 13 -81 -18 23 -17
2336 -17 -28 41 -9 -96 24 27 -59 26 63 -77 -5 22 -42 12 56 -10 -15 33 -2 -2 28 54 -48 -11 38 -29 -11 92 6 -57
2366 -57 63 -19 -57 40 19 -49 -9 17 -44 -11 29 7 -52 26 -9 -65 7 36 -55 7 46 -75 4 38 -37 -9 46 -28 -38
2395 -38 26 22 -29 5 50 -32 -22 51 2 -30 50 6 -57 46 20 -43 29 26 -58 -2 17 -29 -32 19 -12 -47 8 13 -53 -8 52 -64
2427 -64 -5 46 -36 -28 38 -27 -26 42 -13 -15 -4 32 -33 6 40 -4 -17 45 -1 -46 56 -3 -58 9 25 -78 9 34 -34 -7 24
2458 24 -10 -43 20 -7 -57 -12 28 -57 -23 33 -43 -16 43 -25 -51 46 -12 -27 43 3 -20 4 27 -20 -6 36 18 -35 35 9
2488 9 -42 42 27 -54 -8 25 -55 3 46 -11 -19 11 -25 -40 3 17 -45 -17 29 -59 -29 36 -9 -40 34 -20 -51 33 16 -22 24
2519 24 26 -44 5 29 12 -8 25 19 -45 35 22 -14 16 48 -46 -5 37 -29 4 34 -20 -46 17 -11 -23 11 12 -39 -36 38 -32 -23 32
$$ packed form
2307i8J10N7q3j0P1l9m4P5J3r1L8L1q0L3P5p0j2Q6r5k8J11o1l5P0j1r4O3M1m0
2336a7j1O9n0q7J20Lq6Q5L7j40P2K7o4N4M4o6nM8l5%L0K6j02L7M9o7J8J03q6o3
2366e7J20q2l8R7k1o8M0K6o1L3M0k2n9P8l5n6P2K9r1O2L9j21P9L4p5K8N5p4j0
2395c8O4mn1L4M5q2J0P3m9l2Q0m4o3J03k6o3P2lq4N6J9m6lN1l1l5N5No6M5O0j16
2427f4N9N1q2QO6o5JO8n5kJ1L6o5L9L4m4j3O2m6m5J02n9n5O7J6j03Q7K5o8K7L1
2458B4l4l3O3k7n0M5M0q5L4N6p6K7N9o8k6R7n8j5P0m0k3K4K3m7J4M2j8n3P0k6
2488In1Q4j5q1M6L3q0N8M3n7qL0l6j5M3J4o2K8M6q8L0O5m5l1P4n4l1Q4j7l8M6
2519B4Kp0M9K4j7k0L3oo4Q0j3l6L0L2r4M1M2o6L3L0n4k6O3k8j2L4Jn1LP4p0RN5
$$ plain form
2552 32 -20 -57 30 -4 -27 38 18 -39 4 27 -28 10 29 11 -16 29 13 -37 22 50 -15 0 51 -45 -16 34 -16 -16 28 -9 -31
2583 -31 10 6 -10 -7 26 -34 -27 14 -6 -32 28 -8 -55 18 2 -31 10 35 -42 8 16 0 -3 37 24 -31 21 5 -19 5 57 -20 -10
2616 -10 34 -38 -13 28 0 -37 21 -23 -15 -4 13 -19 -23 24 -34 -30 5 12 -37 21 5 -49 11 18 -28 3 44 -21 5 27 3 -15 17
2649 17 26 -18 20 26 -10 -2 46 -13 -17 28 -18 -22 33 -10 -35 12 -3 -21 -19 8 -27 -25 10 -11 -39 9 14 -50 4 6 -42 -5 29 -36 -3
2684 -3 16 -16 -12 15 -1 -15 33 16 0 -2 22 -24 -3 31 -10 -15 29 1 -49 35 5 -30 -1 -5 -38 -23 9 -22 -29 -4 6 -44 -8
2717 -8 6 -38 6 21 -20 -14 26 -30 -2 25 -23 -12 27 7 -11 17 28 -17 -22 26 -4 -16 44 18 -25 17 14 -22 25 8 -15 -8 -3
2750 -3 -25 -18 10 1 -26 -9 -9 -39 -2 13 -24 -26 16 -56 -21 22 -2 -16 15 8 -25 6 13 -9 -7 24 -3 -14 26 16 -5 22 8 -32
2784 -32 10 2 -29 12 14 -40 -2 11 -17 -3 4 -4 -36 -5 5 -28 -11 19 -32 -27 23 -26 -27 27 -13 -29 19 -10 -13 20 14 3 -2 29 0
$$ packed form
2552C2n2l7Q7l4k3O5k0n7M3K3n5L8J9j8k7M5j6n0N9K8o5J5N1r6K9N0n0%M4l7k2
2583c1M1mj6LL3o0PM1k0k6O0l6m7P3j6l3M1K5p7N0Qj6lM0j3n5N2j6k4K4N2p7J0
2616a0M4p2K5M1k8l7N8m4QJ1J7l2mM7n8ML5Pm9N8j6n4O0Pm6L1M1o5K6K2k4j8L2
2649A7Rm4L8Ol6QM8n9mM5m6mN5m3k5M7j5j8KK7l5KL5k1k8M8No4N4Km8L7L4o5L3
2684cJ9l2MK7j6j4M8j7j6kK4m6K1L4m1nM4k8n0Q4l0l5K9ml3J5L2l1pK5J0n0L6
2717hJ4m4M4J5m1OM0n6K8K7m8J1L9k0j8K8J1m5nM8l0j2O0k6m3M2ll6M7j7k3PN
2750ck2PK8rk7J7%l0L7J5l7kM2p2L5M3k4j4L1pl3L1Pk2KL1k7j1M0j0k1K7j4m0
2784c2M2ql1M1Kn4L8J3k8J4Pql2L1J0l3J7L0n1NN0m9jN4m0j6M8k9lL3oj1nL1k9
$$ plain form
2819 0 -1 30 7 -13 9 16 -33 7 23 -23 -2 10 -20 -15 10 2 -32 -4 -6 -19 -16 5 -23 -25 15 -26 -24 5 -12 -17 14 -7 -28 13 -7
2854 -7 -13 7 17 -8 0 18 2 -6 18 23 -20 23 13 -15 2 26 -14 -2 20 -15 -10 17 -6 -14 7 5 -30 -19 10 -24 -30 7 -16 -27 3
2889 3 -7 -16 7 -1 -18 -4 8 -10 -1 14 1 2 16 6 -9 22 21 -13 15 31 -15 -5 24 -20 -8 18 -12 -18 7 6 -23 -14 14 -22 -21
2924 -21 11 -19 -26 7 -4 -32 1 -1 -24 -6 4 -11 -2 13 -15 1 13 1 -17 10 2 -22 13 13 -7 2 26 -8 -6 16 -4 -13 9 5 -27
2959 -27 2 -1 -20 -14 7 -15 -10 11 -10 -16 -1 -8 -35 2 6 -21 15 12 -14 -6 10 -2 -2 14 7 0 9 14 9 17 35 7 -5 22 -3 -8 30 4
2997 4 -22 5 -10 -22 5 10 -20 -14 -2 -28 -26 3 -7 -30 -8 -7 -33 3 2 -20 -8 13 -11 -2 27 3 0 2 19 -13 4 19 0 6 24
3032 24 -1 -1 17 5 0 27 -6 -26 9 7 -13 -2 6 -9 -21 8 -17 -15 -8 2 -28 -5 6 -22 -4 4 -25 -11 23 -19 8 23 11 -12
3066 -12 14 18 -7 5 20 1 -5 28 11 -9 15 4 -13 13 14 -9 7 8 -5 -8 1 -18 -11 -6 -1 -10 1 3 -32 -8 -7 -17 -13 12 -18 -13 9
$$ packed form
2819@jL1k3k0K2Pm9M0J6m6K1J2l0NK5ql4K8kj3LK1k8kM0m1KK9j7nL1k1k1M1k0
2854goK0J0k5QJ8j6qK4Nm3M3j0k8J7K4m0J2K2l5NK7k3qK1kl5J1K9l4oL7k3j1L0
2889Cj0rK3qj7J4J2j8RJ5j3JJ4j0j5L1jl4K8J6m6J0K9m4J2K6l0oK5jk9RK8l6J
2924b1L2l0pL3j1k8L3kk3J8J0j5RJ5k8J6J2j2j8K7qk4L5%k0RK4l4KK2k0rK2ml2
2959b7K9lj9OK1k2NK1k1oJ5pk7L7Mk7L6lk6QJ6j2%J6ppRNnQJ8k8j2K7k5nL8k6
2997Dk6K7j5j2K7Nl0OJ2k6KK9j0k3K2Jk6L6jk2J2K1k4RK9k4lKJ7l2J7J5j9OJ8
3032B4k5%J8j2nK7l3k0L5kk0J1Qj5j2K9k5KPJ0l0K3J1k8J8Qk9J4L4m2K7J5j2k3
3066a2K6Mk5J2J5j9oL3j7k0K4j1j7K6Jk3J6Jj3lRj9PNNrJ1Kl5K4Jj0MK5l0NK2
$$ plain form
3103 9 2 -8 3 6 -18 11 8 0 4 24 5 -1 19 -2 -9 17 18 -10 17 9 -17 0 14 -17 -18 2 -6 -19 -6 -11 -21 -1 -9 -21 -10 0 -14
3140 -14 -15 7 -9 -8 4 1 -6 5 14 -7 1 11 -3 -6 13 -2 -10 15 17 -8 9 9 -12 14 13 -21 0 7 -9 -6 -3 -7 -19 -17 -3 -11 -15 8 -21
3179 -21 -20 -8 -19 -25 4 -9 -22 -4 -8 -13 3 -4 -5 -11 14 -4 -1 9 0 2 11 9 -13 12 24 -3 3 12 -12 -15 5 -5 0 6 -3 -19 -9 -6 -21 -12
3219 -12 -8 -25 -20 0 -10 -24 9 -4 -21 11 2 -7 0 7 7 2 5 7 5 9 11 -6 -6 11 -12 -1 17 -6 -3 17 -1 0 13 -3 0 -1 0 -18 -16 -3
3259 -3 -7 -13 -2 -18 -27 -6 1 -26 -7 -1 -16 -8 1 -8 -6 13 4 -11 14 12 -3 14 11 6 5 12 10 -9 13 1 -7 8 -8 1 -4 11 -15 -2 5 -13 -11
3300 -11 5 -12 -19 -6 -17 -11 -7 -9 -18 -15 7 -4 -3 -4 -10 -7 10 1 -4 10 22 2 15 13 -5 0 14 1 -6 18 8 -5 10 -10 -18 -9 -4 -3 -3 11
3340 11 -8 -23 -1 -7 -19 -12 -14 -23 -6 7 -13 -10 6 -18 -5 6 -12 -13 -10 7 -9 -1 3 -4 13 19 2 4 17 9 -2 11 -1 -3 11 0 -12
3377 -12 -3 -1 -6 -13 5 -15 -21 -3 -11 -21 -13 -14 -25 -3 -8 -11 -6 1 -5 -4 5 5 -11 5 2 -3 -6 10 2 -1 15 5 -4 25 5 5 18 1 -1 13 13 -1 -8
$$ packed form
3103Ipj0J1Lk4K9lqMK0j9oK0k1pK6Jk8K7qk6J7J4l1jK0qj3J3nj0K0qj2J1J0j4
3140a4jK2j6JJ2lpJ1Rk1QJ0j4lJ9j5qK5Kk5J7%k1K6jl4K1Pj6LLmj2KJ4qmK3k9
3179b1JJ2j1oK9j3j3J8mnJ6pjoK5j8LJ0rKRkk2K5J2k7ORk4lK0j0NOrj6J0Lj5R
3219a2Mj7NK0j0j4L3j3j7L2rrPP%nLKkMKj7%J7k3J1J8k3LK0j8JJ3j6LjJj8KJ3
3259cmoJ1j6rK1Pk7J9Oj5QRrKJ9rj5K5kj5J7lnjPkj9K2j2qJ5j6RnJ5k6J3Pj8K
3300a1J6j7pJ3j1OMkrLK2j1JjoLJ7rnJ4J2k0J3kj8NJ4j3pK4j0j3J5k0qRNJ%J4
3340A1j9j5K2oj2PkrJ7J3k0LJ6k4J3J1j8jLJ7j6QMpJ7Oj7KJ3qj1J3j2kJ4j1j2
3377a2RKnpJ8k0oJ8qj0Qjj1K2nlNPoJR%j6J6lnlJ6qlJ6j0rK9k0%J3j7kJ4%j4p
$$ plain form
3420 -8 -3 -4 -18 -5 -19 -12 -1 -6 -22 -19 -6 -23 -9 -9 -17 -20 -1 -6 -14 5 10 -6 1 5 -5 -1 14 5 -8 8 8 2 9 16 -6 7 12 -7 -3 -2 4 -8
3462 -8 5 -7 -7 12 2 -19 -7 -5 -16 -14 -9 -24 -12 5 -7 -22 -11 -7 -11 -15 1 -7 -10 11 0 -3 8 -5 -10 7 11 -11 9 14 5 -7 10 -1
3500 -1 -11 8 -10 -10 2 -3 -18 -11 -4 -13 -16 -17 -14 -9 1 -14 -21 -14 -11 -16 -3 -15 -20 -7 1 -17 -3 3 -13 -3 14 6 -6 4 2 2 8 13 2 4 20 0
3542 0 -4 18 -2 7 -3 5 -18 -8 -1 -21 -20 -10 -10 -13 4 -15 -11 -15 -8 -9 -12 -10 -13 -12 12 -6 -7 8 2 2 10 10 4 9 11 -7 6 13 8 6 5 0 0 10 14 -7
3588 -7 3 -2 -11 0 -5 -18 -15 -3 -14 -17 -2 -12 -14 -11 -10 -17 -20 -7 -16 -3 -2 -6 -14 3 13 -16 4 -6 -8 -1 0 -1 6 6 -3 -6 -8 2 -4 4 9 -5 -1 -5 -11
3633 -11 -7 3 -14 -14 -10 -10 -12 -7 -4 -20 -14 -2 -6 -12 -2 -15 -7 0 -21 -20 6 13 2 2 -5 -11 -4 0 -2 4 6 2 8 1 11 5 6 0 -1 6 -12 -13 -17 -6 -16 -24 -11
3680 -11 -11 -17 -4 -4 -10 -8 -3 -16 -20 -9 -14 -8 5 -7 -10 -1 0 -1 5 11 -3 -1 2 11 2 5 8 7 14 18 -1 8 19 -2 -5 1 5 -2 7 -7 -17 -2 -11 -24 -22 1
3726 1 -14 -9 -10 -4 -8 4 -11 -17 0 9 -4 -2 11 9 8 10 5 -7 9 -2 10 21 9 7 8 13 2 -2 5 -7 -3 8 8 -9 -4 -10 -11 -4 1 -6 -22 -5 -13
$$ packed form
3420hNjj4J3j4PJ1nj6LJ3j7J4%qlJ9nqJ9Nj6PMj0MJ5rj3J6%oPPk2J3Nj9MJOj2
3462hJ3j2%J9j0k1J2Kj1KNj5J2J7j2j5J1MmmJ6qlK1j1lJ1j3nJ7Mk2K0Nrj2J7j1
3500aj0J9j8%J2nj5PPrljLNJ0j5pPLnJ3j2nJ3Qj8J4Oj6J0J7qj2J0k%ONj1KJ6k0
3542@mK2k0Rj0Qk3J0Pk0JJ0%lJ7j9MmPjlKlJK4j8jJ5o%Q%oNKj8J3Pnkjn%J0Mk1
3588gJ0nrJ1nj3LJ2j1lJ5j0kLJplJ3rJ3JmqJ7J0k9K0j0kPJjP%rlkJ0oQNj4Mmo
3633a1MJ0j7%M%kNLj6OJ2moJ0j3QPk1JK6Pj1%poPMkOKmOpJ0oJojPj8jmJ1j0qJ3
3680a1%oJ3%oKNj3mJ1nOJ3j2lRJjOOj4KLRrLLjPMj9RJ1k1lOMpRj4j0J5rj3KK3
3726Aj5NjOmJ2j5oJ7Rj3KJ3kjKnj2J6j1J2J1j2kJNj1mPj2MJ1%j7NojPNpj6J7q
$$ plain form
3769 -13 -18 -7 -14 -10 -1 -2 -12 -7 -3 -7 -3 10 -2 4 14 6 10 8 11 1 4 10 13 11 6 2 -1 -1 4 -1 7 -2 -3 -4 -6 -13 -11 -7 -8 -13 -14 -14 -21 -18 -2 -9 -7 6 -8 -12 -2
3820 -2 8 0 8 0 0 10 2 -1 12 9 2 12 10 12 5 3 -4 6 9 -4 -3 2 -5 -8 -5 0 0 -7 -5 -20 -7 -10 -18 -15 -9 -7 -16 -5 6 -7 5 5 5 -2 7 5 -4 8
3868 8 -1 6 7 7 2 2 0 7 8 4 -4 -1 4 -2 -12 0 1 1 3 -6 -8 -9 -13 -12 -14 -11 -11 -18 -17 -7 -20 -1 -1 -6 -4 0 -6 -9 2 -1 -3 7 9 2 -8 7 8 12 13 5 5 7
3920 7 -4 -1 -7 10 -5 -1 -6 -21 -7 1 -15 -16 -7 -4 -14 -17 -15 -21 -31 -10 -19 -17 -8 -13 -16 0 -3 -3 -4 -8 -11 -4 -3 -4 5 2 2 10 16 3 8 7 8 2 -15 8 -2
3967 -2 3 1 -3 -11 -2 5 -8 -3 -3 -10 -8 -9 -14 -13 -10 -10 -10 -4 -6 -6 4 1 -9 -3 -4 -6 2 0 -2 -7 2 4 11 15 -3 0 12 3 3 -1 2 0 -2 3 -5 -15 -2 -9 -10 -13 -8 -16 -20 -7
4021 -7 -18 -21 -9 -7 -11 -3 -4 -5 -7 13 -4 9 -10 -4 7 8 -2 -2 6 3 -6 6 12 12 4 8 8 6 -2 3 2 2 3 -10 -9 -7 -12 -9 -5 -2 -10 -2 -12 -19 -5 -9 -5 -3 -3
4070 -3 -7 -5 6 -2 4 2 -6 -2 1 -5 6 10 -1 1 9 10 -3 6 8 -6 1 6 4 -4 -4 -2 -16 -5 -6 -16 -12 -3 -11 -11 -8 -6 -20 -11 -10 -10 -4 3 -12 -2 -3 -10 -3 4 1 1
4120 1 10 10 3 2 9 9 6 7 6 -6 12 -8 7 9 -2 -2 -2 -6 -8 1 -1 -17 6 -1 -6 -6 -10 -10 -3 -7 -17 -5 -4 -15 -6 -2 -8 -6 -5 5 -8 -1 0 5 1 6 5 10 7
$$ packed form
3769a3nJ1pMRjj0NMmMJ3j2OJ0qMkLj0LOLknml%NnQrjjkpKMjnj%pLJ6pKJ3j4mJ0
3820bJ0qQq%J0qlJ3lpJ0kKpkpJ0Lj3JNplLN%pKj5J3lqLOKrJ1J1j3J2%%pRkrJ2
3868HrPJ%n%kPJmqLNoj0J2J%KrkjmJkL%pJJ0j3J9%nKMolJ1lkJ0Kpj0J5JMJq%K
3920Gj1LoJ7j5Mnj5J4Qj6jRLj0lKoj0K1rKRnlJ6l%jmlPJjRl%QOj3NjJoj7K3j0
3967bNkmqRPj3N%pKjnJL%%Ok%J0lj0OjkQkknRKPMj8LJ2r%mLkkNqj0J3pjlNqmJ3
4021gj1lJ2KmQjjkK0j7J3j9OJ1Jj0%QlrJ2O%qM%kqNj%Jj3JKnLMLqQj0pJ4mMK%
4070cmKJ1qOkqMLoJ1Mj1KQJj3RKj4PNkq%Kj4J1jj0MRq%LKj4RJ%OPj5J0jpPPl%
4120AR%pjP%lJjj2J8k0J5Kj1%%mkRkj6K3pn%m%Pmj0J2Jj1RMoKJJ0j3PJNmNjNl
$$ plain form
4169 7 13 10 5 6 3 -2 6 0 -9 -11 -12 -4 0 -11 -6 -15 -9 -4 -12 -6 -5 -14 -14 -1 -10 0 -4 -3 -2 11 1 -10 -2 6 2 0 4 -1 5 0 8 3 16 -2 4 7 13 5 -5 3 7 3
4221 3 2 -7 4 -6 -8 0 -5 -8 -8 -19 -19 -7 -7 -19 -7 -2 3 -14 -4 -5 1 -10 -5 7 -1 3 5 -5 1 6 8 8 11 9 0 4 6 2 -4 0 -4 -2 -16 8 -3 2 -7
4268 -7 -12 -18 -18 -14 -16 -10 -20 -18 -11 -10 0 -9 -8 -20 -8 -9 -13 -13 13 -5 1 1 0 -5 12 16 7 4 4 -1 4 1 5 0 -1 4 -5 -2 -6 -8 -7 0 0 -12 -6 -15 -19 -19 -9 -22 -14
4319 -14 -5 -15 -4 -6 -17 0 -1 -19 -6 0 3 1 -2 1 -1 15 4 8 3 4 4 8 16 4 -5 -4 -7 2 0 -11 -5 -2 -8 -8 -8 -9 -16 -12 -10 -15 -16 -7 -2 -7 -7 0 -20 0
4367 0 -6 0 2 -1 -2 -1 7 1 4 13 16 3 8 6 7 2 4 9 9 -2 -3 -2 -6 -10 -3 -3 0 -9 -11 -14 -9 -18 -9 -11 -17 -19 -10 -1 -8 -7 -10 -9 1 -2 8 1 6 2 12 5 12 15 7 13 9 16
4423 16 -1 12 21 10 6 4 -1 10 4 0 0 7 -10 -6 -18 -9 -13 -5 -7 -24 -6 -13 -15 0 -6 -4 1 -9 0 0 -1 -1 -3 -2 4 5 -7 3 4 5 9 10 11 -2 5 0 4
4470 4 3 0 -5 -6 2 -7 -4 -2 -7 -12 -6 -5 -7 -10 -18 -16 -5 -11 -12 -14 -12 -5 -4 8 2 6 9 12 3 9 12 7 14 18 11 13 2 7 11 16 21 1 9 -3 -3 -11 -7 6 -7 -8 -14 -11 -2 -11
4524 -11 -3 2 -7 -5 -8 -11 -11 -14 2 -2 1 -4 2 0 3 -2 2 11 4 2 8 6 18 5 12 8 11 12 9 1 1 11 -5 1 3 -2 -5 5 -4 -7 -9 -8 -11 -7 -9 -16 -5 -1 0 -1 -6 -1 -6
$$ packed form
4169GOlnJlnQorkjQMj1NrONqOJr%J3rJ0mJJJ3j0j1QQmkMnOnQnJ3j8OLOqj0QMm
4221CjrJ1j0kQnl%j1%J2%j2J2NNj7J0jOj1NJ2qMKj0ONK%LkrMKmoMmKj4K4j1Nr
4268gno%MkOj0KPJJ0rJj2J2jm%K6j8O%jnJ7Mrl%nNlMnjNrLmkJP%j2Orm%J0j3Q
4319a4Rj0J1kj1J7jj8J3OLklLkJ6j1MnJ%MQj2rJlRkj1OLo%%jpMKnjRNn%Pk0K0
4367@oOKljJQoLRLj3NkJnKN%j1jJmmP%LrklNrRkokRRpJlJJ0lJ0pNmJ0pPLqOmP
4423A6j7J3Rj1mknJ1om%Pj7Mj2RmQkj7J8pkJ5oKNj0R%j%kJOJj2J0JJMJJj3PnM
4470DjlnjQrLKnnOJklqKJ1ojkKPJJ2oMLLrOLnPMpKj1NMNNk0Qj2%qMJ3j3joLRr
4524a1QNrKll%lJ6mLnOkLnMRpkOkJ2j3PmLJlq%J0j6OKnlJ0rlkJlMkpJ1MJjnNn
$$ plain form
4577 -6 -3 -9 -2 8 4 -2 9 12 6 10 9 5 -6 9 5 9 6 5 -5 5 7 5 7 -6 -2 -3 -5 -15 2 -13 -8 -2 -11 -8 -13 -10 3 -12 -14 -3 -7 -11 3 -5 -4 5 -2
4624 -2 -3 11 4 1 7 14 0 8 12 8 -8 -2 6 3 11 17 4 2 0 -6 -7 -10 4 -19 -6 -14 -14 -13 -8 -14 -20 -12 -16 -10 -5 1 -11 -12 -11 -9 -8 5 -3 -6 6 11 -6 7 9
4673 9 9 10 -2 3 14 3 7 8 0 0 -14 -1 -5 6 -11 -15 -1 -9 -7 -22 -7 -10 -8 1 -8 -10 -1 -4 -9 1 -10 -1 -9 6 -1 3 9 16 10 0 17 19 11 19 14 10
4719 10 13 15 10 7 2 6 1 3 -9 -1 -4 -7 -1 -10 -3 -4 -15 -22 -6 -18 -3 -8 -9 -9 3 2 0 -2 -5 2 -3 16 13 5 -2 5 8 14 11 9 10 8 2 -6 3 0 -8 -5 0 -4 9 -3
4771 -3 -5 -5 -8 -15 -9 -8 -18 -16 -15 -10 -11 5 -2 -11 6 -10 -7 -16 -6 -7 6 14 14 14 3 12 3 15 12 -1 13 -6 12 8 7 11 -1 6 9 2 -5 -13 3 -6 -7 -12 -8
4818 -8 -7 -12 -10 -7 -9 -9 -11 -15 -8 -10 -12 -8 -7 -9 -2 4 2 5 4 18 7 13 22 11 13 9 1 0 8 12 14 4 2 -7 -3 7 -12 -16 -7 -4 -11 -11 -19 -16 -26 -12 -16 -2 -7 -7 4
4869 4 -6 -2 -11 -8 -9 -7 -2 3 -3 12 17 1 10 10 11 7 17 13 15 16 6 11 3 9 -9 6 12 -4 -12 -15 -1 -20 -7 -5 -15 -9 -21 -13 -9 -7 -11 -15 -12 3 -6 -10 2
4916 2 9 4 -8 11 -2 10 3 3 10 7 9 17 5 6 7 3 14 6 -9 -11 1 9 0 -5 -3 8 -9 -11 -11 -11 -3 -15 -8 -14 -2 -12 -4 -7 -3 -2 -4 -15 6 5 7 0
$$ packed form
4577fLoPJ0moJ1LoMjmj1J5mMljj0J0KkKj3Mjkj0J7j5NOrLnLJ3j5kJ1mmJ4qJRp
4624bjJ4plOPj4QMmj6OQlQOj3kkojlJ4k3J3q%JNooQmONOj2jJKJJ3qlJ2Nj7J3K
4673I%Jj2NJ1j1MJq%j4J3mJ1j7mJ4qKj5J5lKRrkRlnJ0j1RqJ5pMOPoj0J7KqQnm
4719A0LKnlnMnKj2QllOrPjj1pJ6j2J5nj%J2jkklPnJ9lqpPLOlkJkoqRlqLNmJ3j2
4771ck%lpOJj0KJNjJ6prJ7j6LrJ0jJ3Q%%j1RrJ2lj3J4j9J8mjMj2PLppqJ6rjnM
4818hJnKLk%kmPkkMJkPOkLjJ4j1ORj1KmqjQMKj0krMJ0j9mRLp%qLj0J4mJ4n%J1
4869Dj0MrLjKNNoJ5Nj6R%JmJ0mKJj0NqOj8J5Oj6qlJ4j9J3Kj0Oj2QMKmmLJ5rmJ2
4916BPnj2J9j3J2p%PlKQj2JJmJ1qj5kJ2QrnKJ1j7k%%Qj2PoJ2j0QlMJkj1K1jKp
$$ plain form
4962 0 1 9 2 5 7 11 7 11 1 0 4 9 8 6 -2 -1 -4 -9 4 1 0 -12 -17 -12 -14 -15 -13 -10 -5 -15 -8 -1 -12 -8 -3 3 -7 -9 -5 -2 3 5 4 7 7 10 12 6 4 18 16 -1 2
5015 2 6 7 2 10 0 -5 -1 -7 -9 -9 -10 -12 -3 -8 -5 -15 -7 -6 -7 -11 -12 -5 -12 -1 -15 -7 -9 -4 4 2 -1 6 6 -3 0 -1 4 9 3 6 10 9 19 3 13 9 -1 2 5 -6 -1 -6
5067 -6 -11 -1 -8 -3 -13 -11 -15 -7 -14 -12 -7 -4 -9 1 -6 -11 -2 -2 7 3 1 3 -1 -1 -4 1 1 6 5 1 9 -8 12 -8 -3 -3 3 -8 -11 -13 -2 -11 -8 4 -14 -9 -7 -21 -17 -23
5117 -23 -15 -6 -15 -4 2 -3 -11 -1 -4 -16 2 -4 -10 1 0 7 7 6 5 1 10 7 -5 15 2 -7 3 -1 -1 0 4 -6 -16 4 -11 4 -9 -7 1 -14 -21 -9 -20
5160 -20 -11 -16 -7 -11 -11 -11 -12 -7 -11 7 -2 2 -5 7 13 3 19 10 0 14 7 8 12 4 7 5 -1 7 4 -5 -8 -5 -7 -13 -7 -9 -3 -4 -7 -8 -18 -15 -11 -6 -17 -2 -7 -8 -11 0
5210 0 -2 2 -1 1 1 12 5 3 4 12 5 11 4 6 7 7 -5 -3 8 -1 -2 -5 0 0 3 -10 -5 -13 -6 -15 -16 -6 -19 -10 -10 -13 -9 -6 -5 -7 -6 -2 2 10 -3 1 10 11 5 9 15 2 21
5263 21 6 10 17 5 4 5 11 8 8 13 2 0 0 -1 -2 -4 -10 -10 -5 -6 -13 -12 -11 -8 -13 -7 -15 -8 -7 -13 -3 4 1 3 8 -3 2 3 9 12 6 15 11 4 6 6 13 6 -2 -3 3 4 4 8 0
5318 0 -7 -8 -8 -1 -5 -7 -4 -4 -12 0 -15 -16 -2 -13 -11 -8 -14 2 -1 -1 7 -4 11 1 -2 7 9 4 11 16 11 5 4 5 -3 2 9 2 2 -3 -1 3 2 -10 -7 -11 -8 -7 -17 -15 -29
$$ packed form
4962@JQpLKMmMj0jMNjkqJlnJ3ljj2nNkjKLNj0PPj1MNOj0kMLNKjL%LKokJ4kj7L
5015BMJnQj0nMok%jkRnLj0QJjmjPpJ1j4QkNQklP%rLjNNoLMjJ0j6J0mj0LLj1Nn
5067fnJ0pNj0KmQpKNLnJ0pnR%RmkKm%lN%NjmQj7K0k0N%Oj1lkJ1rLJ2j8NKj4Mo
5117b3QRrJ1OnqJ0lj2J8ooJ1jP%jjmRlj2K0j3rJ0m%JMj0j0K0j5J5j3KQj5pJ2j1
5160b0RnRm%%jNmJ8rMpJ2Oj0J6rj0J4pJMqLkoQlrlLkoOkOjljj0LMNj1J5njlJ1
5210@kMlK%J1pkJQpOpKJ%j2KJ1rjlN%Lj3NqPrjJ0j3R%lMLJkJMMQj3MRJoMOj3J9
5263B1j5MPj2jJOl%Nj1k%jjko%NjpJJLnOqPJoJ0PlKNj1NJOLoRmpK%PpqjOJ%Mq
5318@pj%PmkL%qJ2j5jJ4j1KLoJ6l%Qj1J5j0lRKnPNnojJqNPp%nKMjj2LmLJj0Kj4
$$ plain form
5369 -29 -12 -18 -6 -12 -12 -16 -7 -18 -3 2 1 -4 -9 0 6 3 -1 8 10 4 4 -1 1 16 8 4 -4 -2 5 -3 2 -11 0 -14 -5 -1 -21 -14 -17 -16 -17 -14 3 -5 -16 -22 -6 -15
5417 -15 -7 -4 2 -8 -1 4 -10 -7 -7 7 0 1 4 -4 5 15 5 6 1 11 9 0 -3 10 -4 -3 1 -1 -5 1 -2 -13 -7 -10 -17 -27 -13 -19 -27 -20 -7 -14 -14 -11 -11 -6 -9 -4
5465 -4 -6 -4 -6 5 2 7 11 4 14 8 10 21 6 1 5 -8 -1 1 -6 -12 2 -7 -6 2 -7 -23 -20 -18 -9 -3 -24 -19 -10 -10 -21 -11 -13 1 -12 -14 -3 4 -1 -8 -4 3 -1 6
5513 6 9 11 15 10 13 -5 8 -6 4 7 2 3 -4 -5 -3 -5 -17 -5 -2 -5 -10 -19 -12 -9 -9 -7 -13 -14 -9 -5 -17 -8 -12 -2 -3 -2 -8 1 -14 -2 -4 1 6 5 11 -1 -8 -5 12
5562 12 13 16 11 9 1 0 -9 -7 -6 -4 -9 -17 -5 -11 -20 -10 -5 -8 -11 -16 -12 -13 -17 -5 -9 -6 -9 -9 11 -10 3 7 2 6 10 8 2 6 9 9 -2 3 4 6 1 9 -1 2 3 -6 3 -8
5614 -8 -9 -8 -2 -13 -11 -16 -13 -6 -7 -18 -14 -10 -16 3 6 -16 4 -4 3 -1 1 9 12 2 -2 12 9 6 11 8 4 -1 -3 2 3 -4 3 -1 -3 -7 2 -6 -8 1 -9 -12 -7 -12 -10 -11 -2 -8 -4
5667 -4 -8 -5 -6 -8 -5 -2 -6 -5 3 9 9 2 13 16 14 9 14 10 20 4 3 -1 12 8 2 7 6 -3 -6 16 -5 2 -13 -6 -6 -1 -1 -22 -2 -11 4 -7 -21 -8 -11 -5 -11 -2
5715 -2 -1 9 -5 5 -14 6 -2 0 6 10 11 8 5 5 3 6 0 4 11 -2 6 -1 -3 -2 1 -15 -3 -9 -14 -15 -9 -15 -17 -1 -13 -12 -11 -12 -9 -9 6 -11 2 -2 7 14 6 10
$$ packed form
5369b9J7oJ2o%mRj1J5NjnnROlmRKo%nKJ5qmqKPqNj3J1j4RMk0PlJjLJ7qj1oJ6r
5417a5QLOj0PNj4L%J4pJLqRJ0j0JnJ0krlJ3j4JMkmOlj1Olpj0J4oqPJ3p%L%NlN
5465dkKkJ1lNMpJ0oKJ1j5nMj3PKpoJ4rJQrj6LKROk1NR%j1J0kJ4j3kJ1PnpMPmP
5513FLKMnLj8J3j4J0LnJpjKkj2J2LlnrPL%KojNMj2RmJ0jJoRj5J2kNNjOj2pLJ7
5562A2JLnkqjrKJKnqJ2orJ0NllnMjmJ2mLl%K0k1J3MnMMkoML%j1NJKnQj0LJrRj1
5614hjJOj1KnLPjj1MMoJ9Lk2K0qPmKQLj0mJ4llNlmnkNJpPmkmRqkRj0lNnKjRoM
5667dmLjkLLmJQO%pJ1LknNmJ0j6jmJ3moNjrlK2k1Pj5P%N%k1K0rJ5j1j4J3lOoR
5715bJJ0j4J0j9K0qKOMJll%kLoMPj3QpkJLj6J2onjOokJ6j2JJjL%J5j7J3mRPqM
$$ plain form
5763 10 12 6 -2 12 -3 11 11 15 7 11 11 2 9 6 3 -6 -1 1 0 -5 -14 -11 -4 -7 -6 -10 -12 -26 -13 -23 -8 -16 -5 -6 -10 -2 1 -2 -6 0 -5 0 13 0 18 6 -2 9
5811 9 3 11 18 4 9 -7 0 8 5 9 6 11 -2 0 -5 -9 1 -7 -18 -9 -22 -12 -6 -12 -10 -7 3 -2 -8 -7 -1 -7 10 4 -3 2 5 9 9 -4 4 5 20 8 19 7 -4
5858 -4 4 6 0 -7 -2 0 0 -6 0 0 5 -3 -16 -12 -12 -9 -5 -3 5 -13 -12 -8 -21 1 -5 -3 1 9 1 -8 5 13 10 -10 5 7 13 0 5 -6 9 -2 -5 -8 2 5 5 0 -1
5907 -1 -7 -5 -11 -19 -4 -15 -15 -19 -13 -24 -21 -14 -14 -17 -5 -11 -6 -2 0 -4 2 3 -2 -4 6 -6 9 13 6 5 -4 13 5 10 3 -3 4 7 -4 -8 -11 1 -8 -7 -12 2 -13 -7 -7
5956 -7 -7 -16 -8 -16 -18 -22 -11 -15 -24 -9 -11 -8 -10 -9 -3 1 1 5 -1 -1 1 -3 5 9 -2 9 3 14 5 0 -3 4 5 -7 -1 0 -2 -16 -4 -7 -7 -1 -10 -8 -10 -11 -16 -6 -2 -10 -12 -4
6008 -4 -10 -13 1 -3 -4 -4 1 -3 6 1 13 8 10 0 7 22 0 14 8 3 -3 9 4 -1 5 -4 -10 0 -12 -2 -3 -11 -12 -15 -15 -8 -4 -9 -16 -14 -7 -11 -4 -15 -3 4 2 -3 2
6057 2 -6 10 -5 9 10 -6 -3 7 3 -2 5 8 7 9 3 -3 2 4 -13 3 -8 -8 -8 -8 0 -8 -22 -7 -15 -5 -8 -21 -9 -15 -2 -9 -6 -1 1 3 2 5 4 9 10 4 1
6104 1 3 13 -1 10 4 7 5 3 8 2 12 13 5 -8 -7 -3 -8 -9 -13 -1 -9 -1 -16 -6 -9 -14 -19 -14 -6 -12 -9 -2 -7 -11 8 -1 -3 -6 0 8 6 4 -2 -1 10 8 1 13 9 5
$$ packed form
5763A0KoqJ4j5J4%MqM%rPllrNKjnrLPlJmkj4J3j0J5qJ1jmQLlmOnNJ3j3J8j2qJ1
5811IoQPj4Nj6PQlMlNj3KnmJ0qj1Rj3J0OoKLJ0noJOoJ7opNLM%j3QJJ5j2J1j2j1
5858dQKopNK%oO%Nqj3M%LMKQj8JMj3K2oKMQqrJ3Qlk0J5KOj3Nj1J5j1llJ0L%nj
5907aoKoqJ5j1%mOj1LP%lJ2oNMKmOJnkJ0j2J5MpjrJ7qNpoPLj1mlJ2rJnJ4j5O%
5956g%rQqkmJ1mrJ5kLkJOM%Mo%KmQMj1J1oJ1rnlPJj2OJkj4J2l%OrKkjnJ0MqkQ
6008dolJ4mj%NmRnJ2nKj0PJ5k2J4onoJ2nnOroJ0j2J0jqjl%PMnpKPmPj1J2PknN
6057BqJ6j5J4Jj6LJ0mnPLjKooNKj7J6j1%%%Qqj4J5qJ0lj3J2oJ3pLNKKjLjNJol
6104AKJ0j4J1oLkkNoJ0Jqj3JMnjmJ2qQj5J0lnnNQoLPnmJ9rklOQkkoJJ1kpJ2mm
$$ plain form
6154 5 7 10 3 -4 0 -3 -4 -4 -10 -5 -14 -16 -9 -16 -6 -18 -1 -9 -4 -6 -9 -9 -6 2 -12 -1 -1 -10 3 1 -1 -2 8 4 13 -6 14 -4 -2 3 0 7 11 8 1 -9 2 9 0
6203 0 -3 -4 -7 -9 -9 -7 -12 -16 -13 -9 0 -17 -1 -8 -16 -13 -5 2 -3 3 -3 -3 8 9 -3 9 9 13 10 6 5 -2 6 -3 16 7 -3 0 4 -7 3 5 0 -4 -12 -8 -12 -22 -20 -6
6253 -6 -6 -8 -10 -18 -21 -15 1 1 -20 -17 -6 -3 5 -2 -7 -6 7 3 2 3 1 9 12 6 5 14 1 4 -2 -1 -8 2 0 3 -7 -3 -9 -15 -15 -15 -12 -7 -18 -5 -20 -9 1 -14
6301 -14 -8 -8 -1 -3 0 -2 3 6 1 0 -1 4 6 19 9 8 5 12 9 6 0 5 -7 2 -5 1 2 -8 -10 -3 -6 -3 -12 4 -10 -11 -15 -13 -15 -9 -10 -3 -4 -9 -4 -4 0 -7 10 3 -4 0 2
6354 2 0 1 6 6 6 0 10 10 0 7 -2 9 -7 -11 5 -5 -4 -8 -6 -11 -17 -15 -17 -15 -23 -17 -16 -10 -9 -14 -7 -13 -2 -9 -7 -1 -2 -7 5 -3 -6 -3 6 4 3 4 10 1 7 5 5 5 4
6407 4 5 9 0 -3 -3 -2 1 -10 -16 -14 -24 -7 -12 -16 -8 -13 -9 -14 -9 -4 -6 -6 -9 -5 -8 2 -4 -9 3 0 -2 -5 0 3 12 7 15 5 11 8 13 12 0 2 7 -1 -5 1 4 -4 -11 -6 -6 -11
6461 -11 -11 -15 -18 -5 -6 -10 -12 -18 -5 -11 -15 -5 -6 -3 -9 -7 -2 6 10 6 9 7 3 5 15 10 15 5 5 6 -3 6 0 -12 0 0 -8 -5 4 0 -6 -4 -11 1 -13 -6 -9 -21 -12 -6
6511 -6 -13 -14 0 -5 1 -2 7 -5 8 -1 2 5 2 14 3 14 9 13 8 6 7 13 8 2 1 4 -4 -8 -3 -13 -5 -1 -7 -11 -5 -15 -9 -1 -11 -8 -15 -11 -2 -8 -4 -8 -4 -5 0 0 -6 -1
$$ packed form
6154EKLppMlj%oNrkPpJ0j2J7qNkl%LQj4J1%rJ3kkjJ0mRj9K0j8KNlPMlpj0J1Pr
6203@ljlk%KnmLMRj7J6pqLQPnOo%J1Jj2J2%MlmjpQrJ9rj0LMj1J0KnmqMmj0KJ4
6253f%kkqlOJ6%k1LJ1LQpnJJ3mjJkQLojRj3LoJpJ0kLj0Moo%%LNj1J3j5J1J0j5
6301a4O%PkLkNLnjjNKJ3j0jlPlloNj2RpOJj0kPlLrJ6j4jmKkOjPjnN%MpJ7ppMK
6354BkJN%%oJ0%j0PrJ1j6mJ6j0JmKnoKkKqOJOJnPoJ1pKOjnJ2qlLRkjJOrOk%%j
6407DJMrl%JLj1oKj0J7nmQnMnNNk%lMlJ0onJ2lklNLRnQj0OlNjj2KNqmOLqpN%n
6461a1%mlJ3jmkoJ3omJ0jLoKNQMmLkmKJ0nNj0%JrRoj2J2%qLRmoKpJ2j4Plj2RO
6511fpjJ4nOlRj2J3rLLlJ2j1J1nMnkJOnojLqmNj0QMomOj0OQj0LpMRoMmMjN%oN
$$ plain form
6563 -1 -2 5 1 4 11 11 9 8 8 14 13 17 -4 3 -4 3 4 -5 4 13 6 -3 -10 -11 -13 -17 -9 -6 -5 -19 -17 -6 1 -7 -14 -3 -9 -4 2 -2 -3 9 0 3 9 1 6 6 -2 -2 -1 -1 2 2 0 -2
6619 -2 8 4 -3 8 4 5 -10 -7 -11 -11 -8 -16 -13 -6 -10 -13 -17 -19 -11 -10 -14 4 -4 -19 -3 -5 3 0 4 -3 7 7 5 2 3 5 4 0 7 -1 4 -2 -1 -11 -4 -2 -3 -10 -6 -11 -8 -6 -5
6672 -5 -10 -13 -4 -25 -14 -13 -17 -12 -6 -7 -10 -8 -14 -5 0 -4 -4 4 -6 -1 12 21 13 4 0 6 5 4 -1 1 7 2 0 4 4 3 -4 -3 0 -13 -8 -12 -12 -8 -7 -10 -20 -16 -15 -10 -9 -10 -14 -4
6726 -4 -12 -2 -7 -3 -8 8 -4 0 11 4 3 10 6 9 6 1 6 -1 -3 -2 -1 -2 6 -3 0 -7 -10 3 -9 -7 -7 -14 -9 -23 -7 -1 -14 -15 -15 3 -9 -10 -2 -12 11 4 5 9
6774 9 9 3 4 1 4 15 14 6 11 7 2 7 5 -3 -7 11 -2 1 0 -6 -9 -17 -5 -25 -7 -11 -19 -18 -18 -14 -19 -8 -15 -13 -11 -18 -5 -14 1 6 -1 7 7 6 20 -2 11 23
6822 23 10 16 11 1 5 -2 6 7 1 9 7 1 -12 -2 -13 4 -8 -5 -3 -2 -11 -8 -7 -6 -9 -19 -6 1 -11 0 -7 -2 6 1 6 0 0 4 3 10 12 19 16 12 7 8 13 6 6
6871 6 17 2 0 5 2 -5 1 -10 -14 -2 -11 -7 1 -11 -3 -10 -5 -11 -2 0 -7 5 0 0 5 -2 0 -8 0 11 -1 0 14 4 9 6 15 14 21 9 12 14 15 -2 -3 8 10 2
6919 2 5 -2 -5 5 -1 -15 -8 -7 -4 -12 -12 -6 -18 -1 1 2 -1 0 -2 5 1 4 14 6 8 2 8 9 3 9 15 14 2 6 9 6 6 0 0 7 -12 -1 -3 -2 -1 -5 -15 -7 -6 -10 -12 -20
$$ packed form
6563ajPmLP%kj%OjMk1PpPJrRRprpjkmQLJj4KJ1PqpJ1oNOmjJ2rLOqN%q%J%L%kk
6619bJ0mpJ1mJj5Lm%LqLPmlmkQJmJ8qj5J6kQlMpJ0%klJKjmPqNoJj0PKjpMnLKJ
6672enlRk1J1JmNOjlKoRNm%Qj0NJ3RqrmOjjnKOnkM%jpJLj3Nm%MJlj0MJNJjmJ0
6726dqJ0nMnJ6j2MJ1pjPmLlnNpkJJjQrLplJ3j2K%pNj4J6Oj3j%J8j2jQj0K3pJM
6774I%oJlLJ1jqNmnNkqmJ8j3LjolqJ2k0J8mqJ%MnJ1pKKpJ3rJ5NpQ%jJ4k2J3J2
6822B3j3Onj0MpQJoQkoj3J0j1J7j2LKJrLJJlj0J3Pj2J1pNQnNo%MjPKPlmnJNp%
6871FJ1j5kNlpOj1mJ2rMQj2QpNoRKpJ2n%NpKqQJ1j2JJ4j0NlRjPj2LKJj7jJ1Kq
6919BLplJ0oj4PJLq%Oj2J7KJlJkPmLJ0qKoOJoOOjj2MLl%o%Pj9J1kJJmj0QJmkq
$$ plain form
6971 -20 -14 -7 -14 -3 -3 1 -2 -4 -8 0 5 4 4 6 8 12 11 7 14 6 9 13 12 9 5 1 15 0 -4 16 -2 14 -2 -11 0 -6 -9 -4 -11 -10 -20 -6 -10 -15 -3 -8 -12 -7 -3
7020 -3 -12 3 -11 3 -5 8 -3 -1 4 11 12 6 8 15 7 1 18 8 20 2 15 -3 -3 -1 2 2 -10 -2 -7 -17 -7 -20 -15 -13 -12 -20 -8 -13 -12 -1 -18 -4
7062 -4 4 -3 -10 -6 0 -11 2 17 -2 9 0 14 9 3 11 0 11 3 10 13 7 0 2 -5 -2 3 14 -3 -2 -14 -18 -22 -9 -8 -10 -14 -11 -11 -19 -8 9 -13 -6 -4 -7 10
7108 10 2 2 -3 6 5 9 -1 2 14 -3 4 1 11 4 3 1 7 2 7 1 -2 -9 -11 -2 -9 -12 -4 -16 -7 -6 -14 -8 -10 -23 -11 -6 -16 -6 -14 -13 -7 6 0 -2 -4 10 8 20
7156 20 -3 10 4 8 -3 7 14 1 -2 2 -4 -7 0 -4 -6 -1 3 -6 -6 -9 -5 -9 -6 -15 -3 -6 -6 -13 -1 -4 -10 -9 -11 -17 -16 -4 -4 8 7 0 9 2 -1 8 6 9 11 9 9 10 8
7207 8 6 3 2 -2 -14 -6 -8 -12 -10 -2 -2 -11 -20 -11 -12 -13 -10 -6 -11 -10 -12 -3 -8 1 -6 -7 -1 6 -8 -6 -6 13 -3 7 11 -2 -5 1 12 8 8 3 2 1 3 -4 0 -4 -6 -14 -13 -17 -10 -15
7261 -15 -10 -13 -5 -11 -17 -4 -17 -8 -8 -14 -13 -8 -3 -6 0 -1 2 0 -1 4 6 16 20 12 7 5 14 7 15 -1 5 2 -5 3 0 -10 2 -4 -4 -14 -14 -9 -7 -14 -15 -9 -18 -4 -21 -18 -13
7312 -13 -15 -5 -8 6 -10 -5 -6 7 2 9 3 -2 1 6 3 0 1 0 11 3 7 3 1 -1 -3 -4 -7 2 -7 -2 -6 -13 -9 -17 -20 -12 -10 -16 -28 -10 -10 -14 -4 -1 -2 2 -1 -1 -12 4
$$ packed form
6971b0OPpJ1%MlkmQNj%KKMjmPqLMjlmmJ4j5mK0j8J6j6rJ1olNpJj0J4mnJ2nmNM
7020crJ5j4J4qJ3j1KNPJoKPqoJ7j0J2j8J3j8%KL%j2Qnj0J0j3NKJqJ2nJJ1j7J4
7062dQppMOj1J3J5j9J1rJ4noQj1J1qPLopKpLNJ1j7Jj2mmJ3JkmL%qJ1J7k2PKlJ7
7108A0q%nRjMj0LJ2j7PlJ0pjkOnNolpkRplQj2RJqOkj3J2Nj0J0qJOJ3okkJ4kJ2
7156B0k3J3oMj1J0Pj3lMolPmkNMr%lMmLrJ2l%pJ2loJkoJJ2%J2jpRplRkLKk%Jk
7207Hkljmj2QkmKQ%rrRjjLMnJkRnRpjOPj4K%J9j6J0Mj3lOJ1m%njjKpMmkqJmPn
7261a5NlQooJ3j3R%oJNNlOjLkjNKJ0MqnkRpQj6OlpQlj0J2o%j0%NKpjOrJ4j7LN
7312a3kJ0lJ4j6NjJ3nPonLNllJjJ1qMmkkkjlRrNmpMqlQKoj2J8%mJ0LjMl%j1J6
$$ plain form
7362 4 0 -3 7 5 7 11 12 8 5 16 10 7 -6 2 -1 10 6 0 0 -1 -15 -9 -8 -5 -18 0 -12 -17 -17 -15 -13 -20 -13 -14 -7 -5 1 -8 -1 4 -6 0 -1 -9 -1 2 7 -5 5 7
7412 7 11 8 12 4 9 -2 7 0 -4 -3 -13 -4 1 -5 -14 -4 -3 -21 -31 -18 -12 -12 -11 -18 -1 -19 -8 -14 -10 -5 -5 -2 -4 4 3 2 13 10 -1 10 13 7 -3 11 9 13 10
7459 10 10 4 7 0 -7 -2 -7 -8 -10 -8 -12 -13 -8 -11 -16 -12 -14 -15 -19 -12 -18 -14 -2 -1 -6 -12 -1 -4 -2 -7 -1 3 -1 -14 5 14 7 9 -2 12 0 1 -7 6 1 -5 8 1 -2 -4 -7
7510 -7 -8 -11 -18 -8 -14 -21 -10 -6 -6 -3 -16 -17 -16 -14 -9 -4 1 -6 4 3 -9 -5 0 -2 13 5 7 15 11 10 7 3 10 8 3 1 -2 3 -9 6 -5 -2 -22 -4 -16 -13 -16 -17 -6
7559 -6 -4 -12 -8 -12 -16 -11 -12 -8 -6 0 -9 2 -5 2 -1 1 1 7 4 -1 1 3 12 5 3 -1 0 17 7 -2 -5 -1 -11 -16 2 -3 -2 -15 -4 1 -9 -15 -5 -1 -9 -7 -2 -15 -9 -9 -9
7610 -9 0 4 5 7 6 5 2 2 -4 15 3 -2 5 -3 -7 8 15 2 0 0 -5 9 -8 0 0 -5 -8 -6 -10 -10 -9 -13 -9 -26 -13 -8 -10 -7 -4 -4 -9 -5 -2 5 -11 -6 -3 -4 4 4 8 5
7662 5 -3 7 5 11 5 6 -2 2 1 5 6 -3 -2 -2 3 3 -16 -9 -7 -18 -12 -13 -18 -7 -19 -10 -13 -11 -6 -7 -12 -1 -7 -19 -8 -2 -6 -6 4 5 14 9 6 1 2 -1 3 -2 1 6 1 1
7714 1 5 4 0 -4 -7 -6 -16 -16 -1 -16 -10 -19 -6 -16 -14 -9 -6 -17 -9 -6 -10 -10 -8 -5 -3 -3 -8 -5 2 7 14 13 17 5 15 4 17 10 5 9 0 3 1 -4 -6 1 10 -7 4
$$ packed form
7362DmlJ0kKMJmlJ1olj3QlJ1mo%jj4OJLj3J8j2n%KKpPjPKOrPNj0OjqQLNj2J0K
7412GMlMqNj1RpmJj0RNorJ0Jj8j0J3O%JpJ7j8J1oMN%LkQjjJ1lj1J1Loj0J4kMl
7459A0%oLppNnjkKmjNlnMkjmPoMJ2JnoJ1lKnOMmj3J9RpKj1J4j2JqJ3noJ3plkl
7510gjlpJ0opJ1M%Lj3jJKNNNpJ0jj2MNkJ5qKQmjlmPknklNj2J5j1Lk0J8j2LljJ1
7559fKqMmmNjMKOrJ1pPlK%OlnKKRpkmJJ7j0rlMj0nJ8nJj3J1Nj0oJ0MqKNj3O%%
7610iRMJKjjl%oJ9j2nPqmJ5Pj3k%nJ4j7Q%nlKm%JmMj7J3NkLL%nMLPj6NLjQ%Ml
7662EqJ0kOoJqMjMJrJ%N%j9PKj1OjnJ1j2RlKNjnJ1oj2J1Om%J0JRnlnJlMnLNn%
7714AMjmmlJj0%J5j5OrJ3j0KNLj1QLm%KLK%nLPNPjMj2J0j1J3pnMrLknkPRj7J1
$$ plain form
7763 4 -1 -9 -14 -19 -11 -5 -11 -13 -10 -15 1 -14 -5 -9 -11 -7 -4 0 2 -3 -7 -7 0 -5 7 11 11 6 5 -1 4 6 12 -2 2 0 0 -3 -4 -7 -11 0 -9 -8 -18 -17 -9 -11 -19 -21 -5 -6 -8 -17
7817 -17 -17 -7 -4 -5 -9 -3 7 0 0 0 3 4 10 2 7 15 1 -1 4 -10 0 5 2 -1 -6 0 2 6 -13 -1 -6 -3 -17 -8 -10 -12 -19 -18 -9 -20 -11 -19 0 -11 -6 -20 -8
7864 -8 -7 -6 -2 -4 -5 -6 2 -6 8 9 0 6 6 8 7 5 -1 -6 3 -2 -1 2 -5 -2 -9 2 -5 -14 -11 -15 -14 -15 -15 -10 -13 -9 -15 -6 -2 -6 -2 -10 -10 -4 3 -5 -2 -1 -1 5 -2 11 12 4 7 4 11 3
7922 3 1 13 1 -10 -7 -3 -1 -12 -11 -15 -11 -5 -9 -7 -17 -13 -13 -10 -9 -16 -8 -9 -4 -3 -5 -1 -4 -2 -4 2 2 5 -6 -4 2 0 15 3 13 6 17 -2 13 8 10 7 6 -3 -4
7971 -4 -3 -11 -2 -9 -12 -6 -6 -6 -10 -11 -14 -14 -15 -13 -13 -15 -14 -6 -5 -5 3 1 7 -13 0 -1 7 5 -2 8 5 4 0 6 4 5 6 0 6 -12 -9 -1 -11 -8 -11 -6 -14 -10 -15 -24 -22 -8 -17 -12 -14
8026 -14 -8 -2 -20 -5 -3 -2 -2 -9 -1 0 2 4 -3 4 16 -3 22 10 1 10 11 10 5 7 -1 -1 6 8 -7 8 7 2 -11 -16 -18 -3 -12 -10 -14 -15 -17 -16 -19 -12 0 -10 0
8073 0 -8 -9 -5 2 -8 4 3 0 -6 2 6 2 0 2 2 -9 4 10 0 4 13 -1 3 -4 -10 -11 -10 -5 -10 -16 -15 -9 -17 -10 -9 -20 -8 -15 -15 -16 -5 6 -1 -2 -8 -2 0 0 0 10
8123 10 -1 17 6 11 12 3 10 9 7 9 4 1 2 11 -1 -2 0 -7 -10 -6 -8 -10 -6 -5 -7 -16 -15 -17 -15 -8 -11 -15 -4 -6 -10 -8 -6 4 -4 -9 -1 13 -2 3 9 -8 3 0 6 0
$$ packed form
7763DnqnnQOokLnJ6j5RmkMLMKnm%PnJ2M%njoNKOj4Mk%ljlmJ1rJj0JQkqkJ6jkr
7817a7%J0LjmOJ0p%%LJOqNQj4kNj4J0NllnOKMj9J2nLj4RkkpJRj1RqJ9j1Nj4J2
7864hJJMkjjQqJ4JrO%KjkonRnJLpLpJ1prLmJj%NlMoRMmMq%OPqLJ%OpJ3JqLlPq
7922CkJ2j2j1LMKj1JmMOmKj0M%LJpQjNJkMlKkO%Lj1KOkJ5j2J0pJ1j9J5nKljrj
7971dJqRplO%%mjl%jK%kJQJ%QkOk0J3jQkpJ0ljmOkJJoOj8LQj0LlNqMnrKJ4rNk
8026a4OOj8J5KJ%pQJKKpPJ2j9K5j2rRJjnKq%PKj5J5jnj3nkJ5rKmjkJlPJ2j0J0
8073@qjMPj0J2jloQMmkK%j1J3Oj0MRj4MpojJNnoJOqPJj1J2p%jJ1J1pjoOK%%J0
8123A0j1J8j1NJrPjkKnlJRj2jKplMkkMJkrJkKPlmJ1kmKKJ0qnQJ4j5NOj7J1lOo
$$ plain form
8173 0 -3 5 7 -5 3 8 -3 3 1 -21 0 -3 4 -10 -2 -13 -12 -11
$$ packed form
8173@lQKj2QNj1Okk2K1lPj4Qj1JJ
8191a1
$$ Imaginary data points
##PAGE= N=2
##DATA TABLE= (X++(I..I)), XYDATA
$$ plain form
0 0 0 0 0 0 0 0 0 0 0 0 0 0 -8 8 -8 8 -8 8 -16 16 -16 22 -24 28 -32 34 -40 44 -48 52 -60 67 -68 76 -84 92
36 92 -99 109 -118 126 -137 148 -158 170 -183 198 -214 231 -251 272 -294 323 -355 393 -437 491 -557
57 -557 640 -746 881 -1056 1291 -1617 2076 -2758 3829 -5649 9180 -18015 71640 170738 -37237
72 -37237 169785 -9081 91382 -118150 -26892 -38818 -75976 -6393 -50194 109265 -13614
83 -13614 66002 59076 -2998 -30102 -39542 -76557 26938 -44478 42155 62092 27752 -33655
95 -33655 86 30035 -107888 50565 -25799 36916 -40056 37092 38048 -26064 -5784 12061
107 12061 890 -89607 72076 -31019 40192 2419 34981 -29533 -16266 -29385 -33225 69954
119 69954 -62204 78999 -8786 18091 -22642 -8654 10758 -36942 -12081 7817 37574 -39681
$$ packed form
0@%%%%%%%%%%%%qJ6j6J6j6J6k4L2l2L8m6N2o0O6p4Q4r2J00j12J27j35J44j60J76
36I2j91K08k27K44k63K85l06L28l53L81m12M45m82N23n66O17o78P48q30R28j048
57e57J197j386J627j937K347k908L693m834O587r478J4829k7195Q9655R9098k07975
72c7237K07022j78866J00463k09532R1258j1926l7158O9583m3801J59459j22879
83a3614P9616o926o2074k7104r440l7015J03495p1416Q6633J9937l4340o1407
95c3655L3741K9949j37923J58453p6364O2715p6972P7148R56o4112K0280J7845
107A2061j1171r0497J61683j03095P1211l7773L2562o4514J3267j3119l840J03179
119F9954j32158J41203q7785K6877m0733J3988J9412m7700K4861J9898K9757p7255
$$ plain form
131 -39681 44450 37106 -41025 -23078 22181 -67134 15629 2865 45840 31605 -3082 34190
143 34190 -47690 -11571 -70436 20461 -44415 32734 31288 18192 77549 -26224 15639 -16924
155 -16924 -42247 -73888 14504 -17042 3835 56897 45033 16130 -5031 -2123 -31238 -34209
167 -34209 -40207 38084 -28840 29639 44504 7430 6600 -1647 -21412 -37615 4728 -41544 30289
180 30289 18179 9670 26310 17372 -12896 -15906 -12552 -14948 -7436 -21892 41133 -1309 -4051
193 -4051 23833 7187 -35101 12772 8832 -24843 20463 -4893 2435 -3511 -1784 -3843 3019
206 3019 -12808 8742 4454 1278 20010 -8657 2494 -2956 -23498 -16876 26095 -17667 14916
219 14916 36875 -11870 -3060 -1001 -11282 -23032 1086 -4316 8621 -1082 20136 25297 -8791
$$ packed form
131c9681Q4131p344p8131J7947M5259q9315Q2763j2764M2975j4235l4687L7272
143C4190q1880L6119n8865R0897o4876P7149j446j3096N9357j03773M1863l2563
155a6924k5323l1641Q8392l1546K0877N3062j1864k8903k1161K908k9115k971
167c4209n998P8291o6924N8479J4865l7074q30q247j9765j6203M2343m6272P1833
180C0289j2110q509J6640q938l0268l010L354k396P512j4456O3025m2442k742
193d051K7884j6646m2288M7873l940l3675M5306k5356P328n946J727k059O862
206C019j5827K1550m288l176J8732k8667J1151n450k0542O622M2971m3762L2583
219A4916K1959m8745Q810K059j0281j1750K4118n402J2937r703K1218N161l4088
$$ plain form
232 -8791 10354 -5125 -33313 -13396 -2305 -16145 26007 17390 370 17508 -1834 -18023
244 -18023 1393 -2182 -10726 3953 -2400 9598 -2322 2861 14528 -13913 -17151 7650 -11617
257 -11617 -7687 34258 5905 3117 13222 -14800 -18551 -5832 -12124 -2012 7863 2331 12763
270 12763 4319 8968 10283 -10109 -1942 -6195 -26729 665 11562 -7806 18798 15814 -15089
283 -15089 1587 1568 -10668 3708 3427 -1799 -2325 -5960 3270 2049 -3125 14120 -1148 -11579
297 -11579 10798 -5366 -7373 14837 -5117 -14333 5806 -7992 -4549 18372 7492 6032 3473
310 3473 -6288 -7394 -12164 -4216 4605 -7555 2463 12790 -7575 9541 18480 -8434 141 396
324 396 -21176 -5526 5882 -2736 7424 5297 -2562 -501 -2782 5625 3856 -3909 7713 -2579
$$ packed form
232h791J9145j5479k8188J9917J1091j3840M2152q617j7020J7138j9342j6189
244a8023J9416l575q544J4679o353J1998j1920N183J1667k8441l238K4801j9267
257a1617L930M1945k8353k788J0105k8022l751J2719o292J0112R875n532J0432
270A2763q444M649J315k0392Q167m253k0534K7394J0897j9368K6604k984l0903
283a5089J6676j9j2236J4376k81n226n26l635R230j221n174J7245j5268j0431
297a1579K2377j6164k007K2210j9954r216K0139j3798L443K2921j0880j460k559
310C473r761j106m770P948Q821j2160J0018J0327k0365J7116Q939k6914Q575K55
324C96k1572J5650J1408q618J0160k127p859K061k281Q407j769p765J1622j0292
$$ plain form
338 -2579 -13079 8022 -1142 -11081 10585 -2183 -11774 10212 3146 -129 11901 1186 -5783
351 -5783 -4648 -7502 -1564 -2000 990 10589 -3956 764 9553 -8422 -1655 8919 -10974 -4257
365 -4257 8137 -8638 3209 10457 -852 -122 329 -5641 -2968 -2606 2324 4076 -6787 7670
379 7670 1734 -7594 7376 4145 -10347 6848 2044 -11861 7235 -1101 -3853 2898 1371 -4488
393 -4488 2822 -221 3029 1961 -3205 7499 -8362 -1260 5090 -5223 -5303 11286 -5835 -3829
407 -3829 11207 -7668 -787 3658 1093 -2683 4936 -2279 2102 -3394 -527 2760 -9211 3909
421 3909 452 -3886 2888 8229 -8831 9309 2929 -9388 3739 -729 -6574 446 6026 -5679
435 -5679 4358 -3749 4871 -4482 -1198 7395 -2102 -1940 5392 1229 -11900 12087 -7177 -2155
$$ packed form
338b579j0500K1101r164r939K1666j2768r591K1986p066l275J2030j0715o969
351e783J135k854N938m36K990R599j4545M720Q789j7975O767J0574j9893O717
365d257J2394j6775J1847P248j1309P30M51n970K673L62M930J752j0863J4457
379G670n936r328J4970l231j4492J7195m804j3905J9096q336k752O751j527n859
393d488P310l043L250j068n166J0704j5861P102O350j0313q0J6589j7121K006
407c829J5036j8875O881M445k565l776P619p215M381n496K867L287j1971J3120
421C909l457m338O774N341j7060J8140o380j2317J3127m468n845P020N580j1705
435e679J0037q107Q620r353L284Q593r497J62P332m163j3129K3987j9264N022
$$ plain form
449 -2155 2533 -4382 -3374 5263 3102 780 9284 -5866 634 -6766 2079 -2457 -1411 641 4866
464 4866 -8956 3194 11698 -11552 9618 155 -3727 -8789 7424 -6228 3155 4007 -2812 5365
478 5365 -9582 8270 -2622 3074 -1145 1580 -9254 2523 -2773 -3979 13390 -3266 1323
491 1323 3700 2570 -12208 10648 -4323 -4128 -3715 -2299 1286 -3976 11497 5876 3142 -7252
505 -7252 8849 -12783 -1808 2662 -3255 -1642 1401 -793 -1359 11747 -8665 12092 -4961 -1330
519 -1330 -5060 1316 1721 -3579 4950 -2854 2625 -14019 12411 -849 -4340 9002 3928 -8391
533 -8391 1809 1877 -5041 1272 -2801 3039 -6063 3615 -2175 10749 -5306 6301 -2278 -7197 4336
548 4336 -11988 10738 -2405 2606 -4204 10063 -7572 -2563 11025 -6997 -501 -2768 3424
$$ packed form
449b155M688o915J008Q637k161k322Q504j5150O500p400Q845m536J046K052M225
464D866j3822J2150Q504k3250K1170r463l882n062J6213j3652R383Q52o819Q177
478E365j4947J7852j0892N696m219K725j0834J1777n296j206J7369j6656M589
491A323K377j130j4778K2856j4971J95M13J416L585n262J5473n621k734j0394
505g252J6101k1632J0975M470n917J613L043k194n66J3106k0412K0757j7053L631
519a330l730O376M05n300Q529p804N479j6644K6430j3260l491J3342n074j2319
533h391J0200O8o918O313m073N840r102R678n790J2924j6055J1607q579m919J1533
548D336j6324K2726j3143N011o810J4267j7635N009J3588j8022O496k267O192
$$ plain form
561 3424 -6935 2519 2659 6552 -7732 4214 2642 -6517 2682 2770 -425 -5685 4387 -10446 6917
576 6917 -2793 1278 6842 731 -2257 1208 2948 -6490 1705 -4617 4312 -10097 3226 5768 524
591 524 -1769 8866 25 -12115 9438 -7500 1802 -2562 3913 -560 -1223 1281 34 2300 -5153
606 -5153 4284 -3340 1171 399 199 2648 2549 -7320 4459 -327 -7707 3401 2996 -1144 -3117 9408
622 9408 -5550 1456 -2101 2611 -1151 -5409 7059 -2565 -792 394 4095 -6383 3667 -1419
636 -1419 -2068 3319 -2125 575 3552 140 -3994 5223 -4602 -352 -2190 2745 386 -2752 3900
651 3900 1844 -3488 -2044 7228 -7130 937 3634 -2173 -1387 2437 -244 -255 1055 -2778 1805 -3065
667 -3065 1093 574 1548 399 218 -2026 1835 -500 -3829 6589 -1671 -3317 2235 1200 -5977 2721
$$ packed form
561C424j0359R454J40L893j4284J1946j572r159R199Q8l195n260J0072j4833J7363
576F917r710M071N564o111k988L465J740r438Q195o322Q929j4409J3323K542n244
591E24k293J0635q841j2140K1553j6938R302m364O475m473o63K504j247K266p453
606e153R437p624M511p72k00K449r9r869J1779m786p380J1108m05m140j973J2525
622I408j4958P006l557M712l762m258J2468r624J773J186L701j0478J0050n086
636a419o49N387n444K700K977l412m134R217r825M250j838M935k359l138O652
651C900k056n332J444R272j4358Q067K697n807P86L824k681j1J310l833M583m870
667c065M158n19R74j149j81k244L861k335l329J0418q260j646N552j035p177Q698
$$ plain form
683 2721 1795 -2063 879 464 2853 -1523 1634 1776 -1481 -4564 919 -3364 -1660 4443 -416 3048
699 3048 3236 -2220 -825 3029 -4501 -350 1052 -2720 -2057 1176 2962 865 507 1846 261 -6382
715 -6382 2835 1703 -3228 2514 1802 -3786 -376 1609 -1983 2725 -11 -300 189 -372 -367 1141 488
732 488 -470 -1559 -2171 2506 -2377 1792 5101 -1915 -2052 2250 -2749 -3727 3686 -291 -870 1091 438
749 438 553 151 1682 1647 -2831 -1594 -265 -3154 1335 2470 -1040 1471 1294 -3214 2250 2285 -2338
766 -2338 1665 140 -3270 -1518 329 221 -175 852 2260 -723 -841 3603 127 -2387 1949 -2349
782 -2349 -4270 1529 -403 201 3271 1004 -172 747 -827 -1099 -53 -634 -80 -1462 472 1687
798 1687 -1224 2179 2357 -3465 -376 1015 -3356 618 2960 -916 135 1442 -1272 -338 81 228
$$ packed form
683B721r26l858K942m15K389m376L157J42l257l083N483m283J704O103m859L464
699C048J88n456J395L854p530M151J402l772O63L233J786k097l58J339j585o643
715f382R217j132m931N742p12n588L410J985l592M708k736k89M89n61NJ508o53
732D88r58j089o12M677m883M169L309p016j37M302m999r78P413l977n79J961o53
749D38J15m02J531l5m478J237J329k889M489J135l510K511j77m508N464L5m623
766b338M003j525l410J752J847j08l96J027J408k983j18M444l476k514M336m298
782b349j921N799j932O04L070k267j176R19j574k72J046n81N54j382J934J215
798A687k911L403J78n822L089J391m371L974K342l876J051J307k714R34M19J47
$$ plain form
814 228 -30 -1321 1093 -370 -911 2267 251 -1780 1522 -808 -2442 2640 413 -1184 1992 -113
830 -113 -1951 402 -41 -642 -256 362 934 -954 747 1983 -1520 -125 1808 -2599 -771 1881 -2017
847 -2017 -25 2106 -1182 3 1244 -609 -117 366 376 -309 -489 536 -111 -1865 1377 362 -2192
864 -2192 2305 395 -1618 1480 914 -2072 1029 446 -1468 544 -72 59 -561 636 566 -686 -640
881 -640 1278 -1496 -264 2809 -1229 86 1471 -1317 -1759 1840 -1423 -646 1023 -523 217 408
897 408 1660 107 -45 -287 -206 -2768 625 844 -1596 2047 1041 -1322 636 1515 -2147 988 -122
914 -122 -1415 -591 305 378 315 1358 615 -273 -1725 1424 -1900 -387 1774 -816 -1166 1566 -130 -1035
932 -1035 2922 -623 -206 -433 -306 -1293 267 425 172 -455 -247 990 -1627 2126 1080 -609 -77
$$ packed form
814B28k58j291K414j463n41L178k016k031L302k330j634N082k227j597L176k105
830a13j838K353m43o01L86O18N72j888J701J236l503J395J933m407J828K652l898
847b017J992K131l288J185J241j853M92M83J0o85j80J025o47j754L242j015k554
864b192M497j910k013L098n66k986L101n83j914K012o16J31o20J197p0j252M6
881f40J918k774J232L073m038J315J385k788m42L599l263P77J669j546P40J91
897D08J252j553j52k42Q1k562L393K19k440L643j006k363J958Q79l662L135j110
914a22j293Q24Q96P3o3J043p43q88j452L149l324J513K161k590l50K732j696r05
932a035L957l545M17k27J27r87J560J58k53o27K08J237k617L753j046j689N32
$$ plain form
949 -77 879 -3036 69 1211 -1596 832 489 -99 -862 2049 -98 1032 -825 454 -1477 -1894 1733
966 1733 -834 538 674 823 -2477 2213 -504 -442 1835 -778 -698 -613 630 -1328 1311 -77 527
983 527 -1501 594 748 -828 1184 1369 -1484 -1488 1672 -2799 960 957 547 -503 1090 -292 -532 981
1001 981 -1068 622 -2102 806 -1219 653 1532 880 -255 849 -338 -2839 1733 -834 -769 256
1017 256 1263 -1747 1011 1043 291 80 -275 692 -2172 275 289 264 -1107 1817 -1442 -236 1243 -611
1035 -611 840 724 -114 -1528 1699 -2174 507 -54 450 -545 -297 1734 -932 413 231 1178 -2985
1052 -2985 1294 151 -1417 912 1077 -321 -354 855 -1314 383 -829 796 -537 732 -100 360
1068 360 194 194 -224 -1189 1583 -2415 660 985 67 -811 1808 -146 -1750 1259 -634 -229 -706 1372
$$ packed form
949g7R56l915L105J142k807K428l43n88p63K911k147J130j857J279j931m17L627
966A733k567J372J36J49l300M690k717O2K277k613Q0Q5J243j958K639j388O04
983E27k028K095J54j576K012J85k853mL160m471L759lm10j050J593j382k40J513
1001I81k049J690k724K908k025J872Q79o52j135J104j187k501M572k567O5J025
1017B56J007l010K758L2p52k11l55R67k864K447J4k5j371K924l259J206J479j854
1035f11J451j16q38j414L227l873K681n61N04r95K48K031k666J345j82R47m163
1052b985M279j143j568K329J65j398l3J209k169J697j212J625j333J269q32M60
1068C60j66%m18r65K772l998L075L25r18q78K619j954j604L009j893M05m77K078
$$ plain form
1086 1372 -255 46 149 883 -1364 -199 786 -1353 825 22 72 -116 1302 -1394 924 158 -1392
1103 -1392 162 220 152 -562 1282 -85 -450 -906 1547 -1119 -463 1536 -172 -845 681 758 -1763 1270
1121 1270 -728 31 -391 127 61 128 741 -350 559 -646 339 -1186 956 289 -789 374 522 -1433
1139 -1433 -405 1817 -1052 453 731 221 -1033 653 255 -530 -491 -314 -43 -1108 1452 534 447 656
1157 656 76 -1292 301 -579 -1076 1148 -270 -250 353 1153 -704 591 371 -374 -1188 -466 850 -1125
1175 -1125 853 1221 -296 -713 804 -623 -435 838 -248 -273 11 -376 -251 730 -34 240 -118 212
1193 212 -613 5 1026 -162 -693 226 -97 -1757 1107 832 -374 420 793 -719 -458 507 -213 -40
1211 -40 -542 395 -722 31 626 210 213 276 -387 -668 966 -763 176 880 -733 -823 426 -32 -570 809
$$ packed form
1086A372j627L01J03P34k247J165R85k139K178q03N0j88J418k696K318p66j550
1103a392J554N8o8p14J844j367l65m56K453k666O56J999j708o73J526P7k521L033
1121A270j998P59m22N18o6O7O13j091R09j205R85j525K142o67j078J163J48j955
1139a433J028K222k869J505K78n10j254J686l98p85L9J77K71j065K560r18q7K09
1157F56n80j368J593q80m97K224j418K0O03Q00j857J295k20p45q14P22J316j975
1175a125J978L68j517m17J517j427J88J273j086k5K84l87J25R81p64K74l58L30
1193B12q25O18J021j188n31R19l23j660K864k75j206P94L73j512K61R65p20J73
1211d0n02R37j117P53N95m16LO3o63k81J634j729R39P04j613r0J249m58n38J379
$$ plain form
1231 809 717 -221 -389 614 -160 -757 237 407 -1226 20 704 -403 780 655 -65 -353 -105 -870 -105
1250 -105 346 -193 347 322 208 -355 324 428 -704 -457 569 -734 -558 1251 192 -504 668 154
1268 154 -978 198 242 -177 -53 165 45 -405 120 224 -256 199 258 -478 272 337 -486 171 506 -912
1288 -912 -135 556 -461 23 557 261 -578 173 280 -456 -203 545 -3 -638 717 -34 -596 373 33
1307 33 -579 332 201 -272 423 210 -225 -64 171 -424 -265 157 135 -321 358 682 -627 92 424 -678
1327 -678 -326 631 -184 -198 603 -50 -373 128 42 -267 -86 227 -57 -178 651 48 -232 315 -233 -825 175
1348 175 215 -446 704 450 -367 -5 225 -374 -208 203 -82 -408 145 496 -151 277 447 -420 -551 356
1368 356 -462 -170 682 -87 -160 224 62 -426 422 183 -151 -172 143 -254 -389 536 12 -312 176 306 -596
$$ packed form
1231H09r2r38j68J003p74n97R94J70j633J246O84j107J183j25p20k88K48p65P65
1250a05M51n39N40k5j14n63O79J04j132K47J026j303J76J809j059o96J172n14
1268A54j132J176M4m19J24K18j20m50N25J04m80M55N9p36P50O5q23O57L35j418
1288i12P77O91j017M84N34k96q39P51J07p36K53P48n48o35J355p51n62R69l40
1307C3o12R11j31m73O95k13m35J61K35n95J59M22k2m56O79L24j309P19L32j102
1327f78L52R57q15j4Q01o53l23N01q6l09J81L13k84j21Q29o03k80N47n48n92J000
1348A75M0o61J150k54q17L62K30n99J66M11k85l26N53L51o47M28J70q67j31R07
1368C56q18K92Q52p69p3L84j62m88Q48k39l34k1L15l97j35R25n24l24M88J30r02
$$ plain form
1389 -596 528 476 -327 41 3 -593 -442 427 -77 249 286 268 -362 43 319 -342 -78 166 -353 -481 693
1410 693 -30 -6 478 -22 -626 105 112 -255 369 271 -73 -441 202 -251 -180 296 282 -393 166 389 -412 340
1432 340 232 -413 -481 224 -461 122 536 339 -10 31 93 -707 -3 45 21 -375 565 -152 -148 700 92 -184
1454 -184 -85 7 -819 275 137 56 61 307 -155 -293 336 -24 -24 39 329 -697 164 151 -203 -49 371 -208
1476 -208 -307 644 -183 148 17 166 -568 -29 84 -206 85 318 230 -386 500 -308 -271 127 162 -382 220
1497 220 236 -333 291 171 -107 -362 270 -323 -97 219 387 -210 147 288 -547 -64 77 -29 -336 614
1517 614 -188 21 215 56 -217 -129 149 -491 274 51 209 -154 468 -135 -328 212 -235 -291 95 497 -423
1538 -423 382 173 -181 -215 288 -206 -301 251 -24 37 -56 469 -438 92 33 -161 -165 207 45 -217 552 -275
$$ packed form
1389e96J124n2q03L68l8n96J51Q69n04L26L7j8o30M05K76o61K64K44n19j28J174
1410F93p23K4M84n00o04P31Pl67O24r8l44l68O43m53P1M76j4o75N59K23q01P52
1432C40j08o45o8P05o85N83M14j97l49M1O2q00P04M8k4l96R40p17MQ48o08k76
1454a84R9R2q26J094j38q1NK46m62j38O29l60%O3K90j026Q61j3l54J54M20n79
1476b08r9R51q27L31j31J49p34N39J13k90K91K33q8o16Q86q08L7L98L5n44O02
1497B20J6n69O24j20k78k55O32n93K26L16J68n97L57J41q35M83J41j06l07R50
1517F14q02K09J94j59k73Q8K78o40P65k23J58l63O22o03j93N40m47n6L86M02r20
1538d23Q05k09l54l4N03m94r5N52k75O1r3N25r07N30n9j94mL72j62k62P69q27
$$ plain form
1560 -275 -27 -32 78 -398 160 201 -213 76 183 -20 -430 436 -77 -167 83 270 -388 86 319 -291 7
1581 7 -61 -52 -261 450 52 120 154 -21 -296 -138 110 -358 153 199 7 -167 506 -73 -178 188 -86 -471 -97
1604 -97 323 -211 299 229 76 -352 123 -76 -226 201 61 -88 -62 276 -335 244 110 -168 -150 150 -117
1625 -117 -102 497 -28 -102 -169 139 -460 77 353 -28 -29 196 63 -401 266 -79 -174 -77 63 -200 107 312
1647 312 -15 97 46 -161 -351 225 -75 -45 183 157 -339 7 314 -268 92 207 -15 -340 244 7 -174
1668 -174 118 35 -163 -171 222 -25 139 241 10 -241 20 -207 -184 231 90 -120 136 215 -279 133 166 -163
1690 -163 -312 150 -46 -240 341 238 -70 -73 176 -316 -106 172 16 -44 125 -14 -140 155 -34 -45 -4 70
1712 70 -240 117 222 -89 -16 140 -134 -390 243 30 -125 168 277 -207 -89 220 -173 -126 42 32 -196
$$ packed form
1560b75K48nJ10m76N58M1m14K89J07k03m10Q66n13r0K50J87o58M74K33o10K98
1581Go8Rk09P11l98O8L4j75k75J58K48m68N11M6j92j74O73n79j05L66k74l85L74
1604i7M20n34N10p0j53m28M75j99j50M27j40j49K6L38o11N79j34k78J8L00k67
1625a17J5N99n25p4o7L08n99N37K76l81jK25j33m64O67l45r5R7J40k63L07K05
1647C12l27J12n1k07j90N76l00L0K28k6m96L46L07n82L60J15k22l25N84k37j81
1668a74K92q3j98qL93k47J64J02k31k51K61k27K3M15j41k10K56P9m94M12L3l29
1690a63j49M62j96j94N81j03l08lK49m92K10K78j56o0J69j39j26K95j89j1M1P4
1712G0l10L57J05l11P3J56k74k56O33k13j55K93J09m84J18L09l93M7J68j0k28
$$ plain form
1733 -196 159 127 -20 43 40 -142 -59 111 -208 71 149 -56 -53 206 -92 -239 157 69 -174 40 265 -139 -93
1756 -93 228 -40 -262 152 69 -163 81 163 -98 -15 128 -129 -26 32 -42 -39 165 2 -101 129 -40 -215 34
1779 34 175 -181 79 257 -92 -151 189 -24 -235 100 37 -150 -1 282 -24 -16 102 -91 -177 40 25 -127
1801 -127 177 54 -72 73 72 -194 23 115 -172 -50 134 -5 -110 227 56 -193 -10 112 -173 -36 256
1822 256 -54 -54 103 -38 -190 88 73 -52 97 57 -103 5 148 -51 -59 57 -118 -173 179 86 -66 136 103
1845 103 -218 -22 130 -134 -13 122 -36 -179 105 20 -37 99 92 -137 -62 132 -106 28 103 -67 -184 109
1867 109 -20 -62 195 92 -73 -39 79 -202 -45 104 -5 -94 108 47 -117 180 86 -125 -65 37 -203 -4
1889 -4 158 -6 9 103 -28 -153 81 13 -63 -3 89 -157 -23 162 -44 -58 104 -38 -194 145 37 -69 43
$$ packed form
1733a96L55l2j47O3lj82Q3J70l19K79P8k05LK59k98j47L96q8k43K14K25m04M6
1756i3L21k68k22M14q3k32K44Q2k61Q3J43k57J03N8p4LK04j63j03K30j69j75K49
1779C4J41l56K60J78l49n9L40k13k11L35o3j87J49K83l06QJ18j93q6K17j5j52
1801a27L04j23j26J45jk66K17R2k87J22J84j39j05L37j71k49J83J22k85J37K92
1822B56l10%J57j41j52K78j5j25J49m0j60J08J43j99qJ16j75n5L52r3j52K02l3
1845A03l21J96J52k64J21J35j58j43K84q5n7J36pk29P5J94k38J34P5j70j17K93
1867A09j29m2K57j03j65L4J18k81J57J49j09q9K02o1j64K97r4k11O0J02k40J99
1889dJ62j64J5R4j31j25K34o8p6O0R2k46J34J85k06j4J62j42j56L39j08j06J12
$$ plain form
1912 43 67 -127 -53 84 -62 -20 124 52 -125 107 2 -108 63 114 -149 -32 102 -115 22 145 21 -132
1934 -132 85 -26 -82 47 112 -81 -55 96 -130 -33 112 60 -128 131 -30 -125 81 36 -78 -45 104 -128 46
1957 46 97 55 -76 83 -1 -178 64 29 -55 0 199 -118 13 111 -70 -55 44 -21 -129 95 33 -16 -9 101 -104
1982 -104 -62 70 -46 -85 98 35 -128 133 20 -90 -5 73 -128 -5 106 -57 -7 61 41 -120 94 26 -78
2005 -78 1 90 -105 -22 148 -77 -24 53 -10 -98 134 16 -44 26 23 -94 -46 116 -42 -16 67 34 -141 109 36 -114
2031 -114 50 24 -108 -24 147 -67 51 49 -16 -97 33 44 -81 89 32 -38 -51 108 -98 -16 100 -54 -65 80
2055 80 28 -75 115 8 -79 -69 53 -75 -18 129 21 -35 31 37 -156 67 36 -103 2 74 -65 14 131 -36
2079 -36 -12 25 -50 -113 52 46 -13 19 87 -97 -50 126 -38 -26 63 -5 -150 72 14 -44 45 38 -71 -45 89 -19 13
$$ packed form
1912D3K4j94P4J37j46M2J44p2j77K32j05j10J71N1k63J17J34k17J37J23j24j53
1934a32K17j11n6J29O5j93K6J51k26R7J45n2j88K59j61r5K06m5j14L3J49k32J74
1957D6N1m2j31J59q4j77K42l5q4N5J99l17J31R8j81J5R9o5j08K24o2m9PJ10k05
1982a04M2J32j16l9J83o3j63K61j13j10Q5P8k01J23J11j63N0O8k0j61K14o8j04
2005g8P9Q9j95Q3J70k25N3P7o3q8K32j18o0P0lj17M8J62j58K6Q3l3j75K50p3j50
2031a14J64k6j32Q4J71k14J18ko5q1J30J1j25J70n7p0j3J59k06Q2J16j54j1J45
2055H0n2j03J90j07q7J0J22j28N7J47j08n6O6Oj93K23l1j39J05P2j39P9J17j67
2079c6K4L7p5o3J65on9L2O8j84M7J76j64J2Q9o8j45K22n8n8Q9pj09K6J34j08L2
$$ plain form
2106 13 39 20 -140 26 25 -72 93 71 -73 -32 117 -90 17 69 -45 -70 16 39 -63 70 67 -35 -56 50 -50
2131 -50 -36 97 25 -67 50 -10 -110 83 10 -40 0 65 -72 -7 80 -21 -42 12 31 -127 42 90 -49 32 84 -68
2157 -68 -68 75 -52 -33 43 7 -37 64 24 -14 3 30 -37 -41 70 -49 -33 95 28 -86 82 12 -102 41 66 -57
2183 -57 -19 65 -34 -17 28 38 -88 20 35 -49 14 50 -21 -40 74 -86 -10 62 -17 -26 62 -3 -78 46 16 -30 -27 80
2211 80 -27 -37 90 11 -97 32 46 -105 48 35 -39 -1 70 -32 -15 22 -39 -15 15 17 -42 42 36 -47 1 51 -79
2238 -79 -26 94 -57 -43 82 19 -53 66 29 -56 -10 37 -10 -35 79 23 -44 20 33 -73 37 47 -46 34 40 -62 20
2265 20 61 -65 -16 16 -31 -55 63 40 -27 18 62 -59 -64 89 -26 -50 54 1 -77 51 33 -27 36 6 -37 -27 29
2292 29 -7 7 40 -2 -47 31 57 -60 69 56 -68 -12 60 -62 -20 83 -13 -36 23 12 -43 19 36 -34 -45 45 -22 -42
$$ packed form
2106A3K6j9j60J66jr7J65k2j44M1J49k07J07N2j14k5Q6K3j02J33lj02k1J06j00
2131e0J4J33p2r2J17o0j00J93p3n0M0O5j37O5Q7j01k1N4J9j58J69M8j39Q1N2j52
2157f8%J43j27J9P6l6m4J01m0l8J7K7o7mJ11j19J6J28o7j14J68p0j14J43K5j23
2183e7L8Q4r9J7M5J0j26J08J5q4O3L6p1j9J14j60P6P2p9rQ8o5p5J24l0m6LJ07
2211H0j07j0J27p9j08J29J4j51J53j3p4L8P1j02J7L7o1K4L0Kn9Q4oq3M8N0j30
2238g9N3J20j51J4J25o3p2J19l7q5M6M7m7k5J14n6o7O4J3j06J10J0r3Q0Oj02Q2
2265B0M1j26M9L2m7k4J18k3o7M5M4j21nJ53j15k4J04n3p8J28j8o0O3l0m3J0N6
2292B9l6J4L3m2m5P8K6j17J29j3j24N6P2j22M2J03r6k3N9j1n5O2J7p0j1R0o7k0
$$ plain form
2320 -42 68 9 -43 39 -6 -73 43 24 -37 21 21 -52 -8 61 12 -23 23 18 -70 23 68 -46 4 60 -67 -36 65 -22 -12
2349 -12 51 -11 -50 29 8 -20 22 20 -44 -49 47 -6 -20 51 12 -84 15 15 -59 23 26 -45 -21 45 -18 -6 36 29 -37 6 15 -48 25
2382 25 50 -23 -23 62 -55 -18 67 -11 -42 30 -3 -48 27 20 -21 -6 28 -16 -51 44 1 -51 29 26 -62 22 46 -41 11 42 -48
2413 -48 -2 37 -4 -19 24 10 -34 23 29 -29 -33 60 -39 -34 62 -15 -33 51 14 -47 38 1 -45 0 25 -11 -26 30 -7 -25 20 32
2445 32 -54 33 38 -51 -1 48 -45 -9 69 -31 -15 22 -5 -33 17 25 -26 9 43 -18 -31 56 -6 -25 49 -6 -42 35 18 -42 35
2476 35 12 -34 -9 33 -14 -18 29 6 -41 15 32 -66 7 35 -48 -26 45 -28 4 56 -7 -33 10 0 -31 21 22 -21 -18 38 -28 -20
2508 -20 60 0 -46 34 11 -53 50 20 -23 9 24 -30 -16 50 -5 -9 5 22 -59 5 30 -31 -1 32 -33 -40 64 -21 -10 33
2538 33 -23 -53 11 16 -7 30 36 -9 -35 41 3 -34 48 15 -51 16 26 -46 27 26 -30 -15 24 -27 -5 26 4 -19 1 21 -32 20
$$ packed form
2320d2J10n9n2Q2m5o7J16j9o1N8%p3M4O9m9l5M6nq8R3M5j14N0N6j27L1J01q7J0
2349a2O3o2l9P9k1k8M2ko4nR6n3j4P1l9r6R9%p4Q2Lp1K4O6o3J2M2po6M3Ro3P3
2382B5K5p3%Q5j17L7Q5p8l1P2l3m5P5pm1J5L4m4l5R5m3n2Q0lq8Q4K4q7N2L1r0
2413d8M6L9m1j5M3j4m4N7On8mR3r9NR6p7j8Q4l7o1Q5l7m6M5K5l6j5N6l7j8M5J2
2445C2q6Q7Nq9N0M9r3L6P8j00J6L7k7k8N0Qn1L5L4o1j3Q7o2j9P4n5l6P7j7o0P7
2476C5k3m6K5M2m7mM7k3m7N6J7r8P3K8q3K2P1p3L2N2o3k6M3j0l1N2Jm3LN6o6Q
2508b0Q0o0m6Q0k3o4J03l0m3L2J5n4J4O6n5mJ4J7q1O4K5o1L0L3o5pJ04q5J1M3
2538C3n6l0O4Nk3L7Om5k6P6l8l7Q2l3o6O7J0p2P3jn6J5L9n1K2L1k2k3K0K0n3N2
$$ plain form
2570 20 41 -24 -19 37 -36 -37 50 -12 -25 22 6 -29 21 27 1 -5 22 -16 -24 34 16 -14 20 26 -50 23 40 -23 7 38 -24 -7 33
2603 33 -15 2 17 21 -32 8 19 -19 -17 44 -10 -38 54 -15 -16 26 2 -45 22 22 -31 25 2 -5 -25 19 -9 -28 14 24 -22 3 30
2636 30 -36 17 32 -20 -10 41 -24 -17 34 0 -17 10 9 -26 3 22 -8 -31 33 -14 -29 28 -10 -26 16 23 -39 29 10 -26 -7 26
2668 26 0 -16 30 13 -13 5 26 -41 2 35 -15 -7 51 -7 -18 37 -11 -1 2 11 -21 19 17 -9 -3 21 -6 -33 41 -9 -26 21 21
2701 21 -37 26 31 -39 0 14 -9 -14 30 0 0 3 9 -13 -2 26 -30 -2 28 -15 -19 47 -7 -7 39 -11 -22 13 22 -11 -1 12 -24 -25 25
2736 25 -5 -31 24 9 -27 -8 13 -32 13 26 -19 -13 14 -6 -8 22 8 -8 -3 11 -24 17 23 -12 -9 30 -6 -27 36 7 -24 8 8
2769 8 -17 3 25 -12 -18 -4 -10 -23 20 13 -19 5 5 -31 1 29 -24 4 23 -17 -18 26 -13 -2 25 2 -25 1 23 -10 -2 26 2 -18
2803 -18 27 5 -5 27 4 -20 5 17 -22 15 19 -6 -8 6 -12 -16 12 10 -29 -14 13 -27 -7 22 -21 -8 15 -3 -18 16 2 0 8
$$ packed form
2570B0K1o5NN6p3jQ7o2j3M7j6l5N0Ok6oK7l8qN8j8l0L4Op6P3J7o3L0L1o2J7M0
2603C3m8J7J5Mn3M0J1l8KO1n4k8R2o9jM2k4m7O7%n3N6k3pk0M4k8j9M2J0m6K5K7
2636C0o6N3J5n2J0N1o5PN1l4j7K7jl5K9J9l0k3O4m7j5N7l8j6M2Po2O8j9l6J9L3
2668B6k6j6M6j7k6J8K1o7M3L3n0QN8n8j1N5m8J0LRl2M0kk6OK4k7k7P4n0j7M7%
2701B1n8O3Np0L9J4k3nM4l0%LOk2J1K8n6K8L0m3mO6n4%M6n0j1L5Rl3J0J3l6jN0
2736B5l0k6N5j5l6J9K1m5M5J3m5OK7k0kL0j4j6NJ4l5M1Ol5LL9l6k1O3k9l1L2%
2769Hk5K0K2l7oJ4oj3M3pl2K4%l6L2K8n3K8J9m0jM4l9J1K7k3k7K6K2l3QK8k4k0
2803a8M5k2j0L2k3k4K5J2l9L7Mk5kJ4j8mK8kl9J5K7m0K0K9m3J3K3j8j5L4j4kQ
$$ plain form
2836 8 13 -20 -3 28 3 -18 16 -3 -14 29 3 -16 11 15 -23 17 12 -13 1 17 -6 -23 21 5 -11 2 21 -18 -6 17 -23 -11
2868 -11 18 -12 -24 15 0 -10 19 5 -13 4 7 -17 -7 20 -10 -17 18 3 -26 12 13 -28 7 18 -18 -5 22 4 -3 13 -9 -13 12
2901 12 6 -18 -10 12 -11 -7 18 -15 -15 17 -15 -11 15 -3 -20 8 2 -13 -8 11 -5 -16 13 12 -9 11 8 -17 -3 18 -20 4 9 -14 1
2936 1 21 -17 3 16 -10 -5 1 6 -22 -6 20 -4 -18 14 -11 -22 25 -3 -18 5 12 -18 -1 5 -12 2 -6 0 -15 23 5 -15 19 6
2970 6 -9 -3 11 -17 1 20 -9 -9 12 -3 -5 18 -4 -23 -2 12 -6 -6 10 -14 -18 7 -3 -26 18 1 -26 -3 9 -22 7 4 -19 -16
3004 -16 14 -10 -2 13 19 -14 -5 13 -32 0 10 -12 -4 15 -7 -6 18 3 -5 -3 3 -13 -9 10 -11 -3 10 -3 -19 15 -10 -20 -5 -4 -24 4
3040 4 15 -10 -10 15 -5 -8 6 1 -10 16 10 -8 -12 24 -6 -5 19 -4 -16 3 -5 -12 18 -14 -17 -6 10 -8 0 4 -6 -12 -1 2 -24 12 1
3077 1 -29 1 10 -19 5 11 -8 -15 19 0 -7 15 8 -4 0 18 -10 -1 11 0 1 31 8 -7 19 2 -8 -1 14 -7 14 13 -4 -8 15 3
$$ packed form
2836HNl3J7L1k5k1L4j9j1M3k6j9K7Ml8M0nk5J4J6k3j7M4j6j6J3J9l9J2K3m0J2
2868a1K9l0j2L9j5j0K9j4j8J7Lk4J0K7l0pL5j5k9L8Jm1L5J1l6J3K7j8pJ6k2mK5
2901A2ok4QK2k3MK5l3%L2l2MK6j8j7K8oj5NJ9j6j1K9jk1K0lk5J4K1l8K4Nk3J5
2936AK0l8K0J3k6NONk8J6K6k4j4L2k5j1M7k8j5K3Pl0J7Oj7J4qOj5L8j8k0L4j3
2970Fj5OJ4k8J8J9k9%K1j5kK3k2j9K1J4j8%J6k4mK5j0k3M4j7k7K3J2l1K9lk3L
3004a6L0k4QJ5Ol3RJ8m5L2J0k2QJ9k2JK4j5qKOj6MJ9k1QJ3j3j6L4k5j0J5Jk0K8
3040DJ1k5%K5k0lJ4nj1K6oj8mL6l0JK4k3j2J9qpL0l2lJ1J6j8QMj0oJ1Lk6L6j1
3077Al0L0Rk9K4Oj9pL4j9pK2pj2MJ8k8RJ2j1JL0k3j5K6j7j0PJ5k1K1jj7mK3j2
$$ plain form
3113 3 -11 18 -3 -11 6 11 -21 -8 17 -9 -10 -1 -5 -2 8 8 -2 7 7 2 0 4 0 -9 12 10 -4 27 13 -17 14 4 -7 -1 15 -9 -16 14 -5
3152 -5 -7 12 -1 -22 7 3 -23 -1 10 -11 -6 2 -7 -17 10 4 -6 11 3 3 -5 8 -4 5 10 4 -11 18 -4 -10 9 3 -2 5 8 -4 3 7 3 -9 12
3193 12 0 -12 7 2 -16 -2 15 -17 -9 9 -7 -11 -1 -10 -2 5 -5 -7 10 8 -8 -1 19 1 4 11 8 -14 9 15 -11 10 16 -15 2 19 -4
3230 -4 7 9 0 -1 3 11 -3 3 16 -12 -9 1 -12 -9 6 -2 -7 14 3 -9 8 1 -9 -3 9 -2 1 19 -3 -9 2 0 -10 3 3 -1 -5 10 0 4
3270 4 5 -1 -5 6 -1 -2 9 4 -2 -8 3 -12 -9 12 3 -8 8 -6 -28 -1 5 -11 1 4 -15 -5 10 5 1 6 0 -8 7 6 5 8 9 -3 -2 3 -11 0
3312 0 12 -4 1 2 16 -1 -1 0 3 -5 7 -1 -10 4 6 -14 10 14 -13 12 12 -12 3 23 -7 -6 14 -6 -7 -4 4 -9 8 4 -9 0 19 -7 17
3351 17 5 0 -6 5 0 -13 10 7 -6 -2 5 -13 1 5 -12 -13 4 -6 -12 10 14 -19 3 -1 -8 0 6 -10 -10 4 4 -11 8 10 -11 5 7 9 -5 8
3391 8 6 -3 3 3 -1 12 0 -9 4 9 -11 -9 14 8 -6 12 0 -15 1 3 -9 0 3 -15 -7 4 -1 -16 5 0 -18 -3 -3 -9 4 -2 -7 -3 9 -6 3
$$ packed form
3113Cj4K9k1qJ7Nl2J3K5k6jRmLJ0%j0R%nkMmrK1kj4L1j4l0L1j0j1OJ6k4pL0j9
3152ekJ9j3k1K9mk6K2J1k1NQrj0K7oj0J7q%qJ3j2RNoj5K9k2oJ9onPLj2PMmj2K1
3193A2j2j2J9nj8J4J7l2QJ8j6mJ0rQPj0kJ7kj6PK0j8LPlk2K3Ok6K1Ol1J7J7k3
3230dJ1KrjMQj4OJ3k8LJ0j3LJ5qnK1j1j2J7pj0OJ2j1LJ8k2oJ1kj0J3%mmJ5j0M
3270DJomJ1pjJ1nooJ1j5LK1rj1J6j4k2K7Oj6J2Lj9J0J5nmNoqJ5jjLJj2JNj4J1
3312@J2j6NJJ4j7%JLqJ2qrJ4Kk0K4Mk7K5%k4J5K0l0JK0k0jLQj3J7mj3RJ9k6K4
3351A7j2noJ1nj3K3lj3MPj8J4Mj7jJ7j0oK2Ml3K2mpQOj6%J4%j5J9Kk1J6KKj4J3
3391HkrO%mJ3j2rJ3Nk0KK3oj4J8j2j5J6Kj2RLj8QJ1nj5K1nj8J5%oJ3onMJ2j5R
$$ plain form
3432 3 12 -6 -10 10 9 -14 6 11 -6 -5 13 -9 -4 6 -4 -4 5 -1 -13 0 2 -11 -1 10 -9 -11 -4 -1 -13 -4 -3 -17 -12 0 -8 -12 2 4 -13 7
3472 7 4 -3 7 2 -6 1 6 -4 -5 -2 -5 -5 4 -5 -6 4 5 -13 11 3 1 7 0 -13 -13 9 -7 -12 0 -8 -5 2 0 -9 -4 2 -2 -11 -1 7 -9 8 2 -4 4 -3 -2 7 6
3521 6 0 -5 13 -10 -7 8 -5 -11 7 5 -14 4 11 -9 -2 -1 -2 -14 11 2 -9 12 5 -14 10 5 -4 2 1 -5 2 10 -6 -4 5 6 -14 3 6 -3 9 14 3
3564 3 1 16 4 3 0 0 -12 4 9 -1 -4 7 -8 4 4 -10 -6 -11 -11 -9 7 16 -4 -1 9 -4 -10 13 -12 -4 8 1 -6 -2 13 -4 1 5 -3 0 2 3 -5
3607 -5 1 3 -2 -6 0 -6 1 3 -2 5 14 2 -4 -2 -3 -25 2 -5 9 8 6 -6 -8 6 -1 -6 9 10 -15 11 12 0 -2 2 -12 -2 6 2 -3 10 4 -6 1 2 -12 -6
3653 -6 -1 0 -15 4 -4 -6 14 4 -3 0 -1 -13 0 2 -2 4 11 -6 2 6 -5 -9 3 3 -8 3 11 -4 -3 8 -1 -9 9 1 -7 7 12 -9 2 8 2 0 -2 -1
3697 -1 -5 -3 -4 -5 1 2 0 2 10 -9 4 1 11 -6 0 5 -8 12 2 -3 5 15 -5 -2 10 -5 0 8 -7 -5 3 -2 2 5 10 1 -3 6 4 4 12 -2 9 6 1 -4 8
3744 8 2 0 -9 -2 2 -3 -4 0 -6 -1 -4 -12 -7 10 -18 10 3 -5 9 -1 7 -2 16 -3 -7 8 -3 3 5 4 6 9 10 4 -2 7 -2 -7 -3 2 -4 4 1 -3 6 -2 5 -9 -3 -4 -4
$$ packed form
3432CRj8mK0jk3K0Nj7JJ8k2NJ0j0%Roj2J3Kj3J0J1j9kPLj2RJj4NJ2qmJ4Kj7K0
3472GlpJ0nqPNj0jLl%RrjJ0Jj8K4qkOpj3%K2j6nJ2qLPkrNOmrJ0Qj6J7ooQpJRj
3521FonJ8k3LJ5j3oJ8kj9J8Pk0PJjj2K5rj1K1pj9K4nrOjoPQj6KRJk0J7LrJ2Nj1
3564CkJ5j2jl%j2J6Nj0lJ1j5J2%j4Mn%KJ6Rk0LJ0j3oK3k5QJ2ppMJ5j7NMqLKJq
3607eOKnmOoPKnPRj2oKjk2K7pJ4jkj2kJ4pnJ5Jk5K6Jj2kMj4J0QmnJ3oj0PJj4O
3653fNJj5J9qkK0j0pLjj2J3KmOPj7QMj1mJ2%j1J1Qj5JJ1rqJ8qqJ4Nk1J1OokkJ
3697amKjjOJkKQj9J3lJ0j7ONj3K0j0nQJ0k0LJ2j5NQj5KQnMLNrmRk%Qj4J1lnnJ2
3744HokrPMnjMoNlqNJ7k8K8pqJ4j0QrJ8j9mJ5j1OKjKLJooRrnMNoQlmRqPj4Oj%
$$ plain form
3795 -4 -3 2 -12 -8 6 0 -10 4 -5 14 3 -1 7 6 2 7 -6 8 11 4 8 2 11 8 1 -12 11 1 -1 3 -6 -8 -7 3 -10 -11 3 0 -3 -12 -5 -7 -1 0 -15 -1
3841 -1 -4 0 -1 -1 5 -5 9 -4 -9 1 -3 -5 -12 9 1 -7 3 -3 -10 0 7 -6 6 2 1 5 7 10 -4 3 -10 -6 -3 -3 -2 -1 17 -1 -8 -6 -3 -4 8 -9 -2 2
3887 2 -6 -2 5 5 -3 2 5 -2 -4 11 0 -7 3 1 -4 5 -2 5 13 6 -2 7 10 -3 -5 -2 -15 2 2 -2 -5 -2 1 0 -1 -4 6 -7 10 6 0 -5 -2 1 11 -4 -1 6 -3 4
3937 4 -2 0 8 -8 6 4 2 7 -2 4 -2 -1 0 -1 -1 -9 -14 -4 -1 -7 2 -5 -7 -6 15 -1 -7 9 -3 -8 0 4 2 -5 -7 2 1 2 -12 -7 1 0 2 6 5 -5 6 5 -3 3 4
3988 4 0 -4 7 -3 -3 -6 -4 -4 0 1 -2 9 -4 -6 -12 -5 -1 -1 1 -4 0 0 -3 0 1 -3 9 -1 8 -1 4 -3 1 4 8 7 -5 15 4 3 1 0 -4 1 6 -2 -1 7 5 6 -5
4039 -5 3 -5 -7 -1 -7 -4 2 -1 -9 2 -9 -10 -2 -1 -6 -2 -6 -7 4 8 5 3 -8 -4 2 8 1 9 12 3 4 5 9 -6 1 2 -7 -4 -3 3 2 0 10 -7 -4 -8 -11 10 7 -18 -1
4090 -1 -18 -4 9 1 2 -8 15 -1 -6 -2 9 -4 -11 12 -1 -7 8 5 7 15 2 4 3 15 3 -6 2 -3 -2 -5 4 -10 9 -3 -9 -9 -3 -5 8 4 -10 -12
4132 -12 0 -2 -1 1 3 -4 3 2 12 1 4 -4 6 -2 -2 4 1 16 -3 -1 5 12 1 10 0 -3 -2 -2 -8 9 -1 -4 -10 -1 -9 -4 0 1 -7 -1 -9 -9 -3 -3 -6 -4 1 2 1 11
$$ packed form
3795dJNj4MJ4oj0J4rJ9j1mQjmNj3J4LpMoRlpj3K3j0kMrkJJ0j3jJ4llrPkOJj5J4
3841alMj%Oj0J4j3nJ0mkpK1qqJ0opJ0Pj3J2mjMKLj4Pj3ML%JJJ8j8pKLjJ2j7PM
3887BqMP%qNLpkJ5j1pJ0knRpPQpqRLj3kLj3J7%mlLLjjlJ0j3J7monLLJ0j5LPrP
3937DoKQj6J4kkNrOoJJj%qnJ0LoRpkJK1j6oJ6j2nQMkpkRjJj4NQjKMjj0J1jqOJ
3988DmmJ1j0%lK%MJlJ1j3koPM%KnM%lLJmJ2j0RrNpMLMjj2K0j1jkjmNNqJQkJj1
4039eQqkOoLOlqJ1j1jQJnMmjJ1Mlkj1MOOpQLrJJMj5PJrLJOjkJ0j7LmlK1lk5J7
4090aj7J4J3qJj0K3j6nMJ1j3pK3j3oJ5lKQj3KjJ2j2rQnJlRj4J9j2o%OkJ3mj4k
4132a2J2kJKKpPjJ0j1LqJ0q%OlJ5j9KOPj1Rj0lJ%oJ7j0loRqNMJqOq%O%lKNJjJ0
$$ plain form
4182 11 2 -5 11 -5 3 -6 2 -2 7 0 -2 11 19 8 1 10 1 -6 -5 11 2 2 -1 2 4 -7 -4 -3 2 -10 -10 3 3 2 -1 5 -18 -6 -8 -12 -6 -7 -16 -10 4 5 -1 -1 5
4231 5 -3 -6 0 -8 -12 0 13 9 5 13 9 6 7 -5 8 2 -8 4 -4 -1 -9 3 -3 2 -4 3 -1 -1 1 -4 0 5 -6 2 -6 -4 3 13 8 -7 -1 3 6 3 -2 2 8 5 12 4 3
4282 3 -4 9 9 2 2 -4 8 0 1 0 -2 -4 5 1 6 7 -2 3 3 9 10 -3 1 5 -4 -4 5 1 3 12 -3 3 3 5 3 3 1 3 3 9 6 4 5 7 8 15 6 2 12 -5 -7 2 3 -1 4
4337 4 -11 9 6 10 -8 -2 4 -7 -2 3 -2 2 5 1 1 1 6 -5 3 6 1 6 9 11 14 8 6 -3 -2 0 1 -2 12 6 0 -3 9 5 -5 -1 -9 -5 7 7 -3 5 -1 -9 -5 5
4387 5 -4 4 -3 -6 -10 8 -3 -2 -3 -1 -12 -2 4 7 20 6 2 -8 -3 4 3 6 5 8 1 8 4 12 -5 -10 0 0 0 1 3 -6 -3 -11 -6 -1 -3 -3 -4 -3 0 3 9 -6 -3 4 -5
4438 -5 -2 7 2 4 1 16 6 5 1 1 0 8 3 1 5 0 6 -3 -2 2 1 -4 -7 -6 -8 -3 -3 -4 7 0 9 -1 -1 -7 5 -8 0 8 5 0 2 1 4 9 8 -1 -14 -1 9 4 -7
4489 -7 8 3 -1 3 8 2 -4 -1 2 5 9 0 5 2 -6 -1 -1 2 5 -5 6 -4 0 6 -4 7 7 10 5 2 -5 3 -3 2 -4 15 10 12 5 7 8 5 4 2 14 14 12 4 8 9 3 -5 4
4542 4 6 11 3 -1 -7 4 0 9 2 -5 1 1 5 -10 14 4 -1 0 2 3 0 -2 23 10 0 7 -2 0 5 10 3 17 11 6 15 5 9 10 1 8 3 -2 5 5 11 -8 13 -4 4
$$ packed form
4182A1rpJ6j6QrQmRpkJ3Qj1pRrpJJ6r%lLKj1LJNj2%J3%jlOk3J2kmOjrOJ4Jo%O
4231EqlOqmJ2J3mmQmlJj2J3oj0J2qLqJ2oNoPm%KnMNj1QqKPJ0nj5OMLlnMOlPqj
4282CpJ3%p%oJ2qJjkkRmNJrN%OJj3MMr%RmKRj5O%Kk%kK%OlkJKJPrmJ0j7kRJmN
4337Dj5K0lMj8OOj1NNnMLm%%Nj1QLnNLKLokrJKJlJ4oolJ2mj0MqMJ2%j0QoqMJ0
4387ErQplmJ8j1JjKj1J0OLJ3j4mj0NPjLjLpPmQj7nJ0%%JKrLqNNk%jJLLOj5LPr
4438eLRnKlJ5j0jm%jQnkMnOrJMjnlJkN%jJ1pRj0%oJ2j3QQlnKjLNjrj3J3J0nj1
4489gJ5nmMNooLLLMrNlqN%LLj0J1j0MOj0J1%LnlpQoNoJ9nKpKJljkJ2%kqMJoqR
4542DKNqmoJ1mRppO%Mj5K4j0nJKJlkK5j3j0PrKNNpJ4onRj0MJrPnnP%Oj9K1j7Q
$$ plain form
4591 4 5 3 -7 -6 -14 0 -5 0 -6 -3 -2 12 1 2 -1 2 1 4 11 9 5 -1 6 2 7 9 7 9 6 4 12 -1 8 5 0 -1 -2 11 6 -2 2 -6 8 8 1 1 -5 0 3 3 1 -2 6 11
4645 11 9 6 3 10 12 -4 -2 6 5 16 13 -3 11 9 5 0 3 8 4 11 4 4 -10 5 7 7 0 -1 -16 -8 -2 -1 0 1 1 -4 5 2 -3 3 -1 5 -3 -6 5 11 -8 12 11 -1
4695 -1 5 10 -1 -6 -4 2 3 11 11 -8 -2 -3 -1 3 7 12 1 -2 1 -8 -5 3 12 0 -7 8 -4 1 1 1 -5 2 -2 -8 -2 0 9 6 0 5 3 7 4 -3 8 13 8 12 6 3 -12 5
4747 5 4 0 4 2 13 3 3 -1 1 -6 -12 1 2 4 -3 -2 -6 0 -9 -9 6 -5 6 10 -6 -1 -5 6 0 11 0 -4 3 7 6 9 7 2 -2 -2 8 10 2 2 -2 7 0 -2 4 -5
4797 -5 1 0 0 -5 1 -14 2 -4 -9 0 7 -4 1 -3 8 1 2 5 -4 6 -4 -3 4 5 6 -3 5 0 5 7 9 3 5 9 -6 5 9 2 6 2 0 -1 1 -12 -7 -5 -1 4 6 -3 0 1
4849 1 -4 -4 -4 -5 -1 -13 -14 -6 0 2 6 7 4 -2 6 -2 3 -4 3 -1 -8 -10 11 10 4 8 15 -6 -8 -5 0 0 -6 3 -3 11 0 7 -4 2 -2 -3 2 -6 -10 -8 -2 -12 0 3 -5 1 4
4902 4 -2 -2 9 -3 0 -7 1 6 2 2 0 7 -3 6 -4 3 2 -2 4 9 10 3 0 -1 -6 -2 13 -2 -10 4 -9 -12 0 3 2 -5 -1 -5 -1 -5 -8 6 1 2 2 0 6 1 8 17 10
4953 10 -2 6 -1 8 1 0 -4 9 10 -1 -3 9 6 13 -2 1 1 0 4 1 1 -6 16 -4 -4 6 12 4 0 -2 -11 -3 -6 2 0 -7 8 4 9 5 -1 2 0 -2 0 9 2 11 12 2
$$ packed form
4591DJkj0JqJ4nNoLJJ4j1JlLjLPkmoPmNKkKlkQj3RlnjjJ3nqMqJ4%p%oNL%klQN
4645A1kllPKj6KQjJ1lj6J4kmnLNmPp%j4J5K%pjj5QOJJJ%nRlnOmOqlJ1Oj9K0jj2
4695aONj1nKOJQ%j9OjKMMNj1lLrLQRj2pJ5j2N%%oPmoOKRloNkMlpJ1NnMolj5J7
4747EjmMkJ1j0%mKpoJ3JKpJmOr%J5j1J1Mj6NmJ1oJ1j1mPMjLknm%J0Kq%mRpkOr
4797eOj%nOj5J6onRPj1NmJ1pJLrJ0j0JPJJrQnNKKoKMj5J1MpMmkjKj3NKMNKrLJ
4849An%%jMj2jQOKMJloQqNpPmpkK1joMPk1kLN%oRoJ4j1Pj1OmjNqmKOj0J2LqOL
4902Do%J1j2LpQNm%kPj0Rj0PjmONJpljnMJ5j5qJ4j3lJ2LjpMmMmlJ4nJ%kOnPRp
4953A0j2QpRpjmJ3Jj1kJ2lPj5L%jMl%pK2k0%J0OqmkrQlQkpJ5mNmoLkkKRpRJj0
$$ plain form
5003 2 12 3 1 -9 9 3 7 0 1 -4 -2 -3 1 -3 1 10 -3 7 -2 3 -2 5 -1 9 2 -2 1 4 -4 10 1 -1 9 8 8 7 -2 11 5 8 8 -1 5 7 10 -7 -3 1 -4 0 -7
5054 -7 -6 -13 -5 3 4 -19 -13 2 -2 -8 1 -6 0 -2 -9 -7 -8 3 6 -8 4 4 2 -4 4 13 6 -2 5 -1 2 13 1 -6 -12 -2 0 -2 -12 0 6 1 3 -2 -1 -10 -6 -2 5 -1 -8
5105 -8 2 -2 -3 -14 -5 -8 -3 3 2 -3 -4 4 -3 -7 4 5 2 3 2 -7 8 1 3 -4 0 0 -11 5 -5 4 9 3 11 2 1 0 0 0 0 2 4 -7 7 2 6 3 14 5 8 -1 7
5156 7 -5 -5 3 9 5 -2 -4 -1 6 8 7 10 5 3 -3 6 2 -11 -2 -1 0 -5 0 -4 -3 0 7 3 7 6 -7 3 1 7 -8 3 12 -3 8 -2 -2 2 8 8 9 -2 3 13 3
5205 3 0 12 8 12 10 9 8 6 5 2 9 -2 -4 6 2 12 -7 2 3 12 -4 -1 -9 3 -3 -2 2 5 5 -14 3 9 0 8 5 4 9 -4 -7 -5 -4 0 12 10 10 17 4 2 -3
5254 -3 -2 -4 11 1 -1 -1 -1 -12 1 -2 -9 -10 -2 5 2 3 -6 1 -5 -6 -4 5 3 -6 12 -8 3 8 -8 -6 0 -4 7 2 4 8 8 14 8 -5 13 0 5 8 -3 -8 -1 5
5302 5 -2 -1 -1 0 -2 4 -5 1 -6 1 -8 4 -1 -5 -5 -17 -4 -4 -3 6 4 -9 -2 -2 -3 -2 -7 5 7 1 2 -4 0 -1 10 6 7 2 4 0 1 -5 -10 1 -2 -4 -1 -1 -1 -5 -4 0 2 -2
5356 -2 2 6 2 -1 -6 3 -6 0 0 0 -6 1 9 10 6 1 6 13 -7 1 -6 -1 12 -5 8 2 -3 13 3 1 5 9 -1 -7 2 -5 7 -2 8 4 5 0 -6 0 6 -1 -3 2 -1 -23 6
$$ packed form
5003BJ0rkj0J8oMpJnKjMmMRj3J0rNnPoJ0pmLLqJ4rkJ0j%jrJ3oL%rOKLj7MMnMp
5054gJpQQJk3OJ5moRpOkpKjJ1Lj4J2%koQRpqPoLJ1j2poJ0Kkj0J2OnKnJrMMPop
5105hJ0mjj1RlNOjnjQpmJ1JlJjrJ5pKpM%j1J6j0RNoQrjj%%%KKj1J4nMlJ1rLrQ
5156Gj2%QOmpkLPKjLnkoRmj3RJJnNmJLPmMjj3J0kOj5J1Rj5J1j0%MO%Jj1NJ0j0
5205ClJ2mMkjjkjlPj1kJ0mJ0j9RJRj6LqJ2oJML%j9J7OrQljNj3lKJMJ2k%Pj3kn
5254cJkJ5j0k%%j1J3lpjQPlJrPojKRkrJ8k0J1Nj6KOmJ1nKM%Ooj3J8j3NLj1nPO
5302EpJ%JkOrOpPrJ2nm%j2J3%JRkj3P%jJnJ2KoJoMjJ1mJnKmJonJ1lkL%%mJMKm
5356bMMmlnRrO%%oPQJmnNPk0QpNJ3j7J3onJ6j0kMMj0oRpJ2rJ0mJnoOOpkNlk2K9
$$ plain form
5407 6 0 -1 9 4 -1 -2 4 2 3 -5 3 5 6 4 -5 4 8 12 7 4 5 9 11 8 11 10 3 2 -5 1 1 0 6 1 1 6 0 -2 -1 7 0 -1 4 0 5 9 14 4 10 12 -3 10 4 3 5 3 8
5464 8 12 3 8 19 5 4 3 2 9 2 -1 1 2 3 2 -2 1 -8 -5 -5 2 1 1 2 5 8 11 -1 11 1 -2 12 5 6 5 6 4 5 8 9 3 20 11 2 7 5 9 3 -5 10 5 1 1
5517 1 8 0 -5 -8 4 9 -5 8 4 0 -2 -3 4 7 1 6 5 -4 5 14 9 8 10 12 8 3 10 6 6 9 0 -11 -5 3 5 7 9 12 -1 -1 2 -7 3 2 -1 -8 3 -12 -5 10 0
5568 0 -6 -1 -1 5 9 4 4 12 -1 4 -5 4 2 4 13 3 1 6 6 5 17 17 16 12 2 3 4 4 -1 9 6 10 8 2 0 1 -1 6 -4 -6 8 -6 -3 -1 -4 0 5 7 -4 3 -9
5619 -9 11 -1 -11 1 5 11 -1 8 0 6 -1 6 -1 4 2 -1 2 -12 4 3 10 13 7 5 1 -5 5 -5 1 2 -10 -1 -3 2 -3 -1 1 2 -5 8 2 -1 4 -1 4 -1 3 3 -5 -3
5669 -3 5 -3 4 4 13 7 9 7 0 1 6 6 11 4 2 5 -2 -5 -5 -15 5 9 -9 -6 2 -4 -3 4 -5 5 -5 -5 0 -7 -3 0 -3 -10 1 1 3 3 4 4 8 2 -3 -1 5 -5 -2 -3 3 9
5723 9 -4 3 -1 2 -1 6 -2 -1 3 0 -4 -14 -5 -13 -6 1 11 5 1 6 -4 -5 9 -8 1 -9 -1 0 -11 -1 7 2 7 17 8 2 7 11 9 3 -3 3 0 -14 -5 -2 6 2 4 5
5773 5 -1 -7 -7 3 7 4 -1 -1 -6 0 -3 5 8 15 4 6 0 2 2 20 6 11 10 0 14 -1 11 5 17 -6 10 -4 1 9 4 6 4 -3 1 -2 6 5 5 -9 -3 7 -1
$$ packed form
5407FojJ0nnjOkJqQKJkrRMMnlJMKlLjpjpO%jOn%NokJQpjNmNMNj0OKj5J3ojKkN
5464HMrNJ1j4jjjPplKJJjmLrL%Pj%JLLLj2J2j0lJ4pJjJkJLJoJ7rrNkMoqJ5nm%
5517APqnlJ2Nj4J3mmkjPLoNjrRRnjKKmnPm%Lrj1OQKKKLj3%LrJ0jlpJ1j5PJ5j0
5568@oN%OMn%Qj3NrRkKRj0kN%jJ2%jmj0JJ%nJ0lMkokJkPj0kJ4j4LKlMNKj1Pj2
5619iK0j2j0J2MOj2RqOpPpNklLj4J6jPLokmoJ0j0OJj2RkNnKKJpJ3olNnNnM%qK
5669cQqP%RoKkpJN%NpkLpl%j0K0Mj8LQoJPrJ0j0%NpMLlpJ1%K%J%MonKOj0LjOO
5723Ij3PmLlPqJMlmj0RqPPJ0omNj0jJ4j7Rj0QJj1J0QnNJ0roNMkooOlj4RLQmKJ
5773Eoo%J0Mln%nOlQLPj1KoK%J8j4Njj0J4j5J2oJ2k3J6j4NQnKkpMlQj%j4OJ0q
$$ plain form
5820 -1 0 -15 0 -5 1 -5 17 2 -4 -3 3 -2 -1 -5 0 5 0 9 -1 5 -5 14 7 3 10 4 5 6 6 -5 -2 -3 -2 2 -7 -4 -6 5 -7 -3 -4 -6 1 -4 2 2 1 -6 -1 2 -3
5871 -3 0 3 14 6 5 5 -5 -1 3 -4 4 -2 4 8 1 -1 -4 4 2 5 -1 6 7 -4 -1 7 4 7 -2 2 4 4 2 -3 4 12 -13 -1 -5 4 1 -3 12 3 -1 2 0 -2 2 3 2 4 6 -5
5925 -5 3 9 -1 15 4 6 10 0 10 -9 -1 -3 7 0 3 5 7 10 1 -2 9 -6 -1 0 1 -3 -5 2 3 5 2 -1 6 2 -1 10 11 1 -6 9 -7 12 -1 1 3 2
5971 2 10 9 12 7 4 5 3 2 4 -1 0 -1 6 -5 -1 5 2 -3 3 5 -8 5 4 5 -3 -10 3 -6 4 10 0 6 -1 -15 6 2 4 3 5 13 5 7 5 1 -4 3 3 6 -2 5 -5 3
6023 3 0 -6 2 -7 -3 6 -1 1 11 -2 4 6 10 -1 3 -3 4 6 -4 -2 -4 6 3 3 -5 -11 4 9 15 10 13 10 6 9 19 4 -2 2 8 2 7 4 4 -3 -8 -8 -5 -11 -3 -2 0 6 -2
6076 -2 14 4 -4 10 6 13 2 8 4 3 6 1 5 4 1 4 15 15 1 0 10 2 7 9 0 4 -2 16 8 4 5 2 10 2 -4 -4 -1 -5 -4 0 0 4 -1 4 -3 -1 4 7 4 7 8 -3
6128 -3 12 6 0 1 14 16 6 8 6 7 9 7 6 5 3 13 17 7 3 9 6 1 9 8 -11 0 2 0 4 -3 -2 -9 1 7 2 3 8 8 4 -9 5 0 2 2 9 6 -7 3 6
6177 6 8 1 6 6 15 -2 -3 1 10 12 9 -3 1 -1 -4 8 5 4 -13 6 7 -3 -2 -4 -9 -7 2 7 3 -5 8 1 -1 6 3 11 2 -5 7 9 8 4 6 1 1 -3 6 4 -9 -1 8 6
$$ packed form
5820aJj5J5nOoK2j5oJOnJmNNnRj0Oj0J9pmPoJJ%j1LjJMrLkJ1j2MjkPnO%jpNLn
5871cLLJ1qj%j0MMpQoOMpklQkLoPJj1LQlLrMK%knPQk5J2mRlmJ5rmLkkMJjKKj1
5925eQOj0J6j1KMj0J0j9QkJ0pLKKLrlJ1j5NJJmkPJKllPmlJ1Jj0pJ5j6J9j3KKj
5971BQjLnlJkjKnJjPj1MOlnOKj3J3jJqpJ3rJ0Oj0Opj4K1mKjKQqKkmnP%LqPj0Q
6023CloQrMRpKJ0j3OKMj1MoPKj0KkJ0l%qoJ5NOnLlmLJ0j5oMOoNl%pn%LoQJKOq
6076bJ6j0qJ4mPj1OmjLnMjlLJ1%j4jJ0qNKrMoJ8qmJlQqo%LmJM%MnNpKNLlLJj1
6128cJ5ooJJ3Kj0KkJKkjjkJ0Mj0mOlnQjj9J1KkMpJpJ0OnJN%mj3J4nK%Plj3J0L
6177FKpN%Rj7jMRKlj2MklJ2ljj7J9Jj0JknKRNmqJ3pkPlQrpJ2KjmKn%mRkj3QRk
$$ plain form
6229 6 10 11 2 0 9 0 0 11 3 3 -8 -2 -5 4 2 3 11 2 9 -9 2 4 1 -8 3 6 -9 6 8 9 -8 10 3 18 9 6 7 11 8 6 9 4 3 9 6 1 12 3 5 6
6279 6 -3 0 0 8 -1 -13 -2 0 -4 -3 -3 0 4 7 -14 1 3 10 1 -7 0 -1 2 3 -9 -4 1 9 5 1 8 -7 -6 -5 0 7 -1 -7 0 -8 -2 9 -6 -2 -1 4 -14 1 -1 4 -8
6330 -8 9 -9 3 0 1 -6 7 7 6 11 4 3 1 -8 -2 2 5 9 7 3 0 7 10 10 3 16 2 8 8 5 -14 3 3 1 5 3 -2 -3 -11 3 -6 -5 6 5 8 -2 6 5 2 -2
6380 -2 4 14 5 12 3 9 10 4 -1 -2 7 17 5 3 13 8 8 1 10 2 1 10 7 12 1 -5 2 -17 -1 -7 7 -9 1 -8 1 6 5 10 -5 7 -12 5 6 6 -6 9
6426 9 1 2 9 -1 5 2 6 12 9 7 -3 8 2 7 -6 -5 6 1 -1 4 2 11 -6 6 6 -8 -4 -8 -2 -12 -9 -12 -7 2 -1 5 -1 7 4 8 11 8 4 10 6 0 -9 5 7 -1 11
6477 11 8 9 1 -2 -3 1 8 -6 8 -1 0 -2 5 2 -8 8 2 -3 5 -6 -7 8 -3 0 -8 4 -9 -8 3 0 8 5 5 4 8 -1 4 8 7 12 8 1 4 -3 10 1 4 4 -1
6526 -1 -3 2 4 -2 2 8 2 4 3 0 3 3 -1 1 12 0 2 -9 -2 -6 4 6 4 1 3 11 -3 -2 4 -5 3 -4 2 15 0 7 4 3 1 11 3 3 12 10 -3 -2 -10 -8 2 -6 -10
6577 -10 -4 -6 2 -17 -9 4 -5 -2 -2 -2 6 17 5 12 -5 6 8 -8 -1 5 -2 8 -6 1 10 4 14 5 -3 3 4 8 9 8 -3 -4 0 -1 6 -7 3 -5 1 5 5 0 0
$$ packed form
6229FMJrkRr%J1q%j1OlRkJQrPj8J1KlrJ1Lj5J5KJj7J8pJ5rlJMlkLnjOlnJ1rKJ
6279FrL%Qrj2J1KmJ%LMLk1J5KPrqPjLJj2NNQmmPj5JJNPqoPqOJ1j5MJNj8J5kNj2
6330hJ7j8J2lJpJ3%jNpjkrOMLMkmlPL%pJ3j4O%lj9J7%kMknjqJ4rJJ1jLj0Qjlm
6380bOJ0rPrOJonjRJ0j2kJ0n%pRqjRlNj1oPj9J6oJ4j6J0rRNjNj5J2j9J7J%j2J5
6426IqJPj0OlMOlkj0J1oNj3JJ1nkNkRj7J2%j4MmOj0LlNRlOoQlMLlmOmorJ4KqJ2
6477A1lJqljMPj4J4rJkPlj0J6onQj1jJ5j1LqJ2j3JJ1lQl%jMrNMjNmpLpJ3rL%n
6526akNKoMOoKjlL%mKJ1j2Kj1PmJ0KklKQj4JOrQpOJ3j5PljkJ0q%Rkj3JqKJ0qm
6577a0OkQj9QJ3rL%%QJ1j2Pj7J1Kj6POpJ0j4PRoJ0rqOJMJjj1jMjPj3J0qOM%n%
$$ plain form
6624 0 1 6 -1 -5 1 -2 1 -4 -2 -5 5 0 2 0 9 6 2 5 17 1 9 5 5 9 -4 5 8 -4 2 7 2 6 5 6 4 2 -1 2 -1 -4 -8 3 -2 3 -1 14 5 4 15 2 10 -7
6676 -7 8 6 -3 8 10 9 7 -2 6 -2 10 7 4 -1 9 1 0 -3 7 12 -4 -1 -3 -12 -3 1 -2 8 5 -9 -3 -7 -3 5 1 11 -7 -4 6 -2 2 1 5 10 -2 -1 0 -2 5
6725 5 1 -8 2 -2 1 6 -4 10 2 10 9 -1 6 2 2 4 2 7 7 -3 -1 -6 6 -4 -1 10 -4 -2 0 -2 1 -4 -4 8 -5 -2 8 -6 -2 3 6 6 7 6 15 11 5 2
6773 2 -7 5 3 0 -8 -5 6 -7 -12 -1 3 4 0 3 2 4 -12 1 -6 -3 -1 -2 -6 -3 17 7 3 1 1 0 8 0 0 3 6 22 6 4 -14 -5 -4 -2 4 0 -7 4 -3 10
6821 10 4 -4 -3 -6 6 0 3 -6 -3 4 8 -1 8 3 -12 -1 -3 7 -3 -3 0 -3 2 -4 5 -2 9 7 -9 1 6 -3 1 -3 -2 -2 2 4 -7 -5 -1 -3 7 -1 -16 2 0 8
6869 8 0 -1 5 -2 -15 -10 -6 2 -3 5 1 -5 -5 4 -5 6 9 9 1 0 5 6 11 5 11 6 -4 7 2 3 3 8 9 16 0 1 2 -1 -3 -2 6 0 -2 -3 -4 0 6 -6 2 -4 -7 -12 -5 9
6923 9 8 -2 -5 -2 3 2 -4 7 -3 0 5 9 3 -7 -1 1 9 9 10 11 3 10 7 5 7 7 5 2 6 13 2 -3 5 -5 6 0 -5 -7 8 9 3 -8 8 5 -3 2 -1 1 2 11 3
6974 3 2 7 10 1 -2 -2 10 6 8 12 -3 3 3 5 1 -3 4 5 -4 7 7 4 -4 6 3 2 0 -4 3 -1 -2 10 -12 -11 5 -1 4 5 7 4 12 11 6 11 5 12 14 10 15 1 6 -5
$$ packed form
6624@JNpmOlLnKlJ0nKkRlmLJ2j6Qm%Mj3RLj2ONnMjJkklLllmJ1nNmJ5rjJ1j3Qj7
6676gJ5krJ1KjkrQqJ2llnJ0qjlJ0Nj6LkrRMlJ0lj4OmMQmJ0j8LJ0qMjMNj2JJkP
6725EmrJ0mLNj0J4qQjj0Pm%KkN%j0KnJ2j0LJ1j4KKkLn%J2j3LJ0j4MNL%JjRmol
6773BrJ2klqLJ1j3nJ1MJmLjKj6J3pLKjmLK0j0mk%jQq%LLJ6j6kj8RJKOmpJ1pJ3
6821A0oqJlJ2oLrLPMrRnj5J1kJ0j0%LlNoRpJ1kj6J0NrMmJ%MKj1KMkJ0qj5J8kQ
6869HqjOpj3NMQnQmo%RrJ1L%qjNJNoOnj0J1nJ%NJPj6JJlkJQokjjMOj2QolnPJ4
6923Ijj0lLNjoJ1j0LNMoj0OKQ%JJqPlkK%klMPj1nQj0J1onkJ5Joj1J6lqNlKJRq
6974CjNLrl%J2mKMj5O%KmmPJrJ1%lqJ0ljkmPmjJ2k2JJ6oNJKlQjnNoPKmNj4Nj1
$$ plain form
7026 -5 0 9 -6 7 8 9 9 5 11 -5 2 7 -2 0 0 6 4 1 -2 1 4 6 -9 -17 -4 4 6 6 6 1 3 -3 9 2 10 2 4 2 4 3 4 0 12 10 9 8 -4 12 3 5 12 3
7078 3 -2 1 1 0 9 4 11 3 2 10 14 -2 0 -1 2 -1 -1 10 -4 11 11 12 8 -1 1 9 8 0 -4 12 -2 -2 8 9 10 5 7 13 5 10 13 2 -2 2 -6 -3 0 -1 12 11 -1
7129 -1 6 7 4 -5 1 7 1 -3 -3 12 10 3 11 21 16 22 15 16 12 12 6 10 13 11 7 6 2 14 5 3 -3 1 8 2 -1 3 -2 -4 -2 8 0 -3 -1 7 12 -1 5 5 2 4 8 1 -3 4 6 1
7185 1 8 15 20 -2 6 13 15 9 14 6 9 4 -1 2 -2 9 -3 -1 -4 5 10 6 -4 -6 -2 -3 4 0 10 3 -6 -2 3 4 2 -10 11 8 0 7 9 4 1 14 8 9 1 14 2 5 17
7236 17 9 5 0 -1 3 9 8 -3 10 12 -1 2 -5 5 5 -1 -7 -5 -2 -1 4 1 1 4 2 -4 0 9 3 5 3 6 4 1 7 3 1 7 7 11 6 9 4 17 7 1 4 2 -2 7 6 4 8 17
7290 17 12 5 2 6 -1 -5 -1 -5 -4 -3 -4 2 11 -3 0 1 0 1 11 8 6 3 0 -5 11 3 15 9 1 10 5 12 11 5 3 3 0 1 7 2 -3 3 0 -1 -10 0 -5 6 2 -2 -2 -6 13
7343 13 1 3 5 4 -1 10 9 -1 4 0 9 6 -2 8 6 5 3 10 5 0 6 13 6 13 -10 2 11 3 2 8 7 -11 -9 7 0 3 0 -3 3 9 12 2 9 3 5 8 0 -2 1 9 2
7394 2 -6 -4 1 7 18 10 8 0 -4 14 3 12 5 13 8 9 2 4 8 0 3 5 14 19 6 7 0 2 -1 -3 6 -1 9 9 -3 3 6 4 -2 8 2 2 9 -2 -6 -9 3 16 10 6 4
$$ packed form
7026eNRj5J3JJ%mOj6PNrK%OkllLLKj5qJ3QK%%nKoJ2pQqKkKjJmJ2kjjj2J6rKPr
7078CnL%jRnPqjQMj6KjLl%J1j4J5%JmrKQjqmJ6j4%J0JJnKOqNLj1mMqLLjJ3jj2
7129aPJlrOOom%J5kpQJ0nOpJm%oMLkmjmJ2rkoMPolMnkKJ0qlKQNj3O%lKMpmPKn
7185APPNk2QPKoNqLnnLmJ1j2KlRNmj0kMjPmJ0prMNJkj2K1lqPKnlJ3oJqJ3j2LJ2
7236A7qmnjMOjj1J3Kj3LpJ0%ooKLJNl%LkoMRoKkLklOmkO%MnLnJ3j0oLkmRjkMR
7290A7nplMpmMmJJjORj4LJjJJ0lkllnJ6qJ2oqRnPjok%lJOnnOljrJ0nJ1mm%mJ9
7343A3j2KKjnJ1jj0NmRlqJ0kjkPnnOPpPk3J2RqjOjj8KJ6pLllOOLj0PoKLqkLQp
7394BqKNOJ1qkqmJ8j1RpQnJpKMqLKRNj3JpKlkRpJ0%j2OLkoJ0o%Pj1mlJ2J3omk
$$ plain form
7445 4 9 12 8 5 4 5 6 15 1 6 11 -2 7 1 5 -3 1 6 -8 3 -4 -3 -2 -11 -6 -13 9 6 3 14 11 2 5 -4 8 2 7 7 3 3 3 7 3 13 10 -1 -5 -5 4 17 15
7496 15 0 3 -1 5 15 0 14 8 13 4 9 11 9 9 0 3 -2 -9 6 10 6 5 4 14 8 4 4 15 8 -2 -1 12 4 6 6 12 11 -1 0 0 0 2 -2 3 8 -3 -15 5
7544 5 3 4 -3 -9 -6 14 -16 6 -4 4 -3 16 0 -2 3 3 13 8 5 10 1 6 7 10 8 -6 11 11 9 6 18 5 14 -1 10 2 6 14 -5 4 -1 1 -6 6 -7
7589 -7 1 5 -7 2 1 -1 14 1 3 12 1 8 9 10 1 -1 9 7 12 12 11 8 12 7 6 14 14 5 9 -2 10 8 11 12 13 1 12 3 7 6 -3 -5 3 -7 3 10 3 -4 -2 -6
7639 -6 4 9 0 7 5 1 -1 -5 -2 13 2 -1 4 1 2 9 6 6 1 10 10 4 0 8 14 18 10 6 3 1 6 11 7 9 7 2 2 0 2 -4 11 -4 6 -2 7 11 5 10 -9 5 0 10
7691 10 12 13 14 1 -2 10 6 3 11 9 3 11 7 7 16 5 3 9 0 8 6 0 4 8 12 -4 3 8 1 -2 8 3 9 14 -4 7 -1 1 2 4 5 -4 -8 11 7 6 14 20 9 1 -7
7742 -7 6 13 4 9 9 10 9 1 4 -2 7 5 11 -2 1 1 -4 5 -3 -1 2 0 0 2 5 1 4 -2 0 8 -4 -2 0 12 1 4 11 7 6 15 8 -7 0 4 1 15 -4 0 15 19 -1
7793 -1 5 14 1 4 -2 -4 -11 -1 3 6 2 -2 0 8 3 7 7 5 -4 5 11 21 20 16 15 9 4 12 12 7 17 22 16 10 1 13 4 2 1 8 7 1 6 4 -1 -2 -9 9 12 1 -1 -1 8 9
$$ packed form
7445DNLmljJJRj4NNj3RoMqMNj4J1pJJrNpK2llJ1lrLrJ2oN%m%%MmJ0lj1m%RJ3k
7496A5j5LmOJ0j5J4oNrNKk%rLnpJ5MmjjJ0om%J1pj0JJ3qK%Ojj2J%%KmNNj1j2K0
7544EkJpoLK0l0K2j0QpJ9j6kN%J0nlNrNJLkj4J7%klJ2j3Rj5J1qMQj9RnKpJ2j3
7589gQMj2RjkJ5j3KRj1PJJrkJ0kN%jlMnjQ%rMj1J2kLJJj2J1rMjrkQj0J0PppKm
7639fJ0NrPkmkmLJ5j1lNlJPl%nR%omQOMqmlkNNmKkn%kKoJ5j5J0qRMoNj9J4nJ0
7691A0KJJj3lJ2mlQkoQm%Rj1kOrQkoMMMj6PNplJ0nONj8J1qKJKJrmJ9mjQOj1qq
7742gJ3PrN%JjqLoRkOj3L%nRqKLk%KLmLoKQj2KKJ2j1LPmjRpj5PMlJ4j9MJ5Mk0
7793aORj3LokpJ0MLmmKQnM%krROJ0jmjonQ%nJ0NoorJ2rkjPjoNknjpJ8Lj1k%RJ
$$ plain form
7847 9 -2 12 11 1 -9 17 6 0 7 0 -3 3 3 2 18 8 1 5 6 13 15 15 13 -3 13 5 5 12 3 6 0 3 7 -6 3 0 8 11 4 0 5 4 -7 0 1 6 3 -10
7895 -10 4 -7 3 -9 6 4 4 -1 -3 2 6 0 0 9 2 6 13 5 5 15 -2 8 10 1 1 8 -1 8 -1 4 -8 1 4 1 0 8 7 -1 0 2 3 3 -10 13 1 1 -6 -1
7943 -1 -6 8 5 2 6 9 13 6 14 3 3 0 7 6 6 3 -9 0 1 2 -1 -2 -3 4 -7 -5 6 -7 2 -7 5 -8 -10 -2 3 0 4 2 8 6 -7 -7 8 -4 1 9 2 13 5
7992 5 15 8 5 6 1 5 3 10 1 3 5 6 -6 -1 3 8 1 1 -4 3 9 -12 -1 -10 6 -1 -5 -1 3 -13 -1 -1 12 2 -7 3 1 5 5 4 3 2 -6 5 8 2 3 11 8 5
8042 5 9 14 5 -1 12 -4 -18 -11 0 -3 2 12 0 4 -10 -7 2 -11 -7 0 3 2 2 5 9 14 2 12 3 10 4 0 8 13 6 -2 2 11 8 13 3 1 2 -3 6 7 3 -6 0 -4
8092 -4 5 -6 5 11 1 1 -3 -1 -2 -8 -3 -6 -1 3 -2 -10 -5 16 3 8 6 9 9 11 6 2 10 7 -1 0 3 -5 5 3 5 1 14 6 4 11 -1 13 -2 -3 2 -4 -3 1 -4 0 -5
8143 -5 0 0 9 3 3 6 6 0 1 3 7 1 2 18 9 0 0 8 20 5 -2 5 9 5 5 6 0 0 9 1 9 4 -4 2 1 3 13 9 -11 -6 -6 8 5 14 6 3 -2 -3
$$ packed form
7847Ij1J4jj0j0K6j1oPplO%jJ6j0pMJPK%kj6J6q%PrLoLMj3RlQLpmNjj1PJNlj3
7895a0J4j1J0j2J5k%nkNMo%RpMPq%J0j7J0Kr%PrRrNj2RLljQjqJKJ%j3K3j2%pN
7943anJ4llMLMpQj1%lPj%lj2RJJljjPj1KJ1j3RrJ2j3kQNlMkOkj3%J5j2NQpJ1q
7992EJ0plJnMkPrKKJj2NMNp%nPOk1J1rJ6pmMMj6J2%J3j0rJ0kM%jjjqJ1LoJQll
8042EMNroJ3j6j4PJ1lNJ0j2Mj4LRj3MPLj%LMNj2J0rPomQNpqMRlNj0kJnRJmrOm
8092dRj1J1Oj0%mKjoNlNMnqNK1j3NkL%KnmQlqJLqJ0kKmJ3qkPj2J4j5jNoJMnMn
8143eN%Ro%L%oJKMoJJ6rr%QJ2j5pPMm%Jo%RqQnqOjKJ0mk0N%J4lRqlnj
8191c
##END NTUPLES=NMR FID
##END=
