##TITLE=1H_AM_NV178
 200.13MHz, ,
 8 sc
 
 12.3.2025
##JCAMPDX= 6.0         $$ Bruker NMR JCAMP-DX V2.0
##DATA TYPE= NMR FID
##DATA CLASS= NTUPLES
##ORIGIN= UXNMR, Bruker Analytische Messtechnik GmbH
##OWNER= pz
$$ XWIN-NMR		Version 3.5
$$ Wed Mar 12 14:15:33 2025 Russian Standard Time (UT+4h)  she@DPX200
##.OBSERVE FREQUENCY= 200.1313
##.OBSERVE NUCLEUS= ^1H
##.DELAY= (6, 6)
##.ACQUISITION MODE= SIMULTANEOUS
##.ACQUISITION SCHEME= undefined
##.AVERAGES= 8
##.DIGITISER RES= 18
##SPECTROMETER/DATA SYSTEM= spect
##.PULSE SEQUENCE= zg30
##.SOLVENT NAME= CDCl3
##.SHIFT REFERENCE= (INTERNAL, CDCl3, 0, 14.3821)
##AUDIT TRAIL= $$ (NUMBER, WHEN, WHO, WHERE, WHAT)
$$ ##TITLE= Audit trail, XWIN-NMR		Version 3.5
$$ ##JCAMPDX= 5.01
$$ ##ORIGIN= Bruker BioSpin GmbH
$$ ##OWNER= she
$$ F:/spectra/data/she/nmr/H-C/1/audita.txt
$$ ##AUDIT TRAIL=  $$ (NUMBER, WHEN, WHO, WHERE, WHAT)
(   1,<2025-03-12 14:14:04.42 +0400>,<she>,<DPX200>,
      <created by zg, POWCHK disabled, PULCHK disabled
       configuration hash MD5:
       00 E9 B6 7A A2 85 ED C7 34 08 36 98 17 FE 4E 26
       data hash MD5: 16K
       A9 B2 A6 7E C7 D7 F1 66 CE 52 40 E0 F8 7B 5A 89>)
$$ ##END=
$$ 
$$ hash MD5
$$ 0C 6C 85 A3 4F 90 55 44 54 31 02 04 28 49 75 21
##$RELAX= 
##$RELAX= 
##$RELAX= 
##$RELAX= 
##$RELAX= 
##$RELAX= 
$$ Bruker specific parameters
$$ --------------------------
##$DU= <F:/spectra>
##$EXPNO= 1
##$NAME= <H-C>
##$PROCNO= 1
##$TYPE= <nmr>
##$USER= <she>
##$AMP= (0..31)
100 100 100 100 100 100 100 100 100 100 100 100 100 100 100 100 100 100 
100 100 100 100 100 100 100 100 100 100 100 100 100 100 
##$AQSEQ= 0
##$AQ_mod= 1
##$AUNM= <au_zg>
##$AUTOPOS= <>
##$BF1= 200.13
##$BF2= 200.13
##$BF3= 200.13
##$BF4= 200.13
##$BF5= 200.13
##$BF6= 200.13
##$BF7= 200.13
##$BF8= 200.13
##$BYTORDA= 1
##$CFDGTYP= 0
##$CFRGTYP= 5
##$CHEMSTR= <none>
##$CNST= (0..31)
1 1 145 1 1 1 1 1 1 1 1 1 1 1 1 1 1 1 1 1 1 1 1 1 1 1 1 1 1 1 1 1 
##$CPDPRG= <>
##$CPDPRG1= <>
##$CPDPRG2= <>
##$CPDPRG3= <>
##$CPDPRG4= <mlev>
##$CPDPRG5= <mlev>
##$CPDPRG6= <mlev>
##$CPDPRG7= <mlev>
##$CPDPRG8= <mlev>
##$CPDPRGB= <>
##$CPDPRGT= <>
##$D= (0..31)
0 0.7 0 0 0 0 0 0 0 0 0 0.03 0 0 0 0 0 0 0 0 0 0 0 0 0 0 0 0 0 0 0 0 
##$DATE= 1741774444
##$DBL= (0..7)
120 120 120 120 120 120 120 120 
##$DBP= (0..7)
150 150 150 150 150 150 150 150 
##$DBP07= 0
##$DBPNAM0= <>
##$DBPNAM1= <>
##$DBPNAM2= <>
##$DBPNAM3= <>
##$DBPNAM4= <>
##$DBPNAM5= <>
##$DBPNAM6= <>
##$DBPNAM7= <>
##$DBPOAL= (0..7)
0.5 0.5 0.5 0.5 0.5 0.5 0.5 0.5 
##$DBPOFFS= (0..7)
0 0 0 0 0 0 0 0 
##$DE= 6
##$DECBNUC= <off>
##$DECIM= 32
##$DECNUC= <off>
##$DECSTAT= 4
##$DIGMOD= 1
##$DIGTYP= 9
##$DL= (0..7)
0 120 120 120 120 120 120 120 
##$DP= (0..7)
150 150 150 150 150 150 150 150 
##$DP07= 0
##$DPNAME0= <>
##$DPNAME1= <>
##$DPNAME2= <>
##$DPNAME3= <>
##$DPNAME4= <>
##$DPNAME5= <>
##$DPNAME6= <>
##$DPNAME7= <>
##$DPOAL= (0..7)
0.5 0.5 0.5 0.5 0.5 0.5 0.5 0.5 
##$DPOFFS= (0..7)
0 0 0 0 0 0 0 0 
##$DQDMODE= 0
##$DR= 18
##$DS= 0
##$DSLIST= <SSSSSSSSSSSSSSS>
##$DSPFIRM= 0
$$ [...]
##$SUBNAM0= <"">
##$SUBNAM1= <"">
##$SUBNAM2= <"">
##$SUBNAM3= <"">
##$SUBNAM4= <"">
##$SUBNAM5= <"">
##$SUBNAM6= <"">
##$SUBNAM7= <"">
##$SUBNAM8= <"">
##$SUBNAM9= <"">
##$SW= 18.0517328524113
##$SWIBOX= (0..15)
0 0 2 0 0 0 0 0 0 0 0 0 0 0 0 0 
##$SW_h= 3612.71676300578
##$TD= 16384
##$TD0= 1
##$TE= 0
##$TE2= 300
##$TE3= 300
##$TEG= 300
##$TL= (0..7)
0 120 120 120 120 120 120 120 
##$TP= (0..7)
150 150 150 150 150 150 150 150 
##$TP07= 0
##$TPNAME0= <>
##$TPNAME1= <>
##$TPNAME2= <>
##$TPNAME3= <>
##$TPNAME4= <>
##$TPNAME5= <>
##$TPNAME6= <>
##$TPNAME7= <>
##$TPOAL= (0..7)
0.5 0.5 0.5 0.5 0.5 0.5 0.5 0.5 
##$TPOFFS= (0..7)
0 0 0 0 0 0 0 0 
##$TUNHIN= 0
##$TUNHOUT= 0
##$TUNXOUT= 0
##$USERA1= <user>
##$USERA2= <user>
##$USERA3= <user>
##$USERA4= <user>
##$USERA5= <user>
##$V9= 5
##$VALIST= <valist>
##$VCLIST= <CCCCCCCCCCCCCCC>
##$VD= 0
##$VDLIST= <DDDDDDDDDDDDDDD>
##$VPLIST= <PPPPPPPPPPPPPPP>
##$VTLIST= <TTTTTTTTTTTTTTT>
##$WBST= 1024
##$WBSW= 4
##$XGAIN= (0..3)
0 0 0 0 
##$XL= 0
##$YL= 0
##$YMAX_a= 183677
##$YMIN_a= -192507
##$ZGOPTNS= <>
##$ZL1= 120
##$ZL2= 120
##$ZL3= 120
##$ZL4= 120
##$ABSF1= 10
##$ABSF2= 0
##$ABSG= 5
##$ABSL= 3
##$ALPHA= 0
##$AQORDER= 0
##$ASSFAC= 0
##$ASSFACI= 0
##$ASSFACX= 0
##$ASSWID= 0
##$AUNMP= <proc_1d>
##$AZFE= 0.1
##$AZFW= 0.1
##$BCFW= 1
##$BC_mod= 2
##$BYTORDP= 1
##$COROFFS= 0
##$CY= -3
##$DATMOD= 1
##$DC= 2
##$DFILT= <>
##$DTYPP= 0
##$F1P= 0
##$F2P= 0
##$FCOR= 0.5
##$FTSIZE= 0
##$FT_mod= 4
##$GAMMA= 1
##$GB= 0.15
##$INTBC= 1
##$INTSCL= 1
##$ISEN= 128
##$LB= 0.25
##$LEV0= 0
##$LPBIN= 0
##$MAXI= 10000
##$MC2= 0
##$MEAN= 0
##$ME_mod= 0
##$MI= 1.114404
##$NCOEF= 0
##$NC_proc= 0
##$NLEV= 6
##$NOISF1= 3.799351
##$NOISF2= 2.8
##$NSP= 1
##$NTH_PI= 0
##$NZP= 0
##$OFFSET= 14.38212
##$PC= 1
##$PHC0= -547.2635
##$PHC1= 11.19221
##$PH_mod= 1
##$PKNL= yes
##$PPARMOD= 0
##$PSCAL= 0
##$PSIGN= 0
##$REVERSE= no
##$SF= 200.129724274929
##$SI= 16384
##$SIGF1= 3
##$SIGF2= 2
##$SINO= 400
##$SIOLD= 16384
##$SREGLST= <1H.CDCl3>
##$SSB= 0
##$STSI= 0
##$STSR= 0
##$SW_p= 3205.1282051282
##$SYMM= 0
##$S_DEV= 0
##$TDeff= 0
##$TDoff= 0
##$TI= <>
##$TILT= no
##$TM1= 0
##$TM2= 0
##$TOPLEV= 0
##$USERP1= <user>
##$USERP2= <user>
##$USERP3= <user>
##$USERP4= <user>
##$USERP5= <user>
##$WDW= 1
##$XDIM= 8192
##$YMAX_p= 0
##$YMIN_p= 0
$$ End of Bruker specific parameters
$$ ---------------------------------
##NTUPLES= NMR FID
##VAR_NAME=  TIME,          FID/REAL,        FID/IMAG
##SYMBOL=    X,             R,               I
##VAR_TYPE=  INDEPENDENT,   DEPENDENT,       DEPENDENT
##VAR_FORM=  AFFN,          ASDF,            ASDF
##VAR_DIM=   8192,          8192,            8192
##UNITS=     SECONDS,       ARBITRARY UNITS, ARBITRARY UNITS
##FACTOR=    0.0002768,     1,               1
##FIRST=     0,             0,               0
##LAST=      2.2672688,     0,               0
##MIN=       0,             -192507,         0
##MAX=       2.2672688,     183677,          0
$$ Real data points
##PAGE= N=1
##DATA TABLE= (X++(R..R)), XYDATA
0@%%%%%%%%%%Qj6J6j6J6k4L2m0M8n6P2q8J04j20J44j68J92k24K56k96L44l92M40
$$ 0 0 0 0 0 0 0 0 0 0 0 8 -8 8 -8 8 -16 16 -24 24 -32 40 -48 56 -64 80 -88 104 -120 136 -160 184 -208 232
33B32m96N65o37P16q04R00j006J120j244J380j531J697j876K069k282K516k773
$$ 232 -264 301 -336 380 -424 476 -530 590 -654 726 -805 892 -984 1085 -1197 1319 -1454
50a454L055l364L705m084M511m992N535o153O869p709Q704r913J1417j3348J5924
$$ -1454 1601 -1763 1942 -2142 2369 -2623 2912 -3241 3628 -4081 4623 -5290 6127 -7221 8703
65H703j9550K5082l4637N5676j82138L6097J56105k37845J49865l8155j01561
$$ 8703 -10847 14235 -20402 35274 -146864 -110767 45338 -192507 -42642 -80797 -182358
76a82358J73314m243r9416J12396p5178l2001J09377j3695n1673N662J1885J5683
$$ -182358 -9044 -13287 -112703 -307 -75485 -107486 1891 -11804 -63477 -57815 -45930 -30247
88c0247n7505N2662N3264r8509P897L6533k8299J09329m2549j23310J14458J5842
$$ -30247 -87752 -35090 18174 -80335 -72438 -35905 -64204 45125 2576 -120734 -6276 9566
100I566m9416R2662p5184o1339Q7821j8505L0069M651j27023P3647O3412q5967
$$ 9566 -39850 52812 -22372 -83711 4110 -14395 15674 20325 -106698 -33051 30361 -55606
112e5606M5552j4458m4649Q7166o1688j6114J27018r1062m8404J03132n1711J57
$$ -55606 -10054 -24512 -69161 18005 -43683 -59797 67221 -23841 -72245 30887 -20824 -20667
124b0667O4604o7284j1477J9053r818O0131j7449p6117J1317M3971M0735m2615
$$ -20667 43937 -23347 -34824 -15771 -25589 34542 17093 -59024 -47707 -3736 36999 -5616
136e616n7190O5931n792l5864P6698l9218n0103P1093l7533p318O1825q0045M904
$$ -5616 -62806 3125 -2667 -38531 38167 -1051 -51154 19939 -17594 -24912 36913 -43132 -38228
149c8228O9947q7989K390P6874m7237k1703l549r913O0297j0929n4521J7190M885
$$ -38228 31719 -56270 -53880 22994 -24243 -45946 -49495 -59408 889 -10040 -64561 -47371 -42486
162d2486J6793K0171k9771J920r421p635O4849k0578o3638M0422J4692j2227J1459
$$ -42486 -25693 -5522 -35293 -33373 -42794 -50429 14420 -6158 -69796 -29374 -14682 -26909 -15450
175a5450k9303J8024K8931n3526P749M4252k1749n504l628p051K6755o484K95
$$ -15450 -44753 -26729 2202 -51324 -43575 677 -21072 -26576 -30204 -37255 -10500 -16984 -16689
188a6689J4009m4082O640N7778j3033k6543j0233O601M9249q787m4581K4841J2231
$$ -16689 -2680 -46762 -40122 17656 4623 -21920 -32153 -25552 23697 14910 -29671 -4830 7401
201G401j4783J3954l001p189K846p301J4235O32k1371J8785J1119k1043l530Q473
$$ 7401 -7382 6572 3571 -3618 -772 -8073 6162 6794 -14577 4208 15327 -5716 -9246 -773
215g73K3893M529m4617L186M5477o071j7921m541o588J5536M977j1906K136j5398
$$ -773 23120 27649 -16968 -13782 31695 25624 7703 3162 -3426 12110 17087 5181 7317 -8081
229h081p468L0543O08k9277k391J8741J2670j5398j6608K2436J4558j9391q054
$$ -8081 -15549 14994 15602 -13675 -16066 2675 15345 -53 -16661 5775 20333 942 -7112
242g112R969J0483j596j4269J55N009n750R357N644k0977p081J9821J6604q635
$$ -7112 2857 13340 11744 -2525 -2370 2639 -3111 6246 11890 -9087 -16168 3653 20257 11622
256A1622k4530N888L1558j215k2013O35J2349L204p687n889L745k656n965M957
$$ 11622 -12908 -7020 24538 23323 1310 1945 14294 17498 9811 3922 7667 5011 -954 4003
270D003l675j4613K517J3816l493j9227k876K3641J0107k1306j0349J9549J5026
$$ 4003 328 -14285 -11768 2048 -1445 -20672 -23548 93 10200 -11106 -21455 -1906 13120
283A3120q219j1270L345P695l13q70j03p992m485J0956O910j4009j2110J3365
$$ 13120 4901 -6369 -3024 4671 4358 3488 3385 -4607 -9092 1864 8774 -5235 -17345 -3980
297c980J6733r183j6235Q950K0713k87j4591P19J3865L552o356j929M6k651K515
$$ -3980 12753 3570 -12665 -3715 16998 16711 2120 2839 16704 20256 13900 11971 12017 9366 11881
312A1881N590p288j4850K715J6261k227k0715l916J9003Q009j5084q627J2337
$$ 11881 17471 10183 -4667 -1952 14309 12082 -8633 -12549 6454 14463 -621 -9248 3089
325C089R876n918o216J578J366k84J730j534r040l612J1473O569j4258j0723J3596
$$ 3089 12965 7047 831 2409 3775 3491 5221 3687 -5353 -8965 2508 9077 -5181 -15904 -2308
340b308J4939p929j4428O240J7460L10j0920P45O989J446m23j013m021m061L147
$$ -2308 12631 4702 -9726 -3486 13974 14284 3364 4109 11098 12544 12121 11108 7087 3026 6173
355F173Q177n954j5678M487J5820l449j5344k775J3718Q200j2319p583J0507N322
$$ 6173 14350 8396 -7282 -2795 13025 9576 -5768 -8543 5175 13375 1056 -6527 3980 9302
369I302k656j255l008k17K622K128N95j0501n979J5037N359j5047p397Q078J1856
$$ 9302 6646 5391 2383 2166 4788 6916 7511 -2990 -8969 6068 11427 -3620 -11017 -2939 8917
384H917m102j6008M950J3046m643l656P53o14M938Q3j530M77q045N125J3401j1710
$$ 8917 4815 -11193 -6243 6803 2160 -1496 -743 -1357 3581 3664 2134 2611 -5434 -309 13092 1382
400A382j1137Q781Q809K159j3168q898J7583M385j3255j07n35J694O659o000r81
$$ 1382 -9755 -974 7835 9994 -3174 -12072 5511 9896 -3359 -3466 -4001 -2307 4352 -1648 -2629
415b629P14n931J1779K933j6973L889R947r1k201j1571P038J7274j4273r095R168
$$ -2629 -1915 -7846 3933 6866 -10107 -6218 3729 3638 1437 -10134 -3096 14178 -95 -9190 -22
430b2j01M977l248j1187Q685K1j965J1756j4602r936J8759P11m527l780j0258
$$ -22 -123 4854 1606 -9581 -896 -875 -2840 8916 -5686 -15622 3137 3848 -679 -4459 -14717
445a4717J7967P392k2190O200Q694q034M835n654l482J1122p804r01N929j0795
$$ -14717 3250 10642 -11548 -5348 3346 -4688 147 -5507 -8989 2133 -5671 -6572 -643 -11438
459a1438R081J0088j0589k13l149P886J9569k1262j1946K1769l307N50K667j9817
$$ -11438 -2357 7731 -2858 -3071 -6220 1666 21235 -27 -11973 9796 6489 7039 9706 -10111
473a0111J0814Q894j6198J2088l337j7575K0322J313j3393R338l673M204O410
$$ -10111 703 9597 -6601 5487 2150 -15425 4897 6210 -7183 2155 -1518 2686 9096
486I096j8784R944J5327j5156p13k599j508J7882j3024j3193J1131r983N582J3618
$$ 9096 -9688 256 15583 427 -286 -2885 -4393 13489 465 -12728 -1597 -11580 -5998 7620
500G620k1315k285R614j204J4941j0249j5479K2309M8p043R360j1276O994Q110
$$ 7620 -13695 -15980 -6366 -7570 7371 -2878 -18357 3952 4000 -3043 6317 -4959 2035 10145
514A0145k1673J3850R143k2094J3885j130j8834K2997K27j3975J1107j3892L242
$$ 10145 -11528 2322 11465 -10629 3256 2126 -16708 6289 6516 -7459 3648 -10244 -7002
527g002K7865j7694j4681J0540J320Q611m316j2203O507m426L049R031j6977K255
$$ -7002 20863 3169 -11512 -972 348 8959 4643 -7560 -1053 -5479 -2430 6601 -10376 -8121
541h121N935j2567J5451k633j7695K5217n340k1826K5902O57j0192J2749j8266
$$ -8121 -2186 -14753 698 -1935 -19630 5587 247 -21579 4323 4980 -5212 7537 -10729
554a0729J071K6765j4995p136N561j1741J3063Q348j4061l4n996N013J8399j4185
$$ -10729 -9658 17107 2112 -5024 537 -11204 1859 10207 -3854 -3888 -9884 -4871 13528 -657
568f57o598R992n412R682J689j3674J4287j039j4615J3847n10n671O947j2677
$$ -657 -7255 2737 -2675 7007 8696 -4978 9309 8270 -6345 7502 6992 1321 8268 -4409
582d409k42R849o735P786n525j8673J7507Q427p981L160j5617L736K5102j5287
$$ -4409 -4651 5198 -1537 6249 724 -17949 -442 7985 4 3164 -12453 -8717 16385 1098
596A098o411J1564j4395P216J3885j6135J453M446p894R226j167p254R160k869
$$ 1098 -5313 6251 -8144 -928 12957 -3178 -1725 2721 -5173 4053 2886 -4368 4792 1923
610A923n832K913J902Q562n791j2821R473L400J69N816j6005k664J6789n509N68
$$ 1923 -3909 -996 906 9468 3677 -9144 329 3729 3898 9714 -6291 -8955 7834 2325 2893
625B893K329j6845Q847J4298j1147p67l42l526J0860m081o966R165l195l648L348
$$ 2893 5222 -11623 -2776 11522 375 -392 -734 -4260 6600 2519 -4447 4718 1523 -2125 1223
640A223l295O013J437r328L699k39r92J1125p046j0889O934L481M282q69j4000
$$ 1223 -2072 3941 5378 -3950 -251 -490 -1482 9643 2597 -8292 -1358 2123 6405 5536 -8464
655h464L775J0205l922j81l165m214P240P0k359K659m472K442M654o583K133M952
$$ -8464 -4689 5516 1594 1413 -1752 -5966 1274 1344 -1015 1644 -2828 -386 4268 -2315 -182 4770
671D770l150L25m178j107J0745k142q873N09M22N891L591r518j761M392J252N717
$$ 4770 1620 1945 -2233 -3340 7405 5263 -3610 -3101 -2679 3212 6803 -2715 -4476 -84 1168 6885
687F885k690p796M916M169O6L97n310J474N750m937k034L267p01k48l802l082
$$ 6885 4195 -3601 1315 5484 5550 5947 637 2111 7861 2924 890 4157 3456 3208 -594 -3676
703c676N349J116l040j573l751L438P408k265m585k100K293Q661o42q754O0L684
$$ -3676 1673 2789 -251 -1824 -5575 -2137 5271 3006 -1579 -3679 -1386 7275 6633 -2121 -2061 1623
719A623J980N22m623j737K926J5J91p43j477L351O68k830J415K036K273P30n710
$$ 1623 3603 4125 -498 -2235 691 706 897 154 -1323 2028 2696 -134 1281 3317 5590 6320 610
736F10o20O903J113l589l804j931N017L370m990m480q8K602L139j721m193m13
$$ 610 -10 6893 8006 4417 613 -1318 3699 7069 2079 -2401 -2489 113 3252 1531 -2662 -3075
752c075L521L232k029l200K219K272j085j529j454J571K153l774l301J942J793
$$ -3075 446 3678 1649 -1551 668 2940 1855 326 -1128 443 2596 -1178 -4479 -2537 -744
767g44N49j639l923R55N482J580l113k614J937N060J761l128k972J775M081k30
$$ -744 -195 -1834 -5757 -4802 680 2260 -853 -3467 -1530 3530 5291 2163 -809 966 5047 4817
783D817l648j139J218J260o0k888j364K800J041k428j570P70K686J472k841k543
$$ 4817 1169 30 1248 2508 2448 -440 -1804 996 2037 -391 -1961 -1191 1495 2967 126 -2417
799b417K608L687n18l456j721K012K881l81l900j960K853K526j382k690q73K409
$$ -2417 191 3878 3360 -96 -1817 195 3076 2695 -1205 -3165 -312 2214 832 -1858 -2731 -322
815c22K742j586k708J243K796P90j548j951J206K947j75l071j565K137K592j130
$$ -322 2420 834 -1874 -631 2165 2955 1407 -544 662 3609 3434 363 -1202 935 3527 2397
831B397l149p40K513K598j368l419L09L029J322j397k748O7L265P39k507j916
$$ 2397 -752 -1492 1021 3619 2251 -1168 -859 2170 3492 2095 -653 -586 2679 3418 911 -1005
847a005N65K637M76l241j473K017K145m76l310p41L221J097j543j754q44K731
$$ -1005 -440 2197 2673 -568 -2041 -24 2121 1645 -1665 -2406 815 1912 369 -1385 -2229 502
863E02K165k614j963O86J954J945k537l147K325K537m47k019k063K170K857j901
$$ 502 2667 53 -1910 -1224 730 2675 138 -3009 -684 1853 1406 -613 -2676 -506 2351 450
879D50k063l39J123K439j686k978R57J196J549k38m108J116M468o33j422j140
$$ 450 -1613 -1952 -829 1610 -76 -3054 -2097 -901 648 410 -3698 -2582 1886 1253 -169 -1309
895a309L13M453l83l891J072J010P25J117l575j130K920J30k14j908k092M024
$$ -1309 -996 3457 3074 -817 255 1265 1990 3107 -468 -1598 1322 1452 1238 -670 -2762 1262
911A262J552l179n46J40K486K229m299r10L261k11O79j595l234L278J147k332
$$ 1262 2814 -365 -911 -771 1715 3944 -355 -1265 1996 1785 2464 869 -2365 913 2060 -272
927b72J32k739P87M811l262k716K067M44K902q56m531L843K578k324Q90j789j64
$$ -272 -140 -2879 -2092 2719 -543 -3259 -1192 -748 2154 1298 -3233 610 3188 864 1754 -35 -199
944a99L942k287j796P99j554L199O90n411J220K639M17Q64m263K32N752j932j345
$$ -199 3743 1456 -340 459 -1095 2104 2794 -2617 -1397 1242 1659 2523 -1740 -1508 4244 2312 967
961I67O14k511L596J206n022J455l36j602M040l696l735M915n48j347N70l041
$$ 967 1581 -930 2666 3872 -1150 305 -31 -1633 2407 -1289 -5024 -109 -657 -2004 -1434 -4475
977d475L799L327n095L07K205L34K692k914k173L284n58J243Mn478K575L334k413
$$ -4475 -676 2651 -2444 -2137 68 402 3094 180 -1993 1291 733 1976 1980 -3498 -923 2411 -2
994bP18k922n70O826l042l593M537j234O05K198m445K382K848l978J707n87k981
$$ -2 716 -2206 -2776 4050 1008 -2585 1952 718 1323 3521 -924 1458 4306 328 2035 1448 -1533
1011a533M759o18m355P56n32L085J649o777N95M440r71J105k074k326M536k84
$$ -1533 3226 2608 -1747 -991 -1523 1562 3211 -3566 -2971 1469 498 1603 -471 -2797 1739 1455
1027A455j240J597l604J144L568l540%N15j269L584k865l230O032m97k717J569
$$ 1455 215 1812 -1792 -648 2920 -620 -620 -105 -1374 2210 -655 -3885 2147 1650 -1067 502
1043E02k663L107M015o003O7K550k477L866R4n837J785J747L55J170m805l66M681
$$ 502 -2161 946 4961 -1042 -975 1575 -902 2964 3058 -2779 -994 753 1108 2278 -2527 -2893 1788
1060A788j422j148l24m38L008k019j795L844j728n79K608l851O65L723k392N32
$$ 1788 366 -782 -1106 -1544 1464 -555 -2350 1494 -234 -813 1795 -2056 -1391 2332 -60 472
1076D72j358l139O178J273o043N25J018J382K406m178r22K963j479J623M51l719
$$ 472 -886 -4025 2153 3426 -2617 -2092 -1074 308 2714 -1464 -2386 577 -902 721 1172 -2547
1092b547J970J051j257J676k275P9M158l398j885L670J63Q3j729k708L995J560
$$ -2547 -577 474 -783 893 -1382 -1303 2855 -543 -2428 1242 1405 1488 -241 -2949 1046 2606
1108B606k848p4j546N71L408j396j075p46j424M777R63n172J209J782l09J433
$$ 2606 -242 -316 -1862 -1291 2117 721 -354 -1100 -2524 2253 3216 -1956 -747 1035 726 2159
1124B159k757k46L839k943j607K756j211K24N02k691P49Q63O1J680l324k227M516
$$ 2159 -598 -844 2995 52 -1555 1201 -10 214 716 -1975 -1226 -363 -302 1378 -1946 -4173 343
1141C43J545j663j862j457L728J842l598q0N06r16J757m46j531N60n83J162P03
$$ 343 1888 225 -1637 -3094 634 2476 -1122 -1202 -696 -1612 145 -301 -1832 -1272 -1855 -693 10
1158A0k565J531K282j788n80j00J697K981l530k739L572O87n61n3k936L77K272
$$ 10 -2555 -1024 1258 -530 -1110 -1210 487 3468 -62 -2801 771 1458 897 844 -2092 -1715 557
1175E57p25K44j529k362L190J909k541r89O49J847L77k496R76K281j445r01QK69
$$ 557 -168 76 -1453 -3815 -625 1284 -1257 -2246 -1597 250 627 -1869 -893 1388 -57 -958 -950 -681
1193f81J415j125j484L70p98J244K224k605k259J747K591J206k682j988L244J641
$$ -681 734 -391 -1875 -1505 -2303 -1059 1165 -1440 -3699 -1952 639 1845 -837 -2825 419 2060
1209B060j231j37o50L74J051j073K34J78j778J196P62k443N05K029m64j376j174
$$ 2060 829 692 42 416 1467 394 628 806 -972 224 986 -1457 -952 1077 613 -763 -1937
1226a937J646K967j578k930O52K092R63j256j574J38O2Q69J131k225j838J670
$$ -1937 -291 2676 1098 -1832 -1180 912 1875 619 -955 -817 -755 114 1245 -980 -2818 -1148
1242a148J391j44j469r98K386J092k487J30K201Pj077o89P07J306m22p61m53p54
$$ -1148 243 99 -1370 -2368 18 1110 -1377 -1247 954 961 -116 -805 -98 1208 786 25 -428 -1182
1260a182R39J564p61k136r03K374K478k341k596J802J857k92q62o67O30O37n00
$$ -1182 -243 1321 560 -1576 -2479 -105 2373 32 -2564 -762 1095 803 -59 -726 -96 541 41
1277D1J12n2p96N31P18r71j013Q44J618r88k426R16K615k04j991q89J443J822
$$ 41 153 101 -695 -164 554 -417 -1430 -586 1032 44 -2382 -1466 1149 945 -1046 -1935 -492 1330
1295A330q17j320L49R3L76J203o86j739K72J863N45j887j125J793J284j377j398
$$ 1330 513 -807 -458 -365 11 1214 528 -1211 -939 924 1469 -418 -1543 250 1534 157 -1241
1312a241Q92J658o19j639N21R54k11J68k11r48L01J248N86j074j703J088K517
$$ -1241 -349 1309 690 -949 -428 526 315 483 272 -676 -375 873 1459 385 -1318 -230 2287
1329B287p20k444R7K069N00j637o52J017K63k42o2m35q0M25M46O1j359k75K367
$$ 2287 1567 -877 -780 1289 1789 152 -500 517 780 538 476 41 -39 386 832 893 -466 -741 1626
1348A626L05k448m26J851J103j221j866O77J543n43r04j63j3L79L84J51p03q58
$$ 1626 1931 -517 -943 908 2011 790 -1076 -399 1144 601 -303 -466 -479 -100 284 435 -268 -1126
1366a126J510J541j592j280J228J503j03k011l86K272L2j778o5L17K14L71m77
$$ -1126 384 1925 333 -947 281 1784 1681 -330 -716 1556 1588 -190 -255 62 276 647 170
1383A70k88l01J75J692k65k132N23J957L61j448j368J615J583j795j109O90J82
$$ 170 -118 -419 -244 1448 1183 -949 -426 1531 1892 444 -924 691 2274 479 -630 60 242
1400B42J17n84o61L08k50N49Q89j625n68J983P97q46j391L66K635m34k403P47
$$ 242 359 -225 -886 -578 -828 -279 610 -1015 -1583 400 1197 351 -1040 -674 1961 1527 -876 -129
1418a29J055j38j15j006P2O83n14O37p3j654J167J702q52j091j72J708J191k253
$$ -129 926 788 673 -333 -261 422 -92 545 472 -1182 -15 1687 835 -256 -428 1280 2471 218
1436B18q41J915L20n49q28m82J155k50p49O56j199m31K040l19j338n7N30J840
$$ 218 -623 1292 1612 1063 235 -247 908 658 -91 565 -634 -1065 975 656 -682 -739 -209 1631
1454A631n54k569J511J872j129o59k60N30R34j179k95N12j015P35R43j465m41
$$ 1631 1077 -1492 19 1891 762 103 -157 373 1307 128 -167 345 -670 65 1008 -457 -898
1471h98O84J149O33k287k70K885k51j524o9P3J233j90j634Q44K6q16J359n65j510
$$ -898 -214 935 1568 -719 -989 1896 1645 121 52 125 1358 1168 -466 378 404 -412 947 382 -1128
1490a128Q38N26L53n84j737J702J760k002p85Q24P16N66j611n32J632m60j66N59
$$ -1128 -290 236 589 5 -1732 -30 1730 -272 -1057 -233 483 1049 -562 -1094 538 78 -88 471
1508D71j332N0J047J7Nj575j37K814o45k090Q01P01O31m19j761J345J013j681
$$ 471 -861 -811 236 253 258 -1317 -1454 1360 715 -1375 -574 127 758 339 -1422 -77 936 -745
1526g45O13K95j120J163L84q03p4o26J255J292k493p92K002N44n03j383j57J940
$$ -745 -132 163 -957 206 590 -213 -287 -913 342 1634 -859 -1651 351 895 392 -991 -1148 792
1544G92l93r27O62o79K07J134o86j13k47l31J865o73k222J550J026q97m48q02
$$ 792 399 -528 134 -545 -338 796 110 -3 -250 -581 1284 611 -1611 -61 965 68 -380 -1182
1562a182J236J357k077m45J230l50M80m0j053M35P6O43Q98k159m88K361r1j119
$$ -1182 54 1411 -666 -1111 119 -231 249 209 -844 -409 -333 310 1208 -951 -1439 922 831 -288
1580b88o11K8J723n80j843J300M94q58N29l76j45P39k66M84k84j307J695J195
$$ -288 -899 -871 852 272 -1571 -271 223 -635 -106 -482 -627 112 -154 330 46 -1261 434 1629
1598A629j737p43L25J164O92k242n38J784m58k75J89r65N63M58m73O20p71m53
$$ 1629 -108 -851 -526 638 1330 -912 -1450 334 -124 -399 -210 -1175 -612 -154 -627 -7 -778 -1231
1616a231J886l71j412O09O45N23q31j661J491J243j538m62J8J88R92n55m61L18
$$ -1231 655 284 -1128 -519 126 649 -182 -1843 -352 891 -647 -1109 -1091 -903 89 -466 -927 -609
1634f09o47J107J284j707o14J241O95K8j343k31J803n45j331N53K13J09j62q61
$$ -609 -1256 -149 1135 -572 -1186 55 750 778 -565 -796 1007 462 -869 -316 -103 6 -156 -1017
1652a017N83L01m04R57n88j317J403J066n24q72r48J451J493j839r45R38M3J65
$$ -1017 -434 -133 -537 420 -168 -1485 -82 984 460 -412 -1360 91 1584 -255 -1200 -262 -219 -54
1670e4k32o38L60q7M2O71p34k71J058Q8m90l83N22J410q97j645J109J084l12o29
$$ -54 -286 -924 -564 -651 -609 62 -672 -943 115 203 -287 -670 -148 1262 365 -1280 -171 913 601 -28
1690b8r39N54J020n97q2j59r69R78J164q83q12L5J004P61j339n16J350K3p74j63
$$ -28 -967 -413 607 10 -72 -231 -1200 -222 942 59 -753 -718 286 1047 -292 -808 542 565 -209 -372
1710c72K24O07l79q35M28P7j49O74m74r73M23R57O01r09j346J097J504o40r76
$$ -372 -148 459 80 -755 -327 -250 -399 275 -199 -1172 -749 208 809 -100 -1446 -349 1155 515 -461
1729d61j63O03N26n75k38K89m17K52N31n95k25M44K50o6p92J13J449k82j466J12
$$ -461 -624 -21 505 -70 -308 -19 -436 -184 347 -248 -473 -29 221 155 -637 -524 925 643 -823 -711
1749g11J047N22o67j005L58O89nO3m12o15M56P65J04q46p32R88R18r68o29O53
$$ -711 336 858 191 -814 -456 233 228 291 -121 -736 -280 485 589 -257 -989 -1 917 -51 -680 -27
1769b7N04j95o91J7Q55j43o02Q3O4J76M28j02n47l63O54R89o61j362K97J136K27
$$ -27 477 282 -409 -392 463 320 -282 -199 -135 41 469 367 -180 -543 111 1100 439 -923 -626 510 737
1790G37q98p03P04O61m49j52J02j31L04K93k08k44L3N91J59r80k42R98L06q91
$$ 737 -161 -864 -160 501 52 -100 2 -129 175 468 260 16 49 640 799 -181 -423 575 881 -10
1810a0p28N50J015l07q74J05L94K82J09l33l17N7N05N22n98q33N90Q25m35q88
$$ -10 -738 -188 827 520 -354 -249 145 427 536 203 -114 -57 448 970 372 -461 129 954 519 -369
1830c69p4Q03J73r10k13N85K19j27k72j20K69K21K34j51o98K54J061r5r39l39
$$ -369 -443 360 533 -377 -590 -5 214 87 -185 -305 -36 185 419 268 -430 -176 885 790 -149 -488
1850d88O68O90o68q89M35N56j56k52j39J94K43P3N1l30j83P47L00p29m23M25P58
$$ -488 180 870 202 -687 -252 304 148 -104 -243 -49 194 267 318 -12 -195 552 852 123 -300 125 883
1871H83k41j177J8R05n8n35l30O5N20M8k22k3k13K94O74l89o24K61O56K05p91
$$ 883 642 -535 -517 388 330 -205 -535 -470 50 98 -124 -147 -360 -66 608 219 -405 -144 512 717 -74
1892g4m96Q56L90o82m35Q0M66J75m87r1J99P4N25Qp21Q0O53L23m14q26L83R43
$$ -74 -570 286 676 -6 -441 -361 105 280 -207 -298 -99 -25 500 508 -213 -133 520 843 429 -397 -14 929
1914I29m39p31O2L08L08l64m55K93J55L7K05m44k39O24K78k65n73j20R73J55r81
$$ 929 490 -241 -179 129 437 73 -382 -89 66 103 308 -136 -375 249 527 262 -311 -431 542 697 -284
1935b84j48N04L58r4o99MN28j09kq2m51L86N09k36l11k61N01O87p53o47O12M12
$$ -284 -432 72 430 336 -363 -359 169 60 58 -24 -475 -89 420 184 -127 -388 113 800 47 -600 12 424
1957D24q6m70l82O23K85m65n2j65k6N71j12m70o9J35O53o8r86K10P81n7l70m18
$$ 424 338 -132 -514 109 394 -71 -123 -288 -314 257 145 -325 -394 -259 394 326 -660 -450 331 274 -96 -514
1979e14K72O87l98l78K01j17K95J98n78r0K49K33K88p06m14R70K35n86k56nO06
$$ -514 -242 445 47 -331 -130 -247 48 246 -332 -422 -173 60 348 -358 -772 198 433 -153 -409 -414 192
2000A92J95p63mL60k2K47k31m41L59K28N0j80o12M33P05n31m45R1L39M68n52n18
$$ 192 387 -376 -380 -20 -42 205 -26 -467 -108 120 170 -10 -622 -189 516 -15 -460 -369 -30 438 -114 -632
2022f32O27J90p9Km36K03N31k10o4l03j99Q66k7r11O8L16K68Lq16J60P83l02j79
$$ -632 -5 185 106 108 -328 -125 406 196 132 -171 -370 496 469 -442 -374 -58 210 213 -603 -443 340 38 -141
2045a41L3j82M50J59l90o4p1L21M03p27l93N33K38k1n72l37Q20J98n37O7r8K25
$$ -141 -108 -290 160 319 -71 -135 -206 115 518 -209 -602 -69 169 148 -424 -761 59 257 -280 -213 -311 -86
2067h6N55m47k51K71m1M01n6q09L36N43k84k40l55K05O61m64m91L29J45K77q0
$$ -86 469 22 -229 42 1 402 346 -463 -127 416 132 -108 -463 -258 403 -61 -552 -223 -78 199 119
2088A19n52K61L20j8J45n33k12P62O0m59k32q3N94O1p99Q3L84k9J07l39q5N77
$$ 119 -433 -172 148 130 275 -258 -470 292 352 -107 -339 -422 172 233 -566 -483 -99 -128 -21 -360 -445 132
2110A32m2o7J5l93M92N17o72k73K28K13L34n23n82N88K80k36j35k78K48M11j79
$$ 132 90 23 38 -355 137 654 -18 -291 -63 150 484 -39 -621 -33 247 11 -124 -402 -154 257 78
2131G8j12j01O6N06j86m63J93J44J96j22o76L23O17m13k86q6K5N58j18n63J67
$$ 78 -34 -135 -69 437 251 -212 -19 125 321 199 -477 -154 463 50 -236 -322 -297 261 143 -420 -253
2152b53J76K46K75n10k35M67K54p3m26k46N72J02m66k5O1J80J43m33l7L64oO6
$$ -253 -77 169 444 -66 -301 166 420 347 -79 -325 247 349 -117 -142 -81 99 242 -191 -228 136 130 196
2174A96j77l21M49L76l06l51j74M21M37m71m24J59K74K86k43m77K47K18k4K8l31
$$ 196 19 -302 147 523 217 -134 -308 113 550 79 -345 -186 88 374 131 -346 -99 119 95 123 -208
2195b08m5N01q3k77K2R0K99r6n21J44M30jk56l31J42M97l2k98k09l1M77J70m70
$$ -208 -253 248 165 -112 -90 0 299 203 -318 -174 256 255 -1 -332 -190 307 275 -23 -232 -263 214 384 -86
2218h6k16J06L27K44m63l09M05J84j27j60p8K49J78k54p3P3J52J47l04k73K39
$$ -86 -302 -196 131 375 -88 -397 8 192 65 -95 -173 76 254 0 -73 0 152 299 -5 -278 -39
2239c9K50M1l21l57L83M64k07l47j30K32M16j55l63L3J80J98j2l44l4K58O8j39
$$ -39 211 252 -69 -426 -43 421 214 -133 -263 -31 385 230 -133 -100 80 278 266 -78 -112 146 214 75
2261G5k68M6L65q3l28k9J90K91j05m06M5L64J40q0k99j07L90K36k32l09q7L21
$$ 75 -193 -147 218 135 -193 -222 -32 259 154 -252 -207 157 297 217 -82 -189 201 437 205 -104 -191 130
2283A30K06l20k63J17K47P5k47j38K60J57q2j21j03K34K58k29k61PK32J97k88
$$ 130 336 16 -247 -130 117 192 -55 -193 67 224 142 21 -82 152 410 181 -80 -73 159 356 68
2304F8m02J15L34N8k74k72J62L44Kj89j53R8L23j2k60n0J44K04o2l55j5L21K8
$$ 68 -334 -219 115 173 -101 -373 -211 133 135 -54 -207 -109 214 202 -58 -108 36 240 178 -177 -192 129 157
2327A57k27k14O4L39M2k99j02J57K80P3k84j66K10K64rl15j66K62J83j52k53o1
$$ 157 -70 -284 -220 119 161 -138 -240 -83 197 270 -14 -180 30 294 285 -30 -196 66 249 97 -156 -217
2349b17K48J33k62j41J31J61R4j95k03K17K38j5k16j85K11L12j38l20m6K07K13
$$ -217 31 164 -98 -239 -108 53 147 -48 -251 -34 204 189 -27 -212 -1 311 173 -147 -193 14 227
2370B27j51l06M8K15Q6p8k32L4K71O5j50j50Q6K92ql26n0K00J75j00l24pK84N0
$$ 227 76 -230 -182 33 119 41 -191 -157 114 179 29 -121 -35 257 249 -77 -127 73 248 148 -176 -183 101 151
2394A51j11j97q5K99J47k10j59K0K30J90k59k11K08J67j9k10j43K20J47j53j56
$$ 151 40 -157 -242 57 204 -6 -165 -145 85 275 16 -195 13 180 161 -49 -192 28 175 22 -134
2415a34l1J62J83j74j92N5J85J68j85l08J84K71l1j74k08J42K98j05k27j6O4K03
$$ -134 -165 -3 180 6 -186 -131 54 222 37 -271 -87 184 153 -21 -229 -87 211 106 -121 -137 -73 130
2437A30j1k65lJ94P8l3k49l4L26L1k18j27P5K71J4k98l9J68J26K8k24j10K12J44
$$ 130 119 -146 -149 45 123 90 -159 -193 133 164 -54 -181 -106 165 179 -119 -158 10 136 164 -60 -170 42 186
2461A86n6j98j35K53J82k26j86M9J70J50k40j79K21J17k7p9j65J37K28r8j36r5
$$ 186 130 -68 -203 50 232 6 -180 -131 39 189 -51 -230 -9 108 81 2 -163 -26 202 104 -32 -127
2483a27R1K75j26l10N3J69J06j07k76J24K59n4r4q5J0K65Ok03l2M2J82O6l10p6
$$ -127 -36 239 113 -197 -144 25 131 24 -252 -128 131 77 -17 -102 -92 173 179 -24 -56 -14 168 234 -76 -152
2507a52K38O7q4k20n7L11L9k26k9J1J71J22k13r5J10R5J21j78k23K24J82j33j54
$$ -152 86 153 69 -151 -208 103 142 -84 -113 -102 69 191 -22 -117 -7 88 209 31 -192 32 214 81 -73
2530g3j09J67K11k37j65J15P6J23q0j95J30J51L7m3k13O6L06q0k12o3N6K22p6
$$ -73 -182 -15 196 -41 -206 -91 -15 108 28 -167 -37 114 151 108 -105 -39 267 187 -25 -88 -32 190 114
2553A14l15O3J65L6k7j78K1K34K1p7o5p4K36J01k71p8Q5J50N0k88j13K76L7j08
$$ 114 -201 -138 27 63 36 -142 -121 113 134 57 -8 -82 154 255 -16 -94 -9 141 191 -97 -210 66 103 -5
2577ej12p5J95J24j40o1k8J18K32j63k15J21J51N1j64k17J77J90j59j03m4O7J93
$$ -5 -117 -192 3 127 -13 -74 -102 16 248 85 -130 -9 142 193 29 -188 -11 179 20 -83 -127 -60 133
2600A33j11j58O4R0J26ok47L4K27L5j03k16M8K79m8k19l3O3J63jk26J0J26K3M7
$$ 133 22 -136 -72 18 144 138 -109 -75 152 187 84 -132 -84 195 147 -72 -105 -42 121 120 -106 -96 30 53 100
2625A00j45j02K01J12j11j23m8K33J15k80r8J40J10K1j79j09J81P2l4p6j20R0
$$ 100 -45 -147 54 166 55 -68 -116 117 232 -48 -146 -6 104 125 -54 -163 18 90 56 -20 -140 -50
2647e0K26q1j66l3J18J78j31k14R9J53J4j12j41J31J48q0r4m2K9J95k5k13k0J02
$$ -50 176 95 -71 -104 14 192 61 -153 -54 99 113 1 -140 -9 139 59 -35 -77 -48 147 122 -91 -111 -9
2671iJ51k2k72j6K71M4j33j32L2J83K4j46l2J4R6O0j40p9P8R1K8j80r8K14J20
$$ -9 142 120 -152 -168 103 147 14 -118 -86 97 121 -25 -57 -43 53 113 -27 -106 -28 63 91 -89 -187 27 147
2696A47j61j43M0J93P1j93p7P8J07P1j04j57O9J51M1j33j71Q9K09p7j78mJ18J08
$$ 147 -14 -157 -117 76 147 -46 -123 -45 62 133 29 -128 -59 92 133 0 -171 -82 127 50 -128 -132 -14 94
2720I4r2j46J12J14No8q4K4J52J9j32j25M5K14pk42p5J47J42j8k30oJ99M5n6p4
$$ 94 2 -144 -32 82 87 19 -65 -41 111 130 -2 -127 -82 132 125 -117 -192 -45 97 79 -151 -157 42 87 31 -43
2746d3k7J10Q9q1r3j8J21P6j56j35J05J36k8j92o2K10J00j21j00J5J11J22o5j35
$$ -43 -70 40 129 48 -45 -63 58 134 -22 -157 -52 84 56 -136 -198 12 112 -9 -109 -94 17 139 74 -61
2770f1kR9J12o3k04J7J88J5j34j36R7J51n5j39JR7R1l2j17J4J11N5k1j50n5J94
$$ -61 -63 36 148 85 -119 -102 86 101 -33 -169 -72 79 24 -115 -114 -17 74 42 -75 -61 50 105 84 -66 -121 73
2796G3R9j61j64M0J78Oj68n4R2J02k0r6l2J06P5qq2p2J04J37j09j52PJ52Q1j70
$$ 73 172 11 -153 -113 65 71 -97 -151 -59 43 23 -73 -105 1 76 68 -14 -86 18 155 46 -106 -99 53 134 -36
2822c6j33J05J49l0j19o4Q5J11mp6p7L8J67j9j61k0J18Q4o3j81L3J65j5j19p2
$$ -36 -169 -64 85 55 -64 -128 -43 68 64 -12 -89 -51 116 97 -64 -84 34 118 55 -126 -93 72 57 -62 -134
2847a34P1J16rj05m6O5J17K5j52p3J08J41k4j80n2J67Q1j27p9K8Q9N1q3p2O0N8
$$ -134 -63 53 44 -61 -107 -42 75 100 -52 -125 -17 124 100 -80 -132 35 116 -11 -90 -62 27 78 -5 -77 -17 41
2873D1K3n9r9O3J30k5j21p2J29J34q3j79M4J31N1r0j21N0Q9M0m5j09KJ22M5r9
$$ 41 64 5 -94 -31 99 74 -47 -119 10 144 61 -118 -74 57 108 18 -103 -53 36 76 31 -78 -76 46 91 -8
2899hq9M5J44k5j47jJ23N3n8j10J4J33J6q6n2j7J19O1j12j04L3J23N7j40j17J25
$$ -8 -97 -52 92 67 -80 -81 42 95 37 -73 -59 74 90 4 -48 -65 54 115 3 -101 -68 55 112 -28 -145 -20
2925b0J08l3j06k8J12P3o8p0qO1O3o9r8J9R1N0q3j29P1J70m3j08n5R6J28m9j24
$$ -20 88 55 -51 -79 33 106 38 -32 -40 21 84 15 -83 -64 27 77 -6 -135 -64 106 63 -45 -100 -4 124 75 -49
2952d9J6O3N6j6r7l7R2M3m6j14nJ40K6j24o0P3J05mj36JJ13L9j8p9m8R5O4m5q6
$$ -49 -33 30 86 70 -27 -64 28 71 25 -89 -94 46 72 -52 -112 -39 66 62 -74 -73 40 79 61 -18 -66 29 93 48 -38
2981c8m7R6J04j21j16O4J01K7r2q1J06R2k4n3m0L6R7m7q6k9N8R3n2j51J7J18M2
$$ -38 -85 11 115 -6 -122 -58 43 70 -22 -103 3 95 71 18 -22 14 111 64 -22 -51 7 100 48 -103 -86 32 74
3008G4p9j25O6J38l6n8m4L7J03Jj02j7M3O6K6j44p0J42M8o4j03oJ38L8j15k5M2
$$ 74 -5 -130 -64 74 38 -20 -64 -27 76 77 -25 -42 1 67 93 -51 -121 21 69 5 -98 -104 34 72 -43 -68 -26
3035b6P7K5p8l8L6O8L0q0j16R5R4n8j02k5Q5Q8r7q5N3O9M0m8r4N6P9Nm8p4NJ45
$$ -26 51 76 -2 -40 -4 64 94 14 -102 -7 87 29 -73 -98 -13 75 -22 -107 -54 15 55 7 -87 -31 48 53 5 -69 -64 81
3065H1j6j26k1N5J01m1j29J6J01J7k2p2rJ16Rn3n7JJ05L0j10n0M6Q8Lj27m7J34
$$ 81 65 -61 -82 -27 74 33 -96 -80 21 38 16 -56 -65 51 60 7 -50 -49 56 86 -24 -74 -28 60 63 -64 -111 23
3093B3M2o1o7j9J01M1o1o0J7M9P0n4j11N8R0J2r1p9Q3J01o3p0j8O1Q3n1r1J8L9
$$ 23 65 4 -63 -82 19 60 -1 -61 -44 5 75 21 -90 -32 58 70 -21 -100 -17 84 21 -49 -67 -6 77 26 -65 -47 -8
3122hO7l4j02J2J01L5p2q6L1J16Kj11l3M9R8k8r5MN7L1%r0l6Q8N3n8n8lQ5N8j02
$$ -8 59 25 -77 -65 36 71 -1 -87 -56 60 62 -49 -82 -33 65 37 -58 -54 3 34 34 -56 -92 -4 49 -9 -67 -70 15 73 -29
3153b9n7P1Q0mq5n1Q0N1j5o8n3P1P5m0q0j6N4R1p1j00M4Q4Qn1n5M1Q2mp0l2L1
$$ -29 -86 -15 65 61 -24 -75 5 56 41 -27 -80 -9 66 26 -54 -70 -16 75 4 -96 -52 32 40 -11 -66 -25 57 53 -17 -49 -18
3184a8P2k0j01j0L8Q3l0j21J1J22L0n7o4RJ24J3q6l4K5O0K2q5n2L1O9Mq7m4R4
$$ -18 54 34 -67 -77 -39 44 14 -107 -96 26 56 -1 -65 -56 68 81 -5 -39 -14 46 68 -17 -69 -38 31 35 -52 -96 -2
3213bO1n9o6kR1N0q9m7N1M1K4n4o9L6Q1op9n9M4R8l2q5j5P6P5m6o9J8N6K8k3p0
$$ -2 59 0 -66 -68 23 73 -16 -63 -12 29 53 -1 -70 -34 47 41 -38 -97 -53 45 13 -72 -87 -11 64 18 -51 -33 23 51 28 -42
3245d2K0Q3Np0o4K5R1kr7m5Q2P8k5r6j7Q8M8m4m8l0P1N7n6n0KO9N0r2p5N8P3j8
$$ -42 -22 61 66 -4 -68 -43 48 46 -51 -96 -14 64 39 -57 -74 14 62 18 -30 -60 11 68 12 -38 -36 33 83 -9 -84 -26 47 29
3277B9p0l7O3P5m4o2mN8P5m4p2LN8O0n5p6RR4Lp8n1K9Q7jr5JM8M7j2p9k0Q0L8
$$ 29 -41 -78 -15 60 16 -46 -50 8 83 39 -33 -30 28 88 33 -43 -34 60 63 -15 -66 -37 50 49 -46 -45 3 50 38 -41 -61 19 57
3310E7l6o6k5J02L3n9o5KR1L7q4o4O2M7Nl3n7M7O1j4n2l6N6O3m8p0NO6N1p1p0
$$ 57 21 -45 -70 32 65 6 -59 -57 34 71 -13 -77 -15 32 37 4 -53 -6 55 41 -11 -47 9 72 24 -46 -41 25 76 5 -65
3341f5M3O2On9n0L0Q1qn9l1J3P3K3j00k6P2N1k6o7rQ1J9m8m5K7N5No2l0K3P3%
$$ -65 -22 40 46 -13 -63 -33 48 40 -19 -50 -37 36 59 -41 -67 5 56 30 -37 -46 35 54 6 -39 -12 43 48 -14 -44 -21 52 52
3373E2p6l9N5R1l7o7m0P6O8n1o5nN7M4k9q4K3N1J8l2n8K0P3j1o2l2N1P1j6j00
$$ 52 -24 -63 -8 83 46 -21 -61 15 83 32 -33 -38 19 63 34 -50 -27 24 42 10 -48 -28 45 34 -28 -60 -9 62 46 -54
3403e4J7O0M3l1p2QN7L6m0o1jO2K7n0m8J4P1J7p4l7O7K8qm8j4N7L9l3n5j5M2N4
$$ -54 -37 23 66 35 -37 -29 28 64 24 -37 -38 24 51 1 -47 -33 38 55 -19 -56 11 39 31 -17 -31 26 65 32 -23 -38 4 58
3435E8o3o1K8N7J8n8n3N2O7j8l9k0L6O0k6m5j5L0L4j4p2J0N3L4m5o1RR1pn8j8
$$ 58 -5 -66 -38 19 37 -21 -74 -22 45 27 -12 -32 4 64 38 -7 -22 8 42 28 -44 -34 19 53 8 -53 -44 47 40 -18 -36
3466c6J6P0Rp6j4L9L7Qp4k5N1K8k4n1l1Q4L1n4l7J8O1K1n3l6L3M4J3m6m8L4O3
$$ -36 -20 50 59 -17 -31 8 45 53 -21 -46 5 33 9 -42 -73 11 42 -12 -49 -31 30 51 -2 -38 -5 39 52 6 -42 -8 55
3497E5k8n3k1L9N5m2p8L2N7K2k3p2L0N6mk1m1J2N5J1n7k9L8N4j7p1j0N8K8l8m8
$$ 55 27 -26 -47 -8 47 5 -73 -41 16 38 15 -57 -27 29 25 4 -37 -25 30 41 -16 -45 -7 47 30 -41 -51 7 35 -3 -51
3528e1%O1K0k3l4%N6K2n3l1J3M1K6o5l2N5M0l1l2k9L9M9l6m4jL9M7m0m6RL9K9
$$ -51 -51 10 30 7 -27 -27 29 51 -2 -33 -20 21 47 -18 -50 5 45 14 -18 -47 -8 41 5 -39 -40 -1 46 6 -40 -31 8 37
3560C7l5p0L6O2j3n3j5L1N6j8m5j4M3L0qn8mM9K1k0n1pP2J8n9k6K8M4jo1oL8J6
$$ 37 2 -68 -32 30 17 -36 -51 -20 36 18 -27 -41 2 32 24 -34 -38 11 32 12 -39 -46 26 44 -15 -41 -13 31 30 -31 -37 1 17
3593A7%m9k1N7K0k1l9k0O1L0m4l4J0M7K3n0l2M9L6qm1k7K8L5jn0j0K9L4k1n5P
$$ 17 17 -32 -53 4 24 3 -36 -56 5 35 -9 -43 -33 14 37 -13 -45 4 40 32 -9 -36 -8 27 26 -24 -34 -5 29 8 -47 -40
3625d0N9J2j8n8L4M9Jl6k1OL5lm8j1J3M1Jn9j2O6J9k4m8MO6pk7k6J1N5Rl0n6L7
$$ -40 19 31 13 -45 -11 38 39 3 -18 -12 23 20 -28 -39 -26 15 16 -43 -55 11 30 6 -42 -38 28 21 -6 -32 -21 34 43 13 -43 -6
3659fL2%l1n2M5N3l1l8j0L8L9m1l8K2L3K1k2m2J1L7Mk3l8PM9Rn9j6L1M0j5n0M
$$ -6 26 26 -5 -57 -12 41 10 -28 -38 0 39 -2 -40 -18 15 36 14 -28 -17 20 24 1 -37 -30 19 28 -31 -47 -16 24 9 -41 -37
3692c7N0Qj1l4NM5Pk6l4J4L9J9n7k8K8L6j0m2k1N8K2j8l6pL7K4j4l6LK2L2l6k9
$$ -37 13 21 10 -24 -19 26 33 7 -27 -13 26 45 -12 -40 -12 24 14 -28 -49 9 31 13 -23 -30 7 31 17 -19 -16 6 38 2 -27
3725b7lM6J6n4k2J4O3k1l5nK4K9nm0jK9J9km5j3N1J9k3m6%N3J3n3j6L6J7J1m0
$$ -27 -30 16 32 -22 -44 -30 33 12 -23 -28 -4 25 20 -20 -21 8 27 25 -20 -33 18 37 14 -32 -32 21 34 -19 -35 1 18 29 -11
3758a1j4K3L0j7l0pK3L8k8l8oM9K5m5m0L2M2nk8m1M2M5j3l6pJ4K5J1m7j4L6L3
$$ -11 -25 -2 28 11 -19 -26 -3 35 7 -31 -37 12 37 -8 -48 -16 26 21 -7 -48 -6 39 26 -10 -17 -3 22 33 -14 -28 8 41
3790D1k1n5J7N0kk5l4J7L9jm5j1J6L2K1n0j5J8L7%m4k0M1K9l1l0KM3J0l1k6K1
$$ 41 20 -35 -18 32 30 5 -29 -12 27 26 -19 -30 -14 18 39 -11 -26 -8 29 29 -15 -35 6 35 4 -26 -24 19 29 -2 -28 -7
3822gK3Ok3l2K7L2Jl4k7L1L2Kn2jM0L8l8m0J6K4Nj8l6J7L0Rl0j8MM7Rn7j1K4L2
$$ -7 16 22 -1 -33 -6 26 27 -7 -34 -3 29 31 -21 -22 18 56 18 -22 -6 18 23 5 -31 -14 16 25 -5 -23 -19 28 37 -20 -31 -7 25
3857B5j8k3kL1Pqk3lL9J0m1j9JL4K7l9l9K6M3Km5j1L7L9l8k8lK4K0k2k8kK6K5
$$ 25 7 -16 -18 13 20 12 -11 -14 25 35 -6 -25 -24 10 37 -2 -41 -15 28 30 -15 -26 11 50 12 -16 -19 5 25 3 -25 -27 -1 24
3891B4l1l2J4L9K0m1k2K0M7j9l0j0K4K3jm1mK4K2ol9j2L6J7k3l1MM9J2m3j8K9
$$ 24 -7 -39 -25 14 34 -7 -29 -9 38 19 -11 -21 3 26 25 -16 -20 4 26 20 -19 -31 5 22 -1 -32 -28 21 33 -10 -28 1
3923AK4kl0j6L3J3%m1rK0K8j6l2nL8K6l9k2J0M6pj8k9J2M1rk1j5J4J9J5n0JK3
$$ 1 25 23 -7 -23 10 23 23 -18 -27 -7 21 5 -27 -32 6 32 -7 -29 -19 27 20 2 -27 -15 26 17 -4 -19 -5 14 29 -21 -20 3
3957CK0k7m0J8M8Jj7k4mM2%l6qJL4J3l9mOK2Mm5j9N0K2j8k0NL8j7j3k0J4J7J5
$$ 3 23 -4 -44 -26 22 23 6 -18 -22 20 20 -16 -24 -23 11 24 -15 -19 -13 9 13 -32 -51 -1 21 3 -17 -12 26 9 -4 -24 -10 7 22
3992B2l0j2RL5Ml4k5K9L5k1l8JL6J3j9l0QK9Pj3k8RK7Jk5k4J7L8Km0qK4L0k0l8
$$ 22 -8 -20 -11 24 28 -6 -31 -2 33 12 -26 -25 11 24 5 -25 -17 12 19 6 -22 -13 14 15 -10 -34 -17 21 23 -17 -25 -1 29 9 -29
4027b9J1K1Nj2k5K2K0Mk0ojL1Ql1k8J4L9pk6j0K6J4j6k4lJ6K9k7k1J4jK4j1k1
$$ -29 -18 3 8 -4 -29 -7 13 17 -3 -9 -10 21 29 -2 -30 -16 23 16 -10 -20 6 20 4 -20 -23 -7 22 -5 -26 -12 -13 11 0 -21
4061b1kL7Ol6qJ8K5j4k0RoK6j0k6jK3J4J3m5oL1J5k4j1NK5J0m1mJ5J6lk6NJ3J0
$$ -21 -23 14 20 -16 -24 -6 19 5 -15 -6 -12 14 4 -22 -23 0 14 27 -18 -24 7 22 -2 -13 -8 17 27 -14 -18 -3 13 10 -16 -11 2 12
4097A2nj9j3K0J2qk8JM1Pk3k1K6RMk9lJ1K0j9Jk0J5L7j4k9MQK4rl2J3K2mk2jn
$$ 12 7 -12 -25 -5 7 -1 -29 -28 13 20 -3 -24 2 11 15 -14 -17 -6 14 -5 -4 -24 -9 28 14 -15 -11 -3 21 12 -20 -7 15 11 -11 -12 -17
4134a7K0jj8jnJ6K3l2kOK7ol2PK6Jpk6J9J6%k3rJ5J6Nk1j0%K5%j8k2L8J2rj9O
$$ -17 3 2 -16 -17 -22 -6 17 -15 -17 -11 16 10 -22 -15 11 12 5 -21 -2 14 14 -9 -18 -3 13 18 -3 -13 -13 12 12 -6 -28 10 22 13 -6 0
4172@J2M%k9RJ4Nj1j6MJ2Pk5jLJ8%j5kK0Lqnj1K9mnj4%J9knj9QJ4Nk3KJ0J0nk2
$$ 0 12 16 16 -13 -4 10 15 4 -12 -8 4 11 -14 -15 -12 6 6 -9 -11 9 12 4 -1 -12 17 13 8 -6 -6 13 11 6 -13 -5 9 14 -9 -7 3 13 8 -14
4214a4qK8Ork6RJ2J6ll1kL0Kk2j4K2J3j3Jj3L2noj7LJ6JLk1KJ1mOj5j5L9%j7j2
$$ -14 -22 6 12 3 -23 -14 -2 14 11 -20 -22 8 10 -12 -26 -4 9 -4 -3 -16 16 11 5 -12 -9 7 8 11 -10 -8 3 -1 5 -10 -25 14 14 -3 -15
4253a5J1K7j7j9KJ8koj2jRJ4j1j9RJ2NKj8NJ2kj7mJ8J2j9NmQMQj7nOK0j1k5RJ3
$$ -15 -4 23 6 -13 -11 7 5 -1 -13 -14 -5 9 -2 -21 -12 0 5 7 -11 -6 6 4 -13 -17 1 13 -6 -1 -5 3 7 15 -2 -7 -1 19 8 -17 -8 5
4293EJ7k8nJJ9%j9KOJ7rj8jJ3mJMoLK1j6Jj4J4Qj2j4NJ0pj1J7LjPnj1J4J2j2J
$$ 5 22 -6 -11 -10 9 9 -10 -8 -2 15 6 -12 -13 0 -4 -3 1 -5 -2 19 3 4 -10 4 12 0 -14 -9 1 -6 -17 0 3 2 9 4 -7 7 19 7 8
4334Hk6K2J4kl5J7J0mj1rNQKqj4J5J7%j2%QNqj9J2K2lk2%LJ1j1JoONNkj6J0R%
$$ 8 -18 4 18 16 -19 -2 8 4 -7 -16 -11 -3 -1 -9 -23 -8 9 9 -3 -3 5 10 2 -17 -5 17 14 -8 -8 -5 6 -5 -4 -10 -4 1 6 4 -12 -2 7 7
4376Gj3qK3J0j7j1KJ1jmj2QQLlj9MJ1kMqPQKrj5K0Jlj3J4JMj1mjMOppNJ4j1mm
$$ 7 -6 -14 9 19 2 -9 -7 4 3 -1 -13 -5 3 6 3 -16 -12 -1 -3 1 -7 0 8 10 1 -14 6 7 4 -9 5 6 10 -1 -5 -6 -2 4 -3 -10 -5 9 -2 -6 -10
4421a0%J5Jk4LJ7Lkj3%K0j5Lj2NPJ0j4nkJ9Nj2pOJ1mlpPplP%mRpj3OJ0J6j7pj
$$ -10 -10 5 6 -18 -15 2 5 3 -10 -10 10 -5 -2 -14 -9 -2 8 -6 -11 -13 6 11 -1 -8 -2 9 5 2 -5 2 -5 -8 -1 -1 -5 4 -3 -16 -10 0 16 -1 -8 -9
4465iJ7j1rjOLnLpJ1qKjQnQlj5J7LPk3LJ7OqpqJNJ3kk0J0MKnj3J9m%j4mJ8kmL
$$ -9 8 -3 -12 -13 -7 -4 -9 -6 -13 -2 -10 -8 -9 -1 -6 2 -1 -16 1 4 11 -12 -9 8 14 6 -1 -9 -8 -3 10 8 -12 -2 2 4 -1 -14 5 1 1 -13 -17 1 -1 -5 -2
4512bK%lj0MkLJ0nj4J2J1j4oJ1Jj%kMklLRj1%oJNJ2mmj0jJJ6mj1lJ1nmJ1lJ2j0
$$ -2 0 0 -3 -13 -9 -11 -8 2 -3 -17 -5 6 -8 -14 -3 -2 -3 -3 -5 -1 -3 -6 -3 6 -5 -5 -11 -10 -5 7 3 -1 -11 -12 -11 5 1 -10 -13 -2 -7 -11 0 -3 9 -1
4558aKrkNlnrKJ1jNj4J3Qj4J8plPjKj2OrJ6j3QLnoO%Mkj1NJ4qJk1J0%N%j6J7l
$$ -1 1 -8 -10 -5 -8 -13 -22 -20 -9 -10 -5 -19 -6 2 -12 6 -1 -4 3 2 4 -8 -2 -11 5 -8 0 3 -2 -8 -2 -2 2 0 -11 -6 8 0 1 -20 -10 -10 -5 -5 -21 -4 -7
4605gKLpLJ0rmPmkJ1k1J9OnkMjmJ2prj1J6KmoQMj0JkMlLj2QK%Mlj2J5%kqQJ2j7
$$ -7 -5 -2 -9 -6 4 -5 -9 -2 -6 -8 3 -18 1 7 2 0 4 3 -1 11 4 -5 -16 0 2 -2 -8 0 4 -6 -5 -7 -3 -6 -3 -15 -7 -5 -5 -1 -4 -16 -1 -1 -3 -11 -3 9 -8
4654hlmJ2MmNNj0jjJ0lmRj2Jj4J5NkM%lnnOpJ4lmj5J2JJKk1K5l%lPkoJ4npJ1k
$$ -8 -11 -15 -3 1 -3 2 7 -3 -4 -5 5 2 -2 7 -5 -4 -18 -3 2 0 4 4 1 -4 -9 -3 -10 4 1 -3 -18 -6 -5 -4 -2 -23 2 -1 -1 -4 3 1 -5 9 4 -3 8 6
4702Fr%Nj3J1rJ0lJ5qj5J4JQj4jPj4J3%%rjRj2J5j4%J0kqNkLJkNjNnPoOnKOqo
$$ 6 -3 -3 2 -11 0 -9 1 -2 13 5 -10 4 5 13 -1 -2 5 -9 4 4 4 -5 -6 3 -9 6 -8 -8 2 0 -8 -3 -5 -2 -1 -3 2 1 6 1 8 2 8 3 5 11 3 -3
4750cRj2J0n%jRKmqPlMjrQpJOj2QNRj9PQpkjMlPkjJ0j3kQqJ5Jj5KMnjJ3j7NJ1
$$ -3 6 -6 4 -1 -1 -2 7 9 5 -3 4 1 5 4 -5 3 -4 -3 3 -9 -1 4 13 -6 1 9 2 0 -1 3 0 7 5 4 14 1 -1 7 -1 14 15 0 2 6 1 0 13 -4 1 12
4800A2p%nQqNqNqmPMj6J3lnKMjOkk%PJ0j1MjjLlkoN%Nj2OlROpJmJnNmKKnj2J8
$$ 12 5 5 0 8 0 5 -3 2 -6 -10 -3 1 -15 -2 -5 -10 -8 -4 -5 1 -1 -3 -3 4 14 3 7 6 5 8 5 3 -3 2 2 7 -5 1 -2 7 13 6 7 3 4 -1 4 0 2 4 -1 -13 5
4853E%noJ2KrMj4J3rQj2J4Mj0nRJ0j4QkJ0j5R%pknOjn%MOrnLJ2Mkk1OJ3j2Q%m
$$ 5 5 0 -6 6 8 -1 3 -11 2 -7 1 -11 3 7 -3 -8 1 11 -3 5 3 13 -2 7 7 0 -2 -7 -1 -2 -7 -7 -3 3 -6 -11 -8 4 8 6 -15 -9 4 -8 0 0 -4
4900dnPjm%MJ2mpLJ0okN%%%q%Pl%Kj0J1oj1LLJ6j0%j7J6nPj5LJ0mPpJ1rjnMJn
$$ -4 -9 -2 -3 -7 -7 -3 9 5 -2 1 11 5 3 8 8 8 8 0 0 7 4 4 6 -4 7 1 -10 -7 -4 12 2 2 -15 1 -4 3 -12 -9 1 -3 4 -3 8 -1 -2 -7 -3 -2 -7
4949gJ6j4J9mlj4kMJMQkoJ1j1j0J6mjmmNoLrQMqkJ2mjRpjlJOoj1J5OjlJllK%N
$$ -7 9 -5 14 10 7 -7 -9 -5 -4 0 8 6 0 11 0 -10 6 2 1 -3 -7 -2 -8 -5 -14 -6 -2 -10 -12 0 -4 -5 4 -3 -4 -7 -6 0 -6 -17 -2 4 3 0 1 -2 -5 -3 -3 2
4999BokJ6j2J0pjQJ0k2lN%Llj1J4j4kJ2J2qMj1kJ3nQj8%J0%nkJ5oLjoOK%qkOK
$$ 2 -4 -6 10 -2 8 1 0 8 18 -4 -7 -2 -2 1 -2 -13 1 -13 -15 -3 9 1 5 -6 -8 5 0 8 -10 -10 0 0 -5 -7 8 2 5 4 -2 4 6 6 -2 -4 2 4
5045DknlMJmolJ7Kj8J4kkoJKJkJ2rlMnOLnmNk%QnK%MpJ0k3PMJ2pPr%%kLoM%mO
$$ 4 2 -3 -6 -2 -1 -5 -11 -14 3 5 -13 1 -1 -3 -9 -8 -6 -5 -7 5 -4 -7 -3 -8 -2 1 -4 -8 -3 -5 -5 3 -2 0 0 4 -3 7 -16 -9 -5 7 0 7 -2 -2 -2 -4 -1 -7 -3 -3 -7 -1
5099aj5MJ6Lk0jPJRlj1QjrJ2PkP%pkJ0%r%MpPJkqJ1j4lNJ4j0Kj1J1Mj2LKnJOj4
$$ -1 -16 -12 4 7 -13 -14 -7 -6 3 0 -11 -3 -4 -13 -1 6 4 11 11 4 2 12 12 3 3 7 0 7 8 6 -2 9 -5 -8 -3 11 1 3 -8 3 7 -5 -2 0 -5 -4 2 -12
5147a2J4qJ1oj3J2JLkOJMkj5LJ2%qmPNlqOlJ2j2nLKMknM%pLKopMNqJ0ljPjPrR
$$ -12 2 -6 5 -1 -14 -2 -1 2 0 6 7 11 9 -6 -3 9 9 1 -3 4 9 6 -2 4 1 13 1 -4 -1 1 5 3 -2 2 2 -5 -2 0 -6 -13 -9 -4 -12 -2 -5 -6 1 0 7 -2 7
5198GqLQnJj0POrLq%MR%rj4NMKrJPJ1j0nJ5j9lJ0oKQRj7QMnlPlRNpkOpnQmLOj4
$$ 7 -1 2 10 5 6 -4 3 9 0 3 -5 -5 -1 8 8 -1 -15 -10 -6 -4 -13 -12 -5 6 -4 -9 6 -13 -16 -6 -12 -10 -2 7 -10 -2 2 -3 -6 1 -2 7 12 5 3 9 2 -3 5 1 4 10 -4
5251dJ0OqqQo%nJ1pkLk%nJ3rrJ6nNJj0POj6J6pQJ%jmLj1LJ4nj1OJJJ1j5qRJ2j4
$$ -4 6 12 4 -4 4 -2 -2 -7 4 -3 -5 -2 -4 -4 -9 4 -5 -14 2 -3 2 3 -7 0 6 -10 6 -1 7 8 8 7 3 6 -5 -2 12 7 -4 2 3 4 15 0 -8 1 13 -1
5299aK%j1J5Lk5K2lKkoOkK%%kJJpRnlONJkKn%mjO%kn%K0mkj8J4mnPqkJ2plJ1k
$$ -1 1 1 -10 5 8 -17 5 2 4 2 -4 2 0 2 2 2 0 1 2 -5 4 -1 -4 2 7 8 6 8 3 3 -1 -2 4 4 2 -3 -3 17 13 11 -7 7 3 -2 5 -3 -5 7 0 -3 8 6
5351FnRj2OLmkj%MkoJ2oJ3j1%LkpOnLKpMqRKj2kQLNpKj2OMjjmjJ0Lj3ORrKn%j
$$ 6 1 10 -2 4 7 3 1 0 0 4 2 -4 8 2 15 4 4 7 5 -2 4 -1 2 4 -3 1 -7 2 4 -8 -10 -2 1 6 -1 1 -11 -5 -1 -2 -3 -7 -8 2 5 -8 -2 7 -2 0 -5 -5 -6
5404fNNnK%OnoJ5rKLkNj2JNKnQj4P%JRj3j0J2kJmjJ1%noJK2k1Kl%J3j9K0j1LJ0
$$ -6 -1 4 -1 1 1 7 2 -4 11 2 4 7 5 10 -2 -1 4 6 1 9 -5 2 2 3 12 -1 -11 1 -1 0 -4 -5 6 6 1 -5 -4 18 -3 -1 -4 -4 9 -10 10 -1 2 12
5452A2kLnKJkj1mJ6qJ5k4ONj%klNj%LKj5j5K9rnPK%nQMjj5QMojmJ2nLKPqMj5J1
$$ 12 10 13 8 10 11 9 -2 -6 10 2 17 -7 -1 4 3 3 1 -2 3 2 2 5 7 -8 -23 6 -3 -8 -1 1 1 -4 4 8 7 -8 0 4 -2 -3 -7 5 0 3 5 12 4 8 -7 4
5502DnQj2J0nRj3J0nnLJLqRrNjLj4J5nRnnMJ1n%mMJj8J3LjJjj1J6KppJ7j2mJ1
$$ 4 -1 7 -5 5 0 9 -4 6 1 -4 -1 0 3 -5 4 -5 0 -1 2 -12 3 -2 7 2 -3 1 12 7 7 3 7 8 -10 3 6 5 6 5 -6 10 12 5 -2 15 3 -1 10
5549A0j4kNLjKLkLkoPpnLM%lKkKJ3oqN%mrmMOJ6njlLmOqLmj0J0jRj6PQj4%Pkm
$$ 10 -4 -6 -1 2 1 3 6 4 7 5 -1 6 -1 -6 -3 1 1 -2 0 -2 0 13 7 -1 4 4 0 -9 -13 -9 -3 13 8 7 4 7 3 9 1 4 0 -10 0 -1 8 -8 -1 7 -7 -7 0 -2 -6
5602f%jOJ3k1OlJ5Jj7J4jOk0KJ2nNnJKjKj3KRJj0PNqNJj1J1pNKj3PJ3j3oOpJ4
$$ -6 -6 -7 -1 12 -9 -3 -6 9 10 -7 7 6 12 -8 -6 6 1 6 1 2 4 3 5 -8 -6 3 4 -6 1 6 -2 3 4 -7 4 -3 2 4 -9 -2 11 -2 -8 -2 -9 5
5648EpjmMjPjmLLJkolK%J2Mj2njJlQQlnlJ3lKoJJPj0kQmoNjLMnmMqJ8j2oPnJ2
$$ 5 -2 -3 -7 -3 -4 3 2 -2 1 4 5 3 -3 -6 -4 -4 8 12 0 -5 -6 -5 -8 0 8 5 0 -3 10 7 9 3 4 5 12 2 0 8 4 -2 3 2 5 9 4 0 4 -4 14 2 -4 3 -2 10
5702A0j2nMJ0m%ooPNpjQJ%j1jOlLolJ0nnNNMMmJrNkJ1qKnk%MkOJqO%j0K0pnqP
$$ 10 -2 -7 -3 7 3 3 -3 -9 -2 3 -4 -5 3 4 4 -7 -8 -2 -5 -2 -8 -11 -1 -6 -11 -6 -1 3 7 3 4 -5 0 -2 9 1 3 -2 -4 -4 0 -2 4 5 -3 3 3 -7 13 6 1 -7 0
5755@J7k7J6JmLoMlQj1%j4J6JNpj%nJ9j1Nj3RkJKnJ3jkjMq%Oj%mklNPmlJj0LJ7
$$ 0 17 -10 6 7 3 6 0 4 1 9 -2 -2 -16 0 1 6 -1 -2 -2 -7 12 1 6 -7 2 0 1 3 -2 11 10 8 7 11 3 3 9 8 8 4 2 -1 4 11 7 4 5 -5 -2 15
5805A5j9mJMoJ2%rO%nPj1J7mjMqjNmmMmRlMrRlmkPkMqOqJ3lKJorRJLj6NRKjrQ
$$ 15 -4 -8 -7 -3 -9 3 3 -6 0 0 -5 2 -9 8 4 3 7 -1 -2 3 -1 -5 -1 -5 4 1 5 -4 5 2 -2 -4 3 1 5 -3 3 -5 8 5 7 8 2 -7 2 3 6 -10 -5 4 6 5 -4 4
5859DnlOkKLrQ%jjQr%MnPQj4LpqJPJNlqJ1LLj5J5j1NpKnQQolKJJK%j7QJ0JqjN
$$ 4 -1 -4 2 0 2 5 -4 4 4 3 2 10 1 1 5 0 7 15 1 4 -3 -11 -10 -3 -2 3 0 -8 3 6 9 -6 9 -2 3 -4 -2 -7 1 9 3 0 2 3 4 6 6 -11 -3 7 8 0 -1 4
5913DPj0Qo%JJ0j4lMkpqJ1QJj1LKNLjj0kJ4noPoNKpM%%oJ2lj2J1njoJ7Kj5KPK
$$ 4 11 1 9 3 3 4 14 0 -3 1 -1 -8 -16 -5 3 4 -7 -4 -2 3 6 5 -5 -7 7 2 -4 3 -3 2 4 -3 1 1 1 -5 7 4 -8 3 -2 -3 -9 8 10 -5 -3 4 6
5962FJmmKKjj4J0jPRj7mJ1rrJ4pQMk1J2MKjjJpRmKpJ4pjPj1J1j%j9RjLNlNMj3
$$ 6 7 3 -1 1 3 2 -12 -2 -3 4 13 -4 -8 3 -6 -15 -1 -8 0 4 -17 -5 -1 1 0 -1 0 -7 2 -2 0 -7 7 0 -1 6 -5 6 5 5 -14 -5 -6 -3 2 -1 4 8 -5
6011e%j6RR%pMLJoNqLjKRrKJ1mkKNoJj3J8nklQrQjmmQpJ1rnNOojm%%RMnOk0J4
$$ -5 -5 -21 -12 -3 -3 -10 -6 -3 -2 -8 -3 -11 -8 -9 -7 2 -7 -5 6 2 0 2 7 1 2 -11 7 2 0 -3 5 -4 4 3 -1 -5 3 -4 7 -2 -7 -2 4 -2 -3 -7 -7 -7 2 6 1 7 -13 1
6065AloLQLj1RlnOnMJ0j2J7j5OLoJkjJnNNj2kLrkJ7j5J7rkjRj4J0j1J1mnMPLq
$$ 1 -2 -8 -5 3 6 -5 4 1 -4 2 -3 1 11 -1 16 1 7 10 4 5 3 2 3 -2 3 8 -4 -6 -3 -12 -14 3 -12 5 -4 -6 -7 2 -12 -2 -13 -2 -6 -11 -7 0 3 -5
6113ej%KJ0j2J2%Lj1oMOkmLNjnLmQnk%nMJ0j5LmJPlqR%J1j5JNj0LkRoOLj3mOJ0
$$ -5 -6 -6 -4 6 -6 6 6 9 -2 -8 -4 2 0 -4 -1 4 3 -2 1 -3 5 0 -2 -2 -7 -3 7 -8 -5 -9 -8 -1 -4 -12 -3 -3 8 -7 -6 -1 -11 -8 -10 -1 -7 -1 2 -11 -15 -9 1
6164ArlJJOJ5k0PMnNrLOkj7J%J1oRj4J2jLlLqJ7j6PKnlLmJ1pPMqK%mJ1%n%qLL
$$ 1 -8 -11 -10 -9 -3 12 -8 -1 3 -2 3 -6 -3 3 1 -16 -15 -15 -4 -10 -1 -15 -3 -4 -1 -4 -1 -9 8 -8 -1 1 -4 -7 -4 -8 3 -4 3 7 -1 1 1 -3 8 8 3 3 -5 -2 1
6215ApJ2Jo%LmrPlljJ0j6RjKlNRj3PnMmMm%lJ5kQj1j1PQnJ0pjj0JOmnJ6lj1oJ
$$ 1 -6 6 7 1 1 4 0 -9 -2 -5 -8 -9 1 -15 -6 -7 -5 -8 -3 6 -7 0 -5 -1 -5 -1 -5 -5 -8 7 5 13 2 -9 -2 6 1 11 4 3 -7 -6 0 -4 -9 7 4 -7 -13 -12
6265a2J5j2kkJ0rpRpJ3jPj2PJ0pNJ3k0JOnJnOpPoMmMJjoQkKj5RjKpmQOqLkjPj2
$$ -12 3 -9 -11 -13 -3 -12 -19 -10 -17 -4 -5 2 -10 -3 7 0 5 18 -2 -1 5 0 1 -4 2 -5 2 -4 0 -4 0 1 0 -6 2 0 2 -13 -4 -5 -3 -10 -14 -6 0 -8 -5 -7 -8 -1 -13
6316a3OPmLj0PLJpRJkkrjJ1nMoNOj4RLl%Nk3J3nLMMj1RJjp%J4j0jJnJ2j1%QlJ4
$$ -13 -7 0 -4 -1 -11 -4 -1 0 -7 2 3 1 -1 -10 -11 0 -5 -1 -7 -2 4 -10 -1 2 -1 -1 4 -19 -6 -11 -8 -4 0 -11 -2 -1 -2 -9 -9 5 -5 -6 -5 -10 2 -9 -9 -1 -4 10
6366A0j1QMk2J5oOoNNj1Pj2J0jm%Mkj0J3j0J2nqKpMkOKQknJjJJ0k3J4JqQ%%mJ7
$$ 10 -1 7 11 -11 4 -2 4 -2 3 8 -3 4 -8 2 1 -3 -3 1 -1 -11 2 -8 4 -1 -9 -7 -14 -10 -12 -6 -4 4 2 -3 -2 -3 -2 8 -15 -1 0 -8 0 0 0 -4 13
6413A3j2mlMMkKLrO%pOKo%Kj8K0jjjrJ0jlNNJj1j%K%rPJ1jJ4j2kpj0QJJoPMj1
$$ 13 1 -3 -6 -2 2 0 2 5 -4 2 2 -5 1 3 -3 -3 -1 -19 1 0 -1 -2 -11 -1 -2 -5 0 5 6 -5 -6 -6 -4 -4 -13 -6 5 4 18 6 4 -3 -13 -5 -4 -3 -9 -2 2 -9
6463iOLJkOpOJKpnmJ5Kj1lKMKj3MPlPj2%J9rlmJ1ljJlNmnMLqP%jj1OnOKJjJjj7
$$ -9 -3 0 1 -1 5 -2 4 5 7 0 -5 -9 6 8 -3 -6 -4 0 2 -11 -7 0 -3 4 -8 -8 11 2 -1 -5 6 3 2 3 0 5 1 -4 0 3 -5 2 2 1 -10 -4 -9 -3 -1 0 -1 0 -1 -18
6517a8J3JlNQj2KlkJ1qPkKnJ%OmRnJlJmQjqKoNmj%OkkLkPj0mpK0kjrlJ2Poo%N
$$ -18 -5 -4 -7 -2 6 -6 -4 -7 -9 2 -6 1 -1 1 -4 -3 -3 3 -1 8 3 4 1 2 -2 6 5 -3 -1 -7 -2 -6 -7 -7 -1 -3 -5 -2 -4 3 -7 -11 -18 2 0 -1 -10 -13 -1 6 0 -6 -6 -1
6571aKqPlJ5j4oRnJ0pLj0J2rKLmJMnmPMj7MKLmLoJMMMj2LMJ3qKjN%Mj8NJ2Oj8
$$ -1 1 -7 0 -3 12 -2 -8 1 -4 6 -1 2 -8 4 -5 -3 0 -4 -3 1 -4 -8 -1 3 -14 -10 -8 -5 -9 -6 -12 -11 -7 -3 1 -11 -8 -4 9 1 3 2 7 7 11 -7 -2 10 16 -2
6621bLlMJj2J0kknMoO%JMlMJrj4J5jQklOmrmNJ2%LnkQJknmOkOj3MJPlJlPqNj1
$$ -2 1 -2 2 3 -9 1 -1 -3 -8 -4 -10 -4 -4 -3 1 -2 2 3 -6 -20 -5 -6 2 0 -3 3 -1 -10 -14 -9 3 3 6 1 -1 7 8 6 1 -3 3 1 7 -6 -2 -1 6 3 4 1 8 0 5 -6
6675foQN%oJOoN%qOLoj1J0J0j3jKkJJ7j1PJpnrJ6qRqpJ5J8k2OrjKLj0%OkkKLP
$$ -6 -12 -4 1 1 -5 -4 2 -4 1 1 -7 -1 2 -4 -15 -5 5 -8 -9 -7 -9 -8 9 -2 5 6 -1 -6 -15 1 -7 2 -6 -13 2 20 -2 4 -5 -6 -4 -1 -11 -11 -5 -7 -9 -7 -4 3
6725Cllj1NklJ6mK%j0%J8j1jJJj5K7ppPmnKOj1RLj1KJ0Pj0mlKjlPolNqQQrLlJ
$$ 3 0 -3 -14 -9 -11 -14 2 -2 0 0 -10 -10 8 -3 -4 -3 -2 -17 10 3 -4 3 -1 -6 -4 2 -9 0 3 -8 -6 4 11 1 -3 -6 -4 -5 -8 -1 -7 -10 -5 -13 -5 3 -6 -3 -6 -5
6775ek2K8nkNnPlnOLMojj2PJ6j3%KnMMmjNMo%j0OPomLkjMpQj2J8j3MNmNknLNk
$$ -5 -27 1 -4 -6 -1 -6 1 -2 -7 -1 2 6 0 -1 -13 -6 10 -3 -3 -1 -6 -2 2 -2 -3 2 6 0 0 -10 -4 3 -3 -7 -4 -6 -7 -3 -10 -2 -14 4 -9 -5 0 -4 1 -1 -6 -3 2 0
6827@jjPoMrJkjjJ9j3KM%oMkMj4mQJLj3LJ0pJOp%jkOLQ%k0J3mOlkMOKj3LN%j4
$$ 0 -1 -2 5 -1 3 -6 -5 -7 -8 -9 10 -3 -1 3 3 -3 1 -1 3 -11 -15 -7 -6 -3 -16 -13 -3 -10 -9 -3 -10 -10 -11 -13 -7 -4 4 4 -16 -3 -7 -1 -4 -6 -2 4 6 -7 -4 1 1 -13
6879a3OJ1kkkoJ0qO%oqkJ1%lJ0qMnMpJ3q%NmJ2j9kJ0J7j6%J2j7Pj0JNLjOPj8M
$$ -13 -7 4 2 0 -2 -8 2 -6 0 0 -6 -14 -16 -5 -5 -8 2 -6 -2 -7 -3 -10 3 -5 -5 0 -4 8 -11 -13 -3 14 -2 -2 10 -7 0 -10 -9 -4 -1 -2 4 11 -7 -3
6925cQmj1J1njlMKJj0O%kOJJlNjm%ljJ0oLNMKjjnjrMqj%J3k%mJ0LnJnmpLMlpJ1
$$ -3 5 1 -10 1 -4 -5 -8 -4 -2 -1 -11 -5 -5 -7 -1 0 1 -2 3 2 -2 -2 -5 -6 4 -2 1 6 10 12 11 10 5 4 -5 -1 -9 -10 -10 3 1 1 -3 7 10 5 6 1 -3 -10 -7 -3 -6 -13 -2
6980bkOmLPk0K2n%oqOJ3moOJoRNj4nMKKrMLpLkPjOkkmKoqJ5rQnnQ%PjqQnl%Pq
$$ -2 -4 2 -2 1 8 -12 10 5 5 -1 -9 -3 10 6 0 6 7 1 10 15 1 -4 0 2 4 -5 -1 2 -5 -2 -4 3 2 8 6 4 0 2 -4 -12 3 -6 2 -3 -8 0 0 7 6 -2 6 1 -2 -2 5 -3
7036cJKkLJLmJQj6KMLj7J4%Rj1mJ5mqjQoRj4MnPkKLJnOjjJlpJJJ1joKm%QqKLM
$$ -3 -2 0 -2 1 2 5 1 2 10 -6 -4 0 3 -14 0 0 9 -2 -6 9 5 -3 -4 4 -2 7 -7 -3 -8 -1 -3 -1 2 3 -2 4 3 2 3 0 -7 -6 -5 6 5 -1 1 -3 -3 5 -3 -1 2 6
7090FrkJLqkJ3j7J5LjjkooQkRjMNrJ%NMqJ3j4O%KLj0Rj2KOoNK%qLpKjrJ1lL%p
$$ 6 -3 -5 -4 -1 -9 -11 2 -15 0 3 2 1 -1 -7 -13 -5 -7 2 1 5 10 1 2 2 7 11 3 16 2 8 8 10 13 3 12 0 2 8 2 7 9 9 1 4 -3 -1 -2 -11 0 -3 0 0 -7
7143g%KJ0j1%Rqj1J8p%LQ%mkQj5QNqmPj4K3j6J6j2OJl%jMnMj5JOmRnlMK%ojpR
$$ -7 -7 -5 5 -6 -6 3 -5 -16 2 -5 -5 -2 6 6 2 0 8 -7 1 6 -2 -6 1 -13 10 -6 10 -2 4 5 2 2 1 5 0 4 -11 -10 -4 -8 1 -4 -7 -3 -1 -1 -7 -8 -15 -6
7193fjmJ5%oLNp%NrQMjj0J0j2PjJ3j9LJ5k2K1k5J0KpJ1rkRlmMLrJ6oknRqQrMm
$$ -6 -7 -11 4 4 -2 1 6 -1 -1 4 -5 3 7 6 -4 6 -6 1 0 13 -6 -3 12 -10 11 -14 -4 -2 -9 2 -7 -9 0 -3 -7 -3 0 -9 7 1 -1 -6 3 -5 3 -6 -2 -6
7241fQlPkoO%mOj3ORlj1NMlKrRmnJ0rkJmPlj3OJ1lLkMrJJ0j0KJNNjnpLOOj0lL
$$ -6 2 -1 6 4 -2 4 4 0 6 -7 -1 8 5 -6 -1 3 0 2 -7 2 -2 -7 3 -6 -8 -7 -11 -4 -7 -20 -14 -3 -6 -3 -5 -1 -10 -9 1 -9 -7 -6 -1 4 3 -2 -9 -6 0 6 -4 -7 -4
7294dOmlRlo%NOl%rMJ0j6J4j6MOnNLlkKPj3J1kj1J2ojJRrL%Mk%LJj5J0r%J1qP
$$ -4 2 -2 -5 4 1 -5 -5 0 6 3 3 -6 -2 8 -8 6 -10 -6 0 -5 0 3 0 -2 0 7 -6 5 3 -8 4 -2 -3 -2 7 -2 1 1 5 3 3 6 7 -8 2 -7 -7 4 -4 3
7344CrPNmqpRpMNnkJNKLnJJknJ3j2LjJ0NKj0LOj1lPlLnoO%joQJJj1KOlOmkn%k
$$ 3 -6 1 6 2 -6 -13 -4 -11 -7 -2 -7 -9 -8 -3 -1 2 -3 -2 -1 -3 -8 5 -7 -4 -5 5 10 12 2 5 11 0 -3 4 1 4 -1 -7 -1 -1 -2 -8 0 1 2 -9 -7 -1 -4 2 -2 -4 -9 -9 -11
7399a1J2pkPKjlMkLkmOMkmKJ1j7J2pPj0J0ljqLmJ6j6Oj0J1%j1kJ4KJrNmjLJ0l
$$ -11 1 -6 -8 -1 1 0 -3 1 -1 2 0 -4 2 6 4 0 2 13 -4 8 1 8 -2 8 5 4 -4 -1 -5 11 -5 1 -9 2 2 -9 -11 3 5 6 -3 2 -2 -3 0 10 7
7446GMoJ1j8J1%mOj1%NOj0RnJlPj2MjNj2RpjMRnj4NQklMj2PKjnNNrKJ3onJLLN
$$ 7 11 5 16 -2 9 9 5 11 0 0 5 11 1 10 5 6 3 10 -2 2 1 6 -6 3 -4 -5 -1 8 3 -11 -6 2 0 -3 1 -11 -4 -2 -3 -8 -3 2 -7 -5 8 2 -3 -2 1 4 9
7497IoJj1OkNmNJj3LKLnK%mOpKlJ5k0nROJj2joK1lJNnkoJ1MmOj1LJJ0pqJQLNj7
$$ 9 3 4 -7 -1 -3 2 -2 3 4 -9 -6 -4 -1 -6 -4 -4 -8 -2 -9 -7 -10 5 -15 -20 -11 -5 -4 -16 -17 -23 -2 -5 -4 1 -4 -6 -12 -1 3 -1 5 -6 -3 -2 8 1 -7 -6 2 5 10 -7
7549gN%kJ0oj3J5Lnj0JkKON%pjPKqJnJ0lPkjpQPKqlLqRrpR%MpPj5J7j7J2%j2N
$$ -7 -2 -2 -4 6 0 -13 2 5 0 -10 -9 -11 -9 -3 2 2 -5 -6 1 3 -5 -4 -9 1 -2 5 3 2 -5 3 10 12 4 1 4 -4 5 -4 -11 -2 -2 2 -5 2 -13 4 -13 -1 -1 -13 -8
7600hMoJLmKQnKnP%PqKLnO%n%J1j0Lj2K2qNnolM%nKjrJ1MKj2OMnLj7J3%%lpJ0
$$ -8 -4 -10 -9 -6 -10 -8 0 -5 -3 -8 -1 -1 6 -2 0 3 -2 4 4 -1 -1 10 0 3 -9 13 5 10 5 -1 -4 0 0 -5 -3 -4 -13 -2 2 4 -8 -2 2 -3 0 -17 -4 -4 -4 -7 -14 -4
7652dJ0jj5RoJ0qj%NjOj0oPNRj7lJ4ojQj0JJ0mo%J%nPjnmLmR%PqnJ1mpJ0L%J1
$$ -4 6 5 -10 -1 -7 3 -5 -6 -6 -1 -2 4 -6 -12 -5 0 9 -8 -11 3 -3 -4 4 -6 -5 5 1 -5 -5 -4 -4 -9 -2 -3 -8 -12 -9 -13 -4 -4 3 -5 -10 1 -3 -10 0 3 3 14
7702A4j8JOj0MOj0MmnOJ2j3kjRjj3J7j0LNqOJpL%kJ9k0Rj0PjM%K%K%KrjlJ0jM
$$ 14 -4 -3 3 -7 -3 3 -7 -3 -7 -12 -6 6 -7 -9 -10 -1 -2 -15 2 -8 -5 0 -8 -2 -1 -8 -5 -5 -7 12 -8 1 -9 -2 -3 1 1 3 3 5 5 7 -2 -3 -6 4 3 7
7750GJJKj3oJ1lMqQMqplLRqjLpJ3nMj0J0j6ONQJjjp%JQkjOrlRmLJllKJ1rpRMj4
$$ 7 8 9 11 -2 -8 3 0 4 -4 4 8 0 -7 -10 -7 2 -6 -7 -4 -11 2 -3 1 -9 1 -15 -9 -4 4 5 4 3 -4 -4 -3 5 3 2 8 -1 -4 5 1 4 5 2 -1 1 12 3 -4 5 9 -5
7804epOjJKNlKKpLpJkJ3mjmO%kRJrPj2kJ0pJ3j0KjJJ0j4MjoJ2lkj5QjlJ3lpJ1
$$ -5 -12 -6 -7 -6 -4 1 -2 0 2 -5 -2 -9 -8 -10 3 -1 -2 -6 0 0 -2 7 8 -1 6 -6 -8 2 -5 8 -2 0 -1 0 10 -4 0 -1 -7 5 2 0 -15 -7 -8 -11 2 -1 -8 3
7854CoRj5ONjJKp%kkmJ4qMkJLKkMpRrRjoMmklqJ1jKLlqQMOnJj0Qj2MLLRj3Lj1
$$ 3 -3 6 -9 -3 2 1 2 4 -3 -3 -5 -7 -11 3 -5 -1 -3 -2 1 3 1 5 -2 7 -2 7 6 0 4 0 -2 -5 -13 -2 -3 -1 2 -1 -9 -1 3 9 4 5 -5 3 -9 -5 -2 1 10 -3 0 -11
7908a1J3lJRloJ1j0jnKmJ5nj0lJ2NmJrRJj1Pj0LKjKPqnJ4pJ2Lk2QqJ2jJNqkON
$$ -11 2 -1 0 9 6 0 11 1 0 -5 -3 -7 8 3 -7 -10 2 7 3 4 -5 4 5 -6 1 -9 -6 -4 -5 -3 4 -4 -9 5 -2 10 13 -9 -1 -9 3 2 3 8 0 -2 4 9
7956IJj6RJNj5KNQj3lJ6mlJ2qrljJ1j1Km%LRrJ0j0QonRpJ1jpJ2j0Qj1J0Jj9Q%
$$ 9 10 -6 3 4 9 -6 -4 1 9 -4 -7 9 5 2 14 6 -3 -6 -7 4 -7 -5 -9 -9 -6 3 -6 4 -6 2 -4 -9 0 -7 4 3 -4 8 -2 6 -5 5 6 -13 -5 -5
8002eJQjj7NN%Q%mOlrJ2lo%OqML%rORj0knPQoj1QjJ2kmLlLJLqJKJLmq%R%pRnj
$$ -5 -4 4 3 -14 -9 -4 -4 4 4 0 6 3 -6 6 3 -3 -3 3 -5 -1 2 2 -7 -1 8 -2 -4 -9 -2 6 0 -11 -3 -4 8 6 2 5 2 5 6 9 1 2 4 5 8 4 -4 -4 5 5 -2 7 2 1
8058AqKoKJkMnJRJnlLLj1RkJRm%J0j0JkJ0nkLooJ4j9J2Jj5J7jlql%LJJmPqOqJ6
$$ 1 -7 -5 -11 -9 -8 -10 -6 -11 -10 -1 0 -5 -8 -5 -2 -13 -4 -6 -5 4 0 0 10 0 1 -1 9 4 2 5 -1 -7 7 -12 0 1 -14 3 2 -1 -9 -12 -12 -9 -8 -7 -11 -4 -12 -6 -14 2
8110BqJM%KkqMOKjLmj2J2knJQjnJ0o%ooKJ3j2RojlQloJ1pmMlMkMnJ1j5J7lnnP
$$ 2 -6 -5 -1 -1 1 -1 -9 -5 1 3 2 5 1 -11 1 -1 -6 -5 3 2 -3 7 1 1 -5 -11 -9 4 -8 1 -5 -6 -9 -1 -4 -10 1 -6 -10 -6 -9 -5 -7 -3 -8 3 -12 5 2 -3 -8 -1
8162aLj2RnjKJLM%Mjj4QKkmOknLkj2MPQj1qR
$$ -1 2 -10 -1 -6 -7 -5 -4 -1 3 3 7 6 -8 0 2 0 -4 2 0 -5 -2 -4 -16 -12 -5 3 -8 -16 -7
8191g
$$ Imaginary data points
##PAGE= N=2
##DATA TABLE= (X++(I..I)), XYDATA
0@%%%%%%%%%%%%%%%%%%%%%%%%%%%%%%%%KoQqQqJ0j4J8k3K7l0L4l8M4n1N7o1O6
$$ 0 0 0 0 0 0 0 0 0 0 0 0 0 0 0 0 0 0 0 0 0 0 0 0 0 0 0 0 0 0 0 0 0 2 -4 4 -4 4 -4 6 -8 10 -13 14 -16 18 -20 24 -27 30 -31 35
51C5p3Q0q8R4r8J01j02R9r0P2l8k4J32l22O78j396L050q012M3558J46021k48964
$$ 35 -38 42 -46 48 -50 51 -51 48 -42 30 -8 -32 100 -222 456 -940 2110 -5902 37656 183677 -65287
72f5287J8204J04496j58043J29124M9293j66571P3090K629q6239J10453j836q5946
$$ -65287 -47083 57413 -100630 28494 77787 -88784 -15694 -13065 -99304 11149 9313 -76633
84g6633J6937K1687J5223k8675J4262O9696q2136k1358Q8667k6320M3057M339
$$ -76633 -59696 -38009 -22786 -51461 -37199 32497 -49639 -70997 17670 -8650 34407 38746
96C8746j36141R0660Q0110r9424N0970j7245r3849J01692J6203l8431K6848r3493
$$ 38746 -97395 -6735 73375 -26049 24921 7676 -86173 15519 31722 -6709 20139 -73354
108g3354L5755J14719r3814q10M6130o1373O8100q85o5505J11530m2313j01617
$$ -73354 -37599 77120 -16694 -17504 28626 -32747 35353 34468 -31037 80493 38180 -63437
120f3437J14751q938n8613P0509m8224m0665N4633p576K5076j545p7012K3763
$$ -63437 51314 42376 -16237 54272 6048 -34617 20016 12440 37516 35971 -41041 -17278
132a7278O2236J5088l4357n5937N9192L6604n7564N1030J587p5160O8409P446
$$ -17278 44958 60046 25689 -30248 28944 65548 7984 59014 60601 -14559 53850 61296
144F1296m8692O3341m2537l7319Q8555n3723l6936R3251l6696n1290K9242k447
$$ 61296 12604 75945 33408 -3911 84644 30921 -6015 87236 50540 -750 28492 26045
156B6045L6233J396o7883J8196K9162m066J2923l1080j3232J4770j1352L9133
$$ 26045 62278 63674 -4209 13987 43149 39083 52006 20926 7694 22464 11112 50245
168E0245m951p4069L4713M0533l2304M857j1487k388L5568l9782j2151N4599k1266
$$ 50245 45294 -28775 5938 46471 14167 19024 7537 5149 40717 935 -11216 43383 22117
181B2117k5721J1391o641J8740P59k0162J2539k4435o160N6708j3999m4962N296
$$ 22117 -3604 7787 1146 19886 20645 483 13022 -11413 -17573 39135 25136 -19826 -14530
194a4530J3026L1761m625n2829J8407L0205k2808M644N292j3416O877n99O147
$$ -14530 -1504 30257 25632 -27197 -8790 21415 -1393 3251 8543 -4873 2004 1405 7552
207G552Q012j9473J0471J8713k1765l693J6746J1722L28l5556j972M9124o309
$$ 7552 15564 -3909 6562 25275 3510 -183 16563 28285 28613 -6943 -8915 40209 33900
220C3900l3692K101K954J1292Q702j6343o29N2n252K6438N265l1058Q96K4519
$$ 33900 208 2309 5263 16555 25257 8914 8285 8337 3085 29523 34788 3730 4626 29145
234B9145P614j5592j6330J8080J5340k3852j2445J3356O416o921j4983j613J0229
$$ 29145 36759 21167 4837 22917 38257 14405 1960 15316 21732 14811 -172 -1785 8444
247H444l543J859O472j5822m662K3396J2743j2574j9088P979L0618k496k7318
$$ 8444 4901 6760 13232 -2590 -7252 16144 28887 16313 -2775 5204 35822 33326 6008
260F008J585J7041J128r758n980M642J455n929L395Q42j0547L390J4248l573j6092
$$ 6008 7593 24634 25762 16004 10024 14666 16121 10192 13587 14429 3882 7272 21520 17947 1855
275A855P53K1661O460k3718j1340J9961J1651j5597j5392L353P892l171o121j570
$$ 1855 2608 24269 30729 7011 -4329 15632 27283 11686 -3706 -353 7539 4368 -1753 -3323
289c323m766k749R438N499j2568q924J4819J5571j0451j5784R970J9305m253j7772
$$ -3323 -8089 -10838 -1400 4099 -8469 -17393 -2574 12997 2546 -13238 -3268 16037 11784 -5988
303e988K48J4144J217j0811l535K713j75J635M304m727r497O341J7164j193j7232
$$ -5988 -5740 8404 9621 -1190 -4725 -2012 -2187 -552 3752 -975 -10472 -4131 13033 11840 -5392
318e392P20K1513P169j6642q352J3687Q945j0400r947J642J820k530j625k627
$$ -5392 -4672 16841 24010 7368 -984 12703 21648 11248 1301 2943 4763 2233 608 -2019
332b019o833j890R665M634j3271q492J4869J3524j0343j4233P737J6960k196j4258
$$ -2019 -8852 -10742 -1077 3557 -9714 -18206 -3337 10187 -156 -14389 -6652 10308 8112 -6146
346f146J50R031K04l738j690k249j149L767O031m276j1869N848J6848l891j5268
$$ -6146 -5996 3035 3239 -499 -2189 -4438 -5587 -1820 4211 -65 -11934 -6086 10762 6871 -8397
361h397J063J4809O300j2714q338J1968O547p241l457j236o9L265L30j615o203
$$ -8397 -7334 7475 13775 1061 -7277 4691 11238 3997 540 -696 -765 2500 2830 1215 -4988
376d988l800J3361O082j5872n787J1887R282n479j4570M079J5561n401q704K906
$$ -4988 -8788 4573 10655 -5217 -11004 883 10165 4686 -9884 -5805 9756 4355 -4349 -1443
390a443K07K287N50m779O43l175J522J1779q866j2622J2133R635l360j0016o667
$$ -1443 -1236 1051 1601 -3178 -2535 -5710 -4188 7591 -1275 -13897 -1764 7871 4511 -5505 -12172
405a2172J6287P863j6718j415O639K8N196m421n024M714l628N121N335j6469P09
$$ -12172 4115 11978 -4740 -6155 484 512 5708 1287 -3737 977 -2651 2470 7805 -8664 -7955
420g955J4302l892n209n749K995J6024j1477j4372J3879L664j966K40r821P308
$$ -7955 6347 2455 -2754 -8503 -5508 10516 -961 -15333 -1454 2210 244 484 -9337 -2029
434b029P640o809P488o089j2549J9414M932j3295k27m628J0180J0691k3214j212
$$ -2029 5611 -1198 6290 201 -12348 7066 11998 -1297 -1524 -6152 4028 14719 -8495 -9707
448i707J6202j0297j272J174o912J0183k623p442R586n700J789J2765j2019m073
$$ -9707 6495 -3802 -5074 -3900 -10812 -629 -3252 -10694 -1108 -6808 -5019 7746 -4273 -8346
462h346N679K058J3384j4961j8623K4501L499j2417N630j2923L683J8019j6042
$$ -8346 -2667 -609 12775 -2186 -20809 3692 7191 -5226 404 -12519 -8836 9183 -6859
475f859K720R176j7400J4867J1525j9185P367N012m277Q435j2885J040J9612j5742
$$ -6859 -4139 5037 -12363 2504 14029 -5156 2211 7223 2946 11381 -1504 -464 19148 3406
489C406q047P862l509J1824n993j9198J4687J283m128J5034j5788q534J8942j754
$$ 3406 -4641 3221 -288 11536 5543 -13655 1032 2315 -1813 13221 -2567 -11101 7841 6087
503F087L550l251j9162J8067P924j8207O832m300l994J2832j7151K174J8820k1588
$$ 6087 9637 6386 -12776 5291 13215 -4992 1840 -2460 -6454 6378 -10773 -8599 10221 -11367
517a1367L614J3950j9086J5786J1941k1694R411J220n463K5089j2080k3322J7042
$$ -11367 -7753 6197 -12889 2897 14838 -6856 2555 3775 -1688 23401 11321 -12001 5041
530E041O018q74j690j4134O124L957m038Q913j2027n111J4464r827N267P952k0315
$$ 5041 11059 10185 8495 -5639 485 4442 404 9317 -2710 -7821 6643 -3184 2083 10035 -10280
545a0280J5527Q289k7375J8704J1759k2563Q781n156q730K6141j0668j9541J2843
$$ -10280 5247 13536 -13839 4865 16624 -5939 2842 -2314 -11044 15097 4429 -15112 -2269
558b269m793M343J2413j6863l031N484J084J5486r858j4117J5200m58P8O329j4415
$$ -2269 -7062 -2719 9694 -7169 -10200 -4716 -3632 11854 1996 -12121 3079 2621 2699 9028 -5387
573e387O842P978j7092R568P678j2454N956m274m606J4668m801j496K649j5563
$$ -5387 1455 9433 -7659 1909 9587 -2867 3089 -1185 -5791 8877 4076 2580 5229 -10334
587a0334J3423J5591j5889j138l959k203K3531j0823j8660J5657o219l105J6833
$$ -10334 3089 18680 2791 1653 -2306 -4509 19022 8199 -10461 5196 -1023 -4128 12705
600A2705j4547o644J2186o848L825M681j0085O757K321q232N208L282K617k773
$$ 12705 -1842 -8486 3700 -3148 677 5358 -4727 2030 4351 -3881 1327 4609 7226 4453
614D453j2440Q823R317o545K274q817n990J9010k157r650N574j0586L152J7950
$$ 4453 -7987 836 10153 3608 5882 -2935 -8925 10085 7928 -1722 3852 -6734 -3582 14368
628A4368j2033p559O509l302O973M84j0622P961J640p327N191m11J096L567r251
$$ 14368 2335 -5224 1285 -2017 4956 5440 -5182 2779 4419 -2908 2283 1872 2968 6535 -2716
643b716J630N784l585O452l320j2729Q474P101k350j332j0615J843J3577m916
$$ -2716 -1086 4698 1113 7565 4245 -8484 -10 7091 4741 3409 -7206 -5363 8214 3298
657C298n172Q34l229O279K778n660K291j359o89N746n246j540O398m099k422j15
$$ 3298 -1874 -1040 -4269 2010 4788 -872 1419 60 -629 5117 -129 -1669 4729 630 -1792 -1907
673a907j823P931q69j1286K049M646K435K500q609k917Q279J314J176j431p740
$$ -1907 -3730 4201 3332 -7954 -5905 -1259 1176 3676 -4933 -7850 429 1743 2919 1488 -6252
688f252M514O614k908j185k958k8O435l481m105M800O4j760r85j730N289K458
$$ -6252 -1738 4876 1968 783 -2175 -2203 4232 751 -3354 1446 1510 -250 -1235 -2965 2324 4782
704D782m693p87j66K617O353l556o747K13K865N224j780j0146j12O020L26j468
$$ 4782 89 -698 -864 1753 8106 4550 -2197 -1984 881 6105 4325 -5821 -5933 87 413 -1055
720a055l727j634M274R78j090L35p85K581J792l069J009K814R5m48m195r07O746
$$ -1055 -4782 -6416 -2142 -1164 -2254 -1919 -2704 -123 1669 -1400 -391 2423 2518 2070 -2125 -3032 3714
737C714M88n864k421O46M647L119n401l913K939L996K312j739l550J129M237K035
$$ 3714 4202 -1662 -4083 -3437 1210 4329 -1072 -4985 -2046 1950 4262 2523 -1027 102 4339 6374
753F374k572l543J914K445k279k252p23Q01J448l203l234K875K352j012j747k321
$$ 6374 3802 259 2173 4618 2339 87 -636 165 1613 -1590 -4824 -1949 403 -609 -2356 -4677
769d677J491N193K97m493k049K560M055j16m490k596K288L539r88m091m22K592
$$ -4677 -3186 2007 2304 -2189 -4238 -1678 2377 2261 -2229 -4825 -2537 1002 14 -4077 -4499 -1907
785a907J319l52j793m71L303J588k459r69J890K267M68k839k141K730K939j979
$$ -1907 -588 -940 -2733 -3204 99 1687 -772 -1741 149 2416 2884 45 -2096 634 3573 1594
801A594m069r36K606K165j491l676r57L442K438k121k536L88K710K088j877k730
$$ 1594 -2475 -3411 -805 1360 -131 -3807 -4764 -1322 1116 -1005 -3541 -3153 -443 1645 -232 -2962
817b962J580K838l11k285j551J232K415q84l245p28K602K169j626k865M16L122
$$ -2962 -1382 1456 1145 -1140 -2691 -1459 956 72 -3173 -3901 -1299 870 -756 -3621 -3205 -83
833h3J921j788k981J050L575O63k120j999P41L216L93l027j291J568K282ml144
$$ -83 1838 50 -2931 -1881 1694 2357 237 -1762 -1021 2195 2588 -439 -1730 -162 2120 2116 -1028
850a028j064K750J734j298k843l34L389Q81k601j348L08K261J711k900k143J920
$$ -1028 -2092 658 2392 1094 -1749 -2083 1306 2187 -414 -1762 -1454 807 2518 -382 -2525 -605
866f05J943P29k171k779K647L024j554k144r05J998K645k356k686Q27J298J372
$$ -605 1338 2067 -104 -2883 -236 2788 1234 -910 -1815 183 2828 472 -2214 -1387 -89 1283
882A283j514l160J434K122N6n07l008N84M725j118l068J2N38K946k18m746Q78
$$ 1283 -231 -3391 -1957 165 221 -286 -3294 -2710 2015 897 -2171 -2159 -1621 1325 1107 -3639 -2761
899b761K523m67L70k248j284L835N92j511n02j022L366K293l898p09J876J257
$$ -2761 -238 -705 -335 -2583 -3867 -32 560 -951 -1453 -2475 891 3184 -714 -1423 453 1710
915A710J453l661j950M165q7j571n13k587K555K446l444k42n4L7M496k087m058
$$ 1710 3163 -498 -2448 1717 1630 59 -454 -3041 -486 1960 -1484 -1726 -1780 -1743 2753 666 -3392
932c392L394J367L79j72m383K397L802l924p91J36j247L267j372l413K111j54
$$ -3392 2 1369 1748 1576 -2807 -410 3392 -532 -1323 -1187 -2434 833 -539 -3952 -1841 -1995
948a995J265J820m625P74M779o27k13k057n43N906j157l936J854j119J365K349
$$ -1995 -730 1090 -3535 -2761 2018 1391 1178 -879 -1422 4484 3327 -609 1245 126 1491 3840
964C840n269P7K651k393K592j013m646N050J547l672J314j223J440L850n163j595
$$ 3840 -1429 -1352 1299 -1094 1498 485 -4161 889 2436 -1236 78 -1145 295 4145 -1018 -2613
980b613L998p90L39j828l298L545M80j579O89l914J301N177l043r55K81j169N801
$$ -2613 1385 595 934 -894 -4192 -647 -167 -1746 -1057 -4971 -3670 1507 -1536 -2491 -2210 -3379 2422
997B422r00n780M703J086k395K605l118j47M366m058n75K176l115L137J372n283
$$ 2422 1522 -4258 445 1531 -864 1741 -1377 -1524 2842 -1216 -1791 385 -2730 407 1779 -3504
1013c504J483K041R26J870n318n17O488j243j525l16k555L713J078l712J275j674
$$ -3504 -2021 20 946 2816 -2502 -3019 3469 2226 701 385 -2170 1543 2621 -1091 184 -1490
1029a490p82M147k996j999K556j341J857l44m027N172J579n000J919m9M76M238
$$ -1490 -2272 1875 -1121 -3120 -564 -1905 -48 -392 -4419 753 2332 -2668 -749 -798 -322 3916
1045C916n196k231N115j832Q00J665n789J256M172j284K02k798j221N433q03l019
$$ 3916 -1280 -3511 1604 -228 572 2237 -3552 -2296 1876 592 794 -2004 -3225 2208 1405 -1614
1061a614R95k28J905n18l011L397Lk808K727j965j304M501k168j813J119k400
$$ -1614 -619 -847 1058 540 -2471 926 929 -1879 848 -1117 -2421 2080 -88 -1901 -782 -3182
1077c182M083K585o935pL790OJ275l058k201M184n83p82J398l327Q82K779k159
$$ -3182 901 3486 -3449 -3456 334 340 1615 -1443 -3644 540 -43 -825 573 -2754 -1872 907 -1252
1094a252P32l88j311L760j881l353M129O34k045n58j860L061K473m015n78P78
$$ -1252 -520 -908 -2219 1541 -340 -3693 436 1070 -975 -1533 -3393 -332 2141 -1874 -2452 -1674
1110a674J11L142j146k563Q55l93K954J673n564K59L795j240K34j162j379L795
$$ -1674 -1563 1579 433 -2130 -1275 -1668 1286 2959 -2605 -2346 1449 209 443 -719 -2098 1697
1126A697j462l037L433j8j350J331j808L44K277o60O42j562k208M464J848l510
$$ 1697 235 -2802 631 613 -737 594 -1214 -870 1407 747 1389 -173 -2381 2083 3931 421
1142D21j549k31K651J894m275j246K086q81Q22K64k047P86M81K23J120j949M85
$$ 421 -1128 -1359 1292 3186 -1089 -2335 -249 -1130 -308 -44 -2091 -1305 -824 -601 519 -1430 -945
1159i45K800j918j259J154Q47J751k684l273L933J672k430j36j472J64L125p35
$$ -945 1855 -63 -1322 -168 679 2430 -254 -3527 406 2078 -352 -488 -1960 -1796 1329 594
1175E94j039j23j494K720K474l078j245J635J264J29k315P2K471j596j787P11
$$ 594 -445 -568 -2062 658 3132 54 -1191 444 1708 1837 -478 -406 2065 469 -1318 -607
1191f07K33O99p93j835R14M31L47J761k067k262K609K434k31k568j881L143J975
$$ -607 -374 325 -468 -2303 -1389 -958 -611 1150 -917 -3179 -570 1864 1633 -935 -2816 327 2302
1208B302k512q62J07K5J104q22n09Q60j097O14J654j810J79K609n71j458r0J536
$$ 2302 -210 -1072 -965 -940 164 -658 -1167 -307 -1404 -790 864 -946 -767 1842 1271 -187 -277 1259
1226A259K273j656l174J227K454O8j794j626N93Q71K26N15j692j671K179J685
$$ 1259 3532 1876 -1298 -71 2383 2451 657 -969 -376 495 721 1236 -456 -2127 52 1737
1242A737r12j249n18J945J267k512m37K423k42j665l64P79J019o37j214nl3P80
$$ 1737 825 -424 -942 1003 2270 -242 -679 1744 1502 -163 -527 252 1271 634 -580 -585 -618 162
1260A62J268r73j814J21K353J875k358k654K250K348j072j303l23O60P44o20l22
$$ 162 1430 457 -1357 -1236 1117 2992 634 -2020 230 2578 1506 203 -120 540 1284 664 342
1277C42K35n75K64P59q24q13R17J255r01k063R98K605o62k361l33J694J413j157
$$ 342 577 2 266 1025 201 -612 305 1560 659 -1404 -406 2199 1537 -824 -1157 537 1950 793
1295G93j780N63P31KN98o33j572N53J837J46j857q86J912J260j599j320J147J550
$$ 793 -987 -424 307 309 907 274 -1298 -745 1092 1238 -619 -1505 407 1667 68 -1252 -105 1445
1313A445p15j733N66J367m08l87j1o55L52J131K6j177j157J080K180r65k584M41
$$ 1445 730 -1003 -437 930 522 135 124 -531 -179 952 978 -199 -1356 -276 1904 939 -1645 -1204
1331a204K273K69j830o43J395N36n97o6p5M1N80K47j58q14j76J927L05k567l59
$$ -1204 1069 1338 -492 -1135 260 796 199 133 58 99 679 926 768 -46 -222 1705 2010 -557 -916
1350i16K139O32j569j611Q56J760o49j288J93M42L84K92j51m89m77J104J280j643
$$ -916 1223 1855 286 -1325 -469 1291 642 -646 -453 -11 373 665 514 25 -452 652 1932 289
1368B89j485J478J242p36j815l32K181K22k201lJ062J48K21l46k96L05K81J067
$$ 289 -1196 282 1524 788 -1027 -1359 822 1044 -1157 -1160 -98 50 271 -75 -371 -66 215 1282
1386A282q9j972N09K130j81j688r55J419J547j848j495J281N06k82l28n30N61
$$ 1282 1193 -779 -270 1860 1679 -9 -964 455 2002 154 -1341 -60 446 164 -164 -694 -133
1403a33L31N3O70j118p94J961N66j555j076L91J980m43k839N75J680o29n16n19
$$ -133 198 251 921 -197 -991 970 1536 -19 -1095 -704 1276 833 -2006 -1431 249 -380 -896 -1415
1421a415j5J080k67qM56j149P77J898j104j279M65J295P97k048j178K225M68j338
$$ -1415 -1430 -350 -617 -625 -169 -1318 -541 1357 253 -1026 -561 734 1531 -517 -1695 530 998 -340
1439c40n15j81J035K38j136N65j23o32J886O9j789M05Q76R26m10k457J019K317
$$ -340 -855 -1036 -1 237 -899 -334 -457 -1089 797 866 -923 -518 358 1284 874 -1583 -564 1753
1457A753j603j272L64L47P13r66q03J004m26J08J181j230n46J307P08J53j689
$$ 1753 150 -1122 -758 -411 302 -664 -1467 -463 -889 -781 400 -830 -1376 -69 639 792 -897
1474h97n89K805m4k391K53O60O25L6j666N60R97r84Q20J89j633R64J049l74l28
$$ -897 -1486 1319 1275 -1116 -863 -203 422 458 -1208 -648 349 -635 185 374 -1259 -295 754 380 52
1493E2j132J098J931k082j291J516N31n3j203q07J768mj071O52p47k69J402k14
$$ 52 -1080 18 1949 -133 -1424 92 623 570 -633 -1440 328 324 -747 -95 -842 -1111 291 77
1511G7m89o57k24K390j95k689R14J343k28l67j378P91J597j708j83J143j071N79
$$ 77 -412 -1069 -1293 1097 902 -1787 -873 470 242 -125 -1503 -712 885 -823 -1006 137 -934 -355
1529c55Q04j223m7P8N10J150k014j142K482N42j255q50LJ840k6j614O86J02l07
$$ -355 449 -774 -821 -743 -233 917 -1097 -2239 243 785 -470 -1320 -1317 523 497 -1117 -431 -329 -636
1548f36J164o11p18M12l28J105n1k289J264J717j444n29N4P32J352j796r71J901
$$ -636 528 -83 -801 -389 -717 388 337 -1952 -688 1029 -415 -944 -890 -158 1194 -602 -1573 328
1566C28o9l27K97r84L98O83r2N35j480q58K465N5j880j39L72J198j48j989J047
$$ 328 259 -68 229 -755 -357 326 234 769 -711 -1569 896 951 -929 -1068 -696 502 354 -1635 -588
1585e88J276j236J96K59m22Q08j18k07J76j010J037J366j966r14J109Q09L07j738
$$ -588 688 -548 -352 -93 -515 293 175 -32 144 -866 171 1537 -429 -1343 -234 575 882 -856
1603h56p80K259M1j062N00m63K50R61o57J55n5p13J461K0j883O19R13k41o61j301
$$ -856 -1636 623 664 -398 102 -361 -111 850 193 348 293 -420 1041 1061 -822 -203 710 469 -192 -1493
1623a493J105J572j708q52Q77K40O78l28q69O44p7L63J132j541j033J626N19o10
$$ -1493 -388 1184 -524 -1376 -499 -259 419 91 -778 -134 -211 152 1284 -257 -1290 336 855 245
1641B45j015l43J651j62j691P11P45k56J9n43M65Q39n55M11J3j251J173J239j150
$$ 245 -770 -1113 538 376 -1315 -604 141 -115 -96 -639 -174 665 110 521 534 -717 456 1695 545
1660E45q94k89J028J351j804j399J480L88l74m4n74L47L89k32N00l63n46J041
$$ 545 -349 -638 390 1741 -63 -1462 18 406 32 -12 -586 -239 150 -82 418 55 -491 550
1678E50J16q04j25M01Q74p08j677J083J400q46q05l38N40J181n95o06L68m70O79
$$ 550 666 -138 -263 138 1012 304 -1373 -290 1110 264 -541 -879 -339 842 247 -359 9 -461 218
1697B18J236j032r50N38Q65M56j185p78J404K17j114l2L90L57k57q50M48N37l36
$$ 218 1454 422 -528 10 875 1331 146 -632 772 989 -125 -157 233 590 333 -517 -69 468 132
1716A32L61j71q71O01R99L1q92j067J012J489r64j315K34O98M22o07m70M81j01
$$ 132 493 322 -549 52 1051 1082 190 -877 135 1624 660 -655 -421 277 699 92 -378 103 2
1735BmN72m58l82O00J75k04m51M5J166k01j550K54J266J73q48q47N00R33j97l26
$$ 2 -2 570 112 -270 330 505 301 -150 -105 1061 860 -690 -436 830 1003 155 -692 -192 741 544 218
1756B18k33l96N05P19k49p96m51R24R04j019p96Q35N23m07n70N9Q08n5p79J59
$$ 218 -15 -411 94 813 564 -232 -683 241 1145 126 -670 165 688 281 -289 -230 578 523 -256 -97
1776i7L64N2K30j95n46j00N67O69o88j270N06J283n5j010n00Q07P79n83m30L12
$$ -97 267 319 549 354 -192 -292 275 944 256 -1014 -508 775 720 -290 -790 17 796 213 -217 95
1796I5k1J26K46l15k65J02L60N3q12k46J024K39r53m66P49R54l88r76K39O91J22
$$ 95 74 200 446 131 -134 -32 328 381 -431 -677 347 586 -367 -833 -84 870 482 -494 -255 436 558
1817E58j08l36k31K49M22K15n65p61O07Q23n69q62J51Q43J42q51j72P95K28l38
$$ 558 450 114 -117 132 554 769 204 -557 50 873 304 -558 -407 436 578 -273 -445 350 578 240
1837B40k46j4L19J90r9k00m94J54Q92k55j063j59P64N12o84q31O01P93k80l41
$$ 240 -6 -20 299 489 390 190 -304 -150 742 487 -576 -735 29 541 -143 -974 -373 420 140 -201
1857b01K6K45K88n7j02j57j36N49K18q09l53N68N36l40j040R8J097n4p26r1K98
$$ -201 -175 70 358 301 199 42 -94 455 673 -136 -489 79 615 275 -765 -667 430 376 -350 -441 -143
1878a43M79M8m00j8qJ52M69l97p14L27N82p5p52m44Q35M17q45l96M00M60J40m75
$$ -143 336 384 -16 -34 -42 110 579 182 -532 -205 377 302 -450 -894 -59 358 -487 -883 -483 -23 117 -358
1900c58j23M46J10J97ko88M7P23M8n39o01L54R49m53q82L03N15J56k70m24L74
$$ -358 -481 -35 75 272 270 -418 -371 352 400 -139 -740 -386 563 110 -772 -469 46 202 -68 -492 -118
1921a18L71j46R4k44k59N91K27m77m28K9P85J47j070j69P82K05k81n54%O75m6
$$ -118 253 107 201 -43 -302 289 516 39 -389 -360 425 572 -498 -667 115 320 39 -515 -515 160 114
1942A14k79O6k39K72N40l54l84J0L51N16o40p30P42N11l85l96k18N75L95o09j49
$$ 114 -165 -99 -338 -66 474 120 -264 -254 97 613 -27 -757 -15 496 111 -285 -503 72 467 -142 -291
1963b91J70l3M40m5n88R0L05L43p6q74J70R30j95n85j78K76O07l59o05L51J18
$$ -291 -121 -154 286 241 -347 -257 48 391 315 -559 -389 541 346 -239 -417 -141 466 107 -498 -147 -29
1984b9L0J92m89j28M89Q4O0m48m24R22L39q59k24K85M22J82p66j20O43p7l1q5
$$ -29 1 193 -296 -424 65 149 209 -239 -663 259 598 -261 -485 -200 222 404 -362 -482 161 84 53 -32
2006c2m22L36L42k24j47l73K84P24n34n84L71L52K34m18n57O69L85m05l0k25O9
$$ -32 -454 -118 224 0 -147 -520 -236 488 -46 -630 -259 93 327 -91 -648 21 406 1 -29 -254 -185
2027a85N70k69l13lj48O26J36r80J13O52N7n9n59O6Q97k42m88K23n4K33K03n35
$$ -185 385 116 -197 -200 -348 278 414 -566 -453 199 256 197 -362 -296 601 359 -129 94 40 273 476 -59
2049e9q8J64J06K74n88m54P02K70k98l58j92P67L38p42LK45L8L93l54m81M42L7
$$ -59 -147 17 123 397 -191 -645 57 327 29 -329 -521 246 584 -158 -155 90 128 521 167 -314 128 165
2071A65J7M5o79K03P13l79l55kJ82N98l37o02N13L12pn2m75J82M86k17q1k63k66
$$ 165 182 227 -452 -249 464 85 -270 -272 -90 508 171 -431 82 394 387 335 -140 42 528 311 230 -33 -299
2094b99O96J01o87j14J37M05J12p75L0O69j06q1j35j43N38K6l93Q2k03J92M99
$$ -299 397 498 -189 -303 -166 239 351 -424 -394 275 169 88 -47 -190 348 374 -19 63 -140 52 551
2115E51o68m40N11J99O0l56n15O12M79m37j48k0K05M36k35k69Q5M3L27j15n61
$$ 551 -117 -557 -46 153 213 -143 -658 -46 433 -4 -152 -172 33 469 234 -35 50 93 420 305 -256
2136b56K16K90n9r9m92K09O95m20m71K16J21L78k0o20J96M07K0Q6m16l19N21K05
$$ -256 -40 250 191 92 -400 -191 504 84 -387 -171 -50 328 308 -312 -116 291 311 397 -19 -338 183 388
2158C88k89l33j48N26J89n62l2K83P4J10l13j02M81J5j71n1k35L36L83m50l68
$$ 388 99 -234 -382 144 333 -229 -261 22 96 206 -107 -209 272 287 116 65 -170 166 549 99 -269
2179b69P6L60L58m75m85L71L38Q6k44m31K46M04j80q2j43o2M61k5m17Q2J54J10
$$ -269 -193 167 525 50 -435 -64 274 360 116 -315 -69 335 155 73 -70 -132 329 304 -113 -31 123 233
2201B33o7m30J19M92r0l28j73J86M56r6m43p7J27L52J34n29k02L08K65Q2l95l28
$$ 233 166 -264 -145 347 257 -71 -244 -58 398 302 -141 -218 -91 261 395 -134 -336 -28 237 319 -76 -404
2223d04M70K61k89j38nJ98J52k75j37J67Q4K4k31k22L09K60j16k92j97L97M35
$$ -404 66 327 38 -100 -105 93 245 -30 -167 0 84 108 -123 -345 -36 224 108 -184 -381 16 451
2244D51l33m06O8K89K98j90m34J11K80Q3r9k99k3K93M7j95j69P8L41n6l57M8K77
$$ 451 118 -288 -220 69 367 177 -257 -146 134 217 118 -181 -204 89 136 -59 -228 -150 191 135 -222 -174 103
2267A03J49j35l70Q0M23K8k32k25l7L38J72l38k71L7L28J65l49k36K67K64J3k28
$$ 103 252 117 -253 -173 250 278 46 -179 -216 122 294 -44 -315 -278 50 215 -134 -370 -103 161 174 -54
2289e4j13K89J57j76j24k9J79J81k48k84J16K29Q5k59l23K15M00k9k87j71K45
$$ -54 -167 122 279 103 -21 -50 129 310 62 -222 -106 123 208 -51 -374 -159 241 212 -75 -246 -1
2310aL47q7k74p3J40K30q2l10l9J79J12j08l22J6L66rk78r5J53L05K1l47m9K48
$$ -1 346 259 -15 -88 52 282 200 -110 -149 30 142 34 -288 -272 94 85 -193 -288 -135 170 191 -156 -205 43
2334D3K17k6l17j24K48K04j09l14j25L07J81k41k13O1K45J34k39j41K20J58Jj62
$$ 43 260 234 -83 -207 41 245 136 -178 -303 4 185 -56 -269 -208 37 171 -68 -209 11 169 170 8
2356Hj64J99K39j47k33j02J98K69k09l57N8K62J41j86k81J10K95K0j30j62P1K76
$$ 8 -156 43 282 135 -98 -200 -2 267 58 -299 -241 21 162 -24 -305 -195 100 120 -10 -172 -101 175
2378A75J7k23r1J11K19o0l19k6K65Q8j35k77N3L37K8j99j29K5K88J24k77j40J32
$$ 175 192 -31 -122 -11 208 148 -171 -197 68 156 21 -256 -203 134 162 -37 -166 -141 147 271 -6 -146 -14
2401a4J90R0k63k19K46J86j32j93p2K18J47j96j54P3J58J22j72j99J46J83N6j82
$$ -14 176 266 3 -216 30 216 84 -109 -181 37 184 -12 -166 -93 65 187 15 -184 -38 145 201 19
2423A9k46J78L10j24k34r1J49K63j26k76O9J34J12l1k54RK42K6j03j83qL17K8
$$ 19 -227 -49 261 137 -97 -188 -39 224 98 -178 -109 25 137 106 -148 -139 103 129 26 -157 -165 152 180
2446A80k91o6J40K03pl02k0K48O5m8j84j00K44J28j53j57o8K30J93k69j84J61
$$ 180 -111 -177 -37 166 159 -143 -163 85 150 102 -82 -182 62 190 37 -120 -188 42 235 -34 -218 -57
2468e7J59Q1k00j80K55J49j35q2r3J19K05j45j84LQ8J94j16l24J06K53J3j17k13
$$ -57 102 183 -17 -197 58 207 72 -10 -103 16 221 76 -108 -105 -17 177 61 -263 -157 96 109 -8 -221
2491b21J22L15r4j75j1L7J94Lk60j1J18Q1L6k77p4K81O1j53j46QL04M9k64j0J19
$$ -221 -99 216 122 -53 -64 -27 167 170 -90 -101 17 98 134 -143 -217 64 125 -28 -174 -166 138 187 -77 -87 32
2516C2R6Q3k09j47K02Q0j1j21k03J96K18j97j75jJ40J94k17j94K04J29K0o1j91
$$ 32 128 211 2 -145 57 137 126 5 -198 -2 216 19 -156 -157 -17 177 -40 -234 -30 99 119 58 -133
2539a33J41J82p9q3j36K8K75j05k77K2J30J34m9k93Q8K66j7p0j00PK58k1j70j4
$$ -133 8 190 111 28 -108 -80 195 90 -187 -165 -35 99 50 -243 -155 111 94 24 -76 -69 189 168 -2 -16
2563a6l3J63Q5k72r8J85R5j1k22j03L01O9j88n6jJ70J27j91p0P2P6J38j71k33
$$ -16 -49 114 199 -73 -171 14 109 98 -124 -227 74 143 -45 -101 -102 68 195 4 -66 6 82 220 49 -184
2587a84J50J61n2j45j78J80K22j81j55Q5R4J24o6j94J12J22J5j6k11OK49rj70
$$ -184 -34 127 75 -70 -248 -68 154 -27 -182 -97 -3 121 55 -139 -27 95 110 94 -117 -111 138 129 -41
2610d1j24M9K73n2k75L6J39R3j5k08lK02%k2r0q0J87J02j88j03L1J57Q8k68j16
$$ -41 -165 -116 157 105 -170 -134 5 98 83 -125 -128 74 74 52 -38 -118 69 171 -17 -120 -89 68 156 -112 -228
2635b28K32R6n3j54p1J91J22j35o5n1Q1J94q8k00K5J47J06j41k09J45J75o4j25
$$ -228 4 100 47 -107 -178 13 135 0 -65 -116 -35 159 71 -129 -104 43 149 8 -201 -56 119 55 -70
2658g0p3J36J39j11j17L5M4J18l1k19J7J75Q0o3k10rK98K0k07r3Q5J61Oj75k9
$$ -70 -143 -7 132 21 -96 -61 -17 101 70 -149 -132 43 123 60 -150 -159 139 159 -48 -141 -56 105 111 -64 -93
2683i3P1P7K4j40p1J29O6l3j18p0K09J21j98j30J15J56L0j93r3J48Q9j5j11j32
$$ -93 -22 55 79 -61 -132 -3 63 30 -88 -158 51 172 -26 -156 -41 115 145 -48 -141 7 96 81 -30 -162
2707a62Q1J58j5j32j22J03K13p4k02N4J33O6p8j36R8J43o7q8n2L8J34k2j55o8
$$ -162 -81 77 62 -70 -192 -89 124 50 -152 -98 35 101 23 -113 -15 128 61 -27 -79 -41 93 71 -84 -152
2731a52Q7J73j1k48m3K12J19q1j74jK25L5j21o3J0R3N3j10j00K2J02L0j37j01
$$ -152 -65 108 97 -151 -194 18 137 56 -118 -119 106 141 20 -43 -33 60 113 3 -97 -75 27 57 -80 -181
2755a81J34J40p8j48l2K18J09j67r3P4R9O3r5j41K9J13O3j05j54L5J90mj45p7
$$ -181 -47 93 15 -133 -165 53 162 -5 -98 -24 75 138 43 -98 -69 44 107 2 -152 -117 73 69 -76 -153
2779a53J22J47o1j49N9J14L6m9j26L6J17K2p6j26k1J77N9j81j25R6J68j1j74l3
$$ -153 -31 116 55 -94 -35 79 115 66 -60 -24 93 115 39 -87 -108 69 128 -53 -178 -82 86 75 -99 -132
2803a32J43R8n1j06oJ12M5n6p5m8R6J01j16j52P6J41J7j47j17J47J51p1j23j4
$$ -132 11 109 58 -48 -54 58 103 47 -28 -76 20 121 5 -147 -71 70 87 -60 -177 -30 121 50 -73 -87
2827h7R8J19n3j03l0O8J14l1j76nJ28O7j06j23M4J67k5j54rR1J03l8j09j6R4P7
$$ -87 11 130 77 -26 -56 12 126 95 -81 -86 42 109 3 -120 -76 91 66 -88 -97 -6 97 59 -50 -66 28 105
2853A05k2j27p2J34J04p2j57k4J82P5j63p3Q0R1J4r8o8R8N9k9n5n5O4J19n6j26
$$ 105 83 -44 -116 18 122 50 -107 -131 51 126 -37 -110 -30 61 75 -23 -91 7 66 37 -18 -73 -9 110 54 -72
2879g2l0J45J02j20j68Q1J50J5j11r1P4J04j1p5o7J8J19K7j14o6O5J33l5j49%
$$ -72 -102 43 145 25 -143 -62 88 103 -8 -99 -25 79 68 -7 -74 -56 63 90 -24 -90 -25 108 73 -76 -76
2904g6J46K8q9p3K0J35j0j04l1K9P7M6j23q6P4J22J8j40r2J46J12q2r8jJ09N6
$$ -76 70 98 9 -64 -44 91 81 -23 -54 -25 52 98 -25 -111 -37 85 103 -37 -129 17 129 47 -51 -52 57 113
2930A13r9o8L4M5K3n6q5M1R2J9p5j03R9J47n7j38QR4R1p2j39M6Q6Qj5j05j4J16
$$ 113 14 -54 -20 25 48 -8 -93 -52 40 59 -16 -119 -20 127 70 -68 -60 34 125 53 -86 -40 46 54 39 -66 -80 36
2958C6L1p4q2J7J35K6j45m2R7Q9k5j27jJ27J7o2o9l0J03L9q6p0OQ2R9j13j17J01
$$ 36 67 -7 -89 -72 63 89 -56 -98 -1 88 63 -64 -65 62 79 17 -52 -82 21 60 -26 -96 -90 -8 91 -22 -139 -38
2986c8J22j4r4o0J08Q6q1o1oL9P7n3r8jP7N3m4j32M8J32Oq3p3O5J45o9q6J1L0
$$ -38 84 70 -24 -84 24 110 29 -32 -38 1 78 25 -73 -74 3 56 12 -120 -72 60 66 -17 -90 -25 120 51 -35 -24 6
3015FP6oj30j7P2L2qj08m9J42N1r5n8L1J19L6j35k2Q0O0j1q0m8P5M5k7n8q2J03
$$ 6 82 76 -54 -71 1 33 25 -83 -132 10 61 -34 -92 -61 58 94 -41 -63 17 77 66 -14 -62 13 58 31 -27 -109 -6
3044fR5p7r8J0R5P7j03q4R2P9j6o0p0O2Q3l7o1l9K7R4k8j27QQ7N1l8j20K8J29
$$ -6 89 12 -86 -76 19 96 -7 -91 1 80 64 4 -66 -4 79 42 -19 -58 -31 63 35 -92 -84 3 54 16 -104 -76 53
3073E3Ko3n4L0R1Or1j6J3P4K1j16l7Q1N7oj30j2J35L6q8n8J6Q6M5r3n1N5M4M8
$$ 53 55 -8 -62 -32 59 65 -26 -42 -29 45 66 -50 -87 -6 51 45 -85 -97 38 74 -14 -72 -56 30 75 -18 -69 -14 30 78
3103G8o8r5O5R4k6q4m7P8R2p2r8M1O3M1n7q9N3O1K6m6p3J7J01J3q7m8L8J19k7
$$ 78 10 -85 -20 74 48 -36 -83 -5 87 15 -83 -42 21 62 5 -84 -31 30 56 10 -63 -46 55 68 -19 -67 -29 90 63
3132F3j18KO8N3l1j16J9Q8J0k9m9l9J10M1q4m7K4Q7K5r8o7R5P5l3q5k7P8M1m9
$$ 63 -55 -53 15 68 37 -79 -60 28 38 9 -40 -79 31 72 -12 -59 -35 52 77 -21 -88 7 82 49 -36 -63 15 56 7
3161Gn2k4O8P6p0n9J2O2P1q6r1P4R5k6o9k9N5P4l8q4j4M8M5l6p3rQ6L7l3q3J6
$$ 7 -45 -69 -1 75 5 -54 -42 20 91 5 -86 -12 83 57 -12 -41 14 88 50 -34 -48 0 45 9 -64 -73 13 50 17 -66 -50
3192e0J30Qq8m1K7R4Kj13j4M0M6np4l6O3O3k0o9k2R5N9q0o6L1P7M6j06n3Q7L7
$$ -50 80 88 0 -41 -14 80 82 -31 -45 -5 41 36 -38 -74 -11 52 32 -37 -59 36 95 15 -51 -20 57 103 -3 -56 31 68
3222F8j8n0o6M7P8k0q7l8O6R5m2r3J6Q7L8n5q5M4P0Jo0m2K4P3j2o6k9L1P7Kj07
$$ 68 50 0 -66 -19 59 39 -48 -86 -20 75 33 -60 -44 43 81 26 -59 -15 55 56 -4 -46 -22 51 39 -27 -56 -25 52 54 -53
3253e3k1J02N9n7q2J4J05K0p1o6K6O8L4p2n8L8M9J5o7o4O3Q9m3p4mP8O0o2o6J1
$$ -53 -74 28 87 30 -52 -38 67 87 16 -50 -24 44 78 6 -52 -14 35 50 -17 -81 -18 71 28 -46 -50 28 88 26 -40 -29
3283b9O9L7o1o8K2P3J6n0o8K0J03rq5k3M9P6j8q4lQ0L3m8n9qQ1K0n0o2PQ4L7r7
$$ -29 40 77 16 -52 -30 43 59 9 -59 -39 64 55 -30 -53 -4 72 54 -30 -33 47 80 32 -27 -35 46 66 16 -46 -39 45 82 -15
3315a5n2M0P9Oq5l5Q7L8k8m5k7M0N7l8n2oN2M7m4o7J8P8K8p9p2P6O2j6o1l3M0
$$ -15 -67 -27 52 58 -27 -62 25 63 35 -10 -37 3 60 22 -30 -36 16 63 19 -48 -30 48 76 -3 -75 1 63 47 -14 -47 -7
3346gP0j0p7l0O0N1j0q7j6P9M0m1o4NP5K2p7l0L9M4lo7j7N1N6j0p6k9P0O9m8p0
$$ -7 63 53 -24 -54 6 57 47 -40 -56 23 63 22 -42 -37 38 60 -17 -47 -8 36 33 -34 -51 0 56 46 -30 -59 11 80 32 -38
3378c8rQ9L8p2o1K4N2L6m7o8L8N2J1m8m6L3O9j1p3j7O1N3l3p5PO9K4m9n6JP8J2
$$ -38 -47 42 80 8 -53 -29 23 59 12 -56 -18 34 45 -3 -49 -16 53 42 -31 -48 13 66 33 -42 -35 34 58 9 -47 -46 32 44
3410D4n4m8K3O8J9p0m7N8O3jq1j0P2K3l8l7j1N3L3p2l5J6N1L5o1o2M4O1Mn8l1
$$ 44 -10 -58 -35 33 52 -18 -65 -7 56 55 -26 -36 36 59 21 -16 -27 26 59 -13 -48 -32 19 54 -7 -69 -25 36 40 -18 -49
3441d9M5P5k9o6j7L8N3l3o0J0L6J8j6o7J6O4J8n6m4M4P6j2o2%L1L8Jp3j4N0J7
$$ -49 -4 71 42 -24 -41 -3 50 17 -43 -33 3 21 5 -62 -46 18 36 -20 -64 -20 56 44 -18 -18 13 51 52 -21 -35 15 32
3472C2j4p0j3P3L1m1m6mP6K8n9m0M3N3jm4l8L9L3j6l7k9M0O1l9n9rM1M6m0o2L9
$$ 32 18 -52 -65 8 39 -2 -48 -52 24 52 -7 -47 -4 49 48 4 -34 5 38 22 -15 -44 -4 57 18 -41 -50 -9 37 -3 -65 -26
3504b6N9J1l4m9K8N6lm0k3KO1j0o8j2M3L8k3o1NP1Ql4l5mP0J3m3k7J6M5J1o7j7
$$ -26 33 44 10 -39 -11 45 42 2 -21 -19 42 32 -36 -48 -5 33 10 -51 -46 25 33 -1 -36 -40 30 43 0 -27 -11 34 45 -22 -39
3537c9L5M0No7j5M7L9m8m2LN9L3m7l0J7L8J3l5l6J5M7J3n6l2L7M9j3n8KL2M5m3
$$ -39 -4 36 41 -26 -41 6 45 -3 -45 -42 17 50 3 -27 -10 28 41 6 -30 -15 32 45 -11 -43 -6 43 30 -28 -26 6 51 8
3569Hn1K4L1J2j5m4NN5J8l6m2K0O1Oo5j1M0K9k0m6kL7K1l0j7k9M7L5l4l5OM6K7
$$ 8 -43 -19 12 24 9 -35 -30 25 43 7 -35 -15 46 52 -13 -24 16 45 25 -21 -23 14 35 5 -12 -41 6 41 7 -28 -22 24 51
3602E1o4k8M4L8Lm7l2M4L8l0l7rJ8L3j6n3OM5M1k3n7RN9Nl4l5K8N3j3n5nJ3M3
$$ 51 -13 -41 3 41 44 -3 -35 9 47 17 -20 -29 -11 22 6 -47 -41 4 45 22 -35 -26 33 38 4 -31 -3 50 37 -18 -23 -10 33
3635C3no0ML2J8jm5rN8J3l2m3MO5J0n2j6K8L1kl9l4M0K8ok8k2K6L8j8m3nM5L3
$$ 33 28 -32 -28 4 22 21 -24 -33 25 38 6 -37 -33 32 42 -10 -26 2 33 31 -8 -42 -2 26 20 -8 -30 -4 34 16 -27 -32 13 46
3669D6l9m1L3L1Ll8k7K2N4k5k2l2K2N1j8l4k9N3L2k0n3K0L9J1m1j8NM2Rl8j8P
$$ 46 7 -34 -1 30 33 -5 -32 -10 44 19 -3 -35 -13 38 20 -14 -43 10 42 22 -31 -11 28 39 -2 -20 -15 27 36 -2 -20 -13
3701a3K6K0n3k0M3K7jn0j3N7L0l9m1J4M0Ql3l5J5K8L2l6l9RM7Jl5k3L2N6l0l8
$$ -13 13 33 -20 -40 3 30 29 -21 -34 23 53 14 -27 -13 27 35 2 -33 -18 10 42 6 -33 -24 23 24 -11 -34 -2 54 24 -14
3733a4mL5K3k5m2J0L6nmm4RN4Nm3k8K3M7jm8j3L5J9ql0j7N3Pk3j5j5L5K4k6l6
$$ -14 -18 17 40 15 -27 -17 19 14 10 -34 -25 29 34 -9 -37 -14 33 32 -16 -29 6 25 17 -13 -30 23 30 7 -8 -23 12 36 10 -26
3767b6PM3J4m7l6M1M4k6l2mK8L4j6l1nJ5J7pm1jL9K3j8m9MO2j1l3j4J9M1j0n0
$$ -26 -19 24 38 -9 -45 -4 40 14 -18 -22 6 40 24 -7 -12 3 20 13 -28 -29 10 33 15 -34 -30 32 21 -12 -26 -7 34 24 -26
3800b6KK8K1Jn1ML2L1k8l6rM5L5n4k7J5L7Ml6j5K6K3ok5k3L1L1j1l6j2L6K9k1
$$ -26 -24 4 25 26 -25 -21 11 42 14 -22 -31 14 49 -5 -32 -17 20 24 -12 -27 -1 22 16 -9 -32 -1 30 19 -17 -29 7 36 15
3833A5m7J0M7J7m0l1RM4pj2j6J2J4J8m3%NL7km2j9O1Kj8l8NL9J1l6j8LK9J7l8
$$ 15 -32 -22 25 42 2 -29 -20 24 17 5 -11 1 15 33 -10 -10 -5 32 30 -12 -31 30 32 14 -24 -19 20 31 -5 -23 -20 9 26 -12
3867a2j1J4L1J9m8k0L4M1j6l9j3L3L1l7j9KK1J5l5k2J6RK7k0k7RN3ol4j9K3M6
$$ -12 -23 -9 22 41 -7 -27 7 48 32 -7 -20 13 44 7 -12 -10 11 26 -9 -31 -15 -6 21 1 -26 -17 36 30 -4 -23 0 46
3899D6j6n0LL3J1j4k4k5M5J3k2k4pM7J1l2j5K5L8j3m3rL0K3j2k6qK5J9k0j9j4
$$ 46 30 -20 -17 16 27 13 -11 -36 9 22 0 -24 -31 16 27 -5 -20 5 43 30 -13 -22 8 31 19 -7 -15 10 29 9 -10 -24
3931b4K4L8l3k6NL8J9m4k2K2L5lm0rL0K4k3j9j4K7K1nn0LL6K2k0m5K1M6Qm0j9
$$ -24 0 38 5 -21 -16 22 41 -3 -25 -3 32 29 -11 -20 10 34 11 -8 -22 5 26 21 -29 -26 10 32 12 -33 -12 34 42 2 -17
3964a7J1L8km0nK3K3kl6j1K9K3k4l1j3N4Lj8l0J9L4rk2rJ7J0Jj8k0K9J8j5k1j2
$$ -17 -6 32 30 -10 -15 8 31 29 -7 -18 11 34 10 -21 -34 20 23 5 -25 -6 28 19 -3 -12 5 15 16 -2 -22 7 25 10 -11 -23
3998b3L3K4j1m5J2L4Ok6l7K9J7Mj8j7ML4Kl4LJ4K8j1l2rK7J7k1l6J6L3Ol1kmK6
$$ -23 10 34 23 -22 -10 24 30 4 -33 -4 13 17 -1 -18 -14 20 22 -12 -9 5 33 22 -10 -19 8 25 4 -32 -16 17 23 -8 -10 -14 12
4033A2Lk1j9RL1Ql7j5L9J3j7j3k0M4Kk7omK7J4k0k0NK3K0k7k6K9J9ol0qK5L1j7
$$ 12 15 -6 -25 -16 15 23 -14 -29 10 23 6 -7 -27 17 19 -8 -14 -18 9 23 3 -17 -12 11 31 4 -22 7 26 20 -10 -18 7 38 21
4068B1m1J1J3K0j6j6kK2Nj4j9JK6%j8j1J6L0ml6oL3J3j8j7mL0Oj2nk2L1J5k5j9
$$ 21 -20 -9 4 24 8 -8 -10 12 17 3 -16 -15 11 11 -7 -18 -2 28 24 -12 -18 15 28 10 -7 -11 19 25 13 8 -14 17 32 7 -12
4103a2RJ7J3k5k5K5K7k3j5j1K5Nj0LqJ0J1Qm9J9RK7k1l0K0K2ol7OK2J0rj1qK0
$$ -12 -3 14 27 2 -23 2 29 6 -9 -20 5 10 0 3 -5 5 16 24 -25 -6 3 30 9 -21 -1 21 15 -22 -16 6 16 7 -4 -12 8
4138HJ2qj6oK7J4j8k7JK9Nl4JNJ0Pk2j1K4OPj7k3K6J7j2j0qK5J2j9k2NK7J4l4
$$ 8 20 12 -4 -10 17 31 13 -14 -13 16 21 -13 -12 -7 3 10 -12 -23 1 7 14 -3 -26 0 17 5 -5 -13 12 24 5 -17 -12 15 29 -5
4174ej0J1J2oj9J0LK2mj8oJ6J3%l3RK8rj3j4MJ2kj2jRK0jk5j6K5K1Nk4nOJ8j9
$$ -5 -15 -4 8 2 -17 -7 -4 18 14 -4 -10 6 19 19 -14 -5 23 14 1 -13 -9 3 1 -11 -12 -3 17 16 -9 -25 0 21 26 2 -3 3 21 2
4212BnOJ4J2k7mmK0jj0j9K2J2npj7PK1nj5mJ9J3j1k0mJ9Jj1j4J0J2jMk1MJ3Qj4
$$ 2 -3 3 17 29 2 -2 -6 14 13 3 -16 6 18 13 6 -11 -4 17 12 -3 -7 12 25 14 -6 -10 9 10 -1 -15 -5 7 6 10 -11 -7 6 14 0
4251@kqK6jk4NK3Opk3OJ6Nk5okJ6Nqj5J4PPl1MJ7J5j1j3j1K8%j4qL%J7ok0J2k
$$ 0 -2 -10 16 15 -9 -4 19 25 18 -5 1 17 22 -3 -9 -11 5 10 2 -13 1 8 15 -16 -12 5 20 9 -4 -15 13 13 -1 -9 -6 -6 11 5 -15 -3 -5
4292eRpj3J1J4qnkK5oKk0NJ9oj3llJ1J8j3k7J2J0Ok7oK0J3qoj4K9noOj0NNjrN
$$ -5 4 -3 -16 -5 9 1 -4 -6 19 13 15 -5 0 19 13 0 -3 -6 5 23 10 -17 -5 5 11 -16 -22 -2 11 3 -3 -17 12 7 1 7 -3 2 7 6 -3 2
4334BOLk0j9K9JJ%rJ5LopJ1j0J7j7qLQOnj2LNmNj1J0Qjj2pKOQj4%PQJ4j8jMJl
$$ 2 8 11 -9 -28 1 2 3 3 -6 9 12 6 -1 10 0 17 0 -8 -5 3 9 4 -8 -5 0 -4 1 -10 0 8 7 -5 -12 -10 -4 4 -10 -10 -3 5 19 1 0 4 5 2
4380BpOPNj0j1PKJ1qmPQJj9lPK1j1j3qJ4%%nJKnJ3j8J0qOLjkRJj3nJ9oMk0QJ4
$$ 2 -5 1 8 13 3 -8 -1 1 12 4 0 7 15 16 -3 -6 1 22 11 -2 -10 4 4 4 -1 0 2 -3 10 -8 2 -6 0 3 2 0 9 10 -3 -8 11 5 9 -11 -3 11
4426A1Jjj2J0LonmPJMj1rOJ3qr%J6Lj8J8nRno%lm%Nj7J5JJ1pj8%J5J1j9KJJ6j2
$$ 11 12 11 -1 9 12 6 1 -3 4 5 9 -2 -11 -5 8 0 -9 -9 7 10 -8 10 5 14 9 3 3 0 -4 -4 1 -16 -1 0 11 4 -14 -14 1 12 -7 -5 -4 12 0
4471@oMjJ3kqKNRjk3lJ3kOj5KOLpnJ4jNj0mOJ5j7%qJ8Olj3jJ1orkK2rmnPJ%Mo
$$ 0 -6 -2 -3 10 8 0 2 7 16 15 -8 -11 2 0 6 -9 -7 -1 2 -5 -10 4 3 8 -2 -6 0 15 -2 -2 -10 8 14 11 -2 -3 8 2 -7 -9 13 4 0 -5 2 3 3 7 1
4520A%ORrj8J3J0j8OpOKl%kkN%jpPjOljKJ1mj1J4Jj2OrPj5K0j1QpKoNnRPlj1%
$$ 1 1 7 16 7 -11 2 12 -6 0 -7 -1 1 -2 -2 -4 -6 -1 -1 -2 -9 -2 -3 3 0 -1 1 12 8 -3 11 12 0 6 -3 4 -11 9 -2 6 -1 1 -5 0 -5 4 11 8 -3 -3
4569cJ6oJj0kJ0Pj7pOJ0Jj3lRJLj4M%J1%jNKrPmmJ6n%nqMRmnoNjj0MJ1j5QkJ1
$$ -3 13 7 8 -2 -4 6 13 -4 -11 -5 5 6 -7 -10 -1 0 3 -11 -7 -7 4 4 3 8 10 1 8 4 0 16 11 11 6 -2 2 11 7 2 -4 1 0 -10 -6 5 -10 -2 -4 7
4617GojNpMlj0J4j0JJJKp%J4j2m%%J1Kj0J1KnKj2RPJ0oj7J2Mj0qLJ2rkkKPj0L
$$ 7 1 0 5 -2 2 -1 -11 3 -7 -6 -5 -4 -2 -9 -9 5 -7 -11 -11 -11 0 2 -8 3 5 0 2 -10 -1 6 16 10 -7 5 9 -1 -9 -6 6 -3 -5 -7 -5 2 -8 -5
4663eMoJ0MlkljjKJ3lqKj0J1nJJ0j4J4rmPLjpJ1j2NJOMj7MNpj1KJ0LoKnJ4ppO
$$ -5 -1 -7 3 7 4 2 -1 -2 -3 -1 12 9 1 3 -7 4 -1 0 10 -4 10 1 -3 4 7 6 -1 10 -2 3 4 10 14 -3 1 6 -1 -12 -10 0 3 -3 -1 -6 8 1 -6 0
4711@%Qj2mMQMJkjnMoj%kNJ4j2j0J4JlKk%jLmRKlj2Mo%J2oqMJ2kjqRnrPpJ2lK
$$ 0 0 8 -4 -8 -4 4 8 9 7 6 1 5 -1 -2 -2 -4 1 15 3 -7 7 8 5 7 5 5 4 7 3 12 14 11 -1 3 -3 -3 9 3 -5 -1 11 9 8 0 9 4 -5 2 -5 7 4 6
4763Fj5J5Qj0Qj5J4jnmMjlKoJKMnnPjPqpNJ3oj0PLJpJMqR%kmlJ2j2J3jM%pNj2
$$ 6 -9 6 14 4 12 -3 11 10 5 1 5 4 1 3 -3 -2 0 4 -1 -6 1 0 7 -1 -8 -3 10 4 -6 1 4 5 -2 -1 3 -5 4 4 2 -2 -5 7 -5 8 7 11 11 4 9 -3
4813cRj1PJj%j1J1j0QLoJKkklj2J1RNoOmRpjkMkrmJ6rO%JlrKOkJ2j9J0LLKLoN
$$ -3 6 -5 2 3 2 2 -9 2 -8 0 3 -3 -2 0 -2 -4 -7 -19 -8 1 6 0 6 2 11 4 3 1 5 3 -6 -10 6 -3 3 3 4 1 -8 -6 0 -2 10 -9 1 4 7 9 12 6 11
4864A1rKjpQpj2J3LLj1J0m%PnRpN%Pj7PjLPk0Rj1J3j1QmlMOknLjOj1Qj0J1pNm
$$ 11 2 4 3 -4 4 -3 -15 -2 1 4 -7 3 -1 -1 6 1 10 3 8 8 15 -2 5 4 7 14 -6 3 -8 5 -6 2 -2 -5 -1 5 3 -2 1 0 6 -5 3 -7 4 -3 2 -2
4912bMJm%qJ5jmnJjJ1j0%QKOjoKnPqpOJNj2J0mLkKj8OPrQPJ%%olONkrONjLrPn
$$ -2 2 3 -1 -1 -9 6 5 1 -4 -3 -4 7 -3 -3 5 7 13 12 6 8 3 10 2 -5 1 2 7 -5 5 1 4 2 4 -14 -8 -1 -10 -2 5 6 6 6 0 -3 3 8 6 -3 3 8 7 10 1 8 3
4967CokJ2rPmNj1J4kNkrOj0PkK%qkKRJj2OkNj3J1qOJ0Krm%kkJ8koRqjljJ0joM
$$ 3 -3 -5 7 -2 5 1 6 -5 9 7 12 10 1 7 -3 4 2 4 4 -4 -6 -4 5 6 -6 0 -2 3 -10 1 -7 -1 9 11 2 -2 -2 -4 -6 12 10 4 13 5 4 1 0 10 9 3 7
5018GrPjj2J4lmpK1JprJ5j0Npp%Mkj0J0lPpk%JJ2oj%MlJ7mkKJmj5NlnJ5rJ1rR
$$ 7 -2 5 4 -8 6 3 -1 -8 13 14 7 -2 13 3 8 1 -6 -6 -2 -4 -14 -4 -7 0 -7 -9 -9 -8 4 -2 -3 -3 1 -2 15 11 9 11 12 8 -7 -2 -5 -10 5 -4 7 -2 7
5067Gj2%oJ4j0LjjQJmLlnLNj1lJ0PoOj2jLMKkPLNpkMOnmKKj4njMJ8nrNkrJKoR
$$ 7 -5 -5 -11 3 -7 -4 -5 -6 2 3 -1 2 -1 -6 -3 2 -9 -12 -2 5 -1 5 -7 -8 -5 -1 1 -1 6 9 14 7 5 9 15 10 6 8 10 -4 -9 -10 -6 12 7 -2 3 1 -8 -7 -5 -11 -2
5120bMNk0K0j2J2j1%QpNklPKrMJ3jj5O%J3k0OPq%J0j4MkQnmmQo%kKpRJpPnJ5q
$$ -2 2 7 -13 7 -5 7 -4 -4 4 -3 2 0 -3 4 6 -3 1 14 13 -2 4 4 17 -3 3 10 2 2 12 -2 2 0 8 3 -1 -5 3 -3 -3 -5 -3 -10 -1 0 -7 0 -5 10 2
5169BLKj2OjpNQjj7J1kjJ3jqJKkNj8J0MkLkLNoPj2jjO%klKlmJ3j2J5j1oOlJOj
$$ 2 5 7 -5 1 0 -7 -2 6 5 -12 -1 -3 -4 9 8 0 1 3 1 6 -12 -2 2 0 3 1 4 9 3 10 -2 -3 -4 2 2 0 -3 -1 -4 -8 5 -7 8 -3 -9 -3 -6 -5 1 0
5219@J0j0OkkM%Kjj3J5oqpRRpMj%jj5ROkLJqMJ1pKj3J3mj1M%Rj2J4oLJ3j8LJ0
$$ 0 10 0 6 4 2 6 6 8 7 -6 9 3 -5 -12 -3 6 -1 3 2 2 1 -14 -5 1 -1 2 3 -5 -1 10 3 5 -8 5 1 -10 -6 -6 3 -9 5 -1 2 15 -3 0 10
5266A0klKojMJlkKKj2Qj1lPJ5mpNLj0RLrNpJ2lj0K1rnlNj0MjrJ6%mkJ0lplNJ1
$$ 10 8 5 7 1 0 4 5 2 0 2 4 -8 0 -11 -14 -7 8 4 -3 2 5 -5 4 7 -2 3 -4 8 5 -5 16 7 2 -1 4 -6 -2 -3 -12 4 4 0 -2 8 5 -2 -5 0 11
5315A1qJ0mrJJ4j4j0LJ8j0oJljOJ%jj2J8rJ3KKkoPJj1J4j7RrJ1jnKLnKnJ1qk%
$$ 11 3 13 9 0 1 15 1 -9 -6 12 2 -4 -3 -6 -7 -1 0 0 -1 -13 5 -4 9 11 13 11 5 12 13 2 16 -1 8 -1 10 9 4 6 9 4 6 1 12 4 2 2
5361BNlRqmj1RMj%KrMMprJ3Rj5J3j2KkLNpkJ0MqOPj6J3rJ3monLLmj2J1j1OLP%
$$ 2 7 4 13 5 1 -10 -1 3 2 2 4 -5 -1 3 -4 -13 0 9 -6 7 -5 -3 -5 -2 3 -4 -6 4 8 0 6 13 -3 10 1 14 10 4 -1 2 5 1 -11 0 -11 -5 -2 5 5
5410EqJ0j1NoMlJ2k2J1%NLj2J0KqjMMLkoQj0OOJknqJ3qkPJLj7kPLqJLKlMMJ1j0
$$ 5 -3 7 -4 1 -5 -1 -4 8 -14 -3 -3 2 5 -7 3 5 -3 -4 0 4 7 5 -1 7 -3 3 9 10 8 3 -5 8 0 -2 5 6 9 -8 -10 -3 0 -8 -7 -4 -2 -5 -1 3 14 4
5460DqK%J%J1mlj0K4j8mjQJ2j4kQMopMOKRj9J3j5J1j5OJ3qJrKMKKrNjJMmoMKN
$$ 4 -4 -2 -2 -1 -1 10 6 3 -7 17 -1 -5 -6 2 14 0 -2 6 10 4 -3 1 7 9 18 -1 12 -3 8 -7 -1 12 4 5 -4 -2 2 4 6 -3 2 1 2 6 2 -4 0 2 7
5509GLjmJlNq%njNQj3jPoJ0j7J5nMNNqnNMplMj3JMKjJOlkrK2j7J1QloQjLj1J4
$$ 7 10 9 5 6 3 8 0 0 -5 -6 -1 7 -6 -7 0 -6 4 -13 2 -3 1 6 11 3 -2 3 7 0 -3 1 -12 -11 -7 -5 -6 -5 1 -2 -4 -13 9 -8 3 11 8 2 10 9 12 1 15
5560A5poOj1MMpj5J9kKLp%%mQoPMmj0J2J%poN%Rj8JOOlM%nKJMJ6k1J5rLNKj1j
$$ 15 8 2 8 -3 1 5 -2 -17 2 0 2 5 -2 -2 -2 -6 2 -4 3 7 3 -7 5 6 6 -1 -7 -2 -2 7 -11 -10 -4 2 -1 3 3 -2 0 1 5 21 0 15 6 9 14 16 5 4
5610DOj0J0kkojpnNJ1j2LJMjJKMMJmnMnpJ8j2jRj1OJ1nmjrQoLjJ2%nj2J2Lj5J2
$$ 4 10 0 10 8 6 0 -1 -8 -13 -8 3 -9 -6 -5 -1 -2 -1 1 5 9 10 6 1 5 0 -7 11 -1 -2 7 -4 2 13 8 4 3 -6 2 -4 -1 -2 10 10 5 -7 5 8 -7 5
5659EqJMmPj1J3j9NPlKj%mLR%j2K3j0JknKNpNLj1OKj6J9j5J4j2LNoLkJ1j1jJ7
$$ 5 -3 -2 2 -2 5 -6 7 -12 -7 0 -3 -1 -2 -2 -6 -3 6 6 -6 17 7 8 6 1 3 8 1 6 9 -2 4 6 -10 9 -6 8 -4 -1 4 -2 1 -1 10 -1 -2 15
5705A5j0jJk%jllkOnOMJlJ%LknJkKoJ5olNrQmkjjlNnnkpRJ6lqNJ0kqJ4nqmKNJ
$$ 15 5 4 5 3 3 2 -1 -4 -6 0 -5 1 5 6 3 4 4 7 5 0 1 -1 1 -5 10 4 1 6 -3 5 1 -1 -2 -3 -6 -1 -6 -11 -13 -20 -11 5 2 -6 -1 9 7 -1 13 8 0 -4 -2 3 4
5760DnJ0lpkPoNJmmpK3j0JKmRlKj0JpQqJ1Mj6N%jKJpMJ0j6nK3jrP%jJJj0lMJJ2
$$ 4 -1 9 6 -1 -3 4 -2 3 4 0 -4 -11 12 2 3 5 1 10 7 9 -1 0 -7 1 -7 4 8 -8 -3 -3 -4 -2 -1 -8 -4 6 -10 -15 8 7 -2 5 5 4 5 6 -4 -7 -3 -2 10
5811A0j1J0oj3PKKJJPnlKjJlNJj4J2%pkKnMPrP%jQjj0KMj2OJ7j0oRMj1%lpJ4j
$$ 10 -1 9 3 -10 -3 -1 1 2 3 10 5 2 4 3 4 1 6 7 -7 5 5 -2 -4 -2 -7 -3 4 -5 2 2 1 9 8 -2 0 4 -8 -2 15 5 -1 8 12 1 1 -2 -9 5 4
5860DLj1lkQPk%%oMjmMJknKqJ2qkRRpKlqRKmPnNj6J5oLNj4KO%Kj1kNOoKrRmMj0
$$ 4 7 -4 -7 -9 -1 6 4 4 4 -2 2 1 -3 1 2 0 -5 -3 -11 1 -7 -9 0 9 2 4 1 -7 2 4 0 7 2 7 -9 6 0 3 8 -6 -4 2 2 4 -7 -9 -4 2 -4 -2 -11 -2 -6 -2 -12
5915a2J3LLo%knLJ1j3%KOloNLKj7PKOJrPJmJ6j1Jj0LKpPKlLqJkJmKkJ1j3J0%J1
$$ -12 1 4 7 1 1 -1 -6 -3 8 -5 -5 -3 3 0 -6 -1 2 4 -13 -6 -4 2 3 -6 1 2 -2 14 3 4 -6 -3 -1 -8 -1 1 -2 1 -7 -6 -8 -7 -11 -9 -11 0 -13 -3 -3 8
5965HNj7NoJ1KmrlNkLJqJ7j0kMpOj0PKj3J9j1MlJKkLqMj0KJRkQj2PkjOJ0j5MJ3
$$ 8 13 -4 1 -5 6 8 4 -5 -8 -3 -5 -2 -1 -9 8 -2 -4 0 -7 -1 -11 -4 -2 -15 4 -7 -3 -6 -5 -3 -5 -2 -10 -6 -16 -14 -13 -4 -6 2 -10 -3 -5 -6 0 10 -5 -1 12
6014A2m%qJN%pPknlPj1qJ4%kKlJ3qJOJl%oppK0kkj3RMqj4J6PnqQoK0k1JMj2J9
$$ 12 8 8 0 1 6 6 -1 6 4 -1 -4 3 -8 -16 -2 -2 -4 -2 -5 8 0 1 7 8 5 5 -1 -8 -15 5 3 1 -12 -3 1 -7 -21 -5 2 -3 -11 -3 -9 11 -10 -9 -5 -17 2
6063BopRPKj8NkKoJ2Mjjj5RpJ4j1RkNm%%%nJ2Jj2%NlKj1JJ7Lj1MJj5LJ7KmPMq
$$ 2 -4 -11 -2 5 7 -11 -6 -8 -6 -12 0 4 3 2 -13 -4 -11 3 -8 1 -1 4 0 0 0 0 -5 7 8 -4 -4 1 -2 0 -11 -10 7 10 -1 3 4 -11 -8 9 11 7 14 18 10
6112A0j5Rm%J0j6QLj2kQJnOokjQkLpJ5j5%QJNqOm%Pj2Jk%QlMpJ6jj4%MKkpmJ7
$$ 10 -5 4 0 0 10 -6 2 5 -7 -9 -1 0 -5 1 -5 -7 -8 0 -2 1 -6 9 -6 -6 2 3 8 0 6 2 2 9 -3 -2 -4 -4 4 1 5 -2 14 13 -1 -1 3 5 3 -4 -8 9
6162IjpkpKJ0qJ3j1mJ2lk2J4LMpLKQo%NpJ9j5jKNj0jkj0J8KlqKJ1j4Rj1J1%Nr
$$ 9 8 1 -1 -8 -6 4 -4 9 -2 -6 6 3 -19 -5 -2 2 -5 -2 0 8 2 2 7 0 19 4 3 5 10 0 -1 -3 -13 5 7 4 -4 -2 9 -5 4 -7 4 4 9 0
6208@Pj1PjLnllNj0NLkQopKJ4mj%Oj2PPqrPOJlMoj0J0mJjlkkMOoOKjOj7NKOpN
$$ 0 7 -4 3 2 5 0 -3 -6 -1 -11 -6 -3 -5 3 -3 -10 -8 6 2 1 1 7 -5 2 9 1 -8 -1 5 6 3 7 1 -9 1 -3 -2 -3 -6 -8 -10 -6 0 -6 0 2 1 7 -10 -5 -3 3 -4 1
6262AJ4j7lOmkRKqRj3RomKJ9knj1kOPj6J0oJJOnmPolJJ0o%pJ2J6k0Pj0J0lOmM
$$ 1 15 -2 -5 1 -3 -5 4 6 -2 7 -6 3 -3 -7 -5 14 12 7 -4 -6 0 7 -9 1 -5 -4 -3 3 -2 -6 1 -5 -8 -7 3 -3 -3 -10 2 18 -2 5 -5 5 2 8 4 8
6310HqLOlkmKmJN%mMj0KJ4mj5J3Oj3kQkjNnnkJ0oQlpjJ4qMj3J7MnoJM%rORrj0
$$ 8 0 3 9 6 4 0 2 -2 -1 4 4 0 4 -6 -4 10 6 -9 4 10 -3 -5 3 1 0 5 0 -5 -7 3 -3 5 2 -5 -6 8 0 4 -9 8 12 7 1 2 6 6 -3 3 12 3 -7
6361gjKOpLj1JJ3Ln%J0j0kJ6l0J1PLMNj1J1j1Lj1PQj5RJNpK%nJ0jqOJKKopJ1J
$$ -7 -8 -6 0 -7 -4 -15 -14 -1 2 -3 -3 7 -3 -5 11 -19 -8 -1 2 6 11 0 11 0 3 -8 -1 7 -8 1 2 7 0 2 2 -3 7 6 -2 4 5 7 9 3 -4 7 8
6408Hj4NqQJjJlmj5J7kNlLjJ0pNjNj1NnkPqJ1qJQ%%lKqj1J2mOj4QJ7j8kLJ4oj2
$$ 8 -6 -1 -9 -1 0 -1 0 -3 -7 -22 -5 -7 -2 -5 -2 -3 7 0 5 4 9 -2 3 -2 -4 3 -5 6 -2 -1 7 7 7 4 6 -2 -13 -1 -5 1 -13 -5 12 -6 -8 -5 9 3 -9
6457ikJ2pmOoLl%LKKM%rkJ2MpNLk1J9lojkkOnQjpkjJ1lmJOJLj7LNQj1J0j5MNJ3
$$ -9 -11 1 -6 -10 -4 -10 -7 -10 -10 -7 -5 -3 1 1 -8 -10 2 6 -1 4 7 -14 5 2 -4 -5 -7 -9 -3 -8 0 -1 -8 -10 -11 0 -3 -7 -6 0 1 4 -13 -10 -5 3 -8 2 -13 -9 -4 9
6509Ij1pLnJ0j5MQR%j8J6LprMMMkqJ%RrjPj1J1j5P%qK4oo%oQoJ0jjK%jj0J1pL
$$ 9 -2 -9 -6 -11 -1 -16 -12 -4 5 5 -13 3 6 -1 -10 -6 -2 2 0 -8 -7 -7 2 -7 -8 -1 -12 -1 -16 -9 -9 -17 7 1 -5 -5 -11 -3 -9 1 0 -1 1 1 0 -10 1 -6 -3
6558cPj4J0QrkLMJqJ4lqmNmMrl%OJnj2J5lPpJlJ4mppJ2nJ2opJ1jNKj1MNkj1RK
$$ -3 4 -10 0 8 -1 -3 0 4 5 -3 11 8 0 -4 1 -3 1 -8 -11 -11 -5 -4 -9 -21 -6 -9 -2 -9 -8 -11 3 -1 -8 -15 -3 -8 4 -2 -9 2 1 6 8 -3 1 6 4 -7 2 4
6608Dn%PrNLNLj5J4j7QoNLrJJrQjlQpRKj5J2rJ1j4Q%NK%lJlMj1QoJ0mKmRj6jM
$$ 4 -1 -1 6 -3 2 5 10 13 -2 12 -5 3 -3 2 5 -4 -3 -2 -11 -3 -4 -7 1 -6 3 5 -10 2 -7 4 -10 -2 -2 3 5 5 2 3 0 4 -7 1 -5 5 1 3 -1 8 -8 -9 -5
$$ [...]
8191G
##END NTUPLES=NMR FID
##END=
