##TITLE=1H_AM_NV175
 200.13MHz, ,
 8 sc
 
 7.2.2025
##JCAMPDX= 6.0         $$ Bruker NMR JCAMP-DX V2.0
##DATA TYPE= NMR FID
##DATA CLASS= NTUPLES
##ORIGIN= UXNMR, Bruker Analytische Messtechnik GmbH
##OWNER= pz
$$ XWIN-NMR		Version 3.5
$$ Fri Feb  7 14:00:55 2025 Russian Standard Time (UT+4h)  she@DPX200
##.OBSERVE FREQUENCY= 200.131
##.OBSERVE NUCLEUS= ^1H
##.DELAY= (6, 6)
##.ACQUISITION MODE= SIMULTANEOUS
##.ACQUISITION SCHEME= undefined
##.AVERAGES= 8
##.DIGITISER RES= 18
##SPECTROMETER/DATA SYSTEM= spect
##.PULSE SEQUENCE= zg30
##.SOLVENT NAME= D2O
##.SHIFT REFERENCE= (INTERNAL, D2O, 0, 14.3821)
##AUDIT TRAIL= $$ (NUMBER, WHEN, WHO, WHERE, WHAT)
$$ ##TITLE= Audit trail, XWIN-NMR		Version 3.5
$$ ##JCAMPDX= 5.01
$$ ##ORIGIN= Bruker BioSpin GmbH
$$ ##OWNER= she
$$ F:/spectra/data/she/nmr/H-C/1/audita.txt
$$ ##AUDIT TRAIL=  $$ (NUMBER, WHEN, WHO, WHERE, WHAT)
(   1,<2025-02-07 13:59:50.79 +0400>,<she>,<DPX200>,
      <created by zg, POWCHK disabled, PULCHK disabled
       configuration hash MD5:
       00 E9 B6 7A A2 85 ED C7 34 08 36 98 17 FE 4E 26
       data hash MD5: 16K
       DC F5 BE BD DC 90 8B A0 1A D1 70 D9 DA 64 EB EF>)
$$ ##END=
$$ 
$$ hash MD5
$$ FB 39 32 FC ED 5A 57 B6 D7 75 C0 C2 A7 F1 89 50
##$RELAX= 
##$RELAX= 
##$RELAX= 
##$RELAX= 
##$RELAX= 
##$RELAX= 
$$ Bruker specific parameters
$$ --------------------------
##$DU= <F:/spectra>
##$EXPNO= 1
##$NAME= <H-C>
##$PROCNO= 1
##$TYPE= <nmr>
##$USER= <she>
##$AMP= (0..31)
100 100 100 100 100 100 100 100 100 100 100 100 100 100 100 100 100 100 
100 100 100 100 100 100 100 100 100 100 100 100 100 100 
##$AQSEQ= 0
##$AQ_mod= 1
##$AUNM= <au_zg>
##$AUTOPOS= <>
##$BF1= 200.13
##$BF2= 200.13
##$BF3= 200.13
##$BF4= 200.13
##$BF5= 200.13
##$BF6= 200.13
##$BF7= 200.13
##$BF8= 200.13
##$BYTORDA= 1
##$CFDGTYP= 0
##$CFRGTYP= 5
##$CHEMSTR= <none>
##$CNST= (0..31)
1 1 145 1 1 1 1 1 1 1 1 1 1 1 1 1 1 1 1 1 1 1 1 1 1 1 1 1 1 1 1 1 
##$CPDPRG= <>
##$CPDPRG1= <>
##$CPDPRG2= <>
##$CPDPRG3= <>
##$CPDPRG4= <mlev>
##$CPDPRG5= <mlev>
##$CPDPRG6= <mlev>
##$CPDPRG7= <mlev>
##$CPDPRG8= <mlev>
##$CPDPRGB= <>
##$CPDPRGT= <>
##$D= (0..31)
0 0.7 0 0 0 0 0 0 0 0 0 0.03 0 0 0 0 0 0 0 0 0 0 0 0 0 0 0 0 0 0 0 0 
##$DATE= 1738922390
##$DBL= (0..7)
120 120 120 120 120 120 120 120 
##$DBP= (0..7)
150 150 150 150 150 150 150 150 
##$DBP07= 0
##$DBPNAM0= <>
##$DBPNAM1= <>
##$DBPNAM2= <>
##$DBPNAM3= <>
##$DBPNAM4= <>
##$DBPNAM5= <>
##$DBPNAM6= <>
##$DBPNAM7= <>
##$DBPOAL= (0..7)
0.5 0.5 0.5 0.5 0.5 0.5 0.5 0.5 
##$DBPOFFS= (0..7)
0 0 0 0 0 0 0 0 
##$DE= 6
##$DECBNUC= <off>
##$DECIM= 32
##$DECNUC= <off>
##$DECSTAT= 4
##$DIGMOD= 1
##$DIGTYP= 9
##$DL= (0..7)
0 120 120 120 120 120 120 120 
##$DP= (0..7)
150 150 150 150 150 150 150 150 
##$DP07= 0
##$DPNAME0= <>
##$DPNAME1= <>
##$DPNAME2= <>
##$DPNAME3= <>
##$DPNAME4= <>
##$DPNAME5= <>
##$DPNAME6= <>
##$DPNAME7= <>
##$DPOAL= (0..7)
0.5 0.5 0.5 0.5 0.5 0.5 0.5 0.5 
##$DPOFFS= (0..7)
0 0 0 0 0 0 0 0 
##$DQDMODE= 0
##$DR= 18
##$DS= 0
##$DSLIST= <SSSSSSSSSSSSSSS>
##$DSPFIRM= 0
$$ [...]
##$SUBNAM0= <"">
##$SUBNAM1= <"">
##$SUBNAM2= <"">
##$SUBNAM3= <"">
##$SUBNAM4= <"">
##$SUBNAM5= <"">
##$SUBNAM6= <"">
##$SUBNAM7= <"">
##$SUBNAM8= <"">
##$SUBNAM9= <"">
##$SW= 18.0517599122864
##$SWIBOX= (0..15)
0 0 2 0 0 0 0 0 0 0 0 0 0 0 0 0 
##$SW_h= 3612.71676300578
##$TD= 16384
##$TD0= 1
##$TE= 0
##$TE2= 300
##$TE3= 300
##$TEG= 300
##$TL= (0..7)
0 120 120 120 120 120 120 120 
##$TP= (0..7)
150 150 150 150 150 150 150 150 
##$TP07= 0
##$TPNAME0= <>
##$TPNAME1= <>
##$TPNAME2= <>
##$TPNAME3= <>
##$TPNAME4= <>
##$TPNAME5= <>
##$TPNAME6= <>
##$TPNAME7= <>
##$TPOAL= (0..7)
0.5 0.5 0.5 0.5 0.5 0.5 0.5 0.5 
##$TPOFFS= (0..7)
0 0 0 0 0 0 0 0 
##$TUNHIN= 0
##$TUNHOUT= 0
##$TUNXOUT= 0
##$USERA1= <user>
##$USERA2= <user>
##$USERA3= <user>
##$USERA4= <user>
##$USERA5= <user>
##$V9= 5
##$VALIST= <valist>
##$VCLIST= <CCCCCCCCCCCCCCC>
##$VD= 0
##$VDLIST= <DDDDDDDDDDDDDDD>
##$VPLIST= <PPPPPPPPPPPPPPP>
##$VTLIST= <TTTTTTTTTTTTTTT>
##$WBST= 1024
##$WBSW= 4
##$XGAIN= (0..3)
0 0 0 0 
##$XL= 0
##$YL= 0
##$YMAX_a= 627198
##$YMIN_a= -766750
##$ZGOPTNS= <>
##$ZL1= 120
##$ZL2= 120
##$ZL3= 120
##$ZL4= 120
##$ABSF1= 10
##$ABSF2= 0
##$ABSG= 5
##$ABSL= 3
##$ALPHA= 0
##$AQORDER= 0
##$ASSFAC= 0
##$ASSFACI= 0
##$ASSFACX= 0
##$ASSWID= 0
##$AUNMP= <proc_1d>
##$AZFE= 0.1
##$AZFW= 0.1
##$BCFW= 1
##$BC_mod= 2
##$BYTORDP= 1
##$COROFFS= 0
##$CY= -3
##$DATMOD= 1
##$DC= 2
##$DFILT= <>
##$DTYPP= 0
##$F1P= 0
##$F2P= 0
##$FCOR= 0.5
##$FTSIZE= 0
##$FT_mod= 4
##$GAMMA= 1
##$GB= 0.15
##$INTBC= 1
##$INTSCL= 1
##$ISEN= 128
##$LB= 0.25
##$LEV0= 0
##$LPBIN= 0
##$MAXI= 10000
##$MC2= 0
##$MEAN= 0
##$ME_mod= 0
##$MI= 1.114404
##$NCOEF= 0
##$NC_proc= 0
##$NLEV= 6
##$NOISF1= 3.799351
##$NOISF2= 2.8
##$NSP= 1
##$NTH_PI= 0
##$NZP= 0
##$OFFSET= 14.38212
##$PC= 1
##$PHC0= -376.6139
##$PHC1= 6.192207
##$PH_mod= 1
##$PKNL= yes
##$PPARMOD= 0
##$PSCAL= 0
##$PSIGN= 0
##$REVERSE= no
##$SF= 200.129724274929
##$SI= 16384
##$SIGF1= 3
##$SIGF2= 2
##$SINO= 400
##$SIOLD= 16384
##$SREGLST= <1H.CDCl3>
##$SSB= 0
##$STSI= 0
##$STSR= 0
##$SW_p= 3205.1282051282
##$SYMM= 0
##$S_DEV= 0
##$TDeff= 0
##$TDoff= 0
##$TI= <>
##$TILT= no
##$TM1= 0
##$TM2= 0
##$TOPLEV= 0
##$USERP1= <user>
##$USERP2= <user>
##$USERP3= <user>
##$USERP4= <user>
##$USERP5= <user>
##$WDW= 1
##$XDIM= 8192
##$YMAX_p= 0
##$YMIN_p= 0
$$ End of Bruker specific parameters
$$ ---------------------------------
##NTUPLES= NMR FID
##VAR_NAME=  TIME,          FID/REAL,        FID/IMAG
##SYMBOL=    X,             R,               I
##VAR_TYPE=  INDEPENDENT,   DEPENDENT,       DEPENDENT
##VAR_FORM=  AFFN,          ASDF,            ASDF
##VAR_DIM=   8192,          8192,            8192
##UNITS=     SECONDS,       ARBITRARY UNITS, ARBITRARY UNITS
##FACTOR=    0.0002768,     1,               1
##FIRST=     0,             0,               0
##LAST=      2.2672688,     0,               0
##MIN=       0,             -766750,         0
##MAX=       2.2672688,     627198,          0
$$ Real data points
##PAGE= N=1
##DATA TABLE= (X++(R..R)), XYDATA
0@%%%%%%qJ6j6J6k4L2m0N6p2Q9j13J44j76K10k52L06l68M33n07N95o95Q07r32
$$ 0 0 0 0 0 0 0 -8 8 -8 8 -16 16 -24 32 -40 49 -64 80 -96 114 -138 168 -200 233 -274 321 -374 433 -499
29d99J070j226J403j597J810k045K307k595K911l261L641m055M511n009N552o146
$$ -499 571 -655 748 -849 961 -1084 1223 -1372 1539 -1722 1919 -2136 2375 -2634 2918 -3228
45c228O795p503Q277r124J0052j1069J2193j3438J4818j6359J8088k0043K2276
$$ -3228 3567 -3936 4341 -4783 5269 -5800 6393 -7045 7773 -8586 9502 -10541 11735
58A1735k4854K7867l1442L5765m1122M7964n7045O9752q8940J21631j92135O02540
$$ 11735 -13119 14748 -16694 19071 -22051 25913 -31132 38620 -50320 71311 -120824 481716
70D81716k43888l15237P04607p30283M06173R0810p15942M10567K52923l44144
$$ 481716 237828 -77409 627198 -103085 303088 393898 -322044 88523 341446 -2698
80b698L62784k41333k19267K75864p2943j06012N421l5145L4550k07458J99933
$$ -2698 360086 118753 -100514 175350 102407 -3605 1816 -33329 1221 -206237 -6304
91f304J05410l37867J36315m0027j22662N14627k18994k99177L54299j34814J13325
$$ -6304 99106 -238761 -102446 -142473 -265135 249492 30498 -268679 85620 -49194 64131
102F4131J90913n57925J01104K87692j41183K09410k10095j91091M15547j23501
$$ 64131 255044 -302881 -201777 85915 -55268 154142 -55953 -247044 168503 45002
112D5002p7070L9022l36546K87724J08220l44444L35088n1685k71814L34207j75014
$$ 45002 -32068 6954 -329592 -41868 66352 -278092 56996 5311 -266503 67704 -107310
123a07310j29617K45243l19865k8966K54441j18596J33292J9900k29395J58117
$$ -107310 -236927 8316 -311549 -340515 -86074 -204670 -71378 -51478 -280873 -122756
133a22756J79506l3630j80857r2203K32909L8312k0331M9719k37520J56948K56042
$$ -122756 56750 23120 -157737 -249940 -17031 21281 950 50669 -186851 -29903 226139
144B26139k64626P7262M6440j84809L65278j7082l10917K94507n4321j95783K03278
$$ 226139 -38487 38775 85215 -99594 265684 248602 -62315 232192 177871 -17912 185366
155A85366j46365l9835J65982j98471M6857J84258q4683n260p7303n0219J31296
$$ 185366 39001 -834 165148 -33323 13534 197792 113109 107849 30546 -19673 111623
166A11623l3076p0295p6650l2649K05799M763j42603Q374m2005J21521R9872k18905
$$ 111623 78547 8252 -68398 -101047 104752 109515 -33088 -24714 -66719 54802 154674 -64231
178f4231Q244J30347k6674N9497o3716p4534J04931m2983k5543M0560n2685P5928
$$ -64231 -55987 74360 47686 107183 43467 -31067 73864 30881 5338 45898 -6787 69141
190F9141J9000p3919P6710N896j6433k0431j43537Q7101J13039j51029l1094K6837
$$ 69141 88141 14222 90932 96828 80395 59964 -83573 3528 116567 -34462 -65556 -38719
202c8719J9364J17043q8147j10862P7925J1399L5549m950j37698M0855R4779k5636
$$ -38719 -19355 97688 9541 -101321 -23396 -11997 23552 18602 -119096 -78241 16538 -9098
214i098l5675p0974L5190Q9598o6101j8400M1984Q180M9589m3301l1156R0680
$$ -9098 -44773 -115747 -80557 9041 -57060 -75460 -33476 -25296 24293 -19008 -50164 40516
226D0516k4371m4918O582l9874O3380L8506r9908q958M3220M4584L7198j00172
$$ 40516 16145 -28773 -22191 -62065 1315 39821 -60087 -69045 -25825 18759 55957 -44215
238d4215l4015J14627K7470l9971n2273k0849P8095O615p3457j5742j942L2125
$$ -44215 -78230 36397 63867 23896 -28377 -49226 28869 35484 -37973 -53715 -55657 -23532
250b3532L0764m8382o412M7092K9157R359m5392n557O8953j7485p3172j0637L5572
$$ -23532 7232 -41150 -47562 -470 28687 38046 -7346 -12903 56050 38565 -34607 -45244 -9672
263i672L3454l3920m9208L9515N9206J0347k7715l6858K3024N2937o697n1938
$$ -9672 23782 -10138 -59346 -19831 39375 49722 22007 -14851 8173 61110 54413 2475
275B475l3657L7648N7546l2142o5620N938N0007J5481m9453l0349M9802L9169
$$ 2475 -31182 6466 64012 31870 -33750 -27812 22195 37676 -11777 -42126 7676 46845
287D6845j4955j9562l116K5323J6175l8310l9910K217K7764J4636l9748l2692
$$ 46845 31890 12328 9212 34535 50710 12400 -27510 -25293 2471 17107 -22641 -55333
299e5333N0191N2202k6468m6752R148N5741J9537m8067l0752L0167K5425k1335
$$ -55333 -5142 47060 20592 -26160 -17012 38729 58266 10199 -20553 9614 35039 13704
311A3704m4611k4223K4472L3952r512k3783J8832N6912L0197m0398m4611K3368
$$ 13704 -30907 -55130 -30658 3294 -6218 -30001 -11169 45743 75940 35542 -9069 14299
323A4299K7279l9130n4167M98M7336K6192k5313j5597K8819K9057j063l0431k7345
$$ 14299 41578 2448 -51719 -51221 -3885 22307 -3006 -18603 10216 39273 38210 7779 -19566
336a9566K2166L7777j1296l9647p522L9341K1574m8970m1207L4205M1202p787
$$ -19566 2600 40377 29081 -10566 -18088 21253 42827 -6143 -47350 -13145 28057 20270
348B0270k9678l58M2589J5874l8892k9586m61J8255J4420k9444k1385L4785L3253
$$ 20270 -9408 -9766 32823 48697 9805 -19781 -20242 -1987 12433 -17011 -38396 -3611 29642
361B9642p169m4911k6379M2483J5431n0872j7310K8834L8411J0066m3258j1627
$$ 29642 22473 -22438 -48817 -6334 9097 -41775 -59085 -30251 8160 18226 -25032 -36659
373c6659L0978k380j6022k6540j5088M9179K8243k6397j2564P919L4486M835o2639
$$ -36659 -5681 -8061 -24083 -50623 -65711 -16532 11711 -14686 -27250 -19331 15155 19990 -42649
386d2649q374M9566J2702j2026j9373J4936M3352j7601l6168n291N872L0398k983
$$ -42649 -51023 -1457 11245 -781 -20154 -5218 38134 20533 -15635 -20926 -15054 15344 12361
399A2361l3372J8794L0561J4214k1004o0161J4121M3568k5306k3154p335L2181
$$ 12361 -21011 -2217 28344 42558 21554 -38607 -24486 19082 -6224 -29378 -36713 -4532
411d532O0739l2330l6382K5936k669Q683j2574m5874L2649K6834o351R547l2242
$$ -4532 56207 23877 -12505 13431 10762 19445 6871 -39003 -6354 20480 14129 23676 -8566
424h566K3549N1579n2825j2456L5735Q576K6927m3161k9303O5205k2388m2570
$$ -8566 14983 66562 13737 1281 37016 45592 72519 29358 55 65260 42872 302
436C02k199l1411N2579L6296n1342J8187J0264J3503L7936q9579m3835M9649k3423
$$ 302 -1897 -33308 19271 55567 4225 22412 32676 46179 84115 -5464 -49299 350 -23073
449b3073L282k0017l4354Q7747J265m4547M4697l5026O585M2910p7396K2037M7592
$$ -23073 -19791 -39808 -74162 13585 14850 -29697 15000 -20026 -13441 29469 -47927 -25890 21702
462B1702m9215K8161j5323k5970P6862l1302m4581L5558O823N2736j2738p3600
$$ 21702 -27513 648 -14675 -40645 36217 4915 -39666 -4108 2715 55451 42713 -30887
474c0887M6985J9146o495n372q1971M5036N7717n8970L6050l0632n1184J04350
$$ -30887 16098 35244 28749 23377 -58594 -13558 44159 -14811 21239 -9393 -60577 43773
486D3773n0280p0410O5044m8846K6765N3043r1006O5440M4206r9328L9600J056
$$ 43773 -6507 -76917 -11873 -60719 -33954 19089 -71917 -6477 37729 -61599 -21999 -20943
498b0943l5201M5158o3468l850P4090j5931L7094j9424n1173R7018R273m2725
$$ -20943 -56144 -10986 -74454 -78304 -4214 -20145 16949 -2475 -53648 43370 52643 9918
510I918o07n6343P3271N2077j04222K1204R723k1776Q2537n3348l7941P2132l6731
$$ 9918 9311 -47032 26239 78316 -25906 -4702 5021 -16755 65782 12434 -25507 46625 9894
523I894K6596J6725p6820N4593k0399o2752P0320m1274k909N2222r3732O1853
$$ 9894 36490 53215 -23605 30988 10589 -52163 18157 -23117 -26026 26196 -67536 -5683
535e683P7617r3637L2090k1715m2996J35421n3491r4692Q5887j5769K3768N6509
$$ -5683 71934 -21703 10387 -11328 -54324 81097 27606 -67086 18801 3032 26800 83309
547H3309r9335p42O3531k150J6267m3452j4699N4941l627k75k3756j1361L9207
$$ 83309 -16026 -16768 46763 44613 60880 17428 2729 57670 54043 53768 30012 18651 57858
560E7858n8618R527O3774q4994J3672L4711p7354P7989J4551j08364M5551r637
$$ 57858 -760 8767 72541 -12453 1219 35930 -41424 36565 51116 -57248 -11697 -21334
572b1334o246Q6490j03498n4365R8604j0178L924j5915o8721N9566L4596j5505
$$ -21334 -27580 58910 -44588 -98953 -349 -10527 -6603 -22518 -91239 -31673 2923 -12582
584a2582L001n5663L4577N6045m6431J4192j1252k6111O0438k9150j2423N2988
$$ -12582 -9581 -65244 -30667 25378 -21053 -6861 -18113 -44224 16214 -12936 -25359 27629
596B7629n1484O88L4797k3887M2524k0729o4976M4115K1746O985j8155o9787M5541
$$ 27629 -23855 -23167 11630 -12257 30267 9538 -55438 -11323 10423 17408 -747 -70534 -24993
609b4993M1599k2339J9140o6393j3146J06749l0162l6297Q980m2115P1167K7259
$$ -24993 16606 -5733 13407 -52986 -66132 40617 10455 -25842 -16862 -58977 12190 39449
621C9449q6872L8352J3739l4008N5098j1228k1326L1159k0117J2776J8579j0534
$$ 39449 -47423 -9071 4668 -29340 25758 14530 -6796 24363 4246 17022 35601 25067
633B5067J7170l6816j4177M9989m51r96l4690l1089Q7510P519o0107J1776l2038
$$ 25067 42237 5421 -8756 41233 40782 39786 5096 -25993 61517 69036 8929 20705 -11333
646a1333K3180O5093o9576k6987K7911r723M6253k0811o3876L7389L626o687J5508
$$ -11333 11847 76940 7364 -19623 8288 -1435 44818 24007 -39869 -2480 1146 -5541 9967
659I967l8358K0005K1669l2345L1366K109k0869J5820m0549J4594N0609m9932
$$ 9967 -28391 -8386 13283 -19062 12304 14413 -6456 9364 -31185 -16591 34018 -15914
671a5914r885J0836j2478N9724q212n9959K4250J2858K6586J5685p5831J770N1732
$$ -15914 -25799 -14963 -27441 32283 24071 -35888 -11638 1220 27806 43491 -32340 -30570 21162
684B1162j6516n407k7283j8252M7298j294q233J5395k1080K0144J6867l3880M974
$$ 21162 4646 -761 -28044 -46296 1002 -292 -8525 6870 -14210 5934 22801 -11079 -6105
697f105j577j5528M238j5636K4216K8261l6625j052K3045J0301J6694m0945k6467
$$ -6105 -7682 -23210 -18972 -34608 -10392 17869 -18756 -19808 3237 13538 30232 -10713 -37180
710c7180M1970P723k529j0018l6256L2384L8802k5109j5669j0103J2900L6721
$$ -37180 4790 12513 9984 -34 -36290 -3906 34896 9787 -5882 -15985 -3085 33636
722C3636k0318k5498J2714N871O094j0018j2007J8236j952q272R551l100Q664
$$ 33636 13318 -12180 534 6405 12499 2481 -9526 8710 6758 -1514 8037 4937 13601
735A3601j817k9314M334J4123R55K562k4578O65M8681N443l1538j6004M864K4352
$$ 13601 11784 -17530 -13196 927 1882 4444 -20134 -19469 29212 34655 3117 -12887 -8023 16329
749A6329m392l5250o502J7167J9295N828j7684k619J5798P821k031j9107n447
$$ 16329 11937 -23313 -29815 -12648 6647 12475 -5209 -7828 7970 15791 13760 -5347 -10794
762a0794K1446n375j8602O781Q695K198q537j4009J7118K2039j2647j4309M187
$$ -10794 10652 5277 -13325 -6544 2151 4349 -4188 -18197 -1079 20960 8313 -5996 -1809
775a809J1100J0655r499k6613m735K3713J2882j6270j6499J0118K5983O694k4493
$$ -1809 9291 19946 10447 -16166 -20901 2812 15694 -576 -17075 -6957 19026 25720 1227
788A227j5381J6707J1267j2905j1572L322J1214N818p069o731O630R108m452j2090
$$ 1227 -14154 2553 13820 915 -10657 -7335 3879 9697 2628 -4103 2527 11635 7183 -4907
802d907j352J2864J0279j2296j9932J0307K2343r091k1320j895J4896J7323n801
$$ -4907 -6259 6605 16884 4588 -15344 -5037 17306 8215 -13105 -15000 -104 17219 11418
815A1418j9881M843J5954P09r449j6478l144J9763M546j7342m775J5036J4873
$$ 11418 -8463 -3620 12334 13043 3594 -12884 -16028 3735 8281 -9061 -13836 1200 16073
828A6073p346j9104L861J7141l070j7405n121J3165J0180p432j1218K27J2125
$$ 16073 8727 -10377 -6516 10625 7555 -9850 -14971 -1806 8374 942 -10276 -10049 2076
841B076R006j0647j4448M913J5829K963j8436j2917J5155J4350j0022j4863K990
$$ 2076 11082 435 -14013 -9100 6729 9692 -8744 -21661 -6506 7844 -2178 -17041 -14051
854a4051J8550N130j5157o348O051O169j31j4908o566J5421J0210k745j0223o64
$$ -14051 4499 9629 -5528 -11876 -5825 344 213 -14695 -21261 -5840 4370 1625 -8598 -9262
868i262K3353M805k4174o903J0207J0164l249k0673M554K2611J29m234n238j100
$$ -9262 14091 18896 -5278 -12181 -1974 8190 4941 -15732 -11178 11433 11562 7328 2090 990
882I90J8468j454j7971k195J214J1306M47k5323N261K1504k139n480j0227O039
$$ 990 19458 18004 33 -2162 -948 10358 10805 -14518 -9257 12247 10108 4628 -5599 440
896D40K3070j3501j7317O437R02Q483m173k0248J1053J3918L52j261j6626R110
$$ 440 23510 10009 -7308 -871 31 8514 4341 -15907 -4854 9064 9416 8155 -8471 639
910F39K4111j5057j4161J445P793J6376j7425j5550K1677L227k921k626j6340
$$ 639 24750 9693 -4468 -3023 4770 21146 3721 -11829 9848 13075 10154 7528 -8812
923h812J4525R803j7293L23o558M227K1103k2686j3252J9725O76O21j3368j3767
$$ -8812 5713 15516 -1777 -1454 -8012 -3785 17318 -5368 -18620 1105 1781 2402 -10966 -24733
937b4733K5844O49j9064K742l850J3817R578k4005K590J0180K498J0611k3194
$$ -24733 1111 1760 -17304 -14562 -18412 -4595 4983 -19022 -16432 -6252 -3754 6857 -16337
950a6337n943K9501n122m847l837r839L1113J09k8957J5118K593M66J0355k5466
$$ -16337 -22280 7221 2099 -2748 -6585 -16424 14689 14798 -14159 959 3552 4018 14373 -11093
964a1093O169K0870j7025N109l409j0514K6712r600k0360J2416k090J1351k807
$$ -11093 -4924 15946 -1079 4030 621 -9893 16819 7219 -13141 -725 -2815 8536 5729
977E729l1740K0553J8726j5630j256j1970R598K3585k0743n361M814m581K4453
$$ 5729 -26011 -5458 13268 -2362 -3618 -15588 -5990 17595 -3148 -8509 -3695 -8276 16177
990A6177q257k3405J7976M973N579j399k3765K3386J1012k5658J1535k355l060
$$ 16177 7920 -15485 2491 7464 13043 11644 -12121 11265 22277 -3381 8154 5799 2739
1003B739J8849k4830j612K4961j5544M133k719k0491K8803M290k7454J152k286
$$ 2739 21588 -3242 -4854 20107 4563 8696 5977 -14514 14289 18579 -8875 -7723 -10009
1016a0009J3585J0388k8876m460J2999R339O008k6054n7K1980q330O996q323j6168
$$ -10009 3576 13964 -14912 -19372 -6373 2966 8974 -17080 -17137 4843 -3487 3509 -4814 -20982
1030b0982L0265q176j5757K3646j7969N060K2494l4174J5187K6373k9057M692
$$ -20982 9283 1107 -14650 8996 -8973 -3913 18581 -15593 -406 25967 -3090 1602
1042A602j473l590L1001k6214k2091K6760j995Q820j344k9209J6506J1846k222
$$ 1602 129 -3461 27540 1326 -20765 5995 4000 12820 11476 -17733 -1227 10619 8397
1055H397J356l4670Q762L3135k2389l648O21p208K7148j1342j3371K1809j6665
$$ 8397 9753 -24917 -16155 16980 -5409 -9057 -8436 -15644 11504 162 -13209 8600 -8065
1068h065P03J2105k0787J6801L238k3031J5981n80Q780J6904l7147O342K9831
$$ -8065 -7362 4743 -16044 757 3995 -19036 -3055 -3635 5145 22049 -15098 -8756 21075
1081B1075j4444Q100k0352k4286M5288j787k4004J1266j6983K0798K7984l4832
$$ 21075 6631 14731 -5621 -29907 15381 13594 -10410 856 -16127 4671 32655 -2177
1093b177Q85O722j3076K0915j4774j9741J8689p172N106O970j1585K2299q827
$$ -2177 -1292 5430 -7646 13269 -1505 -21246 -2557 -9729 -4623 2347 -9238 13061 4234
1106D234k1030K7658l534q187J371k7248K3710K2200k7514P481o811m842M3903
$$ 4234 -16796 10862 7328 -859 512 -26736 -3026 19174 -8340 -859 -7670 -12512 31391
1119C1391j4616k9752J2543j017J9541j162l8086J6633J1215p878J8044j7537
$$ 31391 16775 -12977 -434 -1451 18090 16928 -21158 -4525 6690 -1188 16856 -681
1131f81m755K3100j5917M943M425k3623J5836n395j7787L0879m119j5828J2291
$$ -681 -5436 17664 1747 6690 11115 -12508 3328 -2067 -19854 11025 6906 -8922 3369
1144C369q675J6171J3651l5690n524J2890M520J0601k2452j2588K4638Q474L121
$$ 3369 -5306 10865 24516 -11174 -16698 -3808 712 11313 -11139 -23727 911 9385 12506
1157A2506j0995j7775J8836Q848p816k170j6847Q979J7195j7194J660O753p238
$$ 12506 1511 -16264 2572 11420 3604 1434 -15413 -6434 10761 -6433 -4773 1980 -5258
1170e258R018l991J243J5128j7937p058J0846n606R271n082k2015J4110J3582
$$ -5258 3760 -231 1012 16140 -1797 -8855 1991 -3615 5656 574 -21441 -7331 6251
1183F251L757O33k5825N238L0719j0920j6059n201j971K0060K744j6971M76L457
$$ 6251 10008 10641 -15184 -9946 20773 9853 -6206 -11407 -13378 6682 9426 -7545 -7069 -3612
1197c612P196N766j1191l486M577K329J532n723M091M310j2963J493Q496o73K882
$$ -3612 3584 9350 -1841 -5327 -750 1579 3111 -2612 1479 5789 -7174 -5681 2815 2142 5024
1212E024j2145n866K3390M079j3439n240n313J2231J3294j5700j3067M705J2435
$$ 5024 -7121 -12987 10403 14482 1043 -4197 -9510 2721 16015 315 -12752 -8047 4388
1225D388J0807j0653j4602N594J1762K509j1321o859R080K135k851K674k858J33
$$ 4388 15195 4542 -10060 -4466 7296 9805 -1516 -8375 705 2840 -11 2663 -195 -62
1239f2J853n610K904O279k876m175l459L596J1015j418j4708o637J3673J3248
$$ -62 1791 -3819 -915 5364 2488 -1687 -5146 -1550 9465 8047 -6661 -13298 375 13623
1253A3623j0094j2499J980Q659J1171n677j7696L626J0552J477M50j0185l020
$$ 13623 3529 -8970 -6990 1669 12840 7163 -10533 -6907 3645 5122 5572 -4613 -7633
1266g633J5838M48j0286R86J100K81j601m993N254O062n833n008M922R270l28
$$ -7633 8205 8653 -1633 -647 453 734 -867 -5860 -606 5456 -377 -5385 -463 8807 8479
1281H479r740m248K478P643L698j3958r058J1653R385j383r058p610J1982J2173
$$ 8479 -1261 -5509 -3031 4612 8310 -5648 -14706 -3053 6332 4949 -4109 -11719 263 12436
1295A2436r117q688K388L867K715l607o642J382N101r32l617J455M317J474k601
$$ 12436 3319 -5369 -2981 886 3601 -6 -6648 -5266 -165 -1097 -4714 -3259 1058 2532 -69
1310f9m290M071R803n426j2315L379R281J814o693r270L978J1547O5p673m449
$$ -69 -4359 -288 9515 4089 -8226 -4847 4434 6248 -445 -9715 -5737 5810 5875 -1798 -6247
1325f247M130R457R05p969m645N200Q096n139j0380K275M929o05l754l975P088
$$ -6247 -2117 7340 8245 276 -4369 831 8927 3788 -6592 -4317 612 7 -3747 -7722 -634
1340f34P079o506j715M708J163K028o284q883N938O130l329n708k791R728R528
$$ -634 6445 -61 -1776 2932 4095 6123 -161 -9044 -3106 3024 -305 -6013 -8804 924 10452
1355A0452p019p634L240Q318K245r379m018O441L081o87m928l921O581L236m623
$$ 10452 3433 -4201 -961 7357 9602 223 -3795 2646 5727 5040 112 -3809 2772 6008 1385
1370A385k498M9O603L384r650l171O985K568m393q140J492R747p40o211k817J572
$$ 1385 -1113 -1064 5539 8923 -727 -3898 3087 5655 1262 -6878 -5386 4361 3621 -2590 -5407 -3835
1386c835P014k531r104P18M069N929J259r397K812J0298k602n780n284J646R209
$$ -3835 3179 648 -8456 -7738 -3669 2260 3519 -5878 -3066 7232 4630 -1150 -6434 -4788 4421
1401D421n029o937O319M836K854k425p042M384L989k689k710o005M828R332p048
$$ 4421 -608 -7545 -1226 3610 6464 4039 -3003 1381 5370 2681 -29 -6034 -1206 8126 1078
1416A078o276Q85L391N873q941p181J1082K836k370j440o546O075M369j0178j032
$$ 1078 -5198 -4313 -922 4951 -3990 -11171 -89 2747 377 -1063 -7609 -1534 2835 -7343 -8375
1431h375J471L097Q690o492l870J0376J821k640n963m688J0316J815q209R35K929
$$ -8375 -6904 -3807 4883 -1609 -5479 4897 6718 4078 -1885 -6573 3743 5558 -2651 -1716 1213
1446A213O585K011r787P21M959Q33J745p890r00R966k890m559m815l966J0588
$$ 1213 7798 9809 22 743 5702 6535 8280 390 -510 9456 6566 2007 -2808 -6774 3814
1461C814k006j0948P040N296L090Q35j0716L728N528r683j375l157r09J2369k985
$$ 3814 1808 -9140 -2100 3196 6286 7121 -3595 133 5661 -4022 -5397 -8554 -9463 2906 -79
1476g9n206O146J691N887m560j2440R710N112o006L41n006O132Q155j1484q09
$$ -79 -5285 861 2552 8439 3879 -8561 1149 6261 255 596 -4410 1722 9877 -1607 -2416
1491b416K218k126J0348o482q622J1842r48j509j040j2643R821O269j3595M737
$$ -2416 -198 -2324 8024 1542 -7080 4762 3814 2305 1265 -11378 -1557 4712 -8883 -4146
1505d146J989n11R325j2053m941J1036o128n21J14m622J4576K634q585M123k229
$$ -4146 -2157 -2668 6657 -5396 -10337 699 -5429 -5950 -5836 -10458 4118 6752 -1833 2290 61
1520F1L281K047j5415O39P703J400M900q554K409J6312p073l550J323q121R374
$$ 61 3342 5389 -10026 -9387 -1684 -284 4616 -3938 -1529 14783 7710 4160 5483 -2638 6736
1535F736o42j2593P147j982o50Q109j3304K231J4452q739o1K897j288R311j0138
$$ 6736 6094 -6499 648 -1334 -1984 6125 -7179 -4948 9504 765 704 3601 2313 11624 1486
1550A486j0286R312l326r6N88r892J1596R437n279J530p618K814J2705j3578o081
$$ 1486 -8800 512 -2814 -2910 -2322 -12214 -618 8819 3540 5070 -2548 266 12971 -607 -6688
1565f688N989k128R116k460r995J0155o18l706L641q646M831O366j0061M775L081
$$ -6688 -699 -2827 6289 3829 -6166 3989 3371 -335 3306 -5340 -509 5857 -4204 571 3652
1580C652l131N269j0116k962J1925n154k202j380n551J5419K111j5660K673K802
$$ 3652 521 5790 -4326 -7288 4637 -517 -2719 -4099 -9650 5769 7880 -7780 -5107 -2305
1594b305L751N184j2159o89R186j594K851n218q167Q822J720l997M79j507P341
$$ -2305 1446 6630 -5529 -6218 2968 1374 4225 -993 -9160 -338 1382 -2615 -2136 -3643 3698
1609C698Q45p673O910J317o421N28m237L349O804p602j893K469K040Q817n850
$$ 3698 4543 -3130 3780 5097 -1324 -796 -5033 -1684 5120 -2482 -4375 -1906 134 8951 3101
1624C101j0919N586O763K768n967r320P145O507k335k369p246L570Q766n348l17
$$ 3101 -7818 -2232 4531 7299 1332 -7988 -843 5664 3329 960 -6286 -2716 6050 702 385
1639C85R23k977P238k763o048P348l670m724M422l102M276L946j0571O52Q214
$$ 385 1308 -1669 5569 2806 -3242 4106 436 -4288 134 -2968 1308 5254 -5317 -4665 3549
1654C549J472j394r094j786J0483J667n207n837r96R250L416m501m687k203R759
$$ 3549 5021 3627 -5467 -7253 3230 4897 -310 -6147 -7143 2107 5523 1022 -3665 -5868 3891
1669C891M319j0155n18L265j57L028m576j291N216n456o64N097j904K156j212
$$ 3891 8210 -1945 -2463 802 645 3673 -903 -2194 3022 -2434 -3098 1999 95 2251 1039
1684A039m901O379M035k383m447o949O031Q181o926o832j152N987R279n443p656
$$ 1039 -3862 2517 6552 4169 -278 -7227 -1196 6985 59 -6773 -7925 -1938 7341 1898 -5758
1699e758K933L928N643j601q900K277M616m66q98n506k82M038k684Q14L253J161
$$ -5758 -2825 1103 6746 5145 -3755 -1478 3138 2672 1774 -3732 -4014 24 -2660 -1846 1407 2568
1715B568K240l654R72P900m283p194k452r46P839K96j0170J448M872M536M483
$$ 2568 4808 1154 2126 10026 5743 -1451 -3903 -4849 2990 3286 -6884 -5436 -564 3972 8455
1730H455j0476o441R642L771k512n131m580P118M245n723k341q98Q65K830j481
$$ 8455 -2021 -8462 1180 4951 2439 -2692 -7272 -154 4091 -1632 -3973 -4871 -4006 -1176 -2657
1745b657N46K079l70P53j272J134L797m870m830K898M752L791n229q100N016O925
$$ -2657 -2111 -32 -402 351 -921 213 4010 -860 -5690 -2792 1960 5751 522 -7578 -2562 4363
1761D363j732n291m746M241R793J240m724l282J793M816k439p586l643J990M741
$$ 4363 2631 -2660 -7406 -3165 6628 7868 3144 -138 1655 6471 4032 -3554 -7197 -5207 -466
1776d66o4j744M539K363j427P2p88J079q97o602J07N287R24j362m821j885P487
$$ -466 -530 -2274 2265 4628 3201 3273 2485 3564 2667 -3935 -3828 1459 2383 1021 -3800 -5685 1802
1793A802M065m409m739J284Q847L724p301n730R45L824M18n844k080M210L615
$$ 1802 5867 1458 -3281 -1997 6850 10574 3273 -2457 -1512 2312 2730 -3114 -5194 -984 2631
1808B631K553j160k505K028l86l751j133J97J685p8l247K748N469j821o056l204
$$ 2631 5184 4024 1519 3547 3161 -590 -1723 -1526 159 81 -3166 -418 5051 3230 -2826 -6030
1824f030L221M551k350m918l4N347M850l395o721j029L558L527k580m989L322
$$ -6030 -2809 1742 -608 -5526 -5560 -213 4637 1242 -5479 -6508 -2950 577 -2003 -6992 -3670
1839c670O088K42k694k674J007K056k981j306K906K065J105j271p63L011K01l189
$$ -3670 2418 2660 -34 -2708 -1701 355 -2626 -3932 -1026 1039 2144 873 110 3121 3322 133
1855A33l393n08O135K855n163j831K976L814j77q139l001N613K014q37k166j123
$$ 133 -3260 -3768 2367 5222 59 -1772 1204 5018 4841 -3298 -6299 -686 1328 491 -1675 -2798
1871b798N270J865m338j993m89K307K052l719RM420P26k016l529O12M449k035
$$ -2798 2472 4337 -1 -1994 -2483 -176 1876 -1843 -1834 2586 3312 1296 -2233 -1621 2828 793
1887G93l008K320L583M378j083n413R67J751j264k762n449J407P126K89k730n54
$$ 793 -2215 105 3688 8066 6983 1570 2537 4288 3024 262 -5187 -3780 3346 3635 905 351
1903C51K568M007l533n729Q50J625Nk579l050K827J937k080j171j149L415M285
$$ 351 2919 6926 3393 -2336 -1486 139 144 -2435 -5485 -2658 -721 -2801 -3972 -5121 -1706 2579
1919B579l316j463K644J919P52n988m020M910J067j817n50k01O390L297m614l60
$$ 2579 -737 -2200 444 2363 3115 -2873 -6893 -1983 -916 -2733 -3283 -3484 2906 6203 1589 1229
1935A229K91N63J984n620k031N266K66l63k161k657N614q1o477Q35J835K518J403
$$ 1229 1520 2083 4067 -1553 -3584 1682 1948 1585 -576 -3233 2381 2300 -4177 -3342 -1507 1011 2414
1952B414n346J396M907k087j431l112j624N388p43l819O42J002M706L57n875K695
$$ 2414 -2932 -1536 3371 1284 -147 -3259 -4883 505 -238 -4057 -3415 -2413 2293 2650 -3225 -530
1968e30M271l02m63l290J611M056l760k471l20m03L865j616l711L718K888J456
$$ -530 3741 3439 2976 -314 1297 5353 1593 -878 -1198 -1601 2264 648 -3063 655 3543 4999
1984D999j781m890L679K825n140k539j232J934L791m412k153L682J142J719k336
$$ 4999 3218 -1672 2007 4832 -308 -2847 -4079 -2145 1646 -2766 -4919 -1237 -95 1624 -712
1999g12l445M784J654k594o90j941K940K780n044r78K343J419J813l973q42O129
$$ -712 -4157 627 2281 -313 -1003 -2944 -4 2776 -2268 -3246 -903 516 2329 -1644 -2486 3643
2015C643m8k065p85r56L951j23m957N8N82K175J298n523K40N271K22j341l428
$$ 3643 3595 1530 745 -211 3740 3617 -1340 -1282 -700 1475 2773 -2750 -2510 2761 2983 1642 -1786
2032a786M51N647k470m125J374J05K269K3m601J541K567j08J75l185J213N293
$$ -1786 -1335 4312 1842 -2283 -909 -804 1465 1488 -3113 -1572 995 887 1062 -2123 -910 4383
2048D383k115l175N88J464J521l068l054K378K113P97k024k281L978K228k714
$$ 4383 2268 -907 -319 1145 2666 -402 -3456 -1078 1035 1832 -192 -2473 1505 3733 1019
2063A019k378k106L106K878m735j602K293J539K267l614l303M513J223j780j040
$$ 1019 -1359 -3465 -359 2519 -2216 -3818 -1525 14 2281 -1333 -4636 -123 1100 -680 -1720
2078a720j155L858Q49m364M82L75J12J366l414P04M546J9J69k373j141N647k266
$$ -1720 -2875 983 1832 -2532 -2050 -1675 -1563 -197 -3611 -2907 1639 1658 1827 -546 -1687 3960 1694
2095A694o324J144J478K965M08m992K311L851p39J55m184j075N896o84k478M6
$$ 1694 -4630 -3486 -2008 957 1365 -3627 -1316 2535 1796 1951 -2233 -3308 2588 1904 -574 -528
2111e28l9M174j320n320L008R67j677J531j847K092M126l482j205J204K57K241
$$ -528 -567 3607 2287 -3033 -25 942 -735 796 -1051 1041 5167 1685 480 1684 1941 4182
2127D182l272l438L940K293k32l232l823L726K213k528j344j764M767N496m679
$$ 4182 910 -2528 1412 3705 3473 241 -3582 144 2357 -171 -1515 -3279 1488 6984 2305
2142B305j450J559k107J293l132m935L943P38q84L169o92K473K786m846n44K660
$$ 2305 855 2414 307 1600 -1532 -6467 -2524 -1786 -2670 499 -193 2280 5066 220 -324 2336
2158B336q06j429l811P35N158j377k603j047o3N419N49m345N95J120L001J363
$$ 2336 1530 101 -3710 -2975 2183 806 -1797 -2844 -2907 2512 3061 -1284 -689 431 3432 4795
2174D795p408j888L825j161n04j070p44M759P34j912J098j160j33o93l142K311
$$ 4795 -2613 -4501 -676 -1837 -2341 -3411 -4155 604 1338 -574 524 -636 -769 -1462 -4604 -2293
2190b293K211j343L37q43K379L526n002l624J953J556K959j819m276M342M533
$$ -2293 -82 -1425 -1088 -1931 448 3974 -1028 -4652 -2699 -1143 1816 -3 -4279 63 4596
2205D596j122k085l271N27L647q55k570q59J404K574p22j993M4Q17J023j080j71
$$ 4596 3474 1389 -1882 -1355 2292 1437 -1133 -1992 -588 1986 1264 -729 -685 132 1155 75 -96
2222i6L189m50k970o3L80Q90j056m027O75M399K278l06k965l80M306J065l790
$$ -96 3093 2643 -327 -390 -10 880 -176 -4203 -3528 871 3149 2843 -122 -502 3804 4869 1079
2239A079m020J73M649J157k775p00R17K449J045l183r02J383k42P99k41r07J599
$$ 1079 -2941 -2768 1881 3038 263 -437 480 2929 3974 791 -111 1272 1030 1829 1588 681 2280
2256B280j102k434J149J169l62j756j510L050L523j521l846j558K677K259k806
$$ 2280 1178 -1256 -107 1062 700 -1056 -2566 484 4007 2486 -1360 -2918 -241 2018 -788
2271g88l438r7L216L573j624l421N12K382J200j758k914R84K148l10n92j72M90
$$ -788 -4226 -4323 -1107 2466 842 -2579 -2067 315 1515 -243 -3157 -2173 -25 -335 -927 -1099 -609
2288f09K7j202L80J615K51p36j175R93K808m20l049k197R10L826Qm246o64L137
$$ -609 -582 -1784 -1404 211 462 -274 -1449 -456 2352 1932 -1117 -3314 -2404 1422 1430 -2816 -3480 -343
2306c43K910l27m135j164K938J149q44j932p60K523J124j236p43k32P60m0j315
$$ -343 2567 2240 -1895 -3059 -121 1028 184 -1748 -2508 15 1139 -97 -840 -1072 -312 -352 -1667
2323a667J179J640n97p97q8K240J635k863k296J234J870J219k298k928K210L114
$$ -1667 -488 1152 555 -242 -330 1910 3545 682 -1614 -380 1490 2709 411 -2517 -307 2807
2339B807L12j850k621J823L676j079k746q20J015J528j319k242O32J021n7k84
$$ 2807 3119 1269 -1352 471 4147 3068 322 -498 517 2045 726 -1516 -884 137 80 -204
2355b04P1J339M73j164o32N09J242n09k956n85K283J525r93k696L33L659J013
$$ -204 -133 1206 1679 515 -117 392 1634 1125 -1831 -2416 -133 1392 399 -2297 -1964 1695 2708
2372B708j812j834L81K887N39k518j222N29J729K67k632o04J739L26m87j093N59
$$ 2708 896 -938 -557 2330 2869 351 -871 -342 1387 1654 -978 -1582 157 483 -4 -1097 -538
2389e38K255q80j773R24Q51m6j717k241J202J655q62j296r08J868L027j238k250
$$ -538 1717 837 -936 -12 839 793 -924 -3165 -1963 -308 -1170 -2466 -3374 -1506 1521 283 -1967
2406a967K18J521J715j678k821J363J881k20q97j293J169K081r34q96P09R37R10
$$ -1967 -1749 -228 1487 -191 -3012 -1649 232 12 -885 -2178 -1009 1072 138 -758 -49 888 1798
2423A798j102j575J137J134j031j845j40K272J021j637j303R20K097k40k677o74
$$ 1798 696 -879 258 1392 361 -1484 -1624 648 1669 32 -1271 -351 1746 1506 -1171 -1845
2439a845J492J263l9j880k67K236O30j221j526m4K116K79j927J87J638J120n88
$$ -1845 -353 910 871 -1009 -1276 960 1590 369 -1157 -1201 915 1194 -733 -546 1092 2212 1624
2456A624j819N52J621n59j196o61R08J980o06k004j26J355J056j506k215J263
$$ 1624 -195 357 1978 1419 223 -438 470 2450 1844 -160 -286 1069 2125 619 -1596 -333
2472c33K052j50j519j290J293J217j695j451N7J005J460j144j191J497J037m20
$$ -333 1719 1569 50 -1240 53 1270 -425 -1876 -1819 -814 646 -498 -1689 -192 845 425
2488D25j390j221J574J277j456r14Q33J791O56k006r15J495J224l38j786j45K161
$$ 425 -965 -2186 -612 665 -791 -1705 -872 919 1575 -431 -1346 149 1373 1035 -751 -896 1265
2505A265L87j308j217l07J813K91j883L3J533J386j46k332O1J652j049j736q28
$$ 1265 1652 344 -873 -1180 633 924 -959 -926 607 1993 1847 -485 -424 1228 179 -1557 -2385
2522b385P49J996l17r41P40Q93J448p94k876Q10J672n25r26j625J244K686j714
$$ -2385 -1636 360 43 -898 -158 735 2183 1389 -1487 -677 995 470 -456 -2081 -837 1849 135
2539A35j260R23M07J670o72k284J656Q74q81p81j900J088J961k061n48J186Q14
$$ 135 -1125 -202 205 1875 1203 -1081 575 1449 568 -213 -2113 -1025 936 -1125 -1673 -487 327
2556C27J331j899j820J873J73r53q06j048K510J735j970k72M96O74P73k398j246
$$ 327 1658 -241 -2061 -188 -15 -968 -1774 -2822 -312 1423 -547 -819 -323 351 1124 -1274 -2520
2573b520J727O64M80r19p84K947Q31j972m54J06J252O5k531L33J384k09L26j333
$$ -2520 -793 -129 351 -568 -1352 1595 2426 454 0 106 1358 1423 -1108 -775 609 400 726 -607
2591f07j98K768j09j315j79K40J863q79l172O59J183j0k37j516J263K606m66o63
$$ -607 -805 1963 1854 539 360 600 2463 1584 -1588 -929 254 244 7 -1509 -246 2360 1894 1231
2609A231q01j98K080j312k577Q66Q00Q18o0j884J423J780j181o61o44M12J575
$$ 1231 430 232 2312 1000 -1577 -711 89 907 847 -1037 386 2166 985 324 -320 92 1667
2626A667j608j456J178O95J91j386j256J906R05j107p14n92J570J430k264j252
$$ 1667 59 -1397 -219 476 667 -719 -1975 -69 836 -271 -985 -1577 -7 1423 -841 -2093
2642b093R63J123P45j786j164K233Q07q99o14p63J064J009j236o94N69J178M44
$$ -2093 -1130 -7 738 -1048 -2212 21 828 -71 -685 -1448 -384 625 -611 -1305 -736 442 886
2659H86j568l21J623J54j205j060N63J666m32j652J8J173J089n79j906o7J907
$$ 886 -682 -1003 620 774 -431 -1491 -928 738 306 -1346 -1328 -155 934 355 -1551 -1618 289
2676B89Q90j494j569R07J674J16j320j210J241J628q79q43K57M86J067o99j387
$$ 289 1179 -315 -1884 -977 697 813 -507 -1717 -476 1152 273 -570 -313 173 1240 541 -846
2693h46J190P54q93l84r4J025Q85j393r54J079J406j21k161o84J901J024q64j880
$$ -846 344 1098 205 -179 -273 752 1637 244 -710 369 1775 1654 -507 -1191 710 1734 870 -1010
2711a010l44K424P45j651p18K6J300J237j835j211J330P24k60p40l26J101L24
$$ -1010 -1354 1070 1815 164 -554 -528 772 2009 174 -1037 293 1017 757 17 -309 792 1116
2728A116r03j96Q12P06r34r63P63Q09K94r25j875J260K204j056j695o83R36K262
$$ 1116 213 17 829 1535 601 -362 401 1210 1504 579 -1296 -36 2168 1112 -583 -1266 -330 1932
2746A932r21k739K63J612P66p31j769J45J359K14q19j054N41R00q00r6M49J21
$$ 1932 1011 -1728 -1465 147 913 182 -1587 -1442 -83 131 -688 -1742 -1201 -301 -1101 -1197 -748 -627
2764f27O71r31p87K028K21j757n49M2J606J111k217r90J776J568L43j845j527
$$ -627 44 -887 -1674 354 575 -1182 -1731 -1689 -83 1028 -1189 -2179 -403 1165 1508 -337 -1864
2781a864J490J619m72j962r61J835J201r70n66p6R22Q87j287k42J063o54m19J6
$$ -1864 -374 1245 773 -1189 -2150 -315 886 -84 -650 -726 196 1083 -204 -446 617 -37 -456 -440
2799d40j7J191j48j631M30J724P44q95j821J94K033O41j737j794J077K300J73
$$ -440 -457 734 586 -1045 -615 1109 1853 958 -863 -669 1364 2005 268 -1526 -449 1851 2024
2816B024j252j058N56J923j72k029m89O36N66m5r93J87J096k04o90K42P49r8j407
$$ 2024 772 -286 270 2193 2021 -8 -497 139 705 660 -333 -146 950 746 56 298 1047 949 -458
2835d58o41Q32R06m15j764l13K052J037q29j446m48J940J336j931j655M84J339
$$ -458 -1099 -267 639 224 -1540 -1853 199 1236 407 -1039 -1487 453 1789 -142 -1797 -1313 26
2852B6R39j262j271J180J213n0o25n26O28M17q58l00M35M01j71r94L41J544R0
$$ 26 965 -297 -1568 -388 825 775 150 -376 252 669 -189 -489 -54 347 176 -818 -477 1067 1157
2871A157j311q20P46J679m25k179m17J353J155m68j740k90J715J044q91j380P1
$$ 1157 -154 -974 -228 1451 1026 -1153 -1570 -217 938 470 -1270 -1560 155 1199 308 -1072 -1001
2888a001J221M88j008r47O54R28l85o85K88P21J92p57m40J126N93q70q92l8J230
$$ -1001 220 708 -300 -1247 -593 335 -50 -735 -447 274 466 -291 -731 395 988 118 -774 -812 418
2907D18P04j512j161J019J486K55j511r59J322J236o76j540n39J058Q03p82q23
$$ 418 1122 -390 -1551 -532 954 1209 -302 -1261 61 1297 621 -919 -1458 -400 403 -379 -1202
2924a202L15J025M92r07l63P47L15m28q45l9J258K6j256k6J092J032k69j375K12
$$ -1202 -887 138 630 -277 -640 107 422 -6 -851 -890 368 394 -862 -888 204 1236 967 -408 -196
2943a96J524L36r89j309K03J567P3j243n64Q73J474j26j436q8R07J77r02j070
$$ -196 1328 1664 675 -634 -431 1136 1209 -34 -598 275 1749 1623 187 99 1006 1183 281 -789
2961g89L12R03k74n97JP90P34q16r28K98P36J49j290q49J380J043n68p58l07J320
$$ -789 -477 426 152 -445 -444 346 1080 264 -664 -366 370 519 -771 -1620 -240 803 235 -523 -830 490
2981D90J043j395r37N54O74M70j049j036J319Q22n10m52k08R67N71j263o60L29
$$ 490 1533 138 -799 -245 429 899 -150 -1186 133 955 445 -7 -215 752 1323 60 -600 -271
2999b71M77j39j373j42J500K84m57n51nJ507p0j652k81K56O53L66j692o1J758
$$ -271 206 67 -1306 -1448 52 336 -121 -672 -677 830 760 -892 -1173 -917 -264 102 -1590 -1651 107
3018A07K92m18o19p7J602j27j483K04N43L98pj232J59J280o3o68n86L91J359m54
$$ 107 399 -19 -638 -715 887 760 -723 -519 24 422 415 -817 -658 622 559 -109 -695 -304 1055 601
3038F01j396J12Q28N17p19j077M08J019J27p62q54P62J006n64p21k18Q69R11r73
$$ 601 -795 -683 145 662 -57 -1134 -726 293 420 -342 -1196 -434 572 8 -713 -931 -62 849 -124
3057a24o34Q78M78J66o62r02J270R00j128m66L03R28O52j220p12J082N42k90q37
$$ -124 -758 120 598 764 102 -800 470 1370 242 -224 79 1007 1659 439 -273 809 1351 1061 224
3076B24n75J020P62q23r09K07J053K28j171m64P56N52l80r43K9Q43J67n58o00
$$ 224 -351 669 1431 608 -301 -94 959 1187 16 -448 308 860 480 -463 -434 409 576 18 -582
3095e82J79J065l0j174j94R87O65o86j121L69J149j01q95n70N14J027j85j197
$$ -582 -403 662 632 -542 -736 251 916 230 -891 -522 627 526 -369 -939 -425 602 417 -780
3113g80o0R14M46o66r60J25J037k1j018j43N81N35m2r94j98J263P3r62j74K83
$$ -780 -840 74 520 -146 -1106 -981 56 35 -983 -1126 -545 -10 -52 -1046 -1244 19 92 -870 -1044 -761
3133g61Q92K30j324k6J132J21l28p43j60J557K84j209k65O45R27j39j358J21J089
$$ -761 131 361 -963 -989 143 264 -64 -807 -967 590 874 -335 -600 45 972 833 -525 -404 685
3152F85J22l95q10O6J100k25q46j96L24J080j21j132N49R40j57o91r47L33P96
$$ 685 807 412 -398 -332 768 543 -303 -499 -175 905 784 -348 201 1141 984 293 -654 -321 475
3171D75n95o59J26Q85J106o41q62N82O48J05j028j203R70R21q52m70k29O83J236
$$ 475 -120 -779 -653 232 1338 697 -165 417 1065 1170 142 -1061 -91 830 -22 -492 -721 -38 1198
3190A198r71r60R23N69l7n86q61O62M35p69o25N9R32M05o27q7N30N71l2j595k21
$$ 1198 227 -733 190 759 722 136 -725 -63 372 -397 -1022 -963 -31 374 -253 -340 190 761 729 -866 -1087
3211a087J392j15n23k76N3J577M36j656k32M89K90K00j255m38J556O08n38n12
$$ -1087 305 190 -333 -609 -556 1021 1457 -199 -431 58 348 548 -707 -1145 411 1019 481 -31
3229c1J19Q04j73j048j81K82M22j74r50N17R38l87l80k90M20J272n77j358L90
$$ -31 88 892 719 -329 -510 -228 194 20 -930 -413 525 138 -242 -532 -112 1160 583 -775 -385
3248c85O64Q2o98j313K78J541L49p94k47Q37R20k25j112p71M64N66p38n54O53
$$ -385 279 361 -337 -1650 -1372 169 518 -276 -523 314 1234 1009 -103 -874 -410 156 -582 -1136 -483
3267d83N85K61k73m91O40N21j070n64O92N34Nq01n91Q75Q97p18j152J66J107P62
$$ -483 102 363 90 -401 239 760 -310 -874 -182 352 357 -444 -1035 -160 737 19 -1133 -967 140 902
3287I02m19j169O8J390J01j275n06L32Q16M65p78k58R10K28n59l47m1L81K7n97
$$ 902 483 -686 -618 772 873 -402 -908 -576 240 705 -73 -331 579 807 248 -99 -140 241 268 -329
3307c29R2R38L54q28p42N30Q23j82r71n64J010J295o10j274p7O79O22l96j336
$$ -329 -237 701 1055 227 -515 15 838 656 -315 -879 131 1426 816 -458 -535 144 766 370 -966
3326i66J23J383K88n33m85j9O48L4r58p7P12R6l12jL70L97l36j002rJ002K66p81
$$ -966 -843 540 828 295 -190 -209 439 473 -485 -562 150 246 -66 -67 303 700 364 -638 -647 355 621 -160
3348a60n22N03J238K88j351p81P82R13l47j133l97Q90Q37l74q52p0Q00K67m45
$$ -160 -682 -179 1059 1347 -4 -785 -3 910 563 -570 -967 -77 760 386 -466 -536 264 531 86
3367H6k82R5M32q8q54m2N22l55n11j77O01J026j98j020L44R76J73q05j168J7J226
$$ 86 -196 -101 331 243 -611 -653 -131 -486 -997 -1174 -573 453 255 -765 -421 555 728 -77 -1245 -1228 -2
3388bJ58r40m96N58J228J07r63l48P28N75l27p08N4M90Rl94l56L06M86n11l83
$$ -2 156 -784 -1280 -722 506 613 -350 -698 30 605 278 -430 -376 114 123 -271 -627 -321 165 -346 -729
3409g29N19N52K07o07n01P49Q02n38j000k48R24O62p02r50K45J098M83o80n66
$$ -729 -210 342 549 -58 -559 190 992 454 -546 -794 130 792 90 -860 -615 483 966 286 -280
3428b80N81Q23J52p11l89N44L19m37n36N9N07O5n75J0O95L29m01o19K90P12k41
$$ -280 301 1124 1276 565 176 720 1039 602 66 125 632 697 122 132 827 1156 755 136 426 1138 897
3449H97q29o01K12R89k97j144OP25O26j91j187K3J127m1n89l57L7Q33j3q98L2
$$ 897 68 -533 -321 668 371 -773 -767 -42 584 393 -794 -771 356 315 -274 -631 -594 239 226 -672 -640
3470f40M11Q5k09n08L24P75j43m73r9N60M76p24q07K58N78K46o45o85O75Q43k99
$$ -640 -229 -144 -353 -861 -537 238 95 -378 -477 83 559 -165 -972 -714 -136 110 -535 -1220 -545 298 -1
3491ao72l75N89P94m70o83J85N22K50n16o45M19N97j85l79K12P71L33n63l63K77
$$ -1 -673 -1048 -459 335 -135 -818 -633 -111 139 -377 -1022 -603 -6 -191 -570 -358 413 746 183 -180 97
3512I7M70k19p26j34P80O33k37p36J36Q99Q4p56n57L32P57q5o98j12L90K76k43
$$ 97 567 348 -378 -512 268 901 664 -72 64 963 1047 291 -266 66 823 738 40 -72 318 594 351
3533C51p43%Q20J79m29j40M01M43l88r50p3N82J19m84k54N58Q66R7p44l63N24
$$ 351 -392 -392 428 607 178 38 439 882 494 -456 -529 53 172 -312 -566 -8 858 955 211 -152 372
3554C72L38n11p29P0P37K67n43l81K31M87j4o26j39O69L70l53n27oN27k75p92
$$ 372 710 199 -530 -460 277 544 1 -380 -149 338 324 -302 -441 228 598 245 -282 -288 239 -36 -828
3575h28j59M39N60M8n38N6P59J54o50p92J98Q66j02n27M9M93N88l75r10J05L03
$$ -828 -987 -548 12 60 -478 -422 337 491 -159 -951 -753 113 11 -516 -467 26 614 239 -671 -566 -263
3596b63k7q7m17N28J065k89m82R0L9L20o19r00N86M91j25k01l92M73Q83m70n13
$$ -263 -290 -377 -794 -266 799 510 28 118 157 477 -142 -1042 -456 35 -90 -291 -683 -210 673 203 -310
3617c10K31N25N09n40p98L30K39l23m90m04O50Q70k03q4K99N30J63r40n93K27
$$ -310 -79 446 955 415 -383 -53 186 -137 -627 -1031 -381 489 286 202 501 1031 1194 254 -339 -112
3637a12J30j73m28O3Q97L58l43l53l1O22N2q99j56O00L40p4p26j78P00n3n06j71
$$ -112 18 -155 -583 -520 377 735 392 39 8 630 682 -217 -373 227 567 493 -233 -411 289 236 -270 -441
3659d41N3P86K24p46j16M81J51l28o84P5Q00l5m43j36K56M01l32o75m8N28M37
$$ -441 -388 398 622 -124 -240 241 392 64 -620 -545 255 220 -223 -359 -103 298 -34 -709 -757 -229 208
3680B08j79m50M75O73k59n64n11K10N91m58n59L63N50M90k45o62L60N83l93m22
$$ 208 29 -421 54 727 468 -96 -607 -397 194 -264 -823 -460 90 580 335 -327 33 616 223 -199
3700a99j60L44N35l88n65K17L97L8l95l81N50O83l25m35K5M65J48o55n44L66M85
$$ -199 -359 -15 520 132 -433 -216 181 219 -176 -557 -7 676 351 -84 -59 406 554 -101 -645 -279 206
3721B06O4l07k29M77N86l47o86pM38K59m68m66L48N99r4n42j25L93K68k71m40
$$ 206 270 -37 -266 211 797 450 -236 -243 195 454 -14 -480 -132 467 373 -169 -294 99 367 96 -344
3742c44J05N83jn70l21L53K74k36n26J3P62L47n61l23K99M86j6o94l91N15M51
$$ -344 -239 344 343 -227 -548 -195 79 -157 -683 -670 92 439 -122 -445 -146 340 324 -370 -761 -246 205
3763B05l18m30O4N21L76l26n00L00N55r0m16j24K68L40l45n55L02L93j04l85j69
$$ 205 -113 -543 -479 42 418 92 -408 -108 447 357 -59 -183 85 425 80 -475 -173 220 116 -269 -438
3784d38M73N23k71m64J40M98K06n65o05K43N77n2o00k65N25O54j84m38Q5L99K64
$$ -438 35 558 287 -177 -37 461 667 102 -503 -260 317 265 -335 -600 -75 579 395 -43 42 441 705
3805G05k90m88R6M14j69m21q4K44K77j97m09L76N91j40m57j55L68L67m03q47J5
$$ 705 415 -73 23 437 268 -153 -237 7 284 87 -322 54 645 505 48 -107 261 628 225 -622 -607
3826f07N88J99l44n06K35P48R2n62l40L44M83j39m50K7L65J35k91l89J38K49k51
$$ -607 -19 180 -164 -670 -435 313 405 -157 -497 -153 330 191 -259 -232 133 268 -23 -412 -274 -25 -276
3847b76k28J03M46M57l35l25M18K99j68o58n64N25N41m45m92L4N87M87m46n41
$$ -276 -504 -401 45 502 167 -158 260 559 391 -267 -831 -306 235 -210 -702 -668 -81 406 -40 -581
3867e81L26N26J70l68m43K47K98k74m59m7L43K51j41LM67L87j35n38o2L58m3m23
$$ -581 -255 271 441 73 -370 -123 175 -99 -558 -605 -262 -11 -152 -149 318 705 570 32 -30 328 285 -138
3889a38l58K36P96O0n68k15L02N09k00p60j48O51L88k62n09J02L86j0l85k25J72
$$ -138 -496 -260 536 596 28 -187 115 624 424 -336 -484 167 555 293 -216 -114 272 262 -123 -348 -176
3910a76M14j9k64J80K49ll20l92L63L98l30k58J15N00L93n78o28K89L75P7m25
$$ -176 238 219 -45 135 384 381 61 -331 32 430 100 -158 -43 457 850 272 -356 -67 308 385 -40
3931d0l90N43N74j95m56m02K14M05m27m24K45L76J68k46k93L02J22l87l13J80
$$ -40 -430 113 687 492 36 -366 -152 253 -174 -598 -353 23 191 -55 -348 -46 76 -311 -624 -444
3951d44L67J01l04j57L83L35l20n48l0N08L90j74m55K07O39m1n91l63M1M12P3
$$ -444 -77 24 -280 -437 -54 281 -39 -587 -617 -109 281 107 -348 -141 498 457 -134 -497 -456 -44 29
3972B9l84M7M90K95j49l68r4K45j27l93j09L53L03k79k29J95L99J01m31k43N34
$$ 29 -355 -308 182 477 328 -40 -134 111 -16 -409 -518 -165 138 -141 -370 -175 224 325 -106 -349 185
3993A85M58k20m21k60L04L06m66m25K11N38M18j69k43K86L07k00n45k51K19J02
$$ 185 643 423 2 -258 46 352 -114 -539 -328 210 628 459 216 502 809 609 64 -187 32 134
4013A34k12j19K31L47L5m20p7K51J76k34m72J20O08k1m73k59J79L92j37m43k8
$$ 134 -78 -197 34 381 416 -4 -81 170 346 112 -360 -240 368 347 -126 -385 -206 186 49 -394 -422
4034d22L28M18j31m86J48L25lj93k84J57N23k56l62J24O6J23k28m68L57M59j05
$$ -422 -94 324 193 -293 -145 180 177 -16 -300 -143 380 124 -238 -114 -48 75 -153 -621 -264 195 90
4055I0j03o1K77L58m15n66k2K44J66l46k95M55L91Q3k41k45L66K79m26j85N3J35
$$ 90 -13 -74 203 561 146 -420 -442 -198 -32 -378 -673 -218 173 256 15 -230 136 415 -11 -196 -143 -8
4077hK08l50k88L84J44r3o8j07M25L05l84k55J79K34l9m73j66L27K17j11k17o4
$$ -8 200 -150 -438 -54 90 -3 -71 -178 247 552 168 -87 92 326 287 -186 -352 -25 192 81 -136 -200
4099b00M54J50k99k97J16L42j4l79n0K85J13j76l30Q9L19l8k03j13K26L74k12
$$ -200 254 404 105 -192 -76 266 252 -127 -177 108 221 45 -285 -196 123 85 -118 -231 -5 369 157
4120A57l40Q6J72J66k46l80J83L98j06k05j44J93L88j67m03J16K67K6j84j95J17
$$ 157 -183 -97 75 241 -5 -385 -202 196 90 -115 -259 -66 322 155 -248 -132 135 161 -23 -218 -101
4141a01K81p0k95k1K25K06j82k63P8L24L4l27j95K91K17j60k97j1L26J89k32j82
$$ -101 180 110 -185 -206 19 225 43 -220 -142 182 216 -111 -306 -15 202 42 -255 -266 60 249 17 -165
4163a65J14K76J7k71k46K23K33j75k18Q2K62J25k09j89K22K31j41k53l6K51J62
$$ -165 -51 225 242 -29 -275 -52 181 6 -212 -130 132 257 48 -141 81 312 171 -82 -118 133 295
4184B95k90k25J34K33M1k65k44L52K64j14k17j22K93J54l44k50J75J57N0j90j38
$$ 295 5 -220 -86 147 188 -77 -321 31 295 181 -36 -158 135 289 -55 -305 -130 27 77 -113 -251
4205b51K45J72j59j96nK45J27j86j78K21K77j41l32p9K12P2k08j79J68L41J17
$$ -251 -6 166 7 -189 -194 51 178 -8 -186 35 312 171 -161 -240 -28 44 -164 -343 -175 166 283
4226B83k58j00J59K01j52m18k6K37J05k18j47J52K80j1k03m0K24K01j64j92j2
$$ 283 25 -75 84 285 133 -285 -311 -74 31 -187 -334 -182 98 87 -116 -156 68 269 105 -87 -99
4247i9J57jk83j51K26K54L2j74O5K50K03k82l23M8K45r7k58l7K21K87p0k42l1
$$ -99 58 57 -226 -377 -151 103 135 -39 26 276 479 197 -126 -78 167 70 -188 -225 -4 283 213 -29 -60
4270f0J88M9j93k27J43K63M8k66n8K31J46k54k21J15J61O0j62j57K38J76j34j54
$$ -60 128 177 -16 -243 -100 163 211 -55 -113 118 264 10 -211 -96 65 125 -37 -194 44 220 86 -68
4292f8j8J99K31j91k74J86J88r9k69k20K25K83j62j56J05K32J34k89k15O0N6l4
$$ -68 -86 113 344 153 -121 65 253 154 -115 -335 -110 173 11 -145 -40 192 326 37 -178 -118 -62 -96
4314i6k35m6K72J42o5r6j7K61J7l34n6K05J08k5k53k3L25P2k19j76J22L14O0k36
$$ -96 -331 -377 -105 37 -28 -124 -141 120 137 -197 -253 -48 60 35 -218 -241 84 156 -63 -239 -117 197 257 21
4338B1j27J86J79j69l42J9K24M6r4j24J17K43o8k19l4P6J17j52j86J45K22j7j92
$$ 21 -106 80 259 90 -252 -233 -9 37 -57 -181 -64 179 111 -108 -142 -66 51 -101 -287 -142 80 63 -129
4361a29j12K30K02j43j95K7K84J76k33k12J41J78L0k28j77K12L13r6j92k1J64
$$ -129 -241 -11 191 48 -147 -120 164 340 107 -105 36 214 244 16 -161 51 364 268 76 55 219
4382B19N8k62j82J34J13mk03NK80nj94j27L7K20J4l30j3J99J76m2k69m0L01J43
$$ 219 277 15 -167 -33 80 76 -127 -122 158 153 -41 -168 -131 89 103 -227 -240 -41 135 93 -176 -216 85 228
4406B28k37j87R3K53O3k03j40J42K40j17j65M6J18Q4j82j58J09J13j47j56oK18
$$ 228 -9 -196 -103 150 213 10 -130 12 252 135 -30 16 134 218 36 -122 -13 100 -47 -203 -209 9
4428IJ61k32j21J35J53k6k92k14K57J67j47j37l2K49K66j71j98J28J60Q6k44j45
$$ 9 170 -62 -183 -48 105 79 -213 -427 -170 -3 -150 -287 -319 -70 196 25 -173 -45 115 201 -43 -188
4450a88J78J21r3j03qK26K7j59k6J40J24Nl15J3K08J9j44k52O5L39k0l08k3J28
$$ -188 -10 111 18 -85 -93 133 160 1 -25 115 239 244 -71 -58 150 169 25 -227 -162 177 157 -151 -174 -46
4474d6J88k9k71n3K49R5q9j85K7K19J0j40j31J39J87j23j18J35R0M1j04j74K06
$$ -46 142 113 -158 -211 38 133 44 -141 -114 105 115 -25 -156 -17 170 47 -71 64 154 195 91 -83 123
4497A23J73k01j61k8J56J68j89k49J47K19J15k79j79K30Q9n7k18p2K04Q6j89k1
$$ 123 296 95 -66 -94 62 230 41 -208 -61 158 273 -6 -185 45 134 77 -141 -213 -9 77 -112 -133
4519a33M4O9J08j83j04K20N6r6p5mJ90O7k48q9J53J64m1k35l1J99J35j00k29l
$$ -133 -89 -20 88 -95 -199 21 77 -19 -94 -98 92 159 -89 -178 -25 139 98 -137 -168 31 166 66 -163 -166
4543a66K97J3j88q1N4J68L1k77j5J88J3q5r5N4J69N2k28l3K35L0j89j00K8J81
$$ -166 131 144 -44 -125 -71 97 128 -149 -164 24 37 -48 -143 -89 80 132 -96 -129 106 136 -53 -153 -125 56
4567E6J16k10j78K28J86j08j15j44J91J99j85j82P6J34L6j26j05J02J25j3j28
$$ 56 172 -38 -216 12 198 90 -25 -169 22 221 36 -146 -70 64 100 -26 -131 -29 96 83 -45
4588d5pJ67O5j73j08M5J38jk00k1K44N7r1j13k1K15L5j88j72J20J49l7j51o5J57
$$ -45 -52 115 180 7 -101 -56 82 81 -119 -140 104 161 70 -43 -64 151 186 -2 -174 -54 95 58 -93 -158 -1
4613aJ54p6j77O0J41j1j32j22J30J38j39j61R3J56J01j53q1J18J31l6k16j18J84
$$ -1 153 77 -100 -40 101 90 -42 -164 -34 104 -35 -196 -103 53 154 1 -80 38 169 133 -83 -201 -17
4636a7J39j17r5jK22J18k10p8P6N7j7j34r9J13J49j20o1L5J33R7k21j13J78P3
$$ -17 122 5 -90 -91 131 249 39 -39 37 94 77 -57 -156 -43 106 -14 -75 -40 93 190 -31 -144 34 107
4660A07j21j41k2J83M6j01n2P9J74jk11m9J02N8p0j37l2K16R1j30k4J12R7j6j98
$$ 107 -14 -155 -177 6 52 -49 -101 -22 152 151 -60 -109 -7 51 -19 -156 -188 28 119 -11 -35 77 174 158 -40
4685d0m4J23L0j18j39Q5J68L8j08n2J03J22q8j93l9J70M7j59q1J24J11L6j51O
$$ -40 -84 39 69 -49 -188 -103 65 103 -5 -57 46 168 80 -113 -152 18 65 -94 -175 -51 60 96 -55 -49
4709d9Q4J01q8j59L1R4P2j65o9J37J65q9j32J0J30M3j23j32Q1J27J7j28r0J65
$$ -49 35 136 48 -111 -80 14 86 -79 -148 -11 154 65 -67 -57 73 116 -7 -139 -58 69 86 -42 -132 33
4733C3J36j07r4k2J10P9j33j24R9Q1L4j53p3J52J31j33n9kQ7M1j49m4O9J11j9
$$ 33 169 62 -32 -54 56 135 2 -122 -23 58 92 -61 -134 18 149 16 -43 -45 42 83 -66 -110 -41 70 51
4758E1j21l5J91K4j18j11O3J68Rj93m9J43M2jj21l2J90L3j09m3j8J77J6j73n6
$$ 51 -70 -105 86 110 -8 -119 -56 112 121 -72 -121 22 64 63 -58 -90 100 133 24 -19 -37 140 156 -17 -73
4783g3J21Q7r0j10J0J67Jj77ON1J10q2j47J7J30O9j15j51N2J83k4j04j25J42J71
$$ -73 48 135 45 -65 -55 112 113 -64 -58 -7 103 21 -126 -109 21 90 -25 -176 -124 59 35 -69 -194 -52 119
4808A19j11j37L3J22P3j39p7J24R5k7q7o0J28J12j55j00O0J15K9j63n1J40L7k5
$$ 119 8 -129 -96 26 99 -40 -117 7 102 75 -12 -72 56 168 13 -87 -27 88 117 -46 -97 43 80 55
4832E5j45k1J44J1j12r5OJ86K2j61l4J25J10m0j63o4K47Jj21o9O3J86k5j10k9
$$ 55 -90 -111 33 44 -68 -163 -157 29 51 -110 -144 -19 91 51 -112 -176 71 72 -49 -118 -55 131 106 -4 -33
4857c3J23R2n6j41L4J55Lj18j02J08J45r7j51l2J58M8j20j01Q0Q3M7j48j44J53
$$ -33 90 182 126 -15 19 174 177 59 -43 65 210 113 -38 -70 88 136 16 -85 -5 78 125 -23 -167 -14
4881a4R9q7j29m7J10J36j60q3J30J20Oj12n9J91L0j23r5L6J32M8j96k9J18J39
$$ -14 85 -2 -131 -178 -68 68 -92 -175 -45 75 81 -31 -90 101 131 8 -87 -51 81 129 -67 -96 22 161
4905A61Rk12%J59N9j65j52MJ89j1j69l1J14O3K6j92k8J27N5j23j00O5J60Jj46
$$ 161 170 -42 -42 117 176 11 -141 -137 52 41 -128 -159 -45 18 44 -148 -176 -49 6 -117 -217 -152 8 9 -137
4930a37K1J06R9q2j62J26J20k0r2q8J42J51q2j15n6J69J75j72j84N9J47J8k13
$$ -137 -116 -10 89 7 -155 -29 91 71 -21 -109 33 184 102 -13 -69 100 275 103 -81 -22 125 143 -70
4953g0p2J24J24k3q6o1J49N4j96m2K9N3N0j47m8K18K4m7j17jK32Nj63n1O2J94
$$ -70 -142 -18 106 83 -3 -64 85 139 -57 -99 -70 -17 33 -114 -162 56 80 33 -84 -85 147 152 -11 -62 0 194
4979A94l7k51K0J53R5r1j62L7J85K8j14r1J9J00k9k13J5J67k0l7n6O8J11q0j33
$$ 194 157 -94 -74 79 174 83 -79 -42 143 171 57 -34 -15 85 56 -157 -142 25 5 -32 -88 -20 91 11 -122
5004a22k3J14R5j30j09PJ60R8j62j45J62J55Pj48j08J97J13j46j55J6J15N5j01
$$ -122 -145 -31 64 -66 -175 -168 -8 90 -72 -217 -55 100 107 -41 -149 48 161 15 -140 -124 -9 46 -55
5027e5l3J52O0Jj09l3Q1J5j98n5N0J82M6k05K2K04J7o3j71m1J81R3j80o7P5J26
$$ -55 -88 64 124 125 16 -17 64 79 -119 -174 -124 58 104 -101 -79 125 142 79 -92 -133 48 141 -39 -106 -31 95
5053I5L3j33q9R3R5n1r7J3J74p6p1o5P2J37o0j54R1Q1M2j04j79M8J52n1j30k0
$$ 95 128 -5 -94 -1 94 43 -54 -41 133 57 -14 -79 -7 130 70 -84 7 88 130 26 -153 -105 47 -4 -134 -154
5079a54J96J52q6j22j6P7P1j89j47Q8Q2M4o2r4J88J21r9p5K6J8P8j80q4J35O7
$$ -154 42 194 108 -14 -30 47 118 -71 -218 -130 -48 -4 -66 -160 28 149 50 -25 1 19 97 -83 -167 -32 35
5104C5n8q0m0J55J18j22j03J00J21lj64p9P1P8K3j64l2K05Q7j24oo0J30k5j01
$$ 35 -23 -103 -143 12 130 8 -95 5 126 123 -41 -120 -49 29 52 -112 -144 61 148 24 18 -42 88 63 -38
5129c8p7J97Pn9o3M7J44l6j42j13J26J22m8j26RJ52M6r6j12J6J31mj32o2R0J11
$$ -38 -115 82 89 30 -33 14 158 122 -20 -133 -7 115 67 -59 -50 102 148 52 -60 -44 87 83 -49 -111 -21 90
5155I0l7j41oJ54nj02n1Q0P3k4j08n4J21N4r4j17P5J23J1r5m2O0J04q2j13k6J36
$$ 90 53 -88 -94 60 55 -47 -98 -18 55 31 -77 -131 -10 44 -50 -167 -92 31 42 -53 -95 -35 69 -13 -126 -152 -16
5182a6J16j71r1Q3J19K7j36n5J51Kn7k6l9Q6J17j74k9Q5P0Lj12q0J41J17j03p8
$$ -16 100 -71 -162 -79 40 67 -69 -124 27 29 -28 -54 -93 -7 110 -64 -93 -8 62 65 -47 -127 14 131 28 -50
5208e0J3J19Jr2r6R8N7Rr1rJ28P9r7r6K3J31j7j40m0R2R6m5p9KJ12jr5m1P0J03
$$ -50 -37 82 83 -9 -105 -7 50 59 -32 -41 87 166 69 -27 -4 127 110 -30 -70 22 118 73 -6 -4 108 107 12 -29 41 144
5238A44k7j16m6J10N6p0j56J1J30K0q5m6Q4J08p2q7n0J06L6q9j02L5J29jr1n2
$$ 144 117 1 -45 65 121 51 -105 -94 36 56 -29 -75 9 117 45 -42 -92 14 50 -39 -141 -106 23 22 -69 -121
5264a21J25J17q4n9j7J32L1j66o5O4N7k0j13j1J52O0k2j08%J04K6k21n1P8Q4J
$$ -121 4 121 37 -22 -39 93 124 -42 -107 -43 14 -6 -119 -130 22 82 60 -48 -48 56 82 -139 -190 -112 -28 -27
5290b7j14J6J42L0r1o9K6J05j5j04rJ15R3p8j03J5J44j6j23m6P8J79j3j42J4N6
$$ -27 -141 -125 17 47 -44 -113 -87 18 3 -101 -110 5 98 20 -83 -68 76 60 -63 -109 -31 148 135 -7 7 63
5316F3P2m8j11L8J04J7j02j12N9P1n1p6l0J58Q0q7m3P2M8o8j20n5P3O4n0m2L1
$$ 63 135 87 -24 14 118 135 33 -79 -20 51 0 -76 -106 52 132 45 2 74 122 54 -66 -121 -48 16 -34 -76 -45
5343d5J58O4j19n4K9O1J0j53kJ19L2p3r0L0R9K4j28rJ03P3k9j58k1J08m2r3o9
$$ -45 113 177 58 4 33 94 104 -49 -51 68 100 27 -63 -33 66 90 -38 -47 56 129 100 -58 -79 29 -13 -106 -175
5370a75L8J51j7r6k2Q3R6j17j49N7J25M0p8m6Q5J15m9j45k3Q7R6n4p3P4R5J6j29
$$ -175 -137 14 -3 -99 -121 -38 58 -59 -208 -151 -26 14 -64 -110 -25 90 41 -104 -127 -40 56 2 -71 3 98 114 -15
5397a5o8R0L5n2n5J7J52jq2p2M4K4Oj30j9J67L5r1o6M1R0K9j61n4J13Q9J7j13
$$ -15 -83 7 42 -10 -65 -48 104 103 21 -51 -7 17 23 -107 -126 41 76 -15 -81 -40 50 79 -82 -136 -23 66 83 -30
5425c0NJ15N1r1j21K4J32j0r9J3O1J20r5j14M5J00j7n9j06O0J26m8j38m2Q4O6
$$ -30 -25 90 141 50 -71 -47 85 75 -24 -11 50 170 75 -39 6 106 89 30 -76 -16 110 62 -76 -118 -34 32
5451C2o4q6M2J94M1j32r8J00lp9j11qJ10R2o0k6N1R3L5j19n6P7M5m3j49L3J78
$$ 32 -32 -118 -76 118 159 27 -71 29 26 -53 -164 -172 -62 30 -30 -56 -5 88 123 4 -52 25 70 27 -122 -89 89
5478H9m8j23k3O0J47kj50O7J13Kl8j49n4J63nj23lO1J22jk08M2J34jo9j18J39
$$ 89 41 -82 -105 -45 102 100 -50 17 130 132 94 -55 -109 54 49 -74 -77 -16 106 105 -103 -61 73 72 3 -115 24
5505B4P0k6j02j5K8R5j15j33Q6J07Lk7r8J56R7p8j20k5O9Q2j24p6M8R4O3j29l7
$$ 24 94 68 -34 -49 -21 74 -41 -174 -88 19 22 -5 -103 53 150 72 -48 -73 -4 78 -46 -122 -74 20 83 -46 -83
5532h3J03R1m5p7l6J25L8j57o7L3Q0k2j16j4J50O8o2j21M7J29L2j51n5K6J32k
$$ -83 20 111 66 -11 -47 78 116 -41 -108 -75 5 -17 -133 -147 3 71 9 -112 -65 64 96 -55 -110 -84 48 46
5558D6j50qJ27L0j1r8j1J92l2j15K1N3N4k2j42K1J21j1o7r3N5J40J1j24k8Q2J48
$$ 46 -104 -112 15 45 34 -64 -75 117 85 -30 -9 44 98 76 -66 -45 76 65 -2 -95 -40 100 111 -13 -41 41 189
5585A89j43j39J3R8J3l7p2O7Q7j1j09kO5Q2q2r6Q4O1J2p2m8Q3O4m4j48O6J27M4
$$ 189 46 -93 -80 18 31 -6 -78 -11 76 65 -44 -46 19 101 19 -77 7 68 80 8 -40 43 107 63 -85 -19 108 152
5613A52j13j16R4R3o4j38k5R1J16r0j00O0J40L1j78m8N4Q9m9j26K4Q1N6q3j00
$$ 152 39 -77 17 110 46 -92 -117 -26 90 0 -100 -40 100 131 -47 -95 -41 48 -1 -127 -103 -22 34 -49 -149
5638a49O3J06Qp3o4J05R0r4j07j0R9K7j18m1N9J60kj03m7R8O4j01j13kJ37J8o3
$$ -149 -86 20 28 -45 -109 -4 86 -8 -115 -125 -26 1 -117 -158 -99 61 59 -44 -91 7 71 -30 -143 -145 -8 10 -53
5665e3k9P6R5l9j63J7J10K2j9q0P9R8Oj05p5Q5L8k0j13PJ61K3q4o4M3J20k3j06
$$ -53 -82 -6 89 50 -113 -96 14 36 17 -63 16 114 120 15 -60 25 63 43 -70 -63 98 121 37 -27 16 136 113 7
5693Gm0J07P7q0j10kR2Jj18jP6J61Nr0J8N9o8j40p1J2J29qr3L6J29N6j8j22m0
$$ 7 -33 74 151 71 -39 -41 51 52 -66 -67 9 170 175 85 103 162 94 -46 -117 -105 24 16 -77 -41 88 144 126 4 -36
5722c6R2Qp1j12N0J14j1j12q6J19O6o7r5J09J07l0p2j03O7J14j11j16R1K6J19
$$ -36 56 64 -7 -119 -69 45 34 -78 -164 -45 21 -46 -141 -32 75 45 -27 -130 -63 51 -60 -176 -85 -59 60
5747F0k4j31O3J02p1o9o5J24Q6jj05M1Q2Oj16j02L4P2J2o2l0J29Q1n5j02QN7j3
$$ 60 36 -95 -32 70 -1 -70 -135 -11 75 74 -31 10 92 98 -18 -120 -86 -14 -2 -64 -94 35 116 61 -41 -33 24 11
5775A1o3n3Q1Q6p9j01K4P2R0p2n4N4J17L5j25l4J6O3m8q3K0J53J3l7m0MR1q2q0
$$ 11 -52 -105 -24 62 -17 -118 -94 -22 68 -4 -58 -4 113 148 23 -11 5 68 20 -63 -43 110 123 86 46 50 141 59 -21
5804b1lN1K2k2n9J7R0Nq7m1RJ38p4r9JJ38kj00o7N4Q6j3l9l7R4O2k6q8k6O1K7
$$ -21 -24 27 49 27 -32 -15 75 80 -7 -48 -39 99 25 -74 -73 65 63 -37 -104 -50 36 23 -16 -53 41 103 77 -11 -37 24 51
5835E1p7n0P9P5l2o5J6O1K5o3o8J7Q2J0r3n2O8N3o2o6l2J09L8n5q9P9O9j1q0l2
$$ 51 -26 -76 3 78 46 -19 -3 58 83 20 -48 -31 51 61 -32 -84 -16 37 -25 -91 -123 -14 24 -31 -120 -41 28 17 -63 -95
5865i5O1K6j5p0K6R7J6q7mM4P1o5n8J8J10oo4n3L0M2J3q3l0O1R4m7n4M9K3L8q0
$$ -95 -34 -8 -23 -93 -67 30 46 -41 -45 -1 70 5 -53 -35 75 69 5 -48 -18 24 37 -46 -76 -15 79 32 -22 27 50 88 8
5896Hp7Q7K4o4m8j0J03J5k5n7M0R9mr3m4P7O1l6p4m9J23qn5m1O1P3j8n7qN1N6
$$ 8 -69 18 42 -22 -70 -80 23 38 13 -44 -4 95 91 -2 -46 31 92 56 -18 -67 56 48 -7 -48 13 86 68 11 3 54 110
5927A10m2j30M6N3j1m2o8J1J38p6l4J3K3N8n4p2M7O6l0q0o0R7O7q1j3j9R7N6n6
$$ 110 68 -62 -16 37 26 -16 -84 -73 65 -11 -45 -32 -9 49 -5 -77 -30 36 6 -74 -134 -37 30 -51 -64 -83 14 70 14
5956A4o3M4O5mp5n5P1O0p3o6O0Q8L1r4k1K7N9k4n8l2N4M9n3n0j7R7oq8nO5O7n
$$ 14 -49 -5 60 56 -19 -74 -3 57 -16 -82 -22 66 97 3 -18 9 68 44 -14 -46 8 57 4 -46 -63 34 28 -60 -65 0 67 62
5988F2j12N3J7%l2j00Q0Q3k2q1K2P4jm2n7K0M6j2pm4R2M0p0p1K0M6K2r9j5R8J8
$$ 62 -50 3 20 20 -12 -112 -32 51 29 -52 -30 44 43 1 -56 -36 10 -2 -9 -53 39 79 9 -62 -42 4 26 -73 -88 10 28
6019B8Pq8m1R4O6j22k2OR9L7r3n7N4N7k0p5MQ9Pl7l5J1P5pq2n3J01N8np9M7R3
$$ 28 35 -53 -94 0 66 -56 -78 -72 27 64 -29 -86 -32 25 5 -70 -66 23 30 -7 -42 -31 44 37 -45 -98 3 61 56 -23 24 117
6051A17k6n5o4M2N5oj03lJ19K7pj20J8R1J1j03m3P4P3q1o1rL9L8m1o1P5O0J0l1
$$ 117 91 36 -28 14 69 63 -40 -43 76 103 96 -24 -6 85 96 -7 -50 24 97 16 -45 -54 -15 23 -18 -79 -4 56 66 35
6081C5o1M9M7o5j13J0Q2N8p0l3O3M0K4q0o5R8M4j02o2N0N2M6r1l7N9N8j9o7LN5
$$ 35 -26 23 70 5 -108 -98 -16 42 -28 -61 2 42 66 -14 -79 19 63 -39 -101 -51 1 47 -44 -81 -22 36 17 -50 -47 8
6111HN7j03n8L1N9Kj00L8M9M8k0r1J3Q4Nn5q0N5J43j3j11L1K7P2q0j06pJ04M3
$$ 8 65 -38 -96 -65 -6 -4 -104 -66 -17 31 11 -80 -67 17 22 -33 -113 -58 85 72 -39 -8 19 91 11 -95 -102 2 45
6140D5n3m9Q1J17n6n1m6L8L0n4r9O1P3m7j6m8O5J32j05l4L4Q0J6q5p7K1P5rm7
$$ 45 -8 -57 24 141 85 34 -12 26 56 2 -97 -36 37 -10 -26 -74 -9 123 18 -16 18 98 114 29 -48 -27 48 39 -8
6169hm9J04O8n7k8j9P1Mj02m8R5L9o0m6m1J15L3r1m4J9Q4Mn3o8P3Q4m9o8k9O2
$$ -8 -57 47 115 58 30 11 82 86 -16 -64 31 70 10 -36 -77 38 71 -20 -64 -45 39 43 -10 -78 -5 79 30 -38 -67 -5
6199eL9l6o8L1N9M6j00o1P3M7j5o8J7O0L9p8k7rO0jr3PJ01J9n6n9J5J11Jr0p1
$$ -5 34 -2 -70 -39 20 66 -34 -95 -22 25 10 -58 -41 19 58 -20 -47 -56 4 3 -90 -83 18 37 -19 -78 -63 48 49 -41 -112
6230a12Q2O5m1o7K3K6R1n9o0L8Q0m1m3l1P6L5k2q3K8O5Ol1p3O5P6p0l1j7M5O4
$$ -112 -30 35 -6 -73 -50 -24 67 8 -52 -14 66 25 -18 -49 27 62 40 -43 -15 50 56 25 -48 17 93 23 -8 -25 20 84
6260H4q9n3K0N4M5n7p3Q3L8n8j2j4M4O8r9m3L2P1J2r0k9Q3L9n5m9RM1K6l3n4M6
$$ 84 -5 -58 -38 16 61 4 -69 14 52 -6 -18 -32 12 80 -19 -62 -30 41 53 -37 -66 17 56 1 -48 -39 2 28 -5 -59 -13
6291a3M7Kq7RK0Q9o1l4l2R2J6p3l0M9L9k5p9K2K4M2l9k6J2R3k9l6j9M2M7n2p2
$$ -13 34 36 -51 -42 -22 67 6 -28 -60 32 48 -25 -55 -6 33 8 -71 -49 -25 17 -22 -48 -36 57 28 -8 -27 15 62 10 -62
6322f2L8J9N3o3j2K8M6L1m7k2N5K3p1o6j2P2L1o0rK9M0l3j1j0M8no0k4PN3K2o1
$$ -62 -24 -5 48 -15 -27 1 47 78 31 9 64 87 16 -50 -62 10 41 -19 -28 1 41 8 -3 -13 35 30 -30 -54 -47 6 28 -33
6354c3k7M4O1n6n1K8K2O0p8m5N1N4j2o9K9M7Qm8j3J9J8k0k8l3N9L9Ol8k0O6j0
$$ -33 -60 -16 45 -11 -62 -34 -12 48 -30 -75 -24 30 18 -51 -22 25 33 -15 -28 -9 9 -11 -39 -72 -13 26 32 -6 -26 40 30
6385C0n1k2K4M1rl5k3P4J9ko1j1P0K3n7n7L4N1qn2kN5%l4k9L7K9J3p0j5M2qL6
$$ 30 -21 -43 -19 22 13 -22 -45 29 48 46 -15 -26 44 67 10 -47 -13 38 30 -22 -24 31 31 -3 -32 5 34 47 -23 -38 4 -4 32
6418C2o1j3R1j7jl3J9K3l2l1PjO8n9j4K6L0j8Jn5K4L7kp7L9L2%k9j9J0N4k0m9
$$ 32 -29 -42 49 32 31 -2 17 40 8 -23 -16 -17 51 -8 -22 4 34 16 17 -38 -14 23 21 -56 -17 15 15 -14 -33 -23 31 11 -38
6451c8jN9J2n8j6j1N5j9k0k1M4J3K1n6l7R1nk3k9M0oJ6n2J8N5j5K9p3MN3Kj9m7
$$ -38 -39 20 32 -26 -42 -53 2 -17 -37 -58 -14 -1 20 -36 -73 18 13 -10 -39 1 -5 11 -41 -23 32 17 46 -27 -23 30 32 13 -34
6484c4K0J6j8m3j6O8M4k7k7L0J6k7j1l9L6L9l3n0J9L6J0j6m3M2M6l6j2j1L5pk4
$$ -34 -14 2 -16 -59 -75 -7 37 10 -17 13 29 2 -9 -48 -12 27 -6 -56 -37 -1 9 -7 -50 -8 38 2 -10 -21 14 7 -17
6515a7nL9L6k6k2k7P8j4Qm2l2M8L9o1l2M5L9jo8NK6kk8k0jQ6j6n1K8k4M0jn1O
$$ -17 -22 17 53 27 5 -22 56 42 50 8 -24 24 63 2 -30 15 54 53 -15 -10 16 14 -14 -34 -35 51 35 -16 12 -12 28 27 -24 -18
6549a8M9Jl5%k5O7k0l4OJ9K3j1n3K4MK5l1j7J2K2J5o0J3RM3m1m6K9K8Nm5k7N0
$$ -18 31 32 -3 -3 -28 39 19 -15 -9 10 33 22 -31 -7 -3 22 -9 -26 -14 8 23 -37 -24 -15 28 -13 -59 -30 -2 3 -42 -69 -19
6582a9L6k1n6K2M3Pn4K0qL3k2j3m3O7N4l3j8m8R9np7mM2M3j6n8LM8Olm6J3N2j2
$$ -19 17 -4 -60 -38 5 12 -42 -22 -30 3 -19 -32 -75 -8 46 13 -5 -53 46 41 -36 -40 2 45 29 -29 -26 22 28 25 -21 -8 44 32
6616C2o9J3M5J1ro2J2O9nk6l5pO1jl4j7M2RL3q9JK4K0j9l2nQ0m5j7j1K3M2k4m2
$$ 32 -37 -24 21 32 23 -39 -27 42 37 11 -24 -31 30 29 -5 -22 20 29 62 -27 -26 -2 18 -1 -33 -38 42 -3 -20 -31 -8 34 10 -32
6650c2J8M1K3o1k2K5L3j8o2L2OJ8Mn8N3J4mk5k9N8rj8m0QN5%k5m5N9QL4o5j0O7
$$ -32 -14 27 50 -11 -33 -8 25 7 -55 -23 -17 1 5 -53 0 14 10 -15 -44 14 5 -13 -53 -45 10 10 -15 -60 -1 7 41 -24 -34 33
6684C3j5l4lKQ8l5m5jnO4po2K2O5k4m4m8K7N0Qq0pO6Ll7n6M7M1k0Ko6N3M6jo1
$$ 33 18 -16 -19 -17 71 36 -9 -10 -15 49 42 -20 2 67 43 -1 -49 -22 28 36 -44 -51 15 18 -19 -75 -28 13 -7 -5 -71 -18 28 27 -34
6719c4MQO9m4m8K6K1N0n9J3K8K4m1m2pL1K9l1p2P3M5J2k3l7L9J8l1m0JK6Rn4j0
$$ -34 -30 -22 47 3 -45 -19 2 52 -7 6 34 58 17 -25 -32 -1 28 -3 -75 -2 43 55 32 -5 34 52 21 -19 -18 8 17 -37 -47
6752d7K1P0m4m8K2K6L4j1m5k9N0L1r2J1N8K4j1j1j1K1M9n7n5pO5M4q6L4mM9j9
$$ -47 -26 44 0 -48 -26 0 34 23 -22 -51 -1 30 -62 -51 7 31 20 9 -2 19 68 11 -44 -51 14 58 -28 6 2 51 32
6783C2n8nM3J7p8lj3R1k0m9qP4K5m6n9L2L7on5k4K5J30n8n1KK5M4k8l5j2Q3rn8
$$ 32 -26 -31 12 29 -49 -52 -65 26 6 -43 -51 23 48 2 -57 -25 12 6 -49 -73 -48 82 24 -27 -25 0 44 16 -19 -31 52 43 -15
6816a5k1M3K8m5J%M5M1p7k3nP2l3l2m5O3L2m7k4jP1lm1k9J9J9Nm7j2P3Pm4qpP4
$$ -15 -36 7 35 -10 -9 -9 36 77 0 -23 -28 44 11 -21 -66 -3 29 -18 -42 -43 28 25 -16 -45 -26 -7 -2 -49 -61 12 19 -25 -33 -40 34
6851C4J0n2l6M2M2k4j4m5N1%K6o5J9N5j7l5k5K5K9km1oM5%jm8K3L8rl3l1N1J7
$$ 34 44 -8 -44 -2 40 16 2 -43 8 8 34 -31 -12 43 26 -9 -34 -9 20 18 -23 -29 16 16 15 -33 -10 28 19 -14 -45 6 23
6884B3k2l7K4Rj2j8KK6O7or3K8K2J1j6m4K1J8K2n5J4J6L9op4nO0Kk8m2L7L8J9
$$ 23 1 -36 -12 -3 -15 -33 -31 -5 62 56 -37 -9 13 24 8 -36 -15 3 25 -30 -16 0 39 33 -41 -46 14 16 -12 -54 -17 21 40
6917D0q9%O4nl0k0mL5K0n1J1K0M7j9n0jL8K6j8o6K0P8l7n3j0M1M3k2l6K0j5Q9
$$ 40 -49 -49 15 10 -20 -40 -44 -9 11 -40 -29 -9 38 19 -31 -32 6 32 14 -52 -32 46 9 -44 -54 -13 30 8 -28 -8 -23 66
6949F6o8j8L6lpl5J7J9K9n5J0j1J1L5m3j4N6K2m9m2JN5L0n1j5L4K1J1k8l4K0P
$$ 66 -2 -20 16 13 6 -29 -12 7 36 -19 -9 -20 -9 26 -17 -31 25 47 -2 -44 -43 12 42 -9 -24 10 31 42 14 -20 0 7
6981GL2k5j6J0K6k6l2K1J0L9n8KK7Qqnk3N1k4j5k1K8K9qo1L3j4L3Jm9K7Jkk3J4
$$ 7 39 14 -2 8 34 8 -24 -3 7 46 -12 -10 17 25 17 12 -11 40 16 1 -20 8 37 29 -32 1 -13 20 21 -28 -1 0 -2 -25 -11
7016a1K2J2jn5K0j7L8j3n1N4K5rJl3N3r%l8JmO4o1j7K2N5m6j7J0K3Rl3KK4pm2
$$ -11 11 23 22 -33 -13 -30 8 -5 -56 -2 23 14 15 -18 35 26 26 -12 -11 -15 49 -12 -29 -7 48 2 -15 -5 18 27 -6 -4 20 13 -29
7051b9J5pL0j2K4m8rO4k3nj7K0J2l4j8KJ7M3k8j5J1K9K9m7j0J7K1m5J2l5L5K2
$$ -29 -14 -21 9 -3 21 -27 -36 28 5 0 -17 3 15 -19 -37 -35 -18 25 -3 -18 -7 22 51 4 -6 11 32 -13 -1 -36 -1 21
7083B1J9j8kK0j1k7Kj5N3l7k3J4J8l4Qj4K1J2Nk6lN6j6j7k3k6J9J3l2J0M8K1l9
$$ 21 40 22 20 40 29 2 4 -11 42 5 -18 -4 14 -20 -12 -26 -5 7 12 -14 -17 39 23 6 -17 -43 -24 -11 -43 -33 15 36 -3
7116cJ5l3N8mk8Kk7K9J4j4m2J3L8On7M3J0J8n5Qj9L7pm9L2L4J0k2n4N1L5m4k9
$$ -3 12 -21 37 33 5 7 -20 9 23 9 -33 -20 18 24 -33 10 20 38 -17 -9 -28 9 2 -47 -15 19 29 7 -47 4 39 -5 -34
7149c4KL7L2k6n1O4j2L3o3J5K5J0n1j9OL8Qj1L9ORn8k0j6L8J9m7J0j9K8J8l9J8
$$ -34 -32 5 37 11 -40 24 12 45 -18 -3 22 32 -19 -38 -32 6 14 3 42 48 57 -1 -21 -37 1 20 -27 -17 -36 -8 10 -29 -11
7182a1K7K8k6k9k4O5j2k9l7k1P2qqL1k3M8j7l8J1J3K7k9k5j4M2j0rqJ0QJ9n6K0
$$ -11 16 44 18 -11 -35 30 18 -11 -48 -69 3 -5 -13 18 -5 43 26 -12 -1 12 39 10 -15 -29 13 3 -6 -14 -4 4 23 -33 -13
7215a3J8RJ9l2RK5j6o6pK4N9o1J0K1J2J1l7k8M7J8Ql5jK4J3n8k0J0O5ln5K6K6
$$ -13 5 14 33 1 10 35 19 -47 -54 -30 29 -32 -22 -1 11 22 -15 -43 4 22 30 -5 -6 18 31 -27 -47 -37 28 25 -30 -4 22
7248B2L3j2l6l5L2Kj2k1J4N6j0m9k0O5J1l7l7J8O1lq3nL7L3k4l7RO1J3l0k6l9
$$ 22 55 43 7 -28 4 6 -6 -27 -13 43 33 -16 -36 29 40 3 -34 -16 45 42 -41 -46 -9 24 0 -37 -28 33 46 16 -10 -49
7280d9M9K3l9k5M5K1j8j8mM5J2l7pOK4l8j1J2QK8oo7L0L8rop1N1M9mm8j5O3J6
$$ -49 0 23 -16 -41 4 25 7 -11 -15 30 42 5 -2 4 28 -10 -21 -9 -1 27 21 -46 -16 22 13 7 -64 -13 36 32 -16 -31 32 48
7314D8m5m8J8M5J4m5m2N6L2j2m6j9M8J5l4rj6O5nm9K4J6L8j6n7K2L2kj4n2L3N3
$$ 48 3 -45 -27 18 32 -13 -55 1 33 21 -25 -44 4 19 -15 -24 -40 25 20 -29 -5 11 49 33 -24 -2 30 28 14 -38 -5 48
7346D8l5n8LL5J8K1o6LR9m2k1QoK1k1p0M0J8Rk1j7K9N8k6m1j8K9K8j1lk5M7jl0
$$ 48 13 -45 -42 -7 11 32 -34 -31 68 26 5 13 7 28 7 -63 -23 -5 4 -17 -34 -5 53 27 -14 -32 -3 25 14 11 -14 33 32 2
7380Bl5M1K9j3n9M0K9nk5m2N1%Ok6n2K7O8j0o3QnN1m1j5K1O3k4l9k4O1J0l2j4
$$ 2 -33 8 37 24 -35 5 34 29 4 -38 13 13 19 -7 -59 -32 36 26 -37 -29 -34 17 -24 -39 -18 45 21 -18 -42 19 29 -3 -17
7413a7k2N3J9n1K9J8Qjm1j4M3j8kn8L5L3J3l0j3k9N2K0l0n3P7lk0p2K0M0olj8
$$ -17 -39 14 33 -18 11 29 37 36 -5 -19 24 6 4 -54 -19 14 27 -3 -16 -45 7 27 -3 -56 21 18 -2 -74 -54 -14 -20 -23 -41
7446d1J5M8j0j9oNN4q2j2K8P5l9k0j9K6M0jm3QJ6K4n5rK7L6m4m2J6K6K0nj5J8
$$ -41 -26 22 12 -7 -13 -8 46 -36 -48 -20 55 16 -4 -23 3 43 42 -1 7 23 47 -8 -17 10 46 2 -40 -24 2 22 17 2 20
7479B0Jj7j9j8J2K4j0k8L2K6J7l6j2LJ8mj5JL2kJ4l4k3N2lm6NOP1l3l7mL0lk1
$$ 20 21 4 -15 -33 -21 3 -7 -35 -3 23 40 4 -8 -5 13 9 -6 -5 27 25 39 5 -18 34 31 -15 -10 -4 67 34 -3 -7 23 20 -1
7514an0LP0Ml7NoLOm7J8RM4rj9l6P5m2mmK9j3Pn6L6M9K5n8k6J2L3nPk2lM5n0o
$$ -1 -51 -48 22 26 -11 -6 -12 -9 -3 -50 -32 -23 21 12 -7 -43 32 -10 -14 -18 11 -2 5 -51 -15 34 59 1 -25 -13 20 15 22 0 -3 42 -8 -14
7552a4qL6k8J6m2N2J3Lj6j6QNj2n1M6j4K7l4J5RM3m4k3MK5Rjl3K9M0k2k9j0J3
$$ -14 -22 14 -14 2 -40 12 25 28 12 -4 4 9 -3 -54 -8 -22 5 -29 -14 -5 38 -6 -29 -25 0 9 8 -25 4 44 22 -7 -17 -4
7586doJ4k6J8K4PqoJ4Jj2l7kJ9kj5nL3M1j5n5ORQmk5RK6k1mm0J5M9QJj4J2K1j3
$$ -4 -10 4 -22 -4 20 27 19 13 27 28 16 -21 -23 -4 -6 -21 -26 7 48 33 -22 -16 -7 1 -3 -28 -19 7 -14 -18 -58 -43 6 14 15 1 13 34 21
7625B1Jj1j9Rk1J9L4orJl8M5k3j4KlL2j0mj9J0J3j2k7K0M3l2Mn1N7J9m6Jj2K0
$$ 21 22 11 -8 1 -20 -1 33 27 18 19 -19 26 3 -11 -9 -12 20 10 6 -13 -3 10 -2 -29 -9 34 2 6 -45 12 31 -15 -14 -26 -6
7660fKK2o4O3%k7JnJ8L4m5m0P5K7m7j6Qk2L7Rm8L5mjj7qL9nj9j8j9K5K0k2J6k0
$$ -6 -4 18 -46 17 17 -10 -9 -14 4 38 -7 -47 28 55 8 -8 0 -22 15 24 -24 11 7 6 -11 -19 20 15 -4 -22 -41 -16 4 -18 -2 -22
7696b2QJj5L6KrJ0j9k0J2M6m4J6J1mmJ9l2POJ5rkMQKk6MK2j9j4oL6J8m2OJ5j7
$$ -22 -14 -13 -28 8 10 1 11 -8 -28 -16 30 -14 2 13 9 5 24 -8 -1 5 20 11 9 13 21 23 -3 1 23 4 -10 -16 20 38 -4 2 17 0
7734@Lk7j2L3PL7k7n3L4J3j2Rk0M9j4l4NkL6j0j5j7L5Pk2k2J6L8j7l2K1RkRl8
$$ 0 3 -24 -36 -3 4 41 14 -39 -5 8 -4 5 -15 34 20 -14 -9 -11 25 15 0 -17 18 25 3 -19 -3 35 18 -14 7 16 14 23 -15
7769a5J0JL9k2m3RM1k6j2lK7kqoOPk6Ll1L4N1n3Rj0M5J5l4m9J1L5J5j3l2M5Lk1
$$ -15 -5 -4 35 13 -30 -21 20 -6 -18 -21 6 4 -4 -10 -4 3 -23 -20 -51 -17 34 -19 -10 -20 25 40 6 -43 -32 3 18 5 -27 18 21 0
7805@l0K9J4J5m1RL3J3n6k3J6rL0m0J1kK9K3J0n1J4K1j1n8L8L0j1Lj6k9M9kl2
$$ 0 -30 -1 13 28 -13 -4 29 42 -14 -37 -21 -30 0 -40 -29 -31 -2 21 31 -20 -6 15 4 -54 -16 14 3 6 -10 -39 10 8 -24
7838b4K1J2J3m7OL9J6j0pk9%L9j9k8k2O0K2m2l0J4K0Kk0JjJ8mk0J4K2Nj9j0pN2
$$ -24 -3 9 22 -25 -19 20 36 26 19 -10 -10 29 10 -18 -40 20 42 0 -30 -16 4 6 -14 -13 -14 4 0 -20 -6 16 21 2 -8 -15 37
7873C7k6l3kQK2j2k3L7kKOm7M3J9Nn6oL0L6l1l3OM5Jm9JPL5l6Lk0M1J3l8m5L2
$$ 37 11 -22 -24 -16 6 -6 -29 8 6 8 14 -33 10 29 34 -22 -28 2 38 7 -26 -20 25 26 -23 -22 -15 20 -16 -13 -33 8 21 -17 -62 -30
7909c0K2J1k6j8L6L9l5j8LL2qJo0M5N0j1o0J6QM3k0k6k3N4K8o6k6O5Pm4kk4J5
$$ -30 -8 3 -23 -41 -5 34 -1 -19 -16 16 8 9 -51 -6 44 33 -27 -11 -3 40 20 -6 -29 25 53 -13 -39 26 33 -11 -13 -37 -22
7942b2M9j5j7J6J5l2j1j9N0j0oj7L2NK7o5J5rK0J6k3l1K8L7j0l3J7MK3l2l3L9
$$ -22 27 12 -5 11 26 -6 -17 -36 14 4 -2 -19 13 18 45 -20 -5 -14 6 22 -1 -32 -4 33 23 -10 7 11 34 2 -31 8
7974HPoonK4K3n4PNL7J3l4m8L0L9n7KnK6L1j4n5J9M4K1p1j7M8k6K0l9k7O4mlk3
$$ 8 15 9 3 -2 22 45 -9 -2 3 40 53 19 -29 1 40 -17 -15 -20 6 37 23 -32 -13 31 52 -19 -36 12 -14 6 -33 -60 4 0 -3 -26
8010b6K6N2j7l5K4k9L6l1k2j6M5K9l6k7jL7j0j2j8L8J1nn4K3L1k0m8NM8K6j4m9
$$ -26 0 52 35 0 24 -5 31 0 -22 -38 7 36 0 -27 -28 9 -1 -13 -31 7 18 13 -41 -18 13 -7 -55 -50 -2 24 10 -39
8042c9L7K4k6Kl2K5M2k4k1PJK7ll8J1kM5m4m2M9M4m8oK2MK4l6n8N0L3Pn0kN0k3
$$ -39 -2 22 -4 -2 -34 -9 33 9 -12 -5 -4 23 20 -18 -7 -9 36 -8 -50 -1 43 -5 -11 11 15 39 3 -55 -5 28 35 -15 -17 33 10
8077A0No7K0L5J3k0k9mM6kn5J6L4K5k8j3J9N0j5k2j6%K0J7j9n1M9kql7L3L3j8
$$ 10 15 -52 -32 3 16 -4 -33 -37 9 7 -48 -32 2 27 -1 -14 5 55 40 18 2 2 22 39 20 -31 18 16 8 -29 4 37 19
8110A9ok5M5K9n7kjMJ7l4l2K2K3Ml4KM4K1l0j1l0K2M9n0m2M8M3j8n9J3J8L0j4
$$ 19 13 -12 33 62 5 3 2 6 23 -11 -43 -21 2 6 -28 -26 18 39 9 -2 -32 -10 39 -11 -53 -5 38 20 -39 -26 -8 22 8
8143Hm2M2RRn2k0N6Mk3l9K0M5J5o0j1M3J6k0l6qK0O5k5m8L9jJ7m8Nl1Q2l3j4j7
$$ 8 -34 8 17 26 -26 -46 10 14 -9 -48 -28 17 32 -28 -39 4 20 0 -36 -44 -24 41 16 -32 7 6 23 -25 -20 -51 31 -2 -16 -33
8177c3N9ol1%nO3l2j3jJ6%j7k7O
$$ -33 26 20 -11 -11 -16 47 15 2 1 17 17 0 -27 -21
8191b1
$$ Imaginary data points
##PAGE= N=2
##DATA TABLE= (X++(I..I)), XYDATA
0@%%%%%%%%%%Nj3J6j6J6k4L2l7M5n4O2p2Q8j03J19j38J59j82K06k34K68l06L44
$$ 0 0 0 0 0 0 0 0 0 0 0 5 -8 8 -8 8 -16 16 -21 24 -30 32 -40 48 -55 64 -74 85 -97 109 -125 143 -163 181
33A81l86M34m86N42o04O72p43Q22r13J010j112J226j352J489j638J802j983K184
$$ 181 -205 229 -257 285 -319 353 -390 432 -481 529 -583 643 -709 780 -858 944 -1039 1145
51A145k408K656k934L250l613M033m524N107n811O681p783R220j1170J3955j8203
$$ 1145 -1263 1393 -1541 1709 -1904 2129 -2395 2712 -3099 3582 -4201 5019 -6151 7804 -10399
66a0399K5331l9165P4379l05167n11729R34870l84043j11105N17697o62225K28795
$$ -10399 14932 -24233 50146 -255021 -766750 168120 -215923 -327028 190669 -471556 -242761
77b42761N84180m74890J35915L6123l59563L27045M9641j99700Q7394m174O4921
$$ -242761 341419 -133471 2444 38567 -320996 6049 55690 -144010 -56616 -60790 4131
88D131p1592P5462K21572l02858L7841K27536j72162L42917k5186m83784L56862
$$ 4131 -67461 8001 229573 -73285 -35444 192092 19930 362847 337661 -146123 210739
99B10739O1710j82240K26445m07578n6488N02425j86603j4324j6096k87179L64040
$$ 210739 272449 90209 316654 -90924 -147412 355013 168410 154086 137990 -149189 214851
110B14851Q382l16034J33631j89743J18146K95606l87600J35272J69519l94172
$$ 214851 223233 -92801 40830 -148913 -30767 264839 -122761 12511 182030 -212142
120b12142K36862L7018l02352K70648j19259j46922L69992o8416m8956J03347
$$ -212142 24720 61738 -240614 30034 -89225 -236147 133845 65429 16473 119820
130A19820k22199R2965K05281j27250j64871n1256K22723Q7633j59098L0762j23645
$$ 119820 -102379 -9414 195867 68617 -96254 -147510 75213 162846 3748 34510 -89135
141h9135K7862K96495k49787j05169J99293j85254J73541J08279m17711J70959
$$ -89135 -61273 235222 -14565 -119734 79559 -105695 67846 176125 -241586 -70627
151g0627J22993l10140J69592J1869j53456K09394r5020n9094K29935j01445r4357
$$ -70627 52366 -257774 -88182 -76313 -229769 -20375 -115395 -174489 55446 -45999 -140356
162a40356J0113m9123J28637O332j07170J0106J7853J66446M1704j92735K7163
$$ -140356 -130243 -179366 -50729 -44397 -151567 -141461 -123608 42838 84542 -108193 -81030
173h1030N8182N2451J06490j81452m5022K06076l3207k4587r948r2903J03417
$$ -81030 -22848 29603 136093 -45359 -90381 115695 82488 57901 47953 -44950 58467
184E8467J8712p2612O9119k1072K1203N3327r4954L4253L3767p5925m603p5862
$$ 58467 77179 4567 73686 52614 73817 127144 32190 66443 100210 24285 19682 -56180
196e6180M5901J50510j34653o7311J09426J1360N7843n3607j36638R7888N6918
$$ -56180 -10279 140231 5578 -61733 47693 59053 116896 63289 -73349 24539 81457
207H1457l1568L647j02676K2615J28883m7043n9655k1466K7362R7300n1977n5462
$$ 81457 49889 53536 -49140 -26525 102358 55315 -4340 -25806 1556 98856 46879 -8583
219h583O6108J650N043k4205n9408O8837n603q4930K2843n873K4107M8602r3592
$$ -8583 57525 59175 64218 40013 -19395 49442 43839 -41091 -18248 -24121 -14 48588 -45004
232d5004k0231Q1041J7823K485p5418m5711J15811K3673q7160l9876k629O4713
$$ -45004 -65235 15806 33629 36114 -39304 -85015 30796 54469 -32691 -72567 -75196 -10483
244a0483J6410q4930o094M0231K6497L0056l7383j5038N6926J4751j8362l8604
$$ -10483 5927 -79003 -85097 -44866 -18369 11687 -25696 -40734 16192 30943 12581 -26023
256b6023j7121N6057j0651p6789Q707N6736K7078k5693l7716M5300O1218j5541
$$ -26023 -43144 12913 2262 -74527 -65820 -9084 17994 -7699 -45415 -115 61103 45562
268D5562m3137k6825K2438M5671j9524n5513j3290M4231M8389l5206o3800K1837
$$ 45562 2425 -24400 -1962 43709 24185 -31328 -44618 -387 48002 12796 -51004 -29167
280b9167N9675P600m5757k1905N3859L8027l4733l1168R68J5616N439l8282l2004
$$ -29167 30508 38108 -7649 -29554 24305 62332 27599 -3569 -2601 13015 18454 -19828 -51832
293e1832K2056L5139R516k9270k1065M9721M5475m0076n0504J6708M9039K964
$$ -51832 -29776 5363 14879 -14391 -35456 14265 59740 19664 -30840 -14132 34907 37871
305C7871n7024l0970L6203K4988k8794l5177J185M1098L8372r468k2816J9062
$$ 37871 -19153 -50123 -13920 11068 -17726 -52903 -51718 -10620 27752 18284 -4532 14530
317A4530M0573J344n6510m7406K4808L1982l3504l8017K6738N8962K1422l1468
$$ 14530 55103 56447 -63 -47469 -22661 9321 -24183 -62200 -35462 23500 44922 13454
329A3454j9446K8432K0893j8637l2476j5744K6208L4055j7798l9615K048L8588
$$ 13454 -5992 22440 43333 24696 -7780 -23524 2684 36739 18941 -20674 -18626 19962
341A9962J4915m3993l0921M6430M5726j8818l3165K673L4127N890m6867k6236
$$ 19962 34877 -9116 -40037 6393 52119 33301 136 2809 36936 42826 -4041 -30277
353c0277J9469K4021J1219k0789j7003L5751K6440k5299m1138j3979M3184K4245
$$ -30277 -10808 13213 24432 3643 -13360 22391 48831 23532 -17606 -31585 11599 35844
365C5844m7077j1953M5070K7697p833m4697j7429L6842O45k5508q033J029M3085
$$ 35844 -11233 -23186 21884 49581 41748 -2949 -20378 16464 17109 -8399 -16432 -15403 27682
378B7682K6447m1576k0476J4167J6901k148n3292q622O1109R246l0056j5435P366
$$ 27682 54129 12553 -7923 6244 23145 20997 -32295 -40917 20192 29438 -618 -16053 -8687
391h687K9990k1225m7010P157J9090J8748j85l5215J2272L1117j0589k7879m3146
$$ -8687 21303 78 -46932 -39775 -20685 -1937 -2122 -37337 -25065 6052 -4537 -32416 -75562
404g5562J4486N8503k0254k8378J7908K7290M0132l2987n7484L1587J2351j1798
$$ -75562 -61076 -2573 -22827 -51205 -33297 -6007 34125 1138 -56346 -24759 -12408 -24206
416b4206K074l0107K8886M6156k2225j072j1218K004N0221m1871l4048N2654K738
$$ -24206 -22132 -52239 -23353 22803 578 -494 -11712 -9708 40513 -1358 -35406 17248 19986
429A9986m299k4510m0543N7989J314o1704K2227O846L2751M9183n8040n861L4114
$$ 19986 15687 -8823 -49366 8623 9937 -51767 -29540 -22694 10057 59240 1200 -4661 29453
442B9453j7307J4744n9345n2314Q2721R823j7447K0953k0667O6770K9425p7010
$$ 29453 12146 26890 -32455 -84769 -2048 7775 -9672 11281 -9386 57384 86809 9799
454I799L1390K534k9873N2632m8973j3066P6830m6869n639K5672l9407N5781k493
$$ 9799 41189 43723 13850 66482 17509 4443 81273 34404 28765 54437 15030 70811 68318
467F8318p0376M6334J9288L292n828q1424K9033M4460m3984o707m6645J8207Q3865
$$ 68318 -2058 44276 63564 66856 61028 -20396 8637 53097 9113 2406 -44239 -26032 57833
480E7833o6679j3215K0047o4998P5443J727j05828P5429Q715k5803P3089p1757
$$ 57833 -8846 -22061 -2014 -67012 8431 10158 -95670 -20241 -11526 -37329 35760 -35997
492c5997J927P9365j04561R96N6127n4067L7648j1121k7436R1708j1283j8582
$$ -35997 -34070 45295 -59266 -58270 -2143 -56210 -18562 -29683 -57119 34589 23306 4724
504D724Q462o0411O3945K9653q9362L809j4860L0183O9252j04433j4841O9023
$$ 4724 13186 -47225 16720 46373 -42989 -39180 -54040 -23857 45395 -59038 -73879 -4856
516d856l5555M9799j2954p5313P8983o717l0786L9681p0866J9944L8881p3501
$$ -4856 -40411 9388 -3566 -78879 104 -6613 -37399 2282 -68584 -48640 -9759 -83260
528h3260O3969J7528m5190P2685m8011M461J08414r5207j9247N1680n4338R5378
$$ -83260 -19291 -1763 -46953 25732 -22279 -17818 90596 -4611 -23858 27822 -26516 68862
540F8862J789j31405R1644M0505l8496N3417p4195l0835R4944j1837j9124k0403
$$ 68862 70651 -60754 30890 71395 32899 86316 12121 -18714 76230 64393 45269 24866
552B4866k6649N7387j097l3001q103k0889L5324k3650k6547P3073n6634l3298
$$ 24866 -1783 55604 54507 21506 13403 -7486 27838 4188 -22359 50714 -5920 -39218
564c9218P5665n9556K1517N6551j14369K4015N7989m1670O2412n1880q2098J20783
$$ -39218 36447 -23109 -1592 54959 -59410 -35395 22594 -19076 43336 -8544 -90642 30141
576C0141J6317n0859R127m8271M5456O1101m8229p377k4118R762O8050n0987k3011
$$ 30141 46458 -4401 4726 -43545 1911 63012 14783 7406 -16712 -6950 61100 10113 -12898
589a2898K2650l3555M3948K90m8372N0284k7109l2404N4017k4113J889M388o7201
$$ -12898 9752 -23803 20145 20435 -27937 22347 -4762 -37166 16851 -7262 -5373 -985 -68186
602f8186L9827M3847k7555j2239m5697L3202O7708m4106o514j8424k5374J01540
$$ -68186 -28359 15488 -12067 -24306 -70003 -36801 30907 -13199 -19713 -38137 -63511 38029
614C8029r600q0573L2939r336L2602M9361r0807R960N9467m4931L2246J3586m6880
$$ 38029 28429 -52144 -19205 -28541 4061 53422 -37385 -27425 32042 -12889 19357 32943 -13937
627a3937L0664l592j1144K6036k1532k82j2488k2025N2032L066k9843j0087k2655
$$ -13937 16727 13135 1991 28027 6495 6213 -6275 -28300 23732 26798 -3045 -13132 -35787
640c5787O5234K3625q7549P057J3652j730N9966n2990n1688N9918J692J1666K05
$$ -35787 29447 53072 -34477 -27420 -13768 -15498 44468 -8522 -60210 -292 1400 13066 13271
653A3271o6564L6112L7803k6504J7173j8419J036M0432l2106P634K0210l7111
$$ 13271 -53293 -17181 20622 -5882 11291 -7128 -6092 34340 2234 9868 30078 -7033
665g033J2340j0244o072N5488l7636l2011M0960o861K8480O142p0535K2085L7006
$$ -7033 5307 -4937 -11009 44479 6843 -25168 15792 8931 37411 43553 -26982 -4897 32109
678C2109o764N964n9670j2525P0626j6235k8154j302j1780M5876J2440l1801J3856
$$ 32109 25345 31309 -28361 -40886 29740 13505 -14649 -15951 -27731 18145 30585 -1216 12640
691A2640j1535j863K1722l5756p591J7215j5257R913L230R961K9144l3210j4709
$$ 12640 1105 -758 20964 -14792 -22383 -5168 -20425 -10512 -7282 2679 31823 -1387 -16096
704a6096L4028q93l559k6897k7967M7058J7276k5613m265k0016K2100M2925l3888
$$ -16096 17932 17039 13480 -13417 -41384 5674 22950 -2663 -6928 -26944 -4844 38081 4193
717D193k7072R063J0878K7279j7454l5264J8939J3694l257n161j1841J5921O466
$$ 4193 -22879 -13816 -2938 24341 6887 -28377 -9438 4256 999 -4162 -16003 -82 6384
730F384j5190Q573R02l426J971k1975M355K5875k844k462r894j463M0108M03m5237
$$ 6384 -8806 -233 669 -2757 -786 -22761 -18406 7469 4625 2163 -7731 -9194 30914 31317 -13920
745a3920j1555J5170J9384l054l1293J651L0560J5131k291j9011n732J7308K740
$$ -13920 -25475 -10305 9079 6025 -25268 -23617 6943 22074 19783 772 -4960 12348 15088
758A5088j0459j4458m678K0948N71k0964Q152J3807k761o320p779J3473J9674
$$ 15088 4629 -9829 -14507 6441 7012 -13952 -5800 8007 5246 -1074 -8853 4620 24294
771B4294j6590j9474Q229J0916J646j1975k0384K980K7297J0392j9299j3970J4127
$$ 24294 7704 -11770 -3541 7375 9021 -2954 -23338 -20358 6939 17331 -1968 -15938 -1811
784a811K1339k540k7140j3514K0110J3721j4845j0539R206J2325K493q758o560
$$ -1811 19528 16988 -10152 -23666 -3556 10165 -4680 -15219 -6013 6312 8805 47 -6513
797f513O698P602n888j0715K105J2910N533j2658j5354J1436K2301r788k1831
$$ -6513 185 7787 1899 -8816 -6711 6199 11732 -926 -16280 -4844 17457 7669 -14162
810a4162N540J9326J0717r556k0190M570J8003l957j3649q740K901K0115N600
$$ -14162 -8622 10704 21421 11865 -8325 -3755 14248 10291 -3358 -12098 -9197 10918 16518
823A6518j8241l331J6742R346j1704j8556M382J7748m361j7581o66J5711Q386
$$ 16518 -1723 -5054 11688 21034 9330 -9226 -4844 12904 8543 -9038 -9704 6007 14393
836A4393j0519j0985L986J1448M172j2252j2829P756J4795j732j7654q630J7355
$$ 14393 3874 -7111 -3125 8323 12495 243 -12586 -4830 9965 8233 -9421 -18051 -696
849f96J4482j2761j4104O773J6719J322j8371o968J0420N244k833j0012k889J7607
$$ -696 13786 1025 -13079 -6306 10413 11735 -6636 -13604 -3184 2060 -773 -10785 -13674 3933
863C933R570q980r210n2J5887K186k6872o578J7467P571m927j4886M119K4592
$$ 3933 13503 4523 -4687 -4739 11148 13334 -13538 -20116 -2649 4922 -5 -14891 -10772 13820
877A3820k601j4129k192j161J1332q80k1619K10R491N773K282j8698L248K6914
$$ 13820 11219 -2910 -5102 -6263 5069 4189 -17430 -17220 -7729 -1956 326 -18372 -15124 11790
891A1790m717j2448k769L467J8190j0502k2830J2252Q501J159O78j5251R949K0244
$$ 11790 7073 -5375 -8144 -4677 13513 3011 -19819 -7567 934 2093 2771 -12480 -2531 17713
905A7713o801n552q442L348K2717j4134k0424J0420Q960Q837j1402j8760K2038
$$ 17713 10912 5360 -3082 266 22983 8849 -11575 -1155 7805 16642 5240 -13520 8518
918H518R042j4898q95r477P671J5452j9425l771O913q85J6824j4096j9619K4701
$$ 8518 17560 2662 1767 -7710 -39 15413 -4012 -7783 -870 -1755 15069 973 -18646 6055
932F055M919j0452m467j0189K1575R175k5252M562P966M579J0662k1337l278K0075
$$ 6055 10974 522 -3945 -14134 7441 16616 -8636 -4074 3892 8471 19133 -2204 -5482 14593
946A4593l318K110j2535j1532L0361j032j9484M039o300J7622P120l5813Q953
$$ 14593 11275 13385 850 -10682 19679 18647 -837 3202 -3098 14524 21644 -14169 -5216
959e216J5744j2116P036j5618n157K7114j5800q517R358j2877J7037P17k8128
$$ -5216 10528 -1588 5448 -10170 -15327 11787 -4013 -12530 -3172 -16049 988 1705 -26423
972b6423J4856P760k677L761k4742J2907K9184k1815p176L056L084K2571j6826
$$ -26423 -11567 -3807 -6484 -2723 -27465 -14558 14626 -7189 -14365 -11309 -8225 14346 -2480
985b480j5777J7233k236J1885P01k7907J6924J4557q897Q85j8061J1528K1036
$$ -2480 -18257 -1024 -3260 8625 9326 -18581 -1657 12900 4003 4888 -13173 -1645 19391
998A9391k9316K053J3302j2111J4730j1633j3443L0064j0403j1855J0291j6821
$$ 19391 -9925 -7872 5430 -6681 8049 -3584 -17027 13037 2634 -9221 1070 -15751
1010a5751J7521J4345l3028J831J3209M712J0631k3374o708K4989N179m29j7439
$$ -15751 1770 16115 -16913 -15082 -1873 2839 13470 -9904 -16612 8377 13556 13127 -4312
1023d312n215K8887n858p875L583j6187K2128O729k7982K0926j704j3543K6598
$$ -4312 -9527 19360 13502 5627 9210 -6977 15151 21880 -6102 14824 13120 -423 26175
1036B6175k3256n956L5116k9185j0838J6675j0866J9220j1999l2022L2010P931
$$ 26175 2919 -3037 32079 2894 -7944 8731 -2135 17085 5086 -26936 5074 13005
1048A3005j1448L693k4723R825K2702j5108k752j7866Q48M0099j8295j8689J6057
$$ 13005 1557 5250 -19473 -9648 13054 -2054 -4806 -22672 -21824 18275 -20 -18709 -2652
1061b652o035J6650j2k5650K0516l535j3546J9948j4408K684J6410k4399J0835
$$ -2652 -8687 7963 7951 -17699 2817 -718 -14264 5684 -8724 -6040 10370 -14029 -3194
1074c194J3662q057J3283k6024q377L8741j6509j2146n8k2409L7896J3931l9943
$$ -3194 10468 2411 15694 -10330 -18707 20034 3525 -8621 -8679 -31088 6808 20739 -19204
1087a9204J2664K808K364K8659l3793j6043K3891j3063R707Q90k4665K2810P057
$$ -19204 -6540 -3732 -1368 27291 -6502 -22545 1346 -11717 -2010 -1120 -25785 -2975 4082
1100D082o778J3504j1857Q291M057k7100K1598Q342k3014P561j1354J1324L1468
$$ 4082 -2696 10808 -1049 7242 11299 -15801 5797 14139 -8875 -1314 -12668 -1344 30124
1113C0124l0207n742J4499j0891K9628n596m3314J7878J1824J364M194l4154J0112
$$ 30124 -83 -5825 8674 -2217 27411 21815 -21499 -3621 8203 9567 13761 -20393 -10281
1126a0281K9047j6193P317n130j6391K4598q808j2137J3485j9861O561J3408k0381
$$ -10281 18766 2573 9890 4760 -11631 12967 4159 -7978 5507 -14354 -7793 5615 -14766
1139a4766K2753Q230k7556J2837J944j226J3649l1140j0289K7950K436J607j2360
$$ -14766 7987 16217 -11339 1498 3442 2216 15865 -15275 -25564 2386 4822 6429 -5931
1152e931j3503K8153J0296j2282q389j4374J5512J4654j6776l970n420M150K1224
$$ -5931 -19434 8719 19015 6733 -1656 -16030 -518 14136 -2640 -6610 -12030 -7880 13344
1165A3344j4357p818J4660p085L062K943p326J1100j1572j3723J7490j217r77
$$ 13344 -1013 -8831 5829 -1256 1806 4749 -2577 8523 -3049 -16772 718 -499 -1476
1178a476K938j7635J2659K0487p753m895j6088m9L0930j0426k5337M825N790J4621
$$ -1476 1462 -16173 -3514 16973 9220 4325 -11763 -11812 19118 8692 -16645 -11820 -6030 8591
1192H591M592k0514J32J0737K597K683j0597n554Q794K035m94m050k29N971r421
$$ 8591 13183 -7331 -7199 3538 6135 8818 -1779 -7333 1461 3496 3002 -1048 -1277 4694 -4727
1207d727j326J2641k565k382m569n613J9605M942k1155m002L393Q143J0913j5489
$$ -4727 -6053 6588 4023 1641 -2928 -8541 11064 16006 -5149 -9151 -5758 2385 13298 -2191
1221b191j3595J1869J2596L769j1947j4476Q518J3029j796j1338n869J0687N314
$$ -2191 -15786 -3917 8679 12448 501 -13975 -5457 7572 5776 -5562 -11431 -744 4570
1234D570o395J002n45k104L226l110O61O693l814n083L16L701P612l101j3427
$$ 4570 -1825 -823 -1368 -3472 -246 -3356 -2695 3998 184 -4899 -4583 -882 6730 3629 -9798
1249i798j982J4766J0822j1979j3511O952J0784M615o884j5920M849J5631j528
$$ -9798 -11780 2986 13808 1829 -11682 -4730 6054 10669 3785 -12135 -7286 8345 6817
1262F817m435n576k829J4073J877j4471N29M995p84j03k532L789O424n768n163
$$ 6817 2382 -3194 -6023 8050 9927 -4544 -4015 980 196 93 -2439 1350 7774 2006 -3157
1277c157N675O708l161j0771k467O372N437Q08j0976o723J4396R953o801q777
$$ -3157 2518 9226 6065 -4706 -7173 -801 4636 5444 -5532 -12255 2141 12094 5293 -3484
1291c484l513J0566J0647j1684j1449N523N652J71l711n167K698O426o24l898
$$ -3484 -6997 3569 14216 2532 -8917 -3394 2258 2429 -1282 -6449 -3751 2675 2051 -1847
1305a847J530M154k67l468k899K713O695n281j2082M689J0989j319p894n678N529
$$ -1847 -317 3837 3570 102 -2797 -84 6611 1330 -10752 -6063 4926 3607 -4287 -9965 -4436
1320d436J1435j981r868k050N814P255j861r604l163O050O115n325j0056L930
$$ -4436 6999 5018 -4850 -6900 -1086 6169 4308 -5296 -8459 -2409 3706 -1619 -11675 -7745
1334g745Q279j242k983r71N761O804p047m728N938K64k018l838o310P045Q508
$$ -7745 534 -708 -3691 -4662 1099 7903 856 -3872 2066 2330 312 -3526 -9836 -2791 5717
1349E717m495m591J167Q383P250q893r084N254P363o03r324l879Q326L379l792
$$ 5717 1222 -3369 -2202 6181 13431 4538 -4546 708 8071 7468 -1856 -5735 2591 5970 2178
1364B178l767k236O101M064o142k489K433L968J926q931l942Q591K140n789m990
$$ 2178 -1589 -3825 2276 6340 198 -2291 142 4110 6036 -2895 -6837 1754 3894 -1895 -6885
1379f885K704R775j078q419n67L453N112j534q540K690P543K637l23q106J56J0263
$$ -6885 -4181 5594 4516 -3903 -4470 -1017 4095 2561 -5979 -3289 4254 6891 6568 -1538 -1382 8881
1395H881m176q810j119K820Q179k628q450O907N729k460l537o591K763N523n044
$$ 8881 4705 -4105 -5224 -2404 5775 3147 -5303 1604 7333 4873 1336 -5255 -2492 3031 -2013
1410b013l117j740L135Q596o790q457M779L934L058n512p337J1451N355p684j165
$$ -2013 -5130 -6870 -3735 4861 -1929 -10386 -5607 -1673 1385 -4127 -11464 -13 5342 -2342 -3507
1425c507k998L260O823q919j711P761K075N377m218p264R460J804p740l412k072
$$ -3507 -6505 -3245 3578 -5341 -7052 709 2784 8161 3943 -3321 6139 7943 203 -3209 -5281
1440e281Q704M358r934P40N882K171K60r539j270P911j276j420m599k706R606
$$ -5281 3423 7781 -2153 -1413 4469 6640 6900 -2639 -3909 4002 2726 1306 -3293 -5999 3607
1455C607k101q448m3n78Q651K818j1276O464Q929l187j360q632n5R038q306k893
$$ 3607 1506 -6942 -6985 -7563 1088 3906 -7370 -906 8023 4836 3476 -5156 -5211 3827 -4479 -7372
1471g372N286J59J0318J74r505O243K389j307k550j1344P385R614r596j192L02
$$ -7372 -2086 -1927 8391 8565 -940 5303 7692 6385 3835 -7509 -124 9490 -106 -1298 -996
1486i96J641Q078j0441n187Q348k409M866j543j1844J0593L096q831J479p242
$$ -996 645 8723 -1718 -6905 1443 -966 3900 2357 -9487 1106 4202 -4629 -3150 -10392
1500a0392N191J1945j3383M99R394m798N261o198r073J3947j210n599O133k803
$$ -10392 -5201 6744 -6639 -6140 3254 -1544 3717 -2481 -11554 2393 1183 -4416 1717 -1086
1514a086Q728M829j4146J417J996k666L389j0736k07J4367j25N81m020k975J3879
$$ -1086 7642 12471 -1675 -258 1738 -928 2461 -8275 -8482 5885 5760 6341 2321 -654 13225
1529A3225o499j2430M938n043L602N176j3404N408O389n505P783o385l791J6700
$$ 13225 6726 -5704 -766 -5809 -2207 2969 -10435 -5027 1362 -4143 3640 -2745 -6536 10164
1543A0164o969p580P299l541L223m672j2446J1722L557m963N216n131O858J1988
$$ 10164 3195 -4385 2914 -627 2596 -2076 -14522 -2800 757 -4206 1010 -4121 2737 14725
1557A4725j0749l571j632j941J1574r550j0673J2188R80K269J413j1902P323M862
$$ 14725 3976 405 -1227 -3168 8406 -1144 -11817 371 1351 3620 5033 -6869 454 5316
1571E316q967L893l287j44R722q933m86P706o451J891l607n767J3184j718p637
$$ 5316 -3651 242 -3045 -3189 6533 -2400 -2886 4820 -1631 260 -3347 -9114 4070 2352 -5285
1586e285M192k822R155N230j7811J340R945p31K867q767l788J2419j761l345j224
$$ -5285 -1093 -3915 5240 10470 -7341 -6001 3944 3213 6080 -2687 -6475 5944 4183 838 -386
1601c86p207Q172N753p035J068Q78L187K324r092K847M394q643M19J151Q60P226
$$ -386 -7593 579 6332 -703 365 1243 4430 6754 -2338 509 4903 -3740 -3321 -2170 -1310 5916
1617E916o064m370O611J094L423l971j1408O687Q799k141n777p199O749Q818n887
$$ 5916 -148 -4518 2093 3187 6610 2639 -8769 -2082 6717 4576 -1201 -8400 -1651 7167 1280
1632A280l922k551K318R639m971n030M067k794L345O20q457N659J091p154N787
$$ 1280 -2642 -5193 -2875 6764 1793 -3237 830 -1964 1381 2001 -6456 -797 294 -6860 -1073
1647a073P16n18M838q386j458J0459q04m789n361r43J0934J681q258l049J905
$$ -1073 -357 -875 3963 -4423 -5881 4578 3774 -1015 -6376 -7319 3615 5296 -2962 -6011 -4106
1662d106Q473K857p683l554Q96P084M212j1104k741P223p63N55k081l306N862
$$ -4106 4367 7224 -459 -4013 -3117 3967 8179 -2925 -5666 1557 794 1349 -732 -4038 1824
1677A824k160l175O705j219j496J075m438M292M440n880m147k688N047Q615p094
$$ 1824 -336 -3511 3194 1975 479 1554 -2884 1408 5848 -32 -4179 -6867 -1820 6795 -299
1692b99p308M092O539O420n509r278N011N690J082k403q591J670P090k207k415
$$ -299 -7607 -3515 3024 9444 3935 -5343 -332 5358 6440 4037 -4554 -2884 4206 1999 -416
1707d16k665j21O102p16j025L981m09l37k548k108N420m083r111J479K769N626
$$ -416 -3081 -3202 2900 2184 1159 5140 4731 4394 1846 -262 5158 1075 -8036 -6557 -3788 1838
1723A838J810r552J487Q617P94J44q193o749J0964M837o704m026j794O290N136
$$ 1838 3648 -5904 -4417 4200 4994 5138 -3055 -9804 1160 5997 -707 -4733 -6527 -237 4899
1738D899p153l111K578J550L110p32j023K285r67n94m25o48K461l370m627M690
$$ 4899 -2254 -5365 -2787 -1237 1873 1141 118 2403 1436 842 417 -231 2230 -1140 -5767 -1077
1754a077M741K30m886o676N428P923l710n769j085N176Q291j787q175l020K101
$$ -1077 3664 3894 -992 -7668 -2240 5683 1973 -3796 -4881 295 8586 6799 -1376 -4396 -2295
1769b295L445k709o860j44N595N579N17k781K702K005l749j487m90n55j10m088
$$ -2295 1150 -1559 -8419 -8563 -2968 2611 3128 347 3049 5054 1305 -182 -672 -1227 -1337 -5425
1785e425P77O941M59l084k356j25P041L471o229m034K918O667J032r336n583L871
$$ -5425 -4648 2293 2752 -332 -2688 -2813 4228 7699 1470 -2564 354 7021 8053 -1283 -6866 -2995
1801b995M547K97m442q65O187L292o72k528l750Q22N54l654j38K107J495N99k304
$$ -2995 1552 1849 -2593 -3458 2729 6021 5349 2821 -929 -107 447 -3207 -3345 -1238 257 856 -1448
1818a448J453M381l133o245p74M699M451k599m577J716N296K372m734o488J220
$$ -1448 5 4386 1253 -4992 -5766 -1067 3384 785 -3792 -2076 3220 5592 858 -5630 -4410
1833d410N480K680k448m110L405N929j925m712j984J234K587j893j471L697J703
$$ -4410 1070 3750 1302 -2808 597 6526 4601 -111 -2095 -861 1726 -167 -1638 2059 3762
1848C762r30j730j653J770j08l775j575J448N075K156o109k505L906K012j856
$$ 3762 2832 1102 -551 1219 1111 -2664 -4239 -2791 2284 4440 -1669 -4174 -268 1744 -112
1863a12o458j740P809K962k910j450l93L852J642n545j845J946K093K124k764
$$ -112 -6570 -8310 -501 2461 -449 -1899 -2292 1560 3202 -2343 -4188 -2242 -149 1975 -789
1878g89r23M536n9l320k004J061M536r18l504K997L308P59k784o250K15L137j926
$$ -789 -1712 2824 2765 -555 -2559 -1498 3038 2120 -1384 1613 4921 5680 2896 -3354 -3139 -2 -1928
1895a928k073j649K542P549k29m889k87J918J841l679n837K187L632m50j448j387
$$ -1928 -4001 -5650 -3108 4441 4212 -677 -964 954 2795 -884 -6721 -4534 -902 -1352 -2800 -4187
1911d187L253L282k376p55J078K547L437l504l161L096Q27j330m177k939O259
$$ -4187 -934 2348 -28 -783 295 2842 6279 2775 -386 2710 3537 2207 -1970 -4909 1350
1926A350L173l061M26R90L583K108o718k501K034p50Q77l436k519O194R46l226
$$ 1350 4523 1462 1888 2878 6461 8569 1851 -650 1384 634 1511 -1925 -4444 1750 2696 -530
1942e30p73j946L858J638o784J088M630N44N48m309n18N538k636l471k87o30N031
$$ -530 -1303 -3249 609 2247 -4537 -3449 1181 1725 2273 -2036 -2554 2984 348 -3123 -3410 -4040 991
1959I91R55m781J728K632K115L68n866J267N269k306k312j951J66L845l441l703
$$ 991 1946 -2835 -1107 1525 3640 4008 -1858 -591 4678 2372 60 -1891 -1725 2120 -1321 -5024
1975e024K274O51K661L4m047L446L299j763k375m153K091L987n326k494K447K100
$$ -5024 -2750 -2099 562 596 -3451 -5 3294 1531 -844 -4997 -2906 1081 -4245 -6739 -4292 -2192
1991b192L646k850k878N139J631q89j264l172L893K793m292o95K15J552L029m291
$$ -2192 1454 -1396 -4274 865 2496 1607 343 -2829 1064 3857 -435 -1130 -915 637 3666 -625
2007f25j748M446R63K16k376j725N591L3m693j61j78K126N42n281L26L034P86
$$ -625 -2373 2073 3036 3252 876 -849 4742 4775 82 -79 -257 1869 2411 -2870 -2544 490 1276
2024A276J027l954o19O100m67l367j717K17M830j546n489K501J975M00M91l796
$$ 1276 2303 -1651 -2270 3830 3363 -4 -1721 -1504 3326 1780 -3709 -1208 767 1167 1658 -2138
2040b138J001M111j199p69j463J09M676k068m746J498J784L84k176k566L239K756
$$ -2138 -1137 2974 1775 1006 -457 -348 4328 2260 -2486 -988 796 1180 -996 -3562 -323 2433
2056B433q55j714j875K935K224m117k353K19K493L063m108k200M202J279J51k397
$$ 2433 1578 -136 -2011 924 3148 -969 -3322 -3103 -610 2453 -1655 -3855 347 1626 1777 -620
2072f20l373M530K357l537o46k2K352J344m772m8K596n51J284j565l73M805q03
$$ -620 -3993 537 2894 -643 -1289 -1311 1041 2385 -2387 -2435 161 -390 894 -671 -1044 3761 2958
2089B958k492j151j705L938p30o713K406M219J008L67m327J011M924k361j812
$$ 2958 466 -685 -2390 1548 818 -5895 -3489 730 1738 2105 -2222 -1211 3713 1352 -460
2104d60j752j228N776K27m539R53O90J942k57n523K513L504k674J137J09OL510
$$ -460 -2212 -3440 2336 2563 -1976 -1023 -333 1609 1352 -4171 -1658 1846 -828 309 418 424 3934
2121C934l348l108K564K9N74j692l313M115K797k485k558k245L725L694l349j057
$$ 3934 586 -2522 42 71 645 -1047 -4360 -245 2552 67 -2491 -4736 -1011 2683 -666 -1723
2137a723Q62K965M312n407m415L143j440k90jl420M743M002k128K493J50q20J973
$$ -1723 -861 2104 6416 1009 -3406 -263 -1703 -1993 -1994 -5414 -671 3331 1203 3696 3846 3026 4999
2154D999m705k268L854j013j937j299R29N316j060m061P94J104L545O97n642J30
$$ 4999 294 -1974 1880 867 -1070 -2369 -1440 3876 2816 -1245 -451 653 4198 4895 -747 -617
2170f17K532L88P1o099k328O338K63j727Q96k54L542R83m045J59k53j239O52j754
$$ -617 1915 2303 2374 -3725 -6053 285 548 -1179 -283 -537 3005 3988 -57 102 -151 -1390 -738 -2492
2188b492J856L372k095n64L65L79K236m318l979M058K645P62j177l951L317M496
$$ -2492 -636 2736 641 77 442 821 3057 -1261 -5240 -1182 1463 2225 1048 -2903 414 4910
2204D910l519l740j594Q74L742p63l259K92J969J959r85k505M91J368N65n91q19
$$ 4910 1391 -2349 -3943 -3069 673 -90 -3349 -3057 -1088 871 -114 -2619 -2128 -760 -195 -786 -1605
2221a605K094k86l660K80J571L31k39k166J481N186R84k226k725m63L632L81m608
$$ -1605 489 203 -3457 -3177 -1606 -1275 -1514 -3680 -2199 2987 3971 1745 -980 -1443 2189 2570 -2038
2238b038k432K152M873J069l741p03J927J417K22l163j337K550K21j54J89j251
$$ -2038 -4470 -2318 2555 3624 -117 -820 1107 2524 2746 -417 -1754 796 1017 863 1052 -199
2254a99Q50j47k228J355J917q17j069m07K564K617k735m005k05L154K063k747
$$ -199 651 504 -1724 -369 1548 731 -338 -745 1819 4436 1701 -2304 -2509 645 2708 -39
2270c9k764J784L799K171k372l858R63K807K02k080k354J308K802o25j353L9K74
$$ -39 -2803 -1019 2780 4951 2579 -1279 -316 2491 2693 613 -1741 -433 2369 1744 391 430 704
2287G04J76q57J92J551l03j231p79N76J871j177l421q75J964L149k79m226j72
$$ 704 880 23 215 1766 1463 232 -547 29 1900 723 -2698 -3573 -1609 1540 1261 -2965 -3137
2304c137L920J687j837l902p30L713J115j905j391n8K405J149k101q57M17O60
$$ -3137 783 2470 633 -3269 -3999 -286 829 -1076 -2467 -2525 -120 1029 -1072 -1929 -1512 -852
2320h52M67r29P79J747r76j115L70J304Q08k878k172K286K060J10j939k161K594
$$ -852 -385 -1314 -535 1212 236 -879 -509 795 1603 -1275 -3447 -1161 899 1009 -930 -3091 -497
2337d97L283j063k465j615J725L321j685l550Q0J691J317r88j945J250J937j28
$$ -497 2786 1723 -742 -2357 -632 2689 1004 -2546 -2466 -775 542 -446 -2391 -1141 796 668
2353F68l07K31Q22J98j423n74P53P88n20k163J28K993J192j407j974P86L451K89
$$ 668 361 592 1414 1612 189 -385 368 1156 636 -1527 -1399 1594 2786 1379 -595 191 3642 3931
2371C931k935j493R52K246Ol074j014J448J315k7k365n60K370M33j011n99L60
$$ 3931 996 -497 455 2701 2707 -367 -1381 67 1382 1355 -1010 -1570 800 1233 222 -377 -17
2388a7J683p61k417Q68J032q39j277j287J605K311j039j151K59J685K278j674
$$ -17 1666 905 -1512 -644 388 -451 -1728 -3015 -1410 901 -138 -1289 -1030 655 2933 1259
$$ [...]
8191I
##END NTUPLES=NMR FID
##END=
