##TITLE=1H_AMNV173
 200.13MHz, CDCl3,
 8 sc
 
 3.2.2025
##JCAMPDX= 6.0         $$ Bruker NMR JCAMP-DX V2.0
##DATA TYPE= NMR FID
##DATA CLASS= NTUPLES
##ORIGIN= UXNMR, Bruker Analytische Messtechnik GmbH
##OWNER= pz
$$ XWIN-NMR		Version 3.5
$$ Mon Feb  3 17:56:44 2025 Russian Standard Time (UT+4h)  she@DPX200
##.OBSERVE FREQUENCY= 200.1313
##.OBSERVE NUCLEUS= ^1H
##.DELAY= (6, 6)
##.ACQUISITION MODE= SIMULTANEOUS
##.ACQUISITION SCHEME= undefined
##.AVERAGES= 8
##.DIGITISER RES= 18
##SPECTROMETER/DATA SYSTEM= spect
##.PULSE SEQUENCE= zg30
##.SOLVENT NAME= CDCl3
##.SHIFT REFERENCE= (INTERNAL, CDCl3, 0, 14.3821)
##AUDIT TRAIL= $$ (NUMBER, WHEN, WHO, WHERE, WHAT)
$$ ##TITLE= Audit trail, XWIN-NMR		Version 3.5
$$ ##JCAMPDX= 5.01
$$ ##ORIGIN= Bruker BioSpin GmbH
$$ ##OWNER= she
$$ F:/spectra/data/she/nmr/H-C/1/audita.txt
$$ ##AUDIT TRAIL=  $$ (NUMBER, WHEN, WHO, WHERE, WHAT)
(   1,<2025-02-03 17:55:14.53 +0400>,<she>,<DPX200>,
      <created by zg, POWCHK disabled, PULCHK disabled
       configuration hash MD5:
       00 E9 B6 7A A2 85 ED C7 34 08 36 98 17 FE 4E 26
       data hash MD5: 16K
       E4 59 9E AF 5A E0 49 39 C0 29 A3 D9 E8 D3 E4 33>)
$$ ##END=
$$ 
$$ hash MD5
$$ C6 4D DA 79 E7 7A F9 F9 9E BA 3F 4C 81 B7 CF 5D
##$RELAX= 
##$RELAX= 
##$RELAX= 
##$RELAX= 
##$RELAX= 
##$RELAX= 
$$ Bruker specific parameters
$$ --------------------------
##$DU= <F:/spectra>
##$EXPNO= 1
##$NAME= <H-C>
##$PROCNO= 1
##$TYPE= <nmr>
##$USER= <she>
##$AMP= (0..31)
100 100 100 100 100 100 100 100 100 100 100 100 100 100 100 100 100 100 
100 100 100 100 100 100 100 100 100 100 100 100 100 100 
##$AQSEQ= 0
##$AQ_mod= 1
##$AUNM= <au_zg>
##$AUTOPOS= <>
##$BF1= 200.13
##$BF2= 200.13
##$BF3= 200.13
##$BF4= 200.13
##$BF5= 200.13
##$BF6= 200.13
##$BF7= 200.13
##$BF8= 200.13
##$BYTORDA= 1
##$CFDGTYP= 0
##$CFRGTYP= 5
##$CHEMSTR= <none>
##$CNST= (0..31)
1 1 145 1 1 1 1 1 1 1 1 1 1 1 1 1 1 1 1 1 1 1 1 1 1 1 1 1 1 1 1 1 
##$CPDPRG= <>
##$CPDPRG1= <>
##$CPDPRG2= <>
##$CPDPRG3= <>
##$CPDPRG4= <mlev>
##$CPDPRG5= <mlev>
##$CPDPRG6= <mlev>
##$CPDPRG7= <mlev>
##$CPDPRG8= <mlev>
##$CPDPRGB= <>
##$CPDPRGT= <>
##$D= (0..31)
0 0.7 0 0 0 0 0 0 0 0 0 0.03 0 0 0 0 0 0 0 0 0 0 0 0 0 0 0 0 0 0 0 0 
##$DATE= 1738590913
##$DBL= (0..7)
120 120 120 120 120 120 120 120 
##$DBP= (0..7)
150 150 150 150 150 150 150 150 
##$DBP07= 0
##$DBPNAM0= <>
##$DBPNAM1= <>
##$DBPNAM2= <>
##$DBPNAM3= <>
##$DBPNAM4= <>
##$DBPNAM5= <>
##$DBPNAM6= <>
##$DBPNAM7= <>
##$DBPOAL= (0..7)
0.5 0.5 0.5 0.5 0.5 0.5 0.5 0.5 
##$DBPOFFS= (0..7)
0 0 0 0 0 0 0 0 
##$DE= 6
##$DECBNUC= <off>
##$DECIM= 32
##$DECNUC= <off>
##$DECSTAT= 4
##$DIGMOD= 1
##$DIGTYP= 9
##$DL= (0..7)
0 120 120 120 120 120 120 120 
##$DP= (0..7)
150 150 150 150 150 150 150 150 
##$DP07= 0
##$DPNAME0= <>
##$DPNAME1= <>
##$DPNAME2= <>
##$DPNAME3= <>
##$DPNAME4= <>
##$DPNAME5= <>
##$DPNAME6= <>
##$DPNAME7= <>
##$DPOAL= (0..7)
0.5 0.5 0.5 0.5 0.5 0.5 0.5 0.5 
##$DPOFFS= (0..7)
0 0 0 0 0 0 0 0 
##$DQDMODE= 0
##$DR= 18
##$DS= 0
##$DSLIST= <SSSSSSSSSSSSSSS>
$$ [...]
##$SUBNAM0= <"">
##$SUBNAM1= <"">
##$SUBNAM2= <"">
##$SUBNAM3= <"">
##$SUBNAM4= <"">
##$SUBNAM5= <"">
##$SUBNAM6= <"">
##$SUBNAM7= <"">
##$SUBNAM8= <"">
##$SUBNAM9= <"">
##$SW= 18.0517328524113
##$SWIBOX= (0..15)
0 0 2 0 0 0 0 0 0 0 0 0 0 0 0 0 
##$SW_h= 3612.71676300578
##$TD= 16384
##$TD0= 1
##$TE= 0
##$TE2= 300
##$TE3= 300
##$TEG= 300
##$TL= (0..7)
0 120 120 120 120 120 120 120 
##$TP= (0..7)
150 150 150 150 150 150 150 150 
##$TP07= 0
##$TPNAME0= <>
##$TPNAME1= <>
##$TPNAME2= <>
##$TPNAME3= <>
##$TPNAME4= <>
##$TPNAME5= <>
##$TPNAME6= <>
##$TPNAME7= <>
##$TPOAL= (0..7)
0.5 0.5 0.5 0.5 0.5 0.5 0.5 0.5 
##$TPOFFS= (0..7)
0 0 0 0 0 0 0 0 
##$TUNHIN= 0
##$TUNHOUT= 0
##$TUNXOUT= 0
##$USERA1= <user>
##$USERA2= <user>
##$USERA3= <user>
##$USERA4= <user>
##$USERA5= <user>
##$V9= 5
##$VALIST= <valist>
##$VCLIST= <CCCCCCCCCCCCCCC>
##$VD= 0
##$VDLIST= <DDDDDDDDDDDDDDD>
##$VPLIST= <PPPPPPPPPPPPPPP>
##$VTLIST= <TTTTTTTTTTTTTTT>
##$WBST= 1024
##$WBSW= 4
##$XGAIN= (0..3)
0 0 0 0 
##$XL= 0
##$YL= 0
##$YMAX_a= 206488
##$YMIN_a= -162774
##$ZGOPTNS= <>
##$ZL1= 120
##$ZL2= 120
##$ZL3= 120
##$ZL4= 120
##$ABSF1= 10
##$ABSF2= 0
##$ABSG= 5
##$ABSL= 3
##$ALPHA= 0
##$AQORDER= 0
##$ASSFAC= 0
##$ASSFACI= 0
##$ASSFACX= 0
##$ASSWID= 0
##$AUNMP= <proc_1d>
##$AZFE= 0.1
##$AZFW= 0.1
##$BCFW= 1
##$BC_mod= 2
##$BYTORDP= 1
##$COROFFS= 0
##$CY= -3
##$DATMOD= 1
##$DC= 2
##$DFILT= <>
##$DTYPP= 0
##$F1P= 0
##$F2P= 0
##$FCOR= 0.5
##$FTSIZE= 0
##$FT_mod= 4
##$GAMMA= 1
##$GB= 0.15
##$INTBC= 1
##$INTSCL= 1
##$ISEN= 128
##$LB= 0.25
##$LEV0= 0
##$LPBIN= 0
##$MAXI= 10000
##$MC2= 0
##$MEAN= 0
##$ME_mod= 0
##$MI= 1.114404
##$NCOEF= 0
##$NC_proc= 0
##$NLEV= 6
##$NOISF1= 3.799351
##$NOISF2= 2.8
##$NSP= 1
##$NTH_PI= 0
##$NZP= 0
##$OFFSET= 14.38212
##$PC= 1
##$PHC0= 91.64505
##$PHC1= 15.19222
##$PH_mod= 1
##$PKNL= yes
##$PPARMOD= 0
##$PSCAL= 0
##$PSIGN= 0
##$REVERSE= no
##$SF= 200.129724274929
##$SI= 16384
##$SIGF1= 3
##$SIGF2= 2
##$SINO= 400
##$SIOLD= 16384
##$SREGLST= <1H.CDCl3>
##$SSB= 0
##$STSI= 0
##$STSR= 0
##$SW_p= 3205.1282051282
##$SYMM= 0
##$S_DEV= 0
##$TDeff= 0
##$TDoff= 0
##$TI= <>
##$TILT= no
##$TM1= 0
##$TM2= 0
##$TOPLEV= 0
##$USERP1= <user>
##$USERP2= <user>
##$USERP3= <user>
##$USERP4= <user>
##$USERP5= <user>
##$WDW= 1
##$XDIM= 8192
##$YMAX_p= 0
##$YMIN_p= 0
$$ End of Bruker specific parameters
$$ ---------------------------------
##NTUPLES= NMR FID
##VAR_NAME=  TIME,          FID/REAL,        FID/IMAG
##SYMBOL=    X,             R,               I
##VAR_TYPE=  INDEPENDENT,   DEPENDENT,       DEPENDENT
##VAR_FORM=  AFFN,          ASDF,            ASDF
##VAR_DIM=   8192,          8192,            8192
##UNITS=     SECONDS,       ARBITRARY UNITS, ARBITRARY UNITS
##FACTOR=    0.0002768,     1,               1
##FIRST=     0,             0,               0
##LAST=      2.2672688,     0,               0
##MIN=       0,             -162774,         0
##MAX=       2.2672688,     206488,          0
$$ Real data points
##PAGE= N=1
##DATA TABLE= (X++(R..R)), XYDATA
$$ plain form
0 0 0 0 0 0 0 0 0 0 0 0 0 0 0 0 0 0 0 0 7 -8 8 -8 8 -8 15 -16 16 -20 24 -26 32 -36 40 -48 52 -60 68 -76 84
39 84 -94 108 -116 132 -146 161 -178 197 -217 239 -264 290 -320 352 -389 429 -474 521 -581 644
59 644 -720 805 -906 1029 -1178 1366 -1601 1898 -2238 2234 3308 206488 175190 -43800
73 -43800 -108401 -107851 -29331 89427 101862 21269 -34782 -81907 -71571 5924 82662 121596
85 121596 38701 -160229 -162774 69240 160676 53473 -23466 -84257 -110065 5619 112428
96 112428 75340 1420 -66060 -101704 -26726 77129 96426 42658 -71806 -130409 -10921
107 -10921 103357 56973 3233 -14129 -69766 -59512 36185 74076 49119 -4832 -87165 -81651
119 -81651 31209 93240 60282 -21797 -104400 -63360 67918 81164 1562 -23347 -33578 -40880
$$ packed form
0@%%%%%%%%%%%%%%%%%%Pj5J6j6J6j6K3l1L2l6M4n0N8o8P6q8J00j12J28j44J60
39H4j78K02k24K48k78L07l39L75m14M56n03N54o10O72p41Q18r03R95j102J225
59F44j364J525j711J935k207K544k967L499m136M472J074K03180l1298k18990
73d3800o4601N50P8520J18758J2435q0593n6051m7125J0336P7495P6738L8934
85A21596q2895j98930k545K32014R1436j07203p6939o0791k5808J15684J06809
96A12428l7088p3920o7480l5644P4978J03855J9297n3768j14464n8603J19488
107a0921J14278m6384n3740j7362n5637J0254R5697L7891k4957n3951q2333N514
119h1651J12860O2031l2958q2079q2603M1040J31278J3246p9602k4909j0231p302
$$ plain form
131 -40880 12867 49907 25191 1470 -28511 -51545 -7421 44258 43257 15079 -42938 -73866
143 -73866 2531 73345 35340 -16031 -35538 -48260 -2967 64762 44440 -21418 -46164 -33542
155 -33542 9746 49177 30902 -9850 -33075 -42493 -5538 51757 40286 -9804 -30412 -42301
167 -42301 -24852 45182 69603 6163 -53501 -57936 -13632 54031 69856 8764 -54113 -63882
179 -63882 -16560 55422 69626 7412 -47855 -56526 -28114 35272 74357 29110 -42118 -64416
191 -64416 -35695 25707 72752 47037 -25416 -70133 -53901 15354 79338 63428 -17011 -77774
203 -77774 -67308 9124 83848 70318 -16772 -77763 -62291 4422 65609 64879 4081 -54428
215 -54428 -65128 -23043 45714 79366 35642 -45614 -85125 -42148 47127 91671 40876 -48914
$$ packed form
131d0880N3747L7040k4716k3721k9981k3034M4124N1679j001k8178n8017l0928
143g3866P6397P0814l8005n1371j9507j2722M5293O7729k0322o5858k4746J2622
155c3542M3288L9431j8275m0752k3225r418L6955N7295j1471n0090k0608j1889
167d2301J7449P0034K4421o3440n9664m435M4304O7663J5825o1092o2877r769
179f3882M7322P1982J4204o2214n5267q671K8412O3386L9085m5247p1228k2298
191f4416K8721O1402M7045k5715p2453m4717J6232O9255O3984j5910q0439o0763
203g7774J0466P6432P4724j3530q7090o0991J5472O6713O1187p30o0798n8509
215e4428j0700M2085O8757L3652m3724q1256l9511M2977Q9275M4544n0795q9790
$$ plain form
227 -48914 -84801 -38755 39211 75546 39859 -28391 -66903 -47282 13073 64076 56955 -5290
239 -5290 -63505 -60807 1031 62414 63300 3097 -57820 -60750 -7144 49492 59418 15174 -43831
252 -43831 -62063 -21257 38706 61439 25080 -36490 -61287 -24590 32511 55279 27067 -24559
264 -24559 -50864 -27887 18120 45732 34084 -9961 -47165 -37388 8770 44496 37781 -6650
276 -6650 -46087 -36801 8517 39807 31881 -4042 -35682 -30947 3555 30475 29445 3392 -27831
289 -27831 -31550 -2221 26997 29447 5080 -26599 -31961 -2831 26177 26642 3379 -24086 -29140
302 -29140 -2955 24784 26027 4263 -22127 -28487 -3634 25391 27376 4123 -22830 -29346 -4691
315 -4691 25605 28267 4223 -23339 -31265 -7779 25174 31680 7010 -23720 -34017 -10548 25774
$$ packed form
227d8914l5887M6046P7966L6335l5687o8250l8512J9621O0355N1003p121o2245
239e290n8215K698O1838O1383Q86o0203o0917k930N3606N6636R926m4244n9005
252d3831j8232M0806N9963K2733l6359o1570k4797L6697N7101K2768k8212n1626
264b4559k6305K2977M6007K7612j1648m4045l7204R777M6158L5726o715m4431
276f650l9437R286M5318L1290p926l5923l1640M735L4502K6920j030k6053l1223
289b7831l719K9329K9218K450k4367l1679n362K9130K9008M65k3263k7465n054
302b9140K6185K7739J243k1764k6390o360K4853K9025J985k3253k6953o516K4655
315d691L0296K662k4044k7562p926K3486L2953O506k4670l0730j0297K3469L6322
$$ plain form
328 25774 35845 10604 -23441 -35868 -13593 24040 38162 14985 -21421 -38215 -19283 19844
340 19844 40147 20527 -18550 -40569 -24999 15470 41817 26961 -13808 -41128 -29849 10433
352 10433 42113 33455 -7337 -40587 -35304 3613 40054 38672 -402 -38932 -40296 -4481 35731
365 35731 42726 8047 -34837 -43984 -12330 30622 45956 16835 -29010 -45449 -18686 24465
377 24465 45879 23904 -21663 -44402 -24844 15490 42471 30264 -12705 -42709 -31424 6908
389 6908 39693 35842 -5306 -40376 -33989 1940 35145 37003 1886 -33762 -33633 -4848 26462
402 26462 36693 11620 -26047 -36582 -14279 20330 39433 18208 -24091 -38496 -15604 17901
414 17901 36052 19088 -18706 -33042 -14581 11096 27883 21857 -7241 -28126 -21113 2557
$$ packed form
328B5774J0071k5241l4045j2427K2275L7633J4122k3177l6406j6794J8932L9127
340A9844K0303j9620l9077k2019J5570M0469K6347j4856m0769k7320J1279M0282
352A0433L1680q658m0792l3250N283L8917L6441j382l9074l8530j364L5815M0212
365C5731O995l4679m2884r147L1654M2952J5334k9121m5845j6439K6763M3151
377B4465K1414k1975m5567k2739J9558M0334K6981j2207m2969l0004J1285L8332
389F908L2785l851m1148l5070O387L5929L3205J858l5117l5648J29K8785L1310
402B6462J0231k5073l7667j0535K2303L4609J9103k1225m2299j4405K2892L3505
414A7901J8151j6964l7794j4336J8461K5677J6787o026k9098k0885P013K3670
$$ plain form
426 2557 27068 27721 -4373 -30736 -22181 3259 24366 24695 -3622 -27399 -17918 3572 16996
439 16996 19825 3310 -19014 -19602 -2670 15873 23661 4855 -21804 -19956 1018 15140 18459
452 18459 3545 -19570 -17531 2369 11363 12930 7277 -11489 -20444 -6086 13279 22358 9442
465 9442 -19493 -25269 327 19759 19077 3797 -19803 -22319 3318 17924 11129 3535 -8241
478 -8241 -19876 -10206 10869 21657 14321 -11723 -29674 -11677 17417 25297 13241 -12947 -31020
491 -31020 -11390 19633 22428 8823 -6738 -23711 -19349 8590 26117 18408 -5935 -28507 -21181
504 -21181 8895 24502 18913 392 -24481 -25978 3244 23639 20994 7450 -18220 -33716 -9461
517 -9461 26798 32519 7167 -25432 -33286 -5462 23479 25695 9109 -15834 -29555 -11018 15983
$$ packed form
426B557K4511O53l2094k6363Q555K5440K1107L29k8317k3777R481K1490J3424
439A6996K829j6515k2324n88J6932J8543P788j8806k6659J848K0974J4122L319
452A8459j4914k3115K039J9900Q994J567n653j8766q955J4358J9365R079j2916
465I442k8935n776K5596J9432o82j5280k3600k516K5637J4606o795p594j1776
478h241j1635R670K1075J0788p336k6044j7951J7997K9094P880j2056k6188j8073
491c1020J9630L1023K795j3605j5561j6973M362K7939J7527p709k4343k2572P326
504b1181L0076J5607n589j8521k4873j497K9222K0395k645j3544k5670j5496K4255
517i461L6259N721k5352l2599p854K7824K8941K216j6586k4943j3721J8537K7001
$$ plain form
530 15983 22026 15092 -2391 -27163 -25340 7345 30139 23280 -3652 -29730 -26471 4341 27971
543 27971 25526 -345 -30138 -27825 5550 25828 19097 1474 -18530 -23570 -2862 17333 18656
556 18656 9071 -8191 -23246 -16127 8611 27271 20931 -11172 -34752 -16954 17891 27976 11237
569 11237 -13694 -25398 -9717 13330 16814 7526 -2288 -12737 -14780 -1477 15172 19373 3391
582 3391 -19667 -20497 2553 19181 14586 -1765 -15756 -14259 1004 12076 11568 3520 -9396 -16489
596 -16489 -5503 13499 18533 3097 -16645 -16822 3402 17358 9424 -5705 -10703 -4936 1988
609 1988 4010 4486 5080 -924 -11813 -11610 5136 19553 11087 -13309 -23095 -4363 19727 19834 -2407
624 -2407 -19313 -12314 5676 12716 7148 -376 -6194 -9301 -6258 3460 13660 11585 -6102 -19982
$$ packed form
530A5983O043o934j7483k4772J823L2685K2794o859k6932k6078L259L0812K3630
543B7971k445k5871k9793K313L3375K0278o731j7623k0004n040K0708K0195J323
556A8656r585j7262j5055P119K4738J8660o340l2103k3580J7798L4845J0085j6739
569A1237k4931j1704J5681K3047L484r288r814j0449k043J3303J6649M201j5982
582C391k3058q30K3050J6628m595j6351j3991J497J5263J1072n08q048j2916p093
596a6489J0986J9002N034j5436j9742j77K0224J3956p934j5129m998N767O924
609A988K022M76N94o004j0889K03J6746J4417q466k4396r786J8732K4090J07k2241
624b407j6906O999J7990P040n568p524n818l107L043R718J0200k075j7687j3880
$$ plain form
638 -19982 -11640 9729 21035 10399 -11493 -19953 -6932 9525 15712 10720 -4291 -17947 -13968
651 -13968 4017 18779 16779 -3683 -22576 -16592 5805 19591 14551 -3556 -17545 -13290 671
664 671 10580 15838 9627 -10786 -23085 -10857 13095 26465 13261 -17216 -28828 -8196 17366
677 17366 23378 7835 -14803 -20772 -6450 7878 14612 13871 -1148 -18810 -17156 951 18357
690 18357 21123 1459 -21779 -20463 596 18365 20226 2498 -19023 -19633 -2404 13838 19548
703 19548 7159 -15620 -21063 -4241 12627 17341 7725 -10269 -16978 -6580 6073 14180 12798
716 12798 -3162 -17411 -13253 2379 16668 16756 -3538 -21208 -13218 6460 15832 10943 -4249
729 -4249 -14782 -8200 3518 8595 9100 2468 -9077 -10735 -1948 7269 11993 4777 -10243 -12809
$$ packed form
638a9982Q342K1369J1306j0636k1892q460J3021J6457O187m992j5011j3656L979
651a3968J7985J4762k000k0462j8893N984K2397J3786n040j8107j3989M255J3961
664F71R909N258o211k0413j2299J2228K3952J3370j3204l0477j1612K0632K5562
677A7366O012j5543k2638n969J4322J4328O734p41j5019j7662J654J8107J7406
690A8357K766j9664k3238J316K1059J7769J861j7728k1521o10J7229J6242N710
703A9548j2389k2779n443J6822J6868M714r616j7994o709J0398J2653Q107j382
716A2798j5960j4249M158J5632J4289Q8k0294j7670P990J9678R372m889j5192
729d249j0533O582J1718N077N05o632j1545j658Q787R217M724p216j5020k566
$$ plain form
743 -12809 -1004 8346 9546 2929 -8371 -10355 -949 6486 8069 3861 -6434 -10452 -1355 7670
757 7670 8109 2162 -7026 -8972 499 7437 5283 616 -4670 -7251 -1805 4987 6274 3516 -3896
772 -3896 -10501 -4714 7691 10915 3399 -7521 -12096 -2703 10276 10744 1100 -7630 -9948 -2870 7385
787 7385 9553 3324 -4870 -10711 -7225 5165 12511 7030 -4735 -13009 -9140 5214 14490 8779
801 8779 -4233 -13195 -10266 3372 14214 11002 -2241 -13349 -12691 488 13860 13058 -88 -12773
815 -12773 -14185 -2444 12347 15106 3453 -10895 -15437 -5854 10285 17217 7241 -9441 -16973
828 -16973 -8626 8177 17690 9638 -7442 -16867 -10913 4992 16479 11841 -4132 -15381 -12692
841 -12692 1340 15015 14435 -485 -13904 -13888 -1771 12826 15869 2910 -12194 -15010 -4697
$$ packed form
743a2809J1805R350J200o617j1300j984R406P435J583m208j0295m018R097R025
757G670M39n947r188j946R471O938k154m667n286k581N446O792J287k758p412
772c896o605N787J2405L224p516j0920m575R393J2979M68r644q730k318P078J0255
787G385K168o229q194n841L486J2390P346n481j1765q274L869J4354R276n711
801H779j3012q962K929J3638J0842l212j3243j1108O58J3179J3372q02j3146j2685
815a2773j412J1741J4791K759j1653j4348m542R583J6139O932r976j6682p532
828a6973Q347J6803R513q052j7080r425N954J5905J1487m638j5973j1249K689
841a2692J4032J3675n80j4920j3419J6J2117J4597L043j2959j5104k816J0313
$$ plain form
854 -4697 10336 15954 5120 -10047 -14646 -6725 7277 15197 7346 -7241 -13223 -7850 4059 13776
868 13776 9759 -4261 -12252 -8897 1761 12235 10448 -2443 -11013 -9034 -388 9759 10382 -671
882 -671 -9302 -8386 -1694 7340 10194 1307 -7502 -7555 -2357 5427 9415 2492 -6024 -6727 -2835 3507
898 3507 8269 3236 -5396 -6335 -2575 2616 6892 3102 -4801 -5549 -1630 2322 6052 3177 -4314 -5069
914 -5069 -839 2267 5158 3328 -4226 -5972 -869 3082 5161 2853 -4758 -6761 -842 3885 5579
929 5579 3026 -5081 -7536 -578 4736 5548 3605 -3864 -8467 -2531 4991 7103 4387 -3972 -9801
944 -9801 -4016 4882 8203 5332 -3950 -10841 -4943 4917 8001 5930 -1393 -9981 -7994 2715 9602
959 9602 8644 23 -10790 -10502 1222 10581 10294 586 -11363 -11329 503 9134 9506 3315 -7806
$$ packed form
854d697J5033N618j0834j5167m599P921J4002P920p851j4587n982N373J1909R717
868A3776m017j4020p991L355J0658J0474j787j2891q570J979Q646J0147O23j1053
882f71q631R16O692R034K854q887q809n3N198P784L988o923q516p03L892O342
898C507M762n033q632r39L760N191M276l790p903p48L919L952L730k875p491p55
914e069M230L106K891j830p554j746N103L951K079k308p611k003N919M727J694
929E579k553q107k455O958N314Q12j943p469m603N936P522K112k716q359n829
944i801N785Q898L321k871r282o891N898R860L084k071p323q588J987J0709O887
959I602r58q621j0813K88J1724R359k87r708j1949L4J1832Q631L72o191j1121
$$ plain form
974 -7806 -12760 -3965 7976 12112 6259 -6530 -14180 -6520 7245 13367 7583 -5900 -13776 -7021
988 -7021 4957 10839 8760 -1385 -12572 -11117 1639 11716 11049 54 -12055 -11836 426 10915
1002 10915 10915 1456 -9278 -10466 -2207 6539 10418 6199 -5734 -13199 -6693 6241 12615 6875 -6147
1017 -6147 -13122 -6023 6104 10695 5377 -3943 -8675 -5365 1421 6777 7814 1460 -7820 -9371 -1117
1032 -1117 8061 9447 1263 -8519 -9199 -492 7486 7268 504 -5835 -6289 -1554 3985 6207 3218 -3327
1048 -3327 -6574 -3038 3447 6422 3077 -3060 -5804 -2838 2515 4909 2557 -2010 -4548 -3224 1299
1063 1299 4961 3407 -2114 -5406 -2798 2915 5663 1976 -3796 -4631 -548 3522 3864 521 -3112
1078 -3112 -3257 -943 1753 3616 2096 -2391 -4708 -2478 2107 5611 3534 -3353 -6765 -2564 3930
$$ packed form
974g806m954Q795J1941M136n853j2789p650P660J3765O122n784j3483p876O755
988g021J1978N882k079j0145j1187J455J2756J0077o67j0995j2109K19J2262J0489
1002A0915%r459j0734j188Q259Q746L879m219j1933p465O506J2934O374n740j3022
1017f147o975P099J2127M591n318r320m732L310O786N356J037o354r280j551Q254
1032a117R178J386q184r782o80Q707P978k18o764o339m54M735N539K222k989o545
1048c327l247L536O485K975l345o137k744K966N353K394k352m567k538J324M523
1063A299L662j554n521l292K608N713K748l687n772q35M083M070L42l343l633
1078c112j45K314K696J863j520m487k317K230M585L504k077o887l412M201O494
$$ plain form
1093 3930 6816 3121 -4269 -7205 -2530 4202 6909 3232 -4384 -7359 -2702 3278 5979 4235 -2260
1108 -2260 -7258 -4805 1633 6553 6781 64 -8095 -7931 411 8630 9239 -145 -9962 -8577 1013 8147
1124 8147 8242 695 -8237 -8578 -1032 5912 8233 3861 -5413 -9894 -4452 4918 10314 6173 -4903
1139 -4903 -10654 -5382 3680 9462 7515 -2483 -10516 -7642 1672 9126 8999 -618 -10611 -9073 1116
1154 1116 9091 8525 -277 -8110 -7075 -707 4888 7675 4349 -4380 -9085 -5341 3387 10429 7345
1169 7345 -5093 -12051 -5573 5579 10246 4575 -5339 -8329 -3161 2676 5634 5147 -115 -5642 -5813
1184 -5813 -1220 5357 8183 1879 -7077 -7895 -771 6204 7007 779 -5871 -6053 -1137 3923 5938 2409
1200 2409 -3996 -5957 -2011 3520 5860 2397 -3715 -5071 -1012 2770 3629 1768 -1598 -3469 -2508
$$ packed form
1093C930K886l695p390k936M675O732K707l677p616k975M657N980K701j744o495
1108b260m998K453O438M920K28o717q159J64Q342Q219O09r384r817J385R590P134
1124H147R5p547q932l41P546O944K321m372r274m481N442R370N396m141j1076
1139d903n751N272R062N782j947r998q033K874R314P454j27r617r993J538J0189
1154A116P975n66q802p833J035O368N595K787l326q729m705L744Q728P042l084
1169G345j2438o958O478J1152M667n671r914k990N168N837K958m87n262n527j71
1184e813M593O577K826o304q956q18P124O975Q03o228o650j82M916N060K015l529
1200B409o405j961L946N531K340l463o112j356M059L782Q59j861l366j871R61
$$ plain form
1215 -2508 542 3662 3748 -977 -5397 -3550 2298 5591 2744 -3412 -5465 -823 4060 3865 254 -2907
1231 -2907 -3002 -579 1934 2728 1529 -1401 -3743 -2586 1706 4572 2655 -2390 -5115 -2431 2820 5128
1247 5128 2379 -2466 -4869 -2854 2146 5564 3659 -2267 -6169 -3941 2502 6533 3643 -2997 -6145
1262 -6145 -3408 1889 5222 3928 -848 -4667 -4828 -956 5055 7055 1643 -6160 -7686 -1362 6797
1277 6797 8157 768 -6981 -7020 -981 5267 6680 1825 -4418 -6285 -3431 2504 7362 5193 -2825
1292 -2825 -7912 -5259 2413 8235 5913 -2437 -7474 -5496 901 6863 6538 -427 -6626 -6602 -1205 6028
1308 6028 7932 1093 -6685 -6994 -1244 5367 7187 1928 -4613 -6178 -2950 2919 7118 4229 -2920
1323 -2920 -6890 -4906 1808 7875 5411 -3215 -7449 -4231 1914 6426 4579 -1795 -5359 -4003 32
$$ packed form
1215b508L050L120Q6m725m420J847N848L293k847o156k053M642M883j95l611l161
1231b907r5K423K513P94j199k930k342J157M292K866j917n045k725K684N251K308
1247E128k749m845k403K015N000L418j905n926l902K228O443M031k890o640l148
1262f145K737N297L333j294m776l819j61L872O011K000n412p803j526O324Q159
1277F797J360p389p749l9O039O248J413m855o243j867K854N935M858k169q018
1292b825n087K653P672N822k322q350n037J978O397N962l25o965o199K4N397P233
1308F028J904o839p778l09N750O611J820n259o541j565L228N869M199k889p149
1323b920l970J984O714O067k464q626m234L218O145M512j847o374l564J356M035
$$ plain form
1338 32 4769 5467 294 -4486 -4923 -1507 4247 6357 918 -4946 -4988 -1161 3496 5256 1120 -3741
1354 -3741 -4184 -1534 2445 4786 1814 -2896 -3775 -1700 1863 4655 2215 -2909 -3874 -1229 1653 3636
1370 3636 1973 -2365 -3590 -1418 1248 3520 2347 -2218 -3769 -1284 1579 3576 2486 -2303 -4059
1385 -4059 -958 2086 3183 1898 -2016 -3878 -1251 1654 3108 2323 -1731 -4327 -1986 1653 3459
1400 3459 2902 -1321 -4767 -2548 2067 4028 2953 -1056 -4616 -3016 1473 3945 3550 -357 -4810
1415 -4810 -4036 863 4102 4013 375 -4719 -4860 105 4313 4587 1098 -4083 -5241 -932 3924 5173
1431 5173 2221 -3668 -5966 -1896 3422 5293 2872 -2881 -6287 -3070 2644 5455 3550 -1781 -5800
1446 -5800 -4025 1510 5377 4686 -510 -5607 -4893 640 5114 5017 456 -5075 -5519 -512 4397 5166
$$ packed form
1338C2M737O98n173m780m37L416N754K110n439n864m2L827M657J760m136m861
1354c741m43K650L979K341k972m710q79K075L563K792k440n124r65K645K882J983
1370C636j663m338j225K172K666K272j173m565j551K485K863J997j090m789j756
1385d059L101L044J097j285l914j862K627K905J454p85m054k596K341L639J806
1400C459n57m223l446K219M615J961j075m009l560J600M489K472l95l907m453
1415d810P74M899L239q9l638n094j41M965M208K74l489n181j158M309M856J249
1431E173k952n889k298M070N318J871k421n753l406L217N714K811j905n331m019
1446e800J775N535L867o91n196n097P14N533M474r7m561n531m44N007M909P69
$$ plain form
1462 5166 1289 -4122 -5630 -1795 3516 5449 2516 -3248 -5771 -2468 2882 5441 3168 -2311 -5554
1477 -5554 -3112 2121 4977 3280 -1386 -4800 -3701 821 4439 3884 -425 -4381 -4082 150 4166
1492 4166 4170 210 -3941 -3893 -108 3644 3661 490 -2911 -3605 -1025 2573 3568 1197 -2378 -3686 -1568
1509 -1568 2206 3771 1384 -2413 -3539 -1122 2294 3227 967 -1917 -2723 -1065 1654 2827 1139
1524 1139 -1480 -2602 -1593 1128 3081 1634 -1710 -3167 -1432 1653 3150 1372 -1738 -2885 -1226
1539 -1226 1535 3024 1530 -1506 -2693 -1624 938 3142 2238 -1373 -3537 -2048 1146 3277 2221
1554 2221 -1290 -3419 -2155 837 3170 2706 -494 -3084 -2711 -41 3170 3856 232 -3838 -3677 -31
1570 -31 3493 3737 180 -3759 -3683 -442 2907 3694 1102 -2594 -3825 -1737 2002 4594 2711 -2402
$$ packed form
1462E166l877n411j508L835N311J933k933n764k523L303N350K559k273n479l243
1477e554K442N233K856j697m666l414J099M522L618n55m309l956K99M232M016
1492D166Ml960m151M8L785L752J7l171l401o94K580L598R95k371l575j308K118
1509a568L774J565k387l797j126K417L416R33k260k884q06J658K719J173j688
1524A139k619j122J009K721J953j447l344j457J735L085J497j778l110j147J659
1539a226K761J489j494l036j187J069K562K204r04l611k164J489L194K131j056
1554B221l511k129J264K992K333m64l200k590L73K670L211O86l624m070J61L646
1570c1L524K44l557l939P6L241L349P87k592l696j231K088L739K592j883n113
$$ plain form
1586 -2402 -4838 -2388 2145 4710 2902 -2018 -4737 -2784 1402 4166 3253 -879 -4226 -3589 89
1601 89 3919 4336 114 -4268 -3948 -165 3519 4185 908 -3329 -4034 -1240 2559 4347 2050 -2580
1617 -2580 -4683 -2344 2257 4771 2468 -2548 -4579 -1965 1896 3924 2430 -1340 -3564 -2388 696
1632 696 3306 3119 -102 -3339 -3419 -167 3290 3576 -18 -3488 -3284 -101 2896 3178 384 -2741 -2892
1649 -2892 -335 2258 2896 809 -1951 -2695 -794 1719 2600 1066 -1430 -2470 -1273 1044 2415 1462
1665 1462 -1144 -2691 -1529 1279 2717 1428 -1413 -2668 -999 1680 2417 645 -1248 -1884 -789
1680 -789 933 1766 1070 -659 -1953 -1525 546 2246 1546 -814 -2433 -1642 966 2674 1491 -968
1696 -968 -2306 -1524 723 2556 1849 -704 -2473 -2038 521 2770 2078 -783 -2690 -2058 339 2476
$$ packed form
1586b402k436K450M533K565j808m920k719J953M186K764r13m132l347O37L678
1601H9L830M17m222m382L20L783L684O66l277m237p05K794L799J788k297m630
1617b580k103K339M601K514k303n016k031K614L861K028j494l770k224J176L084
1632F96K610j87l221l237q0L252L457K86l594l470K04L183K997K82k794l125j51
1649b892K557K593O38k087k760p44J901K513Q81j534k496j040J197K317J371r53
1665A462k606j547J162K808J438j289k841j255J669K679P37j772j893o36J095
1680g89J722Q33o96j729j294M28K071J700p00k360j619P91K608J708j183k459
1696i68j338P82K247J833p07k553j769M35K559K249o92k861j907O32K397K137
$$ plain form
1712 2476 2133 -106 -2071 -2313 -623 2202 3162 899 -2329 -3320 -1142 2703 3853 756 -2869 -3422
1728 -3422 -1010 2396 3438 949 -2083 -3022 -1627 1200 3345 2192 -1112 -3349 -2617 816 3921
1743 3921 2982 -933 -3608 -2991 369 3741 3209 -503 -3307 -3175 -311 3009 3503 280 -2935 -3320
1759 -3320 -893 2638 3596 1007 -2081 -3145 -1777 1682 3865 1932 -1657 -3392 -2337 1120 3819
1774 3819 2326 -1511 -3519 -2319 1007 3317 2094 -830 -2613 -2245 9 2667 2678 -63 -2231 -2432
1790 -2432 -699 2303 2905 459 -2213 -2625 -854 1843 2687 653 -1726 -2402 -1233 1427 2739 907
1806 907 -1485 -2049 -960 1127 2248 1035 -1131 -1645 -1007 461 1698 1209 -550 -1648 -1545 113
1822 113 2106 1618 -821 -2004 -1126 701 1952 1249 -924 -1687 -660 674 1396 1020 -493 -1356 -1020
$$ packed form
1712B476l43k239j965k42J690K825R60k263l228r91K178L845J150l097l625n53
1728c422K412L406J042k489l032r39J395K827K145j153l304k237P32L433L105
1743C921r39l915k675O17L360L372n32l712k804J32K864L320M94l223l215l85
1759c320K427L531R58k589l088j064J368L459K183j933l589j735J055L457K699
1774C819j493l837k008J200L326K310j223k924j783L68K254K658J1k741k168k01
1790b432J733L002O02k446k672m12J771K697Q44k034k379o76J169K660J312j832
1806I07k392n64J089K087J121j213k166n14O38J468J237m89j759j098J03J658
1822A13J993m88k439j183Q78J827J251p03k173p63J027J334P22l76j513q63L36
$$ plain form
1839 -1020 43 1495 1482 -467 -1913 -1249 319 1719 1463 -523 -1999 -1223 487 1674 1540 -152
1855 -152 -1852 -1564 65 1802 1998 -23 -2258 -2021 215 1910 2013 50 -2008 -2058 -154 1670 2157
1872 2157 841 -1645 -2449 -912 1612 2788 1324 -1820 -2952 -1123 1716 2794 1257 -1580 -2825
1887 -2825 -1391 1103 2539 1722 -797 -2774 -2083 536 2761 2521 -237 -2881 -2565 240 2740 2646
1903 2646 39 -2555 -2773 -387 2268 2779 682 -2100 -2966 -1039 1773 2957 1286 -1644 -2953 -1362
1919 -1362 1439 2822 1672 -1024 -2734 -1873 750 2696 2041 -584 -2696 -2266 312 2506 2203 -229
1935 -229 -2345 -2208 -50 2150 2164 321 -1727 -2253 -621 1712 2394 783 -1495 -2321 -961 1360 2248
1952 2248 914 -1223 -2214 -1054 1026 1932 1058 -701 -1838 -1289 560 1899 1263 -446 -1738 -1341
$$ packed form
1839a020J063J452j3j949j446O64J568J400k56j986j476P76J710J187j34j692
1855a52j700K88J629J737J96k021k235K37K236J695J03j963k058n0J904J824M87
1872B157j316k486q04J537K524J176j464l144j132J829K839J078j537k837j245
1887b825J434K494J436q17k519j977O91K619K225k40k758k644L16K805K500r4
1903B646k607k594k18K386K655N11k097k782q66J927K812J184j671k930j309J591
1919a362K801J383j150k696j710Q61K623J946o55k625k112M30K578K194l03k432
1935b29k116J37K158K200J4j843k048n26J632K333O82j611k278q26J360K321Q88
1952B248j334k137r91J160K080R06q74j759j137N49J849J339o36j709j292L97
$$ plain form
1968 -1341 383 1719 1116 -319 -1472 -1244 224 1401 1042 -234 -1249 -1227 66 1346 1175 -156
1984 -156 -1238 -1128 136 1451 1182 -254 -1166 -990 177 1175 1002 -209 -1054 -1042 -66 1118 1261 -79
2002 -79 -1292 -1310 -93 1342 1490 -104 -1361 -1229 11 1324 1458 51 -1356 -1379 -293 1123 1654
2019 1654 396 -1382 -1789 -592 1277 1959 601 -1404 -1867 -683 1127 2030 831 -1109 -1887 -960
2035 -960 873 2036 1276 -814 -2104 -1430 580 2164 1635 -612 -2123 -1612 225 2036 1909 -220
2051 -220 -1923 -1770 -147 1854 2208 386 -1799 -2196 -610 1579 2334 776 -1533 -2243 -990 1156
2067 1156 2266 1053 -1165 -2198 -1274 826 2181 1499 -602 -2097 -1533 398 2140 1780 -306 -2033
2083 -2033 -1809 78 1887 1847 -12 -1824 -1812 -282 1443 1890 475 -1411 -1897 -612 1240 1973 783
$$ packed form
1968a341J724J336o03j435j153K28J468J177l59j276j015K2J293J280j71j331
1984a56j082J10J264J315k69j436r12J76J167R98j73j211q45J2R76J184J43j340
2002g9j213j8J217J435J48j594j257J32J240J313J34j407j407k3J086J416N31
2019A654j258j778m07J197J869O82j358k005m63J184J810R03j199j940p78R27
2035i60J833J163p60k090j290O74K010J584n29k247j511N11J837J811j27k129
2051b20j703J53J623K001L54j822k185l97J586K189P55j558k309p10J253K146
2067A156J110j213k218j033R24K100J355o82k101j495N64J931J742l60k086j727
2083b033K24J887J809m0j859j812J2J530J725M47j415j886m86J285J852P33j190
$$ plain form
2100 783 -1083 -1884 -827 947 1769 884 -831 -1671 -1033 523 1534 1115 -452 -1615 -1235 272 1582
2117 1582 1243 -297 -1459 -1110 246 1381 1072 -166 -1179 -1084 69 1002 1046 43 -1003 -1142 -182
2134 -182 980 1105 171 -1070 -1147 -54 1039 1063 48 -800 -908 -80 947 954 171 -744 -1005 -148 894
2153 894 980 123 -878 -1062 -217 894 1012 189 -716 -1015 -287 767 1125 363 -740 -1196 -458 888 1343
2172 1343 422 -827 -1352 -495 868 1267 408 -794 -1258 -657 624 1378 774 -504 -1365 -950 439 1536
2190 1536 1038 -491 -1504 -1148 329 1497 1136 -249 -1451 -1330 -41 1457 1365 27 -1328 -1435 -213
2207 -213 1342 1542 267 -1105 -1488 -611 1014 1692 661 -844 -1697 -964 841 1765 908 -760 -1735
2224 -1735 -1114 666 1726 1053 -524 -1485 -1126 205 1464 1326 -68 -1289 -1411 -129 1362 1504 183
$$ packed form
2100G83j866q01J057J774Q22q85j715q40O38J556J011m19j567j163L80J507J310
2117A582l39j540j162L49J356J135l09j238j013R5J153R33M4j003j046j39R60
2134a82J162J25r34j241p7J093J093K4j015q48j08Q28J027Pp83r15k61Q57J042
2153H94Q6q57j001j84Q45J111J18q23r05k99P28J054L58p62j103m56P38J346M55
2172A343r21j249n25Q57J363L99q59j202m64O01J281P54o04j278q61M15J389J097
2190A536m98j529j013L56J477J168l61j385j202J21J289J498r2j338j355j07J222
2207b13J555K00j275j372l83Q77J625O78j031j505q53P33J805R24q57j668r75
2224a735O21J780J060o73j577r61L59J331J259j38j394j221j22J282J491J42j321
$$ plain form
2241 183 -1319 -1554 -399 1259 1517 294 -1012 -1361 -574 888 1446 597 -741 -1403 -751 655 1464
2258 1464 732 -526 -1309 -864 477 1287 808 -283 -1132 -1021 81 1118 993 -138 -1137 -1062 117 1120
2276 1120 940 -126 -999 -882 65 932 814 -4 -736 -857 -201 646 888 187 -700 -956 -249 748 908
2295 908 179 -705 -838 -194 732 853 180 -555 -711 -211 561 724 243 -552 -821 -268 522 786 264 -573
2315 -573 -803 -342 502 833 392 -436 -876 -420 526 1023 497 -477 -990 -509 487 974 508 -509 -913 -588
2335 -588 306 989 621 -266 -983 -781 184 989 828 -88 -938 -904 38 1046 1015 -23 -970 -1035 -145 872
2355 872 1100 172 -872 -1139 -286 840 1150 341 -701 -1157 -500 687 1207 596 -515 -1152 -717 451
2373 451 1225 739 -456 -1254 -866 289 1217 811 -289 -1080 -930 134 1044 929 9 -897 -992 -120 883
$$ packed form
2241A83j502k35J155J658K58j223j306l49P87J462N58q49j338o62O52J406Q09
2258A464p32j258p83M45J341Q10m79j091q49J11J102J037j25j131r99P5J179J003
2276A120j80j066q73J17R47Q67j18q18p32j21O56Q47K42p01q87k56P07R97J60
2295I08p29q84j33O44R26J21o73p35j56N00P72J63m81p95k69N53P90K64n22q37
2315e73k30M61Q44L31m41q28m40M56R46M97n26r74n13M81R96M87m66j017m04L25
2335e88Q94O83l68q87p17K02R65Q05j61r16q50L4R42J008l1j038r47o5Q90J017
2355H72K28r28j044k67Q53J126L10q09j042m56O57J187N20o11j111o37M35J168
2373D51P74m86j195p98L88J155R28m06j100p91J50J064R10j15r20r06r5Q72J003
$$ plain form
2392 883 1132 197 -830 -1091 -236 821 1032 344 -687 -1089 -447 653 1015 418 -490 -969 -587 513
2410 513 1029 571 -295 -976 -621 347 856 630 -198 -783 -723 130 830 624 -35 -713 -789 -5 757 678 12
2431 12 -674 -706 47 682 609 54 -515 -615 -124 573 545 102 -499 -692 -194 455 667 160 -495 -652 -223
2452 -223 525 652 178 -411 -610 -290 412 654 241 -378 -633 -280 349 658 226 -393 -585 -394 336 661
2472 661 284 -371 -623 -370 249 767 430 -290 -717 -441 237 796 514 -273 -627 -479 88 701 519 -208
2492 -208 -676 -613 4 686 706 -83 -716 -667 8 731 733 52 -682 -779 -154 639 794 194 -613 -767 -389 411
2514 411 940 448 -499 -876 -496 419 917 431 -399 -788 -474 285 858 660 -176 -766 -652 87 769 736
2534 736 -109 -841 -802 -1 742 726 -6 -663 -762 -131 581 777 259 -495 -780 -293 454 833 352 -467 -871
$$ packed form
2392H83K49r35j027k61Q55J057K11o88j031m02O42J100L62n97r08m79L82J100
2410E13N16m58q66o81L55R68N09k26q28n85O0Q53P00k06o59o78p6P84P62p9o66
2431A2o86l2P53O35p3n55n69j00M91O97k8m43o01j93M98O49K12n07o55j57M29
2452b23P48J27m74n89j99L20P02K42m13o19k55L53O29L09m32o19j92J91P30L25
2472F61l77o55k52K53O19N18l37p20m27K76O78N59k82p87l54J48N67O13j82p27
2492b08m68O3O17O82K0p89o33M9O75P23Ko81p34r7O25P93J55o00q07j54L78Q00
2514D11N29m92r47l77L80R15M98m86q30l89L14P59N73j98q36n90J14P39O82l3
2534G36q45p32L9Q01P43j6p32o57r9O31P12J96n18p54k85M87P47L79m81q19m04
$$ plain form
2555 -871 -414 364 798 408 -392 -782 -442 247 637 452 -158 -633 -513 124 648 533 -33 -638 -572 95
2575 95 583 536 -85 -536 -458 -14 481 493 2 -477 -524 -71 381 575 168 -402 -596 -63 372 510 155 -390
2597 -390 -451 -149 322 474 124 -279 -487 -164 251 457 171 -254 -463 -184 351 545 225 -247 -450 -263
2617 -263 346 533 275 -184 -554 -352 271 477 295 -164 -522 -335 198 553 417 -136 -608 -374 140 545
2637 545 420 -68 -563 -496 95 586 485 -55 -555 -557 -63 535 557 78 -523 -648 -131 522 686 214 -493
2658 -493 -678 -305 457 708 363 -378 -699 -389 241 771 437 -268 -760 -526 252 667 490 -164 -660 -617
2678 -617 106 690 612 -14 -640 -695 -57 630 673 119 -557 -691 -228 483 713 201 -473 -681 -315 394 666
2699 666 286 -312 -642 -410 249 608 457 -185 -567 -467 151 574 392 -96 -485 -554 -3 522 493 31 -411
$$ packed form
2555h71M57P78M34l90q00l90L40O89L90j85o10m75J20O37N24j15n66o05O6O67
2575I5M88m7o21m51P8M44M95J2m91m79m7M53M52J94m07n70j94N33M35J38l55n45
2597c90o1L02M71J52l50m03k08L23M15K06k86m25k09K79N35J94l20m72k03J87
2617b63O09J87k58m59l70K02O23K06j82m59l58J87N33L55j36n53m72K34N14M05
2637E45j25m88m95O7N91M91j01n40n00kM94N98K2m79o01j25N17O53J64m72p07
2658d93j85L73P62K51l45p41l21L10O30N30l34p05m92K34P78M15j77o54m96M3
2678f17P23N84p8o26o26n5O38O87M3n54o76j34M63P11K30n12o74k08L66P09K72
2699F66l80n98l30K32O59L59j51o42l82J00O18M23j82m88l89o9N51N25k9m62m42
$$ plain form
2720 -411 -529 -22 474 501 94 -372 -504 -128 378 483 117 -297 -467 -191 317 456 169 -291 -460 -250
2740 -250 250 402 191 -201 -427 -154 272 419 217 -196 -301 -181 166 448 225 -196 -374 -221 148 324
2760 324 220 -154 -387 -310 121 390 279 -91 -371 -258 129 411 307 -114 -450 -299 92 403 328 -104 -427
2781 -427 -316 76 402 352 11 -376 -408 -27 464 459 39 -411 -452 -14 488 514 95 -406 -513 -144 371 485
2803 485 227 -287 -622 -247 277 555 363 -249 -626 -349 278 636 369 -156 -618 -398 135 565 501 -45
2823 -45 -543 -513 44 516 539 78 -490 -565 -83 443 551 186 -424 -561 -194 342 565 270 -269 -659 -306
2844 -306 281 562 340 -192 -586 -413 178 618 427 -112 -473 -445 41 403 432 32 -459 -484 -33 366 518
2865 518 85 -390 -531 -84 254 442 159 -321 -525 -229 218 406 192 -245 -465 -224 224 406 238 -64
$$ packed form
2720d11j18N07M96K7m07m66j32L76N06J05l66m14j70K76N08J39k87m60j69K10
2740b50N00J52k11l92k26K73M26J47k02m13j05J20L47K82k23m21j78J53L69J76
2760C24j04l74k33P7M31K69j11l70k80J13L87K82j04m21l36J51L91L11p5m32l23
2781d27J11L92L26n0l41l87l2L81M91nm20m50m1M38N02K6m19n01j07L69N15J14
2803D85k58n14l35L75N24K78j92o12l77K77O27L58k67n25m62K20N33M30o4n46
2823d5m98L0N57M72K3m61n68p5M82N26J08l65o10j37L67N36K23k95n39l90L53
2844c06N87K81k22n32l94J73N91M40j91n39l61K8M86L62K9m00m91k5M51L99J52
2865E18m33m75j41M47L38J88k83m80k04K96M47J88k14m37k20K41M48J82j68l02
$$ plain form
2885 -64 -311 -190 113 287 288 -51 -367 -334 51 286 265 -18 -309 -291 62 286 169 -22 -221 -224 -6 263 277
2908 277 -6 -188 -210 2 217 222 39 -225 -312 34 232 210 -34 -242 -243 -17 288 223 48 -228 -294 -45 288
2931 288 291 6 -274 -341 -83 286 276 -3 -226 -254 -112 231 328 70 -169 -318 -184 233 442 148 -149 -417
2953 -417 -267 242 447 243 -186 -376 -261 78 378 209 -67 -375 -353 -37 437 457 -19 -323 -398 -8 384
2974 384 415 30 -358 -454 -137 337 427 115 -268 -481 -234 223 453 287 -179 -447 -290 168 375 290 -127
2995 -127 -434 -366 86 396 364 -55 -447 -413 -54 351 392 88 -384 -471 -108 309 439 84 -294 -410 -155 227
3017 227 377 277 -97 -401 -216 182 370 272 -183 -410 -226 123 301 230 -102 -313 -252 26 278 256 38
3038 38 -245 -269 -17 234 286 74 -194 -265 13 158 266 46 -196 -256 -34 221 231 111 -134 -169 -4 91 170
$$ packed form
2885f4k47J21L03J74Jl39l16L3L85K35k1k83k91J8L53K24j17j91j99lK18K69J4
2908B77k83j82k2K12K15Nj83k64q7L46J98k2k44k08jK26L05o5j75k76o6K49L33
2931B88Lk85k80o7K58L69j0k79k23k8J42L43R7k58k39j49J34M17K09k94k97k68
2953d17J50N09K05k04m29j90J15L39L00j69k76l08K2L16M74K0m76l04p5L90L92
2974C84L1l85l88r6L17M74R0l12l83k13K47M57K30j66m66k68J57M58K07q5m17
2995a27l07O8M52L10l2m19l92L4L59M05M1l04m72q7L63M17J30l55l78j16K55L82
3017B27J50j00l74l04J85L98J88r8m55k27J84L49J78p1l32k11O1K78K52k2k18
3038C8k83k4K52K51N2k12k68p1K78J45J08k20k42o0K22K55J0j20k45l5J65R5P9
$$ plain form
3061 170 94 -81 -166 -66 120 263 79 -117 -215 -122 113 156 91 -149 -195 -58 121 206 63 -109 -197 -96 180
3084 180 242 102 -139 -242 -82 153 241 64 -190 -196 -149 68 125 77 -57 -278 -219 65 261 194 -80 -309 -244
3107 -244 86 297 192 -49 -318 -237 -22 255 213 -15 -231 -252 -41 255 252 99 -219 -345 -33 211 321 115
3129 115 -239 -373 -132 197 367 138 -144 -378 -190 171 371 256 -95 -381 -283 93 345 276 -48 -263 -334
3150 -334 0 224 330 102 -215 -334 -53 288 343 98 -282 -353 -121 189 305 139 -174 -327 -180 168 277
3171 277 243 -86 -334 -178 93 326 228 -69 -261 -231 58 210 209 -4 -213 -228 -22 245 236 31 -179 -204 -67
3194 -67 221 260 68 -153 -158 -63 172 217 43 -120 -220 -139 69 113 58 -139 -193 -118 105 195 54 -134 -131 -31 51
3219 51 200 87 -119 -158 -109 35 179 92 -89 -237 -91 30 215 122 -81 -145 -127 80 202 89 -94 -164 -61
$$ packed form
3061A70p6j75q5J00J86J43j84j96r8R3K35M3o5k40m6J37J79Q5j43j72q8J01K76
3084A80O2j40k41j03J60K35Q8j77k54oM7K17N7m8j34k21N9K84J96o7k74k29O5
3107b44L30K11j05k41k69Q1K15K77m2k28k16k1K11K96lj53l18j26L12K44J10k06
3129A15l54j34K41L29J70k29k82k34J88L61K00j15l51k86R8L76K52o9l24k15p1
3150c34L34K24J06k28l17j19K81L41N5k45l80p1K32L10J16j66l13j53J47L48J09
3171B77l4l29k48J56K71K33r8k97j92L0K89J52jk13k09j5K06K67rk05k10k5J37
3194f7K88L9j92k21nR5K35M5j74j63j00Q1K08M4n5j97n4P5K23R0j41j88LJ00Q2
3219E1J49j13k06l9M9J44J44q7j81j48J46J21J85r3k03o4J8K07J22j13j83p0J03
$$ plain form
3242 -61 84 226 146 -91 -184 -88 93 196 182 -131 -203 -193 25 236 156 -23 -219 -200 22 211 203 -31 -233 -229
3266 -229 -50 209 209 35 -154 -250 -59 198 272 75 -176 -304 -121 170 294 146 -132 -285 -146 155 368
3287 368 204 -66 -283 -192 74 288 214 -42 -321 -296 56 261 252 11 -276 -287 -39 265 330 86 -280 -317 -108
3310 -108 214 280 160 -236 -304 -130 186 347 159 -169 -311 -165 134 274 187 -101 -243 -212 34 265 225 33
3332 33 -323 -220 16 207 219 59 -220 -219 -85 142 259 69 -217 -233 -80 180 247 96 -94 -292 -53 133
3354 133 208 137 -119 -208 -99 98 202 97 -121 -234 -85 136 218 119 -132 -182 -109 100 209 73 -101 -148 -138
3377 -138 77 182 118 -90 -243 -107 8 175 99 -86 -295 -156 60 200 141 -108 -224 -174 58 205 260 20
3399 20 -214 -137 17 169 197 -54 -186 -161 14 173 195 42 -234 -232 -39 236 282 26 -171 -272 -60 148 230
$$ packed form
3242f1J45J42q0k37r3R6J81J03j4l13p2J0K18K11q0j79j96J9K22J89qk34k02M
3266b29J79K59%j74j89r6J91K57P4j97k51j28J83K91J24j48k78j53J39L01K13
3287C68j64k70k17R1K66K14p4k56k79K5L52K05rk41k87j1K48L04O5k44l66l7K09
3310a08L22O6j20l96o8J74L16J61j88l28j42J46K99J40q7k88j42L1K46K31m0j92
3332C3l56J03K36J91J2j60k79JJ34K27J17j90k86j6J53K60O7j51j90j98K39J86
3354A33P5p1k56q9J09J97J04j05k18j13J49K21Q2r9k51n0P3K09J09j36j74m7J0
3377a38K15J05o4k08j53J36J15J67p6j85k09J39K16J40n9k49j16N0K32J47N5k40
3399B0k34P7J54J52K8k51j32K5J75J59K2j53k76KJ93K75M6k56j97j01K12K08Q2
$$ plain form
3422 230 63 -117 -312 -114 139 270 78 -190 -263 -194 126 341 207 -158 -351 -155 101 286 250 -42 -265
3443 -265 -255 -10 248 260 -19 -270 -301 -45 231 301 2 -267 -344 -91 217 296 103 -205 -305 -172 166 330
3465 330 196 -148 -244 -113 64 329 193 -143 -342 -188 99 262 192 -79 -271 -239 -29 245 205 5 -258
3486 -258 -274 -6 185 213 32 -190 -237 -62 138 215 52 -158 -224 -95 140 216 113 -176 -223 -130 180 282 131
3509 131 -111 -231 -105 97 171 97 -76 -238 -154 23 205 155 -89 -197 -128 75 179 80 -80 -243 -110 53
3531 53 208 186 16 -199 -202 -24 145 178 -28 -267 -128 6 145 188 -7 -171 -208 -10 254 177 6 -246 -203
3554 -203 -16 131 236 15 -190 -249 -23 156 176 166 -123 -250 -107 154 232 115 -117 -254 -169 124 255 171
3576 171 -93 -247 -144 41 247 203 -109 -258 -244 16 268 254 -50 -206 -243 -5 225 246 -11 -217 -249 -20
$$ packed form
3422B30j67j80j95J98K53J31j92k68p3O9L20K15j34l65j93J96K56J85l6k92k23
3443b65J0K45K58J2k79k51l1K56K76P0k99k69p7K53L08P9j93l08j00J33L38J64
3465C30j34l44r6J31J77K65j36l36j99J54K87J63p0k71j92L2K10K74m0k00k63
3486b58j6K68J91K8j81k22m7J75K00P7j63k10o6J29K35P6j03k89m7R3L10J02j51
3509A31k42j20J26K02P4p4j73j62Q4J77J82n0k44j08O9K03J04r9j60j63J33J63
3531E3J55k2j70k15lJ78J69L3k06k39J39J34J39M3j95j64l7J98K64p7j71k52M3
3554b03J87J47J05k21k05n9K26J79K0j0k89j27J43K61P8j17k32j37Q5K93J31q4
3576A71k64j54J03J85K06m4l12j49J4K60K52j4l04j56l7K38K30K1k57k06l2K29
$$ plain form
3598 -20 201 209 176 -213 -301 -86 226 274 117 -142 -279 -111 82 222 117 -110 -252 -180 96 259 185 -61 -242
3621 -242 -174 61 240 212 -43 -308 -179 29 215 148 -27 -221 -246 -11 182 184 61 -209 -256 -53 164 242 68
3644 68 -113 -171 -47 160 247 41 -70 -216 -59 130 229 45 -126 -170 -54 104 204 81 -59 -110 -110 38 114
3667 114 100 -78 -184 -86 57 169 123 -68 -153 -159 -1 189 179 -71 -149 -200 2 172 162 -2 -178 -124 -12 112
3691 112 161 -46 -171 -179 35 84 200 -56 -181 -154 -50 118 205 95 -183 -212 -4 131 202 76 -107 -196 -112
3714 -112 152 253 71 -75 -242 -117 117 237 168 -112 -189 -138 97 235 193 -89 -215 -186 49 313 219 -1
3736 -1 -222 -208 2 223 217 23 -236 -239 36 182 206 47 -216 -250 -66 214 215 53 -158 -303 -73 175 266 155
3760 155 -189 -272 -159 119 210 143 -149 -224 -154 48 193 170 -77 -177 -156 24 231 207 -46 -246 -183 21 190
$$ packed form
3598b0K21Ql3l89q8K15L12M8j57k59j37J68J93J40j05k27j42P2K76J63p4k46j81
3621b42O8K35J79k8k55k65J29K08J86o7j75j94k5K35J93Kj23k70m7K03K17P8j74
3644F8j81n8J24K07Q7k06j11j46J57J89R9j84j71m4J16J58J00j23j40n1%J48P6
3667A14j4j78j06R8J43J12m6j91q5oJ58J90j0k50p8n1K02J70j0j64j76N4J12J24
3691A12M9k07j25qK14M9J16k56j25K7J04J68Q7j10k78k9K08J35P1j26j83q9Q4
3714a12K64J01j82j46j67J25K34J20o9k80p7N1K35J38m2k82j26K9K35K64r4k20
3736ak21J4K10K21oj94k59lK75J46K4j59k63l4J84K80Jj62k11j45K30K48R1j11
3760A55l44q3J13K78R1o7k92p5P0K02J45k3k47j00K1J80K07k4k53k00O3K04J69
$$ plain form
3783 190 128 -23 -205 -243 15 173 172 34 -174 -165 -22 188 238 23 -90 -166 -63 117 198 55 -112 -207 -95
3806 -95 94 158 36 -102 -166 -69 80 140 65 -89 -164 -76 86 161 160 -30 -201 -80 87 133 96 -21 -130 -99 -2
3831 -2 159 97 -23 -155 -161 4 169 130 -4 -124 -132 -9 151 138 -34 -167 -162 -14 205 202 -58 -210 -105 -31 135
3856 135 163 72 -129 -195 -63 219 208 103 -84 -169 -85 136 197 49 -164 -194 -95 74 226 114 -118 -230 -172
3879 -172 71 252 138 -10 -239 -122 72 236 165 -14 -251 -221 35 214 214 11 -188 -222 -24 185 243 84
3901 84 -200 -275 -69 204 201 97 -161 -217 -76 197 233 148 -110 -258 -102 93 268 146 -80 -299 -137 71
3923 71 214 157 -58 -246 -120 13 201 224 8 -188 -249 35 173 201 84 -197 -233 -23 201 172 57 -196
3945 -196 -211 -60 196 199 110 -128 -178 -50 118 248 79 -102 -208 -82 87 235 150 -50 -192 -57 24 143
$$ packed form
3783A90o2j51j82l8K58J58jj38k08RJ43K10N0k15j13p6J03J80Q1j43j67r5J12
3806i5J89O4j22j38o4R7J49O0p5j54p5Q8J62P5jj90j71J21J67M6l7j17j09L1R7
3831bJ61o2j20j32oJ65J65l9j34j20qJ23J60j3j72j33NJ48K19lk60j52J05P4J66
3856A35K8r1k01o6J32K82j1j05j87q5Q4K21O1j48k13l0R9J69J52j12k32j12N8
3879a72K43J81j14j48k29J17J94J64p1j79k37L0K56J79%k03j99l4J98K09N8j59
3901H4k84p5K06K73lj04k58n6J41K73L6q5k58j48J56J95J75j22k26k19J62K08
3923G1J43n7k15j88J26J33J88K3k16j96o1K84J38K8j17k81l6K10K24k9j15k53
3945a96j5J51K56Lq9k38n0J28J68J30j69j81j06J26J69J48q5k00j42J35Q1J19
$$ plain form
3967 143 104 -42 -148 -129 82 187 149 -43 -157 -143 49 167 174 9 -166 -209 -10 172 128 -27 -146 -177 -51
3990 -51 207 209 2 -184 -210 -3 178 132 3 -165 -169 -13 140 226 63 -131 -256 -20 172 209 49 -157 -135
4013 -135 -116 87 210 104 -110 -268 -139 90 209 129 -120 -264 -77 116 246 149 -89 -241 -170 147 241 266
4035 266 -81 -254 -236 20 168 236 18 -247 -210 -47 221 255 98 -146 -269 -37 185 277 104 -184 -278 -115
4057 -115 176 286 146 -118 -273 -157 121 240 143 -46 -207 -237 55 280 171 -48 -278 -247 3 259 195
4078 195 37 -169 -221 -4 222 185 12 -183 -294 -58 156 285 141 -170 -301 -94 136 245 158 -112 -274
4099 -274 -187 87 253 118 -55 -204 -215 115 231 192 -98 -227 -157 71 214 113 -37 -189 -179 -10 168 185
4121 185 -1 -107 -192 -45 178 208 77 -199 -171 -16 195 228 37 -177 -213 -50 220 169 77 -175 -203 -69 116
$$ packed form
3967A43l9j46j06J9K11J05l8j92j14J4J92J18Pj65j75m3J99J82m4j55j19l1J26
3990e1K58Kk07j86k6K07J81m6j29j68mJ56J53Q6j63j94j25K36J92L7j60k06K2
4013a35J9K03J23j06k14j58J29K29J19q0k49j44J87J93J30r7k38j52P1L17R4K5
4035B66l47j73J8K56J48O8k18k65L7J63K68L4j57k44j23K32K22R2j73k88r4J63
4057a15K91J10j40k64j55J16K78J19r7j89j61l0K92K25j09k19k30L1K50K56o4
4078A95j58k06n2K17K26l7j73j95j11K36K14J29j44l11j31K07K30J09q7k70j62
4099b74Q7K74J66j35j73j49j1L30J16l9k90j29P0K28J43j01j50j52J0J69J78J7
4121A85j86j06q5J47K23L0j31k76K8J55K11L3j91k14l6J63K70n1r2k52k8J34J85
$$ plain form
4144 116 187 45 -142 -164 -97 150 258 15 -49 -234 -89 90 200 141 -70 -171 -155 74 213 98 -36 -183
4166 -183 -114 66 163 167 -67 -171 -164 57 198 255 -31 -230 -141 35 245 315 -22 -157 -173 -50 182 281 47 -228
4190 -228 -253 -57 210 230 61 -107 -198 -166 186 286 157 -93 -238 -159 118 219 186 -64 -239 -163 19 239
4212 239 163 -46 -235 -258 -33 234 214 -13 -242 -260 -31 188 294 79 -198 -281 -48 142 243 73 -181 -233
4234 -233 -61 88 283 141 -102 -172 -107 84 253 183 -77 -208 -139 64 223 143 -90 -190 -193 -14 216 190 -60
4257 -60 -217 -171 -45 209 184 -6 -171 -231 -84 133 244 69 -119 -222 -24 103 203 113 -105 -207 -123 121
4279 121 184 102 -201 -195 -66 131 198 88 -86 -239 -114 104 220 118 -102 -173 -130 24 151 109 -33 -201 -154
4302 -154 -39 203 146 15 -175 -170 13 138 126 12 -168 -151 -63 152 195 82 -132 -176 -91 175 225 49 -183
$$ packed form
4144A16P1j42j87k2O7K47J08k43o4j85J45J79J10n9k11j01J6K29J39j15j34j47
4166a83O9J80R7Mk34j04PK21J41N7k86j99Q9J76K10P0l37j35j6J23K32R9k34k75
4190b28k5J96K67K0j69j68r1L2L52J00j29k50j45P9K77J01l3k50j75P6J82K20
4212B39p6k09j89k3K25K67k0k27k29j8K29K19J06k15k77q3K33J90J01j70k54n2
4234b33J72J49J95j42k43p0O5J91J69p0k60j31O9K03J59q0k33j00lJ79K30k6k50
4257f0j57M6J26K54k5j90j65o0J47K17J11j75j88j03J98J27J00r0k18j02Q4K44
4279A21O3q2l03OJ29J97O7j10j74j53J25K18J16j02k20p1M3J54J27m2j42j68M7
4302a54J15K42n7j31j90NJ83J25j2j14j80J7Q8K15M3j13k14m4Q5K66N0j76k32
$$ plain form
4325 -183 -231 -66 95 185 155 -145 -216 -83 97 214 100 -101 -203 -114 111 163 116 -104 -225 -147 11 222 132
4348 132 0 -251 -170 39 215 222 -7 -208 -157 -16 232 155 7 -216 -208 -44 186 282 37 -165 -219 -55 134
4371 134 203 85 -153 -221 -143 156 237 110 -65 -230 -147 126 244 154 -24 -214 -148 16 163 176 -53 -209 -197
4394 -197 37 163 180 -9 -168 -163 -19 192 201 14 -203 -173 -49 157 203 21 -191 -206 -26 108 202 110 -76
4417 -76 -232 -72 57 242 57 -68 -188 -123 114 220 90 -60 -194 -125 73 170 69 -81 -231 -100 22
4438 22 132 153 -29 -159 -134 20 226 131 -18 -125 -146 -22 143 141 7 -122 -149 -59 164 172 11 -139 -216 -102
4462 -102 179 199 10 -159 -187 -79 109 210 49 -106 -153 -27 64 129 48 -70 -224 -111 85 191 91 -57
4484 -57 -205 -155 37 198 163 -62 -172 -136 31 187 83 -33 -221 -125 14 215 152 0 -136 -141 -64 148 147 -29
$$ packed form
4325a83m8J65J61R0l0l00p1J33J80J17j14k01j02Q9K25N2m7k20j21P8J58K11r0
4348A32j32k51Q1K09J76Pk29k01N1J41K48p7j48k23QJ64K30R6k45k02n4J64J89
4371A34O9j18k38o8P8K99Q1j27j75j65Q3K73J18r0j78j90O6J64J47J3k29j56J2
4394a97K34J26J7j89j59NJ44K11Rj87k17L0J24K06M6j82k12j5J80J34R4r2j86
4417g6j56J60J29J85j85j25j20O5K37J06j30j50j34O9J98R7j01j50j50J31J22
4438B2J10K1j82j30K5J54K06r5j49j07k1J24J65kj34j29k7R0K23Qj61j50p7J14
4462a02K81K0j89j69k8J08J88J01j61j55m7J26R1O5q1j18j54J13J96J06j00j48
4484e7j48N0J92J61l5k25j10L6J67J56j04j16j88R6J39K01o3j52j36nP7K12jj76
$$ plain form
4508 -29 -141 -234 -9 191 184 122 -126 -245 -146 98 238 66 -134 -231 -146 35 199 95 -173 -250 -113 72 196
4531 196 141 -49 -163 -93 56 216 181 7 -153 -166 -25 215 218 27 -148 -197 -20 159 186 43 -149 -193 -59
4554 -59 189 194 51 -54 -147 -72 90 182 108 -59 -222 -120 108 286 104 -53 -154 -158 108 178 107 -72 -164 -135
4578 -135 42 203 123 -21 -131 -164 13 150 120 6 -126 -132 -67 202 161 -29 -175 -164 -47 157 146 43 -164
4601 -164 -177 -31 165 139 15 -122 -138 -60 69 174 23 -121 -96 -45 91 154 94 -108 -140 -108 40 150 95 -96
4625 -96 -179 -80 87 177 144 -41 -173 -111 67 146 142 -12 -160 -152 57 256 191 16 -221 -160 -40 169 203 -24 -141
4650 -141 -110 -75 146 258 54 -172 -206 -94 130 123 46 -33 -212 -107 107 164 77 -65 -176 -76 65 225 203
4673 203 -10 -215 -131 70 165 148 -30 -173 -179 -4 145 123 -17 -194 -210 -40 132 142 53 -180 -181 -61 120 204
$$ packed form
4508b9j12r3K25K00po2k48j19R9K44J40j72k00r7Q5J81J64j04k68p7J37J85J24
4531A96n5j90j14P0J49J60l5j74j60j3J41K40Lj91j75m9J77J79K7j43j92m4J34
4554e9K48Nj43j05r3P5J62R2p4j67j63J02K28J78j82j57j01mK66P0p1j79r2K9
4578a35J77J61q0j44j10l3J77J37l0j14j32oO5K69m1j90j46J1J17K04j1j03k07
4601a64j3J46J96k6j24j37j6P8J29J05j51j44K5N1J36O3o0k02l2L2J48J10n5j91
4625i6q3R9J67R0l3j85j32O2J78P9mj54j48QK09J99o5j75k37O1J20K09L4k27j17
4650a41L1L5K21J12k04k26l4J12K24pp7p9j79J05K14N7q7j42j11J00J41J60k2
4673B03k13k05Q4K01R5j7j78j43oJ75J49k2j40j77j6J70J72J0q9k33jJ20J81Q4
$$ plain form
4697 204 8 -171 -193 -53 103 181 89 -129 -190 -70 69 112 109 -57 -177 -169 73 171 115 -30 -166 -116 -5 206
4721 206 136 -6 -171 -123 20 214 162 -24 -124 -153 3 148 186 13 -130 -142 53 137 191 50 -140 -120 -9
4744 -9 140 186 64 -106 -145 -84 134 160 50 -89 -166 -22 42 135 117 -86 -148 -100 57 107 40 -66 -175 -125 41
4769 41 125 46 -66 -111 -130 51 257 178 -36 -168 -131 1 144 153 -31 -145 -131 68 216 120 -30 -118 -222 -44
4793 -44 141 186 -12 -120 -193 14 194 193 67 -103 -238 -66 175 198 21 -107 -169 -113 191 163 86 -111 -164 -101
4817 -101 11 209 159 -12 -205 -144 59 160 135 -84 -181 -208 0 162 190 30 -156 -186 -13 227 170 31 -172
4840 -172 -134 -63 212 190 113 -170 -140 -82 113 173 66 -65 -165 -43 115 194 156 -73 -153 -105 36 180 120 -70
4864 -70 -160 -161 31 163 159 -48 -208 -48 -5 129 197 29 -126 -152 -76 112 185 6 -135 -209 -18 110 154 20
$$ packed form
4697B04j96j79k2J40J56P8r2k18o1J20J39M3lj66j20QK42R8n6j45j36N0J11K11
4721B06p0j42j65M8J43J94n2j86j00k9J56J45L8j73j43j2J95Q4N4j41j90K0J11
4744iJ49M6j22j70l9O1K18K6j10j39p7J44O4R3j8k03o2M8J57N0o7j06j09N0J66
4769D1Q4p9j12m5j9J81K06p9k14j32L7J32J43Rj84j14J4J99J48r6j50q8j04J78
4793d4J85M5j98j08p3K07J80jj26j70j35J72K41K3j77j28o2N6L04k8p7j97n3O3
4817a01J12J98n0j71j93O1K03J01k5k19r7k7K08J62K8j60j86l0J73K40n7j39k03
4840a72L8P1K75k2p7k83L0N8J95O0j07j31j00J22J58P9l8k29q0M8J41J44o0j90
4864g0r0jJ92J32mk07j60J60M3J34O8j68j55k6P6J88P3j79j41p4J91J28M4j34
$$ plain form
4888 20 -154 -151 -38 107 132 8 -104 -171 -84 82 142 79 -69 -135 -111 7 163 87 -86 -101 -93 86 129 113 -75
4913 -75 -146 -102 115 169 65 -57 -151 -135 -18 104 106 14 -182 -106 13 139 61 4 -156 -123 -31 144 130 8 -137
4938 -137 -147 28 159 193 42 -48 -103 -34 91 181 77 -125 -132 -129 133 164 81 -77 -169 -107 121 217 91 -54 -175
4963 -175 -62 75 200 136 -77 -192 -115 52 189 149 14 -216 -146 -47 191 142 -28 -162 -166 27 117 203 72
4986 72 -133 -142 -20 141 230 73 -159 -151 -88 79 170 107 -91 -203 -94 108 189 67 -18 -166 -137 30 186 90
5010 90 5 -181 -168 50 123 103 0 -142 -167 -13 214 170 59 -133 -140 4 102 192 63 -107 -93 -62 82 165 33
5035 33 -110 -164 -6 154 140 53 -76 -204 -42 138 165 87 -75 -133 -51 142 98 121 -7 -186 -96 20 164 42
5059 42 -53 -148 -109 87 133 124 -34 -141 -90 64 174 157 -19 -147 -112 94 124 107 -52 -84 -121 7 144 99 -25
$$ packed form
4888B0j74LJ13J45K5j24j12o7Q7J66O0o3j48o6K4J18J56p6j73j5QJ79M3j6j88
4913g5p1M4K17N4j04j22r4J6J17J22Kr2j96P6J19J26p8n7j60L3R2J75j4j22j45
4938a37j0J75J31L4j51r0n5O9J25R0j04k02pLK62L1q3j58r2O2K28R6j26j45j21
4963a75J13J37J25o4k13j15P7J67J37m0j35k30P0R9K38m9j70j34mJ93R0Q6j31
4986G2k05rJ22J61Q9j57k32QO3J67R1o3j98j12J09K02Q1j22q5j48K9J67J56r6
5010I0q5j86J3K18P3k0j03j42k5J54K27m4j11j92pJ44R8R0j29j70J4L1J44Q3j32
5035C3j43n4J58J60j4q7j29j28J62J80K7p8j62n8Q2J93m4K3j28j79R0J16J44j22
5059D2r5r5L9J96M6rj58j07N1J54J10j7j76j28L5K06L0j7j59l2l7J28J37m5j24
$$ plain form
5084 -25 -141 -69 -33 159 137 27 -15 -130 -54 175 199 4 -136 -181 -44 80 184 21 -70 -239 -59 116 192
5107 192 23 -99 -143 -98 87 90 105 -95 -159 -62 64 148 110 -115 -163 -144 -12 152 150 -22 -193 -121 25 104 180
5132 180 28 -198 -117 7 156 190 104 -152 -163 -62 115 141 74 -127 -159 -7 59 176 117 -51 -161 -99 122
5155 122 152 105 -36 -170 -83 62 133 95 -30 -172 -106 51 138 94 -57 -117 -155 -28 93 148 10 -141 -137 10
5179 10 124 143 41 -136 -187 -30 139 191 64 -75 -173 -73 89 191 44 -90 -131 -12 80 131 89 -51 -95
5202 -95 -66 54 159 91 -76 -90 6 50 184 112 -32 -137 -99 -14 85 71 -52 -155 -78 66 126 163 2 -91 -101
5227 -101 14 115 65 6 -117 -59 -7 154 87 -21 -68 -93 4 107 95 28 -100 -173 29 81 162 31 -94 -112 8
5252 8 58 168 46 -127 -154 -113 89 142 62 -108 -114 -82 61 162 95 -48 -137 -82 54 201 96 -14 -110 -66 1
$$ packed form
5084b5j16P2L6J92k2j10m2j15P6K29K4j95j40m5J37J24J04j63r1j69J80J75P6
5107A92j69j22m4M5J85LJ5k00o4R7J26Q4l8k25m8J9J32J64kj72j71P2J46P9P6
5132A80j52k26Q1J24J49L4q6k56j1J01J77K6o7k01l2J52O6J17n9j68j10O2K21
5155A22L0m7j41j34Q7J45P1l8j25j42O6J57Q7m4j51o0l8J27J21N5j38j51MJ47
5179A0J14J9j02j77n1J57J69N2j27j39r8J00J62J02j47j34m1J19R2N1m2j40m4
5202i5K9J20J05o8j67j4R6M4J34p2j44j05L8Q5R9j4j23j03P7J44O0L7j61r3j0
5227a01J15J01n0n9j23N8N2J61o7j08m7k5R7J03j2o7j28p3K02N2Q1j31j25j8J20
5252HN0J10j22j73k7M1K02N3q0j70oL2J43J01o7j43q9N5J36J47j05j10r6M4O7
$$ plain form
5277 1 108 124 47 -134 -117 -14 126 147 -15 -95 -120 -66 125 208 44 -94 -126 -45 158 151 0 -136 -108 -74 161
5302 161 204 50 -70 -104 -88 66 174 96 -26 -119 -87 65 170 123 -24 -146 -110 50 98 90 -40 -106 -94 54
5326 54 90 102 -14 -134 -114 -2 108 143 55 -114 -127 46 165 154 28 -43 -190 -27 103 127 4 -83 -108 -42
5350 -42 54 158 70 -53 -96 -51 82 149 131 -26 -82 -99 28 90 103 -28 -111 -79 61 170 60 -56 -54 -52 -53 112
5376 112 79 -18 -138 -66 12 108 136 -13 -81 -129 11 133 140 -3 -121 -113 -69 131 63 29 -111 -136 -33 70 142 30
5402 30 -29 -170 -55 121 132 91 -70 -134 -94 32 119 77 -76 -173 -83 59 151 94 -10 -154 -103 24 147 66 -8
5427 -8 -147 -145 14 129 102 -10 -158 -130 -14 180 218 37 -102 -143 -27 90 152 46 -157 -131 -26 61 159 28
5451 28 -92 -133 -22 32 128 89 -126 -182 -98 53 131 156 2 -135 -68 5 155 170 34 -101 -147 42 168 99 -40
$$ packed form
5277AJ07J6p7j81J7J03J40K1j62q0k5N4J91Q3j64j38l2Q1K03pj51j36K8L4K35
5302A61M3j54j20l4J6J54J08p8j22r3L2J52J05m7j47j22L6J60M8qj30o6J2J48
5326E4L6J2j16j20K0J12J10L5q8j69j3J73J19j1j26p1j47J63J30K4j23q7k5O6
5350d2R6J04q8j23m3M5J33O7j8j57n6j7J27O2J3j31q3L2J40J09j10j16KKjJ65
5376A12l3r7j20P2P8R6K8j49o8m8J40J22Pj43j18QM4K00o8l4j40k5J03J03P2j12
5402C0n9j41J15J76J1m1j61o4M0J26Q7m2j53r7R0J42R2n7j04j44N1J27J23q1p4
5427hj39KJ59J15k7j12j48K8J16J94L8j81j39m1J16J17O2j06k03K6J05Q7R8j31
5451B8j20m1J11N4R6l9k15n6Q4J51P8K5j54j37O7P3J50J5j36j35m6J89J26o9j39
$$ plain form
5476 -40 -155 -123 -19 111 171 38 -97 -152 11 96 138 -4 -110 -140 -4 142 128 37 -24 -82 -71 47 140 65 -93
5501 -93 -98 -29 64 66 38 -44 -150 -99 58 219 92 -65 -92 -95 37 151 125 -15 -132 -115 25 176 109 -50 -153
5526 -153 -122 13 115 85 23 -121 -81 -41 89 126 53 -101 -120 -53 110 217 -26 -71 -139 -17 97 121 24 -90
5550 -90 -99 -104 64 160 64 -121 -123 -59 57 159 72 8 -170 -119 52 191 132 -53 -212 -131 50 166 178 -28 -229
5575 -229 -117 10 167 155 -62 -164 -116 1 132 162 7 -105 -160 -38 113 133 42 -147 -161 -73 78 166 43
5598 43 -86 -168 -81 149 168 177 -66 -93 -121 51 175 66 34 -143 -126 2 159 57 -32 -173 -176 19 92 97 10 -84
5624 -84 -137 -60 124 134 77 -66 -195 -39 100 163 8 -116 -108 -101 81 170 60 -170 -187 -30 107 181 50 -113
5648 -113 -151 -92 57 144 100 -28 -162 -97 29 157 125 -35 -136 -84 36 128 101 -1 -187 -126 15 207 164 36
$$ packed form
5476d0j15L2J04J30O0j33j35n5J63Q5M2j42j06l0J36J46j4r1o1n8J1J18R3p5j58
5501i3nO9R3Kk8q2j06N1J57J61j27j57k7lJ32J14k6j40j17J7J40J51o7j59j03
5526a53L1J35J02l0o2j44M0M0J30L7p3j54j9O7J63J07k43m5o8J22J14K4r7j14
5550i0rnJ68R6r6j85kO4J16J02q7o4j78N1J71J39n9j85j59Q1J81J16J2k06k01
5575b29J12J27J57j2k17j02M8J17J31L0j55j12n5J22J51K0r1j89j4Q8J51Q8j23
5598D3j29q2Q7K30J9Rk43k7k8J72J24j09l2j77J7J28J57j02q9j41lJ95P3Nq7r4
5624h4n3P7J84J0n7j43j29J56J39O3j55j24QPJ82Q9j10k30j7J57J37P4j31j63
5648a13l8N9J49Q7m4j28j34O5J26J28l2j60j01N2J20R2k7j02j86O1J41J92m3j28
$$ plain form
5672 36 -160 -155 -30 155 148 -21 -81 -153 -52 138 158 7 -119 -126 -20 153 132 37 -82 -178 -88 112 203 87 -126
5697 -126 -156 -35 124 169 120 -56 -177 -166 60 105 118 -50 -148 -123 47 170 140 -57 -157 -108 14 240 154 -2
5721 -2 -162 -174 16 151 136 -54 -127 -190 -57 156 172 5 -112 -161 -7 114 138 87 -133 -156 -77 92 213 30
5745 30 -67 -115 -77 50 154 117 -55 -152 -107 59 213 142 -40 -190 -122 75 146 151 -25 -186 -159 -9 130 219 26
5770 26 -128 -180 -37 91 169 44 -100 -191 -40 122 205 92 -70 -139 -56 101 155 76 -60 -146 -138 59 168 157
5794 157 -104 -128 -90 -23 183 93 -42 -100 -153 49 185 85 -13 -143 -103 -5 130 170 29 -78 -165 0 80 156
5818 156 36 -99 -146 -19 144 166 106 -117 -115 -27 89 141 63 -71 -143 -88 77 191 79 -72 -206 -69 57
5841 57 217 128 -73 -152 -68 54 207 148 -21 -154 -120 78 162 123 -63 -124 -172 56 180 167 -3 -116 -135 -47
$$ packed form
5672C6j96NJ25J85pj69o0p2J01J90K0j51j26pJ06J73k1r5j19r6R0K00R1j16k13
5697a26l0J21J59M5m9j76j21J1K26M5J3j68r8K5J70J23l0j97j00M9J22K26q6j56
5721bj60j2J90J35j5j90p3o3J33K13J6j67j17m9J54J21K4n1k20k3P9J69J21j83
5745C0r7m8L8J27J04l7j72r7M5J66J54p1j82j50O8J97P1Nj76j61K7J50J39Q9j93
5770B6j54n2J43J28P8j25j44r1J51J62Q3j13j62o9Q3J57N4p9j36q6QJ97J09j1
5794A57k61k4L8O7K06r0j35n8n3K02J36j00r8j30M0R8J35M0j41j07q7J65Q0P6
5818A56j20j35m7J27J63K2o0k23KQ8J16N2p8j34p2N5J65J14j12j51j34J37J26
5841E7J60q9k01p9Q4J22J53n9j69j33L4J98Q4l9j86o1m8K28J24j3j70j13j9Q8
$$ plain form
5865 -47 199 144 -15 -152 -112 -16 174 110 80 -69 -157 -36 44 169 60 -83 -130 -88 34 136 80 -51 -156 -88
5889 -88 94 205 120 -67 -164 -133 22 166 146 19 -164 -110 -14 115 140 42 -108 -186 -33 163 132 49 -162 -102
5913 -102 -47 91 145 69 -129 -124 -16 101 167 102 -74 -135 -69 77 135 131 0 -126 -147 97 177 101 -34 -181 -146
5938 -146 4 147 93 49 -128 -134 28 152 160 26 -133 -129 41 106 127 58 -83 -149 -34 161 92 31 -71 -121 -22
5963 -22 90 143 12 -106 -112 -20 37 149 79 -28 -148 -78 77 82 69 -16 -135 -115 30 144 83 -33 -110 -90 27
5988 27 70 151 -46 -92 -58 39 65 118 -3 -95 -26 17 100 111 24 -141 -151 2 25 66 23 -95 -103 -60 80 123 18
6015 18 -64 -159 -51 91 124 22 -97 -82 -104 64 143 34 -67 -101 -55 24 140 81 -51 -110 -76 37 127 121 -36
6040 -36 -137 -97 33 116 123 -4 -101 -120 21 158 161 10 -133 -162 4 75 84 12 -92 -135 -37 117 128 49 -111 -146
$$ packed form
5865d7K46n5j59j37M0R6J90o4l0j49q8J21Q0J25j09j43m7M2J22J02n6j31j05O8
5889h8J82J11q5j87r7L1J55J44k0j27j83N4R6J29K5r8j50p8J53J96l1q3k11O0
5913a02N5J38N4p6j98NJ08J17O6o5j76o1O6J46N8mj31j26k1K44Q0p6j35j47L5
5938a46J50J43n4m4j77oJ62J24Qj34j59MJ70O5K1o9j41o6J15J95o9o1j02n0R9
5963b2J12N3j31j18oR2N7J12p0j07j20P0J55Nj3q5j19K0J45J14o1j16p7K0J17
5988B7M3Q1j97m6L4R7K6N3j21r2O9M3Q3J1q7j65j0J53K3M1m3j18qM3J40M3j05
6015A8q2r5J08J42L3j02j19J5k2J68P9j09j01l4M6P9J16n9j32n9L4J13R0oj57
6040c6j01M0J30Q3Pj27r7j9J41J37Lj51j43k9J66P1Rp2j04m3R8J54J1p9j60l5
$$ plain form
6066 -146 -38 28 151 22 -112 -135 -66 41 174 72 -1 -120 -97 74 132 69 -64 -109 -27 40 96 121 -18 -131
6090 -131 -101 6 83 126 -13 -110 -107 -38 74 112 1 -85 -171 -35 102 114 66 -114 -101 -66 35 195 48 -40 -69
6115 -69 -60 52 166 79 -41 -160 -21 81 82 85 -50 -91 -111 49 108 59 33 -137 -132 32 100 96 16 -64 -108 11 70
6142 70 71 -9 -129 -101 19 126 143 31 -46 -88 7 63 131 10 -51 -50 22 47 96 29 3 -147 -5 36 74 82 -10 -74
6170 -74 -30 17 30 24 -63 -142 -92 -7 33 74 -39 -120 -50 -13 134 114 -36 -96 -102 55 70 99 -20 -98 -120 3 136 118
6198 118 5 -79 -119 -1 87 67 41 -109 -113 -59 84 155 51 -102 -123 -30 36 108 33 -67 -136 -50 25 158 43 -55
6224 -55 -135 -85 11 104 89 -15 -46 -81 55 126 132 27 -46 -114 -72 86 114 -11 -102 -56 9 118 60 0 -28 -118 -3
6251 -3 97 89 85 -31 -86 -50 63 116 63 -9 -72 -65 39 102 50 -37 -145 -27 -19 61 76 -19 -101 -84 20 107 84 7 -71
$$ packed form
6066a46J08O6J23j29j34k3O9J07J33j02p3j19K3J71N8o3j33m5Q2O7N6K5j39j13
6090a31L0J07P7M3j39r7LO9J12L8j11q6q6J36J37J2m8j80J3L5J01J60j47q8k9
6115f9RJ12J14q7j20j19J39J02JLj35m1k0J60N9m9k6j70NJ64O8mq0q0m4J19N9
6142G0Jq0j20K8J20J07J7j12p7m2R5N6O8j21o1JP2K5M9o7k6j50J42M1L8Qr2o4
6170g4M4M7J3oq7p9N0Q5M0M1j13q1P0L7J47k0j50o0oJ57J5K9j19p8k2J23J33j8
6198A18j13q4m0J18Q8k0k6j50mN4J43P1j04j53k1R3O6P2p5j00o9Q6P5J33j15r8
6224e5q0N0R6R3j5j04l1l5J36P1Oj05p3o8M2J58K8j25r1M6O5J09n8o0k8r0J15
6251cJ00qmj16n5L6J13N3n3p2o3PJ04O3n2q7j08J18QQ0J5r5q2J7J04Q7k3p7p8
$$ plain form
6280 -71 -83 -50 126 99 -20 -100 -95 33 106 43 43 -55 -106 36 107 100 -3 -93 -88 -15 45 5 28 -43 -109 -18 17 116 1
6309 1 -75 -59 -12 46 98 68 -50 -143 -62 47 70 78 9 -82 -84 48 33 95 -42 -93 -94 38 50 109 -56 -82 -99 -14 78
6338 78 98 15 -135 -33 -60 44 120 40 -96 -104 -77 50 147 45 -26 -61 49 29 90 38 -35 -112 -97 99 102 129 -63
6365 -63 -32 -33 47 54 89 14 -93 -83 46 96 49 67 -21 -129 -18 96 63 16 -93 -96 -49 60 96 34 -94 -137 31
6392 31 32 60 34 -56 -115 -37 -12 38 97 -47 -55 -5 37 139 65 22 -101 -22 -11 73 72 -10 -39 -51 51 20 69 11 -76 -68
6422 -68 3 94 38 -36 -87 -46 2 63 108 33 -62 -21 -13 11 165 41 -56 -151 -35 17 74 4 -46 -79 -54 -8 35 62 -31
6451 -31 -117 -70 17 53 55 -7 -62 -93 21 22 24 -52 -66 -48 -51 28 35 8 -26 -123 -26 17 108 56 -83 -106 -13 44 70 44 -15 -41
6483 -41 -40 47 92 49 -34 -87 -48 60 87 53 -39 -144 -54 29 82 87 4 -92 -79 7 92 35 -33 -90 -77 -37 47 23 7 -82
$$ packed form
6280g1j2L3J76k7j19q0NJ28P3o3%r8n1J42P1pj03r0NP3O0m0K3p1o6R1L5R9j15
6309Ap6J6M7N8N2l0j18r3Q1J09K3Qo9r1kJ32j5O2j37n1jJ32J2N9j65k6j7Q5R2
6338G8K0q3j50J02k7J04P6q0j36qK7J27R7j02p1l5J10k0O1n2p3p7J5J96LK7j92
6365f3L1jQ0PL5p5j07J0J29N0m7J8q8j08J11J14l3m7j09lM7J09L6o2j28m3J68
6392C1JK8k6r0n9P8K5N0N9j44qN0M2J02p4m3j23P9J1Q4jq2k9j2J02l1M9n8q7Q
6422f8P1R1n6p4n1M1M8O1M5p5r5M1QK4J54j24r7r5J16N2N7p0n0l3K5M6M3K7r3
6451c1q6M7Q7L6Ko2n5l1J14JKp6j4J8lP9Pk7l4r7R7M3R1n2j39k3R3N7K6k6n9k6
6483d1JQ7M5m3q3n3L9J08K7l4r2j05R0Q3N3Nq3r6J3Q6Q5n7o8n7J3M0Q4k4j6q9
$$ plain form
6513 -82 -34 -42 59 48 7 -72 -68 13 46 75 74 -99 -115 -3 3 86 -24 -3 -90 -56 40 100 65 12 -28 -63 23 59 23 13
6543 13 -107 -66 4 68 28 31 -4 -61 23 73 95 17 24 -77 22 14 52 -2 -61 -39 -10 73 53 52 -37 -34 -55 60 37 12 -59
6574 -59 -48 -38 68 46 35 -37 -121 -39 71 70 5 29 -14 -9 1 40 55 -34 -31 -18 3 106 63 25 -90 -75 33 42 40 -44
6604 -44 -57 -51 3 0 82 49 8 -48 -47 4 71 41 27 -53 -38 58 24 17 -33 19 -77 48 53 40 15 -59 -57 -11 59 2 -25 -38 -99
6637 -99 -26 -2 40 6 -34 -51 -57 52 29 32 -85 -26 0 64 49 -57 -38 -65 -25 49 50 28 -13 -13 -47 -7 42 -7 4 -14 -17
6668 -17 -23 13 46 7 -38 -34 14 3 66 -5 -52 -46 -39 43 17 -19 -21 -109 -16 76 47 60 16 -38 -20 54 50 21 -22 -2 -84 -41 -5
6701 -5 17 -40 -22 3 54 19 -42 -14 -55 -63 47 -3 -9 -63 -43 -44 60 56 50 -46 -62 -58 29 34 67 1 -23 -22 -70 82 4 0 -2 -51
6735 -51 -11 41 -8 32 -33 -27 21 38 84 12 -13 -35 -11 18 14 47 5 -22 -48 18 39 -2 -50 -46 -10 -13 15 -29 -30 10 -6 30 28
$$ packed form
6513h2M8qJ01j1m1p9MQ1L3K9jj73j6J12OQ3j10K1q7L4R6O0l5n3m0l5Q6L6l6j0
6543A3j20M1P0O4m0Ll5n7Q4N0K2p8Pj01R9qL8n4n9K2K9Q3k0jq9Lk1J15k3k5p1
6574e9J1J0J06k2j1p2q4Q2J10jo5K4m3NJ0L9J5q9LJ3K1J03m3l8j15J5J08Rkq4
6604d4j3ON4lQ2l3m1n6JN1O7l0j4q0J5R6l4pn0N2r6J25Nj3k5p4KM6P0n7k7j3o1
6637i9P3K4M2l4m0j7oJ09k3Lj17N9K6O4j5j06J9k7M0P4Jk2m1%l4M0M9m9J1j8l
6668a7oL6L3l9m5MM8j1O3p1m7OPQ2k6l6kq8R3R2k9J3m4n4J8P4mk9m3K0q2M3L6
6701eK2n7J8K5N1l5o1K8m1qJ10n0on4K0jJ04mor6j6MQ7NL3o6k4Jm8J52p8mkm9
6735e1M0N2m9M0o5OM8J7M6p2k5k2K4K9mL3m2k7k6O6K1m1m8ML6lK8m4jM0j6L6k
$$ plain form
6768 28 46 -66 -2 -73 -40 16 94 -7 28 -13 -32 63 -45 -41 -27 24 -40 -4 -3 -12 -10 -10 -6 8 54 -64 -54 -28 -12 12 35
6799 35 -5 -22 5 -22 61 -4 -18 45 -84 11 32 41 60 10 -24 15 -25 -68 29 -7 5 -7 83 8 48 -45 19 -50 -47 54
6829 54 40 12 -1 -21 -29 42 59 16 25 -26 23 37 0 8 -62 -49 -11 -38 -12 -32 -74 -22 20 0 -5 70 -61 -30 7 10 -13 -45
6861 -45 -72 -6 -42 23 13 23 -82 -20 -10 -29 45 87 -9 -28 -17 1 -8 44 21 -13 -7 38 83 32 56 -38 12 -10 10 35 -25
6892 -25 -56 7 -9 -10 41 -24 3 9 9 45 13 -1 -21 59 -12 24 0 32 13 -6 -14 17 -14 80 19 -55 -45 -24 5 28 34 -16 -7
6925 -7 31 70 15 -22 10 -7 22 38 26 39 -48 -16 18 30 6 -12 -26 -30 5 -19 -24 20 -16 -54 -10 71 63 21 -42 -74 -15 5
6957 5 54 -45 -12 -75 -76 71 49 4 45 -59 -52 4 -2 40 -2 -89 -25 -4 64 -24 -21 -23 -25 0 24 14 -14 -87 -28 4 37 54 -20
6990 -20 -49 -50 35 91 47 -10 -21 -28 38 52 24 -14 -70 -46 -24 65 35 -80 -76 15 -65 32 34 39 -67 -7 20 3 67 -9 -32 -74
$$ packed form
6768B8J8j12O4p1L3N6P8j01L5m1j9R5j08MJ4N1o4L6JrK%MJ4M6j18J0K6J6K4K3
6799C5m0j7K7k7Q3o5j4O3j29R5K1RJ9n0l4L9m0m3R7l6J2j2R0p5M0r3O4o9LJ01
6829E4j4k8j3k0qP1J7m3Rn1M9J4l7Qp0J3L8k7K6k0m2N2M2k0nP5j31L1L7Lk3l2
6861d5k7O6l6O5j0J0j05O2J0j9P4M2r6j9J1J8rN2k3l4OM5M5n1K4r4N0k2K0K5o0
6892b5l1O3j6jN1o5K7O%L6l2j4k0Q0p1L6k4L2j9j9qL1l1R4o1p4J0K1K9K3On0R
6925gL8L9n5l7L2j7K9J6j2J3q7L2L4J2k4j8j4mL5k4nM4l6l8M4Q1qm2o3l2N9K0
6957EM9r9L3o3jJ47k2m5M1j04PN6oM2m2q7O4K1O8q8LkkK5K4j0k8p3N9L2L3J7p4
6990b0k9jQ5N6m4n7j1pO6J4k8l8n6K4K2Q9l0j15MR1q0R7KNj06O0K7j7O4p6k3m2
$$ plain form
7022 -74 -23 38 73 3 34 -65 -37 18 27 73 31 -10 -17 -9 54 46 98 -46 28 41 31 50 -14 -22 -81 18 18 36 -7 -54 65 -76
7054 -76 -11 51 40 0 -51 -52 43 13 -8 -12 -54 -49 -14 32 23 63 -47 -64 34 44 98 4 -13 -43 -20 40 -20 33 -126 -50 30
7085 30 38 42 30 35 -58 -51 -15 37 51 -17 -8 -27 28 39 27 7 18 -15 30 39 -27 33 -33 -16 -13 32 29 -13 -55 3 -3 55 30 44 -26
7120 -26 18 14 71 38 2 -28 -34 -3 41 46 12 -57 -60 45 40 -31 -8 -109 -74 3 10 43 41 -46 -21 -7 8 55 43 30 -81 -56
7152 -56 -17 53 12 83 -76 -35 0 66 56 7 -18 -25 -2 92 96 -29 2 -51 53 35 70 23 6 -32 10 -4 4 4 -12 -41 -46
7183 -46 51 9 19 -45 -84 -48 14 19 28 -36 9 -60 26 29 -41 50 -31 -38 -13 31 12 26 -58 -31 -37 10 55 3 1 -69 49 30 51
7216 51 17 -64 -46 -7 34 39 9 -5 -16 -30 44 -3 -3 -98 -21 -23 -37 76 -12 -6 -36 -28 24 -10 50 31 -26 13 13 -29 12 16 -15
7249 -15 -34 -59 3 38 29 -25 -2 -7 -4 40 3 -11 -35 -43 10 76 91 13 -50 -27 25 94 28 -30 -64 8 -34 68 34 -24 -47 -12
$$ packed form
7022g4N1O1L5p0L1r9K8N5RM6m2m1pQO3qN2j44P4J3j0J9o4qn9R9%J8m3m7J19j41
7054g6O5O2j1m0n1jR5l0k1mm2NL5M6rM0j10j7R8J0N4r4j7l0K3O0o0N3j59P6Q0
7085C0QMj2Nr3PL6N2J4o8Rj9N5J1j2k0J1l3M5Ro6O0o6J7LM5lm2m2N8oN8k5J4p0
7120b6M4mN7l3l6l0oL1M4Nl4o9lJ05np1K3j01L5P7PL3kq7K5J4J5M7j2j3j11K5
7152e6L9P0m1P1j59M1L5O6j0m9k5pK3R4Mj25L1n3J04j8L5m7j7l8M2j4Q%j6k9n
7183d6R7m2J0o4l9L6O2NRo4M5o9Q6Lp0R1q1pK5M4j9J4q4K7oM7M5n2kp0J18j9K1
7216E1l4q1J8L9M1Nl0j4j1j4P4m7%r5P7kj4J13q8Ol0QN2l4O0j9n7L9%m2M1Ml1
7249a5j9k5O2L5rn4K3nLM4l7j4k4qN3O6J5p8o3K3N2O9o6n8l4P2m2J02l4n8k3L5
$$ plain form
7281 -12 53 17 7 35 -49 -71 0 98 -24 -2 -26 -49 10 66 30 71 -72 -51 -16 32 3 -1 -47 -41 -14 -1 24 14 -62 -13
7311 -13 -67 73 25 58 -31 -76 22 26 22 48 -36 -58 -36 2 39 69 7 -75 15 9 59 43 10 -37 -90 -11 47 -35 10 4 -46 34
7343 34 60 92 57 -34 -18 -59 70 72 -16 -55 -6 -62 20 -10 108 -21 -101 38 4 -13 12 -13 -36 -12 30 46 41 -28 -38
7372 -38 -42 44 10 20 11 13 -19 7 18 62 -21 -52 -66 -59 7 42 29 -32 -80 -4 87 73 25 -25 -117 -58 30 10 28 -43 -13 21
7404 21 -11 6 31 -25 -96 -30 51 44 -10 -52 -62 -38 24 39 7 5 3 -50 0 43 5 -2 -33 -81 37 44 -36 -34 -36 -33 36 20 0 -5
7438 -5 -24 -19 1 -15 78 41 26 -45 -41 28 0 -32 -18 7 -16 6 18 13 -56 -15 -52 3 102 24 -39 -22 -41 -9 59 30 -9 -55
7470 -55 -12 -8 68 75 -2 5 -103 6 27 -6 -9 -64 -50 -17 69 36 -13 -38 -19 -9 39 49 -2 -18 21 -31 30 6 34 29 -28 -28
7502 -28 25 51 44 -31 -21 12 -7 -2 12 -38 5 -46 40 -35 40 -2 -66 -15 -6 26 17 -17 -9 -40 6 44 80 79 -56 -8 8 24 26
$$ packed form
7281a2O5l6j0K8q4k2P1R8j22K2k4k3N9N6l6M1j43K1L5M8k9mm6OK7J3K5j0p6M9
7311a3n4J40m8L3q9m5R8MmK6q4k2K2L8L7L0o2q2R0oN0j6l3m7n3P9N8q2M5on0Q0
7343C4K6L2l5r1J6m1J29Kq8l9M9n6Q2l0J18j29q0J39l4j7K5k5k3K4M2J6no9j0
7372c8mQ6l4J0rKl2K6J1M4q3l1j4PO6L5j3o1m8P6R1j4m8n0r2N9Q8k0J8p1L0L4
7404B1l2J7K5n6p1O6Q1pn4m2j0K4O2J5l2kkn3N0M3l8pl1m8J18Pq0KkLO9j6k0n
7438ej9NK0j6R3l7j5p1MO9k8l2J4K5k3K2J2no9M1l7N5R9p8o3J7j9L2O8k9l9m6
7470e5M3MP6Pp7Pj08J09K1l3ln5J4L3Q6l3m9k5J9J0M8J0n1j6L9n2O1k4K8nn7%
7502b8N3K6pp5J0L3j9NJ4n0M3n1Q6p5P5m2o4N1RL2rl4Ql1M6L8L6jj35M8J6J6K
$$ plain form
7535 26 36 -70 -35 -12 5 -7 32 -17 -13 -17 0 13 -5 -89 0 -24 19 29 -22 -4 -2 -46 -8 54 21 -15 -40 -55 -13 20 57
7566 57 21 22 -53 26 51 22 7 -75 -12 16 17 42 33 6 -29 -40 55 80 -20 -44 -26 -11 57 41 17 -47 -66 -17 46 1 13
7597 13 -28 -21 -61 -3 50 -1 -21 -24 -106 43 19 39 21 -24 -7 -5 45 68 17 -10 -9 46 41 62 1 -46 -36 -14 110 47 -4 -66
7629 -66 -62 -46 5 47 11 -17 -79 -6 14 74 68 -41 -45 -55 -39 57 104 -10 -25 -23 1 -11 -8 -36 -44 -88 -68 42 98 0 31 -40
7661 -40 60 30 67 51 1 -43 45 70 19 66 -11 -39 -1 52 -30 37 -48 -24 -24 -9 -49 -15 -15 11 -62 83 61 60 -1 -76 27
7692 27 8 -2 26 20 -41 -38 17 93 -14 -58 -40 -33 -17 35 39 -31 1 -57 -8 27 54 -3 -43 -14 4 2 21 71 -20 2 -9 58
7724 58 23 48 -8 -27 -100 54 -1 11 -51 -43 -8 -3 72 35 -38 -7 -20 19 68 25 -3 -20 -48 15 99 62 -10 -26 -116 -48 70
7755 70 23 38 0 -42 -34 46 83 0 1 -89 -62 19 20 32 -9 -62 -95 -13 81 -8 7 -57 -8 37 23 28 -66 -69 -72 65 33 11 9
$$ packed form
7535B6J0j06L5K3J7j2L9m9MmJ7J3j8q4Q9k4M3J0n1J8Km4L8O2l3l6k5j5M2L3L7
7566E7l6Jp5P9K5k9j5q2O3K8JK5rk7l5j1R5K5j00k4J8J5O8j6k4o4j9M9O3m5J2
7597A3m1Pm0N8N3n1k0lq2J49k4K0j8m5J7KN0K3n1k7JN5nK1o1m7J0K2J24o3n1o2
7629f6MJ6N1M2l6k8o2P3K0O0oj09mj0J6R6M7j14j5KK4j2Lk8qm4K0J10N6r8L1p1
7661d0J00l0L7j6n0m4Q8K5n1M7p7k8L8N3q2O7q5K4%J5m0L4%K6p3J45k2jo1p5J03
7692B7j9j0K8oo1LN5P6j07m4J8PJ6N2Mp0L2n8M9L5K7n7m0K9J8kJ9N0r1K2j1O7
7724E8l5K5n6j9p3J54n5J2o2QL5NP5l7p3L1j3L9M9m3k8j7k8O3Q4l7p2j6r0O8J18
7755G0m7J5l8m2QQ0L7q3Jr0K7Q1JJ2m1n3l3Q2R4q9J5o4M9M5j4Nr4llJ37l2k2k
$$ plain form
7788 9 -76 -53 22 8 65 -11 -4 -78 19 23 76 30 -57 -78 12 15 7 -26 -27 -5 -1 43 23 12 -25 -104 -38 38 23 15 -28 -78 27 52
7822 52 110 45 -56 -34 -5 18 80 77 10 -69 -62 31 100 86 -17 -61 -36 -1 58 52 18 -40 -80 -11 103 20 28 -4 -56 -31 9
7853 9 37 -14 -29 -103 -50 97 13 -21 -4 -96 -26 32 10 19 4 -29 17 47 94 42 -36 -46 -26 -7 57 21 -58 -47 -22 -45 64
7884 64 56 -35 -46 -27 60 53 66 26 -58 -76 -30 36 62 -3 -47 -74 -41 55 62 -3 -73 -64 -69 37 108 59 -28 -80 -45 38 49 44 -20
7917 -20 -55 -70 -48 49 88 -58 -70 -42 8 76 71 -21 -61 -40 -39 47 74 12 -66 -31 1 62 57 62 -32 -112 -59 85 13 57 -7
7948 -7 -53 -24 24 24 16 2 -88 -31 63 31 9 -38 -74 4 77 40 28 -38 -21 -20 21 135 53 -1 -108 -79 -40 111 92 51 -96
7979 -96 -57 19 10 85 -5 -55 -56 19 48 65 27 -22 -80 -7 -34 94 44 -39 -67 -110 98 94 62 37 -101 -65 11 115 19 -51
8009 -51 -125 -62 34 15 16 -20 -34 -26 4 49 113 -55 -98 -35 2 92 114 -23 -65 -68 30 98 94 11 -56 -86 -21 5 48 95 -44
$$ packed form
7788Iq5K3P5j4N7p6Pp4R7MN3m6q7k1R0Lql3jK2MM4k0j1l7p9O6P6j5qm3n0J05K5
7822E2N8o5j01K2K9K3O2lo7p9PR3O9j4j03m4K5L5N9ol4n8m0O9J14q3Ql2n2K5M0
7853IK8n1j5p4N3J47q4l4J7r2P0N8k2Rj5l3M6L0M7n2p8j0K0J9O4l6p9J1K5k3J09
7884F4qr1j1J9Q7pJ3m0q4j8M6O6K6o5m4k7L3R6Po5p0RnJ06P1m9q7n2L5Q3J1no4
7917b0l5j5K2R7L9j46j2K8N0O8nr2m0K1JQ6K7o2p8L5L2O1nNr4q0N3J44p2M4o4
7948gm6K9M8%qj4r0N7R4l2k2m7l6P8P3l7j2o6J7JM1J14q2n4j07K9L9J51j9m1j47
7979i6L9P6rP5r0n0jP5K9J7l8m9n8P3k7J28n0q3k8m3K08ml2k5j38L6P6J04r6p0
8009e1p4O3R6j9Jl6j4QL0M5O4j68m3O3L7R0K2j37m2lR8O8mq3o7l0O5K6M3M7j39
$$ plain form
8040 -44 -99 -11 -8 70 23 -36 -89 -69 47 17 -10 -55 -55 -36 -9 66 41 33 -43 -59 29 81 82 39 -36 -99 -28 32 136 22 -35
8071 -35 -37 18 76 6 68 -46 -65 39 49 50 -17 -41 -81 16 2 102 41 -118 -47 -21 60 37 31 20 -130 -70 -22 88 22
8100 22 -56 -88 -62 -24 27 50 5 -58 -117 -18 77 71 6 -49 -106 -47 47 104 14 -59 -67 -19 93 158 38 -104 -102 -38 90 78
8130 78 59 -30 -88 -33 -23 76 58 -86 -35 -43 18 77 89 -48 -49 -93 -25 91 42 -13 -88 -45 78 82 104 5 -120 -28 -11
8159 -11 47 114 -30 -64 -88 22 99 122 5 -18 -31 -13 59 121 42 -52 -76 -21 7 67 57 -35 -99 -37 -15 88 82 -26
8187 -26 -74 -55 -20 17
$$ packed form
8040d4n5Q8LP8m7n9n3K0J16l0k7m5%J9K7P5k5qp6j6Q8N2Jm3p5o3P1O0J04j14n7
8071c5kN5N8p0O2j14j9J04J0Jo7k4m0R7j4J00o1j59P1K6Q1k3oj1j50O0M8J10o6
8100B2p8l2K6L8N1K3m5o3n9R9R5oo5n5n7N9R4N7r0p3qM8J12O5j20j42KO4J28j2
8130G8j9q9n8N5J0R9j8j44N1qO1N9J2j37jm4O8J16m9n5p5M3J23MK2r9j25R2J7
8159a1N8O7j44l4k4J10P7K3j17k3j3J8P2O2p9r4k4N5K8O0j0r2o4O2K2J03oj08
8187b6m8J9L5L7
8191A7
$$ Imaginary data points
##PAGE= N=2
##DATA TABLE= (X++(I..I)), XYDATA
$$ plain form
0 0 0 0 0 0 0 0 0 0 0 0 0 0 -8 8 -8 8 -16 16 -19 24 -32 32 -40 48 -56 64 -74 88 -104 115 -136 152 -171 194
34 194 -218 249 -279 312 -348 388 -432 481 -533 589 -652 719 -793 876 -965 1063 -1171 1290
52 1290 -1421 1569 -1735 1920 -2134 2376 -2660 2997 -3401 3898 -4526 5350 -6481 8137 -10806
67 -10806 15812 -28438 129607 165683 -150977 -147732 -56222 46892 113093 86294 -41929 -80141
79 -80141 -71217 -21178 55651 96893 58340 -31330 -159794 -108498 126544 184139 -2982 -100318
91 -100318 -84920 -52295 53575 131908 41817 -62686 -85308 -62682 23297 106261 69824 -22656
103 -22656 -97395 -98894 31120 131837 43932 -52369 -44889 -47071 -24182 65950 78997 7329
115 7329 -46650 -78727 -42532 69336 99540 15317 -65568 -93197 -25991 93788 82546 -33106
$$ packed form
0@%%%%%%%%%%%%qJ6j6J6k4L2l5M3n6O4p2Q8j04J20j38J62j92K19k51K88l23L65
34A94m12M67n28N91o60P36q20R13j014J122j241J371j512J669j841K028k234K461
52A290k711K990l304L655m054M510n036N657o398P299q424R876j1831J4618j8943
67a0806K6618m4250J58045L6076l16660L245R1510J03114O6201k6799j28223l8212
79h0141Q924N0039P6829M1242l8553q9670j28464N1296K35042N7595j87121r7336
91a00318J5398L2625J05870P8333r0091j04503k2622K2626Q5979Q2964l6437r2480
103b2656p4739j499J30014J00717q7905r6301P480k182K2889R0132J3047p1668
115G329n3979l2077L6195J11868L0204q4223q0885k7629O7206J19779j1242j15652
$$ plain form
127 -33106 -59135 -25164 -12966 28738 54911 8344 -27997 -31946 -30178 14551 57180 28827
139 28827 -18140 -48902 -49108 25354 81877 18851 -50286 -42121 -20074 18700 64142 26076 -48658
152 -48658 -51266 -8047 31674 49271 13954 -33878 -37430 -17812 17297 54965 26793 -35670
164 -35670 -42661 -19679 5182 51086 51788 -24696 -71078 -36904 22731 64702 48063 -26633 -71597
177 -71597 -41340 22432 69819 51059 -26509 -68313 -38177 12148 55018 59664 -4629 -68609
189 -68609 -55644 3007 53019 63420 11137 -58812 -68970 -15947 51064 78100 27555 -56275
201 -56275 -81488 -28008 51604 88177 35948 -57503 -85986 -27946 46898 75401 36358 -36506
213 -36506 -72128 -42391 18720 66315 59686 -7684 -73951 -69675 3402 77621 77910 -2889 -80480
$$ packed form
127c3106k6029L3971J2198M1704K6173m6567l6341l949J768M4729M2629k8353
139B8827m6967l0762k06P4462N6523o3026o9137Q165K2047L8774M5442l8066p4734
152d8658k608M3219L9721J7597l5317m7832l552J9618L5109L7668k8172o2463
164c5670o991K2982K4861M5904P02p6484m6382L4174N9635M1971j6639p4696m4964
177g1597L0257O3772M7387j8760p7568m1804L0136N0325M2870M646o4293o3980
189f8609J2965N8651N0012J0401n2283o9949j0158N3023O7011K7036n0545q3830
201e6275k5213N3480P9612L6573n2229r3451k8483N8040P4844K8503l9043p2864
213c6506l5622K9737O1111M7595o629o7370o6267M276P3077P4219K89q0799p7591
$$ plain form
226 -80480 -72855 4972 72045 68129 1921 -61066 -64444 -12447 47076 65825 25132 -41840 -71376
239 -71376 -32781 37556 71985 36749 -33981 -70370 -37462 29574 65467 40317 -19304 -60500
251 -60500 -45493 13217 59011 48274 -8123 -57449 -51155 5693 53797 46759 -2589 -46690
263 -46690 -46446 -2743 40645 44252 10081 -32328 -47247 -15531 33144 48185 17185 -29331 -48567
276 -48567 -18132 30673 44163 13971 -25397 -40077 -16914 21992 35801 15516 -15659 -33439
288 -33439 -20254 15158 34443 19029 -12135 -31940 -21117 13787 33633 17297 -13016 -29645
300 -29645 -19311 11649 30661 16333 -12245 -28345 -19198 10608 31075 17942 -12185 -28743
312 -28743 -18836 11025 32317 19408 -12047 -29703 -20270 9423 32802 22504 -11028 -32637
$$ packed form
226h0480P625P7827O7073l916o6208o2987l378N1997N9523J8749m0693o6972k9536
239g1376L8595P0337L4429l5236p0730l6389L2908O7036L5893k5150n9621m1196
251f0500J5007N8710M5794j0737n6397m9326O294N6848M8104p038m9348m4101
263d6690K44M3703M3388L607l4171m2409j4919L1716M8675J5041l1000m6516j9236
276d8567L0435M8805J3490l0192l9368j4680K3163L8906J3809k0285l1175j7780
288c3439J3185L5412J9285j5414l1164j9805J0823L4904J9846j6336l0313j6629
300b9645J0334L0960J9012j4328k8578j6100R147K9806K0467j3133l0127j6558
312b8743R907K9861K1292j2909l1455j7656R433K9693K3379j0298l3532k1609
$$ plain form
324 -32637 -24144 7533 34361 26419 -9329 -34785 -27154 5861 35184 30384 -5077 -34505 -30615
337 -30615 2004 34549 34949 419 -34292 -35616 -3683 32656 38693 6087 -33033 -40300 -9677
350 -9677 29993 41928 13161 -29080 -43321 -16093 26365 44665 20873 -23417 -45165 -23114
362 -23114 20570 44959 27752 -16401 -45774 -30838 12916 43548 33772 -8511 -44326 -36955
374 -36955 5721 41013 38090 -154 -39372 -39873 -1789 35609 40195 9078 -32170 -42759 -10977
387 -10977 29134 41751 16722 -26553 -44965 -17484 24208 40259 20525 -19368 -41665 -21375
399 -21375 16823 35841 25094 -8515 -36689 -27974 7409 33905 31608 -1196 -36838 -33115 4399
412 4399 32423 30013 814 -32006 -31192 1271 25445 25322 6631 -20707 -29503 -7921 18520
$$ packed form
324c2637Q493L1677K6828p942l5748k5456P631L3015K9323m800l5461k9428L890
337c0615L2619L2545M00l4530l4711j324L1933L6339O037l2606l9120p267L0623
350i677L9670J1935k8767m2241j4241K7228M2458J8300k3792m4290k1748K2051
362b3114M3684K4389j7207m4153k9373J4936M3754L0632r776m2283l5815P371
374c6955M2676L5292k923l8244l9218n01L8084L7398M586l1117m1248j0589L1782
387a0977M0111J2617k5029m3275j8412K7481M1692J6051j9734l9893k2297K0290
399b1375L8198J9018j0747l3609k8174Q715L5383K6496k297l2804l5642L723L7514
412D399K8024k410k9199l2820Q14L2463K4174j23j8691k7338q796K1582K6441
$$ plain form
425 18520 28492 14810 -17824 -33421 -10280 19562 27078 12689 -15933 -30331 -9294 17111
437 17111 20356 9702 -8311 -23231 -13565 9572 20611 15125 -6130 -25696 -14049 13088 20567
450 20567 10704 -6233 -21641 -12337 12229 16934 6573 -2786 -15138 -16195 3489 19227 15476
463 15476 -2850 -23759 -19529 11261 25764 10984 -8776 -21833 -14886 13014 23604 5731
475 5731 -7954 -12247 -14041 -407 18420 17872 779 -19819 -25263 72 26970 21090 -2626
488 -2626 -22102 -25290 887 29218 20433 -5217 -17139 -19397 -6752 19682 26518 5277 -18804
501 -18804 -27380 -9166 21395 26687 5708 -14675 -25881 -15504 16172 29313 10838 -9863
513 -9863 -23486 -23184 6295 35316 24048 -11021 -33028 -23548 11092 33015 18658 -8223 -24752
$$ packed form
425A8520R972j3682l2634j5597K3141K9842P516j4389k8622j4398K1037K6405
437A7111L245j0654j8013j4920R666K3137J1039n486k1255j9566J1647K7137P479
450B0567r863j6937j5408R304K4566M705j0361r359j2352j057J9684J5738l751
463A5476j8326k0909M230L0790J4503j4780j9760j3057O947K7900J0590j7873
475E731j3685m293j794J3634J8827n48j7093k0598n444K5335K6898n880k3716
488b626j9476l188K6177K8331q785k5650j1922k258J2645K6434O836k1241k4081
501a8804q576J8214L0561N292k0979k0383j1206J0377L1676J3141j8475k0701
513i863j3623L02K9479K9021j1268l5069k2007R480L4640K1923j4357k6881j6529
$$ plain form
526 -24752 -23406 2222 26579 19985 -550 -15503 -25255 -12539 20764 32275 9304 -19391 -30562
539 -30562 -13040 20199 32102 12420 -16423 -32133 -16098 20006 30929 8464 -14096 -22865
551 -22865 -15499 8804 24155 13205 -4859 -16443 -19167 -3678 19746 25173 6492 -21914 -31201
564 -31201 -3065 29754 25811 -3070 -23683 -21823 1097 21913 16010 -2581 -11721 -13159 -7492
577 -7492 7389 17884 11652 -7071 -22029 -13176 12769 22879 7525 -11319 -17497 -7745 9351
590 9351 15499 6431 -5308 -12936 -11870 2468 16983 13164 -6122 -19703 -11195 10949 19195 4238
604 4238 -12055 -11424 -308 7140 6174 2398 156 -4205 -9764 -5089 10047 16737 2226 -18696
618 -18696 -18834 5022 23452 13371 -12021 -21759 -6094 13628 14896 2160 -6991 -8460 -5696
$$ packed form
526b4752J346K5628K4357o594k0535j4953r752J2716L3303J1511k2971k8695j1171
539c0562J7522L3239J1903j9682k8843j5710J6035L6104J0923k2465k2560q769
551b2865P366K4303J5351j0950j8064j1584k724J5489K3424N427j8681k8406r287
564c1201K8136L2819l943k8881k0613J860K2920K0816n903j8591r140j438N667
577g492J4881J0495o232j8723j4958Q853K5945J0110j5354j8844o178R752J7096
590I351O148r068j1739p628J066J4338J4515l819j9286j3581Q508K2144Q246j4957
604D238j6293O31J1116P448r66l776k242m361n559M675J5136O690j4511k0922
618a8696j38K3856J8430j0081k5392r738J5665J9722J268j2736r151j469K764
$$ plain form
631 -5696 601 8476 11516 3817 -12069 -17963 -2884 16873 18185 67 -18721 -17757 2134 17123
645 17123 13712 897 -12009 -16817 -5009 13510 19324 7268 -13029 -22506 -7380 16236 20919
658 20919 5307 -13305 -19347 -6623 10400 14609 9143 -1536 -16500 -18674 917 21329 21235
671 21235 -162 -24772 -23738 5150 26498 18654 -4856 -21973 -17345 3937 16843 13074 3353
684 3353 -10265 -19803 -9174 11794 20675 11433 -9925 -24671 -12460 13135 22834 11796 -8859
697 -8859 -22756 -13035 9642 19786 12927 -4071 -20664 -16610 6140 19291 12708 -2847 -16417
710 -16417 -14869 1839 13694 12633 3973 -10328 -17579 -5447 12063 17558 8158 -11539 -21570
723 -21570 -5704 15380 16596 2929 -11433 -15294 -3177 10183 10099 3630 -3747 -11012 -7649 4457
$$ packed form
631e696O297P875L040p699j5886n894J5079J9757J312j8118j8788R64J9891J4989
645A7123l411j2815j2906m808J1808J8519N814j2056k0297r477J5126K3616M683
658B0919j5612j8612o042J2724J7023M209n466j0679j4964k174J9591K0412r4
671B1235k1397k4610J034K8888K1348p844k3510j7117M628K1282J2906l769r721
684C353j3618r538J0629K0968Q881r242k1358j4746J2211K5595R699j1038k0655
697h859j3897R721K2677J0144o859j6998j6593M054K2750J3151o583j5555j3570
710a6417J548J6708J1855j061q660j4301p251J2132J7510N495r400j9697j0031
723b1570J5866K1084J216j3667j4362l861J2117J3360q4o469p377p265L363J2106
$$ plain form
737 4457 10847 8152 -1333 -12538 -9820 5299 12180 6307 -2972 -10447 -7924 3951 9622 5193
751 5193 -1794 -8544 -8411 2706 10182 5418 -3063 -8515 -6256 4319 9559 3235 -3630 -5690 -4587
766 -4587 1920 7320 4625 -1243 -6269 -7988 -283 10225 8484 -2824 -10662 -8838 2819 12681
780 12681 7832 -5002 -10441 -6377 2899 10460 7626 -2248 -8562 -8253 -1069 9428 11279 691
794 691 -10359 -11842 -2584 10500 13476 2015 -10937 -12927 -3446 9855 14452 4547 -9510 -14047
808 -14047 -5876 8375 15651 7400 -8130 -15285 -8346 6026 15492 10110 -5413 -15626 -11319 2933
822 2933 15166 13491 -1856 -15546 -14074 665 14986 15630 1042 -14519 -15472 -1944 12898
835 12898 16127 4005 -12135 -16252 -5283 9624 16168 7601 -9187 -16820 -8053 7050 15797
$$ packed form
737D457O390k695r485j1205K718J5119O881n873r279p475K523J1875N671m429
751E193o987o750J33J1117P476m764q481n452K259J0575N240o324o865k060J103
766d587O507N400k695n868n026j719P705J0508j741j1308p838J824J1657R862
780A2681m849j2834n439M064R276P561k834r874o314L09P184J0497J851j0588
794F91j1050j483R258J3084K976j1461j2952j990R481J3301M597r905j4057m537
808a4047Q171J4251P276q251j5530p155O939J4372R466n382j5523j0213M307J4252
822B933J2233j675j5347j3690J472J4739J4321O44j4588j5561r53J3528J4842
835A2898L229j2122j6140m117J0969J4907O544q567j6788p633Q767J5103Q747
$$ plain form
848 15797 10520 -5696 -16290 -10413 4592 15038 12287 -2837 -15168 -11639 1885 12735 12769
861 12769 57 -13292 -12431 -696 10030 12600 3287 -10532 -12915 -2796 8316 12551 5322
874 5322 -8184 -12342 -3908 6290 11189 6372 -6036 -11609 -4848 4204 9097 6807 -3543 -10407
888 -10407 -5495 2843 7562 6965 -1549 -8826 -5378 1947 6158 6722 84 -7690 -5538 1614 5189
903 5189 5511 290 -6768 -5194 1538 4387 4233 423 -5996 -4802 1982 4249 3565 685 -5246 -5114
919 -5114 2077 5311 3590 -76 -5606 -5386 2259 6058 3613 -685 -6268 -6176 2445 6988 3564 -801
935 -801 -5688 -6905 1085 7956 5656 -288 -6395 -7992 263 8769 7187 135 -7154 -9409 -668
950 -668 9011 7566 447 -5895 -9510 -3824 7475 10237 3312 -5635 -11285 -5874 7301 12417 5421
$$ packed form
848A5797n277j6216j0594N877J5005J0446k751j5124j2331L529J3524J0850L4
861A2769j2712j3349Q61J1735J0726K570r313j3819k383J0119J1112M235p229
874E322j3506m158Q434J0198M899m817j2408n573O761R052M893k290j0350o864
888a0407M912Q338M719n97q514p277L448P325M211N64o638p774K152P152L575
903E189L22n221p058J574O732K849j54l810o419J194O784K267o84k880n931J32
919e114P191L234j721l666n530K20P645L799k445m298n583R2Q621M543l424m365
935h01m887j217P990O871k300n944o107j597Q255Q506j582p052p289k255Q741
950f68R679j445p119o342l615N686J1299K762o925q947n650N411J3175N116o996
$$ plain form
965 5421 -5716 -12479 -6877 6903 12115 5451 -3589 -10504 -9507 2301 12055 9270 -1231 -11138
979 -11138 -11962 126 12492 11633 320 -11087 -12385 -731 11088 10886 2434 -7310 -12553 -5532
993 -5532 8372 13236 5334 -6872 -13650 -7129 7024 13200 6251 -5428 -11924 -7289 4136 10368
1007 10368 7719 -261 -9544 -11130 -255 11436 11137 372 -10844 -11709 -232 10771 9719 -157
1021 -157 -8583 -8730 -1277 6058 7480 3786 -3297 -9198 -6035 4121 10223 6227 -3789 -10235 -6061
1036 -6061 4469 9533 4630 -3835 -7788 -4404 2263 5957 4587 -584 -5700 -5759 82 5842 5632
1051 5632 -10 -5258 -5073 209 4882 4645 209 -3949 -4243 -746 3394 4610 997 -4180 -5087 -457
1067 -457 4618 4645 -552 -5295 -3698 1768 4663 2748 -1499 -3894 -2156 1305 3130 2749 -15 -3624
$$ packed form
965E421j1137o763N602J3780N212o664r040o915R97J1808R754k785j0501r907
979a1138q24J2088J2366q59j1313j1407j298J1654J1819k02q452r744n243P021
993e532J3904M864p902j2206o778O521J4153O176o949j1679o496M635J1425O232
1007A0368k649p980r283j586J0875J1691k99j0765j1216q65J1477J1003j052r876
1021a57q426j47P453P335J422l694p083n901L163J0156O102l996j0016o446M174
1036f061J0530N064m903q465l953L384O667L694j370n171n116n9N841N760k10
1051E632n642n248J85N282M673k37m436m158k94L497M140J216l613n177r07M630
1067d57N075K7n197m743J597N466K895j915m247k395J738L461J825l81k764l609
$$ plain form
1083 -3624 -3904 16 3933 4447 493 -5392 -5835 445 6145 5319 -464 -6366 -5839 1126 6713 5590
1099 5590 -498 -6453 -6079 985 6293 5219 458 -5077 -6856 -1631 5157 6598 2754 -4164 -8744
1114 -8744 -4482 5163 9655 5106 -5040 -10924 -4824 6404 9925 4419 -4207 -9704 -5580 4183
1128 4183 8588 5473 -1404 -8353 -8194 611 8678 8516 591 -8855 -9844 -237 8562 8927 2367 -6948
1144 -6948 -10469 -2895 7243 9902 4299 -5752 -11425 -4936 6642 10466 4348 -5392 -9953 -4375
1158 -4375 4199 7269 5189 -382 -7304 -7816 -178 7557 9171 2187 -8924 -10963 -283 9939
1172 9939 9159 -332 -8922 -7846 760 6314 5400 1559 -3664 -6621 -3356 2859 6764 5470 -2029
1187 -2029 -8646 -5436 3701 8130 4746 -2907 -7467 -4155 2570 5785 4177 -960 -5980 -5016 1074
$$ packed form
1083c624k80L920L917N14l954n885m43O280N700q26n783n902N27O965N587j123
1099E590o088n955L74P064N308j074m761n535j779N225O788J441l844o918m580
1114h744M262R645M492m549j0146n884O100J1228L521n506q626n497M124R763
1128D183M405l115o877o949J59Q805Q067j62p925r446r89R607Q799L65o560r315
1144f948l521P574J0138K659n603j0051n673O489J1578L824o118r740m561N578
1158d375Q574L070k080n571o922n12P638P735J614o984j1111k039J0680J0222
1172I939p80r491q590J076Q606N554r14l841n223k957L265O215L905j294p499
1187b029o617L210R137M429l384p653m560L312O725L215j608n137n020R64O090
$$ plain form
1202 1074 5388 4460 -552 -5433 -4369 1477 4596 2969 -348 -2939 -3063 -484 2536 3618 1722
1217 1722 -2813 -5217 -1424 4224 4935 151 -5135 -4704 1314 5255 2813 -1950 -3768 -1867 1351
1232 1351 3082 2137 -231 -2428 -3047 -543 3307 4036 245 -4142 -4474 -84 4464 4288 -371 -4420
1248 -4420 -4190 -157 4204 4883 801 -4510 -5482 -736 5178 6058 750 -5366 -5738 -368 4665 5180
1264 5180 1172 -3763 -5315 -2518 2365 5799 4496 -2212 -7665 -5164 2862 8399 5599 -3316 -8563
1279 -8563 -4543 3386 7322 4679 -1934 -6640 -5095 482 5300 6293 1320 -6136 -7682 -1403 6037
1294 6037 7880 2150 -6147 -7771 -1804 5033 7436 3425 -4308 -7677 -3538 3217 7423 5284 -3038
1309 -3038 -8622 -4885 2959 7129 5033 -1939 -6964 -4929 951 5513 6061 781 -5912 -6326 -963
$$ packed form
1202A074M314r28n012m881J064N846L119j627l317k591j24K579L020J082j896
1217A722m535k404L793N648P11m784n286M31O018L941k442m763j818J901L218
1232A351J731r45k368k197o19K504L850P29l791m387l32M390M548j76m659m049
1248d420K30M033M361O79m082n311r72M746N914Q80n308o116l72N370N033N15
1264E180m008m935j552K797M883L434j303o708n453K501Q026N537k800q915n247
1279h563M020P929L936k643o613m706J545N577M818R93m973p456j546O279P440
1294F037J843n730q297j624N967O837K403m011p733l369M139O755M206k139q322
1309c038n584L737P844M170k096o972n025K035N880M562N48n280o693m14N363
$$ plain form
1324 -963 5217 7424 2108 -6318 -7469 -726 5287 6206 1597 -4860 -6003 -1567 3063 5154 3239
1339 3239 -2645 -5772 -2985 1822 5433 4595 -1877 -6410 -3382 2172 4947 3784 -1370 -5226 -3298
1354 -3298 1174 3774 3662 -386 -4603 -3337 684 3295 3710 344 -4223 -3471 963 3262 2985 267
1370 267 -3376 -3215 496 2754 2770 458 -3328 -3534 390 2970 2709 398 -3450 -3685 812 3532 2570
1387 2570 22 -2962 -3284 518 3325 2656 410 -2797 -3831 -182 3519 3092 552 -2955 -4477 -683
1403 -683 3921 3744 548 -2990 -4389 -1057 3633 4178 1264 -2554 -4778 -2048 3395 4769 1927 -2300
1419 -2300 -5146 -3047 2741 5244 2576 -1984 -5172 -3776 1884 5381 3641 -1016 -5140 -4660 1107
1434 1107 5593 4315 -303 -4803 -5245 -85 5120 4932 520 -4296 -5601 -1422 4252 5478 1885
$$ packed form
1324i63O180K207n316q426j151O743O013R19m609o457j143M436M630K091j915
1339C239n884l127K787M807L611q38o472m533L028N554K775j163n154l856J928
1354c298M472K600j12m048m217J266M021K611M15l366m567P52M434K299k77k718
1370B67l643J61L711K258J6k312l786k06L924K580k61k311l848k35M497K720r62
1387B570k548k984l22L802K807o69k246l207j034L649L701m27k540l507j522L794
1403f83M604j77l196l538j399L332M690N45k914l818k224K730N443J374k842m227
1419b300k846K099N788K503k668m560l188J396N660L497j740m657m124M80N767
1434A107M486j278m618m500m42N160N205j88m412m816j305M179N674J226l593
$$ plain form
1449 1885 -3546 -6042 -2567 3749 5849 2702 -2620 -5895 -3482 2687 5870 3369 -1836 -5417 -4095
1464 -4095 1343 5227 4252 -685 -5142 -4896 286 4994 4695 261 -4535 -5053 -422 4487 4830 838
1480 838 -3683 -4719 -1354 3303 4769 1798 -2956 -4842 -2252 2565 4727 2288 -2396 -4752 -2484
1495 -2484 2227 4444 2351 -1713 -3784 -2416 1147 3667 2806 -813 -3484 -2835 454 3344 3044 -568
1511 -568 -3579 -2889 629 3325 2564 -773 -2920 -2172 412 2649 2391 -138 -2450 -2212 60 2270
1527 2270 2701 234 -2739 -2793 114 2643 2583 -221 -2939 -2534 217 2529 2470 -59 -2556 -2378 -47
1544 -47 2244 2785 801 -2574 -3264 -297 2719 3074 648 -2701 -3351 -577 2437 3091 1026 -2210 -3482
1561 -3482 -1299 1941 3507 2276 -1796 -4373 -2169 2370 4280 2327 -1881 -4274 -2330 1862 3806
$$ packed form
1449A885n431k496L475O316K100l147n322l275K413O169L183k501n205l581J322
1464d095N438L884r75m937m457K46N182M708k99m434m796n18M631M909L43l992
1480H38m521j036L365M657J466k971m754j886K590M817K162k439m684k356K268
1495b484M711K217k093m064k071J368L563K520q61l619k671O49L289K890l00l612
1511e68l011O90L518K696p61l337k147P48K584K237k58k529k312K38K272K210
1527B270M31k467k973n4K907K529o0k804k718M05K751K312n9k529k497J78K331
1544d7K291N41j984l375o90K967L016L55k426l349o50K774L014O54k065l236j272
1561c482K183L240J566j231m072k577K204M539J910j953m208k393J944M192J944
$$ plain form
1576 3806 2454 -1068 -3890 -2966 490 3418 3638 292 -4137 -4369 53 4175 4212 519 -3842 -4373
1592 -4373 -421 3580 4127 1148 -2941 -4366 -1682 2562 4358 2384 -2341 -5033 -2474 2309 4361
1607 4361 2624 -1467 -4382 -2945 1263 4070 3383 -326 -4066 -3838 185 4009 4125 105 -4290 -4091
1623 -4091 136 3661 3509 300 -3235 -3541 -622 2478 3393 1456 -1936 -3761 -1846 1971 4006 2164
1639 2164 -1904 -4066 -1989 1844 3489 1957 -1505 -3511 -1986 1254 2979 1975 -825 -2866 -2101
1654 -2101 716 2635 2028 -322 -2252 -2017 98 2047 2123 228 -2176 -2438 -293 2205 2433 19
1670 19 -2474 -2396 235 2443 1924 -462 -2056 -1513 320 1656 1628 87 -1356 -1711 -453 1454 2107
1687 2107 512 -1884 -2359 -571 1939 2399 245 -2145 -2233 -303 1781 2421 673 -1866 -2444 -673
$$ packed form
1576C806j352l522k822R24L456K928K20l346m429k32M422M122L7l693m361n31
1592d373L952M001N47k979m089j425K684M244J796j974m725k692K559M783K052
1607D361j737m091k915J437M208K807o87l709l740K28M023L824J16m020m395J99
1623d091M227L525j52l209l535l06K919L100R15j937l392j825J915L817K035j842
1639B164m068k162K077L833J645j532l462k006J525L240J725j004k800k041P65
1654b101K817J919o07k350j930K35K115J949P6j895k404k62K145K498K28k414
1670A9k493P8K631K208n19k386j594N43J833J336k8j541j443l55J258J907O53
1687B107j595k396m75J788K510M60k154k390q8J930K084O40j748k539n78J771
$$ plain form
1703 -673 1779 2832 894 -2004 -2692 -793 1673 2621 1090 -1621 -2632 -1324 889 2652 2153 -870
1719 -870 -3221 -2414 768 3582 2912 -1099 -3833 -2341 1103 3421 2562 -817 -3235 -2384 244 2462
1735 2462 2889 469 -2731 -3272 -878 2478 3764 1224 -2789 -3708 -1160 2314 3934 1722 -2424 -3826
1751 -3826 -1555 1767 3635 2246 -1712 -3796 -2292 1134 3441 2592 -883 -3357 -2514 159 2852
1766 2852 3288 198 -3103 -3130 -374 2723 3676 775 -3076 -3451 -529 2538 3277 691 -2453 -2876 -944
1783 -944 1488 2810 1578 -1638 -2810 -1399 1004 2811 2246 -990 -2948 -1741 763 2594 2065 -640
1799 -640 -2554 -1846 163 2205 2235 -349 -2463 -1794 280 1828 1935 -9 -1924 -1529 72 1284 1652
1816 1652 490 -1263 -1627 -519 1016 2039 737 -1689 -2078 -193 1399 1720 290 -1630 -1654 78
$$ packed form
1703f73K452J053j938k898o88J899K466R48j531k711j011J308K213J763m99l023
1719h70k351Q07L182K814o70m011k734J492L444K318q59l379k418Q51K628K218
1735B462M27k420l200n41K394L356J286k540m013r19K548L474J620k212m146j402
1751c826K271L322J868j389l958k084J504L426K307q49l475k474Q43K673K693
1766B852M36l090l301k7K756L097R53k901l851l75K922L067P39k586l144m23J932
1783i44K432J322j232l216j172J411K403J807n65l236j958J207K504J831n29k705
1799f40j914P08K009K042L0k584k114O69K074J548J07j944j915L95J601J212L68
1816A652j162j753l64J108J535J023j302k426l89J885J592L21j430j920k4J732
$$ plain form
1832 78 1326 1253 284 -1025 -1264 -256 982 1510 833 -1170 -2002 -404 1212 1593 627 -1351 -2039 -484
1850 -484 1435 1689 634 -1123 -1997 -773 1205 2062 1098 -1078 -2420 -1088 1429 2275 1094 -1075
1866 -1075 -2362 -1288 968 2083 1441 -580 -2304 -1951 507 2410 2093 -230 -2666 -2449 460 2814
1882 2814 2289 -226 -2532 -2446 141 2356 2284 394 -2043 -2711 -738 1929 2881 1129 -1808 -3115 -1286
1899 -1286 1865 3103 1472 -1451 -3001 -1600 1296 2930 1879 -830 -2844 -2197 589 2811 2283
1914 2283 -337 -2761 -2560 173 2588 2472 164 -2298 -2561 -461 2132 2724 822 -1865 -2695 -941
1930 -941 1791 2798 1085 -1561 -2751 -1246 1345 2502 1254 -1070 -2335 -1560 683 2344 1781 -499
1946 -499 -2173 -1775 372 2236 1922 -217 -1979 -1759 45 1803 1706 2 -1575 -1723 -429 1391 1813
$$ packed form
1832G8J248p3r69j309k39J008J238N28o77k003q32J598J616L81r66j978o88J555
1850d84J919K54j055j757q74J224J978Q57r64k176j342J332K517Q46j181k169
1866a075j287J074K256J115o42k021j724L53K458J903l17k323k436K17K909K354
1882B814n25k515k306Q6K587K215p2j890k437o68J973K667R52j752k937j307J829
1899a286L151J238j631k923j550J401K896J634j051k709k014O47K786K222n28
1914B283k620k424K01K733K415j16k308k462k63K100K593N92j902k687q30J754
1930i41K732J007j713k646j190J505K591J157j248k324j265P75K243J661n63k280
1946d99j674L98K147J864l14k139j762K20J804J758r7j704j577j48J294J820M22
$$ plain form
1963 1813 446 -1318 -1713 -522 1222 1789 508 -1107 -1507 -444 1054 1539 496 -952 -1423 -579
1979 -579 686 1438 591 -886 -1434 -587 714 1403 571 -949 -1304 -388 819 1358 543 -807 -1170 -453
1997 -453 656 1334 776 -751 -1492 -749 661 1512 856 -927 -1670 -650 883 1560 869 -710 -1558 -781
2015 -781 668 1512 1155 -472 -1743 -1225 437 1711 1483 -369 -1965 -1478 434 1775 1506 -194 -1900
2032 -1900 -1627 97 1605 1831 316 -1690 -1958 -320 1628 2124 664 -1647 -2174 -572 1407 2071
2048 2071 900 -1301 -2286 -1034 1047 2074 1377 -800 -2330 -1428 743 2266 1693 -483 -2171 -1729
2064 -1729 346 2045 1858 -81 -2050 -1901 -41 1699 1981 420 -1721 -2109 -539 1522 2160 772
2080 772 -1390 -2154 -852 1270 2191 1085 -1100 -2097 -1110 818 1926 1268 -584 -1973 -1358 414 1828
$$ packed form
1963A813j367j764l95J191J744N67j281j615m00J063J498M85j043j448m71Q44
1979e79J265P52q47j477n48Q47J301O89q32j520l55R16J207N39q15j350l63P17
1997d53J109O78n58j527p41P43J410Q51o56j783p43J020J533O77o91j579q48P77
2015g81J449Q44l57j627j271N18J662J274k28j852j596M87J912J341k69j700j706
2032a900K73J724J508K26j515k006k68J638J948M96j460k311n27J602J979O64
2048B071j171k201r85J252K081J027o97k177j530R02K171J523n73k176j688M42
2064a729K075J699j87j939j969J49J860J740K82j561k141l88J570K061O38j388
2080G72k162p64J302K122R21j106k185r97R87J928J108o58j852j389O15J772J414
$$ plain form
2097 1828 1469 -268 -1800 -1556 180 1694 1604 8 -1460 -1499 -158 1308 1490 372 -1196 -1664 -469
2114 -469 1152 1522 500 -1028 -1625 -522 983 1380 487 -798 -1348 -529 718 1256 645 -568 -1240
2131 -1240 -737 540 1215 755 -514 -1271 -686 541 1211 550 -562 -1109 -654 441 1054 632 -355 -951
2149 -951 -636 390 1102 672 -353 -1020 -694 362 1087 675 -466 -1050 -713 194 1092 799 -292 -1139
2167 -1139 -858 282 1186 1029 -255 -1232 -955 258 1232 1078 -268 -1277 -976 -1 1112 1141 102 -1146
2185 -1146 -1245 -244 1079 1509 325 -1183 -1416 -405 1096 1643 518 -1087 -1518 -602 887 1693 761
2202 761 -888 -1607 -940 576 1554 1067 -618 -1636 -1043 331 1512 1338 -131 -1533 -1371 -18 1483
2219 1483 1650 56 -1546 -1574 -239 1376 1645 200 -1385 -1495 -375 1018 1544 644 -904 -1565 -768
$$ packed form
2097A828l59j737j532K44J736J514r0j596j468l9J341J466J82j118j568m68J195
2114d69J621L70j022j528n97J103J505L97q93j285n50Q19J247N38o11j213o72
2131a240N03J277O75m60j269p57N85J227O70o61j112n47M55J095O13m22r87n96
2149i51L15J026P12m30j025o67L26J056P25m12j141n84L37R07Q98k93j091q47
2167a139K81J140R04j57j284r77K77J213R74j54j346j009L01R75J113K9j039j248
2185a146r9J001J323M30j184j508k33J011J501N47j125j605m31R16J489Q06r32
2202G61j649p19O67J516R78m87j685j018N93J374J181j74j469j402J62J353J501
2219A483J67j594j602k8J335J615K69j445j585j10J120J393N26r00j548o61P97
$$ plain form
2236 -768 751 1672 980 -658 -1597 -969 543 1652 1028 -572 -1520 -1055 216 1282 1198 -206 -1390
2253 -1390 -1225 -16 1242 1291 41 -1138 -1157 -139 1077 1239 261 -881 -1116 -361 701 1237 505 -762
2271 -762 -1221 -549 733 1240 488 -695 -1106 -440 560 1090 477 -473 -869 -497 357 957 691 -346 -881
2290 -881 -681 259 922 671 -363 -1020 -617 300 868 593 -286 -832 -564 200 770 619 -123 -794 -568 210
2310 210 809 590 -156 -773 -661 92 747 719 -84 -811 -746 -2 749 800 29 -829 -862 24 904 840 7 -824
2332 -824 -824 -46 826 936 162 -724 -923 -295 625 958 319 -670 -1055 -465 608 1117 563 -579 -1165 -510
2352 -510 515 1134 742 -380 -1155 -695 376 1180 783 -301 -1115 -922 139 1045 940 -115 -983 -1026
2370 -1026 -92 998 1195 201 -866 -1172 -273 996 1220 332 -870 -1174 -455 754 1164 424 -635 -1077
$$ packed form
2236g68J519R21o92j638r39O28J512J109o24j600r48M65J271J066q4j404j184
2253a390J65J209J258M9j250j179j9J018J216J62r78j142k35P55J062N36p32j267
2271g62m59O72J282N07p52j183m11O66J000N30o13r50l96L72Q54O00k66j037n35
2290h81K00R40O63k51j034o57M03R17N68k75q79n46K68P64N70j51p42o71K26P78
2310B10N99k19p46o17J12P53O55k8q03p27O5P44P51N1p71q58l3Q86Q80o4q33q31
2332h24%P78Q72J10p74q86j99O28R20L33o39r89l85N90J073N09n54j142n86O55
2352e10J025O19l92j122p75M60J071Q04l97j084q14J93J061R06j05j055q68m3
2370a026R34J090J97r94j067l06Q99J269K24q88j202l04P19J209M10p40j059m42
$$ plain form
2388 -1077 -637 507 1180 728 -379 -1071 -772 321 1152 795 -324 -1020 -818 168 1045 868 -112 -913
2406 -913 -904 -37 825 905 63 -778 -875 -165 751 941 148 -647 -819 -270 558 943 370 -544 -818 -435 420
2427 420 883 396 -453 -792 -401 407 800 410 -345 -629 -369 255 685 504 -256 -610 -451 189 638 432
2447 432 -220 -634 -469 143 630 495 -210 -555 -430 20 583 503 -183 -571 -476 99 575 544 -82 -566 -483
2468 -483 28 626 629 27 -616 -559 11 517 662 177 -619 -651 -55 581 727 83 -588 -616 -129 534 710 215
2490 215 -512 -730 -236 444 775 382 -426 -850 -434 365 851 448 -433 -871 -458 341 848 612 -217 -837
2510 -837 -562 173 718 723 -29 -804 -759 -7 751 767 3 -783 -789 -146 643 822 244 -610 -793 -222 533 849
2532 849 403 -493 -945 -408 460 876 402 -423 -876 -475 295 779 495 -173 -739 -602 95 740 702 -63
$$ packed form
2388a077M40J144O73m52j107o92K99J093Q31l57j119o96K02R86Q77j77r80q01
2406i13RQ67Q62Q0q42q41r7P10R16J90p93p95j72N49Q28L85n73r14k74L83Q55
2427D20M63m87q49l39L91Q08L93l90p55k84K60O24M30j81p60l54J59O40M49k06
2447D32o52m14J65O12M87j35p05l45J25M50N63q0o86l88R5N75M76l1o26m84Q3
2468d83N11N98Lo02o43N7N70N06J45m85p96l2N96O36J46o44o71k8M87O63J76m95
2490B15p27k18M94O80L31l93q08m24M16P99M86m03q81m38M13P99N07k36q29o20
2510h37K75P35N45Np52p75M5P52P58J6p64p86oO43P89J79n78q54j83N71P55L16
2532H49m46q96m52N37Q68M16m74q25m53M01P70M84k84o68n66J37O97O45l8p65
$$ plain form
2552 -63 -665 -739 42 724 707 48 -681 -638 -19 565 646 109 -480 -656 -227 381 678 300 -407 -711 -272 457
2574 457 704 320 -337 -614 -328 345 656 212 -270 -585 -360 151 514 370 -172 -546 -344 165 545 325
2594 325 -91 -461 -387 152 494 388 -13 -445 -441 83 392 333 -15 -464 -420 23 478 438 -77 -434 -437 26 469
2617 469 396 11 -395 -407 -130 443 457 42 -416 -488 -168 433 534 57 -445 -589 -184 353 571 173 -361
2638 -361 -588 -189 474 682 276 -307 -622 -284 342 632 405 -250 -644 -380 193 684 475 -184 -636 -563
2658 -563 59 626 558 -65 -632 -623 -11 600 675 117 -586 -661 -165 551 714 146 -562 -728 -204 464 757 331
2680 331 -353 -682 -380 297 769 451 -286 -688 -389 224 786 571 -148 -658 -507 67 624 506 -86 -561
$$ packed form
2552f3o02p4P81O82j7o59p29M3O19N84Q1n37n89j76M29O08K97l78p07l04M39P29
2574D57K47l84o57k77K86O73L11m44m82l15K25N11L63j44n42l74K02N09L80k20
2594C25m16l70P4N39L42j06m01m32MN24L09n9l48m49M4M43M55m0n15l57lM63M43
2617D69p3l85m06j2K77N73J4m15m58p2L20O01J01m77n02j44M05N37K18l98n34
2638c61k27L99O63K08m06n83l15L38O26K90k27o55l94K64N73M91k09o59m52P3
2658e63O22N67o8o23n67RO12O11P5n58p03p5M96P16J63n68p08j66N24O68K93m26
2680C31o84l29L02O77M72l18p37m02K99O13N62k15p19n10J51N74N57j18n92m75
$$ [...]
8191I2
##END NTUPLES=NMR FID
##END=
