##TITLE=1H_AM_NV171
 CDCl3
 8 sc, 
 4.12.2024
##JCAMPDX= 6.0         $$ Bruker NMR JCAMP-DX V2.0
##DATA TYPE= NMR FID
##DATA CLASS= NTUPLES
##ORIGIN= UXNMR, Bruker Analytische Messtechnik GmbH
##OWNER= root
$$ XWIN-NMR		Version 3.5
$$ Wed Dec  4 15:30:25 2024 Russian Standard Time (UT+4h)  she@DPX200
##.OBSERVE FREQUENCY= 200.1315
##.OBSERVE NUCLEUS= ^1H
##.DELAY= (6, 6)
##.ACQUISITION MODE= SIMULTANEOUS
##.ACQUISITION SCHEME= undefined
##.AVERAGES= 8
##.DIGITISER RES= 18
##SPECTROMETER/DATA SYSTEM= spect
##.PULSE SEQUENCE= zg30
##.SOLVENT NAME= CDCl3
##.SHIFT REFERENCE= (INTERNAL, CDCl3, 0, 15.7039)
##AUDIT TRAIL= $$ (NUMBER, WHEN, WHO, WHERE, WHAT)
$$ ##TITLE= Audit trail, XWIN-NMR		Version 3.5
$$ ##JCAMPDX= 5.01
$$ ##ORIGIN= Bruker BioSpin GmbH
$$ ##OWNER= she
$$ F:/spectra/data/she/nmr/H-F/1/audita.txt
$$ ##AUDIT TRAIL=  $$ (NUMBER, WHEN, WHO, WHERE, WHAT)
(   1,<2024-12-04 15:29:12.95 +0400>,<she>,<DPX200>,
      <created by zg, POWCHK disabled, PULCHK disabled
       configuration hash MD5:
       00 E9 B6 7A A2 85 ED C7 34 08 36 98 17 FE 4E 26
       data hash MD5: 16K
       91 06 BA EA 46 EA 97 2E A5 0E 75 25 36 2F B5 93>)
$$ ##END=
$$ 
$$ hash MD5
$$ E3 4A 54 1E 29 A5 BC 94 A8 23 25 A3 EF 41 2D 6F
##$RELAX= 
##$RELAX= 
##$RELAX= 
##$RELAX= 
##$RELAX= 
##$RELAX= 
$$ Bruker specific parameters
$$ --------------------------
##$DU= <F:/spectra>
##$EXPNO= 1
##$NAME= <H-F>
##$PROCNO= 1
##$TYPE= <nmr>
##$USER= <she>
##$AMP= (0..31)
100 100 100 100 100 100 100 100 100 100 100 100 100 100 100 100 100 100 
100 100 100 100 100 100 100 100 100 100 100 100 100 100 
##$AQSEQ= 0
##$AQ_mod= 1
##$AUNM= <au_zg>
##$AUTOPOS= <>
##$BF1= 200.13
##$BF2= 200.13
##$BF3= 200.13
##$BF4= 200.13
##$BF5= 200.13
##$BF6= 200.13
##$BF7= 200.13
##$BF8= 200.13
##$BYTORDA= 1
##$CFDGTYP= 0
##$CFRGTYP= 5
##$CHEMSTR= <none>
##$CNST= (0..31)
1 1 145 1 1 1 1 1 1 1 1 1 1 1 1 1 1 1 1 1 1 1 1 1 1 1 1 1 1 1 1 1 
##$CPDPRG= <>
##$CPDPRG1= <>
##$CPDPRG2= <>
##$CPDPRG3= <>
##$CPDPRG4= <mlev>
##$CPDPRG5= <mlev>
##$CPDPRG6= <mlev>
##$CPDPRG7= <mlev>
##$CPDPRG8= <mlev>
##$CPDPRGB= <>
##$CPDPRGT= <>
##$D= (0..31)
0 1.2 0 0 0 0 0 0 0 0.06 0 0.03 0 0 0 0 0.0002 0 0 0 0 0 0 0 0 0 0 0 0 
0 0 0 
##$DATE= 1733311752
##$DBL= (0..7)
120 120 120 120 120 120 120 120 
##$DBP= (0..7)
150 150 150 150 150 150 150 150 
##$DBP07= 0
##$DBPNAM0= <>
##$DBPNAM1= <>
##$DBPNAM2= <>
##$DBPNAM3= <>
##$DBPNAM4= <>
##$DBPNAM5= <>
##$DBPNAM6= <>
##$DBPNAM7= <>
##$DBPOAL= (0..7)
0.5 0.5 0.5 0.5 0.5 0.5 0.5 0.5 
##$DBPOFFS= (0..7)
0 0 0 0 0 0 0 0 
##$DE= 6
##$DECBNUC= <off>
##$DECIM= 24
##$DECNUC= <off>
##$DECSTAT= 4
##$DIGMOD= 1
##$DIGTYP= 9
##$DL= (0..7)
0 120 120 120 120 120 120 120 
##$DP= (0..7)
150 150 150 150 150 150 150 150 
##$DP07= 0
##$DPNAME0= <>
##$DPNAME1= <>
##$DPNAME2= <>
##$DPNAME3= <>
##$DPNAME4= <>
##$DPNAME5= <>
##$DPNAME6= <>
##$DPNAME7= <>
##$DPOAL= (0..7)
0.5 0.5 0.5 0.5 0.5 0.5 0.5 0.5 
##$DPOFFS= (0..7)
0 0 0 0 0 0 0 0 
##$DQDMODE= 0
##$DR= 18
##$DS= 0
##$DSLIST= <SSSSSSSSSSSSSSS>
$$ [...]
##$SUBNAM2= <"">
##$SUBNAM3= <"">
##$SUBNAM4= <"">
##$SUBNAM5= <"">
##$SUBNAM6= <"">
##$SUBNAM7= <"">
##$SUBNAM8= <"">
##$SUBNAM9= <"">
##$SW= 24.0689530833862
##$SWIBOX= (0..15)
0 0 2 0 0 0 0 0 0 0 0 0 0 0 0 0 
##$SW_h= 4816.95568400771
##$TD= 16384
##$TD0= 1
##$TE= 0
##$TE2= 300
##$TE3= 300
##$TEG= 300
##$TL= (0..7)
0 120 120 120 120 120 120 120 
##$TP= (0..7)
150 150 150 150 150 150 150 150 
##$TP07= 0
##$TPNAME0= <>
##$TPNAME1= <>
##$TPNAME2= <>
##$TPNAME3= <>
##$TPNAME4= <>
##$TPNAME5= <>
##$TPNAME6= <>
##$TPNAME7= <>
##$TPOAL= (0..7)
0.5 0.5 0.5 0.5 0.5 0.5 0.5 0.5 
##$TPOFFS= (0..7)
0 0 0 0 0 0 0 0 
##$TUNHIN= 0
##$TUNHOUT= 0
##$TUNXOUT= 0
##$USERA1= <user>
##$USERA2= <user>
##$USERA3= <user>
##$USERA4= <user>
##$USERA5= <user>
##$V9= 5
##$VALIST= <valist>
##$VCLIST= <CCCCCCCCCCCCCCC>
##$VD= 0
##$VDLIST= <DDDDDDDDDDDDDDD>
##$VPLIST= <PPPPPPPPPPPPPPP>
##$VTLIST= <TTTTTTTTTTTTTTT>
##$WBST= 1024
##$WBSW= 4
##$XGAIN= (0..3)
0 0 0 0 
##$XL= 0
##$YL= 0
##$YMAX_a= 552677
##$YMIN_a= -881189
##$ZGOPTNS= <>
##$ZL1= 120
##$ZL2= 120
##$ZL3= 120
##$ZL4= 120
##$ABSF1= 10
##$ABSF2= 0
##$ABSG= 5
##$ABSL= 3
##$ALPHA= 0
##$AQORDER= 0
##$ASSFAC= 0
##$ASSFACI= 0
##$ASSFACX= 0
##$ASSWID= 0
##$AUNMP= <proc_1d>
##$AZFE= 0.1
##$AZFW= 0.1
##$BCFW= 1
##$BC_mod= 2
##$BYTORDP= 1
##$COROFFS= 0
##$CY= 11.3945322036743
##$DATMOD= 1
##$DC= 2
##$DFILT= <>
##$DTYPP= 0
##$F1P= 15.6554695791079
##$F2P= 12.8336369535428
##$FCOR= 0.5
##$FTSIZE= 0
##$FT_mod= 4
##$GAMMA= 1
##$GB= 0.15
##$INTBC= 1
##$INTSCL= 1
##$ISEN= 128
##$LB= 0.24
##$LEV0= 0
##$LPBIN= 0
##$MAXI= 10000
##$MC2= 0
##$MEAN= 0
##$ME_mod= 0
##$MI= 1.114404
##$NCOEF= 0
##$NC_proc= 0
##$NLEV= 6
##$NOISF1= 3.799351
##$NOISF2= 2.8
##$NSP= 1
##$NTH_PI= 0
##$NZP= 0
##$OFFSET= 15.70392
##$PC= 1
##$PHC0= -26863.07
##$PHC1= 11.78744
##$PH_mod= 1
##$PKNL= yes
##$PPARMOD= 0
##$PSCAL= 0
##$PSIGN= 0
##$REVERSE= no
##$SF= 200.130013532006
##$SI= 16384
##$SIGF1= 3
##$SIGF2= 2
##$SINO= 400
##$SIOLD= 16384
##$SREGLST= <1H.CDCl3>
##$SSB= 0
##$STSI= 0
##$STSR= 0
##$SW_p= 3612.71676300578
##$SYMM= 0
##$S_DEV= 0
##$TDeff= 0
##$TDoff= 0
##$TI= <>
##$TILT= no
##$TM1= 0
##$TM2= 0
##$TOPLEV= 0
##$USERP1= <user>
##$USERP2= <user>
##$USERP3= <user>
##$USERP4= <user>
##$USERP5= <user>
##$WDW= 1
##$XDIM= 8192
##$YMAX_p= 0
##$YMIN_p= 0
$$ End of Bruker specific parameters
$$ ---------------------------------
##NTUPLES= NMR FID
##VAR_NAME=  TIME,          FID/REAL,        FID/IMAG
##SYMBOL=    X,             R,               I
##VAR_TYPE=  INDEPENDENT,   DEPENDENT,       DEPENDENT
##VAR_FORM=  AFFN,          ASDF,            ASDF
##VAR_DIM=   8192,          8192,            8192
##UNITS=     SECONDS,       ARBITRARY UNITS, ARBITRARY UNITS
##FACTOR=    0.0002076,     1,               1
##FIRST=     0,             0,               0
##LAST=      1.7004516,     0,               0
##MIN=       0,             -881189,         0
##MAX=       1.7004516,     552677,          0
$$ Real data points
##PAGE= N=1
##DATA TABLE= (X++(R..R)), XYDATA
$$ [...]
2480F91J050j135j500j665K54L850L275j620l956j327R16J604K171N08m004m835
2496e723M51M308K497n59j456k639j813K745N333J374l552l169n06P26K646K871
2512C534j048m899k247K189K751J068j14k232l443j11M267K866j628k464r30m2
2528b483J903L954J195l969l564J177K847J249M48j283m213k205L227M421j27
2543B577k536j708j359K71L898L545k098m553r29K036J685J799R00l273m376P03
2559c418M346J598j686j752j770j513K308M696M62m038k287J187J658J763K056
2574C610j416m860j421L552L019k91j166j775k582M16M918K712k805l446m87O21
2590a401J492L151P44m246l656J903L500J018k16j003l105j724L408M132r38l285
$$ plain form
2480 691 1741 606 -894 -2559 -2305 1545 4820 3200 -756 -2083 -1167 437 2608 3116 -888 -5723
2496 -5723 -5272 -964 1533 974 -482 -3121 -4934 -2189 3144 4518 966 -2203 -2709 -1983 663 3534
2512 3534 2486 -2413 -4660 -2471 280 1348 1234 -998 -4441 -4552 -285 2581 953 -1511 -2441 -2483
2528 -2483 -580 3374 4569 600 -2964 -1787 1060 2309 2757 1474 -2739 -4944 -1717 2704 2577
2543 2577 41 -1667 -3026 -2755 1143 4688 2590 -1963 -2892 -856 829 2628 3528 255 -4121 -3418
2559 -3418 928 2526 840 -912 -2682 -4195 -1887 2809 3271 -767 -3054 -1867 -209 1554 3610
2574 3610 2194 -2666 -4087 -535 2484 2193 1027 -748 -3330 -2914 2004 4716 1911 -1535 -2022 -1401
2590 -1401 91 3242 3986 -260 -3916 -2013 1487 2505 2289 1286 -1819 -3543 -135 3997 3059 -226
2606b26j242k48L08L121K641k616m620j48K999J622N09J87k785l534J473N095
2622B536J358k641j996o24n10K169M146j02m694k557J981K085R98R25j399m200
2638b525j219L829L106r78j893j319j540O50M280K207l089l499J77J661J346J912
2654C106j08m046l042K283L714J51j404j314k260q71L600L767j428l655o96R32
2670a271J026K528K070k670m731J28L852J634o15o99k212k975J432M820J283l346
2686B54k401K59O37J821K851q7m075k005K481K649N61j71j569l096m43L550K343
2703C559j761k616j224n05J401L635J378l528l162J221K825J391J134n12l584
2718c48k565K791M063k39k437j612j234n76K638L210j220m044j276J679J653J484
$$ plain form
2606 -226 -1468 -1716 -1408 1713 4354 1738 -2882 -3030 -31 1591 2100 2287 -498 -4032 -2559 2536
2622 2536 3894 1253 -743 -1367 -1877 292 4438 4336 -358 -2915 -934 1151 2149 3074 1675 -2525
2638 -2525 -3744 85 3191 2213 320 -999 -2539 -1889 2391 4598 1509 -1990 -1813 -152 1194 3106
2654 3106 2998 -1048 -4090 -1807 1907 2058 654 -660 -2920 -3791 -191 3576 2148 -1507 -2203 -1271
2670 -1271 -245 2283 4353 1683 -3048 -2920 932 2566 1951 1252 -960 -3935 -2503 2317 3600 254
2686 254 -2147 -1888 -1251 570 3421 3334 -741 -2746 -265 2384 2945 2774 1205 -1891 -2334 1216 3559
2703 3559 1798 -818 -2042 -2547 -1146 2489 3867 339 -2823 -1602 1223 2614 3748 3236 -348
2718 -348 -2913 -122 3941 3702 1265 -347 -1581 -2157 481 3691 2471 -1573 -2849 -1170 483 1967
2734A967J123j741l251L55L670J842j236j676j534j302J330L180P5l676k284P79
2750b379J601J674J458j179l667j094L075K982K07j135j852k260K63L936K584
2765D214j987l305j320J2J243K790P55l478l427Q54K911J207J98j92j794j704
2781c023K177L494k7k723j382K72L88J181J375j363l424r72K322K276L87j268
2797c10k402j588J547L915J820j485k254j499L43K802L428n86m027k801O18J442
2813a037J473J270r04l545j738K830L407L57j165q72j057j45K300K150j285k814
2829g75n69J507J352M22o48k119j499J398K621N99j733j913j229N45K928K971
2845C858p89l289j708R10K171K302J086k271m084j435K668L028O82j463k551j991
$$ plain form
2734 1967 3090 1349 -1902 -1547 2123 3965 2729 1053 -481 -1783 -453 2727 2802 -874 -3158 -2379
2750 -2379 -778 896 2354 1175 -2492 -3586 -511 2471 2678 1543 -309 -2569 -2306 1630 4214
2765 4214 2227 -1078 -2398 -2386 -1143 1647 2402 -1076 -4503 -3649 -738 469 667 475 -1319 -3023
2781 -3023 -846 2648 2621 -102 -1484 -1212 -824 357 1732 369 -3055 -4027 -1705 571 958 -310
2797 -310 -2712 -4300 -2753 1162 2982 1497 -757 -2256 -1913 889 4317 3731 -296 -3097 -2479 -1037
2813 -1037 436 1706 802 -2743 -4481 -1651 1756 2113 948 76 -981 -1126 1174 3324 2039 -775
2829 -775 -1344 163 1515 1937 1289 -830 -2329 -931 1690 2289 556 -1357 -2586 -2041 887 3858
2845 3858 3069 -220 -1928 -1018 1153 3455 4541 2270 -1814 -3249 -581 2447 3129 1666 -885 -2876
2861b876N01L203K134r71k188j151K72J583J894J50j922j354P80J250J91m04j159
2878f7j907l56K258J936j468k637o37J103J871K161O95k452l465j47L078K584
2894B550m7k108k840j619J349L374K059j034k701k057K14K525K483Rk355j873
2910b071j44J236J746J110j076k336m68K041J538q91j345n56O5P75J671N91k050
2927a64k130O49K373J605o5j687k492j051J799K977J304j494k691j762P96L239
2943A206K603o74k935k160J00J706K439J043j779k900o24K081J807J60q33j212
2959B8j139L83J794Q94j142j503k3J191J330N78q90j927p85J460J910N33j503
2976A189k505j622J018K998J547j302k582j393M08K022K626N27k507k760j69K033
$$ plain form
2861 -2876 -2375 828 2962 1991 -197 -1348 -1076 507 2401 2551 629 -725 55 1305 1496 1092 -67
2878 -67 -1974 -2330 -72 1864 396 -2241 -2878 -1775 96 2257 2952 500 -2965 -3112 -34 2550
2894 2550 2503 395 -2445 -4064 -2715 659 2718 1684 -1017 -3074 -2860 -335 2148 2157 -198 -2071
2910 -2071 -2215 -979 767 1877 801 -1535 -2003 38 1576 685 -660 -1216 -1151 -376 1295 1886 -164
2927 -164 -2294 -1645 728 2333 2268 581 -1911 -2962 -1163 1814 3118 1624 -1067 -2829 -2033 1206
2943 1206 3809 3135 200 -1960 -1860 -154 2285 3328 1549 -1351 -1975 106 1913 2073 1240 28
2959 28 -1111 -728 1066 1960 818 -685 -708 483 1813 2391 1501 -426 -1211 249 2159 2692 1189
2976 1189 -1316 -2938 -1920 1078 2625 1323 -1259 -2652 -2244 -222 2404 2931 424 -2336 -2505 -472
2992d72J957P01r80k282j738P80K260R92j222j874j000N26J638J323n08j732n16
3009b147J133J713Q36o16j940j362R26K042P82j237k082j192K8J861K330M6k429
3026a308k146K52K076K076R49j211k490j203J632K574Q05j167j922j421L26J941
3042b37J353r63j795r42N78J410J287J54j523j267Q51J894R73l79j239j505j30
3059a480J903K010l17k416j678j30J545K008P91j671k625n87J944K254P92n92
3075A751j878j342O57K335J335q45j744j278k10J262J600l8k003j536M04J417
3091a13J215J40j166j610OJ948J743l41j647j279k18J202J968N57j874k328l37
3108b134J343J558J015o97k301j655J026K406J263m67j432j534k38J906K230k26
$$ plain form
2992 -472 1485 2186 1206 -1076 -2814 -2034 226 1218 -4 -1878 -2878 -2352 -714 609 101 -1631 -2147
3009 -2147 -1014 699 1535 919 -1021 -2383 -1457 585 1367 130 -1952 -3144 -3116 -1255 1075 1121 -1308
3026 -1308 -3454 -3202 -1126 950 1899 688 -1802 -3005 -1373 1201 2006 839 -1083 -2504 -2178 -237
3042 -237 1116 153 -1642 -2584 -2006 -596 691 845 -678 -1945 -1094 800 1773 1394 155 -1350 -1480
3059 -1480 423 2433 2116 -300 -1978 -2108 -563 1445 2236 565 -2060 -2647 -703 1551 2343 1751
3075 1751 -127 -1469 -812 1523 2858 2013 269 -1009 -1219 43 1643 1605 -398 -1934 -1530 -113
3091 -113 1102 1242 76 -1534 -1528 420 2163 1822 175 -1104 -1322 -120 1848 2405 531 -1797 -2134
3108 -2134 -791 767 1782 1085 -1216 -2871 -1845 561 1824 1357 -75 -1609 -1847 59 2289 2063
3124B063j867j429N9R41J269M56j385j891r7J480J218o9q60j194n78J180K027
3141A323N84j544j500k03P29J681J271r13k463j259J325J969R08m66j604j993
3157b155P9K396J908m77j583j197p3R90J934Q80j518j921m8J171J138M80n96j644
3175b36j043J105J767K90j132j268o37N37J743J104j016j994m43J015J354J059
3191B205j85j821j882N19K166J053p19j287j421o03J228K407M29j746j651l5Q69
3208d74J336J082o17k309r02J342J654L03o90j047j134K90J893J100j152j669
3224i94m60M57J057J110O3j836j543O93J736R96k13j005j683n75J700K029n2j646
3242a66j184l30P40J735J230j279k309n02J309J162M58j38j340j503M93K248J101
$$ plain form
3124 2063 196 -1233 -1174 -233 1036 1492 107 -1784 -1881 -401 817 748 -112 -1306 -1884 -704 1323
3141 1323 1907 363 -1137 -1340 -611 1070 2341 1428 -1035 -2294 -969 1000 1908 1442 -162 -2155
3157 -2155 -2076 320 2228 1751 168 -1029 -1102 -112 1822 2702 1184 -737 -785 386 1524 2004 1408 -236
3175 -236 -1279 -174 1593 1883 751 -517 -1154 -617 1126 2230 1214 -780 -1223 -208 1146 2205
3191 2205 2020 199 -1683 -1164 1002 2055 1336 49 -1372 -1975 -747 1660 2089 343 -1308 -1343 -474
3208 -474 862 1944 1327 -982 -1884 -542 1112 1415 725 -322 -1456 -1166 727 1827 675 -994
3224 -994 -1454 -997 60 1170 1233 -603 -2146 -1453 283 1279 1066 61 -1622 -2197 -497 1532 1480 -166
3242 -166 -1350 -1680 -940 795 2025 746 -1563 -2065 -756 406 864 726 -614 -2117 -1624 624 1725
3259A725r09j054o21p5J130J645m0j983j335O43J206Q82K65j006j889l99J824
3276IJ532k70j215r56o94P10K110J054j357j708j36P96Q20J071j17j946j741P39
3294a299J863N27n85q37j143l21J531J904l25j723q47L56Q46J279O73j236j810
3311a147J5J514R78q3p19j303j325P17K054N37j426j302j45M59J303J692j75j989
3329c45j190J077J283N79j62j140j711m39J634J383o15j294p67j64O82J689P63
3346A263j379j417L17J262Q72N56k65j642j198J037J872Mj328r85p35K0J448J529
3364A231n88j912l94Q98J108R56L27j202j697J38J738J034m53p69j064p81Q53
3381e77J817L05j696j266J1N48R57J080l92j769o13J428J584K46m57p17j134M6
$$ plain form
3259 1725 816 -238 -859 -934 196 1841 1801 -182 -1517 -874 332 1214 1479 473 -1416 -1815 9
3276 9 1541 1271 56 -900 -1594 -884 1226 2280 923 -785 -921 -125 695 1766 1649 -297 -2038 -1299
3294 -1299 564 1091 506 -331 -1474 -1795 -264 1640 1315 -408 -1255 -899 -53 1226 1899 663 -1147
3311 -1147 -1132 382 1360 1277 558 -745 -2070 -1353 701 1238 -188 -1490 -1635 -1176 127 1819 1644 -345
3329 -345 -1535 -458 825 1404 1242 102 -1609 -2048 -414 969 354 -940 -1707 -1871 -1189 500 1263
3346 1263 -116 -1533 -1216 46 918 1474 1209 -433 -1631 -594 1278 1282 -46 -1031 -1766 -1746 -298 1231
3364 1231 643 -1269 -1663 -765 343 1299 1626 424 -1273 -1135 603 1637 1184 415 -649 -1430 -577
3381 -577 1240 1545 -151 -1417 -1406 -858 99 1179 787 -982 -1595 -167 1417 1663 1206 489 -645 -599
3399e99J562J008j109j637n17K04P43J195L93j541j497O93J532Q75K28o73j386
3416e26o20J214J855k5j515j103l06K80J124J005q37j991n25J123J123N40p3j013
3434b70j168M33J746Q33o62j101p24k91R21J441q8j699j074N11R83P36M07p25
3452B09j721n22J605J467j35r23p74n19M22J638J157j108j694m63N92J026Q09
3469A066j36j480j348N77J579P05j96p69r73l34J248J578k07j388q37K25O39R66
3487I15N90r55j587j81J296J022J63p34j124p15O67J724O90r41j288n06L04J240
3505E80J269l44j742j130O28J227O63J68q33j400m43J466J371k11j175p19k41
3522h66M19J122N95r60j424r8Q72J020K80m84j142p50Q70J466L16q08j134o38
$$ plain form
3399 -599 963 1971 862 -775 -1292 -1088 -345 850 1243 -298 -1795 -1102 430 1305 1533 860 -526
3416 -526 -1146 68 1923 1898 383 -720 -1026 -746 378 1383 546 -1445 -1970 -847 276 816 743 -270
3434 -270 -1438 -1005 741 1574 912 -189 -913 -1204 -283 1158 1070 -629 -1703 -1192 -209 527 934 209
3452 209 -1512 -2034 -429 1038 903 -20 -794 -1313 -891 747 1904 796 -898 -1361 -769 257 1066
3469 1066 930 -550 -1898 -1321 258 963 767 -2 -975 -1309 -61 1517 1310 -78 -915 -690 -51 915
3487 915 1505 550 -1037 -1218 78 1100 1263 529 -595 -1310 -643 1081 1771 830 -458 -964 -660 580
3505 580 1849 1505 -237 -1367 -739 488 1151 1319 486 -914 -1357 109 1480 1269 94 -625 -866
3522 -866 -447 675 1270 310 -1114 -1212 -340 680 960 476 -666 -1416 -546 920 1236 428 -706 -1344
3540a344L20J369J223p11j765o98M23J101R57J69j131j588j33J561J314m9p67
3557B51j012n33N73J338O16q28j256l67M83Q48N70l97j186n48Q09R87L00l94p95
3576e41o81L88J501Q89q36j301n08N05R31J075N7j558j523K36J437J148J01j010
3594C10j304n50R17J729P23q70j139o09L92J316R55m95j270p57L55P73M79n0q60
3613D5r32J53J213O22n85p85l31K85R35Q30j28j212r53L81J226J009j28j327j387
3632a069k45J251J404K03j112j386o96O80J746J012o73j313p58M26J056R52K97
3649A775j174j244p6R55O86j22p72p48k47O01P56J03q88o00K61Q30Q77j5r07q77
3669h26J56J114Q73Pj092j370n25Q49J561N07j068j462o61O59J268J267k4j407
$$ plain form
3540 -1344 -1024 345 1568 857 -908 -1606 -1183 -82 875 1044 -87 -1675 -1808 -247 1067 1018 251
3557 251 -761 -1294 -721 617 1233 405 -851 -1218 -735 113 683 286 -900 -1448 -639 348 648 254 -541
3576 -541 -1222 -834 667 1556 720 -581 -1089 -584 347 1422 1479 -79 -1602 -1366 71 1219 1320 310
3594 310 -994 -1544 -627 1102 1825 955 -184 -793 -401 915 1870 1375 105 -652 -297 476 955 905 45
3613 45 -887 -734 479 1101 516 -269 -600 -315 620 1450 1322 110 -843 -462 764 1773 1645 318 -1069
3632 -1069 -1314 -63 1341 1544 432 -954 -1650 -970 776 1788 1115 -198 -956 -530 526 1478 1775
3649 1775 601 -643 -719 236 922 800 28 -720 -967 -366 390 493 -395 -995 -734 96 973 958 51 -826
3669 -826 -670 444 1317 1324 232 -1138 -1663 -814 747 1254 186 -1276 -1937 -1278 -10 1257 1233 -174
3687a74j215K06J351J052R6q39j134l83P23J014K54o84r05l23M11Q60K30o45p91
3706h96N0P28P28K33m59p52l40Q91J228K53j113j174m99N60J138P77o47j549r59
3725a802N60J366J060Qj097j128j05J208J232K42o87j125o15M81J138M38p93r33
3743e52m17L15O94N04k95p73n00O45J035L02n48q01l05L79R67N12n82j204p05
3762a329M56J119P05k66j153j076J70J176J067O8r08j170n05R66J487L26p68j078
3780g13m35L94R89P61m92j098n93M34Q27M92l13o36o55K10J007O16l87q35m40
3799h67J86Q97P46p4j084q26J36J035Q44k4q61j113k58R55J202K60q17j060m11
3818a134O10J084P72n86j090n91K68R66N89j82q07p90K05J000O33k03o68o93k4
$$ plain form
3687 -174 -1389 -1183 168 1220 1316 477 -657 -1040 -317 697 951 267 -638 -961 -550 310 540 -105 -896
3706 -896 -846 -118 610 843 384 -368 -708 183 1411 1664 551 -623 -1122 -562 576 1353 706 -843 -1802
3725 -1802 -1242 124 1184 1192 95 -1033 -1138 70 1302 1544 857 -268 -883 -402 736 1174 381 -552
3743 -552 -969 -654 40 544 249 -524 -1024 -379 656 958 410 -391 -696 -317 650 1162 580 -624 -1329
3762 -1329 -873 246 951 685 -468 -1544 -1374 -198 869 937 29 -1141 -1646 -680 807 1133 365 -713
3780 -713 -1148 -754 235 996 504 -594 -1187 -753 74 566 253 -383 -1038 -828 179 795 408 -427 -867
3799 -867 -681 216 962 888 -196 -1022 -886 149 993 969 108 -1005 -1263 -308 894 1154 337 -723 -1134
3818 -1134 -524 560 1332 746 -344 -935 -667 299 888 706 -101 -891 -686 314 947 744 76 -617 -641
3837f41Q36Q50j36r86p96J08P08R37Q5p54j083j78R80J086P5o76q25n42M48J193
3857F89P06o69j204n43M06P46O84j05j083r00K25R89Q23j77o80o52n4R14Q60j04
3877H71p53p90j49O35Q46J05q16j005j14P97Q07K95m58r69n45O38J336M28o64
3896D95q01m73K35R15Q31j54j169r18K59Q84N74j0p71q56j08Q11Q04J22o22p07
3916f59j02N35R56L36o39r90r1N37O75L45m20j136o81O42J080K82n76p34n25K10
3936i55J123R30k42r46n83K73P65P43L5q21j077r5Q21O86o4n54p78m21O79J090
3956F09K10o72o53r7M91P77M80m07j072m28O00P32K73l71p69p35K32R56O56m36
3976C76q41n01M6Q26Q97J60r19r02K81Q19N61J47l27j059n04O87J004Q0p93o30
$$ plain form
3837 -641 195 1045 909 -77 -873 -765 -57 880 965 211 -872 -1050 -70 1016 1091 415 -410 -952 -504 689
3857 689 1395 726 -478 -1021 -615 131 815 710 -373 -1273 -1048 -59 764 587 -93 -745 -799 115 975 871
3877 871 118 -672 -821 -186 660 765 -51 -1056 -1170 -373 434 729 271 -698 -1243 -605 731 1159 495
3896 495 -306 -779 -544 371 1202 1048 -121 -1039 -780 104 678 668 -103 -959 -1067 -256 548 670 48 -659
3916 -659 -761 -226 730 1066 427 -563 -654 -117 558 903 483 -653 -1334 -692 388 670 94 -640 -1165 -955
3936 -955 168 1098 856 -90 -673 -400 365 1108 1143 322 -755 -850 -29 657 593 39 -739 -1160 -481 609
3956 609 819 147 -506 -603 -112 665 1145 738 -334 -762 -162 570 843 472 -297 -1032 -800 156 812 376
3976 376 -465 -966 -920 -94 803 963 44 -858 -577 242 803 950 623 -436 -940 -253 751 831 38 -592
3996e92l27K78Q43O00m74r19l40O02P99M04j04p68o61K22R35N30m35q09o10r1
4016i17P03Q91j30r52p36K92N70O63L83m84r62k74Q41Q90O8m14o76m91J48R50
4036C63N09n45r18k97L06N99N95k7r11o06L40R86M32k36n41o15j42Q84P37j10
4056H03r04n95r3N60P33K23p28r39j43O98P14K86k82q22n28M39J089M31o01o18
4076b77m10P3O97P29k27r79n08K97N55M77J45n76q08q3R88P31j97p04l35j94M03
4097b03R05K48p46q88J4M68O21L52k44r54n67N53R42L28m23o18m65R3P62P71k59
4118F90r55m24J85N35O43K32p35q43O8P17N87Ol90p10l26O32P91K45q15o17n3
4139e37K77O60N56l68j057k81O16O57K21j46o13o82J54R19O04m02q06l95M1N67
$$ plain form
3996 -592 -919 -641 202 802 328 -591 -931 -329 470 874 770 2 -659 -437 498 1028 593 -216 -826 -917
4016 -917 -214 677 547 -405 -1141 -849 -279 384 767 283 -679 -953 -112 778 846 432 -244 -735 -587 363
4036 363 872 327 -591 -888 -582 17 612 585 -326 -932 -592 394 826 590 49 -566 -708 176 913 803
4056 803 -101 -696 -789 -229 504 727 -1 -940 -1083 -385 329 615 333 -489 -1017 -578 511 942 341 -277
4076 -277 -687 -614 83 812 585 -394 -902 -605 -50 427 572 -4 -812 -895 93 824 627 -77 -412 -606 -203
4097 -203 702 950 204 -684 -670 -202 419 771 527 -427 -994 -441 501 829 406 -212 -677 -584 178 949 690
4118 690 -265 -689 -504 31 674 906 171 -672 -604 113 700 706 316 -394 -720 -88 703 948 133 -484 -537
4139 -537 -260 400 956 588 -469 -750 -134 523 744 598 -15 -697 -543 376 980 578 -228 -623 -582 -15
4159a5O86J43q27q50J37P18O30J07m82p52k54O69P76J40m88n41m86K91P73M70
4179H45m88q27k25K46N18M45r5o26p01L50R60M64k84m78m68j69O86Q05j56q61
4199e9o60l9N70O02L29o97q22j62O70Q22K00l29o34l86L39R18L90n14p41k88J88
4220c03M79M35m6p65n72K10P29M18l8n49n73j0O71P32j60n46n26r6N45P89J40
4241I64o89q17r5M54N77J40k26q35o40M05J073M18n27o20k16J69O84O00N0q04
4261F5o84J67N94N15j95o27o12m7N76M44J00l82n76j85O01R15J27o11o31%L34
4282a12O43L35l22r73o25N34Q42K14l65n99m76J53O96P74j60p15o25J74O05O65
4302F63L8n61n88p5N10M61J31m17p31k55N36O70J8n64m17j79M35N86N11l67p34
$$ plain form
4159 -15 671 814 -13 -863 -726 -8 622 729 247 -505 -759 -90 686 826 338 -203 -689 -398 375 845
4179 845 357 -470 -695 -449 69 514 419 -207 -908 -558 402 866 582 104 -364 -533 153 958 802 -59
4199 -59 -719 -758 -188 414 743 46 -776 -938 -268 554 754 425 -209 -595 -256 662 1052 538 -203 -491 -303
4220 -303 176 611 565 -200 -772 -562 167 585 547 -2 -575 -585 86 818 658 112 -414 -510 35 824 964
4241 964 275 -542 -637 -183 394 534 308 -527 -1167 -762 311 729 202 -418 -634 -465 219 819 869 65
4261 65 -619 -452 142 657 462 -165 -777 -824 -248 196 296 -86 -662 -847 -246 669 796 185 -446 -446 -112
4282 -112 531 866 544 -429 -1054 -520 322 536 171 -428 -904 -751 -55 719 559 -156 -781 -607 -2 663
4302 663 701 140 -448 -523 -13 448 579 162 -569 -824 -288 382 400 -164 -581 -760 -325 261 772 405 -329
4323c29l86N47Q30K22k82p35m19J7O41P21j82q39o33o0P40P29M5n86n38m1M27
4344a11O37M28l87p82l76N40O30Mm40m21k38J52M25M75k65p28k50N40N95K27k97
4365C58n69l17J59O28O20j05q19o18PP34O56o3o77o74j03M11P11L86m63p05m43
4386h86N44P00K12k00m60m63M2N50M90j79o74k87K06M86K70j87m77l88K23M70
4406hM73j87n98n06J46Q27M62j32o51n78p7N54P51L11n71r48k57O10O58M08k72
4427D15o55n76J38P85O17k44n62m96L5N37M64Q2m31m56PM30M16p3l95l91R2M31
4449A70M94j06n18m59l3M66O35Q5o40o99m2N14O78L05k89p43n32L20R04M96k21
4470G85o91o67N6N42N92M8n64p04j7L79O14K12l57n56j6L62M31J80k67n08k30
$$ plain form
4323 -329 -715 -168 662 884 602 -133 -552 -535 106 827 645 -194 -827 -887 -147 582 627 41 -497 -538 -111
4344 -111 526 954 567 -215 -591 -51 579 583 143 -278 -516 -364 61 536 271 -457 -707 -167 428 655 358
4365 358 -211 -528 -369 259 879 774 -45 -663 -656 78 734 671 -6 -680 -783 -372 339 725 262 -443 -886
4386 -886 -342 358 570 370 -90 -553 -511 39 529 350 -324 -611 -405 81 351 164 -313 -701 -478 -8
4406 -8 465 278 -320 -826 -680 147 609 477 -174 -752 -829 -275 476 787 216 -732 -989 -379 279 687 415
4427 415 -240 -816 -678 107 724 480 -82 -578 -543 -6 458 540 109 -347 -340 90 506 433 38 -353 -261 170
4449 170 664 558 40 -419 -452 14 649 734 94 -605 -647 -133 545 850 561 -182 -714 -394 510 1006 785
4470 785 94 -573 -517 25 617 665 101 -603 -620 -241 373 585 228 -328 -344 18 449 629 362 -146 -376
4491c76L33N45J06n26n50p1L07N32K54l32p61l93N05P56L97l06o34m32J43O97
4511A94O02k3o80p26m6N05O29J06m53p54k24L82O07K82j99o06k87M59O24K13k42
4532C63m06k31J65M24K98k77o28l57K49N57K50j58n64m42J53O96N61o5n82n45
4552e39OP07N87Q1n16p05j78L95N96K32l93o92l51L01O43L01j68n40k73J61O02
4573B57M58q6n59l85K04M27L84l1o72n49J30N27K93q4m93m91j5N64N97R6m61n12
4595d01r3M31O16K51l41p69l50L83N56K39l15n69l70N5P16L72j16n86l83J51N75
4616E2M45K2n72m42J45M41M75n5m53n24j38M02N96J6m69n29j07L67N31L83l42
4637B44p02j89L90O14K95k97n30n07K70O18M37k81n71l61J13M39M30j1n45n10
$$ plain form
4491 -376 -43 502 608 82 -468 -539 -232 300 554 222 -539 -932 -427 329 726 420 -214 -646 -503 194
4511 194 796 773 93 -633 -679 -174 455 561 108 -646 -870 -488 119 401 202 -404 -691 -232 392 605 363
4532 363 -43 -274 -109 315 613 336 -292 -649 -400 157 407 249 -315 -757 -604 92 653 588 6 -539
4552 -539 -533 174 761 842 326 -379 -557 -162 434 666 273 -419 -770 -469 174 475 307 -233 -506 -345 257
4573 257 715 629 70 -315 -111 316 700 669 -3 -552 -422 105 398 314 -179 -670 -685 -121 476 572 111 -401
4595 -401 -494 -63 553 804 463 -306 -656 -273 283 522 207 -362 -732 -677 39 411 295 -291 -674 -523 52
4616 52 497 519 -53 -495 -350 91 566 511 58 -466 -604 -202 394 410 -59 -588 -695 -328 203 586 244
4637 244 -458 -647 -257 357 652 355 -175 -682 -412 206 643 362 -209 -570 -457 -18 412 401 -144 -654
4657f54J29N36M00J29l41n63j34O08N35J6m66m42k22K93O20K83m44o95q9K91M92
4678B82L56j61n59m35K81O02K82j90l33m73j5N69N10l1o57m29N4K92N21P3m06
4699A33o24n6M71O35k3k53n43k30L07O71J58m14m93k94J91N73M05k04o21l30K91
4720b50M25L33q7n12n38N4N94M79j60l99m20p7L61O10J29m62n80l5L36M81M7j83
4742A46n74k54L42O82M3l07m49l10J70N69M46k11o26k91K25N16K98m3n19m86R3
4763e40N28M77j14l92m35q9N58M59O4m35m28j06K51M42K55k86o53j29M42M36K18
4784E23j45m19m13K21O29K59l74n33k02J26K90M73p6n35m12J18N62L49O6l55m99
4805c47j31M88N45Q6m84m94k10L19N61J58l61o10j33L04M14L03j82m24l25K29
$$ plain form
4657 -654 -525 11 411 540 199 -364 -498 110 645 661 195 -247 -469 -176 444 727 283 -412 -501 -210 282
4678 282 638 477 -82 -517 -236 366 648 458 125 -348 -363 206 716 685 28 -401 -347 -55 466 539 133
4699 133 -491 -547 -76 559 536 283 -260 -490 -183 488 646 232 -261 -555 -364 209 614 410 -211 -541 -250
4720 -250 175 508 421 -91 -629 -575 19 498 338 -61 -481 -558 -197 413 542 80 -500 -535 -199 282 329 146
4742 146 -428 -682 -340 342 385 78 -371 -681 -511 58 504 293 -333 -624 -399 117 415 372 -147 -633 -540
4763 -540 -12 465 351 -41 -476 -565 -7 452 516 81 -347 -453 -202 240 495 209 -444 -573 -131 305 523
4784 523 378 -41 -454 -233 396 655 281 -252 -454 -328 -38 435 359 -176 -588 -470 92 441 507 152 -347
4805 -347 -478 10 555 641 157 -337 -547 -228 333 491 130 -480 -613 -309 105 408 226 -198 -523 -294
4825b94N62K64j61l80l64P9L47L73r6n18l25Q8L48M08O4n09m77pN23L90L7k72
4847H0l96j37L27O08J96l84n08k55L50K68K58k17n09l97J63N49L65j72l32k91
4867d34J0N17M93pn41k88n4L48M63o6m02m31n5L10M33L3l10m13k35M18O21R3k95
4890B08l31j75K41M73L14k05o25l11J92M48J87j38l96m42P6M19M89j21l11m12
4910d20P9L80M00J13m07l67j03K90L31J80k52m44k89L33L19J59k74l67k06J82
4930c63M91K94k53l48j74J15M87J82kn62l35O1M43L03r7k99m08r3L79M56J04m41
4952f0l66k8K12M31K66k18n32j37K22M03K27k24k73k92J7L59L13j40m32k32J76
4973c08L71K79p2l10l25N5L76M40r4m34l43m6L86M49K7l33m09r9K20N16K22l67
$$ plain form
4825 -294 268 532 371 -9 -373 -294 53 426 330 -188 -513 -425 -77 331 395 -114 -591 -598 -75 315 352 80
4847 80 -316 -453 -126 482 678 294 -214 -469 -119 149 407 190 -319 -716 -553 -4 361 189 -143 -434
4867 -434 -424 93 586 579 38 -250 -304 44 507 441 39 -392 -447 -137 296 329 19 -394 -629 -211 410 503 208
4890 208 -123 -298 -57 416 730 525 -100 -411 -219 229 416 278 -118 -560 -484 -65 424 303 -8 -420
4910 -420 -341 39 439 552 145 -222 -325 -35 296 476 224 -220 -509 -176 143 302 28 -339 -545 -363
4930 -363 128 422 169 -179 -353 -238 249 431 429 -133 -468 -407 36 339 242 -57 -465 -558 -179 277 381 -60
4952 -60 -426 -454 -242 189 455 237 -295 -432 -210 193 420 196 -77 -369 -352 7 320 180 -252 -484 -308
4973 -308 63 342 270 -40 -365 -310 66 506 412 -22 -365 -411 -25 424 451 118 -291 -390 -170 346 568 201
4995B01m44k21L39L84J95k01l38k69J12M20L12j34m03k73N8L50L13o5k94l71Q0
5016b49K97L40k5l11l90j2M10L71o1k74l22j11K36L96J88k67l87l06L15M40K08
5037D86j66m71l00J32M25J98j24l69k63j1M49L41ql71l11k0L63K92O0k93l36l8
5059c35K88L07J14l02m43j09K66L86J46k39m76k5K43M01K25o7m68k88K07L35L09
5080D75j97l23l36k0L43L23K9l90k80j8L28L26k3j57l89j05L11L39J26j74k89
5101a01k44L09L07J13k07l97j62J82L03K29j38m02k80K04L05L61k1l07l50kL97
5122I9L47rl17l46q1K28L48J38l66m12n3K48L32M3j11l39n9J88L51J37j87k72
5144i3j93J53K66K39k25l60k33K15L04K10j13l41l36P2M39L37ql82l19PK75M22
$$ plain form
4995 201 -243 -464 -125 259 454 253 -85 -354 -242 178 490 356 -47 -320 -262 88 401 336 42 -329 -249
5016 -249 48 388 363 52 -338 -350 60 431 370 96 -226 -337 -101 295 483 216 -171 -477 -162 278 486
5037 486 320 -151 -451 -319 106 304 180 -189 -452 -463 -14 327 319 -52 -363 -383 -20 272 332 39 -297 -335
5059 -335 -47 260 374 72 -371 -480 -214 172 318 79 -397 -422 -179 222 447 380 -88 -376 -169 166 475
5080 475 278 -45 -381 -401 -58 265 294 -96 -376 -394 -66 260 237 80 -309 -414 -103 236 362 188 -101
5101 -101 -345 -36 271 384 177 -220 -382 -200 103 332 194 -208 -488 -284 21 382 361 54 -296 -298 99
5122 99 446 437 120 -226 -307 -79 269 407 41 -371 -424 -176 156 199 88 -251 -310 -122 229 366 179 -93
5144 -93 -286 -133 133 372 147 -213 -446 -231 73 283 170 -171 -507 -435 4 341 333 -49 -368 -361 -86 336
5166C36R4k06m13j64K37L51J55k43l98q1J07K42K03j91k00k06J70L31J98o3k72
5187a3k68P9L85K86k06l51k62J22L52J56j6k64l20j05K90M03M5k61k73j67K99
5208h9L38K80j83m57j90K07K94J64r4l18k99J15K45K39p7k04j78K5L22J76n1k77
5230a2j49M1K16K02J17k95l17j5L11K49q9k26l20j58L26L80O5k56l02o0J47L61
5252B16K77k24l25k45P5L57J95q3k57k23m4K00L04L5k29l33M6J60K98N9k63k47
5274b51M0K80J40L5j79k41r1K05L21M5k70l10j39J89K95K53j52l66k10K30K49
5295G3L05j23k99k45j5L15K25P4l03k76l4K13L17L6k13k39l1J53K08J46k06k01
5317a20j97K16K97K0p2l05j52J74J88J57m3l02j34P6L21J73L2l89k06j4K72K40
$$ plain form
5166 336 430 224 -189 -353 -116 235 390 147 -251 -332 -225 17 220 29 -171 -377 -207 124 322 259 -13
5187 -13 -281 -202 183 469 263 -88 -350 -228 124 280 264 0 -320 -425 -135 268 313 52 -221 -388 -89
5208 -89 249 529 346 -111 -301 -94 200 364 270 -48 -347 -232 13 252 175 -29 -207 -182 140 316 265 -12
5230 -12 -161 -120 96 298 415 120 -197 -212 99 348 259 33 -287 -445 -119 261 326 70 -232 -292 -145 216
5252 216 493 269 -56 -301 -226 131 326 243 -14 -237 -281 -81 223 258 29 -304 -258 -98 200 259 -4 -251
5274 -251 -211 69 209 244 65 -176 -267 -62 259 304 34 -276 -415 -226 69 322 170 -196 -406 -176 73
5295 73 378 255 -44 -289 -304 11 236 310 7 -269 -303 -90 227 263 50 -189 -220 -67 141 287 81 -120
5317 -120 -317 -101 196 216 144 -161 -313 -139 49 206 163 -139 -273 -197 124 297 329 -60 -266 -280 -8 232
5339B32L7l27k26l7K05L05Q3j88k54r6J57L22J28j53k85j26J43J96Q9p5k00k30
5361c00J36K22K06j20k98j82J37K33K30q3k37k00O5K28K45pk49k33m6J52K85j7
5383A67j37l01p5J42K61K19k67k05j47K03L11P4r3j42k51M4L31J50j59j61k75
5404c11P4J84K10Ok53k54N6K93K81j8j46k44o7K34K84j9k20k38r5J43L04O1k26
5427C9k39p9J09J93K28r4l19j18J52K60J27k0k84j30L9K59J06L0k78j74p2J45
5449a20K26O2j94k90N1J84K53Q3k31j28p6J34K97N5j00k57j77Q3K14J08M3l40
5471a20k13J67J35K31l2k39j96N0K82J44L8j88k39%K64J87Mk14l20l1J63K29J38
5494B40j81l47l3J87K21J23k8k91j19P8K91J91j19k53j88Q9K36J69j02k14k14
$$ plain form
5339 232 269 -58 -284 -321 -116 189 272 84 -170 -266 -109 213 341 188 -97 -223 -80 116 205 130 -70 -300
5361 -300 -164 58 264 144 -154 -336 -199 34 264 181 -56 -256 -191 37 282 275 26 -207 -253 -101 184 167
5383 167 30 -271 -346 -204 57 276 9 -196 -343 -140 171 245 152 10 -241 -197 134 284 125 -36 -311
5404 -311 -237 -53 157 163 -90 -344 -288 5 286 268 122 -122 -189 45 329 310 90 -148 -243 -100 204 265 39
5427 39 -200 -279 -170 23 251 157 -162 -280 -128 132 259 239 -45 -175 -136 123 229 259 -19 -193 -265 -120
5449 -120 106 168 -26 -316 -265 -81 172 255 24 -104 -180 -46 251 306 206 -51 -228 -145 69 177 220 -120
5471 -120 -333 -166 -31 200 168 -71 -267 -217 65 209 247 59 -180 -180 84 271 275 61 -259 -290 -127 102 240
5494 240 59 -288 -321 -134 87 210 182 -109 -228 -150 141 332 213 -40 -228 -139 97 266 164 -50 -264
5515b64L7K45J19J24j55l42j3K06L53l1j54k42k5J76K03J23k48j88j58J62J60
5536H8J40o8k86j82J78K63J00o3k57j75Q8K43K15J1k51j73r0K77J49K5k52k52
5558b72N7J50K62Jk09k04p6K51K08K5j32j77j25J59K28O9o9k65j40J00K29J59
5580B29n5k62j61L4K53J64k0k97k32M7K51K93%k32k27L1J89J52J61k97j85r9J10
5603a53K27J10j26k55m8J84R2L00j44k13j54M3K91J41p6j73k68N1K94J44n9k64
5625e6j46J6K37J08P4k11k08m7K12K91M5k96j69q6J96K63Qj12k66o3O9K57J32
5648B48J6k83k27J40K33J62q3k70k34R0K31K11p5j79j52k3K13K13J8j98k15n9
5670b23K37J25P1k60j61n3J41K61P9j64k79o4J91K03J60q4k75j27L5J57L05p7
$$ plain form
5515 -264 -227 18 137 261 106 -236 -249 -43 310 279 125 -117 -142 34 237 360 112 -76 -234 -72 88
5536 88 228 160 -126 -308 -130 133 233 170 -87 -262 -174 69 284 295 44 -129 -219 58 207 232 -20 -272
5558 -272 -215 -65 197 198 -11 -215 -291 -40 168 193 61 -116 -241 -82 146 215 146 -119 -259 -159 70 229
5580 229 174 -88 -249 -215 38 202 182 -115 -347 -300 -49 244 244 12 -215 -184 5 157 318 21 -164 -263 -153
5603 -153 74 184 58 -197 -245 -61 31 331 187 -26 -180 -137 154 295 219 46 -222 -171 123 267 208 -56
5625 -56 -202 -186 51 159 233 22 -186 -233 -21 270 315 19 -150 -236 -40 223 231 119 -147 -210 -141 116 248
5648 248 264 -19 -246 -106 127 289 206 -64 -298 -208 23 234 159 -20 -172 -195 18 231 249 51 -164 -223
5670 -223 14 139 210 -50 -211 -264 -123 138 217 53 -226 -290 -99 104 264 180 -95 -222 -187 -30 275 198
5692A98j93l12O0K14K66m7k00k54L4K04J24J33j81l17k1K00K72J0j73j90m6K24
5714EJ77J64k20k66j27J89J71J21j25k77j07P9K71J30l1k07j61N9K64K35n2k37
5736E5k24o0K56K70kk09k53r3J99J99J19j32k59k8N0K52J73j60j36j34M6K96J17
5759C42j35k29k34J19K87R8q2k48k59J52K10J91n7k16j59L3J35K81mk22q4j82
5781b63K08L09L4k27j95j21J39J18K08j06k60j45J43K91J07j18j74r2O5J83J31
5802B35k8k39k12J51J65Q9K0k08k38l9K62J74Q6j77k34o8J59K17J37j57k53j21
5824b79J28K41J50j09k71k17J83K59J26q0j93j03K5J32K14J7k26j07n1J50K22
5845B11J16k89k66L0J86J57P1j28k99n9K99K13K5j72j95j94J33K45K43k10k43
$$ plain form
5692 198 5 -307 -247 -33 233 186 -14 -268 -234 -30 94 227 46 -271 -292 -92 180 190 17 -173 -219 5
5714 5 182 346 126 -140 -267 -78 93 214 89 -188 -295 -216 55 185 154 -53 -214 -155 109 344 292 55
5736 55 -169 -229 27 297 295 86 -167 -260 -61 138 257 125 -134 -162 -112 140 313 153 17 -117 -71 225 342
5759 342 207 -22 -256 -137 150 248 166 -82 -341 -189 21 212 155 -61 -220 -187 -52 229 225 3 -81 -263
5781 -263 -55 254 288 61 -134 -255 -116 2 210 104 -156 -301 -158 133 240 122 -52 -144 -79 104 235
5802 235 207 -32 -244 -93 72 161 181 -27 -265 -304 -42 132 218 41 -193 -261 -102 115 252 95 -158 -279
5824 -279 -151 90 240 131 -140 -357 -174 85 211 131 -62 -165 -140 -8 206 223 -3 -110 -161 -11 211
5845 211 327 38 -228 -198 -12 145 216 88 -211 -270 29 242 267 95 -100 -294 -161 84 327 117 -126
5866a26q3L1K56J34j6k44k51N1K94J29M4k27j05j41K04K54Ok57j31r5K17K01O9
5889B14j47k67m9K14J70J00j94j03j54O5L38M7q6k25j20J7K78J57j7l00j45L9
5911a68K26J64mk38k23J2J99J55R6j81j81r9K18J19J52k65j12p6J11K19M0j13
5933E1j97j51J83K57J83j76k29j41L9K76J90j04k48j40M0J72K14K1j79k47r1K42
5955c5K81j32k7k38q8J85K17R5j11k64j01J95J10J23o0k40j68J27K53Q7p7k46
5977a14k08K60J15J75mk86q0J3J94J62O3k42k15n7K26J70Pj12k33j03J21K48J04
6000B04j15k16m1P3J74J31p2k30o0J5K15R8k3k49j12k1K70P7J5j94j97Q3J84K56
6024B65l4k60j45J6J86J74J7j02j95j17J20K70N1j47k14j17Q6K25O1j6k09j27
$$ plain form
5866 -126 -209 -178 78 212 196 -48 -299 -248 46 175 219 -8 -113 -254 -50 204 210 -47 -178 -273 -56 145 214
5889 214 67 -200 -249 -35 135 235 41 -62 -216 -151 187 234 148 -77 -197 -180 98 255 238 -62 -207 -168
5911 -168 58 222 218 -20 -243 -231 -32 123 219 38 -143 -242 -24 95 247 -18 -130 -206 -95 124 164 51
5933 51 -146 -297 -114 143 326 150 -79 -220 -181 95 285 181 -67 -207 -167 5 219 240 61 -186 -277 -35
5955 -35 246 114 87 -151 -239 -54 163 258 147 -117 -218 -23 87 210 150 -90 -258 -131 122 209 132 -114
5977 -114 -322 -62 53 228 224 -62 -142 -129 65 227 290 48 -167 -224 2 172 179 67 -166 -269 -148 100 204
6000 204 89 -127 -168 -95 79 210 138 -92 -152 -137 78 176 153 -96 -208 -229 41 118 133 -61 -258 -175 9 265
6024 265 231 -29 -174 -158 28 202 219 117 -78 -195 -75 195 246 99 -115 -232 -146 79 140 124 -85 -212
6046b12KL04J24Jk65o6l4K08J41l9k45r0%O6K80pj24k05j68K41K20R6j76j52j13
6071b13J09K47J34o6k55j11P4J61J42l2k55k39J8L34J58K0l41j52Q8K07J25L0
6093A83j75j39r3K26R2J02j87j84q6P9K80N5j25k38qN9K33J57j65k51l9M0K59
6116G5J39r6j60j70M2J79J98l9j87j87j2J14J95J9j26j16j30J81K40L1j51j14
6138g5q0O2K41N9r7k01j08Q5K39Q2q8k29j34J65J11J83p1j76j56M2K00J90j1j78
6162E5k26J13O7K20n9j29k23oJ42K25J4j11j84o0R8K02N9n6j59j01JK45J08p8
6186A57j80k10J01K06J27k8j87j05m3J17K22Lj66j70p9K14J78P0k15j44p8J86
6208b4J32J14j86j27j48J08K09J33j10j37j44JJ85J31o0j78j21O7K16J15kj79
$$ plain form
6046 -212 -210 94 218 219 -46 -112 -146 62 203 164 -81 -171 -171 -105 175 168 44 -161 -329 -88 132 228 52 -100 -213
6071 -213 -104 143 277 211 -44 -155 -81 80 222 190 -65 -304 -286 48 206 226 -115 -267 -179 28 153 183
6093 183 8 -131 -224 2 94 196 9 -175 -261 -182 98 153 28 -210 -218 -159 74 231 66 -185 -224 -184 75
6116 75 214 118 -42 -212 -170 9 207 168 -19 -206 -218 -104 91 110 -16 -132 -262 -81 159 190 39 -75
6138 -75 -155 -93 148 207 110 -91 -199 -114 125 207 119 -110 -244 -79 32 215 144 -32 -188 -146 54 244 233 55
6162 55 -171 -58 9 229 170 41 -182 -188 -46 179 193 82 -102 -162 -64 138 197 141 -18 -119 -118 127 235 157
6186 157 -23 -233 -132 74 201 173 -14 -119 -162 -45 177 180 14 -156 -235 -21 157 227 12 -132 -210 -24
6208 -24 108 222 36 -91 -239 -131 78 211 101 -36 -180 -179 6 137 77 -101 -222 -155 61 176 174 -5
6230ej92J4J65K03r9q7j36J6N4J79R2j76j55q0J46J72J62j78j68j24j2K60J35
6253A86o9j87j05O9J56J83jk55k11M6K33J58K5k28j18m5J40J97Qj58j82J2P4K23
6277A51R4o8k68k3PK08J35j24j53j65P0K66J42j67j52j37NK59J31j03j45j57L0
6300a64K55J22m1j36j59pJ63J28Q1k27j23r0J19J65J15j35j74j45J63J75R8r2
6322I1k32o2J46J04J79q8j31k18M3K07J62q0j66j22n3J36J68N9j66j29o4J49K18
6345A51P4j93j18p5P1J94P2r3j72j38Q6J90J35j06k33n2J1K42J32j5j32k49L5
6368a83J57K25K8k59j17l3J55K48m4j71j44j8J04J56O4r2j81p5R5K46J19j82j21
6391b3j16J1K47J01m5l25lj0P5K52k1k29p7J1J58J29J9r2j66q0J33K70Lk08j53
$$ plain form
6230 -5 -197 -183 -18 185 86 -1 -137 -121 -67 112 204 28 -127 -207 -61 111 273 95 -73 -197 -209 51 186
6253 186 117 -70 -175 -106 50 233 232 -23 -234 -188 45 203 228 0 -118 -163 -23 174 182 24 -158 -146 -72 151
6277 151 245 177 -91 -114 -107 101 236 112 -41 -206 -136 130 272 105 -47 -184 -179 80 211 108 -37 -194 -164
6300 -164 91 213 172 36 -123 -130 33 161 242 15 -108 -198 -79 86 201 66 -108 -253 -90 85 183 91
6322 91 -141 -203 -57 47 226 138 7 -211 -168 39 201 121 -45 -167 -220 -84 84 143 -23 -152 -216 -67 151
6345 151 225 32 -86 -161 -90 104 176 83 -89 -227 -141 49 184 78 -155 -207 -196 46 178 163 31 -218 -183
6368 -183 -26 199 227 -32 -149 -182 -27 221 177 6 -138 -156 -52 104 168 76 -105 -180 -85 161 280 98 -23
6391 -23 -139 -128 119 220 175 -150 -153 -163 -88 164 143 -86 -163 -152 6 135 154 62 -104 -184 -51 219 222 14 -139
6416a39n4J66J46Q8j54k61m2J78J50P0l5k22j14L9K68Q4l1j16j34mJ39J33k5j55
6440b5k07M9K41Q4%j59j53k1J22J58K0j32q7j85J44K56L6j66q9j02J35J77J08
6463B04q7k66n5K8K96N3q2j66j25kK06K01n4r4k08K7J34K00k6j51j63k6J83J20
6487A47L1o0j94o0K6K72L7q0k42j7J9K30N3o9j77r0Q2J84P9J5j82j99J05J46J49
6512B05k6j46k16k2J57L15l7j83j35j36K16K11O8j42k55pP4J53J08p6k29k1pJ91
6536F0J55j23r9j83N3J08K21J4k89r8oJ77J33O4j76k33K5J78J26L3j07j65q4R4
6560a22K74R8r7k81j42J61K03J07r1k53r0J09J56J47q9j28j19nJ49K05k2k08j09
6583a47L7J35J34L1j54k63M9J47K08k9n9k03j05J57K34L2q7k23j42J52K10N7l1
$$ plain form
6416 -139 -193 -27 119 207 53 -208 -250 -72 78 148 113 -109 -223 -184 84 168 137 21 -113 -117 22 155 130 -25
6440 -25 -232 -183 58 142 142 -17 -170 -191 -69 89 109 -23 -110 -295 -151 105 141 -25 -114 -216 -81 96 204
6463 204 117 -149 -204 -176 120 173 91 -75 -200 -202 4 205 151 57 -151 -124 10 210 184 33 -130 -156 27 147
6487 147 178 118 -76 -136 -110 162 199 119 -123 -140 -121 109 162 93 -84 -174 -92 92 171 186 4 -195 -90 56 205
6512 205 179 33 -183 -205 -48 267 230 47 -88 -224 -8 203 271 129 -126 -133 -59 94 202 126 -103 -124 -131 60
6536 60 215 92 -7 -190 -137 -29 192 206 -83 -181 -187 -10 123 187 11 -222 -197 -19 107 140 33 -132 -216 -122
6560 -122 152 250 153 -128 -270 -109 94 201 110 -143 -233 -124 32 179 90 -38 -157 -162 -13 192 170 -38 -147
6583 -147 -110 25 159 190 36 -227 -178 -31 177 148 89 -114 -219 -62 172 204 117 -106 -248 -96 114 171 140
6606A40k46j29P7J99J23J2j73j99j3K37J81Pk06j80MJ50K16J12k66k78RK35O4
6629G6O9r3j83j22J77K29R1k06j68p4L8K69J42n2k98n7P6J26J68o2k23j60R8J96
6653E7M0L7j39k29j6J89K54J2k03k00j4K02J44P3p3k32q3R4K06K1l2k56k02K45
6677a05K33Q8j12k45j6qK36J73k8k35j24N0J47J08N0j62k38mJ42J76O1j35j65
6700a13j44K06J67J35j21k52o3J69J83Q2r5j98j14O3J72J14o3k45o6J5K35K23
6722B90p9k34k14J20Q3K96n3r0k36l9J38K35k3q2k50r0J11J91J31k00j32q1R4
6745a14K36J35o8k79j45J78K15J3Pj40k21K4K35R4j6j50k60N7K08J17Q6j86k27
6768b01n8J49K37J39j11k91J6pK85N1j01k32n2N6J63J10q3k00j35R8K03J39J2
$$ plain form
6606 140 -106 -235 -158 41 164 176 3 -196 -209 28 209 216 10 -170 -166 -16 200 312 46 -232 -223 12 76
6629 76 145 52 -131 -253 -76 153 244 38 -130 -204 -166 103 245 193 -105 -162 -86 40 208 146 -77 -237 -139 57
6653 57 97 134 -5 -234 -250 -61 193 205 2 -198 -212 -10 134 207 134 -98 -181 -87 119 140 108 -148 -350 -105
6677 -105 128 216 104 -141 -157 -165 71 244 216 -19 -143 -93 54 162 212 50 -188 -192 -50 126 187 52 -113
6700 -113 -257 -51 116 251 130 -122 -185 -16 167 249 154 -44 -158 -95 77 191 128 -117 -183 -168 67 290
6722 290 211 -23 -237 -117 -34 262 209 119 -117 -156 -18 217 194 112 -138 -228 -117 74 205 5 -127 -208 -114
6745 -114 122 257 189 -90 -235 -57 158 171 178 38 -183 -159 76 170 154 4 -256 -199 9 126 212 26 -201
6768 -201 -259 -110 127 266 155 -136 -120 -127 158 209 108 -124 -176 -120 43 153 70 -130 -265 -167 36 175 187
6791A87k17j65K9K26J19k1j15j72o6K18J55j3j79j43q5J90J87R8j32k78n0J70
6813e7J93J20j25k69r8J39K24O7o7j59j83N2K41J02M8l24l2qJ40K47q1j78j41
6836a49J2J43J75N2k08j71p1J66J68J15j53j96n0O5K23J06r6k28p9J09J75R3p7
6859A24k18j37M1K20J63rj83j92j1K56J33L3j47k25M2N1K14O4j41k26j9J35R8
6882F6J13j58j64r6J27K37N3o2k52n3M5K57Q7p3j17k19N8J76J41Jj97j28J3O4
6906h1K23j6j7k89n8J71K35N5o8l00q8K01J57J14j34k22q0Q0K23J01j05j87j70
6929b55R6K73P1j8k44o7M9R9K22ok00k15pJ81J63J3j38k56m2J79K15J0k8k95n1
6954b51J38K30P6l3k49o3J0K17O8kj34k67M7J98K50j66j72m7o1J59J94N7j79k65
$$ plain form
6791 187 -30 -195 -166 60 179 158 43 -129 -195 23 178 165 -14 -157 -242 -52 135 233 101 -177 -227 -57
6813 -57 136 256 131 -138 -236 -97 127 194 127 -32 -215 -163 78 180 228 -96 -128 -136 4 251 170 -8 -149
6836 -149 -137 6 181 233 25 -146 -217 -51 117 232 79 -117 -167 -102 121 227 131 -97 -176 -67 108 201 124
6859 124 -94 -231 -190 30 193 184 1 -191 -202 54 187 220 73 -152 -110 -59 155 219 78 -148 -167 -32 66
6882 66 179 21 -143 -239 -112 125 178 116 -136 -189 -144 113 200 127 10 -209 -151 25 166 167 -30 -158 -145 -81
6906 -81 142 126 109 -180 -238 -67 168 223 155 -145 -233 -32 125 239 105 -117 -197 -117 106 207 102 -85 -255
6929 -255 -159 114 185 167 -77 -144 -95 4 226 220 20 -195 -202 -21 142 155 17 -239 -281 -102 113 123 95 -200 -251
6954 -251 -113 117 193 160 -89 -152 -142 75 143 141 7 -260 -213 -15 235 69 -103 -150 -211 -52 142 199 20 -245
6978b45m3K42K42M5k13j69o8J61J21J20k42p8p9K3K89N3q1k02j05N8K01J29N0
7001B09k46r4m0K65J37m0k56j23K0J56J91l3k28q3l0J09J92O0j32k04j2O7K59
7024A44N4j45j33j28mL07J15q0k26j32R6J34K14j27r7k05j5K91J47m2k23j27P8
7047a04J44J50Q4k98j13k8J43J83P0j58j76j28K02J81P0j43j76j24J16K33J46
7068B74j05k19j52J28J79Q7L0l17m8l8J51K12j8j63j65j30K87J71J0q4j85j03
7090a98J24K35R7k00j37j62J84J26J62j17k45p5N2K49P3j2j88j30J4J85K01m9
7112A89k15j28M1J68R9P8j63k26j15K06K71o5k6k77k6J61J18J07j26k07j23K17
7134d2J20J18m4k48j83J32K40N4M5k47j07L0J86J55J3k11j91o0J43L39J1k85j40
$$ plain form
6978 -245 -288 -46 196 241 28 -141 -209 -48 73 193 -49 -127 -206 -183 106 159 78 -124 -229 -171 30 159 209
7001 209 -37 -131 -171 94 231 191 -65 -188 -168 -12 179 146 -82 -165 -195 -86 106 166 34 -170 -182 -115 144
7024 144 198 53 -80 -208 -212 95 210 130 -96 -228 -132 2 216 89 -8 -213 -228 63 210 168 -55 -182 -104
7047 -104 40 190 274 -24 -137 -165 -22 161 231 73 -103 -231 -29 152 222 79 -97 -221 -105 128 274
7068 274 169 -50 -202 -74 105 192 222 -95 -143 -181 -30 182 164 1 -164 -294 -7 164 174 90 -95 -198
7090 -198 -74 161 258 58 -79 -241 -57 69 231 114 -131 -206 -154 95 168 156 -32 -162 -148 37 238 189
7112 189 -26 -154 -113 55 154 232 69 -157 -272 -66 205 140 114 -163 -189 -28 90 197 71 -136 -259 -42
7134 -42 78 196 152 -96 -279 -147 93 147 192 -55 -162 -132 54 209 222 11 -180 -240 -97 242 253 -32 -172
7157a72k8J83K20M4j89j81l1J24J59J26j04k63j38J56J47J37k1k80j38N6K63J35
7179B05pk16k25N9K37J34K0k07j74L1O9L04n4j76j06n9Q4J98O8r7k56pM4K43R9
7204B11p9k91l3M7K05J50j4k28j32N7J09K81j05k09k03O3J44J24O6k42j24O4J48
7227IJ27K4l1j68j74J44J88J47j22k70q1J08J73N2n3j73j39J56J31J07J0k87j84
7250c06J66J76K00j16j08j12o4K42J78n4j63k33L6J37J84P8j18k70p2J07K89J04
7272B81j52j64j26O0K54J25q1k26q7n1K65J22j03j65j53R7K11J1jj70j62k9K34
7295a0K17N2k63j68MJ41J62R0j21k84o1Q8K86K8p9j72k09J17L12J13q5j73k10
7318b25J02J35K59l8k72j09OJ35J52M3k16j81k8J39K46K4j95j71K0J53J44J54
$$ plain form
7157 -172 -200 -17 203 247 58 -123 -154 -30 129 255 151 -112 -250 -94 53 190 169 -111 -249 -193 70 205
7179 205 198 -18 -243 -184 53 187 207 0 -174 -143 -74 230 176 0 -106 -165 -81 117 185 88 -168 -175 -131 112 211
7204 211 132 -159 -192 -145 60 210 196 -32 -164 -107 2 283 178 -31 -234 -171 -27 97 163 -79 -203 -139 9
7227 9 136 160 129 -39 -213 -69 119 266 144 -126 -207 -99 74 126 73 -100 -239 -83 48 155 165 -122 -306
7250 -306 -140 36 236 120 12 -100 -164 78 256 202 39 -194 -158 -21 163 241 123 -147 -219 -112 177 281
7272 281 129 -35 -161 -101 153 278 197 -29 -116 -167 98 220 117 -48 -201 -104 107 118 117 -53 -215 -244 -10
7295 -10 207 259 -4 -172 -168 -27 135 225 104 -180 -241 -153 133 161 82 -90 -299 -182 130 243 158 -15 -225
7318 -225 -123 12 271 233 -39 -148 -142 -7 145 188 -28 -209 -237 -98 148 172 -23 -194 -174 -21 123 277
7340B77j48k40j25J12K40R8r2k65j23J26K37J00q0j82j65%K66K11o6k21j02J0
7362a32K15J08M4k17j57o2K43J02K2q5j67j4R5K15L1p3k72k4R7J39J57j68j53
7385e6j70J39K12Q9l4k15k16R7K20O6R3k43j11k0J27J69Q0k43j47q7J94J72Q7
7408B03p2k60p8Q5K86J13j80k25o3P4J39K09j07j89j16O0J90J53j9k30j50j8J58
7431c7K05j6j11j85q2K15K07N2k05k33N3J8K31Q7j81k18o8J63J89J82k16j25j67
7454b42R8J96J48r4j99r7K6J84K05j4k30j82k3K36K30o0j99k12o4K77J19P4j45
7477C2k05J1J06K41J0j02k49m5J46J80P4j03j98j16M1K09K25q6k67j22PK04J93
7500A86L1k85n0p5K14K15m7k54j15k1J21L03p3n4k02q4R6K38K5j04k08q8Q8K54
$$ plain form
7340 277 129 -111 -236 -124 116 214 122 -143 -266 -140 97 197 117 -65 -230 -230 36 247 181 -40 -142 -132
7362 -132 83 191 235 18 -139 -201 42 144 166 81 -86 -100 -5 210 241 168 -104 -128 -31 108 265 97 -56
7385 -56 -226 -87 125 214 180 -35 -251 -154 66 132 225 -18 -129 -149 -22 147 227 -16 -163 -250 -56 116 203
7408 203 131 -129 -207 -122 164 277 97 -128 -191 -117 22 231 124 -65 -181 -121 69 222 203 -27 -177 -195 -37
7431 -37 168 152 41 -144 -226 -11 196 248 43 -190 -137 -119 112 199 18 -200 -268 -105 84 266 50 -75 -242
7454 -242 -144 52 200 106 -93 -190 -164 20 225 211 -19 -201 -224 12 242 182 -17 -229 -293 -16 103 177 32
7477 32 -173 -162 -56 185 195 93 -156 -201 -55 125 199 96 -102 -218 -177 32 257 171 -96 -218 -211 -7 186
7500 186 217 -68 -118 -193 21 236 189 -65 -180 -201 -80 223 150 96 -106 -190 -94 144 169 65 -143 -231 -143 111
7524A11J13j15j98j60J29J68J67q4j98q3L1J15J82k7j79j81m2K16J31R4j46j83
7546a39r2K29J54J55k36j07j35J19K26Q3j25k81k2m5L64J9J4k57j03OK76J27o3
7569A67j43j51K2K01J15n7j56j80M7Q3K67n4j44j33r7K03J51Q0j35k09o0Q6J91
7592I4J39o2k29j59J15K46J48q6k53j61Q5K54Q9o7j45k68RK54K34r2r5j65QJ53
7616D6J48J0j15k34n6J88R8Mo6k13k6Q1J78J08j00j45j67Q2J63K44j50j19j67
7639b08J19J58O6Q7k53j59k7K51R3P0k00k12kJ81K20R3k22j80q7R8K84K3j06k29
7663a42m9M3K18J95j50k20j64N1K60J58r8j86k00P9K45Q0O4j73j75o9K44J76j8
7686A69j82j10j23J64K77pj43j62q1O5J98J81j04k43j27Q5K22J33j52j13j17L1
$$ plain form
7524 111 224 109 -89 -249 -120 48 215 131 -67 -150 -119 -4 178 151 -28 -209 -251 -35 96 190 44 -139
7546 -139 -231 -2 152 307 71 -36 -171 -52 174 257 132 -149 -171 -216 148 167 181 -76 -179 -173 103 230 167
7569 167 24 -127 -105 96 211 154 -2 -182 -135 -52 215 161 17 -116 -213 -10 141 221 86 -123 -183 -97 94
7592 94 233 171 -58 -217 -102 144 292 206 -47 -208 -123 131 220 153 8 -260 -251 3 237 145 50 -115 -107 46
7616 46 194 204 89 -145 -201 -13 85 89 23 -190 -216 -135 43 151 51 -94 -261 -179 -16 228 78 -41 -208
7639 -208 -89 69 135 222 -31 -190 -217 34 127 197 -3 -215 -217 -36 184 277 55 -125 -212 -114 170 193 87 -142
7663 -142 -191 -148 70 265 115 -105 -269 -218 42 200 102 -84 -284 -205 40 120 184 11 -164 -233 11 187 169
7686 169 -13 -123 -246 -82 195 188 45 -117 -198 -133 65 246 142 -101 -228 -143 79 212 60 -53 -170 -139
7708a39J84J12J6k44j46K5J87J80L9k62p8o5J80K08M6j48j98j37J72K63Kj12k72
7731a87n1J12J98J48j09k30q0P7J97K19j74j75j77J15J10K37j12j55q8l0J46K02
7753A93M0k52k11lK05J87k2o5k43J6J12K19q1j09j28r6J22K44Q8j23j06j69O0
7776a22K11J74o1j73k20R2K06J49o9j95j15o4K13J82Kj56k09p8K19K84j3k65p5
7799h3lN1K39M3j09j64j78R9J44J86j16j89j26R4J99R1o2j07k18M6K63J70kk53
7823A5j70l3J90K03K4k40j50n7J25K06Q7j43j57r3Q8K15J33j25k27r8J24K38Q2
7846B37j42j21k13J31J66J07l6k03j74R7R8J84K5j86j98m5K42K19K8j62j56j72
7868b74K64J46P2j90k55K0N8K41J29j54j27j24L8K36J57k1k26j25J2J99J94q0
$$ plain form
7708 -139 45 157 173 -71 -217 -192 -5 175 214 -48 -126 -191 -11 197 243 95 -103 -240 -68 195 197 85 -187
7731 -187 -238 -126 72 220 111 -119 -199 -122 75 294 120 -55 -232 -117 -7 230 118 -37 -125 -155 -9 193
7753 193 233 -19 -230 -233 -28 159 137 72 -171 -155 -43 176 95 -14 -142 -238 -116 128 216 93 -13 -182 -122
7776 -122 89 263 202 29 -191 -99 107 256 187 -8 -123 -187 26 208 210 54 -155 -233 -14 270 257 -8 -83
7799 -83 -86 -35 204 247 138 -26 -204 -105 39 225 109 -80 -206 -112 87 178 116 9 -209 -163 100 270 268 15
7823 15 -155 -188 2 205 229 -11 -161 -218 -93 113 200 57 -100 -193 -105 110 243 118 -109 -207 -83 155 237
7846 237 95 -26 -239 -108 58 165 129 -74 -248 -151 -53 131 156 -30 -228 -273 -31 188 216 54 -102 -274
7868 -274 -10 136 208 18 -237 -217 -159 82 211 57 -70 -194 -156 80 237 216 -10 -135 -123 76 270 190
7890A90k19j24j02K73J77j3j81j63o3J64K04P0j30k87l2K74J57J1q6j74j38Q8
7912a04K29Q2r4j58j37Q3J05J93n6k38j13J1J98J66J3k30j28L1J63J02Q9j84j49
7935a26j7J54J56Jj00k42p5J66J40O0j04j61l8J21J87J33j30k41n8OK33K05j03
7958A67k13j92Q1J67J67pj92k69R6K08J03K0j76j01n9J87J22R4j56k49j3J66J38
7981H9O6J9l08j27J72J96J18j5l20l2n0J96J85k0k09j21Q8J27J78Pk55k40L0J66
8005f0L13j02j31j52m8Q9J96J33j41k63qJ18J45J76j76j69j64J75J83J25j22k27
8027a10j20R9K02J32j53j15j73R9J26J30J03j81k71O0J08K39L0j40k12j26K34
8048c9J75M7j53j31q4Q8J64J73r1k58j22N4K45J50o6k15j34J5K89R4l4j55k13
$$ plain form
7890 190 -29 -153 -255 18 195 182 1 -162 -225 -61 143 213 83 -204 -236 38 195 206 120 -54 -192 -104
7912 -104 125 207 113 -45 -182 -99 6 199 143 -95 -208 -197 1 167 180 -50 -178 -147 16 118 207 23 -126
7935 -126 -143 11 167 168 68 -174 -249 -83 57 117 13 -148 -186 -65 122 255 125 -116 -174 -168 65 270 167
7958 167 -46 -238 -157 10 177 170 -22 -291 -195 13 116 136 -40 -141 -200 -13 109 203 47 -202 -215 -49 89
7981 89 155 174 -134 -261 -89 107 225 210 -110 -142 -192 4 189 169 -40 -161 -73 54 232 239 -16 -256 -226 -60
8005 -60 253 151 20 -132 -180 -91 105 238 97 -166 -174 -56 89 265 89 -80 -244 -69 114 239 117 -110
8027 -110 -230 -131 71 203 50 -65 -238 -139 -13 117 220 39 -232 -172 -64 175 205 65 -147 -273 -39
8048 -39 136 183 30 -101 -185 -97 67 240 149 -109 -231 -177 68 218 152 -63 -197 -182 107 201 167 12 -201
8071b01k2J47K25J07k27k23N4J80J22pj07k45k3J59J96L0q6k20r6M6L52L1pk15
8095c0j89J08J75J50o0j95j79J12Q7K58L1k05k01j7R6K32J5k09j32o2K44J11J19
8118B59j62k47N5R0K00J01j08k75j22J09K12J32q6k75j03k1L38J12lk42j97N7
8140a76J36K53rk04j35q9K06J97Oj58j58j30J15J93J13o5k34j64K31K00P0m7k46
8163i5r8Q8K10J47j15k91j19L9K34J95j13j26j90PK33N1J19k60j34p0K30J89O5
8186A96j67j16j06R1J97
$$ plain form
8071 -201 -223 -76 149 256 29 -194 -140 40 162 155 48 -197 -220 -61 135 165 79 -141 -237 -191 161 192 185 -30
8095 -30 -219 -111 64 214 154 -41 -220 -108 -21 237 268 63 -138 -155 -59 173 188 -21 -153 -215 29 140 259
8118 259 97 -150 -95 -5 195 296 188 -87 -209 -100 112 244 158 -117 -220 -241 97 209 206 -36 -233 -176
8140 -176 -40 213 204 0 -135 -224 -18 179 185 27 -131 -261 -146 47 160 95 -139 -303 -72 128 198 151 -95
8163 -95 -193 -105 105 252 137 -154 -273 -234 0 195 82 -44 -234 -227 6 57 176 -84 -218 -288 -58 131 196
8186 196 29 -87 -193 -102 95
8191I5
$$ Imaginary data points
##PAGE= N=2
##DATA TABLE= (X++(I..I)), XYDATA
0@%%%Qj6QqK4l2M0m8N6q0R7j13J43j73K03k38K81l31L84m43N13n93O78p73Q78
28D65r94J122j265J424j595J785j994K222k472K746l045L378l743M139m582N077
44B668n626O242o933P722q629R677j0916J2405j4228J6521j9510K3589k9518L8950
58B2414n6303R8558l80667n65191P12312K50642l75880n9233L71977k31918m49867
69f63156K56146N78700r7409l75157L1386J62420j34737n6174J82167O9817j46486
80a92483o8679J9391K4227N8070O299j44202l215K45740P1093k40586n9606J91075
92i2876j2032j11159K45008K46119k95981l66299J82304L00933p1885o6037J47107
103A05202j17542l53103N0605L84399Q0581j66531p60j9145k04575M1840L58849
$$ plain form
0 0 0 0 0 8 -8 0 -8 16 -16 24 -24 32 -48 49 -64 79 -94 109 -129 152 -179 205 -238 275 -318 360 -413 465
28 465 -529 593 -672 752 -843 942 -1052 1170 -1302 1444 -1601 1777 -1966 2173 -2409 2668
44 2668 -2958 3284 -3649 4073 -4556 5121 -5795 6610 -7618 8903 -10607 12982 -16536 22414
58 22414 -33889 64669 -315998 -881189 -168877 81765 -294115 -353348 18629 -213289 -663156
69 -663156 -407010 171690 74281 -300876 -269490 -107070 -241807 -297981 -115814 -45997 -192483
80 -192483 -261162 -241771 -217544 -159474 -153175 -297377 -300592 -54852 16241 -224345 -283951 -92876
92 -92876 -104908 -216067 28941 275060 -20921 -387220 -204916 96017 24132 -41905 105202
103 105202 -12340 -365443 -314838 69561 150142 -16389 -17149 -36294 -240869 -199029 159820
114A59820Q6843k53225n4581J22999q9568o2248K63060J23219k99242j44886K62278
125A14469Q5010k49174l0623K13920m1237j79770J27190J92166j50561j92931
135a11541J27977J84029j6356l3507J4361j01811j20181O6421J39568M2126k1999
146A69087j03510j97173l3384K42313J49987j42363j09748M6446p9391j25411
156a83147J84723K56010j50996k90816P0703J84745r4995q6384J74823M5802k51951
167a41483q3836K21836O9580j83075m9821J15365o905o5681P5131N2752j22448
178a18585q1209R8725R5192p453k6602o1671j03828J8918J60455O7341q3132n5742
190i7591j8267p0199J2038J75683Q3085j52915j31929M5107M4630p094Q3652P9945
$$ plain form
114 159820 246663 -6562 -61143 61856 -27712 -89960 173100 296319 -2923 -147809 114469
125 114469 199479 -49695 -80318 133602 92365 -87405 39785 231951 81390 -111541
135 -111541 16436 200465 184109 150602 164963 63152 -57029 9392 148960 191086 169087
146 169087 65577 -131596 -164980 77333 227320 84957 -24791 21655 -57736 -183147
156 -183147 1576 257586 106590 -184226 -113523 71222 -23773 -110157 64666 110468 -141483
167 -141483 -225319 -3483 66097 -116978 -166799 -51434 -58339 -124020 -48889 3863 -118585
178 -118585 -199794 -101069 -5877 -13330 -39932 -101603 -205431 -186513 -26058 41283 -41849 -97591
190 -97591 -115858 -186057 -174019 1664 84749 -68166 -200095 -154988 -110358 -117452 -33800 46145
202D6145j16248j50379O1466J38468K819m2779J0217l5872o3160O2672J09542
213B2891l5185r6289J6014N3326r407J9387N5084n1909j07407L4525J22811J5896
225C9737n4546k603j6254o3982L7968J47851M0628j14365p8099K5661L4491M1219
237C7706P4670K011j13963p3798N9808Q3811K2016o955l4302p0026j9254P4646
249C6370O0623k5204m1502j4135j6244J0460O9124L6698o4498o5030K5773N0798
261F3233J1914L990j2192o8328m9956N9585Q8741r290p4552m3249o586J7476O1546
274D2332N6143l5723q9152k8416M3616M8884L2070N823n1934p3947l399O7676
286A3973M5575j4087l9525m6088l2057K8299O9741J7259n9027n2409N849L3949
$$ plain form
202 46145 -70103 -220482 -159016 -20548 -17729 -60508 -50291 -86163 -149323 -86651 22891
213 22891 -12294 -108583 -92569 -39243 -48650 -29263 25821 -26088 -133495 -98970 23841 39737
225 39737 -14809 -17412 -33666 -97648 -59680 88171 128799 14434 -63665 -38004 -3513 37706
237 37706 112376 114387 424 -73374 -13566 70245 92261 85306 51004 -19022 -38276 36370
249 36370 96993 71789 30287 16152 -92 10368 79492 116190 51692 -13338 12435 63233
261 63233 75147 79137 66945 -1383 -51339 8246 96987 87697 13145 -30104 -36690 -19214 42332
274 42332 98475 62752 -26400 -54816 -11200 37684 69754 75577 23643 -50304 -53703 13973
286 13973 59548 45461 5936 -40152 -72209 -43910 25831 43090 -15937 -68346 -62497 -28548
298b8548L4099K2956j9166n6982k1770M8163N4122L70l6019l7674k3894J2529
310e1814N1493L3469l2304o3246k8369K1935M7862M1990k03n1591n1157J1117
322g0818O3739N3118J612m2436m8663q981M5486N5601P442m4445m9205j3092K7924
335b2718M3665J9305k6880m6230j5683L0468M7077K6675j1558l7829k5111K1029
347B210N3273L3213j7717m7852l2740J1341M6116L7389j2010n3065m2324P854
359a4312M5729L9460j030l9947m1933j734M3730N0095J2984k9078l9324j2499
371A2141K7918M5485J9921k8763n3808l0234J6192M0186K0778k2051m7572l0681
383c0488J6372M9253L5296j0933m2221k8463J3688M3440L3666o489m1886m0024
$$ plain form
298 -28548 5551 28507 9341 -47641 -69411 -21248 32874 33244 -2775 -40449 -64343 -51814
310 -51814 -321 33148 844 -62402 -90771 -68836 -20974 21016 20813 -30778 -81935 -70818
322 -70818 -7079 46039 47651 5215 -43448 -52429 -6943 48658 56100 11655 -37550 -50642 -22718
335 -22718 20947 40252 13372 -32858 -48541 -18073 29004 55679 44121 6292 -18819 2210
347 2210 55483 88696 70979 23127 -9613 1728 47844 85233 73223 20158 -22166 -14312
359 -14312 31417 70877 69847 29900 -12033 -13767 29963 80058 93042 63964 24640 12141
371 12141 40059 85544 105465 76702 22894 -7340 8852 49038 69816 47765 193 -30488
383 -30488 -14116 35137 70433 59500 17279 -11184 2504 45944 79610 73121 31235 -8789
395h789k038L4943L3857l712m0665m3821j2404K6636L9707J3321k9825m5224j4505
408e2519L2217M8641K1991k0742m1777k3431J9343M4741K3218k4965m9892k8917
420e2092J2158L5437K4920r864m0044l4259O661M0904L3570l413l2596l2199k905
433e3722L4387M4116J0172l4341m0643n837K9917L6045J0659k8614m8632k3484
445f9977K5092M3049J4626k3265l5568j7704J8331M5536L3251j1987m0496k3794
457d2906J3040L3718K7591k503l6991l8860J376L8647L2271k274k9200l3071r232
470d8394K9973M3281Q558l3696l3526q23K6823L5164J8931j9563m3150j6746K8369
483d799L5533P580j9338l3052k7861Q805M6041L1412j9223l9763j7575R621K8207
$$ plain form
395 -8789 -10827 24116 57973 54261 13596 -30225 -42629 -15993 23714 37035 7210 -38014 -52519
408 -52519 -20302 28339 50330 29588 -12189 -35620 -16277 28464 51682 26717 -23175 -52092
420 -52092 -39934 -4497 20423 10559 -29485 -63744 -57083 -16179 17391 13978 -18618 -50817 -53722
433 -53722 -19335 24781 34953 612 -40031 -45868 -15951 20094 30753 2139 -46493 -69977
445 -69977 -44885 -1836 12790 -10475 -46043 -63747 -45416 120 33371 21384 -19112 -42906
457 -42906 -29866 3852 31443 28940 -8051 -46911 -45535 -6888 25383 23109 -6091 -39162 -48394
470 -48394 -18421 24860 33418 -278 -33804 -34627 -7804 27360 46291 26728 -16422 -33168 -4799
483 -4799 30734 38314 18976 -14076 -41937 -33132 12909 44321 25098 -14665 -32240 -22619 5588
496E588L4713N374m3393m5629N732L9997K5684k42j9058l4163j8842K9538M7593
509C2892O204l3044k6894p020Q140K8609K7069j7202m5785j2687K8244K4704O427
522A9657m211k5417l3791Q636M9408K2043k7701k9661p307L452K4270M1197L268
535D3843n1716l9218J6200L2221J5270N110j8373m8608k1815M2488M8210j992
547B1620k4580j6557j8909j386M4642L9061k7807m9498j619K2753P705J4351J7882
560B7658k6522m6311J1366N1068Q098l1191j4090k876r953J7474M3229K295m5368
573a5123k1206K5287K9782J9827R858k5834m7135l952M1920K5313o291j3114l1688
586a2356m0754J6308O7290J8254m7536k4787J1989p301K759N6544K8623o1561
$$ plain form
496 5588 40301 45675 2282 -43347 -37615 2382 28066 27824 8766 -25397 -44239 -14701 32892
509 32892 39096 6052 -20842 -27862 -19722 8887 35956 18754 -27031 -39718 -11474 13230 19657
522 19657 15446 -9971 -43762 -35126 14282 36325 8624 -21037 -28344 -24892 -622 40575 43843
535 43843 -7873 -47091 -30891 1330 16600 21710 3337 -45271 -67086 -24598 23612 21620
547 21620 -2960 -19517 -38426 -39812 4830 43891 16084 -33414 -35033 -12280 -4575 9776 27658
560 27658 1136 -45175 -33809 17259 25357 -5834 -19924 -22800 -32753 -15279 27950 30245 -15123
573 -15123 -36329 -11042 18740 38567 48425 22591 -24544 -28496 13424 38737 32446 19332 -12356
586 -12356 -53110 -36802 30488 48742 1206 -23581 -11592 -18893 -16134 40410 69033 7472
598G472m8528M2760M3135k0536j1599J8409k5853m6117K6970N6348j9703n4886
610c2128K571K8639K019J2230K8880j7303m6859P619M9255J7514r525p104k8983
623F825l5684K4701O0692M475m3557k0500n793j3912K4389N7068l524o6288k3937
636c5045L3705J7567M829K6593k127n2035j3625N0727K2018k8041o329N202l2129
649h690j1514N0779J6210o1523k6751M5424J3859k5141K4647K9665n6336m8768
661e8139O7647P2917l6954m9820J9270J299l8909K8107P4556j7974q8055j9331
673d5386M2331J1597j187K2683p335n0701j4101L9065K8162M384j563k5682l0796
686b8529K2371M2357j5241l4421J1959N574l5637P288N5423j8247p9995P202P7045
$$ plain form
598 7472 -41056 1704 44839 24303 12704 31113 5260 -40857 -13887 42461 22758 -32128
610 -32128 -29557 -918 1101 13331 42211 24908 -21951 -14332 34923 52437 42912 35808 6825
623 6825 -28859 -4158 56534 61009 17452 -3048 -8841 -22753 1636 58704 55180 -11108 -35045
636 -35045 -1340 16227 21056 47649 45522 -6513 -20138 30589 52607 24566 18237 23439 -8690
649 -8690 -20204 30575 46785 -14738 -41489 3935 17794 -7347 17300 46965 -9371 -58139
661 -58139 9508 82425 45471 -4349 14921 16220 -22689 5418 79974 62000 -26055 -45386
673 -45386 -3055 8542 7355 30038 22703 -27998 -42099 -3034 25128 29512 27949 2267 -28529
686 -28529 -6158 36199 20958 -13463 -1504 4070 -31567 -24279 31144 12897 -67098 -59896 17149
699A7149o28n1994J5145K4661n1767k1337Q4145M8017o8034n0635L2010J3271
711i997j6889L7978M1675n3551p1657J9362M8369K410L011J4089l6855m8041L0968
724c9128N7982o425k4752J2672m706l2308J8726M9951j5940m8399J2567L2318
736A2558j7618j4733K2808r291m1712J5510N3181n594m0343j926L568j6494K9051
749a1035O0911j5333p1518q001L9813K225M871M6699q034q7289k4414P3907L3580
762C6382l4919K382K1315m7328m2693N8970O3633l3585m4041K0627J0786k6223
774a4694J3375M0318j7149m1276J4812L0522j3764j7200P051q769j1591L1365
786A3000K5942l6085l7227J5542J5427m823K7362L0121m4851o2824K1837N6729
$$ plain form
699 17149 16521 -35473 -20328 4333 -47434 -68771 15374 63391 -4643 -55278 -23268 -9997
711 -9997 -26886 11092 52767 -784 -72441 -53079 -4710 -2300 711 14800 -22055 -70096 -39128
724 -39128 18854 12429 -12323 349 -4357 -36665 -17939 32012 16072 -32327 -19760 12558
736 12558 -5060 -19793 3015 -6276 -47988 -32478 20703 15109 -25234 -27160 -23592 -40086 -11035
749 -11035 49876 34543 -36975 -44976 -5163 -2938 1933 48632 40598 -46691 -71105 2802 36382
762 36382 1463 3845 25160 -22168 -64861 -5891 57742 24157 -19884 743 11529 -14694
774 -14694 -1319 38999 21850 -19426 -4614 25908 12144 -5056 1995 -6774 -18365 13000
786 13000 38942 2857 -34370 -18828 -3401 -8224 19138 49259 4408 -58416 -36579 20150
798B0150K704j0278J5340k4790o2788Q995P6758K1974m2594j7942J654k2915K701
811c1031N4867K0264m5889k5075K0706K991r612K3189J4523l3406j6428L3618
823H717J1124l0704l356K3046r134j3012L1023J5886m5852l0895L3321L0672o403
836A4433J758J571m0801l2043L9717N2979n853k9957j2794j7903j1505L8866M9227
849D7695j1593m2913j1125M283k107K2999L5615j5125m8832p292K6798N045k617
862H31J5980k726l0670K32L5870M639k8724k558J9913K01k963J4653o017l3999
876a5338l088L7626J7680j5982j1401r872k3472J549M2960K4575k6783l1028n961
889a8535M97J2621L8375K0102l3910m0136M160K4248J3558J1466R51k9762k8948
$$ plain form
798 20150 22854 12576 27916 3126 -59662 -50667 26091 48065 5471 -12471 -10817 -33732 -31031
811 -31031 23836 44100 -1789 -26864 -6158 -3167 -12779 10410 24933 -8473 -24901 8717
823 8717 19841 -10863 -14219 8827 -307 -13319 17704 33590 -12262 -43157 -9836 20836 14433
836 14433 16191 17762 -23039 -55082 -15365 37614 31761 1804 -10990 -28893 -40398 -1532 47695
849 47695 36102 -6811 -17936 -13653 -15760 7239 42854 27729 -21103 -28395 -1597 3448 831
862 831 16811 14085 -16585 -16353 19517 24156 -4568 -7126 12787 12988 10025 24678 18661 -15338
876 -15338 -18426 19200 36880 20898 9497 -375 -23847 -22298 20662 45237 18454 -12574 -18535
889 -18535 -18038 -5417 32958 53060 19150 -20986 -16826 7422 20980 32446 33397 3635 -25313
902b5313J2916K7725O05j1131j750q378j1778J2684K2114o415j9203M898J5743
915A2717J418R00O038j2421k1335Q362K8899L843k3369j9351r427j456J9578K8288
929B2684k812l2993j9224J0298J9956J9657J3277j2776l2799j2333K0578K1140
941A4653L485m607j3920k3769o313K4442K0769j0406k0514o409J987N870J4122
954f10P988j3887j6530P988K1398P976p706j1716q836J490J4774J2001p285j9154
968a2109j3702j196J2494J9742O327j8811k2983r78J7640J8352J1739k183k1288
981f956k0233R905L0887J4456j3278j9805j0963j098J0645J5717R71j9212j7394
994b6358L410J6270J2006J124p706q999K92J2464J4192L140j0559j5684n797J1803
$$ plain form
902 -25313 -12397 15328 15933 4802 3052 -5326 -17104 -4420 17694 11279 -7924 -3026 12717
915 12717 14135 15035 21073 8652 -12683 -4321 24578 28421 5052 -14299 -23726 -25182 -5604 22684
929 22684 19872 -13121 -32345 -22047 -2091 17566 30843 18067 -14732 -27065 -6487 14653
941 14653 18138 13531 -389 -24158 -30471 -6029 14740 4334 -16180 -22589 -20602 -14732 -610
954 -610 7378 -6509 -23039 -15051 6347 14323 6617 -5099 -13935 -12445 2329 14330 7045 -12109
968 -12109 -25811 -27007 -14513 5229 11556 -7255 -30238 -31216 -13576 4776 16515 14332 -6956
981 -6956 -27189 -17284 13603 28059 14781 -5024 -15987 -17085 -6440 9277 10248 -8964 -26358
994 -26358 -22948 -6678 5328 6452 -1254 -10253 -9961 2503 16695 19835 9276 -6408 -12205 -402
1008d02J8041K435j7615j8997l568J1615J6637R195r138k1817j1380J3689K3863
1021A2558J0159q708j5345r269L437J5420J5312n15j6907j7354k055J3297J4323
1034A4353R66j3583j5388l468J1285J6548O930j0373j7818m925J4922J8241K687
1047B0377j2806j4153m390Q368J5353Q421r550j9060r166Q282J5241P911n187
1060I641j5077j3248J678J6700J6170P0j5312j5553m23J6225J7204J164j5602
1073C637j6514k871J1671J5177M058j2742j7792m471J2315J4463L401q316j2729
1086a0713p315N993J6293J0384o753j5715q817N041J4325J2052k588j7394j4967
1099b0174L129J6561J2814j774j4245j4815l95J6475J6232q81j4311j1968j555
$$ plain form
1008 -402 17639 20074 2459 -16538 -20106 -8491 8146 17341 8203 -13614 -24994 -11305 12558
1021 12558 22717 14009 -1336 -10605 -7168 8252 23564 23049 6142 -11212 -13267 30 14353
1034 14353 15319 1736 -13652 -17120 -5835 10713 17643 7270 -10548 -15473 -551 17690 20377
1047 20377 7571 -6582 -10972 -2604 12749 21170 11620 -7440 -16606 -8324 6917 14828 9641
1060 9641 -5436 -18684 -17006 -306 15864 15934 622 -14931 -15354 871 18075 19239 3637
1073 3637 -12877 -15748 -4077 11100 15158 2416 -15376 -19847 -7532 6931 10332 2016 -10713
1086 -10713 -18028 -12035 4258 14642 7889 -7826 -16643 -11602 2723 14775 12187 -5207 -20174
1099 -20174 -17045 -484 12330 10556 -3689 -18504 -18899 -2424 13808 12927 -1384 -13352 -14907
1112a4907Q494J3614O659j0111j6945m413J1104J3451N865l915j3172j1661N184
1125a0753J8624J0181q921j6149r115L088J3938J3571k944j8275j1866O625J4909
1138B913J0060L28j0555j4355j355J5555J4114j440j0622r942n531N422J6605
1151A1197Q928j2347j8147l252R614J1110P944k215j6334j3151R384K0428O331
1164A9490r235j0567o752N71J2777J4238l854j7876r419M683Q443P795L107j0310
1178C091j7595k888J5133J2603l38p428j0727p974Q664K1045P342j4673j4895
1191h640j202N939R327R801m368k0804j1897J0920J4301J417l844n668j1369l394
1205a9481J6567J6786n057j4402m420J938M105J2022Q477j3383k0701J39J5735
$$ plain form
1112 -14907 -6413 7201 13860 3749 -13196 -17609 -6505 6946 12811 8896 -4276 -15937 -10753
1125 -10753 7871 18052 9131 -7018 -16133 -13045 893 14464 11520 -6755 -18621 -11996 2913
1138 2913 12973 13301 2746 -11609 -12964 2591 16705 15265 4643 -5299 -10830 -5408 11197
1151 11197 20125 7778 -10369 -13621 -4007 7103 15047 12832 -3502 -16653 -7269 13159 19490
1164 19490 10255 -312 -7064 -6493 6284 20522 16668 -1208 -10627 -5944 2499 10294 13401 3091
1178 3091 -14504 -17392 -2259 10344 10006 2578 -8149 -16123 -7459 13586 20928 6255 -8640
1191 -8640 -9842 -3903 5424 15225 10857 -9947 -21844 -10924 3377 4794 950 -4718 -16087 -19481
1205 -19481 -2914 13872 8815 -5587 -10007 -8069 -3964 8058 16535 3152 -17549 -17410 -1675
1218a675P180k875n850j1986j0331R320K0101K771j4803r670P28M288J1187J3139
1232A1524m075j8965p602J0109J0331M439J217j0399j8984k296J8999J2199p238
1245g41r750n418n265N935K0738Q750j6697j3869Q062J0980K272M535J827j4654
1259c295j2764J1755J7028m078j2971l409k092l006J0746J5347n907j9658l739
1272a6043J2633J0581O700K405j2086j6441L921J9938Q800o522r113j1067q424
1285a4718J0297K0280M93j7821q320L313R74O807J6310M76k0845q023J6456J1247
1299A6926m061k18N56j2665o683J6781J2770j4434j6563K934O175K78O617M736
1313A3149j4706j4894J0625J9147K120n964l416r439q168J3109K0287k977j8868
$$ plain form
1218 -1675 5505 2630 -3220 -15206 -25537 -16217 3884 6655 -8148 -17818 -17090 -12802 -1615 11524
1232 11524 7449 -11516 -19118 -9009 1322 5761 6978 -3421 -22405 -24701 -5702 6497 -741
1245 -741 -10491 -15909 -21174 -15239 5499 14249 -2448 -16317 -8255 2725 4997 9532 11359 -3295
1259 -3295 -16059 -4304 12724 8646 -4325 -7734 -9826 -12832 -2086 13261 7354 -12304 -16043
1272 -16043 -3410 7171 13871 16276 4190 -12251 -8330 11608 20408 13886 4773 -6294 -14718
1285 -14718 -4421 15859 16352 -1469 -9789 -6476 -5502 1305 17615 18091 -2754 -10777 5679 16926
1299 16926 12865 12647 13203 538 -6145 10636 23406 8972 -7591 -4657 1518 1796 8413 13149
1313 13149 -1557 -16451 -5826 13321 15441 9477 6061 -3378 -11546 1563 21850 18873 5
1326Eq879j065r9J0902J5073p484k4081o653J3168R042L316M219o699j6243O41
1341a4837J9097P250r182m331j00o380J348J4571R36j8671o585J2447M561m493
1355d369N041J626j6917p143K2523J7119j2434j4064J763j336k685J6327J6502
1368B1953j5037k5786L46J5650N933L101L826j1283j8295L049J8766P417m178
1381E462l642q023q535R194J7450j113j2883j048L548l474M419J3485n117k0409
1395a0686J117K0178L085j2225q99K092j0008M22K1830Q008k0400j3981Q292P300
1409D125K223J0306L170j9734j5968J0958J6117J831j228k904j5519j0148J6367
1422d04J8871n586j2616n20k324n821J0344J5331r245j9642K617J3241j366m322
$$ plain form
1326 5 -8874 -9939 -10038 864 15937 8453 -15628 -22281 -9113 -71 3245 7464 765 -15478 -14837
1341 -14837 4260 11510 2328 -2003 -2103 -8483 -7135 7436 8372 -10299 -16884 -4437 124 -4369
1355 -4369 672 2298 -14619 -21762 761 17880 5446 -8618 -6855 -8191 -10876 5451 21953
1368 21953 6916 -18870 -18524 -2874 3059 6160 9986 -1297 -19592 -16543 2223 9640 5462
1381 5462 1820 -6203 -14738 -5544 11906 10793 -2090 -3138 410 -3064 1355 14840 9723 -10686
1395 -10686 -9569 10609 13694 1469 570 2662 -7346 -6924 14906 22914 2514 -11467 -3175 4125
1409 4125 6348 16654 19824 90 -15878 -4920 11197 13028 11800 8896 -6623 -16771 -404
1422 -404 18467 12881 265 -255 -2579 -8400 1944 17275 8030 -11612 -8995 4246 2880 -1442
1436a442N402k857j2229M402J7886Q83j4143m835K521l72O441J1940o015k0688
1450a3106n453J1478O877L419N799q276k0955o84K3175J1416q828m691j316j1363
1464a2508k947K0130J2310j6020j5453M851M580l066O293Q050j0800j3243Q496
1477i327J3779k537o446J165k449l471J0693J1703r057j5357J367Q665K618N511
1491F857M907j2691j8147M721J9147N775n532l115p712j0840O947K1546O525j2399
1505E989q772m99j88P020J3917K62j5842p454O677L295n75M144j572j2715k212
1520h525J4672N932j0695m219O681N99n05J0884N467j5758j2833J0210J3718m64
1534A5164m359l195j1551r514J0940J8043P66j2502q619l633J753J3008J3742
$$ plain form
1436 -1442 3960 1103 -11126 -6724 11162 12045 -2098 -6933 -4412 -4784 1657 13597 7582 -13106
1450 -13106 -18559 -7081 -204 3215 9014 738 -20217 -20901 2274 13690 4862 171 -1145 -12508
1464 -12508 -15455 4675 16985 965 -14488 -9637 -5057 -8123 -1830 6220 -4580 -17823 -9327
1477 -9327 4452 1915 -4531 -3366 -5815 -9286 1407 13110 4053 -11304 -9937 -1272 1346 6857
1491 6857 11764 -927 -19074 -14353 4794 10569 5037 1922 -5790 -16630 -9683 11863 18388 5989
1505 5989 -2783 -3282 -3470 3550 17467 17729 1887 -5567 1110 4405 3830 7974 6402 -6313 -8525
1520 -8525 6147 12079 1384 -2835 3846 4445 3940 14824 20291 4533 -8300 1910 15628 15164
1534 15164 10805 7610 -3941 -13455 -2515 15528 16294 3792 -4827 -8460 -6707 6301 20043
1547B0043l869j4742n784L637M921P678O091q038j4610j106R796K511l835n17
1561B176k310o357J875J0100O16r923k954P021M705J924K087n308j1067N9J3146
1576E790P757m504p531q038p843M325J6940P192j2569j3753j809L383O350J2477
1590H167N860j2775j4997L014J2890N861kj570p270q952K174J0213K829o409n722
1605f689j018J818M208K829l484m903J747O052L978J246k701p931l913R150J1972
1620A2361j022j0731p293k353J156Q611J0993k833j5995r457O159J1005P185K651
1634A0437m994j1605n313Q513J2346L413n819q439n733J707Q126M821l844o394
1648b778k568R56L428M615m77o894l554N866P095m84m332l418k473J283P982O796
$$ plain form
1547 20043 16174 1432 -4352 -715 4206 11884 17975 9937 -4673 -5779 4017 6528 2693 2176
1561 2176 -134 -6491 -4616 5484 6100 -3823 -6777 244 4949 6873 8960 3652 -7415 -7356 5790
1576 5790 13547 9043 1512 -6526 -14369 -10044 6896 14088 1519 -12234 -14043 -10660 -4310 8167
1590 8167 14027 1252 -13745 -10731 2159 8020 8018 6448 -822 -9774 -7600 2613 5442 -967 -6689
1605 -6689 -7707 -5889 -1681 1148 -2336 -7239 -5492 560 4538 5784 3083 -4848 -8761 389 12361
1620 12361 11339 608 -6685 -9038 -7882 729 11722 8889 -7106 -16563 -10404 601 7786 10437
1634 10437 5443 -6162 -11475 -2962 9384 12797 6978 -1461 -7194 -5487 2639 7460 3616 -2778
1648 -2778 -5346 -4390 -962 3653 3176 -3718 -7272 -1406 5689 5205 873 -2545 -5018 -3735 4247 11043
1664A1043m696j1670n695M255Q392O408o28r198j0434q36R279J0175K668o307
1678B756j0551m985O190J0790M217m331p093n313l25O525P780p26q611n556K424
1693f809M958K998J89l790n425j15O749N438k528o829m065J946O620N710j305
1708C742p907o284J302P087P063J645o440r719k579P551R013K149m413p413o003
1723a1206J537R684P886k968r343n147K292O412O171J066o009o971M30O684N364
1738E882m58m793n307j031N388N825n31n539m481o67L670O472L366n337q601j267
1754g409O763O816K273k676o982n862L401J0100N014n102q327m382R34N880O525
1769F966m82q068o307J570O226N566K049l845o916j526O684O608M4m245n240l552
$$ plain form
1664 11043 6347 -5323 -11018 -6763 1629 8037 7409 -1789 -12223 -13059 -3780 6395 9063 2756
1678 2756 -7795 -12780 -6590 4200 8417 4086 -3007 -8320 -8645 -2120 5660 4934 -3677 -9233 -6809
1693 -6809 -1851 1147 1336 -2454 -7879 -7994 -1245 4193 1665 -5164 -9229 -7283 -663 5047 3742
1708 3742 -4165 -10449 -9147 -2060 5003 6648 208 -9511 -12090 -4539 4474 6623 2210 -5203 -11206
1723 -11206 -9669 15 7901 4933 -4410 -9557 -7265 -853 5318 6384 375 -6596 -6166 518 5882
1738 5882 5424 631 -4676 -5707 -319 5506 4975 -564 -5045 -5712 -2042 4430 7796 2459 -6142 -7409
1754 -7409 -646 6170 8443 5767 -1215 -7077 -3676 6424 11438 6336 -1991 -6373 -5439 441 6966
1769 6966 6484 -1584 -7891 -6321 -95 5471 7520 3675 -3241 -4767 1917 8525 8569 4324 -916 -4468
1785d468K264P765L452o557q397p77M690M907L334j306p555n233N073R175K913
1800I280l448m648m095n68O419P194j762q617n332O96L539N167K985n375r111
1815g676j053P771O153M07k776m957m106M034R599K986o510o083m22K167M071
1830C605M698j826r113n128M098O008J817m82l640o480m09R154P829k238n842
1845B051k866p59K915P810L036q419r423R41O078K525M36j279o794n736M981R538
1861E035J043n354l100j090JN648P646j727r170l841L891M125K548O80n921r032
1877h618j43Q817M836l178l945l056k241M418R746K067p974n406K459K964K397
1892C143M212r32r425n421O113O782r24k889k708n461j793Q362P497m507q190
$$ plain form
1785 -4468 -2204 5561 9013 2456 -5941 -6718 -2028 2879 6213 4907 -2648 -7881 -2808 6367 9280
1800 9280 5832 1184 -2911 -3479 2940 10134 8372 -245 -5577 -4881 -1342 3825 6810 1435 -7676
1815 -7676 -8729 -958 5195 5602 2826 -2131 -6237 -2203 7396 10382 3872 -2211 -2633 -466 3605
1830 3605 8303 6477 -2636 -7764 -3666 2342 4159 3677 37 -6443 -6852 2302 10131 7893 2051
1845 2051 -815 -1574 1341 9151 12187 3768 -5655 -4714 1364 3889 4325 3046 -3748 -9484 -4503 5035
1861 5035 6078 724 -2376 -3466 -3465 2183 9829 8102 -1068 -4909 -1018 3107 5655 6335 414 -8618
1877 -8618 -8761 56 4892 1714 -2231 -5287 -7528 -3110 6636 8703 729 -4677 -2218 746 3143
1892 3143 7355 6423 -3002 -8423 -2310 4472 3548 659 -2049 -7510 -9303 -941 6556 2049 -6141
1907f141q32L163L010N247K760o718q073K686P603J861k180k187n346m569M855
1922d861Q757m34p020k933K34N40N357P234k691r995j853P249M834P42O08l878
1938A890q017K23R760M084o465n582p78r67J745P155K632p448n582M067N407J525
1954C649J650l81p024m640O043P232j819n560k757k211L0P098N871n601q798P5
1970g143N314L078K582J074o168p065L570Q840J955l304k163l375l847M323Q870
1985F541j90q362l637K012J124L066N484j964r721k365Q102M773k639j924j164
2000h64m201K08Q138M167o749o350J584K998J290L018M97o953o065L937P363J984
2016D002j446l100n318j573P347P645j920o831l609j091J664O941M869n781q692
$$ plain form
1907 -6141 -6973 -3810 -800 4447 7207 489 -7584 -4898 2705 4566 2386 199 -5147 -9716 -4861
1922 -4861 3896 3462 -3558 -6491 -6257 -5717 -360 6874 4183 -5812 -7665 -416 4418 5160 5768 1890
1938 1890 -6127 -5904 3856 7940 1475 -4107 -4885 -5852 -4107 3048 5680 -1768 -7350 -3283 2124 3649
1954 3649 5299 4918 -2106 -6746 -703 6529 4710 -850 -3607 -5818 -5788 1310 7181 1580 -7218 -7143
1970 -7143 -1829 1249 3831 4905 -1263 -8328 -4758 4082 6037 2733 570 -2805 -6652 -2329 6541
1985 6541 6351 -2011 -5648 -3636 -2512 554 6038 4074 -5647 -8012 90 4863 2224 300 -864
2000 -864 -5065 -4857 3281 7448 699 -5651 -4067 -1069 221 3239 3736 -3217 -9282 -5345 2018 4002
2016 4002 2556 -544 -5862 -7435 -88 7557 5637 -1194 -4803 -5894 -4230 2711 7580 1799 -6893
2031f893R75O032K073J101K017l764p181J589Q359J461n546k337P10j638J266
2046a776O165O49p646l777N209N140M41m67k760n707k03Q198N362l941o101k857
2062d071j105K557P450K913p404p470Q96M361L381M157J386o886p003L422Q190
2077D774K102k658k359l804l190L807O627j034o574k122K353J618J575J694k949
2092a40m779J641O216J881k702j803j912j965L560P327p2q085n192J113K300L446
2108H34M649k025j0017m994O561P960J636j198k615n629j977P285P446j953n973
2123a0k296o08k31L717L797l405o327j31L780J170m7M40k214k815L490O424l5
2140D699n367k387J493K151L624K658m273q128j906N487M818R57j867n142n604
$$ plain form
2031 -6893 -5918 114 2187 3288 5305 1541 -5640 -4051 4308 5769 223 -2114 -1404 -3042 -1776
2046 -1776 4389 5038 -2608 -6385 -1176 3964 4405 3938 1178 -4529 -4732 3466 8828 4887 -1214 -4071
2062 -4071 -5176 -2619 4831 7744 340 -7130 -6234 -1873 1508 5665 7051 165 -6838 -3416 4774
2077 4774 6876 4218 1859 -1945 -5135 -1328 5299 4265 -2309 -4431 -2078 -460 1115 2809 -140
2092 -140 -4919 -3278 2938 4819 2117 314 -1598 -3563 -3 7324 7252 -833 -6025 -4912 -2612 834
2108 834 5483 3458 -6559 -11553 -4992 2968 4604 3406 791 -4838 -6815 470 7916 5963 -10
2123 -10 -2306 -2914 -3145 572 4369 964 -5363 -5494 -1714 -544 -591 -151 -2365 -5180 -1690 4734 4699
2140 4699 -668 -3055 -1562 589 4213 6871 2598 -5530 -7436 -1949 2869 3826 1959 -3183 -8787
2155h787J728Q132N030j560l846l713k247L436Q221K786o006n721l9J446J880
2170G40L674J62o553m544M300M964j431k666M39m20q57L853M276l017n939N10
2186b509M946K244J4o30m107n371J097O950L608k972n319l956m62N016O916J052
2202F517n345n133n55L105N383L687k626o592k311L158K905J020J99k468m909
2217c965m03N134K701l285k831L19N72J377L594Q32n191l859L610N494R41k085
2233B955l049m021j072N276N767j302o043l656q1K342M805L598k914o712k164
2248f271L440M254K635L47l437m811L09N368L308j563l220k468o78K100L487m45
2264B355m167k261J907L041J962L17k656l795O24N065L398j456l443l065j772
$$ plain form
2155 -8787 -7059 1073 6103 4543 697 -3016 -5263 -1827 6394 9180 3174 -2547 -2586 -1140 740
2170 740 4414 4576 -1977 -6521 -2221 2743 1312 -1354 -915 -1335 -2192 1661 5937 2920 -3019 -2509
2186 -2509 2437 4681 4695 4065 -42 -5413 -4316 2634 6242 3270 -2049 -6005 -6467 -1451 5465 6517
2202 6517 1172 -3961 -4516 -1411 3972 7659 5033 -1559 -3870 -712 2193 3213 3412 944 -3965
2217 -3965 -4368 766 3467 182 -2649 -2330 -1758 -381 3213 4045 -1146 -5005 -1395 4099 5040 2955
2233 2955 -94 -4115 -5187 89 5856 4554 -1489 -5145 -5226 -2884 1921 5519 2605 -4107 -6271
2248 -6271 -2831 1423 4058 4405 968 -3843 -3534 1834 5142 3579 359 -2109 -2787 -687 2800 2355
2264 2355 -1812 -4073 -2166 875 2837 3154 498 -3297 -2673 2392 5790 4334 891 -2174 -3946
2279c946K334O086K485m748o053j024K645L677L513j34n656n016J767N772K936
2294D638r83k420l029j331K939M066Q6l199k563l1J557K379J010k464l440J30
2310b655L304K248k45k217l593j666L271N469R62m256m103n01K263M197L492j690
2326D280o265m008J996M396K639k30l315m495j109L971M587Q33k549l317j673
2341d259J427L841J730k604l352m04J773K038J242j014l403j306K968L655l14
2356B018l134k559r01J400M008K749k490n117j883K467L992L066o9m237m726K16
2372e200M817M250N40k920m439k144K646M809J465l029l545j645P98K812K956
2387B171n59l418j293K247K589Q46n59j869k227M21L403J774k479l775j323J276
$$ plain form
2279 -3946 -1612 4474 6959 2211 -3842 -4866 -2221 1456 4969 4835 -821 -5837 -4070 1702 4638
2294 4638 3655 1235 -1794 -3125 -186 3880 3966 767 -1796 -1827 -270 2109 3119 655 -2785 -2655
2310 -2655 649 2897 2652 435 -3158 -4824 -1553 3916 4878 622 -3481 -3982 -1719 2478 5970 4280
2326 4280 -1985 -5993 -3997 399 3038 2808 -507 -5002 -6111 -2140 2447 3280 731 -2586 -4259
2341 -4259 -2832 1009 2739 135 -3217 -3621 -1848 190 1432 418 -2985 -4291 -1323 2332 2018
2356 2018 -1116 -3675 -4576 -3176 832 3581 1091 -4026 -5909 -3442 550 3616 3547 -690 -5416 -5200
2372 -5200 -383 3867 4407 1487 -2952 -5096 -2450 2359 3824 795 -2750 -4395 -3597 -785 2171
2387 2171 1612 -1806 -3099 -852 1737 2583 2024 155 -2072 -1651 1752 3526 1047 -2728 -4051 -2775
2403b775L049K989p22m503l427J401M307L274K84l090m374j048M282M900Q62k739
2419B670l495k525O24M100L062k087m849k016J207K293K553J019k551l223O92
2434b526L961K024j121j942j755l48K386K964p16l977k394P37K296K277L87l154
2450i01m396k68L992L606O35j614k845k157K057N675K659k890m233j680K95K321
2466B56L289j7m553l817J210L489K083L40j332k922q34L432L775k36k440j633
2482I0l38J272L104J366l217m412k26K537J735N57j097l530k795K703N436J570
2498D755k374k308j181R8L310L959r07n138k932J337K359J881R71k324m379p28
2514c601L802L205n00j700j937j846J484M502J768l094k988K21J499J800K165
$$ plain form
2403 -2775 274 3263 2541 -1962 -5389 -3988 319 3593 3877 787 -3587 -4635 -353 4547 5409 2670
2419 2670 -825 -3350 -2726 1374 4436 2349 -2500 -4516 -3309 -1016 1537 2556 5 -3218 -2526
2434 -2526 1435 3459 2338 396 -1359 -1707 679 3643 2927 -1050 -3444 -2707 -411 1866 2253 -901
2450 -901 -5297 -5565 -1573 2033 2668 1054 -1791 -3948 -1891 3784 6443 3553 -680 -2360 -2065 256
2466 256 3545 3528 -1025 -4842 -3632 -143 1940 2280 948 -1974 -2808 624 4399 4163 1723 90
2482 90 -248 1024 4128 5494 2277 -2135 -2361 176 1911 2468 1371 -2159 -4954 -2251 3185 4755
2498 4755 2381 73 -1108 -1010 2300 6259 5352 214 -2718 -1381 978 2859 3830 1506 -2873 -3601
2514 -3601 201 3406 2906 1206 -731 -2577 -1093 3409 5177 2083 -905 -684 815 2615 4780
2529D780p53m699k829K541L517N6j620j720k684l43M261L919j691l951j187Q48
2545a555J429L107J565l493m645L92L615J650j06q49l098k816K109M865P53l303
2561c80j994q8M90K623L496j028m695j669K846K337M17O9k115l847N1M629K660
2578C802k014k518q80p05J507M209J162m208l680J069K402J352J344o97m183k367
2594d405L387M027j88k068j421j749k19L760L104k366m133m40J657J250J906J100
2610C202l155m133J332M257J175j166j121k043j846K563M929k6m253k107R89R00
2626e03J928K443j625m974j525L616K593l41q21j684k905L22M515K553k518k912
2642a838m82L79J439L171P45m144l323J654K864R22o8j118l418j519L568L722
$$ plain form
2529 4780 4027 -672 -3501 -960 2557 2613 993 -727 -3411 -3754 507 4426 2735 -1216 -2403 -1555
2545 -1555 -126 2981 4546 1053 -3592 -3200 415 2065 1959 1110 -1988 -4804 -2695 2170 2923 -380
2561 -380 -2374 -2462 -1972 651 4147 3119 -1576 -3245 -399 1938 2355 2424 309 -3538 -3487 1142 3802
2578 3802 1788 -730 -1610 -2315 -808 3401 4563 355 -3325 -2256 146 1498 2842 2145 -2038 -4405
2594 -4405 -1018 3009 2821 753 -668 -2417 -2636 1124 4228 1862 -2271 -2711 -1054 196 2102 3202
2610 3202 47 -4086 -2754 1503 2678 1512 391 -1652 -3498 -935 3994 3968 -285 -2392 -1403 -503
2626 -503 1425 3868 2243 -2731 -4256 -640 1953 1612 791 -893 -3798 -3476 1039 3592 1074 -1838
2642 -1838 -2320 -1941 -502 2669 3414 -730 -4053 -2399 465 1387 1319 201 -3217 -4736 -1168 2554
2658B554q85k966r36l81O48L473K551k587m192K93K570J344Q69K27l123l833J514
2675b860M661R32k337j520j116j043K337M346km385k045J931J918J209J213j269
2691A970l914j040L525K607r52j808j567j657O56L783J437k720k827J48J483J879
2707A003K505j44l925k419K714L331L36j075j583k777j048L446L582j585l789
2722a428j118O50Q62K370K037k135l975l4L359J925Q4l43j931k506J183L792O71
2739C463k903k220n10J91J699K377p99l770j259K606K521P33j42j670k730J40
2755b273L773K522j569k574j521o59J376L382J143l467l613J72J894J683J513
2770A782k99l504k173K543L781O41j433r54j158n81K109K675j194l661j064J466
$$ plain form
2658 2554 1669 -1297 -2233 -2614 -1966 1507 4058 1471 -2721 -2428 142 1486 2355 2582 -541 -4374 -2860
2675 -2860 1801 2733 396 -1124 -2240 -3283 -946 3400 3398 -987 -3032 -1101 817 2026 3239 1970
2691 1970 -1944 -2984 541 3148 2196 388 -1179 -2836 -2180 1603 3040 320 -2507 -2359 -876 1003
2707 1003 3508 3364 -561 -2980 -266 3065 3401 2326 743 -2034 -3082 364 3946 2361 -1428
2722 -1428 -2546 -1896 -1034 1336 3373 1238 -2737 -2771 588 2513 2597 2254 323 -2183 -1000 2792 3463
2739 3463 560 -1660 -2170 -1979 -280 2097 1298 -2472 -3731 -1125 1396 2129 1987 317 -2413 -2273
2755 -2273 1500 4022 2453 -121 -1642 -2301 -925 2457 3600 133 -3480 -3308 -1414 269 1782
2770 1782 1483 -2021 -4194 -1651 2130 2771 1338 384 -774 -1355 754 3429 2235 -1426 -2490 -1024
2786a024J039O04K51j548k590L57L350J958r30j996j457O6K473L319J92k992k537
2803a465k98J623K451J380k151m473j585K512K672P42j04j337k665j13L728L053
2819C970j035k629r64j06M60J752J122k130k841K58K342J070o11j216j578l75
2835b511K021K376m38k450j455M63J669K616J287k168l647o45K333K327P82r58
2851A602k973l206N19L840K702j039k618j932k87J891L139R47k198k586j26J328
2867i97J688R23r55k212r71J258J330m11r97q59p73O27K394J223j872k279N15
2884b368K301J645O94q62k904k420J290L665J663j846k885j614L78K687L029N07
2900B960k500k895n56J730K698J432j424k802j198J187J902J276j4j625k061L39
$$ plain form
2786 -1024 15 619 870 -678 -3268 -2911 439 2397 1467 -529 -1986 -1920 553 3872 4064 1072 -1465
2803 -1465 -1763 -140 2311 3691 1540 -2933 -4518 -2006 666 1408 1304 -33 -2698 -2811 917 3970
2819 3970 2935 306 -658 -764 -304 1448 2570 440 -2401 -2143 199 1269 658 -558 -2136 -2511
2835 -2511 -490 1886 1448 -1002 -2457 -1994 -325 2291 3578 1410 -2237 -2882 -549 1778 2560 1602
2851 1602 -1371 -4577 -4058 -218 2484 1445 -1173 -3105 -3392 -1501 1638 2585 387 -2199 -2325 -997
2867 -997 691 1614 659 -1553 -2524 -1266 64 -347 -1344 -2203 -2976 -2349 45 1268 -604 -2883 -2368
2884 -2368 -67 1578 2272 1410 -1494 -3914 -2624 1041 2704 858 -2027 -3641 -3263 -576 2453 2960
2900 2960 460 -2435 -2991 -1261 1437 2869 1445 -1357 -2555 -1368 534 1810 1796 171 -1890 -1551
2916a551K420J095j504j600J06Q74Q46R91l28k112j396J569K547N18j383k071
2932i79j498O24K566K316k27k642k310j56K133L016J017k336l346r25J657K388
2948A298J433m38k565k324O15K822J454r41j606q97k16J009J649L20j688j268
2964a343P06J551P47m48j444j555J44J767J375o10k108j750K6K199K694L99k471
2981a21k380qJ838K259J237r80k991j985J297K728J344r05j781j841m89J679K492
2998A393J90j935j624K37J512J703N62j081j692K8J622J271l03j538j600n01J445
3015c11J925m1k042j541n9J401K095J316j090k554j207J582K467J247o48k090
3031D50k080l4K405K079m24k378j749k64J394K003N58j441j877P0J541J336O46
$$ plain form
2916 -1551 869 1964 460 -1140 -1034 -160 686 1677 1349 -763 -2159 -590 1957 2475 1092 -979
2932 -979 -2477 -1853 713 3029 2802 160 -2150 -2306 -173 2843 3860 1524 -1822 -2747 -1090 1298
2948 1298 2731 2293 -272 -2596 -1981 841 2295 1354 -252 -1149 -1365 -356 1293 1613 -75 -1343
2964 -1343 -637 914 1661 1213 -231 -1786 -1642 125 1500 890 -1218 -2968 -2942 -743 1951 2350 -121
2981 -121 -2501 -2509 -671 1588 2825 1845 -1146 -3131 -1834 894 2238 1333 -448 -2289 -2778 -1099 1393
2998 1393 1583 -352 -1976 -1739 -227 1476 2038 957 -735 -707 915 2186 1883 345 -1255 -1756 -311
3015 -311 1614 1573 -469 -2010 -2069 -668 1427 2743 1653 -901 -2108 -526 1941 3188 2540 450
3031 450 -1630 -1664 741 2820 2396 18 -1731 -1995 -601 1402 1960 519 -1358 -1288 253 1589 2235
3048B235p92j581p01J330J709J24j379j611o90O85J816J115j390k519r48J330
3064a267K014J182m07k102j911P05K624J716m75j819j731m48J401K125K53j887
3080b7k016n17Q79J536J008p92k039o59J300J863N96o81j357r14O15K105J055
3097A955j473j962o30P86J442J229m15k358j639Q88K161J279j69j340j872l81
3113b499J980K380L55j623j654o21P22K075J291j195k432q40J053J454O58l21
3129G83j464j297P25J991R50q35j084o51K84J479J489l86j991j182O86J432J092
3146B021J38j656k119j97K299J793j91j283j624p53J124K544J076j564k085m39
3162i16Q91J318J147j91k049j638N75J828P69n19j045j195l23J485J586l84j670
$$ plain form
3048 2235 1443 -138 -839 491 2200 2324 945 -666 -1356 -671 1145 2260 870 -1649 -2597 -1267
3064 -1267 747 1929 1522 -580 -2491 -1786 838 2554 2079 260 -1471 -1919 -518 1607 1860 -27
3080 -27 -2043 -2560 -1681 -145 863 71 -1968 -2627 -1327 536 1132 451 -906 -1820 -1205 900 1955
3097 1955 482 -1480 -2110 -1324 118 1347 932 -1426 -3065 -2177 -16 1263 1094 -246 -2118 -2499
3113 -2499 -519 1861 2216 593 -1061 -1682 -960 1115 2406 1211 -1221 -2061 -1008 446 1104 783
3129 783 -681 -1978 -1253 738 1688 853 -231 -882 -598 881 2370 1984 -7 -1189 -503 929 2021
3146 2021 2159 503 -1616 -1813 486 2279 2088 805 -819 -1572 -448 2096 3172 1608 -477 -916
3162 -916 -25 1293 2440 2249 200 -1438 -863 965 1734 1215 170 -1025 -1348 137 1723 1339 -331
3179c31r26K49J026J474K81j546j836K94J753J202j63j015j847r82J380K232L64
3196A609j644j445m24M61J713J672l87k344j308J033J555P34J56j285j929j78
3212b011K018J578n84j290r01k48Q45J664M18j691j633L94J209R50M47o67j660
3229a162p66J377J909K25j115j260q83L38K070J509r87k134p70Q14J162J327J64
3246A818j865j883L90K018J032l26p57j007o95J160K075L03j672j278M7O12R10
3263H82R31o93k114q16J420J527K18o35j158j176L89K053J213j139j592n54L47
3280h97J125J627J29k038j680N92J396O57P2p93j722r51J581J968N9j284q83l29
3298a371M81J634J206j069k061k35J030J093N13l03j397j535O03K033M34j031
$$ plain form
3179 -331 -1257 -1008 18 1492 1773 227 -1609 -1315 438 1640 1477 462 -1385 -2367 -987 1245 1609
3196 1609 -35 -1480 -1904 -1443 270 1942 1555 -789 -2097 -1064 491 1225 1381 96 -1833 -2011
3212 -2011 7 1585 1001 -289 -1190 -1438 -593 1071 1489 -202 -1835 -1441 -232 718 1165 498 -1162
3229 -1162 -1928 -551 1358 1583 468 -792 -1675 -1337 733 2242 1255 -879 -1649 -835 327 1654 1818
3246 1818 -47 -1930 -1540 478 1510 1184 427 -580 -1275 -115 1960 2263 591 -687 -640 -28 882
3263 882 1813 1120 -994 -1810 -390 1137 1355 720 -438 -1614 -1225 828 2041 902 -690 -1244 -897
3280 -897 228 1855 1984 -54 -1734 -1142 254 911 983 190 -1532 -2483 -902 1066 1125 -159 -1042 -1371
3298 -1371 -890 744 1950 881 -1180 -1415 -385 708 1221 918 -479 -2014 -1411 622 1056 25
3314B5j112q48j87J293J873j1j944q92P71J126R88O56r09k075o65J539J361l26
3332F63j110j069q38M63J913J107j166j463oO57R90J257N5j677j235Q83J615L38
3350A377m99q17j312n94J466J596n20j696o99L26P45J473Q85j182j764P2J659
3367E16J024R8o06j386j149P89J881L91j229j112n05Q3J116J530m92j913p90R27
3385h27J216P52K80p05j539j28J803J293o09j306q52l89M57J377M15j591j454
3402a807K23J118R04O10j92j436q38J165J775K53q78r71q68j09J482J294q12j897
3420i84q06N56Q25R49L55j131j559K85J746J109k38o47r72o21Q27J624K73j452
3438A39j166j09M43J001R27n79j678n91J224J191L51l43r62j147K19J967J133
$$ plain form
3314 25 -1087 -1935 -2122 -829 1044 1033 -911 -1803 -1032 94 1082 1738 829 -1246 -1911 -372 989 663
3332 663 -447 -1516 -2354 -1891 22 1129 -37 -1500 -1506 -849 141 1398 1453 -224 -1459 -576 1039 1377
3350 1377 878 61 -1251 -1845 -379 1217 697 -999 -1698 -1372 -627 846 1731 549 -1215 -1143 516
3367 516 1540 1638 1032 -354 -1503 -714 1167 1558 329 -783 -1288 -1205 -89 1441 949 -964 -1754 -827
3385 -827 389 1141 1421 716 -823 -951 852 2145 1536 230 -622 -1011 -554 823 1238 -353 -1807
3402 -1807 -1584 -466 438 1048 856 -580 -1418 -253 1522 1775 897 -74 -942 -1051 431 1725 913 -984
3420 -984 -1790 -1234 -409 540 895 -236 -1795 -1510 236 1345 1107 460 -512 -1133 -306 1318 1591 139
3438 139 -1027 -1136 -693 308 1235 656 -1022 -1613 -389 802 1153 810 -152 -1299 -1080 887 2020
3455B020q86j394m69K19Q16J263K63j599j560L17J193Q94P6n47j356n98J206J638
3473A496J84r37r51l59L27J266J014q24j666n06Q87R44N24k29j112j226M75J608
3491I15Q14p56j018o94jJ066J442j00j510j167K21R06J067M16r50j694m84J308
3509b19J416J43p41r79r01L18J605R54r53j357m41M27P71P82J55j330j038N00
3527h88J366O34m20p73r03o0J227J151l49j327q94J13Q79J252M01j260j655p3
3545a579J325J124L08m29j335j034O23J878Q25q08j277n74J5R84J089l1j326j120
3563a342K32J006P77R0p62r17q0J122R32k19p38o85r1P79J135K49j348j349K19
3582i90J057Q66K72o89j509q04Q80J795O53p47j374p52L10J409J335k33j315j275
$$ plain form
3455 2020 1134 -260 -729 -510 306 1569 1832 233 -1327 -1010 183 1077 1153 606 -750 -1348 -142 1496
3473 1496 1680 743 -208 -567 -240 1026 2040 1216 -450 -956 -69 875 1399 1170 58 -1168 -693 915
3491 915 1729 973 -45 -739 -740 326 1768 1668 158 -1009 -788 118 1185 1601 651 -1043 -1527 -219
3509 -219 1197 1340 599 -380 -1281 -963 642 1596 643 -714 -1155 -728 43 825 980 -350 -1388 -888
3527 -888 478 1112 692 -81 -984 -1044 183 1334 985 -342 -1236 -1123 -244 1008 1409 149 -1506 -1579
3545 -1579 -254 870 1178 749 -586 -1620 -997 881 1706 898 -379 -953 -938 46 1135 1104 -222 -1342
3563 -1342 -1110 -104 673 763 1 -916 -996 126 1058 839 101 -584 -675 104 1239 1488 140 -1209 -990
3582 -990 67 933 1205 516 -993 -1797 -917 878 1531 784 -590 -1342 -1032 377 1712 1479 164 -1111
3600a111R3R31J066K58r59j496k05Q59Q32J57m36p37n58O39J253K51q96q49K15
3619f93O15P69K85o04j319m32R08J302K54r65j338p38N70J670R32o12j352r59
3637a707K13J351J489K47j262j522m7J060R56M21o19j362q20M80J212N40p40p94
3655i04k76L07Q48O34k31q61l14O89J041K73n59j014o22O13J165M41q10j320p46
3674a646L30J400J246j86j445j181L84J284J311L63p24j544p85R48J480M49p31
3691I53j191p98K25J082Q02l04r42p56J98Q32O18qp56n29M47R37L79l49o36n88
3711c84Q7Q98P30m18j383q59K22R95J054J26j106j340j76J278J456M85q07j293
3729d35p05O23J361P39m93j270j009jR04J017p0j100q43J28P81P83J43n32o45
$$ plain form
3600 -1111 -1018 -87 979 1237 278 -1218 -1423 -564 268 425 -11 -748 -1306 -667 586 837 -59 -908 -693
3619 -693 -78 691 976 372 -947 -1379 -471 831 1085 120 -1218 -1956 -1386 284 1216 604 -748 -1707
3637 -1707 -1494 -143 1346 1593 331 -1191 -1238 -178 778 1199 580 -782 -1602 -1122 90 630 -110 -904
3655 -904 -1180 -873 -25 609 378 -483 -797 -108 933 1206 647 -367 -989 -376 789 1230 420 -900 -1646
3674 -1646 -1316 84 1330 1144 -301 -1482 -1098 186 1497 1860 1136 -408 -1193 -245 1235 1684 953
3691 953 -238 -1036 -811 271 1073 769 -173 -929 -731 101 719 711 -45 -574 -127 810 1189 840 204 -384
3711 -384 -297 601 1331 913 -470 -1329 -1107 -112 942 1068 -38 -1378 -1554 -276 1180 1665 858 -435
3729 -435 -1140 -517 844 1583 1090 -180 -1189 -1190 -286 731 661 -439 -1282 -1154 -373 410 553 21 -624
3748f24j28Q43Q00j70r59o90J58O37O44M8r28j005NR93J001K29q97j107l49P62
3768g37J313N79n63j206o83L07J232J086k60j287q60J30Q68Q41J96p83j173j11
3786a111R27R59L0o72o35j05N25Q93K18p36q85m4O07Q30L00o76j020m54P51J073
3806G75L30n77j046o55M22J223Q73m31j172p57K84R47Q32O1r01j122n7Q59Q76
3825G64K04o61q62l50O23J029K26o77p70l49N33P33M49o15r64l48O31R80K76l53
3845D99r33o83L67J251O54n90j005n37J18P72R29J08j114j176J09Q15Q92J27m83
3864A20r74m62P67J144L64n98p99l71M05Q75M53n00j132l72L57Q04N09j84r60
3883e54o45M32J067N66k13p17p35K1R30J094p5j110q93J74N61P72K71o68j208
$$ plain form
3748 -624 -752 91 891 721 -238 -928 -770 -133 511 559 -369 -1374 -1369 -376 625 854 -43 -1150 -1499 -737
3768 -737 576 1155 592 -614 -1297 -990 242 1328 1068 -219 -1079 -949 -81 760 956 173 -1000 -1111
3786 -1111 -184 775 805 133 -502 -607 -82 811 1029 293 -592 -636 -29 801 1101 425 -595 -1049 -298 775
3806 775 1105 528 -518 -1173 -751 472 1345 914 -258 -1015 -731 216 1048 1109 208 -914 -971 -112 764
3825 764 968 307 -555 -905 -282 747 973 296 -474 -823 -290 443 892 277 -687 -1035 -404 576 852 499
3845 499 -434 -1117 -750 501 1155 565 -440 -977 -859 -87 842 950 -164 -1340 -1231 -416 476 603 120
3864 120 -854 -1316 -549 595 959 361 -438 -809 -404 471 924 424 -708 -1080 -723 81 590 406 -554
3883 -554 -1199 -767 300 866 653 -64 -799 -778 152 1246 1171 61 -832 -658 -97 675 946 278 -930
3902i30l95P59J026K23n61p10m13L29J105N63l88q47m40L66O46P04k39j048o69
3921i19K87Q18L95p7p06q52r3J062R73j54p69p28Q1P83R20M02p44j084k80O64
3941b1P34K30m51r99o61L25J159L99m36p10n12L00Q48Q90j50j015n53M23O13M65
3961H78p1p56q51j06Q63P16k27o78o19j23N65J055L10q69q08o5O16P95N28l45
3981H08j032o52O37R48K07l22p44p33kR57Q03l53r60n65M20O02N77L14o08r24
4001f22O0Q18P00p0n77p80l33O08Q34J08p14q21k81M55R18N46m63r98k81O87Q16
4022F10L39q4p55q03J56J069O23m82p92m97r8N39Q49J39q26q10J62O95N49K14
4042G97l01r41k67P22R21M1o54n95l08K49P85N00o47r76k65M96O85M94j94p87
$$ plain form
3902 -930 -1325 -566 460 683 122 -588 -1001 -672 433 996 608 -239 -679 -313 333 1037 798 -250 -919
3921 -919 -632 186 581 504 -202 -1054 -1147 -85 888 734 -35 -763 -682 101 1021 1423 679 -405 -685 -21
3941 -21 713 943 492 -507 -1168 -843 316 715 279 -431 -943 -643 205 1095 945 -70 -623 -200 413 878
3961 878 807 51 -800 -906 -43 673 446 -232 -851 -974 -409 646 956 87 -721 -786 -170 625 1153 808
3981 808 -224 -876 -239 709 916 594 -150 -883 -885 72 875 522 -438 -1003 -583 19 596 910 302 -622
4001 -622 -562 256 956 886 309 -471 -804 -196 638 746 32 -789 -1070 -615 303 849 386 -612 -893 -206 610
4022 610 949 865 110 -693 -537 532 1155 673 -119 -616 -714 -175 674 813 -13 -823 -661 34 583 797
4042 797 496 -445 -712 10 931 972 318 -277 -585 -336 449 949 302 -674 -939 -443 242 736 542 -245
4062b45o40L13R00N70k46o08n82q0O19R39m2q79o96M8M43O94L20n21r12k57P92
4083g0O42N4k80n93n08L78J022L69o21q23j11J99N21N81Kj047p42M24Q85L90j13
4104E59n91p25p2Q02Q41q3p83n86j19N14Q31K80o14r27j30N92O01L59l00p09n74
4125h34L67R11K86m47n64m35k0P65P36k62r14m19L35N19M62J09o39p98Q5Q46O13
4146G02k95n33l93k98L69Q92L96q28q43n4O03N18M15k80r36m25M54R06M01l28
4166D43o64m79J46P65O48k62p10n15l8N06O98Q8p18p20J48P07M27Q9j67o97l66
4187f71N95R43J40p02o24r4K54N48L44l20r63l95N00P72L16j56n97o10K66Q90
4207D36O37k95o81m06j87N73P63M7q76o98M6O13M55J32k61p05m05O17P67Q7m11
$$ plain form
4062 -245 -885 -572 328 898 652 44 -538 -618 1 940 898 19 -677 -629 -186 508 828 307 -605 -862 -70
4083 -70 572 626 346 -247 -755 -377 645 1014 393 -430 -541 -342 179 760 762 -285 -1027 -603 282 672 559
4104 559 -32 -757 -829 -27 814 731 -52 -638 -757 -243 588 868 254 -673 -803 -211 390 749 449 -260 -834
4125 -834 -467 444 730 283 -281 -716 -736 29 765 503 -411 -830 -495 24 486 595 -44 -842 -757 89 702
4146 702 407 -126 -519 -817 -448 444 840 12 -831 -885 -282 236 651 371 -565 -990 -536 370 771 443
4166 443 -221 -700 -554 211 859 597 -113 -628 -666 -160 538 626 -92 -812 -664 43 470 559 392 -305 -671
4187 -671 -76 867 1007 305 -319 -413 -159 389 733 413 -550 -945 -445 327 643 487 -110 -720 -454 436
4207 436 1073 778 97 -309 -496 77 840 887 11 -687 -641 -28 427 559 298 -407 -812 -195 572 659 248
4228B48n16k63L53P10M19m73p95k40K30O09M39k65q75o43L11Q66L54k02m76n33
4248g42j30O99R23N8q18n42J26M40M83L15m06q99m40M74P15J90n19n53k94K73
4268f47P68M31l30m54k99J79O78O59l34q78m90L88M51L60r7o09p18j14Q53Q91
4288F88j54p12m94j8M92O84L59l92q86l02N77P11K38l96o56m04K77N65L22j43
4308C56n46m90P4O71N90k33p02k83L27N64M04kn03o88k0P68O31k47o73o14n4M33
4330b37O31L49n07p73l57M86P88N81l69p91k74K39N53M37P9p01p14n3P20N49l28
4351C08n99k30J3M13M31J61m21o43P5O53N33j63m52n45m3M24N98K67o15p37l41
4372i13M82P49M19m11q95k72K41P13N73o1o49p35k8Q85N42r3o29l44k18L49O19
$$ plain form
4228 248 -268 -531 -178 532 951 478 -317 -557 -327 282 721 456 -419 -1062 -751 115 469 267 -209 -742
4248 -742 -872 -173 750 808 -10 -552 -426 14 497 812 406 -493 -933 -459 256 446 -73 -626 -920 -647
4268 -647 121 552 222 -232 -531 -352 326 985 651 -227 -717 -329 122 482 385 -224 -942 -1056 -203 688
4288 688 534 -178 -672 -690 -198 486 845 453 -433 -735 -158 553 791 395 -261 -665 -388 177 499 356
4308 356 -190 -680 -606 65 655 422 -280 -563 -236 328 732 730 227 -461 -481 287 918 671 -2 -616 -670 -237
4330 -237 394 743 236 -537 -894 -408 380 961 592 -199 -473 -234 319 756 835 134 -580 -633 87 636 308
4351 308 -291 -521 -508 -95 336 497 76 -567 -492 161 694 531 79 -466 -509 -85 513 780 165 -572 -913
4372 -913 -431 318 737 326 -569 -841 -600 113 686 625 -24 -759 -787 98 640 547 -82 -426 -644 -295 324
4393C24K37m57o04p9M39M83M5l82m61m6L70N16J36l25o23j60L59Q24J65n15o55
4414d09l09M08O52M33p1q72p12K24Q71O19j20n27p04j73M93P03L58n12p41j49
4434e38M44M74K01j86m78l28K53N85J34k33m85k67L67M68O6j89o25k35K77N93
4454B98L33j54q52m50M01P75M64p6o93n84j05O11P74R5o82q26k35N39O44L43l17
$$ plain form
4393 324 561 104 -500 -579 -140 343 388 6 -455 -501 -131 385 521 196 -427 -587 -228 596 761 246 -409
4414 -409 -718 -310 342 775 704 -168 -880 -656 215 834 714 187 -517 -690 -197 506 864 352 -389 -538
4434 -538 -94 380 581 395 -83 -411 -158 427 561 328 -157 -424 -57 411 477 288 -337 -572 -295 298
4454 298 631 477 -375 -825 -424 351 815 739 46 -538 -643 -32 742 837 155 -671 -906 -367 277 620 303
$$ [...]
8191A75
##END NTUPLES=NMR FID
##END=
