##TITLE=1H_AM_NV170.2
 200.13MHz, CDCl3,
 8 sc
 
 21.1.2025
##JCAMPDX= 6.0         $$ Bruker NMR JCAMP-DX V2.0
##DATA TYPE= NMR FID
##DATA CLASS= NTUPLES
##ORIGIN= UXNMR, Bruker Analytische Messtechnik GmbH
##OWNER= pz
$$ XWIN-NMR		Version 3.5
$$ Tue Jan 21 17:10:26 2025 Russian Standard Time (UT+4h)  she@DPX200
##.OBSERVE FREQUENCY= 200.1313
##.OBSERVE NUCLEUS= ^1H
##.DELAY= (6, 6)
##.ACQUISITION MODE= SIMULTANEOUS
##.ACQUISITION SCHEME= undefined
##.AVERAGES= 8
##.DIGITISER RES= 18
##SPECTROMETER/DATA SYSTEM= spect
##.PULSE SEQUENCE= zg30
##.SOLVENT NAME= D2O
##.SHIFT REFERENCE= (INTERNAL, D2O, 0, 14.3821)
##AUDIT TRAIL= $$ (NUMBER, WHEN, WHO, WHERE, WHAT)
$$ ##TITLE= Audit trail, XWIN-NMR		Version 3.5
$$ ##JCAMPDX= 5.01
$$ ##ORIGIN= Bruker BioSpin GmbH
$$ ##OWNER= she
$$ F:/spectra/data/she/nmr/H-C/1/audita.txt
$$ ##AUDIT TRAIL=  $$ (NUMBER, WHEN, WHO, WHERE, WHAT)
(   1,<2025-01-21 17:09:12.90 +0400>,<she>,<DPX200>,
      <created by zg, POWCHK disabled, PULCHK disabled
       configuration hash MD5:
       00 E9 B6 7A A2 85 ED C7 34 08 36 98 17 FE 4E 26
       data hash MD5: 16K
       A9 EB AF B9 22 0F FD DE 2E 11 25 EA 85 3B D5 47>)
$$ ##END=
$$ 
$$ hash MD5
$$ 33 C2 6F 86 AD 6D 6F 1C C4 C1 31 8B C3 D6 34 79
##$RELAX= 
##$RELAX= 
##$RELAX= 
##$RELAX= 
##$RELAX= 
##$RELAX= 
$$ Bruker specific parameters
$$ --------------------------
##$DU= <F:/spectra>
##$EXPNO= 1
##$NAME= <H-C>
##$PROCNO= 1
##$TYPE= <nmr>
##$USER= <she>
##$AMP= (0..31)
100 100 100 100 100 100 100 100 100 100 100 100 100 100 100 100 100 100 
100 100 100 100 100 100 100 100 100 100 100 100 100 100 
##$AQSEQ= 0
##$AQ_mod= 1
##$AUNM= <au_zg>
##$AUTOPOS= <>
##$BF1= 200.13
##$BF2= 200.13
##$BF3= 200.13
##$BF4= 200.13
##$BF5= 200.13
##$BF6= 200.13
##$BF7= 200.13
##$BF8= 200.13
##$BYTORDA= 1
##$CFDGTYP= 0
##$CFRGTYP= 5
##$CHEMSTR= <none>
##$CNST= (0..31)
1 1 145 1 1 1 1 1 1 1 1 1 1 1 1 1 1 1 1 1 1 1 1 1 1 1 1 1 1 1 1 1 
##$CPDPRG= <>
##$CPDPRG1= <>
##$CPDPRG2= <>
##$CPDPRG3= <>
##$CPDPRG4= <mlev>
##$CPDPRG5= <mlev>
##$CPDPRG6= <mlev>
##$CPDPRG7= <mlev>
##$CPDPRG8= <mlev>
##$CPDPRGB= <>
##$CPDPRGT= <>
##$D= (0..31)
0 0.7 0 0 0 0 0 0 0 0 0 0.03 0 0 0 0 0 0 0 0 0 0 0 0 0 0 0 0 0 0 0 0 
##$DATE= 1737464952
##$DBL= (0..7)
120 120 120 120 120 120 120 120 
##$DBP= (0..7)
150 150 150 150 150 150 150 150 
##$DBP07= 0
##$DBPNAM0= <>
##$DBPNAM1= <>
##$DBPNAM2= <>
##$DBPNAM3= <>
##$DBPNAM4= <>
##$DBPNAM5= <>
##$DBPNAM6= <>
##$DBPNAM7= <>
##$DBPOAL= (0..7)
0.5 0.5 0.5 0.5 0.5 0.5 0.5 0.5 
##$DBPOFFS= (0..7)
0 0 0 0 0 0 0 0 
##$DE= 6
##$DECBNUC= <off>
##$DECIM= 32
##$DECNUC= <off>
##$DECSTAT= 4
##$DIGMOD= 1
##$DIGTYP= 9
##$DL= (0..7)
0 120 120 120 120 120 120 120 
##$DP= (0..7)
150 150 150 150 150 150 150 150 
##$DP07= 0
##$DPNAME0= <>
##$DPNAME1= <>
##$DPNAME2= <>
##$DPNAME3= <>
##$DPNAME4= <>
##$DPNAME5= <>
##$DPNAME6= <>
##$DPNAME7= <>
##$DPOAL= (0..7)
0.5 0.5 0.5 0.5 0.5 0.5 0.5 0.5 
##$DPOFFS= (0..7)
0 0 0 0 0 0 0 0 
##$DQDMODE= 0
##$DR= 18
##$DS= 0
##$DSLIST= <SSSSSSSSSSSSSSS>
$$ [...]
##$SUBNAM0= <"">
##$SUBNAM1= <"">
##$SUBNAM2= <"">
##$SUBNAM3= <"">
##$SUBNAM4= <"">
##$SUBNAM5= <"">
##$SUBNAM6= <"">
##$SUBNAM7= <"">
##$SUBNAM8= <"">
##$SUBNAM9= <"">
##$SW= 18.0517328524113
##$SWIBOX= (0..15)
0 0 2 0 0 0 0 0 0 0 0 0 0 0 0 0 
##$SW_h= 3612.71676300578
##$TD= 16384
##$TD0= 1
##$TE= 0
##$TE2= 300
##$TE3= 300
##$TEG= 300
##$TL= (0..7)
0 120 120 120 120 120 120 120 
##$TP= (0..7)
150 150 150 150 150 150 150 150 
##$TP07= 0
##$TPNAME0= <>
##$TPNAME1= <>
##$TPNAME2= <>
##$TPNAME3= <>
##$TPNAME4= <>
##$TPNAME5= <>
##$TPNAME6= <>
##$TPNAME7= <>
##$TPOAL= (0..7)
0.5 0.5 0.5 0.5 0.5 0.5 0.5 0.5 
##$TPOFFS= (0..7)
0 0 0 0 0 0 0 0 
##$TUNHIN= 0
##$TUNHOUT= 0
##$TUNXOUT= 0
##$USERA1= <user>
##$USERA2= <user>
##$USERA3= <user>
##$USERA4= <user>
##$USERA5= <user>
##$V9= 5
##$VALIST= <valist>
##$VCLIST= <CCCCCCCCCCCCCCC>
##$VD= 0
##$VDLIST= <DDDDDDDDDDDDDDD>
##$VPLIST= <PPPPPPPPPPPPPPP>
##$VTLIST= <TTTTTTTTTTTTTTT>
##$WBST= 1024
##$WBSW= 4
##$XGAIN= (0..3)
0 0 0 0 
##$XL= 0
##$YL= 0
##$YMAX_a= 11599
##$YMIN_a= -11755
##$ZGOPTNS= <>
##$ZL1= 120
##$ZL2= 120
##$ZL3= 120
##$ZL4= 120
##$ABSF1= 10
##$ABSF2= 0
##$ABSG= 5
##$ABSL= 3
##$ALPHA= 0
##$AQORDER= 0
##$ASSFAC= 0
##$ASSFACI= 0
##$ASSFACX= 0
##$ASSWID= 0
##$AUNMP= <proc_1d>
##$AZFE= 0.1
##$AZFW= 0.1
##$BCFW= 1
##$BC_mod= 2
##$BYTORDP= 1
##$COROFFS= 0
##$CY= -3
##$DATMOD= 1
##$DC= 2
##$DFILT= <>
##$DTYPP= 0
##$F1P= 0
##$F2P= 0
##$FCOR= 0.5
##$FTSIZE= 0
##$FT_mod= 4
##$GAMMA= 1
##$GB= 0.15
##$INTBC= 1
##$INTSCL= 1
##$ISEN= 128
##$LB= 0.25
##$LEV0= 0
##$LPBIN= 0
##$MAXI= 10000
##$MC2= 0
##$MEAN= 0
##$ME_mod= 0
##$MI= 1.114404
##$NCOEF= 0
##$NC_proc= 0
##$NLEV= 6
##$NOISF1= 3.799351
##$NOISF2= 2.8
##$NSP= 1
##$NTH_PI= 0
##$NZP= 0
##$OFFSET= 14.38212
##$PC= 1
##$PHC0= 95.64218
##$PHC1= 8.3922
##$PH_mod= 1
##$PKNL= yes
##$PPARMOD= 0
##$PSCAL= 0
##$PSIGN= 0
##$REVERSE= no
##$SF= 200.129724274929
##$SI= 16384
##$SIGF1= 3
##$SIGF2= 2
##$SINO= 400
##$SIOLD= 16384
##$SREGLST= <1H.CDCl3>
##$SSB= 0
##$STSI= 0
##$STSR= 0
##$SW_p= 3205.1282051282
##$SYMM= 0
##$S_DEV= 0
##$TDeff= 0
##$TDoff= 0
##$TI= <>
##$TILT= no
##$TM1= 0
##$TM2= 0
##$TOPLEV= 0
##$USERP1= <user>
##$USERP2= <user>
##$USERP3= <user>
##$USERP4= <user>
##$USERP5= <user>
##$WDW= 1
##$XDIM= 8192
##$YMAX_p= 0
##$YMIN_p= 0
$$ End of Bruker specific parameters
$$ ---------------------------------
##NTUPLES= NMR FID
##VAR_NAME=  TIME,          FID/REAL,        FID/IMAG
##SYMBOL=    X,             R,               I
##VAR_TYPE=  INDEPENDENT,   DEPENDENT,       DEPENDENT
##VAR_FORM=  AFFN,          ASDF,            ASDF
##VAR_DIM=   8192,          8192,            8192
##UNITS=     SECONDS,       ARBITRARY UNITS, ARBITRARY UNITS
##FACTOR=    0.0002768,     1,               1
##FIRST=     0,             0,               0
##LAST=      2.2672688,     0,               0
##MIN=       0,             -11755,          0
##MAX=       2.2672688,     11599,           0
$$ Real data points
##PAGE= N=1
##DATA TABLE= (X++(R..R)), XYDATA
0@%%%%%%%%%%%%%%%%%%%%%%%%%%%%%%%%%kQj3J5j6J6j6J6j6J6k0K6k9L1l2L4m0
50b2M4m6N3n9O3p1P8q6R8j09J20j36J55j78K08k49L08l95N56k050O047p856q228
73a1755R393J34r076M211J0564j410r44N718O82m447j049j00J02q7k415j206J421
90b64l790m324M319L731l464K343O664l400m738M669J398m682K686M353l945k524
106i68K096k766k549L621O99k160K968O33n041O98L857k480o32N681n1m760J350
123A96J619l531p7L410l88j222O18j570j307J333m24j25L390K04l473J285J700
140A638l813k19N076p58l331K813Q63m853J8L866j546j434K964j32l167N17J288
157b10j119J129K273o30k58P08j768j122J596k65j427J243J43k781k74J377n77
$$ plain form
0 0 0 0 0 0 0 0 0 0 0 0 0 0 0 0 0 0 0 0 0 0 0 0 0 0 0 0 0 0 0 0 0 0 0 -2 6 -7 8 -8 8 -8 8 -8 8 -12 14 -15 16 -16 18 -22
50 -22 22 -24 29 -30 33 -38 40 -46 52 -57 63 -73 82 -96 112 -137 171 -224 332 -1718 4329 -3527 -11755
73 -11755 -2362 -2228 -11304 -7093 3471 2061 1117 6835 7517 3070 2021 1921 2023 1936 -479 -1685 -264
90 -264 -4054 -8378 -4059 -328 -3792 -1449 5215 1815 -2923 1746 3144 -1538 1148 5501 1556 -968
106 -968 1128 -1638 -4187 -566 133 -2027 941 1574 -3467 -2769 1088 -1392 -2024 3657 3606 -1154 196
123 196 1815 -1716 -1793 1617 1229 7 625 -945 -2252 -919 -1343 -1468 1922 2126 -1347 -62 1638
140 1638 -2175 -2394 2682 1924 -1407 1406 2269 -2584 -2566 1300 -246 -1680 1284 1152 -2015 -1498 -210
157 -210 -1329 -200 2073 1443 1185 1893 125 -997 599 334 -1093 150 293 -2488 -2762 -1385 -1962
174a962N72K610L41m45J203n72j437J321O44k098J90R76k938k118J829j07j744
191c735K279K355j423q8K287k12q95J791R40j213l68m00j751j078j23n68K09M88
209a505n57kJ147j37o9K319J278r97N64J089j627j726Q64o2j681p1O03j011q74
228b455O50M95L46Q15O78M13L05n20l48M54j36p29M17J65j075m48O95k74n09J011
248e0O08r75q0O45n96o44O67O42m20J6N09O9l66J03L63K04l05k76p0k12p82k09
270a159N21J14l12M84O27l69q9O24J21m84J10K30o36n38K64l8k93J30O40J98k95
291a50K81M26k32l66K67J55o11m20K29om75oO55J06k27K79M71k17l07L79J85l79
313C7j53K89l0l59qK89k36l29J71M1m02j32K46K3k85K52O62K5l4M90M26l57k02
$$ plain form
174 -1962 -1390 1220 1561 1116 2319 1747 310 1631 2275 177 367 1343 -1595 -3713 -1884 -1991 -3735
191 -3735 -1456 899 -524 -612 1675 1463 568 2359 3299 2086 1718 1318 -433 -1511 -1634 -2202 -1993 -1505
209 -1505 -2062 -2064 -917 -1054 -1123 1196 2474 1477 2041 3130 1503 -223 641 579 -1102 -1173 -570 -1581 -2455
228 -2455 -1805 -1310 -964 -149 529 942 1247 727 379 833 697 -32 385 550 -525 -973 -278 -552 -1061 -50
248 -50 558 -417 -497 148 -448 -1092 -425 217 -203 -187 322 391 25 128 491 695 390 114 44 -168 -950 -1159
270 -1159 -638 -524 -836 -352 275 -94 -183 441 562 78 188 418 -218 -756 -492 -530 -823 -693 -53 145 -150
291 -150 131 557 325 -41 226 381 -230 -650 -421 -427 -902 -908 -253 -147 -374 -95 376 159 -148 231 416 37
313 37 -116 173 143 -216 -224 65 -171 -500 -329 -288 -690 -822 -576 -553 -838 -586 76 101 67 557 983 626 424
336D24K72j37p47l38P4l54n30O8M04j4J7M93N83J38j4M61J93l58k17J60l35o08
358c65K2J43n17j65M57k0l76L57M76k47k11N86K27l94K5M14r3k24O4J62j7k50
380E4k76J40N4o02Q2M98k54m06M70L61m93J53P18k67l66N61N9o33J56N39l92k91
402a35L78n7l97P3J9r3P4L1j16K46j25n07M71N58n29p8R66k16q80N75N47q63j7
425g5Q87n09o31N61j19p88M58M18n15J02N46n53l07P39k7k26P57J96p26L52K43
446G83q90J14P73o65n08P33l67j064O54O65o45L66J100o44m61P77k96o83Q97K68
466I07r11K23N15j120k26J183k88m23R71p9j070L11L33j009L68J112q62l59J186
485G62l84j007J126Q40p72J94O65r30p94L84l94l13R00j27o18O89L7j110R55J362
$$ plain form
336 424 696 559 -188 -526 -452 -806 -1336 -1268 -864 -878 -861 -368 215 353 339 800 993 635 418 578 243 -365
358 -365 -343 -200 -717 -882 -425 -445 -821 -464 12 -235 -446 140 367 -27 -2 412 319 95 159 321 304 54
380 54 -222 -82 -28 -630 -548 -50 -304 -710 -240 121 -372 -219 499 232 -134 427 486 -147 9 548 156 -135
402 -135 243 186 -211 -138 -119 -212 -138 -107 -223 23 -102 -609 -138 420 -109 -187 779 563 -317 258 805 -58 -75
425 -75 812 303 -328 233 114 -674 -216 202 -313 -211 335 -218 -525 214 187 -39 718 914 188 540 783
446 783 -107 7 780 115 -393 340 -27 -1091 -437 228 -417 -51 1049 405 -56 721 425 -258 639 907
466 907 -4 219 734 -386 -612 571 283 -140 831 752 -318 -7 326 -683 -315 797 -65 -424 762
485 762 378 -629 497 1337 565 759 1424 494 -300 84 -310 -623 277 150 -468 221 258 -852 103 1465
505A465j220j4J720j087j986J455P57j918N32K095j229j460J462J95j530N75J486
522A298p08o67L35l53l89O4O7Q44Q35r62l82J329p49j489J580J300k034l22J832
541A429j342k014J672J092j509N94J672j314j038J131o5p09J099M96q14J99P7
558F56j169K92J140o96MJ097r46j490Q32K68j130Q79J339r19l91Q78n49n25J224
577G94L29n94P88j09j784lR83j189j71J888k90j724R02O58j468M10J828l98o82
596A68Q07m43j184M81N38l89N66M08r90j58L18q49L6J290j82p04P92j64j499N38
616f20J171o41O1J307n48j270O53J53q79P52R54r46k43N10r55o53J231J71p41
635e33Q10N58j324l58R84k41k55J027K58p87m3j31n50K96N66l58K97K68r82m39
$$ plain form
505 1465 245 231 1951 864 -1122 333 1090 -828 -296 1799 570 -890 572 767 -763 -188 1298
522 1298 590 -77 258 -95 -484 -420 -353 491 1326 364 -18 1311 562 -927 653 1953 -81 -403 1429
541 1429 87 -1927 -255 837 -672 -78 1594 280 -758 373 308 -401 698 1194 380 579 656
558 656 -513 -221 919 223 227 1324 378 -1112 -280 -12 -1142 -263 1076 157 -234 644 95 -430 794
577 794 1123 529 1317 1208 -576 -579 404 -785 -956 932 642 -1082 -180 478 -990 -580 1248 850 168
596 168 975 532 -652 -171 367 -22 544 952 -38 -196 122 -727 -691 599 417 -287 505 341 -1158 -620
616 -620 551 -90 -29 1278 730 -540 113 266 -613 139 1093 147 -96 414 -541 -1194 37 208 -533
635 -533 277 835 -489 -847 137 -104 -359 668 926 139 96 -35 -585 -289 277 -81 216 484 -498 -937
655i37P61j09m79J041N35j046j37N92p48l54J082L74o80L04K41q46r8N15l7P7
675E1L73l92m86Q1m20k74P85M35n24L40N31p99l99R09J91n36N45L04r48l42L23
696b52k89k11O70J79l81L7j18l66J89L42L9K15J68l78j39J86j57j0O86J25n22
717A3JQ5p56l24O27L2l55L05K21n15o9N02K24P3L63R3k45k99k15j40P5j4o2K02
741a78j67l69J61K55r9N2O05k4n26PJ98l48j92N38K29l73LK95j27k86J87K53O
764A00l12j00J7k53k40J43M43m0m1K65J15l23O7L09P8k45J57Nl68k37J49L9j09
787c81J16K38j03k99R1J51j21p9K40J85j94r2K20Q4j70N4L98j18k71M4K2k85j68
810d38J16J41j89M3N5PK1Q1J59O2k0J17mj59n5J17L9k23P5J41k00k02J64J12k39
$$ plain form
655 -937 -176 -285 -764 277 812 -234 -371 221 -527 -881 201 575 -105 199 440 -406 -504 11 -26 51
675 51 424 32 -454 -373 -793 -1067 -282 153 -371 -31 500 -299 -698 211 402 -134 411 715 -233 -575 -252
696 -252 -541 -752 -82 97 -284 -247 -365 -731 -542 -200 -161 54 222 -156 -295 -109 -266 -276 410 535 13
717 13 14 99 -657 -981 -354 -322 -677 -372 -151 -666 -735 -233 -9 64 427 520 275 -24 -239 -379 -304 -318 -380 -178
741 -178 -345 -714 -553 -298 -397 -345 260 236 -290 -283 -85 -433 -625 -87 142 -231 -228 67 -60 -346 -159 94 100
764 100 -212 -312 -295 -548 -788 -645 -202 -242 -283 -18 97 -226 -159 150 228 -17 140 145 -223 -460 -311 -272 -381
787 -381 -265 -27 -130 -429 -338 -187 -308 -387 -147 38 -156 -248 -28 56 -114 -60 338 220 -51 -7 15 -270 -438
810 -438 -322 -181 -370 -327 -272 -265 -244 -163 -4 58 38 155 151 -8 -63 54 93 -130 -55 86 -114 -316 -152 -40 -279
835b79JK82q2k26J61J30p0m1K20J07j2j12M7P5j12q4O1q1r3j13Q5l2j68J58J15
860f3j13O3K62j4k05K68J64k69n5K43j3l03J16j0j68n1L7J04r3J6RM3O5j02R3
885B4J97r1j62K13O7l06M6L06k15j58L69o7k82J29K11k47j26L01j91k16R3N7j14
908a62J42J6RK67J6j17K37J28k98j10M06l40m57L36K3m30K7M85k51k57N06Q5l14
931e3K14K98k23j5K73k97o9J86j99q5K71j76j72K22j01l64K28K52m74l6N91k48
953B3l90O20L55m81J37N30k97l83K86j21m24J20O2l28P3Q1j54J72L25j69J55M53
975F45l27k65M46j13n61L70L82p24j58O92l98m49O31K81n70J13M13m35l26N35
995A82j02j79M16Nl93L26j2l38K66L29l77j44M01m23m06M66J84m59L61L44n21
$$ plain form
835 -279 -278 4 -78 -304 -143 -13 -83 -124 96 203 191 79 126 201 89 5 66 -15 -108 -221 -136 -168 -336 -178 -63
860 -63 -176 -113 149 135 -70 198 362 93 38 281 268 -35 81 71 -97 -148 -111 -7 -100 -84 -75 -32 33 -69 24
885 24 221 130 -32 181 248 -58 -12 294 79 -79 290 223 -59 70 281 34 -92 209 18 -198 -105 -48 -162
908 -162 -20 -4 5 272 288 171 408 536 238 128 534 194 -263 73 96 -334 -307 178 -73 -330 176 261 -53
931 -53 161 459 236 221 494 197 128 314 115 30 301 125 -47 175 74 -290 -62 190 -284 -320 271 23
953 23 -367 253 608 127 264 794 497 114 400 279 -145 -25 37 -291 -218 -137 -291 -119 206 37 192 645
975 645 318 53 499 386 -175 195 577 -147 -305 387 -11 -460 171 452 -118 -5 408 -27 -353 182
995 182 80 -99 317 322 -71 255 243 -95 171 500 123 -21 380 -43 -449 17 201 -258 103 447 -74
1016g4n9M40k46k43M75O4n07K74J43n33J63M62k98m3N43k62o14M24J36o61L95
1037b1M11m99k33M10j97l43N84J87l31L24J50n13O2L70l75n2N78k77m78K79k3
1058A3n78L28M77l47j11N12m92l05N11K21l46M99M07p06j43N27m12l38O14O6o21
1079b24Q2J20n35m9M90q7j9M18Kl35K59m5l5M58R0l90O7M6o97j55O74k35m12N42
1103C0J89q66R6P40l33j15P70J13m90L0J67m39N6K65k20m2J22m04k42L23K1j05
1125c34N10K48m93K9L25n27m8O11k1m19K42P6n78N0L40k5O0K82j78k18m6j11j13
1148c38L51J42k92J19J76l69j63M96L6k42M82P3o24j03K87k78j2M60k4k90Q3L2
1170Bl02R5L27m0l7J09k45j61K4r1J25L14R5j60J11M9l42J5L88r8k50K79j65m73
$$ plain form
1016 -74 -133 307 61 -182 293 357 -150 124 267 -266 -103 359 61 18 561 299 -315 109 245 -416 -21
1037 -21 390 -109 -342 68 -129 -472 112 299 -32 292 442 -71 -9 361 -14 -66 512 235 -243 36 13
1058 13 -565 -237 240 -107 -218 294 -198 -503 8 229 -117 382 789 83 -60 467 55 -283 331 397 -224
1079 -224 -142 -22 -557 -606 -116 -203 -222 196 198 -137 122 77 42 500 590 200 267 313 -384 -539 135 -100 -512 30
1103 30 219 -647 -551 189 -144 -259 511 624 134 164 331 -108 -52 213 -7 -49 73 -331 -573 -250 -229 -334
1125 -334 176 424 -69 -40 285 -242 -290 321 300 -119 123 199 -379 -329 11 -14 46 328 150 -68 -114 -225 -338
1148 -338 13 155 -137 -18 158 -211 -374 122 158 -84 398 471 -153 -256 31 -247 -259 201 177 -113 -30 2
1170 2 -300 -205 122 82 45 154 -91 -252 -228 -319 -194 120 215 55 166 215 -127 -112 276 178 -72 207 42 -431
1194d31K6K54j58J02L74l4k75N6J41j61J5L37O6j05q3j52j02M0j32J56K44j19
1216E9k76L5Kl10J44M87k2j18K10k5k34N7L36L0j59O6j09k94k01p3L6J28R1k1
1240a61J05k1j29J29K96j1%K52j02l09j48J23j60m8K45O2k68q8R0Jk8J32K40r
1264A93j29o6K7k2j30K04J44k2j78OJ3k56Q4J87j0j01K3K4j57l2J28N9K4J60n4
1289A19o7j22nJ53J0k0N5kj56j16P2P4q3L2J44j02j22N7K4k9RJ89J3q7k5j3j5
1316a3J1P0l7J17l5q7n2j3m0P9J8k5Mm1j02p5J05R8o9J14Q0j1r8Q6Q0j36J15K3
1344A66r7p5q4l9j0J7l9K6L1pk6M4K3K1J38R0j89O4J01j41q6R7J02k39j3J23j23
1371a25j96R3M1pO9P3J0j5K8J03J45m1r4R9m0j22j00N3l2k21J1J57j87J6K90n0
$$ plain form
1194 -431 -405 -151 -309 -207 167 133 -142 -86 55 -106 -91 246 312 207 124 -28 -130 -90 -222 -66 178 59
1216 59 -217 -182 -180 -490 -346 141 119 1 211 186 -48 9 345 375 216 282 173 -121 -322 -395 -359 -231 -140 -161
1240 -161 -56 -77 -206 -77 219 208 208 460 358 49 -99 24 -136 -184 61 123 -145 -233 -143 -142 -170 -38 202 193
1264 193 64 -2 25 3 -127 77 221 199 21 27 40 -216 -132 55 45 -56 -33 -9 -166 -198 -70 -11 13 173 119
1289 119 52 -70 -75 78 88 68 123 121 -35 -151 -79 -5 -88 -56 88 -14 -136 -79 -55 -84 -75 114 127 40 15 2 -13
1316 -13 -2 68 31 148 113 26 -26 -39 -79 0 18 -7 -3 -44 -146 -221 -116 -18 -87 27 107 96 -2 84 164 28 143 166
1344 166 69 -6 -90 -129 -139 -122 -161 -135 -104 -111 -137 -93 -70 -49 89 179 -10 54 155 14 -72 25 127 -112 -125 -2 -125
1371 -125 -321 -228 -187 -194 -125 -52 -42 -57 -29 74 219 178 84 183 143 21 -79 -26 -58 -279 -268 -111 -298 -282 8 -42
1397d2j20K23J30j69L6R4j01j98J60j1j28M5L5l1K2l1l0J20L1k00P0P0r0r6J63
1422d8j2j76J53J96j45K2K00j17j37J47K4j98jN8j26n6R3n2Q0N9Jm0R9k4o9J07
1448C8R7k28K7K33j34j59K08K5k16M7M8j05j23K85j82r8J31K9p7J16J41j99J07
1471A1J56j81L1J47r2j91J68p1j97J16J52k46M1K30j60j15K13K2j66J45L3j69
1493a23N3K00j58K6J39l7k00K10j2k49N9K38l61MJ77j32q6K33R8j71J62J02j78
1516fm7K38o6q2P9N0j96N3J9j83j5P8j00J27J36j25j10K20k1j05K41O5l41N7K53
1541B19k05j23L02n0l03J43J10k84MK65r7j43L09n4k94J30J24j23N7J56q3mQ9
1564A45j52q8K96j16k6J43l7l37j6K57k30NK36Pk21J51J17j86P2K33r3k7R9r7
$$ plain form
1397 -42 -162 61 191 22 58 152 51 -147 13 2 -126 -81 -46 -77 -55 -86 -116 4 35 -165 -95 -25 -115 -211 -48
1422 -48 -60 -236 -83 113 -32 -10 190 73 -64 83 107 -91 -92 -34 -160 -216 -123 -175 -95 -36 -35 -75 24 0 -69 38
1448 38 135 -93 -66 167 33 -126 82 107 -109 -62 -14 -119 -242 43 -139 -237 -106 -77 -154 -38 103 -96 11
1471 11 167 -14 17 164 72 -119 49 -22 -219 -103 49 -197 -156 74 -86 -201 12 34 -132 13 46 -123
1493 -123 -70 130 -28 -2 137 100 -100 110 98 -151 -92 146 -215 -211 -34 -166 -252 -19 79 -92 70 172 -6
1516 -6 -53 185 119 37 116 166 -30 23 42 -141 -156 -78 -178 -51 85 -40 -150 70 49 -56 185 250 -91 -34 219
1541 219 14 -109 193 143 -160 -17 93 -191 -187 78 -19 -162 147 93 -201 -71 53 -70 -13 143 60 56 145
1564 145 -7 -95 201 85 59 202 165 -172 -188 69 -161 -156 80 87 -134 17 134 -52 20 253 160 133 232 135
1588A35k11J31o6l1P0N6j88M7J03k31N3L79j10j43J88M6l37J00K65j59n0K25j08
1611A64j75PLn5K5J01o6l4K9j53R5J21J8J6J66j5k63P4J27j88o4L36r0k62J11
1636B8O4k59N6K60k3j30J63o3k44Q4P5OJ83q0p3R5n7p4J0J58qr4J53j32k64J28
1662c8P6j85J37J84q3j22J42K2j69J33J48r0l2M5r8k23J49rK2P4M2j09k2kr9Q9
1688a8J79p2q7M0k6r9M0P3P4J08K1r8j15L9m3k1J23jn5p4mj02JP5K8O6J27n6j35
1717a2K0O1j15J14J86q5j41QJ9j90N2Q2J0j8l5j1r4J9O7P1J34M6o2k9k7n5J5J07
1745A37m5m9L7j74j35J07M0m7J31J24j11o5OL6L1P0M6M2p0n5j16k3j4K3N8N6o2
1772b2p1k1K6k9O8J73r2K2K3j51m6J46N9q7N0N0r7j11N6M0k6P3qj0k6j29M9mN2
$$ plain form
1588 135 -76 55 -11 -42 28 84 -104 -57 46 -185 -132 247 137 -6 182 228 -109 -9 256 97 47 272 164
1611 164 -11 -4 -1 -56 -31 70 4 -30 -1 -154 -59 62 80 96 262 247 -16 58 185 -3 -67 269 179 -83 28
1636 28 92 -167 -111 149 126 -4 159 96 -148 -64 11 17 200 120 47 142 85 11 21 179 171 77 230 98 -166 -38
1662 -38 38 -147 -10 174 91 -31 111 133 -36 97 245 155 123 168 70 -153 -4 -13 9 83 125 16 -6 -8 -107 -18
1688 -18 161 89 2 42 16 -83 -43 30 104 212 233 135 20 59 16 -5 118 117 62 -12 -16 -118 -117 -42 -14 52 179 123 -12
1717 -12 8 69 -46 68 254 169 28 36 55 -135 -83 -1 9 -9 -44 -55 -149 -130 -63 8 142 188 126 97 70 15 30 137
1745 137 92 43 80 -94 -229 -122 -82 -129 2 126 15 -50 -44 -8 23 93 139 181 111 56 -60 -83 -97 -74 -16 40 -22
1772 -22 -93 -114 -88 -117 -49 124 32 54 77 -74 -120 26 85 -2 48 98 1 -110 -54 -14 -40 33 25 15 -11 -140 -91 -95 -43
1801d3n5J14L5j16j5K1Q2j3Q2Ko5r0JLp3N4N2m0qO7q3o1O8P5K6j9J1J2n6r2J6
1832a08R7K8o9K3N1q2n6J06o3m9J04lm7j20Q0%j8O4O5L9m9j3L4nKM7o5Pr6k4j
1863a21n2j0J23n9J1MO4qj25J57N9jL2pj1p2m5j7M2L4l3m0k5k1l5P4k9K9L0Q9
1893C7n1j9J10n3k5P7j0j43L6nj5n2P0Ro8j2N7j4K7o9L2Q7Np6K5Q4o9k2L7L1q1
1924f0L1O9j52O3N7q0n8Q1K2r1k0J37m0RK9J0J5K5J6m8L3qq7L9O0j55O9K8r6m7
1954a49J74l6q6R7P8o0o3Q2k6oN5k1l2m3O1o1Q5l1l4K9l9N0j21J17n0k2L5P4j41
1983h4M9J43j18j4N9N8j10M1K6j9n8Q1j8p8N9l7l4N7j8o2R1Q6r4K2P5n1m5K3K7
2012E7p3J49o7j49N5J02j13K5N1m5p2L7O1J7j9J9k4R0J5n2m1L2m0k0J01p4o2M8
$$ plain form
1801 -43 -98 16 51 -65 -80 -59 23 10 92 94 29 -61 -60 -57 -130 -76 -24 -64 -72 -5 -88 -149 -81 -6 20 1 12 24 -32 -124 -108
1832 -108 -11 17 -52 -29 22 -60 -116 -10 -73 -122 -18 -21 -68 -188 -108 -108 -126 -62 3 42 -7 -20 14 9 11 58 -7 0 -96 -120 -121
1863 -121 -173 -183 -60 -119 -108 -104 -40 -48 -173 -16 43 42 74 67 56 -16 -61 -78 -36 -2 -35 -75 -100 -121 -156 -82 -111 -82 -52 37
1893 37 -14 -33 77 24 -1 76 66 -77 -41 -46 -61 -113 -43 -34 -102 -114 -57 -71 -44 -113 -81 6 11 -65 -40 44 -25 -47 -10 21 -60
1924 -60 -29 40 -112 -49 8 -72 -130 -49 -27 -118 -138 -1 -41 -32 -3 7 22 47 63 15 48 40 -47 -8 52 -103 -34 -6 -102 -149
1954 -149 25 -11 -97 0 78 18 -45 37 11 5 60 39 7 -36 25 -36 49 18 -16 13 -26 24 -97 20 -30 -52 -17 57 -84
1983 -84 -35 108 -10 -24 35 93 -17 24 50 31 -27 54 36 -42 17 -20 -54 3 -15 -77 14 100 6 28 103 52 7 30 57
2012 57 -16 133 66 -83 -28 74 -39 -14 37 -8 -80 -43 18 35 16 35 11 101 116 64 23 55 15 -5 96 22 -40 8
2040HM0j06K6K6K8p9L8Np3N0J48j15L3R4k8j24LJ57j23L1N4n5oo6l1kJ12o0K1
2069FK3n6l1R0M2k5MJ06m4r3Q2K7j42K1O1l6n2K8n9m2k1Q6k0L1Q4p7J00m0m1M4
2099E6J28j58n7J06J2j51O6O9j02kN8K0j03M6L8p9J61p3k4nQ4m7N1k7M9n4l4O4
2127I2r1o4J8JlJ23r2j8N5m2J8O2K5j3k1J4Ko5%N3p5J16q8m9j9O3j14J06N3j9
2157B8jJ8K9j21PL2O8q1J20j44RN6j4RP8l8J3k4k2j7l2J5N5o7Q1o9m9M5pLM7R0
2189A17j53M0l%l6L7J23j06k9J5r2jP2m4mO8j5Ln3O9K3l5L6JK7K2j08K5Nj2L6
2220B8jl4l8k4k4K8l4R3J9O%N9o4q2J27J6M0K5q5n8k0rj1L1p2P0k7O0q7MR3K6
2252E5m2N6N7j02k0J6L1p7K9Q7j05l1l8l5jQ2L2L5o1K7rj9J1K7P1M9l7j03J4J2
$$ plain form
2040 8 48 -58 -32 -6 22 -57 -19 -14 -87 -37 111 -4 29 123 95 -29 -26 131 8 39 93 38 32 -34 -65 -67 45 -15 6
2069 6 29 -27 -58 32 74 49 53 159 115 22 104 131 -11 10 71 35 -17 11 -48 -90 -111 -25 -45 -14 70 -7 93 53 12 56
2099 56 184 26 -31 75 87 -64 2 71 -31 -33 25 45 -58 -12 26 -53 108 35 11 6 90 43 94 67 116 62 28 92
2127 92 1 -63 -45 -44 -47 76 -16 -34 21 -21 -3 59 84 71 50 64 66 1 1 54 -21 95 7 -42 -61 2 -112 -6 47 28
2157 28 27 45 74 -47 -40 -8 60 -21 99 -45 -36 20 6 15 93 55 68 44 22 5 -27 -12 43 -24 57 -12 -61 -16 -23 -20 27 117
2189 117 -36 4 1 1 -35 2 125 19 -10 5 -87 -88 -16 -60 -64 4 -11 -8 -61 8 31 -4 32 33 60 82 -26 -1 4 -8 28
2220 28 27 -7 -45 -69 -93 -65 -99 -6 13 19 19 78 14 -68 59 75 115 140 55 -3 -23 -32 -43 -12 -84 -14 -41 19 -68 -64 29 55
2252 55 13 69 126 24 4 20 51 -26 3 90 -15 -46 -84 -119 -120 -38 -6 29 -32 -5 -14 -33 -22 5 76 125 88 -15 -1 11
2282A1r7Q0O0o2J0qj7m4M9L3oK8O6q6rm0rP4L3o2K7l1%p7N5O1l8P0r1j2m3K0j3
2315f8MM6P6p3K1Np8K4L4M8M6Jp6J8r6J01q3L9M3m3M1r2N9n3J13K4q5J0%K9k4
2346A1o2N0M2N6m1m3J0r1KL4ON6n9lKJ0j1k7R0L5Rm4M2k5o6O8ok2m1L2j4o5j3
2379g8K1K0l7R6m5J0M4pJ6j1O3q2Q8qo6kK2k7r2J00m9r5N3J0LPO8N2k8K1mm7K
2412A8L1Mk1ql0nLl1J8K2m9l4R2k2l3O9M6p6K1L2k4o0M6K5m3qJ7J1m9O8m9rl6
2445f4Q1j0l6L9p6O8J2k4j4Q5L0j34K0j1k6N4J0L0j18P9Mj7Pl3OK8M6p3L3joJ5
2477DL3o3K7jMk5j9Q9j03L6N3J6j05R7Kr8L6k8M5m5J8mn9R7j0qM7n4MN1j8M2m2
2510A9j6n4l6N5Mq5M6K3o1J0J34J2j53J15J6k8J3j5K6j04Q0j4j1plL7o8N6l0K7
$$ plain form
2282 11 -86 -6 54 -8 2 -6 -23 -67 -18 15 9 37 103 17 8 -32 -41 33 66 4 31 0 0 -77 -22 39 1 71 -20 -32 -75 -55 -68
2315 -68 -64 -18 58 -15 6 11 -67 -43 -9 39 85 86 10 28 -68 33 -50 -11 32 -11 30 -62 -3 -56 57 81 -4 6 6 35 11
2346 11 -51 -1 41 97 56 13 23 -68 -66 -32 -26 30 -29 -32 -30 -20 -31 -58 32 67 76 32 74 49 -17 51 45 23 -18 14 0 -65 -78
2379 -78 -57 -37 -74 22 -23 -13 31 24 40 29 92 10 98 90 24 22 44 17 -75 25 -24 -119 -66 -56 -53 -46 22 74 46 67 63 16 18
2412 18 49 53 32 24 -6 -11 -8 -39 -21 1 -48 -82 10 -12 -45 24 70 -6 15 47 23 -37 9 34 -9 -17 0 11 -38 30 -19 -28 -64
2445 -64 17 7 -29 10 -66 2 14 -10 -24 61 91 -43 -23 -34 -60 -6 4 34 -84 -5 -1 -18 -11 -44 -38 -10 36 -37 -4 -5 -11 4
2477 4 37 -26 1 0 4 -21 -40 49 -54 -18 35 51 -54 43 45 -53 -17 -45 0 -45 -27 -31 -90 7 -3 -11 36 -18 -14 37 19 61 19
2510 19 3 -51 -87 -32 -28 -113 -67 -44 -105 -95 39 51 -102 13 29 1 14 -1 25 -79 1 -13 -24 -31 -34 3 -65 -9 -39 -12
2540a2j2oJ8K2p2J3Q5j0J6m4N1n9K1Oj5m3n3L9l4L6K6RK3o0O3l0K8m9N4Rp1O6
2572A5n0Q1o8L2J9l5n4M9k2k7K1O6l2o3O4L6l3PK1k2K2j4j7k6rkK4nm1K5K0m7
2604f5J4N2l8Mk2J06n0o2J13J3m5j6l8Qk3L7m9P7m9M7K2m5JrL9l6j1L1K7k8k0
2635a5rj1j5N9N8m4l8k0Jk7O8k4L7o9L6j7j3k1K3Q9m7L0l8O0l5K7J3j6J7r6%J5
2667b2J4P9r7pK5K0l1K9mk4O4j5J0M4o6J9o4M5k6O1k7l0j8lK6r5J06K6Mo1k6Q2
2699C8q2O8j4L1kn1O7k0p1L0K7K7k1k5K2l4p3M6j4O9k5PM0j8K3k0K9m9M2J1ko9
2731a3L1k2k2M9jrrl7PK9k2J4M6RK3m3J2k3j4P6l5l7nJ9l9J8k2O9m4J0j0k6K0
2764aK4m0M7L7oo2POKj3mJL3l6kJ4kk5O4j4K9q8J4L4m7k4P2M7o8P2j2o0L5pJ1
$$ plain form
2540 -12 -24 -30 -12 10 -62 -49 36 26 42 -2 49 -10 11 17 2 -41 -94 -55 -89 -53 -27 -18 5 -55 8 -22 6 -43 11 20 -51 15
2572 15 -35 46 -22 10 29 -6 -60 -11 -33 -60 -39 27 -5 -68 -4 32 -1 6 27 5 27 13 -4 -30 -39 -41 -17 -22 -63 -38 -18 -65
2604 -65 -51 1 -37 -33 -55 51 1 -61 52 65 20 4 -34 -26 -49 -12 -61 16 -33 14 36 -9 -8 -17 22 -14 -25 6 33 5 -15
2635 -15 -24 -35 -50 9 67 23 -15 -35 -34 -61 7 -17 20 -49 -13 -30 -43 -64 -41 48 1 31 -7 53 18 45 58 42 59 -37 -37 -22
2667 -22 -8 71 -26 -33 -8 12 -19 10 6 -18 46 31 41 85 19 38 -26 19 -7 54 27 -3 -21 -24 2 -93 13 39 43 -18 -44 38
2699 38 -44 24 10 41 39 -12 55 35 -36 -6 21 48 27 2 24 -10 -83 -37 -51 18 -7 0 40 22 45 25 54 5 47 58 56 -13
2731 -13 18 -4 -26 23 22 13 4 -33 -26 3 -19 -5 41 50 73 30 42 19 5 81 46 9 4 23 -16 2 -20 49 5 15 5 -21 -1
2764 -1 23 -17 30 67 61 -1 6 12 14 1 -3 -2 31 -5 -7 7 5 -20 44 30 59 -29 -15 19 -28 -52 20 67 -1 71 59 -1 34 27 38
2799C8Onn9M5l0l1K8P4k9j6M4Jj00k1mP9M4k8k3QRk5QJ0k3L2m3POk6l2Q4k1pP
2834Go7J54p4oJ1O8Jm3j0jo7M4j5j2L0m9LJ6k7j5QJ7M0j2lM5k6pjj0l6N3j4n4
2868e2M7l8J1KJ4P1n6m2M3K0l8N1K9k8%O4j01j2K4k1k5J12q5L6m0k1J7L8j3o9
2898f2R0k7l7PK7k2L1L9k5Rm8J9k5QR2o2Mn6J2J5j5M0l3N1j7K3jJo5J7J3Ok1M6
2932C4l6k0j9o4N2L2M2r9N7m2M1K9m2R1n3L6q9J08j14L7L0l0K0L0k6q3P6OJ4r
2962Ij7l6j3M6PK8k3L6j05O3Nl4K2k1N0K9r5ON0mqj5MqN0k3j1l8L8j1N0k9J0l1
2996a9K9n7P1n6oK5Lj5J0J6Jp%oK1n0J3J9k1L0LK6p0J3K2K1%m2PK9k4k4M8j9J2
3031Cn0LNK7L4M9j6o1L7q1J3Rk4M2K4L5n3j6M2Mm6l4N7kl7L8k0L6p1N6K3m7j6
$$ plain form
2799 38 44 39 -20 25 -5 -36 -8 66 37 21 65 66 -34 -55 -59 20 64 36 13 21 30 5 13 23 0 32 -11 -4 2 -24 -56 28 7 0 7
2834 7 -60 94 20 14 25 93 94 51 41 40 -27 17 2 -10 20 -29 -26 -10 -37 -52 -44 -27 13 1 -2 43 17 10 9 -1 -37 16 2 -52
2868 -52 -5 -43 -32 -30 -16 55 -1 -43 0 20 -18 33 62 34 34 98 -3 -15 9 -12 -37 75 -10 26 -14 -35 -18 20 7 -62
2898 -62 28 1 -36 -29 -2 -24 7 46 21 30 -18 1 -24 -16 76 14 18 -38 -26 -11 -26 14 -19 32 15 38 37 38 -27 -10 3 9 -12 34
2932 34 -2 -22 -41 -105 -53 -21 21 -78 -21 -63 -22 7 -35 56 3 39 -50 58 -56 -19 11 -19 1 31 5 -78 -2 4 18 9
2962 9 -8 -44 -57 -11 -4 24 1 37 -68 -5 0 -34 -12 -33 17 46 -49 -43 7 3 -5 -20 -16 -24 26 3 -8 -46 -8 -19 31 2 12 -19
2996 -19 10 -47 24 -32 -38 -13 -10 -25 -15 1 2 -5 -5 -11 10 -40 -27 -8 -29 1 4 30 -40 -27 -5 16 16 -26 -19 10 -14 -38 10 -9 3
3031 3 -47 -44 -39 -12 22 71 55 -6 31 -50 -37 -28 -52 -10 14 49 -4 -20 22 26 -20 -54 3 1 -36 2 -18 18 -53 3 26 -21 -37
3064c7P5j5l4Kl0J05r1J7o2L7K3L7j8k2pO0k5m9M2k1j2NL6j7L1j4K0Rl3Pj09Q4
3096fM9l5k5J6K2lJj0pj8L7l0L0Ll2Nj8L7l1oO5j10O9l4k3L0oJ4P5n7k6jJ13n8
3130C0J6n0M1q8O7rj6K8j4k1q9J02Nn2K5mO9m1%N0l0L2q0M5J3o2l5Q8l8NO2J8
3162F7j7j49Q3J9L0j9N3p4J3L0lp6N4%L8qm1J0L6m0N0j20K5K6ML2j7k6j5kkP9
3194D0q5K0R4k8j8Pj2oo8N3O4m8n7M2l0QL9j11P7J2M0o7J5Q5l7J0l0kk0j0L6O1
3226G4m2m2M4mn7KM6n0P2o2KM8o3K7j4N6J3J8j5p7P0r5KQ4Pm4k1j6k6M0K3L0k0
3259A0n0M0M1m1n0Q1M4o7K3j5n0M9pk5L1l6L0K1j5j2J4o3K0K0L5J1m4NJ5n1oJ5
3291b7N0n3N7jm3m2M0J0N1q4P4m1K7nL5n2%j3O5Jl7j0n1O1m3J9N2rp1K9k5OO8
$$ plain form
3064 -37 38 23 -11 -9 -39 66 -25 -8 -70 -33 -10 27 9 -13 -20 40 15 -34 8 -13 -25 -20 16 -1 30 16 36 45 12 19 -90 -6
3096 -6 43 8 -17 -1 21 18 19 9 2 -16 21 -9 21 24 -8 -3 -21 16 -15 -21 44 -66 3 -31 -54 -24 -30 -16 59 2 -24 -25 88 30
3130 30 46 -4 37 -51 16 7 -9 19 5 -16 -105 -3 2 -50 -25 -29 40 -1 -1 49 19 51 -29 16 29 -33 -68 20 -18 -13 49 67
3162 67 50 -99 -16 3 33 14 67 -7 6 36 33 -43 11 11 49 41 0 10 46 6 56 -64 -39 -13 -9 23 6 -20 -35 -37 -39 40
3194 40 -45 -25 69 41 23 30 18 12 -56 -3 61 13 -44 -2 -32 -24 15 -96 -19 -7 33 -34 -19 66 29 39 9 7 -13 -23 13 74
3226 74 32 -10 34 30 -27 -25 21 -29 43 -19 -17 31 -32 -5 -19 37 50 68 53 -24 46 -49 -47 37 44 0 -21 -37 -63 -23 0 30 10
3259 10 -40 0 41 0 -50 31 75 8 31 16 -34 15 8 -17 14 -22 8 29 14 2 16 -47 -27 -7 28 39 -5 0 15 -36 -42 -27
3291 -27 23 -30 27 26 -17 -59 -19 -9 42 -42 32 -9 18 13 48 -4 -4 -17 48 49 12 2 -49 12 -31 -12 40 31 -40 -11 -36 -30 38
3324C8J6l9j5k7M6J4k6j7RM5q6N8k6l2L7J3j7j5L0o2J01l5K1l6n3K0K2L7o5P8
3354C4Mj6n0N9m9j2m8N4J0lJ2j0nm3k0R1j8M4l1l9J4Q0n8J5N4n9k9J8j1l7O6j7
3386@kJ7Jk5M5k1m8nP8m7n2O5%l0j3O0RJ3o2Lml7kM9j9j8N2j3K5m3M0M5pn1K0
3421B3k0mOm4J00q2Mqk9L7l5M0POLj2QL0o8kJ8J4O7o1k7N8o0m0O7k4N1J0q9R6
3455D0m2K3j0J2k6M5j3m3Lk2L8K7m6%oJ1L3l4N3n5N6j9k2K5l5j6K3%NMJ1K1l9
3488Bl7J8mL5k8Qj0K0On1K6JK8l5j5O4j2l8P2q0L1j7k8M4j9K6%n0J14r2M7n7R
3521b2j2L5j2J0J8l8O4o5K6J1LRn7N0Kk9J1m9O6m2L3n7L0L3N3j20K1Jj3J5jJ4
3553a2Pk3P1k2m1M6K6k0j9l4k8N1k1K0L1l7j1K9l3j1O9K5m3l0L5m6M5j3k6k5L7
$$ plain form
3324 38 54 15 0 -27 19 33 7 -10 -1 44 -42 16 -10 -42 -5 8 -9 -24 6 -56 45 10 31 -5 -58 -38 -16 21 -44 34
3354 34 38 22 -28 31 -18 -30 -78 -24 -14 -17 -5 -15 -20 -63 -83 8 -10 34 3 -36 -22 58 0 15 69 10 -19 -1 -12 -49 17 0
3386 0 -2 15 16 -9 36 15 -33 -38 40 -7 -59 6 6 -24 -37 23 32 45 -17 -14 -18 -55 -57 -8 -27 -45 7 -6 19 -24 16 61 54 3 23
3421 23 3 -1 5 -39 61 -21 -17 -25 -54 -17 -52 -12 -5 1 4 -8 0 30 -38 -40 -22 -8 59 -2 -29 29 -31 -71 -4 -28 23 33 -56 40
3455 40 -2 21 11 23 -3 42 29 -14 -11 -33 5 32 -14 -14 -20 -9 24 -10 43 -12 44 25 3 28 -7 -23 0 0 5 9 20 41 2
3488 2 -35 -17 -21 14 -14 -6 -16 4 10 -41 -15 -14 14 -21 -36 28 16 -22 50 -30 1 -16 -44 0 -19 7 7 -43 71 -21 26 -31 -22
3521 -22 -34 1 -11 -1 17 -21 43 -22 4 15 18 27 -30 20 22 -7 4 -45 21 -21 12 -45 -15 18 71 -49 -28 -27 -40 -25 -26 -12
3553 -12 -5 -28 43 21 -20 26 52 32 13 -21 -49 2 -19 1 32 -5 -16 13 -20 -31 38 63 20 -10 25 -21 24 11 -15 -40 -3
3584cm4%N4j9M4n3M9mj2m3O6j1l3O0l8J8oO4r4M8o7Kl1M9o9J48l9Rn8j1L3k8M6
3617B7o3N8m3N6o1J9j6k0K1P3o6M1j4l6N0k8o3P9J0n8M1l1K0l5K0M1k0Q7p6Nj0
3648Hj4No4O6j7K1l0Q5j17M7k2k3M0j2m6Q6KnJ0%L1k8plJ3pJ2k9Kj5Ro6M7rpJ5
3684b2lJ9N8k7M1o0J3J0j8l4m5Q7m0K6L8j22M3L9Njo1K8m2M9nK2L0j6Lj6oL0k6
3717cm7P0k2j0l1R7q0K2J5n2LN0O9q0PJ2n5Q7l3o1L4koO5m1k7kl6L7o1O6L1k2
3750fM6o1J5lL1j0qpk7JN5j0p7L1qL1k7K0M8L6n4K3l1rM6k4M2r2j3ok2R1J5J0
3784D6q7R9p1k8k1J3P2mk6mL4k5KK0Nk8N3Lk5l5l0L5nJ2O%%k1n7N8JK7J8q4N8
3819A1M9n9n2J25j03J3J3K1L1o5J0oLL8j4Ml4K9Po4kO1j00N2L1p7J07m4M4o9M8
$$ plain form
3584 -3 -47 -47 7 -12 32 -21 28 24 12 -31 35 24 -9 51 13 31 25 89 -5 43 -24 -22 -53 -4 -73 75 36 45 -13 -24 9 -19 27
3617 27 -36 22 -21 35 -26 -7 -23 -43 -22 51 -15 26 12 -24 26 -2 -65 14 24 -34 7 -24 -4 -39 -19 22 2 89 13 18 8
3648 8 -6 -1 -65 1 -16 5 -25 60 -57 -10 -32 -55 -15 -27 -73 13 15 10 20 20 51 23 16 13 26 19 31 2 4 -11 -2 -68 -21 -30 -37 -22
3684 -22 -25 -6 52 25 66 6 19 29 11 -23 -68 19 -21 5 43 -79 -36 3 8 7 -54 -26 -68 -19 -24 -2 28 12 15 -1 -7 23 -3
3717 -3 -50 20 -2 -12 -43 54 -26 -4 11 -41 -38 12 81 1 8 20 -35 52 19 -42 -8 -10 -16 49 8 -19 -21 -57 -20 -81 -15 16 -6
3750 -6 40 -21 -6 -9 22 12 4 -3 -30 -29 26 16 -61 -30 -38 -7 -34 -14 34 70 16 39 8 -1 45 21 63 -29 -42 -48 -70 21 36 46
3784 46 -41 58 -13 -41 -62 -49 23 19 -7 -11 23 -2 0 20 25 -3 50 53 28 -7 -37 -2 -7 5 11 11 11 -10 -67 -9 -8 19 37 -47 11
3819 11 60 1 -51 74 -29 -16 -3 18 49 -16 -6 -12 -9 29 15 19 -15 14 21 -43 -45 16 -84 -32 -1 -78 29 -15 29 -40 8
3850Ho3N6mJ2J4k2jK7o9L2j3qL3J4O1p1NPr0O5l5N8J2j8l0K6l8J5kJ2M8j16N9
3883a6jJNn2O9Pn8j7P0%Oo5M8O1m9l7kL6R4j08L2j4nj4j3L6j1M7l7J9ql7N2m6
3917g%J0J7K4m4j0j4K3k7K1jL6q%nl3N6l2mJ7n1P7p4Oj0R6q7O2j9j0Pm1M4n9K7
3952a3lM1j1l2N5j3l5M1m3jpKL2k3J4m1L2m3MP6m8M5l2M8K4n0k4j3j4J6j0N3k9
3985bK7k6N0j24Q4Kl2j0N4K5k2p9P6MJj3K5k9k9LK1M1o8l1L0Rk3K3j7K4j4M8m5
4018a7K0K3rJ5k7m6N5n6J8K9n3J25p0K2K3k9l6JN4k9J1q4K3N8QJ7l1J9k3j1J4
4049A4m4M2l8M4pn3J4JK3J1k0N5l3p7O1K8l4mK0K1k5L2pn6J2K3j7l3LP9o7J3R
4082a0j9N7l2l1M3l6mL3JO5j4q6M6k1%N2k5j7m0K3nJ6J7l6J9KM1k0o1OM6M8qp5
$$ plain form
3850 8 -55 1 -3 9 23 1 0 27 -42 -10 -23 -31 2 16 77 6 11 18 -72 -7 -42 16 28 10 -20 6 -32 -17 -19 -7 41 -75 -16
3883 -16 -17 -16 -11 -63 6 13 -45 -62 8 8 14 -51 -3 58 9 -28 -30 6 100 -8 24 10 5 -9 -22 14 3 50 13 32 24 -13 39 -7
3917 -7 -7 3 20 44 0 -10 -24 -1 -28 -7 -8 28 20 20 15 -18 38 6 2 19 -32 45 -29 -23 -33 63 -24 38 19 9 16 -25 19 -40 -13
3952 -13 -16 25 14 -18 37 24 -11 30 -13 -14 -21 -19 13 -10 4 -37 -5 -48 -44 32 -16 29 -3 45 69 19 -5 -18 -32 -16 -26 27 -2
3985 -2 25 -1 49 -75 9 11 -21 -31 23 48 26 -53 23 27 28 15 40 11 -18 -15 6 47 -21 -52 -22 -13 -36 -13 -30 -6 -20 28 -17
4018 -17 3 26 17 32 5 -41 14 -42 -24 5 -48 77 7 29 52 23 -13 -12 42 13 24 -60 -37 21 29 46 15 34 11 0 14
4049 14 -30 12 -26 18 11 -42 -28 -27 -4 7 -13 42 9 -68 -7 21 -13 -17 3 24 -1 31 24 -32 -20 3 -14 -47 -44 35 -32 -19 -10
4082 -10 -29 28 -4 -35 8 -28 -32 1 2 67 53 -33 13 -8 -8 44 19 2 -38 -15 -20 -4 13 -23 -4 -2 39 19 -42 -36 10 58 50 -25
4116b5L8j3O0p1JnJ4m4rQ4l1K2o9J3L5L7l2Nl0L8J5k2j0L3p7K3J2Pk9N2j0l4K4
4149Bj4M2q6M5Ml1L8K2NrJ%lj1l6j4MR6j01M8J8l0Q5n3K9m5j5M9k7K4l4k6M1J2
4183C0m7k6N1J8p4M3J2l0K1k6l6N4kN6ql1k4J4J2m0K2l1Q2m4K3k0l4jK5M1j8R
4215B1j0l3O1n1NQ2m7m2j0K3J8K0n4l8qO9k2J2k0j0M0k7k1L7J2k0NNn4P7m6N3
4247B7j2J5L7o5L9k5l2M9L2o6pm6M4k8M8o2L4N0m5J0L9ln6J3K2k5K6o6L3J6m1
4278d5O3Mk8n6J20lm4L2o5L2l3O4jn6J2J0K1m8L2m5K5J4l3K0m9L1K8k8O4j7n4
4309c3N7o2L3K6K8l7L2k1J0qJ8n2O4j1l0Jl5j5J40p4pl0K4K2o4R4q5K7M1o1L1
4340B3No6O1k7K6J9j2k9K9k6K4j6j8LJ7k7P3n5K4j4pN0m6j0QJ7o4J3O6m6J9m3
$$ plain form
4116 -25 13 0 60 -11 -10 -15 -1 -45 -54 30 -1 21 -48 -35 0 37 5 10 -20 18 33 11 1 34 -43 -20 -8 -1 -30 22 12 -22 2
4149 2 -12 30 -56 -11 -7 -38 0 22 27 18 19 19 16 5 -31 -45 -41 55 -46 2 20 -10 75 22 51 6 -9 40 13 37 3 -23 18 30
4183 30 -17 -43 8 26 -48 -5 7 -23 -2 -28 -64 -10 -12 44 36 5 -19 -5 7 -33 -11 -42 40 -4 19 -1 -35 -36 -11 30 12 21
4215 21 11 -22 39 -12 -7 75 28 -14 -24 -1 17 37 -17 -55 -63 6 -16 -4 -24 -34 6 -21 -42 -5 7 -13 -8 -3 -57 20 -26 27
4247 27 15 30 67 2 41 16 -16 33 65 -1 -8 -54 -10 -38 10 -52 -18 32 -13 -3 36 33 -23 -10 12 -13 13 -53 -20 -4 -45
4278 -45 18 22 -6 -62 58 55 11 43 -22 10 -23 41 40 -16 -4 6 27 -21 11 -34 -9 5 -28 -8 -57 -26 2 -26 38 21 -33
4309 -33 24 -38 -5 21 49 12 44 23 33 25 43 -9 55 44 14 15 -20 -35 105 31 24 -6 18 40 -24 70 -15 12 53 -8 23
4340 23 28 -38 23 -4 22 41 29 0 29 3 27 11 -7 -4 13 -14 59 4 28 14 7 57 11 1 9 26 -38 -25 41 -5 14 -29
4372b9L9K1m0O0o7M3j8j6m4P5K3k4L4j4l3Qn9j5K5l3L3O3o6L3j2J2jp9Q8LNL1
4404D6m5L1jk7Nm6LK8k1nK4l0K8lL0j6J8j2pQk2j7M4j3k2N5l4K4m4k7OPO2m0L4
4439B1m0MJ1K6j0kj6M1k8K2o1pM9L6qj2pJ5o3KK8kj6mM2p9R3Lk5kL4m5nm%M5k2
4476A4m6K9p1Q0j6j1KK5k0J4k7MrO0nm0J5LL7m5m3M4K7m7K3L3j0NJ8pm0L4j5l0
4510a5LM6j09R5L2n4Pj7k4j4L7kM6p3Qlj5O4o4L2j0K1mK7l5N0q0N8k9j3N0m3N2
4543B4RK1j2o3P3r4K0M7o3R7o3M1k4M2o1LJ4K8m7L8JJ5m7oJ2J9m9Q1m2n3M1m0
4575c8K9m2LrN0pM5n4J2J2l5K5j0Pj8L4ll2rP4J4o9m%M4m1j7M6j4J9n3L2j4k7
4609e0J5L0jL2j14P8l7O2o1P2j7j6QOJ1oK9m9K2L0l3k6P2q1j0JL1Mk2K0l8NP0
$$ plain form
4372 -29 10 31 -9 51 -16 27 9 -7 -51 24 47 23 57 43 10 18 -41 -56 -31 -64 -31 32 -34 -1 -13 -1 -2 -81 7 10 15 46
4404 46 1 32 31 4 9 -37 -34 -6 -27 -32 -8 -38 -10 -13 17 1 19 7 0 8 -14 -31 13 0 -22 33 -1 23 -21 -48 -42 -35 27 -13 21
4439 21 -19 -15 -4 22 12 10 -6 35 7 29 -32 -39 10 46 38 26 19 34 -29 -27 1 -1 -17 -21 21 -58 35 38 13 11 45 0 -5 -9 -9 36 14
4476 14 -32 -3 -74 6 -10 -21 -19 6 -14 0 -27 -23 -32 28 23 -17 -2 1 38 -7 -50 -6 21 -26 -3 30 20 25 43 36 -4 30 15 -15
4510 -15 -12 34 -75 20 52 -2 5 -12 -36 -50 -13 -15 31 -42 -34 -37 -52 12 -52 -20 -30 -9 -13 14 -21 29 -51 7 -22 -35 15 -28 24
4543 24 33 54 42 -21 52 -42 -22 25 -38 59 -4 37 13 55 -6 -3 11 39 -8 30 31 46 -1 -7 5 24 -25 56 14 -39 2 -38
4575 -38 -9 -51 -48 -57 -7 -14 31 -23 -11 1 -34 -9 -19 -12 -30 4 1 -31 -40 34 48 -21 -25 -25 19 -22 -39 7 -7 12 -41 -9 -23 -50
4609 -50 -35 -5 -6 26 -88 -10 -47 15 -46 26 9 -7 1 7 18 12 41 -8 14 44 11 -15 57 -24 -34 -33 -2 2 -20 0 -38 -33 37
4642C7k9k3LL5k6K2oj2j5J5k9LL0M4m9N1p3L7j0K5p3K9pO8l4r2J16rJ4o6K1j2
4674a5%J8J7j3rl0P%pK3N3o1L3j5k4k0j1L8K3J2j7lJ0L1n2jJ6mj0J0Oj3O8p0m8
4709e8J02o5N3%p3POM1J8KK1l9J3k6K9n7J5K6Mk9oK4l9K8KJ5m8RL3J6mLn6J0M6
4744B3k4J4j8K5j5K2K1n0%J0l2N9%l3k8J0M2J9J9q5J2J9m1N7o0K2k0L7l6J5K4
4775Hm9O3j1n9J5J5K3KJ7m8L3RJ8k5l9J6L6ll6Q8J5j10M2J3n5M8m2k4P5J9l4J6
4807C6o4K5j9m3J27Ol6q4lO4L9J4p6k0L1J2ml7M7Om8oN3j0J7j3k2l0M3m0L7l1
4839b9nJ6k1N6rL0o8P1m5J3J9l8j0KM7q9O4j4J4j8K4m7J01j01M1n9N6l4J8k3J5
4870b3k2K8J1m3N3j7O5m2k5j0P9n1n0NM3%KL8n7RLj7N1l5j3qMN0n0%O4o1k8PK1
$$ plain form
4642 37 8 -15 -12 23 -3 19 13 1 -14 1 -28 -25 5 49 0 51 -22 15 5 30 -43 -14 -21 47 13 -79 37 28 42 -24 -3 -15
4674 -15 -15 3 20 7 -2 -32 -25 -25 -32 -9 44 -17 16 1 -23 -43 -54 -16 7 19 2 -1 9 40 -12 -13 3 -1 -11 -1 5 -8 60 -10 -58
4709 -58 44 -21 32 32 -41 -34 -28 13 31 33 54 15 28 2 31 -26 -11 15 19 -10 -16 8 -31 -3 -1 14 -34 -25 8 24 20 23 -33 -23 23
4744 23 -1 13 -5 20 5 27 48 -2 -2 8 -24 35 35 2 -26 -16 26 45 64 -21 -9 10 -31 26 -34 -12 -32 5 -31 -16 8
4775 8 -41 22 11 -48 -33 -18 5 7 24 -24 9 18 36 11 -28 -12 24 21 -15 73 88 -22 20 33 -22 26 -16 -40 35 54 20 36
4807 36 -28 -3 -22 -65 62 68 32 -52 -55 9 48 62 -14 -34 -3 9 5 -32 15 21 -27 -33 20 10 27 14 -8 -38 5 -35 2 -29
4839 -29 -34 -18 -39 17 8 38 -30 41 -4 9 28 -10 -20 -18 29 -60 4 -10 4 -14 10 -37 64 -37 4 -55 1 -33 -15 -38 -23
4870 -23 -45 -17 -6 -49 4 -13 52 10 -15 -25 54 3 -47 -42 1 1 3 41 -16 -7 -4 -21 30 -5 -18 -26 -22 28 -22 -22 42 -19 -47 -40 -19
4905a9M5l0l2j1QM8rjk0N3m7M6l2l1R2j05L8pk0O3m4n6KJ06o6L5N3m2Ro7N3rk5
4938b2j8M5J1Ql9M9m9K8o5K5N8k8K9n1J1J5n2kP3o1M8J4m8O9o5MN0m3N4l3K3q6
4970d8J2R3r1L0J6l4K1K1J5o4P9q2O2m0%PL3qo8N3j4QM1m5M3o8l0K5O4o1k5N2
5002cK7k2n2Q4m4N3o4J1K6k8j8N5K5p5j2M1j0N8n9Nj4M5Qm1K5l2N3r9M2Ll5L1
5034a6j0N9j4k5k3L2NmJl7L1K0qj9qlL2N1k7k5M3q0JP1M6q0j1J1k9L1l2Kk6P4
5068C3k9k6M6k7j5P0j1m1m7L1P2n3m6N0J1m6L3j2M4k7j5Kl0N5j7o2Q6QRn9LK9
5100A9o1Q4n8m3Q3ok5m5O4km2J4k8J2M0Rl2J8j6J6j1LJ7Nmm3K9m0J8J9l3M8J5
5133B4J2m5k8N7l5K6j7M7n1J0j5M4r7J10o5K9o4P7l7NN7p7K6q0N3N2n0K9j0k0
$$ plain form
4905 -19 26 -4 -36 -47 -39 9 0 -1 -21 32 -15 31 -1 -32 60 -45 -7 -14 -34 29 -15 -71 -69 37 -29 6 59 17 26 -41 12 3 -22
4938 -22 -40 5 16 24 -15 34 -15 13 -52 -27 31 3 32 -19 -8 7 -45 -47 26 -35 13 27 -21 48 -17 -13 37 -6 48 15 38 -48
4970 -48 -36 57 -34 -4 12 -22 -1 20 35 -29 50 -32 30 -10 -10 -3 30 22 -46 7 -7 1 42 -3 40 -28 -58 -33 31 -30 -55 -3
5002 -3 24 2 -50 34 -10 43 -21 -10 16 -12 -30 25 50 -25 -37 4 -6 52 -7 -2 -16 29 37 -4 21 -11 42 -57 -15 -12 -47 -16
5034 -16 -26 33 19 -6 -29 3 8 4 5 -32 -1 19 11 -8 -16 -19 13 64 37 12 55 -25 -24 47 93 13 2 13 -16 15 -17 -15 -41 33
5068 33 4 -22 24 -3 -18 52 41 0 -47 -16 56 3 -43 7 18 -28 5 -7 37 10 -5 -3 -33 22 5 -57 29 37 46 -13 -10 19
5100 19 -42 42 -16 -59 24 18 -7 -52 12 10 -32 -18 -46 -34 6 15 -17 1 -15 1 -10 -7 10 15 11 -32 -3 -43 -25 -6 -39 9 24
5133 24 36 -9 -37 20 -15 11 -6 41 -10 0 -15 29 -68 42 -23 6 -58 19 -18 -13 44 -33 -7 -87 -34 18 -32 -3 -13 -33
5163c3Q9l4j4n0N0Jj8oJJ3l5l2J7J5P8m1K2j8lpK9kl0J4K6n0k4j0K3K6J6n7N1
5196Gm2JN6m3J1L4j3km1M7p4M6NN6o7R0m6k6k9M6J0m0J3k7K9M6j10O2PpM0r5J8
5229c8K6M3l8RJq2J12o8R2j34O2j7k7P2k4j5j0K4j9J4N6l8L2k8k1L3J4j7o7M0
5259a3j7K1l8P3M1m5p1L0L6Kn7%k0N4j4l2N3K0j0n9OM0K4n0J7KM1m2n4nP8k0K0
5292A1n1k2P7QMp7O8l4L8plk3k8M6K6m6m7L2qM9Mk7J2l7PP1o7M2J8ok6jqN4q1
5327c2O8l0j1j0Q1q8j4R1o2LOj5L2m0j7J8L9l3J5J9m8K2j4J2JK5k0J0rl8M4k5
5359b0OK8j3j2j3M9n5rn7O6jN1j1Qn0K1J2J8K2n8J9k3K4mM0j6K6l4l1K8Rk0kK7
5393B5j6n5K0j3OrJ1O1k5K4p3QO1p5R5l0N4p7l2M8n8Q2o1J9m2P4j2j1K1l5j8K2
$$ plain form
5163 -33 56 22 8 -42 8 9 -9 -15 -14 -1 -36 -68 -51 -36 42 1 23 5 2 -5 24 22 -8 6 32 -18 -42 -52 -29 -3 13 -44 7
5196 7 -35 -34 22 -21 -10 24 11 9 -32 15 -59 -13 -8 48 -19 71 25 -1 -30 16 26 -14 -1 -28 1 47 -63 -1 6 -1 39 -56 -38
5229 -38 -12 31 -7 2 3 -79 33 -35 57 -77 -15 -32 -59 13 -11 -26 -36 -12 -31 -17 39 1 33 5 -16 17 31 14 -53 -13
5259 -13 -30 -9 -47 26 67 22 -49 -19 17 19 -38 -38 -58 -4 -18 -50 3 23 13 -46 -40 0 24 -26 -9 -7 34 -8 -62 -67 11 -9 11
5292 11 -40 -62 15 23 27 -50 18 -16 22 15 12 -11 -39 7 33 -13 -60 -28 -36 13 17 -10 2 -35 -28 43 -24 18 36 30 4 3 -5 49 -32
5327 -32 36 6 -5 -15 66 -22 -36 55 -7 -4 2 -13 19 -21 -38 -20 19 -14 1 20 -28 -6 -20 -8 -7 18 -2 8 -1 -39 5 -20
5359 -20 -14 14 1 -11 -24 25 -30 -39 -96 -30 -31 20 9 17 -33 -12 0 18 40 -18 1 -22 2 -2 38 22 48 14 -17 11 20 0 -2 25
5393 25 9 -46 -26 -39 -33 -42 -31 30 5 29 -44 -36 25 -50 45 15 69 -8 -40 8 -50 32 -29 -10 -52 22 10 -1 20 -15 -33 -11
5425a1J3ok9J8j3L4Mj1Rk8L5j00Q5l4L7k1K2m1K6K3J9j30Q9O9l0l8K5%LOpJ6j1
5458B3k6m5mK6Rl1J3M4oj4M8j7%j6l6M4jL9n1K3kj6kRn3O9ol9rJ8j5%L8jm2J06
5494G7r6k8N5k6mQ5q4LJJ0M8m5n3O7k6kR9o3k8l%L2K0n3QJ8l0M9l7j4P2l7Jm5
5528b9L3J1Kl5O3r2Q8q2N1n9P8k1p8R1Rj0J5l7qmK3j0Nl1J5M5k5J0N4j04mN6N
5561B5r1J13m9k8%l2O1Mj6l5QJ7L1l4L5m2l3N9N9o3pK8J0Mqq9N9n2O2qj3j0l8
5594g3M1M6m9O4Kp0M8Lm6MlN1l4N7J3K9n6l0o8K9J5J0jL5L0l8J1j2jm7M7l1J7
5627gLM1ml4M5o9j7N1k1j8L8l7P4p5pL7lL0rp3O7l1P9o1m9M0Kj2k5K9O8r6j6Q2
5661B2L4j3l9k2Lk3nP5o9M4l6M6l6m1O7l4M3k5k6pN8j1OlJL8n4lk0N6K2q3K9L1
$$ plain form
5425 -11 2 -4 -33 -15 -28 6 10 -1 8 -20 15 -85 0 -34 3 -18 4 -37 -11 12 31 -99 -10 59 29 -9 16 16 19 25 18 34 23
5458 23 -3 -48 -52 -26 -17 -48 -35 9 3 -11 37 20 20 4 -32 12 11 50 -1 22 20 4 2 11 -42 27 21 -18 -27 -9 -24 -24 14 13 -29 77
5494 77 -19 -47 8 -18 -22 63 -21 -18 -17 -7 41 -4 -57 10 -16 -18 81 18 -10 -13 -13 19 39 -14 -6 12 -18 31 -6 -20 52 15 16 -29
5528 -29 4 15 17 -18 45 -47 41 -41 10 -49 29 8 -70 21 30 20 35 -2 -10 -14 9 -1 4 -27 -12 33 8 18 72 -32 -36 20 25
5561 25 -66 47 -2 -30 -30 -62 -1 3 -13 -48 -40 -23 8 -26 9 -33 -66 -7 52 -11 -18 10 20 24 16 -73 -14 -66 -4 -12 -25 -35 -73
5594 -73 -32 14 -35 29 31 -39 9 12 -34 -30 -33 18 -16 41 54 83 27 -3 -71 -42 -27 -17 -18 17 47 9 20 8 7 -40 7 -24 -7
5627 -7 -4 37 33 -1 44 -25 -42 9 -12 -30 8 -29 45 -30 -37 0 -3 27 18 -55 12 -19 60 -1 -50 -10 -8 -20 -45 -16 52 -44 -60 22
5661 22 56 43 4 -18 -15 -38 -43 32 -37 7 -29 17 -19 -60 7 -27 16 -9 -35 -42 16 5 11 8 9 47 -7 -10 -30 26 48 -35 -6 25
5695B5mK0n4K1m3K8K8k3J7%k2kn0M9Rk2m4L8J0K0L7m7K1o4M0J4OM2o2K1k4K1j8
5728a2j8j4L1m0N6K0m5%l4K5K7lK4k2mm6R7p0J8K8Qp2oM7l2O6mo6O0k2m0L7n0
5761e6M9m3O3n1R8j0m4JM4r2K5L8k2L0m2lkl3J2M8k4j9k0J06j30N6K6jJ4jn9R8
5793E6mo7M7n8J0Rj1P8n3k6K9k0l6L6J4l4O1k0j7Qj4m0N5L6p4jP1q7P7o8M6n9
5825e6O9m9J3L0k1Pj7k7M9k2K8k0M7J9l2m6K2Rjj0L4l1K4L1p6j7J7M8jK6j9jm9
5858b2N5l9kJ7n8P2mJ5r2L1%J1KjN8m9j6K9M0l6%m6MM0j5Qk4N5n4M8p2k8P9p0
5892f4R0om5k7P1j4j0J4J3K4k8k6K1MlJ5l9Pk5N4K5k4q7PR1l7L0l5mk8M5n0P2
5925C1n1l2P5k2Lnj1lk1M8Lk2J2Nl7L6n7M0L0k9J02l5q9J4k0J4N4j4K0m7m8L0
$$ plain form
5695 25 21 41 -13 8 -35 -7 21 -2 15 15 -7 -9 -59 -10 -1 -23 -67 -29 -19 1 38 -9 12 -52 -12 2 8 50 -12 9 -15 6 -12
5728 -12 -30 -44 -13 -53 3 23 -22 -22 -56 -31 -4 -7 17 -5 -9 -55 42 -28 -10 18 26 -46 -52 -5 -37 29 25 -41 19 -3 -43 -6 -56
5761 -56 -7 -50 13 -38 60 50 6 7 51 -41 -16 22 0 30 -12 -15 -17 -50 -38 10 -14 -33 -53 53 -77 -21 5 4 18 17 -42 56
5793 56 52 -15 32 -26 -16 -7 -18 60 7 -19 10 -10 -46 -10 4 -30 31 11 -6 2 -12 -52 3 39 -35 -36 35 -52 25 -43 3 -56
5825 -56 13 -36 -23 7 -14 -7 -24 -51 -2 -24 4 -16 31 50 18 -28 -6 3 2 -8 26 -5 19 50 -26 -43 -26 22 21 47 28 27 -22
5858 -22 33 -6 -8 9 -49 23 19 34 -58 -27 -27 -16 -14 -15 43 -6 -22 7 47 11 11 -35 -31 9 -6 2 -22 33 -21 27 -45 -73 6 -64
5892 -64 26 20 -25 -52 19 5 -5 9 22 46 18 -8 13 17 14 29 -10 -3 -28 26 51 27 -60 -53 38 1 31 -4 -8 -36 9 -41 31
5925 31 -20 -52 23 1 4 -1 -12 -15 -36 12 15 -7 5 10 -27 9 -48 -8 22 -7 95 60 -29 -15 -35 -21 33 19 39 -8 -56 -26
5957b6J5k9M6m1N4m5L3m5O3p1P9q8N9N1q4O9o7JJ0P6n8J9m9J0LN3o0L5K0K3j9
5988C7l3NRL3o2O4k8j5k7k1K1LK3K4n0L1K6n4P3q7MK0L1m4J2nK1j3rJ2Nk8N8j4
6022B2l7j0M4r9N3l3K6M8%m0O1k5oJ4q0R6m7mJ8o3M0jQj0K2m8O1k8j8K4L9n2M3
6055A8n2N7o6P8n1M3J8m7l1M0O8n1L8o3J6L2p6N9K3o6RK3J0j6m7J4PqK3L1p0M6
6087Ik7l2L4K0J3o3O7k4M9j6k1N9l6n9O4m8L3K2o4O9o0M0n5J7mM8k5j9M3k8J4
6118B0m5L7l1M1k9L0l2K7O4o2K2j08O1k9J0j7N8k5L8mmJ6mMo2J0lJ5mL4j1k3Q
6151BO1n8p%M0m2N2J0p4l3J8N5m2j9RrQ5n4K6qK9p4K5J6K6o2K3N9k1k3M0q5L0
6184ej2j5M8j8j3j9M5K5M9n7p2Q4l4m0N2Lk2J3k3k2K2K4pm8N8j0J1k9rl2M1K3
$$ plain form
5957 -26 -11 -40 6 -35 19 -26 7 -38 25 -46 33 -55 4 55 -29 40 -27 -26 -16 60 2 21 -28 -18 -15 38 -22 13 33 56 37
5988 37 4 9 18 51 -11 53 25 10 -17 -38 -17 -14 9 33 -17 14 40 -14 59 -28 -24 -4 27 -17 -5 -10 11 -2 -11 1 6 -22 36 22
6022 22 -15 -25 19 -80 -27 -60 -34 14 14 -26 35 10 4 18 -62 34 -13 -17 1 -62 -22 -23 -15 -25 -3 -51 10 -18 -36 -12 27 -25 18
6055 18 -34 23 -43 35 -16 27 45 -2 -33 7 75 24 62 -1 15 47 -29 30 53 -13 -4 19 29 13 -34 -20 -13 -21 2 33 -37 9
6087 9 -18 -50 -16 4 17 -46 21 -3 46 30 9 68 32 -27 37 -11 22 44 -20 49 -11 29 -26 -9 -13 35 10 -9 34 6 20
6118 20 -25 12 -19 22 -7 23 -9 18 82 20 42 -66 -5 -34 -24 -41 17 -8 30 26 22 38 34 38 -24 -14 -17 -2 -6 28 17 -6 2
6151 2 63 5 -2 -2 38 -4 48 58 -16 -49 -31 24 -18 -37 -28 -37 48 -6 20 12 41 -33 -8 8 34 -28 -5 54 33 10 50 -35 -5
6184 -5 -17 -32 16 -2 -15 -34 11 36 85 28 -44 40 6 -34 18 21 -1 12 -11 -33 -11 13 6 -42 16 6 17 -12 -21 -53 -12 11
6216A1J2l8j0Qo8J12o1L8J17p6n2OK9K2k7l0k7L9K2n2OL9l6P5p8j3N0j8kKP1n
6248F6Pn2p5L5L8n6N1l3N9l5jj1nJ3ML2k9k4M5j6nj3lj8J9k2pM8mRj2O6q0RK9
6283B9nm2J9l9M2Pj6N0j8k7J3J5j1L4q8K7J3K5jq4M1M2q2RN4k7L3o1P0m7R1m7
6315A9Jkm1k1N0Rn3L7k2O3p4N9l4J5j8o8R8lm0N2J3k9kl0Oj3m4N3l0P2l7k1N0
6348A5o0NK3j2J2K6q8P5n3O3j0%o1R1o4P7m7MJ7m0P3p4J32p9k9j7j9K7Lk2K4L8
6380C0m2J6L1k9J5n2MJ7l5J20n8q1Q4n7L3j5M4k6L3o1K9Nl5Pm3Q7K7k9k9K6k9
6411a3J9k0j5m8P8k1j0M3j0l0K5P0q0qM6%Qp4j2MK6K0K4k2k2N8n1O5p9K9k0K5
6443Ej3OJK0j8Ljk8M3qk3l2L0M4n9L5k0p0N6KJJJ2l4J05k9Rm5%K2q3M7M5pJ6k8
$$ plain form
6216 11 23 -15 -25 -17 -85 27 -34 4 121 45 -7 -1 28 50 23 -7 -34 5 27 -25 -19 20 -16 59 -19 -32 18 0 -2 0 71 66
6248 66 73 21 -54 -19 19 -37 14 -19 40 5 4 -7 -12 1 5 37 8 -16 29 13 8 -5 -8 -26 -7 -29 -36 12 8 17 5 71 -9 0 29
6283 29 24 -18 1 -38 4 11 -5 45 27 0 13 28 17 51 -37 -10 3 28 27 -57 -16 26 -56 -47 7 -20 13 -48 22 -25 66 19
6315 19 20 18 -23 -44 6 15 -38 -1 -23 40 -34 25 -9 6 -12 -80 18 15 -25 27 40 11 9 -21 -15 -28 -72 -19 -49 23 -14 -35 15
6348 15 -45 -40 -17 -29 -17 9 -79 -4 -57 6 -4 -4 -65 26 -38 39 -8 -4 13 -27 46 -28 104 25 -4 -21 -40 -13 -10 -32 -8 30
6380 30 -12 4 35 6 21 -31 -27 -10 -45 75 17 -64 20 -37 -4 -19 25 -1 32 -29 0 5 -30 -23 -66 21 48 19 -10 16 -13
6411 -13 6 -14 -29 -77 1 -20 -30 13 3 -27 -2 68 -12 -20 26 26 34 -40 -52 -48 -22 -2 22 0 -22 36 -15 50 -29 0 -20 5
6443 5 -8 -2 -1 19 1 4 3 -25 18 10 -13 -45 -15 29 -30 5 -15 -85 -29 -27 -26 -25 -13 -47 58 29 38 -7 -7 15 -68 -21 24 17 33 5
6479Ek0K2p3O7kk6K8L8k5l8J2L6m7J3J9k1J6L4k4m5M7J5m7Ojk2M6JKj7J6oQMJ2
6514C3m3M0nj5j4L3j0p8N0P3j04N6l5m9Q6oq7LQ4j2J6j2k1LL1q2Q0l7nL9l6km
6547c0M3j5Oo9M9pN2l6k5j4J08m7K2j02rM5R2j03M7moM3m5j8L0J4K5n5J5L3n4
6578a5N5l7LJ1o6K1M9nm0K5K9l8J%kL8m3L6m3l2Q2j4o5L3Q4j24O4n0K8LNj0J4
6611cL8o5K3M2m0Q6j60O5K3k0k3M6Kn1K0J2M3n3J4qK5j9rJ5K4m1jJ6n8N6j2J7
6643DJ5k1O0j09M7k4M0j3NPl4qP7l7KmK3qj7K6n2O4k7l3J5J5Km5L6o0O5npj7m
6678b2pL7j4j2O9m5K4j8o0P0l0j5k7O7j9P5o1n0O5o3mkN9j9M7n8jL1%k5RK5j9
6711GJ5q7P8J8l4NpRk6K7j2K4l6Q5o9m6L2m8L9Mo0O1K7K9ko5N0lq6J04j6p7J4
$$ plain form
6479 5 -15 7 -66 1 -1 -27 1 39 14 -24 -12 24 -23 -10 9 -12 4 38 14 -31 16 31 -16 -10 -11 -33 13 14 16 -1 15 9 17 21 33
6514 33 -10 30 25 10 -4 29 19 -59 -9 64 -40 16 -19 -68 18 12 -75 -72 12 0 16 4 -17 -14 17 -65 15 -22 -27 12 -24 -26 -30
6547 -30 13 -2 4 -65 -16 -23 29 -7 -32 -46 62 15 37 -65 -74 -29 63 -40 7 3 -3 40 -5 -23 7 21 46 -9 6 39 -15
6578 -15 40 3 6 17 -49 -28 21 16 -24 1 30 -8 -7 -7 -9 29 -14 22 -21 -53 29 15 -50 -17 67 -57 7 -43 -15 -12 -7 -17 -3
6611 -3 35 -30 -7 35 -5 81 -79 -14 9 -11 -34 12 14 -37 -17 -5 38 -15 -1 -9 16 -3 -12 3 27 -14 -15 1 -57 -1 -13 4
6643 4 19 -2 58 -51 -4 -28 12 -1 4 11 -23 -31 46 9 11 7 30 22 5 31 -21 43 16 -17 -2 13 15 -30 6 -54 11 6 -1 -18 -22
6678 -22 -29 8 -6 -18 51 6 30 12 -48 22 -8 -23 -50 17 -2 73 12 -38 27 -36 -40 -42 17 -2 45 -13 -14 17 17 -8 1 26 7
6711 7 22 -65 13 31 -3 2 -5 4 -22 5 -7 17 -19 66 -3 -49 -17 -65 -26 -22 -82 -21 6 35 33 -32 18 15 -71 33 17 -60 -46
6744d6P8m1jM4l9Rm1Q6o8pLN9qo6K0nnL0k1L4J1l7M6j8o1j1O0J7m2JM1k5J2L4
6778D3l7K9np0J2L8J4k9L7k0qJ4k3L9l1Qj9k7j2P0o7J3M7rL4o2O7m4qn8R2n7L1
6811Bl9mR1o8J1j1LL6p4K7J8qJ9nJ1j04R5K2o7K2M0m2pQJ4l3Q8k8k4j17J46n3
6843c1j8R2l4loLj6j3L0j8LLML3K1o8K4K5M5n7jj1M0p6L5j0l3M0N3qMok0j0L7
6878E3q2j8L0%K2o0K2RjR2p1j3L2j7%j9NK7J4n4N7J8j4k8k7M4K5p5M0%k4J5lN7
6912E6p1K4n0M2jj2P5p6L2J2J9n9N0l7L8k5mNLl9O0j8p0nJ2M4m4Q0q9J2N8krJ5
6946B6j7n1P3m3oR7p0j4Oj8O7o5M0k0j1ORJK8n3Lom9M1O4p4N1n4K8J7J5o8N9k7
6980a5L8l3m2Q8o9O8%p3OL9kJ3o4J2L7L2k3K9q5M4J2l9M5j4j1k6L9J9j0L1j05
$$ plain form
6744 -46 32 -9 -10 34 -5 4 -37 49 -19 -26 -23 36 28 -38 -18 -23 -28 2 -19 15 26 -11 35 17 -44 -55 5 22 -20 -19 22 -3 9 43
6778 43 6 35 30 -40 -28 10 24 -5 32 12 4 18 -5 34 3 11 -8 -35 -47 23 -44 -31 16 7 41 -21 46 2 -6 -64 28 -29 2
6811 2 -37 -41 50 -18 -7 -18 -15 21 -53 -26 -8 -16 3 -2 9 -95 0 22 -45 -23 17 -25 -32 -24 -10 -43 45 17 -7 -124 22 -31
6843 -31 -49 43 9 6 0 3 -13 -26 4 -14 -11 -8 -4 29 50 -18 6 31 76 19 18 7 47 -29 6 -4 -37 3 56 48 52 46 26 16 53
6878 53 -29 -47 -17 -17 5 -55 -33 -24 -25 67 -4 -17 15 -2 -2 -21 -16 11 25 -29 28 46 32 4 -23 21 46 -29 11 11 -13 2 -1 56
6912 56 -15 9 -41 1 0 -12 63 -13 19 31 50 -9 41 4 42 17 13 18 21 -18 42 24 -46 -51 -39 5 -39 41 -48 -36 22 20 11 26
6946 26 9 -42 31 -12 -18 79 9 -5 1 -17 50 -15 25 5 -6 0 9 10 38 -15 -12 -18 -67 -26 38 -36 15 -39 -11 6 21 -47 12 -15
6980 -15 23 -10 -52 36 -33 35 35 -38 -32 7 5 18 -46 -34 3 35 12 41 -44 0 12 -27 18 4 -7 -33 6 25 15 46 -59
7011e9P8o4M5J6m6O0m3J6o9R8j06P1K8n5NM8n8J6N7m3K8k2jJ2n2J6K5k2ML8L1
7042E2r6JK8K1j6L7KL0q6nK0j1K9L5n5K2j7J5l1l7R5j2l8OM9p1P4n3o2O7nQm2
7075d6M3m6O4l9j0K8L5j5RL2j23L1M5k9l6N4kJ8m3j0M5k8L4j0k3K1pl8P6k7K1
7106B4j0m8K8qLO5Mm9k4j7J3opL7L2k1m8M6m3K9Rk2KJ7jL7m1M9o4j1M4n8k2R1
7140C0q5J1N8K6j5o3N9l7j9L2ONj1J1l6O0%n2Q9o8N5p1M7n0n1J09m8KLLl9Q6q4
7173c7O8p0j1M4LJ9k5J2JJ0K7p4J9j3L4j2PJ6M0l8j8oL7o9L5L5Mk%n5M3M9p3K3
7207B3n1O2l3j4M3o1K2J9m3K6Qm1O4l8Rm5M2N2j25N9K5K0L2k4m1J8k1j6K5JM8
7238D5o9J1J2J5J3ok4J5j6L9l0M7o3k0J4Qp0J30jn4K6oj1m4O2l2J6mJ0l5J1Np5
$$ plain form
7011 -59 19 -45 0 16 -30 30 -13 3 -66 32 -74 -3 25 -30 -25 23 -35 -19 38 -5 23 1 0 12 -40 -24 1 -21 -17 21 52
7042 52 -44 -43 -15 6 -10 27 29 59 -27 -32 -12 -23 6 41 -14 8 -9 6 -25 -62 33 21 -17 -11 38 -33 41 -12 -74 -7 -12 -4 -46
7075 -46 -3 -49 15 -24 -34 -6 29 14 23 55 -68 -37 8 -21 -57 -3 -5 13 -30 -40 5 -23 11 1 -22 -1 -8 -46 30 3 24
7106 24 14 -34 -6 -14 -11 54 58 9 -15 -32 -19 -25 -32 5 37 16 -32 14 -29 0 9 -13 -11 6 5 42 1 50 -14 -25 19 -39 -61 30
7140 30 -55 -44 14 40 25 -38 21 -16 -35 -3 3 8 -3 8 -28 32 32 -20 69 1 56 -15 32 -18 -69 40 -8 -6 -3 0 -39 47 -37
7173 -37 31 -39 -50 -6 -3 16 -9 3 4 14 41 -33 -14 -27 7 -5 2 18 58 20 2 -4 33 -36 -1 34 38 36 36 -19 24 73 0 23
7207 23 -28 34 1 -13 30 -31 -9 10 -33 -7 1 -40 24 -14 -5 -50 -8 44 -81 -22 3 23 55 31 -10 8 -13 -29 -4 -3 45
7238 45 -24 -13 -1 14 27 21 -3 12 -4 35 5 52 -11 -31 -17 -9 -79 51 50 -4 22 16 5 -39 23 -9 7 3 13 -22 -11 -6 -81
7271h1R8o2M9j5M5l9j3M3Lnk5l0M2O4r1K3J5k0m5M8Ml9Q3l1pJ0m8L1m1N4m8K7
7303aO6k0k7k%l8M1l9%L9Qmm7j6pO7L0n0j2K4k2n3N0L4j1rJ2n2O4n4M8m4N3n2
7337b4nM1m4L8m5N5N6j22O9l7L7J1k4o3P7%rL3k5J5m4mQ0r1P0m9m6K3L9k6k3J
7369c6jJ2M2L7Rq6M5nJn2J01p2k8R2o4mk6M6k6P8k2j8N1q5J6N6m7Qm4L9j3Rk5
7402a2rJ4Mk5L0M3n0O1l8J4n6ql3P0K3Mkj2n1K5K7mmJ8n3L1n6N6k5J3J8Lmj4J0
7437Hl1J9L1o1l4L4L6kj7J1mJ7o4Q6l6j6M2J1m9Q0p9J5Qj2L5k6k0L1rM3o6L0R
7470B0m1ln0Q7n0M9NJ9M5j04N5l9k0K3L8k3l4NN6q1K9k2L6l1mK6kL7J4o4ML1j3
7503bL7k1k9O2k0l6k5M7l6lM2n7M1Lj5J7J0ln3L1m6K4J7mj6rQ0j12N3K6JN5q0
$$ plain form
7271 -81 17 -45 4 -11 34 -5 -18 25 28 23 -2 -32 10 74 -17 6 21 1 -44 4 8 -31 52 21 14 24 -24 7 -34 20 -28 -1
7303 -1 65 45 18 16 16 -22 19 -20 -20 19 27 23 -24 -40 -47 20 50 0 -12 12 -10 -63 -13 21 10 1 13 -39 25 -29 19 -25 28 -24
7337 -24 -29 12 -32 6 -39 16 72 -50 19 -18 19 30 6 -57 20 20 11 44 19 34 -10 -14 66 -25 45 -4 -50 -27 12 -14 -37 -36
7369 -36 -37 -25 17 54 63 -23 22 17 18 -34 67 -5 -33 59 -5 -9 -35 11 -15 63 41 23 74 -11 5 61 14 22 -22 17 4 13 -12
7402 -12 -21 -7 -3 -28 2 45 -5 56 18 32 -24 -32 -65 5 28 32 30 18 -33 -8 19 15 11 29 -24 7 -49 7 -18 -5 13 16 12 -2 8
7437 8 -23 -4 27 -34 -68 -34 2 0 -17 -6 -10 7 -57 29 -7 -23 19 30 -19 61 -18 -3 5 -7 28 2 -18 13 4 47 -19 11 20
7470 20 -21 -24 -74 13 -37 12 17 36 81 -23 32 -7 -27 -4 34 11 -23 -18 38 -43 -14 -36 0 -31 -35 -9 -11 26 40 -24 -20 11 -2
7503 -2 35 14 -15 47 27 -9 -34 13 -23 -26 16 -41 0 3 -12 5 15 12 -41 -10 -56 -32 -15 -19 -35 -44 36 -76 -23 3 4 59 -21
7536b1J2j2NOON%kM1n5L1m8O9m9J6L3k9l0kO4m6j0K3k6J8k0j24J68q3P6k4L0n3
7569c1L7pm0O6o1O3j8m6M2l1%j2J4J3l3P4p8M9kQL4qro1Q5k7kK1n1K5J3j8J8m7
7603b0L0j4J0N0k9k3j3J5qm7O2J8rj7%Qj3J9o6M0O6k3m4L0p2Q4q2J2N1Lm8jQ9
7636E8l1J0j1l0M5l1K1k8p2N1L3KJj2jj6JJ5n5R1K2l2j5m9J9J9Jk1j5L2m5J5L0
7669BP8n6j0L5m1K7j1m9P7%r9N0joJ8J7j0j2r1J01Lk8l3M4k6J5j7j3LkPK0lM7
7703C6k8k0P0q8J9k8J6O1l4K2k7jNj7L4K6rm2L2k7Jj4O4k9L9o8LrJ1M9r4loP7
7737B1m1m5O5L8l1k8k7J6M7j4J0n1J9K6JK4ll7K8n4N7j3jj5o2Q2l6K1l1JO9qj6
7770A2M6j08Q1o2N9n3J4%M1m4J2K4O2j26K1JJ9k7J5lK3k1L9m9L4Kmp%J7k7J0K8
$$ plain form
7536 -21 -9 -21 -16 -10 -4 1 1 -1 40 -15 16 -32 37 -12 4 37 8 -22 -24 40 -6 -16 7 -19 -1 -21 -145 23 -60 16 -8 22 -31
7569 -31 6 -1 -41 25 -36 27 9 -37 5 -26 -26 -38 -24 -11 -44 30 -48 1 -1 7 41 33 24 -37 48 21 19 40 -11 14 27 9 27 -20
7603 -20 10 -4 6 56 27 4 -9 6 -2 -49 13 31 22 5 5 13 0 19 -47 -7 59 36 -8 22 -50 34 -48 -36 15 18 -30 -31 58
7636 58 27 37 26 -4 41 10 31 3 -69 -18 15 17 18 6 5 -11 -10 5 -50 41 63 31 16 -33 -14 5 6 -15 -30 2 -43 -28 2
7669 2 80 24 14 49 8 35 24 -25 52 52 -47 3 2 -4 14 31 21 9 -82 19 22 -6 -39 5 -21 -6 -23 -36 -33 -35 -28 -8 -11 36
7703 36 8 -12 58 -30 -11 -39 -23 38 4 26 -1 -2 3 -14 20 46 37 -5 27 0 1 -13 51 22 61 -7 -4 -13 -2 47 -47 -50 -56 21
7737 21 -20 -65 0 38 7 -21 -48 -32 15 1 11 -40 -21 5 6 30 27 -10 18 -36 21 8 7 -8 -70 12 -24 -3 -34 -33 36 28 12
7770 12 58 -50 31 -31 28 -25 -11 -11 30 -14 -2 22 84 -42 -21 -20 -1 -28 -13 -16 7 -14 25 -24 10 12 8 1 1 18 -9 1 29
7803B9n1qL6nj1Lj6J2j7M6Km7N7o4K8jK2m2L8j3p7R4J8j1K1j04K3k2N3J7n9j5
7835f4Q9p0R5n0K3j6L0mNn3K9J2mp0OPL9j7L9k2ml2M9ml3M7j8m9M8k5J9qn2P2
7869A4K2k0j6K6j1Ok3J2n5O6oK3o9K3jlK4m3L7%Kl6K7l7L4M3l9k3%J4J0Om0K5
7903hj3O7p0J0QnL7jo5N4M0k0n2o5J35r4L5N3j11L6K7K1n1J1RO0m0K1l9L4k6j3
7935a5L1m0M5l6k7J02l8l8K8m8K3Mm0N9m8J8OK7l8jlK2m3L5NmMK4j0m7O6k5m6
7968d8O0j5J1J6k9N6ln2kRo5P1l9K7J3m4L3j7M8o8pK3O0m0k0O0m1J7J7r1J7M0
8000cn1MR2j44R7rnRK9m9j4K6J3J2Lm3K0M5k9k0J0JjO4j14O3N0m5%m9L4j1NOK7
8035B3m7J5POj2p1J17m2j7K9j3K2l6l0Q4p9O3j6m1RK4j3%N7k0k7k9L3j9LK4j9
$$ plain form
7803 29 -22 -30 6 1 -10 -7 -23 -11 -28 18 20 -27 30 -34 -6 -7 15 -27 11 -2 -79 15 33 22 43 -61 -38 -60 -7 10 -49 -64
7835 -64 25 -45 50 0 23 7 37 33 38 -15 14 26 22 -48 -42 -35 4 -13 26 4 0 -32 17 13 -20 27 9 -40 8 -17 2 -6 -58 14
7869 14 36 16 0 26 15 21 -2 10 -45 21 15 38 -31 -8 -9 -12 12 -31 6 6 8 -28 -1 -38 -4 39 0 -23 -23 -9 1 7 -33 -8
7903 -8 -21 46 -24 -14 -6 -11 26 25 -40 14 54 34 -18 -83 52 -42 -7 46 -65 -29 -2 19 -32 -21 -12 48 8 29 -10 24 -2 -15
7935 -15 16 -24 21 -15 -42 60 22 -16 12 -36 -13 -9 -49 10 -38 -20 -14 13 -25 -26 -29 -7 -50 -15 -10 -14 -10 14 4 -43 23 -2 -48
7968 -48 12 -3 8 24 -5 51 48 -4 -6 3 -62 9 -30 -3 10 -34 -1 -18 30 -38 -45 -22 38 -2 -22 38 -3 14 31 -60 -43 -3
8000 -3 -54 -50 42 -102 -5 -14 -19 -10 19 -30 -44 -18 -5 7 10 -33 -13 32 3 -17 -7 -6 -7 57 -57 6 56 11 11 -38 -4 -15 -10 -4 23
8035 23 -24 -9 -2 4 -8 -79 38 -4 -21 8 -5 17 -19 -49 35 -44 19 3 -38 -29 -5 -18 -18 39 19 -8 -37 -4 -23 -20 4 -15
8067a5pP3n9qK3Ol8RL0l8M7j00J00J3l0L1r1R0Lo2M6k5n2O8%j3K4k5mm4L7K4j7
8100dm1K2%K4j4K9m5M5n8P2K2l7l1K7M0n3oJ3L7n1P5n1J8n8JK4M0p1j9M4RPm0
8133c0M3l6K0L1l5L8m2L6m6m4P3l9ojJ06l5K2l8Npm1Q6p2J8J8Qp2MJR9q1O2p7
8166c2L5Mr7P9j2N9o0PK6J2k8j7LK3J1J1J8j0o4L2M6l5o7O8k3
$$ plain form
8067 -15 -22 51 -8 -16 7 13 -25 -16 14 -24 23 -77 23 36 6 37 -54 36 39 -23 23 -2 -54 14 14 1 25 0 -4 -48 -11 13 -4
8100 -4 -45 -23 -23 1 -13 16 -29 16 -42 30 52 15 -16 11 51 -2 -8 5 42 -9 66 15 33 -25 -24 0 40 -31 -50 -6 3 10 -30
8133 -30 13 -23 -3 28 -7 31 -11 25 -21 -65 8 -31 -37 -38 68 33 55 17 22 15 -26 60 -12 6 24 32 -40 -36 -35 64 -17 45 -32
8166 -32 3 7 -90 -11 -23 36 -24 -17 9 21 -7 -24 -21 2 13 24 42 32 -32 0 46 11 -56 12 -11
8191a1
$$ Imaginary data points
##PAGE= N=2
##DATA TABLE= (X++(I..I)), XYDATA
0@%%%%%%%%%%%%%%%%%%%%%%%%qJ6j6J6j6J6j6J7k5L2l2L3m1M8m9N7o5P0p8Q6r4
45d9J06j17J26j39J54j70J88k08K27k50K78l07L43l84M29m86N55o40P51q98J108
66F17j433K006l332J3292M49j5055Q187o92j1169o86R654m188m784M224K584l574
82c900K174M399K881J254n87j622Q66l058m556K524L362n108j466M642l150n704
98g049M981M324l558J742N415l209l626L116k63k604L481J491l428N44P66m744
114b621l99M667j398k223M505K72n450Q40L631k088k67M048j53k651K65p31j419
131a172J531N22q74J949K5l872L59K823k445o65M889r4m410J719K066l962k75
148a886M764o70k692K203J71l728R7K077j003mJ773r04j192R08l83l22K472R81
$$ plain form
0 0 0 0 0 0 0 0 0 0 0 0 0 0 0 0 0 0 0 0 0 0 0 0 0 0 -8 8 -8 8 -8 8 -8 9 -16 16 -16 17 -24 24 -25 32 -33 37 -41 45 -49
45 -49 57 -60 66 -73 81 -89 99 -109 118 -132 146 -161 182 -202 227 -259 296 -344 407 -491 617
66 617 -816 1190 -2142 11150 11599 -3456 4731 4039 -7130 -7816 1838 -2350 -7134 -2910 -326 -3900
82 -3900 -1726 2673 5554 6808 6221 4599 5465 2407 -2149 375 3737 -1371 -2837 1805 -1345 -7049
98 -7049 -2068 2256 -1302 440 5855 2646 -980 2136 1873 -731 2750 4241 813 1357 2123 -2621
114 -2621 -3020 1647 249 -1974 2531 2803 -2647 -1807 1824 -264 -531 3517 3364 713 978 247 -1172
131 -1172 359 881 7 1956 1981 -1891 -1532 1291 -1154 -1819 3070 2976 -1434 285 2351 -1611 -1886
148 -1886 2878 2208 -484 1719 1890 -1838 -1741 336 -667 -671 1102 198 -994 -86 -469 -791 1681 2662
166B662j310P28L28k766r23J437q40r92J327m18j691O99N81n92K095K256r81K36
184A836J744j816k163J869J57k745K74J220k659j780J846K18q42J990J934n96
200D87K65J132l14j67P24o3m94k29j627j445O1p33r31J363J029j045K90J889k67
219g5o38K147J321j218j62O14j250j605R1J2n82l2Pj52R4k4K11J002O19j72L52
240E60L97j005n40O93j06p43N71O49j071l89Q89k88o95O67N76p67m45L01r5l42
260a183K73O36K94K9m4K65R2m26j39K99p8q55o9K35n36l04P94L64k18M11N24k95
282F9l77K82P9n81j60K57j93n50J30M48J6o6M87N74k95l45L28P8o61k33L95j74
304d92n76R8M10q4k98M53L90k82q8L40J04l27M8L66j40j39J41K32l41k31K97j57
$$ plain form
166 2662 1352 2080 2408 -358 -1281 156 -684 -1676 -349 -767 -2458 -1759 -1178 -1770 325 2581 1600 1836
184 1836 3580 1764 -399 1470 1627 -1118 -844 376 -2283 -4063 -2217 -1999 -2841 -851 1083 487
200 487 752 1884 1570 1403 2127 2064 1570 1341 -286 -1731 -1670 -2403 -3334 -1971 -942 -1987 -1697 192 -75
219 -75 -713 1434 2755 1537 1375 1989 739 -866 -775 -763 -1345 -1377 -1370 -1522 -1428 -1452 -1241 -239 380 208 560
240 560 957 -48 -588 105 -1 -744 -173 476 -595 -984 -95 -383 -1078 -411 165 -602 -1047 -746 -841 -1183
260 -1183 -910 -274 20 49 5 270 362 -64 -203 96 18 -837 -906 -671 -1207 -1511 -717 -353 -571 -160 364 69
282 69 -308 -26 53 -528 -688 -431 -624 -1174 -1044 -596 -580 -646 -159 415 120 -225 103 181 -480 -713 -318 -492
304 -492 -1068 -970 -560 -644 -942 -489 -99 -381 -469 -129 -25 -352 -304 62 -78 -217 -76 156 -185 -416 -119 -276
326b76n47j38K81k72m82M09M81o6J8P78M38k00j4N42k42o10j34k6n08o12j7J97
348a000k50n7M61M51k2K17N84J18l19K97K57m30l37J75j31o51M7M11l40l88M68
369d39K20m89N2M70l3p6J44K93Rn6r7K82J56l82n1L64k70o65K00L83n84j74P28
392a5j02n37M49L95m76JO88j76l31L72R5m56O3L46j41J7m9k14J61m9m93J84M67
415A99m45l53P83l7q85M23R12o17j51R61k11q17N05L09p22K94O21o16k92M41m89
436a87n12O10Q7n01M97K97p28K00O76m46J53R82k91o91N91n9j110L34O63q11k35
457d81Q53n71q00R30K15n46Q35O81j008n6P08q25m93J166k7p22O58J74j058K64
477a03Q71p65N7J061p47j141P84m3j193Q07J269q29j76J131n40o09R20J61m05
$$ plain form
326 -276 -823 -961 -680 -952 -1434 -1025 -544 -610 -592 186 624 424 410 952 710 100 -34 -60 -568 -1180 -1197 -1000
348 -1000 -1250 -1307 -846 -395 -417 -200 384 502 183 480 737 307 -30 145 14 -637 -590 -179 -519 -907 -439
369 -439 -219 -708 -656 -186 -219 -295 -151 142 151 95 -2 280 436 54 3 367 97 -568 -368 15 -569 -743 -15
392 -15 -117 -654 -205 190 -286 -285 403 227 -104 268 363 -93 -30 316 175 192 143 -71 90 41 -452 -268 199
415 199 -246 -599 184 147 -738 -315 597 -20 -171 790 579 -238 267 576 -146 148 769 153 -139 302 -187
436 -187 -699 -89 -2 -503 -6 291 -437 -237 439 -7 146 1128 837 146 737 678 -432 -98 565 -246 -481
457 -481 372 -199 -999 -69 146 -400 435 1116 108 52 760 -65 -558 608 581 -141 517 691 -367 -103
477 -103 768 3 60 1121 374 -767 17 -26 -1219 -412 857 28 -148 983 443 -166 754 915 510
496E10M87j51j165J52J35j158N32J495q86o46J643m34j706J312J539j729j74J987
514A743j171j982J394Q58j464M47J672o66j060M03N1m64J39J42K74K77r61p52
532a120J234K7j203J448J817j785q84J906p11k101J525J464j747l26J477j122
548a01j452J281N83p71Q19P24j195j62L99p15K96J288l27n21R30m84j467Q91Q79
567H95j067K14J095j141j249P87o2o03J229O74q00M73M10j266J06J520o06o12
585cJ382m18k111M06J025j209jJ855l44j233O09K07j006O27R71l70J06K67q72
604a12m31O64k28j24J196j21j120L50R2j152K85J397n95n16J025m11j360P08Q84
623D31o75M69J015q92o67O81m54o80J127N60j046J69N36j283n04J176J26n03P77
$$ plain form
496 510 997 846 -319 -167 -32 -1190 -658 837 -49 -695 948 514 -1192 120 1659 -70 -244 1743
514 1743 572 -1410 -16 842 -622 -175 1497 831 -229 174 225 -239 -100 42 316 593 -368 -1120
532 -1120 114 141 -1062 386 2203 418 -466 1440 729 -1372 153 1617 -130 -456 1021 -101
548 -101 -1553 -272 311 -460 359 1083 -112 -274 125 -590 -294 994 667 146 1076 592 -875 16 895
567 895 -172 42 1137 -4 -1253 -466 -528 -1131 98 772 -28 445 855 -411 -305 1215 609 -3
585 -3 1379 961 -1150 -744 281 -928 -929 926 582 -651 -42 165 -841 -214 757 387 493 760 -112
604 -112 -543 121 -107 -231 965 844 -276 74 166 -986 -701 696 101 -415 610 199 -1161 -453 431
623 431 -244 225 1240 348 -319 362 -92 -772 355 915 -131 38 574 -709 -1213 -37 89 -414 363
642C63K68r84q2M05k47M11P28m27j29K16p20n98Q34K26n12N23N60j239l93P89
662hk12m17R86M04r77n4M00o98l6Q64J78j04K54j81o07J92j8k32N72K95q29k21
684d49L51n82m15J106M62n92L71M10o92l50O71N7k40M07R3o84j99P7k70K10M46
705A88n6r5M8m63k03K73J15m5N62J64n79P5M37l24j00P12J31p67l1J3o07l25N33
728c44J22q4K42J31j78l8K60K04K18O9j85k7k52n04K9L57j47o0M11mn89N5M82
751A68j64k19N30O5m98k31K73Jk07L12L59P2k75j3J04q8j55l5K66k00l64QN9j86
775d18PM43J86j83J92J15k33r5K16J10j97NJ65k53k57R6J48l1j21J47J29l37j44
798c10J61J17j14M1L03lk04Q2K31q6p6K00K5k62j80M8j26j72J45L4J4n7J52j7
$$ plain form
642 363 631 -353 -435 -30 -277 134 862 435 306 522 -198 -796 38 264 -248 275 835 -404 -797 -8
662 -8 -220 -637 349 753 -224 -278 122 -576 -612 252 430 326 580 399 -208 -16 -34 -266 306 601 -228 -449
684 -449 -98 -680 -1095 11 473 -119 252 662 -30 -380 291 348 108 515 608 -76 -275 -198 -468 -258 188
705 188 132 37 85 -378 -581 -308 -193 -238 324 488 -91 -16 421 97 -3 709 840 73 42 55 -552 -877 -344
728 -344 -222 -306 -64 67 -111 -149 111 315 533 602 417 390 138 -366 -337 20 -127 -187 224 220 -369 -314 168
751 168 4 -215 315 380 -118 -349 -76 -75 -282 30 389 461 186 173 277 189 34 -1 265 65 -299 -291 -232 -418
775 -418 -411 32 218 35 227 342 109 14 230 340 143 148 313 60 -197 -101 47 16 -105 42 171 -166 -310
798 -310 -149 -32 -146 -105 198 195 -9 73 304 218 142 342 367 105 -75 -27 -153 -325 -180 -146 -132 -189 -37 -54
822e4k0m3L27K0j15L5J47j20k73K28Q2j90q5K73j15k91k8J55p9j52J84P1j10O
846a47J34J14j0K2J33R5j36m5K9l3k58P0M2k23q5J68Ok07J82K23j68n1L06M0k20
871a9J28J59j82m3N8M0p2j54l5K3J6j61l2K56p4j76K11J72l07J06K47j62k13K82
895F8Q8l35J53K69k66o7K93n0k26N5M9j38q2o7p1N9K4k29K54L24k01n9N42p8m36
920a27L68K37n17j65L92k67m05K46K2l52J40M21k37p5L01l4j23J84L3j00J69n9
942E2j77J96R4l78K47K68m48k62M73k10o46L86M40n05q1O51r3l23N22J75l10J79
964B50J52l15k05J00k94r8J78j50j58L10o9k29N14J93m61L69M46o02l59P09j70
985A11o46M39N15o89j35N91l20l39M54R6l58J15J62m24O9K45k21J69M77k38l16
$$ plain form
822 -54 -74 -117 210 230 115 150 297 177 -96 132 214 24 -61 212 97 -194 -222 -67 -146 -298 -114 -43 -153 -147
846 -147 -13 101 91 113 246 341 205 160 189 156 -102 -32 10 -213 -298 -130 -124 -331 -149 74 -94 -145 161 201 -19
871 -19 109 268 86 43 101 141 69 -85 -120 -97 -81 -242 -274 -18 -92 -268 -57 115 -192 -86 161 -1 -214 68
895 68 156 -179 -26 243 -23 -90 203 153 -73 -18 31 -107 -189 -256 -327 -268 -244 -473 -219 105 -96 -155 387 309 -127
920 -127 241 478 -39 -204 188 -79 -484 -238 -216 -568 -428 -7 -244 -319 -18 -52 -175 9 42 -58 111 52
942 52 -125 71 165 -213 34 302 -146 -408 65 -145 -791 -405 35 -470 -551 100 7 -316 206 381 71 250
964 250 402 87 -118 -18 -312 -410 -232 -382 -540 -230 -299 -528 -14 179 -282 87 533 -69 -428 281 111
985 111 -535 -96 419 -270 -405 186 -134 -473 -19 77 -281 -166 -4 -428 -359 -114 -335 -166 311 73 -243
1006b43M07p9m49L62K50n06O4L66m94k82N78m1l13M62J81n67J35K47m46NN53j72
1028A8l47N10j47n32L83L97m23J31O19n55n28M52n7m41L66L72m82k9K37m25J9
1049d62N73l4j80N12j23n65K32K27m15K10M92m02l77L51j57n82N85K85m99J84
1069a45M34o02k04O15O1l49N97K42o12l5L71n27j00N20j24l95K29j70m85K56K51
1090a72q1L47K96m07J5L57l30p8P12k6o30K17J82q90r1O52j54l94N40J12n59L5
1112c47M70k07J96N03j02k20J27k93l49L12N2k45K40J21n07j98N09j77j31O48
1132D02R5m67j1K46m89n3N12P1j92J43p9l14J52O8l1K65J97m61q6J93m31j42N72
1155A60J31l54L26J51n09j16N27m3j09K59k0l90p6J26k26J91L02Mj20Qj92j47
$$ plain form
1006 -243 164 85 -364 -2 248 -258 -194 172 -322 -604 -26 -67 -380 82 263 -304 -169 78 -368 -363 190 18
1028 18 -329 181 34 -498 -115 282 -141 -10 609 54 -474 -22 -79 -520 -154 218 -264 -293 -56 -481 -462
1049 -462 111 77 -103 409 286 -279 -47 180 -235 -25 467 65 -312 39 -118 -700 -115 170 -329 -145
1069 -145 289 -313 -517 98 159 -190 407 649 37 2 373 -154 -254 266 142 -253 -24 -194 -679 -423 -172
1090 -172 -253 94 390 -17 -2 355 25 -53 659 633 3 220 402 -488 -579 73 -81 -475 65 177 -382 -347
1112 -347 123 -84 112 615 513 293 420 127 -222 90 142 -103 137 258 -249 -447 62 -115 -246 402
1132 402 497 30 19 265 -224 -277 235 306 114 257 178 -136 16 84 53 318 515 54 -32 161 -270 -412 160
1155 160 291 -63 263 414 -95 -211 316 273 164 423 403 13 -63 63 -163 28 330 334 214 222 30 -117
1177a17R7J06k0K10p7l01j8R0j41Q6N41L9l15K22k7m97P7M03j84j14J95p6m98
1200c19P0J95nQ8L16J4k69l8k2J13J3J55L7J37k21k81R4M7k72J17L15p1m76R6
1224a67P9k26J00M63K3l5J20j7j27J2O8P3J2j71j79j73o0k21J36K81N2r2J93J22
1248B66l32J13L68Oj58J05M3m03j27J01pL2L2J47j40j08j11J07N4j3J17J87j28
1271A51k51J02L0k9K7K50k9j39l5k6j32L8J47l5j9nq0n6o0J45N2K3O1m5M3j16
1297A2l8P7J37j13mO0o7j89M0M9l7M7P7l4j37k1J11m1K6Q2l4rk7j3j2j8R5Q2q
1326I3p0P4r7m5m9O6Rr6LO9j21r7J42R0k9M3J66o1j45J06N2m2jQrj27q3M2l3n1
1356a93J6Q1kr6M8J39m6o4J21J05j02j7J41l5j87Q0J32k39m4R4q3j59K7K9J8M8
$$ plain form
1177 -117 -20 86 66 276 199 -102 -120 -30 -171 -85 456 495 180 402 375 -122 -45 358 174 60 255 179 -319
1200 -319 -249 -54 -59 29 345 359 90 52 30 143 156 311 348 485 264 -17 77 124 -148 -31 284 213 -263 -167
1224 -167 -88 -314 -214 249 272 237 357 340 213 225 293 366 378 207 28 -145 -205 -426 -290 -9 43 -49 144 266
1248 266 -66 47 415 421 263 368 411 8 -119 -18 -25 7 39 186 46 -62 -173 -66 -12 -25 92 279 151
1271 151 -100 2 32 3 30 280 251 112 77 51 -81 -43 104 69 50 45 -35 -91 -151 -6 46 69 130 85 128 12
1297 12 -26 51 188 75 71 131 64 -125 -85 -36 -73 -26 51 17 -120 -141 -30 -71 -45 37 3 -6 -33 -46 -58 -76 19 101 93
1326 93 23 97 0 -45 -94 -28 -19 -115 -112 -43 -164 -261 -119 -29 -58 -15 151 90 -55 51 103 61 60 68 59 -68 -151 -109 -142 -193
1356 -193 -177 -96 -98 -194 -146 -7 -53 -117 4 109 7 -10 131 96 -91 -11 121 -118 -162 -68 -151 -310 -283 -254 -236 -188
1382a88P8O2Q1j3j4J99o6r3L5nk03o5N8Pk42J12J34j41L9K14M1j79J21J33j27
1407b2o6R0o4p4O7Lj8R0q8K3J74j89j19J53M4l15Q8K15j57j10J90O7j59J52J14
1432H9j29m7K02j08j17L4Mj13Q5nj01P1K6j30J48P5j46j9K92j50j52K58K0j83
1456i6O3J43j00m3J49m9j75N4L7j86k8J20q5L9J36j01mK00k3j74J98L1k00R9J33
1481A38k30j38K85o4k08J86J08l00R6K03j98o7J67J2r5J16L0j76J52Q3j10P0J60
1504B20j55j52J50mk79J85O3k49O5K04k29q9L06l4j39J90J22k07J00O9j53L1J42
1527A57j61n7N1j10j00J82N6k40K21J68k97l6L40j85q1K85O3k99RJ91j96m8K93
1550B06p6j86J01O0k80M6K33k12K8J80j23r2J12q5RJ93M9j82J67Q2k46l4K38r9
$$ plain form
1382 -188 -110 -48 33 20 6 205 139 46 81 76 -127 -192 -134 -127 -369 -257 -123 -264 -225 -11 30 -149 -28 105 -22
1407 -22 -88 2 -62 -136 -69 -66 -84 6 -82 -59 115 -74 -193 -40 4 -311 -223 -8 -165 -275 -85 -18 -177 -25 89
1432 89 -40 -87 115 7 -110 -76 -72 -185 -100 -105 -206 -135 -109 -239 -91 -16 -162 -181 111 -39 -191 67 87 -96
1456 -96 -33 110 10 -33 116 67 -108 -54 -17 -203 -231 -111 -196 -157 -21 -122 -126 74 51 -123 75 106 -94 5 138
1481 138 -92 -230 55 -9 -217 -31 77 -223 -127 76 -122 -189 -22 -10 -105 11 41 -135 17 100 -10 60 220
1504 220 65 -87 63 59 -220 -35 28 -221 -156 48 -181 -270 36 2 -137 53 175 -32 68 137 -16 15 157
1527 157 -4 -61 -10 -120 -220 -38 18 -222 -1 167 -130 -166 174 -11 -92 193 256 -43 -34 157 -39 -87 206
1550 206 130 -56 45 105 -175 -129 104 -108 -80 100 -23 -115 -3 -88 -79 114 163 -19 148 230 -16 -50 188 89
1574H9j65K44n5l43O1J41j14J7K59j05r4J06Rq3J79Q6r4P8Kk44k8N7r9m9K72n2
1600G5k26P5J25k57M1L07j8k00J89P8k32J3J77k3l2J40k15k6%q3l6J28L0j42J19
1625GO1k56R3K92j00p6K15k4k52L4J29k22j7K61J9j61pK3j39Q7M1L2M4pj18p2
1651a13R1j29O3K03O0j24J32r2j97J22J23q6n4J83k12j75O9J60j23N3K46p2j38
1674a0L5J6j13J60Q6n1L0m0j21j8P3n7R6J06l9j43p3N7q5oJ32j9m6M3J8j43J00
1701a2O1M5Q9M8j45n4j2o7L6N2Lj0Lj32j04L8J38l8O6J53n8j23J4O1j0K5J45p6
1729A36j15l0o7q5P4kO9J0l8On4OO9Q0J12j5j4p6J7j64P5J38j31M8J6j02k52J55
1757a34P3m3J60P3n4j14K4J5k2Q6%J16m8j67MpK2KR5j06O4j18O1m7o7J17J15m3
$$ plain form
1574 89 -76 168 113 -230 -169 -28 -142 -125 134 29 -65 41 50 -33 146 232 138 216 218 -26 -54 3 -96 -145 127 75
1600 75 -151 -76 49 -208 -167 140 122 -78 111 189 -43 -30 147 124 92 232 17 -9 -9 -92 -128 0 30 -112 7
1625 7 68 -188 -95 197 97 21 236 212 -40 -6 123 -99 -116 145 164 3 -4 19 -120 -33 8 40 84 77 -41 -113
1651 -113 -22 -151 -88 115 175 51 183 91 -106 16 139 53 -1 182 -30 -205 -136 24 -99 -46 200 128 -10
1674 -10 25 41 -72 88 174 123 153 113 -8 -26 47 -10 86 192 153 10 -63 -6 -91 -97 35 16 -30 13 31 -112 -12
1701 -12 49 94 183 231 86 32 20 -47 -11 41 44 34 37 -95 -199 -161 -23 -61 5 158 100 -23 -9 52 42 67 212 136
1729 136 21 -9 -76 -161 -87 -89 -20 -10 -48 -42 -96 -90 -21 59 171 156 142 66 83 -81 -6 132 1 49 65 -37 -289 -134
1757 -134 -61 -104 56 129 75 -39 -15 0 -22 64 64 180 132 -35 -31 -38 -16 -14 81 -25 39 -79 -18 -65 -132 -15 100 57
1785E7k1M9n9r8N1J22Qk6k5k2Lj17O7M6O3n6n2Mq1o6N2J25m9O0L8q8K3M1K4j3
1815F0N8Nj06q1N4p0rK5Q1j7oj3l1Q5j44K2J25P4q1m5N5o5jO4N2O1n8J1r2r7Q8
1846Dpk2K1j2l8r8R2RR6PJ8O4Lk6q3Q2k9o3O2Lj86M0Q5j11k0J16j7l0K1P3l5P
1878B6O6M8Mm5j4L4n1o2pP4op9n2K5p6j1J50k3q8J98l4n3K2P3k3j0n4O4j10L2
1908A8L4o8n4M4Ml6J15j47P0L6k2o7R7N2o7JQ5o2j5J75j64k2Q3Pp0l8N4j13r8
1937a68J32J3l4N9kRK9l1OQ1K9m9k7L9m5q3Q2Jj28Q2P1j24pJ04ok5J0J8q7P8M0
1968F7p2J8P6k9n2M6o5L0N8o4j04M4J02j32k6J65j31ON2L9l3JJ28q2o4Q3k6r5
1996f0R0J0o3J3kq5L3N8j5m4P5j00J3J80m9r5J3Q4n1j8M4m8j01J83m8j03l9J00
$$ plain form
1785 57 36 85 26 -72 -21 101 109 83 58 36 39 -78 -11 35 98 42 -10 -6 -87 -153 -101 24 -25 35 73 -15 8 49 73 60
1815 60 118 123 17 -64 -10 -80 -89 -64 17 0 -6 -19 -50 35 -109 -87 38 112 31 -14 41 -24 -25 39 91 152 94 105 13 -84 4
1846 4 -3 -25 -4 -16 -54 -152 -60 -51 45 52 70 134 137 111 28 110 81 18 80 83 -103 -63 22 -89 -109 7 -10 -40 -19 54 19 26
1878 26 92 140 144 99 85 119 68 6 -1 73 67 -12 -64 -39 -115 -126 24 1 -87 111 77 24 46 119 96 86 32 96 -14 18
1908 18 52 -16 -70 -26 -22 -58 57 -90 -20 16 -6 -73 24 76 9 10 95 33 18 193 29 7 90 97 27 -11 43 -70 -168
1937 -168 -36 -23 -57 2 0 9 38 7 13 94 123 74 47 86 41 -42 40 41 -87 -5 66 -58 -65 39 33 8 18 36 -51 27 67
1968 67 -5 13 89 60 8 54 -11 19 77 13 -91 -47 55 -77 -103 62 -69 -63 -11 28 -5 -4 124 42 -22 61 35 -60
1996 -60 30 40 -23 -10 -12 -97 -64 -6 -21 -65 10 -90 -77 103 54 -41 -28 56 5 -13 31 -17 -118 65 17 -86 -125 -25
2024b5o2O3M9r0oP7j0p5N6k8N0mM1p2O9K5j2o5P5op9J8K5j16K4P1n5m4J15k1m9
2055f1L9N3k9J8O7j24J6P2n9N5q4L9K6m7l7q5QO2o7J5P8L5r7O6N5k1nR7o8L5r
2086D3k4j4oJ5n4K6k7n2JN8j00J18L8q3L3O0n7j7Q3N5j25jQ0j1j63M2J06q2NL3
2116b0k9o6J1O0j0J23p6JL7M6j36J25k6l1j7L7n3q4P0n4l6Q7J14j17QN0l3j3O5
2145C3oJ3%o2n9Q6l6j7n0J44k7j11Q1m3jM7N5o7j7L7j5n1kP2j6K3O1j02rM3L5
2176C9m5N7O1q9k7l9j1l9J37m5k7K5j17R5k4L7PQ1Po2Rk8o2mO7N6k2J1l8j3o2
2207f5J0RP3k5L8k7Qo0K4Q0K0m7rQ3j07m3K3K2k0N1Lkr4O3o9k6Q9jP9n5J2J7n7
2240cP2OK5n6qp5l2Mk0P7J9j4k3M5j01L8M6P6L0k5L6o4p2O2J0rk4J0Pn5n7jL9
$$ plain form
2024 -25 -87 -24 25 -65 -71 6 -4 -79 -23 -51 -1 -5 36 -36 33 58 46 -19 56 50 -29 -11 14 -102 -78 -7 -62 -106 9 -12 -61
2055 -61 -22 31 2 20 87 -37 -21 51 -8 47 -37 2 28 -19 -56 -141 -133 -71 -138 -123 -45 -10 -107 -41 14 -7 -12 85 17 52 43
2086 43 19 5 -1 14 -40 -14 -41 -93 -92 -34 -134 -16 22 -61 -28 32 -25 -42 41 96 -29 -30 50 39 -124 -82 24 -58 -53 -20
2116 -20 -49 -115 -104 -44 -54 69 -7 -6 31 77 -59 66 40 9 -8 29 -24 -108 -38 -92 -128 -41 73 -44 -36 14 -19 -32 33
2145 33 27 40 40 -22 -81 5 -31 -48 -98 46 19 -92 -11 -54 -55 -8 47 -20 -37 0 -15 -66 -68 4 -12 11 72 -30 -39 4 39
2176 39 -6 51 112 23 -4 -43 -54 -93 44 -1 -28 -3 -120 -25 -49 -12 -5 76 83 21 30 2 -60 -64 3 59 37 48 10 -3 -65
2207 -65 -55 -46 27 2 40 13 21 -39 -15 65 85 38 29 112 5 -38 -15 7 -13 38 41 39 -55 8 -61 -87 2 1 80 25 37 54 -3
2240 -3 69 75 100 44 36 -39 -71 -67 -87 -10 9 -5 -28 17 -84 -46 0 76 106 81 117 53 -19 43 53 44 20 30 37 -18 -75 -76 -37
2273c7L9J8J9Nk0J5j1j0n0J38M4r7j5k4k9p7R8P6j11L2j6K0m0J7L6O3k4jn0N3
2303F1j03RK1L8j7N4LKq8R5o1J7J8P1j07k5L5j7K3l1K4k1L7l9K0m4KN8O8o1l7
2334ElN9j24M2N7j1Ml7N2k3m8k6J54j0j2Nl4m6L6L0rK3M8j14K2r3N8m6N8k3O3
2365E7n9n3k3Q8n2P1K3K2Ln1P0o6L1K5Kr7L6n7K4Jj5pP9j1k2m3L0K8p2J33n1p
2397C7J02p9mo3N1J1o9J6k1j9m5O8Oj0P4Pp1L8k6O6n1N5%p4L5p5L3N5p7o3J21
2428B8k9m4J8K1L9m9L4l2N4l7P1l9l7O3o1M1p4JN3Qo4oj2j5j5M0QrO2J1n8J5M8
2461C4k3k1L9Pj15R1Oo4N4L9j1n1JO9p0k1qJ9J1K6j4j8P0k6j04J32m0k7l2N3l4
2492b8L1k9M7l1K9n5J2J6o0K5Mk0lK1J5L4RL1k1L7n1l8M7M7pm2k2j5J5q2M5J5
$$ plain form
2273 -37 2 20 39 44 24 39 28 18 -32 106 150 53 38 14 -15 -92 6 82 -29 3 -13 7 -33 -16 20 83 59 58 8 61
2303 61 -42 -33 -12 26 9 63 66 68 -20 75 14 31 49 120 13 -12 23 6 29 -2 22 1 38 -1 19 -25 -23 35 103 42 5
2334 5 2 61 -63 -21 36 25 29 -8 44 21 -27 -53 101 91 79 84 50 4 40 70 61 84 132 18 40 -53 5 -41 17 -6 57
2365 57 -2 -55 -78 10 -42 29 52 74 77 26 96 30 61 86 88 -9 27 -30 -6 -5 -20 -27 52 41 19 -24 6 34 -38 95 44 37
2397 37 139 60 56 -7 44 55 -14 2 -19 -38 -83 -15 -9 -19 55 62 -9 29 3 69 18 73 73 -1 34 -41 -8 47 -30 -93 28
2428 28 -1 -45 -27 -6 33 -16 18 -14 40 3 74 35 -2 61 0 41 -33 -32 21 29 -35 -41 -53 -68 -83 -43 -35 -44 18 29 -29 -14 34
2461 34 11 -10 29 36 -79 12 18 -46 8 47 36 -15 -14 55 -15 -36 -44 -25 -14 12 -2 -20 50 24 -80 52 12 -15 -47 6 -28
2492 -28 3 -26 21 -10 19 -36 -24 -8 -68 -43 -39 -59 -62 -41 -26 8 17 48 27 64 13 -25 22 69 62 20 -2 -17 -2 -84 -39 -24
2524b4m3P6J3On1M7JL2r5LQ0k5l5kl8QoQL7l3j4J4M8m2j0J02k2K2J1m1n0k3Q7
2557D1j02L0j6l0J05Lr5Q0j0Ll2K0j4o6R4K4o6L2L8Mj26P0L7m9N9l8p9K5rkN9
2588a0k4j8K9QM5pj7j9O6l2J7j3n2Q3k8o6J8rN3p6lM5p3R4kn7K6Q0o3k6J1k0L9
2621aj0m3M0K7J1p4J06pm6pm3K7J3J5P5q5k1O3p6P7J4n4qP1K7n2K2n9J3m2J01
2652G4q4M2k5k0pRnPQ8r2j5J5R1l9j6L6p5K5l9O4p9K9k2nN4q0L8J8J2k0QR1n1
2685B7nM9n3j3m7P5j8j2j8P4p6o1M8j9L7L7m7M7j7L7m4k2J7j7L8qj6J6rOp1Q8
2717B3M3o6K3j7j1qJ0O6o6m9N0lJ2J3L8L2j08O6K0r6N0q4Q1n9lj1L9j2nrR2l0
2749B1K6o8M8j8K3k8rP7l3k5m1K5qk9kP3k1LK9l7o4J03l2l3L7j0l7N1l3M7m7J
$$ plain form
2524 -24 -67 9 22 28 -23 24 25 57 -38 -35 45 20 -15 -17 -55 -47 -53 -45 -8 -41 -55 -41 7 -35 -45 57 35 57 68 27 -23 -46 41
2557 41 -61 -31 -47 -77 28 31 -64 16 6 9 -23 -3 -17 -83 11 35 -31 1 39 43 -83 -13 24 -25 34 -4 -83 -58 -67 -69 -10
2588 -10 -34 -52 -23 -15 30 23 6 -13 53 21 38 25 -27 56 28 -38 -20 -29 24 -52 -55 -10 -83 11 9 -48 -22 58 -5 -31 -20 -40 -1
2621 -1 -11 -54 -14 13 24 -50 56 49 3 -4 -47 -20 -7 8 83 -2 -23 40 -36 41 55 1 -7 64 91 39 61 2 15 -27 74
2652 74 -10 32 7 -13 -20 -11 -16 -9 79 -13 -28 -13 78 39 23 59 -16 9 -30 34 -45 -16 -38 -43 11 -69 -31 -13 -1 -21 -13 78 27
2685 27 22 71 18 5 -42 33 15 3 -15 59 -17 -78 -30 -49 -12 25 -22 25 8 45 1 -21 -4 -21 17 9 -7 9 0 6 -65 23
2717 23 66 0 23 6 -5 -13 -3 63 -3 -52 -2 -5 7 20 58 90 -18 48 68 -28 22 -62 19 -40 -43 -54 -15 -27 -32 -41 51 21
2749 21 47 -21 27 9 32 4 -5 72 39 14 -27 -2 -10 -39 -41 32 11 14 43 6 -58 45 13 -20 17 7 -30 21 -12 35 -12 -11
2781a1N1%o4j0O1Km2m5O2j5K0o9L4O3q2O6l0N7l3K1o6P2o0K3qL3pm1Rl0N8J0L1
2814F0q0rL4j7J2K7kj8j8J16l0r5L5j6J6n1P0l0k3m4j0O7Ml4J02n9j8mM6pLj9
2846HM2j1Pl8j1K4KJ5j02O4l1K6k8M5j3K8n4Q4k6k6J4l7M3j4KJ5rp7%l8j3P0L1
2879h%o4L6P3n3j2J9K3k6M2j1J3q8PO0J6m6N2n5QK4j1j6N5p4oO5l4K1M8k7JL8
2912G0j01Ok6P2k2l0QJ1j8K1rJ0J6k4J8O0m3n3K7pLK9K2pk0K3n1jK0L2l0J0l3
2945a7J6j7%O9o3L5k5K9KKl6J2O0n5kJ0j0m2K9Jk5K1PK2l5o8O8k1L6J2nOj0L2
2979C8k9LJ1nJn5O7m9O0o3Mk0N6pm3M5l3M1K6j4L0m8j4nPQO3q2MM7k5l3J6k9j6
3014d3J1L3O0j4k3nM6j14R7k2K5p8P7k5JJn5L6J7m6K5m8L6J0K4rm0j1M0nk3K0
$$ plain form
2781 -11 40 40 -24 -34 27 29 -13 -58 4 -11 9 -60 -26 37 -45 21 -9 48 15 36 -30 42 -18 5 -3 30 23 -18 -9 -39 19 29 60
2814 60 -20 -29 5 -12 0 27 25 7 -11 105 75 -20 15 -1 15 -36 34 4 -19 -63 -73 -6 -2 -36 66 7 -11 -15 31 24 27 8
2846 8 50 39 46 8 -3 21 23 38 -64 0 -31 -5 -33 12 -1 27 -27 57 31 5 19 -18 25 11 13 28 19 -58 -58 -96 -109 -39 -8
2879 -8 -8 -72 -36 37 -16 -28 -9 14 -12 30 19 32 -56 -49 11 27 -19 33 -22 -14 10 -1 -17 38 -36 -42 23 -11 10 58 31 32 70
2912 70 -31 -25 -51 21 -1 -31 -23 -12 -30 -9 -18 -8 8 -16 2 62 19 -34 -7 -14 -11 18 40 33 13 36 -15 -16 4 36 6 16 -17
2945 -17 -1 -18 -18 51 -12 23 -2 27 29 31 -5 7 67 12 10 20 10 -32 -3 -2 -27 -6 1 23 -12 -80 -12 -33 3 15 10 16 6 38
2979 38 9 12 23 18 19 -36 31 -18 42 -21 -17 -37 19 12 -31 14 -19 22 48 34 64 16 2 -3 4 12 75 -7 -3 44 19 -14 2 -27 -43
3014 -43 -32 1 61 47 24 19 65 -49 48 26 51 -27 50 25 26 27 -28 8 25 -21 4 -44 -8 2 26 17 -23 -34 6 1 -22 -2
3046bk0l1M6K1m8J1K7mRl9J3J1J2k8pQ1n3M1O0j01N4n1KK1L7l3j1Oo7P3m3J0k
3079eL2n8J9J9nj0j3l4L7k3M0L4pm9M8K0n3M0qj9k5jK6L3p4N1k3O6q9M0JK9j9
3112B0nP0o2j8j5M9m0J1o0lkK9J3K1J4j6j6pl9R4q9L9J0L0r7O1P8l6r5O0m1l0
3144g2L5LL0K1Nk4qJ0k0J5kj2P1q1N3n4P6j5l1lO4l0m2J2nK3m4RKrO0l6j7L0n
3179Il7PK6l9M1n4J2O2l2J8k0J9L0j24Q8Jl4oN4o8Q5j4m2J9N9p2M9k8n3P9p4L
3211c6Nl7k1R2j1k3j3L4m1P2o9O0q1J12k0On0j4N2l9J9k2M4j4n5L4k9m6O9N4m5
3242a3L6m6J7N1l2N8p1N1j7j2l4Lj5OR7p3m0L3j7K6r0J18p2N7j8j0J4K3k4k1K9
3273A4K3J2p0k7L5M3l3m3R2L1l2l3nj8M0k0j4J8qm6P2n3lL4j5l4K9L0j2l9N3k9
$$ plain form
3046 -2 -22 -53 -7 14 -34 -23 4 0 9 -30 -17 -6 6 -22 -29 52 -1 40 100 -1 53 2 4 25 62 29 18 24 -43 30 -13 -3 -5
3079 -5 27 -31 -12 7 2 -8 -21 -55 -18 -41 -1 33 26 -23 25 45 -8 32 24 5 -20 -21 5 38 -36 15 -8 58 -31 9 10 39 20
3112 20 15 85 23 5 -10 39 -1 10 -50 -53 -55 -26 -13 8 22 6 -10 -17 -56 38 -51 -12 -2 28 -69 -8 70 34 -61 -1 -42 -72
3144 -72 -37 -34 -4 17 22 -2 -10 0 -20 -5 -7 -19 52 -29 24 -30 46 31 0 -3 61 31 -11 1 -4 19 -25 -16 -14 -23 37 1 -16 14 9
3179 9 -28 -21 5 -34 7 -47 -35 27 -5 13 -7 12 42 -82 6 7 -27 -33 21 -47 38 24 -18 1 60 -12 37 9 -44 35 -39 -36
3211 -36 -31 -68 -89 3 -8 -31 -44 -10 -51 21 -48 12 -69 43 23 29 -21 -35 17 -22 -3 -25 19 5 -50 -16 -45 -91 -22 32 -13
3242 -13 23 -23 -6 45 13 71 0 51 34 22 -12 -9 -24 -18 79 6 -34 -1 -18 8 -82 36 -36 21 3 -7 7 30 6 -15 14
3273 14 37 49 -21 -48 -13 30 -3 -46 46 77 45 12 7 -11 29 9 -5 13 5 -41 31 -22 -25 9 -6 -40 -11 19 7 -32 21 -8
3305hL3r1J0MK7JNN3q0P2Pm9J9J4mK6p4MP5n3j3L1PK5J2m3m1N5j2k2L5q2P5L8
3339E6l1l5PK7n4L4n3O7l4K9j9n3N5M0J4n6RL3o8L0M2k2M9j3n8M6rm1K2nnm6P0
3372B8o6L2k9N7k6M1K3q2L8k1K1Jj8Lj8R1p3Ll6L8K0l4Oj2l7N7KK3L9l7kJJ5m0
3406Hn2P8j9M1n6N5o8On0P6j6M9l5Nj3l3O1n0K0NNJ2Ok6K7k0lj9N9n5k0m4P9k9
3440a6J7P8j1j30R1j9J7Jo7N7L4n0QJ7rp8O3jk0L2j5L2k3J9k8L6j1%rq3P9pmO
3474FM5n7K5J8rl3J0l5Q6o1N9l5NJ1l8Q7n1j6k3N9M3j02M7K6q1K6L8j9k0Oq%k4
3507a5%J1L6k6J6l2J3j4P7p6l3N3%P7q5kK6o2M5j6K4m0J1j3K7OO0l4K5l4j0J0
3539B5j4M4k8On7N2o8ppN4l8K8n3Q1rm3P0k7K0o2N3n6J4K1k5mK9m9N8Oq6P6K7
$$ plain form
3305 -8 25 -66 -56 -52 -25 -24 -19 34 -46 26 33 -16 3 17 13 39 -35 -31 44 -9 -22 9 16 41 53 10 -31 24 12 -10 25 -57 18 56
3339 56 25 -10 -3 24 -30 4 -49 18 -16 13 -6 -59 -4 36 50 -6 3 36 -32 -2 40 18 67 54 -4 42 33 -8 14 9 4 -42 28
3372 28 -38 -6 -35 22 -4 37 60 -22 16 -5 16 17 -1 2 -16 75 2 5 -31 7 27 -7 -1 -13 -50 7 9 32 71 34 32 33 48 8
3406 8 -44 34 15 56 0 55 -13 -7 -57 19 3 52 17 22 9 -24 37 -13 7 12 17 29 35 9 36 16 13 -6 53 -2 -22 -66 13 -16
3440 -16 1 79 68 -62 29 10 27 28 -39 18 52 2 10 27 18 -60 3 2 -18 14 -1 31 8 27 -1 35 24 24 15 -68 11 4 0 6
3474 6 51 -6 19 37 28 -5 5 -30 56 -5 54 19 24 35 -3 84 33 17 -6 53 96 -6 41 67 -14 12 50 31 11 17 9 9 -15
3507 -15 -15 -4 32 6 22 -10 3 -11 66 -10 -43 10 10 87 2 0 26 -36 9 -7 17 -23 -12 -25 2 8 68 34 59 25 15 25
3539 25 11 55 27 33 -24 28 -40 -47 -54 0 -38 -10 -63 18 9 -34 36 9 29 -33 20 -36 -22 -1 -26 -30 -1 -50 8 14 -72 4 31
3572C1Jk8J3k0K8OJ7r2N9j4J21q2K2n0ml2K7k0jj5m6J29r5M8j6J9Ml9NM3pk5K0
3605Gl4k6M9N2n0j1M3l0m7O3l5L7m2J2O7l6j6k9L7j3n2J33p0L0l9M0k9k2k9K5
3635a5K6p3Q7o3L0Qj3MM6n6J3P0m5k1Km3O9Nl9k6Q2q2N8Pl9K2jj5J4Rl0RM0j1
3669B9l2L6K4k3j7K1k0Kj1K5j7o2N4K8l1n4K1L4L1l2k8J3K0j2K8L9m4l5J7L8p3
3700c1M2l4rL9J5q0K4Q2j3m6m6L1M9m0K2j2j7J6K6K3n6K1kj5Pm9pJ37j16M7m6
3731c8J6O2m8O2j00N3m0P1p3QM8m0LN2qk7j8J1N3o3oL0k0L6k7J7kk3j1O0p9L5
3763fJ4Ml6K2l4LK9k5L2k4j2K0M2%m4k5K2rQ9l6oN2m7k7N4n1P0p3kQj5L6k6l7
3797c8L7NJ1l7O7j6%n9N4Rk9l6O9l7Pop2Q2Pl1l8M7j9M9J3j1q8J36r6N5J1q0L8
$$ plain form
3572 31 32 4 17 -3 25 31 48 -44 15 1 122 40 62 12 8 -24 3 -17 -18 -33 -79 50 -45 3 -13 6 10 -29 -24 19 12 -13 7
3605 7 -27 -53 -4 48 -2 -13 30 0 -47 16 -19 18 -24 -12 55 19 3 -26 11 -2 -54 79 9 39 0 40 11 -11 -40 -15
3635 -15 11 -62 25 -38 -8 0 -13 -9 37 -19 -6 64 19 -2 0 -43 26 31 -8 -34 48 -34 24 31 -8 14 13 -2 12 21 -9 0 40 29
3669 29 -3 33 57 34 17 38 18 20 9 34 17 -45 9 37 6 -48 -27 7 38 6 -22 -9 11 -1 27 66 22 -13 4 42 -31
3700 -31 11 -23 -32 7 22 -58 -34 48 35 -11 -57 -26 23 -17 5 -7 -24 -8 18 41 -15 6 4 -11 -4 -53 -60 77 -39 8 -38
3731 -38 -22 40 -8 54 -46 7 -33 38 -35 -27 21 -19 -16 36 28 1 -17 -6 47 -16 -22 8 -12 24 -3 14 12 -11 -22 38 -41 -6
3763 -6 8 12 -24 -2 -36 -33 -4 -29 3 -21 -33 -13 29 29 -15 -40 -18 -27 62 26 20 72 25 -2 52 1 71 -2 -4 4 -11 25 -1 -38
3797 -38 -1 4 15 -22 45 29 29 -30 24 33 4 -32 37 0 7 1 -71 11 18 -13 -51 -4 -23 26 39 28 -60 76 -20 35 46 -34 4
3830DK0l6L0l5j3KL9OK1o3KN9m9J5j0K7K9K8p0l8P9p9j8RR5n5m7RN1k5J2%QLj2
3865bjPk2J9M8k9j9N4k9nk7M3k4M7n7j9%N1l8L6m7K7j4J0n5K4L9NK4r2M4M0l0
3898Hn2N6k7L5JlJl1l1R0p2L9l5L4L3o2P4l6p3J19n6n1O4Po5O8mq7N5Kk4J6J8
3931A1j3Rl0J2Q8j16M2JMm4L5M0Mo7Kk3J8K9rP6p5lk3J7L3L1l7kpj5O4p6M9k6
3965aLj8qkJ3Oj9J0qM7J3n4Rrl3K9L7J6m6K0j2kl1K0L1%J1Rp6M8J6nj6NM5K8n0
4002B6Lj0J2J3l5J0k8K4L6l2m2J0J8pPr9J17m5J9RM0l5l0l8J06n2Lqk2J03p9j8
4034b4O9j0K0n0o0M4L2k0l0K3N5j7%K5k0Mo4nlJ01p8j8J1k1L8L3j01L0N5J1%j8
4066A2qJJm2K5m1O6lk9K6J3om7M0l7K7k6M1l5M8M5n7L3K5q2k0J09p8K3l1Jl6O7
$$ plain form
3830 4 24 -12 18 -17 -30 -28 11 17 38 -25 -23 36 -13 2 -8 19 48 76 6 -32 47 -32 -50 -41 54 -1 -48 -39 12 -13 -1 -1 7 10 -2
3865 -2 -3 4 -18 1 49 20 1 55 26 21 -6 37 13 60 3 -16 -16 35 -3 33 -14 13 -1 9 -46 -22 17 22 46 -46 -2 38 8
3898 8 -44 12 -15 20 21 18 19 -12 -43 47 -25 14 -21 13 46 -16 58 22 -51 68 12 -39 25 32 -33 35 31 -56 -1 1 -23 -7 11
3931 11 -2 7 -23 -11 77 -39 3 4 8 -36 -1 39 43 -24 -22 -45 -27 2 -7 69 -6 -9 -32 -15 18 49 12 10 3 -12 52 -24 25 -1
3965 -1 2 -16 -24 -26 -13 -7 -26 -16 -24 23 36 -18 -9 -18 -51 -22 15 31 -15 5 -7 -9 -40 -20 11 11 22 31 -45 3 19 14 -2 3 48 76 26
4002 26 29 19 31 44 9 19 -9 15 51 19 -23 -13 5 -2 5 -94 23 -22 -3 6 46 11 -19 -57 49 -3 0 -8 -30 73 -6 -24
4034 -24 45 35 55 5 -55 -11 21 1 -29 -6 49 32 32 57 37 41 -23 -28 -31 70 -8 -26 -15 -36 2 35 -66 -36 19 30 30 12
4066 12 4 5 6 -36 -11 -52 14 11 -18 8 21 15 -32 8 -29 -2 -28 13 -22 26 71 14 47 72 -10 -30 79 1 24 -7 -6 -42 25
4099B5o4N5m1Ll0L5K6l9kJ7M8j6j8k5k6P1Pm1M4k4J9K4j4n8P2j5j3m2K3J8K3K
4131D4m4n2K2K7j4J5L1l8O2o8m4P1J7j05J37j10L5Lj4N3J7Ro5j6k9M0J3K3m9j0
4161c9N5K0m5M6j4l3K1L6m6J9K3j6n6K9J4n3L8Lk4LJ6j7K8l1L0L0J8p1L5P0q6
4192Cj8j0nM4l5L0j2K2k4M0o2qK2k4KKK4L5K5l7rm2L4l7P3j9k4J5qm2L2LK3l1
4226a8NL3J1k8L0pkk3l8K5j4N0j04J15p4j9K5K2M2l1Jn1J0N2K5j6LK7l7K9J4j1
4258D6o1Pj5kJ8K2m3L5K2p6R4j6j2J1m2j2M7pj4l9J5pM4n8Rj4P0n3ljO6n2Nn9
4292g5J15j6J8k4m2N3o1jM6l0qQ6m2m5N8j8l3LkJ7K0k0j3K7o8J01r8P0Pn9Q2o8
4324b0PK0Oj4Ll1KM5l5K3j0j5pnL2J9PL1o7MPjL9k2Qo9M9l2j3M9n2O1k0l0O4J2
$$ plain form
4099 25 -39 16 -25 -22 -52 -17 9 -30 -32 -15 33 17 -1 -26 -52 19 26 -15 29 5 24 48 34 -24 48 33 20 -22 1 19 42 44
4131 44 0 -52 -30 -3 -17 -2 29 -9 53 -15 -59 12 29 -76 61 -49 -14 -11 -25 28 45 54 -11 -27 -56 -16 -3 20 -29 -39
4161 -39 16 36 -9 37 23 -10 11 47 1 20 43 27 -29 0 14 -39 -1 2 -22 -19 -3 -20 8 -23 7 37 55 -16 19 89 3
4192 3 -15 -25 -30 14 -21 9 -3 19 -5 35 -27 -35 -13 -37 -35 -33 -9 26 51 14 5 -37 -3 -40 33 14 -10 5 -3 -45 -13 -10 13 -18
4226 -18 -13 20 31 3 33 26 24 1 -37 -12 -26 24 -80 35 -39 -58 -33 -11 31 0 1 -50 -40 12 37 21 24 51 14 43 57 46
4258 46 -15 -8 -23 -25 -7 15 -28 7 29 -47 47 31 19 30 -12 -24 23 16 2 -37 -22 -29 15 -43 -34 -48 22 -31 -34 -35 31 -21 -16 -75
4292 -75 40 24 42 18 -24 29 -32 -33 13 -17 -25 61 19 -26 32 14 -19 -16 -18 -1 19 -1 -14 13 -55 46 -52 18 25 -34 48 -20
4324 -20 -13 7 13 -1 2 -29 -27 18 -17 6 -4 -19 -26 -31 1 20 27 58 -9 -5 2 1 40 18 26 -43 6 -26 -39 10 -42 19 -1 -31 33 45
4360D5j00M9L6oNp9O0n4M9Ln2O6k0K2J7m2l6M3j4L2l3jNOO5o1P3p3Pnk5K6K4j7
4394A5k4qPnqqL7n7L5OPkL3k3RK6q8K4j7N0j7j5K5J7l2K9O8q6KqL4Ln1kj8M0K6
4431B4j8n8J16n3krPj0n0L3L6o4J07o3J7j9K6qk8Kk0R1p9M5Jm9NK8o0Q7j4k7K0
4464A4j6J2J2n8M1K4p5N9jLl7J11q2l1j6J7N1m1L0LJ3l1QRnp1Q4k0j9J2Lp9P0
4497fl7N8K5o6N7j3l2L4j3k9J9j9L6n0P0Kq6K2j8N5k8nLN5l2Kk0pj9N1Jk0K0j
4531Ij9P7p3m0K0N1j3opj9L7k7Q0k5m8k8L7l1M8k4qK2KJ0k3K4j6nk0L9J2k3oJ2
4565A9mK8l9L5p0L6m4m2L5O8n3M1k9L9m5K9J3n7L2K6Rn1j5O5M9n7j2k2L0j6LJ5
4597A6L2l0Mm8N0j4m2J8K0j4J8m4M5l2J0RN2l2n8L5LNpn2O6J7p2nQ6p1M3LK9l8
$$ plain form
4360 45 -55 -6 30 24 29 -50 10 -44 5 8 -44 22 2 24 41 -1 -37 6 -8 24 -9 -10 -5 1 66 5 78 5 12 7 -18 8 32 15
4394 15 -9 -17 -10 -15 -23 -31 6 -51 -16 -10 -3 -5 28 5 14 40 -48 -24 -41 9 -8 -23 2 19 -13 16 84 -2 0 -8 26 29 -22 -24 -42 -2 24
4431 24 6 -52 64 11 9 0 7 -3 -53 -20 16 -48 59 -4 13 -6 20 12 -16 -14 -34 57 -22 23 24 -25 -20 8 -52 35 21 -6 14
4464 14 -2 10 22 -36 5 29 -46 13 12 15 -22 89 7 -24 -40 -23 28 -13 17 20 33 2 10 19 14 -57 27 7 -12 0 3 -76 -6
4497 -6 -43 15 40 -26 31 18 -14 20 7 -22 -3 -22 14 -36 34 36 -50 -28 -46 9 -19 -24 -21 34 2 4 -16 -23 -42 9 10 -10 10 9
4531 9 -10 67 -6 -46 -26 25 12 6 -1 -20 17 -10 70 45 -3 -31 6 -25 23 -1 -9 13 15 25 2 26 10 5 -15 24 36 13 7 19
4565 19 15 43 4 39 -31 5 -39 -81 -46 22 -31 10 -19 20 -25 4 17 -40 -8 18 27 -24 -39 26 75 18 6 -16 14 -2 1 16
4597 16 48 18 22 -26 24 10 -32 -14 6 -8 10 -34 11 -21 -11 -2 50 18 -40 -5 -2 3 -4 -56 10 27 -45 -50 36 -35 8 11 40 2
4631BK9m8j8M9O2o1j9J6n1M9k1N5k6o3K4M8k0o2L0M5j8j9K7pK3pj2k4m2O9m6J1
4663b5Ml5M4k1J6K2l7L4L7l8N5n1L7o7K4K5On0L2K3m7Omk0qO4o4L5M8m0J0kLk5
4697ik2k5N2k8O8o4NQ7j05L9K0n2L9Jm2Q5m2j5k7M6K2k0O2q0L6l2J9M7l0K7p0
4728hJ2kJlj8J1l6KK5m3Q0j9QK8n9k4J3O6mj2k9Kj9k9N9n3K9K1j6O5pl6qNk8J7
4764iJ7Rmj1pL5j0m7K0j5K8o7L4K9J3o7lL5M3n6nK5Pk0MM1l2kj2j3K8l%J9j1K7
4800B0m8K0K0LOj8k9J3k8P9k9j9J6%K3r7L9l2N2l0M0l7J5l9L0j3lqJ1P3o3l1K6
4833c8MJ6J9PPj0J9m1j0Rk3L5M2k4m6O9m5JL4n5M3j01O8Rpj4J8K9n3R1J2l9k2
4866Dj1m2O2r0Q9o5O2k9K0rj1N1r4L6M1j9m6R9p1J6J7j2j6M9j09J28k5k5L5j7
$$ plain form
4631 2 31 -17 -35 14 76 15 -4 12 -39 10 -11 44 18 -45 -21 27 7 -55 -25 20 2 -17 10 3 26 19 7 -17 -59 10 -36 -25
4663 -25 -21 -56 -12 -33 -17 5 -32 2 39 1 56 5 42 -25 -1 24 30 -20 12 35 -12 -6 -10 -30 -38 26 -38 -3 45 5 15 13 16 -9
4697 -9 -31 -56 -4 -32 36 -28 -23 64 -41 -2 18 -34 5 6 -36 49 7 -8 -35 11 33 13 75 -5 31 -1 18 65 35 62 -8
4728 -8 4 2 3 0 -18 -7 -43 -41 -16 -59 21 2 10 38 -21 -45 -32 34 30 18 -11 -9 -28 -57 2 -51 -22 -1 -17 48 41 5 -3 2 -26 -9
4764 -9 8 17 13 2 -5 30 20 -27 -7 -22 6 -61 -27 2 15 -52 -55 -20 23 -33 -38 -13 -6 -26 -22 19 -13 -15 -27 -40 -12 -15 -15 4 -7 20
4800 20 -28 -8 12 15 21 3 -26 -13 -41 38 9 -10 6 6 29 -68 -29 -61 -9 -39 1 -36 -21 -60 -30 -43 -46 -54 -43 30 -33 -64 -38
4833 -38 -34 -18 1 8 15 5 24 -17 -27 -18 -41 -6 36 12 -34 35 -10 -9 25 -30 13 -88 -20 -11 -18 -32 -14 15 -38 53 65 26 4
4866 4 -7 -49 13 -77 12 -53 9 -20 0 -9 -20 31 -63 -27 14 -5 -51 48 -23 -7 10 -2 -18 31 -78 50 25 0 35 18
4896A8k9K6J2k7L7j4j8N9p1mN5K7l0o2M7o1M2j5mL1j1Jl1L3n9LlO0NrL7j02P8
4929B1M3o9J8j7K6K7p5O7o4M0l0J3k1L9j1Oj8O0p2l6K4P4r7L9K4j6J1J9j5l8N4
4960B6j0l5Qnk0K8O0n5oL9j1O3o1j0JJ3l7K1kkqJ3N2Oq8Rk3K6N8q5Q1Lp0RK1k4
4996a5ln5L4J1M2K0l1oNJJJ7mj3oL8n2M3K6m7Orj4OlN5n9K8k4J4o6L4K7L0n7J1
5032a5N5k9N0p1k7M9Rl3j8K2k5K3L8o9j6K9N5l9l5O8j0lo1Q0M3q3K9llk1j7j6
5064d4M2K2l7N5l4k7L6qk6K2J9l1j1J5M1p8L9l2J9k4qQ6J3n2M9o5%K8m4lj0O6
5096A8n8R3n6LK1j8K4M5l7k5lKoj1J6M2k0m1k9O7%n2%k8K2N7l2rLM9L1o3pk4L
5131b3L3qp7O0qJK4m3J7K7j6J00n4pK3r7J4P9j2rj1n1M5j1J1l9j9j5N7M4k3l3
$$ plain form
4896 18 -11 15 27 0 37 23 5 64 -7 -11 44 71 41 -21 26 -35 7 -8 -12 19 8 9 -22 11 -48 -45 -48 12 17 8 45 -57 21
4929 21 64 -5 13 -4 22 49 -26 41 -23 17 -13 0 -21 18 7 13 -5 55 -17 -53 -29 45 -52 -13 11 -5 6 25 10 -28 26
4960 26 16 -19 -11 -16 -36 -8 52 -3 -9 30 19 82 21 11 12 25 -12 9 7 5 -3 10 62 68 -20 -11 -34 -8 50 -35 46 49 -21 -12 9 -15
4996 -15 -18 -73 -39 -28 14 34 3 -3 2 3 4 21 17 4 -2 36 -16 27 53 6 12 3 -11 -5 -8 47 -12 16 -8 6 -60 -26 1 31 -26 -15
5032 -15 40 11 61 -10 -37 12 21 -12 -30 -8 -33 -10 28 -41 -57 -28 27 -12 -47 21 11 8 -53 27 70 -13 16 13 10 -11 -28 -44
5064 -44 -2 20 -17 38 4 -23 13 5 -21 1 20 -11 -22 -7 34 -44 -5 -37 -18 -42 -50 36 49 -3 46 -19 -19 9 -35 -38 -48 18
5096 18 -40 53 -3 0 21 3 27 72 35 10 7 9 3 -8 8 50 30 -11 -40 27 27 -25 -25 -53 -31 26 -6 -15 -12 37 68 5 -2 -26 -23
5131 -23 10 2 -75 -15 -23 -22 2 -41 -24 3 -13 87 33 26 49 -48 -34 45 33 24 13 -38 7 -4 7 -32 -51 -66 -9 35 12 -21
5163b1L7j5J7o7O4J6l5n9M5N3m2k0O5l9J3M1k8J7k8Kk5KM7j0p9JO3LL7p7P3q9
5195c8P4p4K9jK0l1M5m1rN9l8k9J3J8n5L7J9KJ3j5M8l2j16O6M6j0kL8qj3M2m0
5227A7J1m0k6N7pPk0j1LK0m8J06n1n4K8ln4R0pn5J8J8m6J2j6N2k9O8l4J6K3r5
5259e0M4L2k8k6L0om5L5PO5q3J4K1J8Pk3J5j7n3N1l2J2N0n0j7m0O8N3p1L3Pnm8
5292c2N4o3k1O3pL4m7J0K9l5kL1n2P3K2n2L8m4o0J02k2k0K2J7l5m2M6rp8L9N9
5323A8J9l3n1J4P0kj4nLm1L5%m1k3L5m7L2%N0j7K8KJ5m9pJ1O2o4P5m6j2k2J3L8
5357D6m1j6J9k0j7M2j7P4l7o9N3l2joP2q0J0J9j5k6PO7l6n5P0l5K1J4j3l3j0J6
5389b9M4K3l8j5L1kK4K7m2K9j1j5mOp4L7O6j31M6OP4p0J5K3k1Q5j20L7J4Oo5Q7
$$ plain form
5163 -21 16 1 18 -49 15 31 -4 -63 -18 35 -7 -27 38 -1 12 53 25 42 14 16 -9 -7 40 30 -49 -48 15 18 55 -22 51 -38
5195 -38 36 -38 -9 -10 10 -21 24 -17 -26 33 -5 -34 -21 -3 -58 -21 -2 0 13 -2 46 14 -102 -36 10 0 -2 36 28 15 57 17
5227 17 28 -12 -38 19 12 19 -1 -12 -9 11 -37 69 18 -36 -8 -11 -65 25 18 -37 -19 -1 -47 -35 -51 1 -28 40 6 22 45 -50
5259 -50 -6 26 -2 -28 2 -4 -49 -14 -7 58 -25 -11 10 28 35 12 27 10 -43 8 -24 -12 38 -12 -29 -69 -1 52 -19 14 21 16 -32
5292 -32 22 -41 -62 1 -6 28 -19 -9 20 -15 -17 14 -38 35 57 5 43 -1 -61 41 19 -1 21 38 3 -39 7 -2 -80 -41 18
5323 18 37 4 -47 -33 37 35 21 16 19 -22 13 13 -28 -51 -16 -63 -31 -31 19 2 30 32 47 -2 -9 2 64 0 75 29 17 -5 8 46
5357 46 5 -11 8 -12 -29 13 -4 70 33 -36 17 -15 -16 -22 50 -30 -20 -1 -16 -42 -35 32 -4 -59 11 -24 -3 11 -2 -35 -45 -29
5389 -29 15 38 0 -15 16 14 38 65 23 52 41 26 22 28 -46 -9 57 -74 -28 -22 52 -18 -3 20 -1 84 -36 1 15 21 -44 43
5421D3r0P5k6o8Q9k6pj9J1L1K8j3j9l8O4N6p3k9N2J4p0N1n9J8j2j3O3j2Pl6K0
5452A2L0j9m0PK5n0P1n4n8L4K0N2k7j0k1j4M3o4P9k5J0JmkM9J9n4K2o0j5Q1l0
5484HL4r4J6O7j9J4m2j4M5j4jL9o6LN0m6j5M5L6k1mj6j1kl9M6NK6l5L6l2K0j6
5517Ck0QO0o5L1rm6Q3Kq6R6n2k8M8q3R8p5N8j9o6O4M1l1k5K0Ql0L4l1k3mK8k2
5550c3N5L0r4P4j7q5L9J4JRnk0JP2j2k2q3O0nL6k7M6l9KO2n5K6p1L8k1K5N3m6
5583Hj0o3P0J6n4pP6j00R8kKPo4L6J7p7K0k6J0O3k7K1m1O7r9O8O2r7K1k2J8O5
5615E6Nm7j3LN4o6K6Lp1L2K0LK2m9rK5m0P3k3k4K8k7P7Qn5j5L9m3M4L6j00M6J5
5648C3qRmJ8l9l1L4N2kl9j9n4Q3l7K4J5oMpm3ok8N9ol3J0N4mm5l4R9r0R3q9RM4
$$ plain form
5421 43 -47 28 2 -66 23 -3 -10 -29 -18 13 41 28 9 -29 35 91 18 -11 41 55 -15 36 -23 -5 -17 -30 33 21 28 -8 12
5452 12 42 23 -17 -10 15 -35 36 -18 -76 -42 -22 30 3 -7 -28 -42 1 -63 16 -9 1 2 -2 -4 45 64 10 32 -28 -43 38 8
5484 8 42 -52 -36 31 12 26 -16 -30 15 1 0 39 -27 -24 26 -20 -35 10 46 25 21 5 -6 -8 -47 -1 4 30 -5 31 -1 19 3
5517 3 -17 -9 51 -14 17 8 -38 45 47 -39 57 5 -23 25 -58 40 -35 23 4 -62 2 43 12 -13 7 15 -15 19 -12 -35 -39 -11 -33
5550 -33 22 52 -42 32 15 -70 -31 -17 -16 -7 -12 -32 -31 41 29 7 -76 -16 -21 15 -12 34 -5 -3 59 4 30 -41 -3 -24 1 54 8
5583 8 -2 -65 5 21 -33 -40 36 -64 34 32 34 41 -23 13 30 -47 -27 -53 -43 20 -7 14 -27 40 -59 9 71 -26 -5 -27 -9 56
5615 56 61 14 1 4 58 -8 18 21 -50 -18 2 5 27 -22 -31 -6 -46 27 4 -20 8 -19 58 66 11 -4 35 -8 36 72 -28 18 33
5648 33 25 34 30 48 9 -22 12 64 62 23 4 -50 33 -4 20 35 29 33 26 -17 -23 -51 8 2 -31 -21 33 29 -16 -50 49 -41 52 -37 -28 16
5684A6L2l3K3l6J3kl9M2n9N6K8qj13N8oN4K2n2rMk2rL3k8J4mN3L1j6q0P4pj1k8
5718iO3p8P1r7N6lj9L9M3J8o4klp7P9n5O3J8Pk0K7Ll8k7j3J7MKL6k7k3k1N0ml9
5753b3J3kK9lk6L4j0j7K0o9M3N4m9j6k7L2Rl7M1k0L2k4Lo5J03RJn7J3K5l1K7N1
5786F3j11NN2kL3j04P6OL4m7OK4m8m7P1k0p4O8L5k0O7j06O6l7j1K7k4M6j9J5M3
5817F7l5m7k8O6J0j2j8O3n9L3q7j1J08m5J6j0j0P9o9l2J1m3O2k0K4k8Npk5K9N
5848hK5Rk8M7l6k2mK3MmM3n2k1M6N1o0mQm6O4n4O4o5P3p3RL1nrJ%oJ7p2K7j4M5
5885Dl5M0M2j06P9k0n2J11m3K3J1n4k0Rl1P2j4kJ0J6m2K7l2K1LPm8K9K7j00N7
5916a1j0%Lj3J9M1m7m7M2K8k5mj1N9M7p3o3P0l0K5J8m4pN6l3m8N7L1m1k6K2L3
$$ plain form
5684 16 48 15 38 2 15 13 -26 16 -43 13 41 33 -80 -22 -28 26 48 -4 -13 -9 -31 -40 -7 -35 -21 -25 28 59 43 -37 37 30 19 -9
5718 -9 54 -24 47 -50 6 3 -16 23 66 84 20 18 15 -62 17 -38 25 43 50 30 57 60 22 -5 -18 -1 3 5 41 14 -9 -30 20 16 -23
5753 -23 -10 -12 17 14 -12 22 12 -5 15 -54 -11 43 -6 -22 -49 -17 -8 -45 -4 -24 8 -16 -13 -78 25 34 35 -22 -9 16 -15 12 63
5786 63 -48 -43 9 7 40 -64 12 18 52 5 11 35 -13 -60 11 -9 -83 -15 20 0 67 -39 27 -10 -21 6 -18 28 9 24 67
5817 67 32 -15 -43 23 33 21 3 66 7 40 -47 -58 50 5 21 11 1 80 11 -21 -10 -53 9 -11 13 -15 -10 -17 -42 -13 -8
5848 -8 17 26 -2 45 9 -13 -17 6 10 6 49 -3 -24 22 73 13 9 17 -29 35 -19 45 -20 53 -20 -11 20 15 6 7 7 1 18 -54 -27 -41 4
5885 4 -31 9 51 -55 24 4 -48 63 20 43 54 0 -20 -11 -42 30 16 14 24 40 -2 25 -7 14 17 24 -24 5 32 -68 -11
5916 -11 -21 -21 -18 -31 -12 29 -18 -65 -23 5 -20 -24 -35 24 71 -2 -65 5 -25 0 18 -26 -33 23 -10 -58 -1 30 -11 -37 -15 18
5948A8QK6m1k6J6M8o3Nk3L0m9K5L3N0n2oJJ3k4J8J0m6M9n7K0L9m6L9j2l5K5N7
5980E0l9m8M6l5P0n3m0O6o7P5l6j0K8K2Om2rP1j12P8m9M4J0KOm8mJ9m2R2r8L5
6012a2J9j6L1l4nN8l1j0nNj4K7j4j5l7KL8J9M2l7Rqk9J2R6o1kk9K6Qj4J5k9jJ2
6047A6k7J8j0L8m6K2J1n1K2nj9J6jjJ5M0o5L6J8m0j6%Q6j7k8L0l3lL3n5jJ5L6
6080C4K8l2J0L5q5K0j4K4k3O8n4Qj0K4l1l4O4k4qK5km7j6K2m6N6n4M2K4L9m8J
6112dK1J9n3nK6j2L1n8J7k0J1PJ0L1L4p2L4k7M6j6l9L4K8j1l5mM2N9j31K4J1l7
6144c9prpM7K6J5k5L3j4n8R4k0JM9j8q5L1j5P5j30O5J3k0J9m6N6ol2K8Mqj9K6
6177B4j3l0J3P4q1L7j3k1m6L9Rj9M3o3M5l7K7QkO0pn3M4lk6NJ5l5J7j1Kj5L9j8
$$ plain form
5948 18 26 52 11 -15 1 49 -14 -9 -32 -2 -51 -26 7 57 5 -1 0 13 -11 7 17 -29 20 -37 -17 22 -24 15 3 -32 -7 50
5980 50 11 -37 9 -26 44 -9 -49 17 -50 25 -11 -21 7 29 35 -7 -16 55 -57 21 -28 16 26 28 34 -14 -18 1 -41 51 -47 -12
6012 -12 7 -9 22 -12 -17 41 10 0 -5 0 -14 13 -1 -16 -53 -51 -13 6 48 11 20 12 -17 -5 91 30 28 -1 25 33 19 34 5 4 16
6047 16 -11 7 -3 35 -11 11 22 -29 -7 -12 -31 -15 -16 -17 -2 38 -27 9 27 -13 -29 -29 57 40 12 42 9 6 39 -16 -17 -2 34
6080 34 62 30 40 75 -10 10 -4 20 -3 65 11 19 9 33 2 -32 32 8 0 25 23 -24 -40 -18 -64 -8 -62 -20 4 43 -5 -4
6112 -4 17 36 -17 -22 4 -8 23 -35 -18 -38 -27 -20 -10 21 55 -17 17 -10 36 20 -19 15 43 32 -3 -7 35 94 -37 -13 -2 -39
6144 -39 -46 -55 -62 -15 11 26 1 34 20 -38 56 36 37 86 68 -17 14 -1 74 -56 9 22 2 21 -25 31 25 -7 21 25 17 -2 24
6177 24 11 -19 -6 68 -13 24 11 -10 -56 -17 -8 -27 16 -47 -2 -39 -12 -4 -6 54 47 -6 38 35 9 14 29 -6 11 0 2 -13 26 8
6211Hkj2M9l7J1K9k9m7J5pRK9o8L0k2P0m9L6m7k2M7Rl5J7L6%l0N0q6M6Ll0N9k
6245B8k3nM9n4JK1J6k3k3K1j1J6k0l5O5nj4l7K1O3p2lJ9p3J03k5m1R6j42N2J7
6276a8J3L7m6qJ4M5o2lRL8MO7r5P2p9K2l6L0Nk8n5oJ22n9LoJ9k7lJ1JJ2K8m9K4
6311dM2n1J9k6O3p4N7m7K9m6L6K0Nj4j5J5J1k8L7O2l3o3Nkqj0k7P4k1o5R7m5k7
6344c4kO2k3kml5O8j7n8K0L0ql0L1m7L8%K6o6O7p9J01m3nlL9o1L9J5rOm7mL8o0
6379e7N5P4r2K5%L5m8k6oM8l3K6%%%oM3m8Rk6N8n3n0P6j4M6l4kL6l4n2J21p9K7
6413A9K7o6LM0K3Nr4N6L9l1l6M0J8Ml8J6mK4o0j5N7o7O2J3j1m3mP1p5n3R9k2k1
6446b4J5N3m0onK0k0k4K3P3n3Kn2M6k6M3n2K3J1J9Jn5OJ0pMrQP2o6n5O8nk1l5
$$ plain form
6211 8 6 -6 43 6 17 46 17 -30 -15 -22 -13 16 -52 -22 -44 26 -23 13 -34 -56 -9 0 -35 -18 18 18 -12 38 -48 -2 1 -29 30 28
6245 28 5 0 49 -5 -4 17 33 10 -13 8 -3 13 -7 -42 23 18 4 -33 -12 51 -21 -24 -5 -78 25 0 -41 55 -87 -35 -18
6276 -18 -5 32 -14 -22 -8 37 -25 -28 -19 19 23 90 -5 67 -12 10 -26 4 9 -19 -74 -80 42 -17 -14 -20 -1 -28 -31 -20 -19 -7 21 -28 -4
6311 -4 38 -13 6 -20 43 -31 26 -21 8 -38 -2 18 23 9 -6 9 20 -8 29 91 58 -5 0 -2 -10 -20 -47 27 6 -59 38 -7 -34
6344 -34 -36 26 3 1 -3 -38 30 13 -45 -25 5 -3 -33 -2 -49 -11 -11 15 -51 16 -63 38 -5 -10 -13 26 -35 4 19 10 16 -31 -35 3 -57
6379 -57 -2 72 -20 5 5 40 -8 -34 -40 8 -25 1 1 1 1 -5 38 -10 -1 -27 31 -22 -72 4 -10 36 2 0 36 2 -50 71 -8 19
6413 19 46 -20 -17 23 46 51 -43 13 52 21 -15 25 43 47 9 25 21 45 -15 -30 27 -40 22 35 24 -19 -23 48 -27 -80 19 -3 -24
6446 -24 -9 44 4 -2 -7 13 -7 -31 -8 65 12 14 -38 8 -18 25 -27 -4 7 26 27 -28 -22 -12 -19 -15 -24 -16 56 -10 -65 3 -2 -23 -58
6481e8M0L6j5KJ5l4L2l6L8Kn9N2m9K2P4p9L3j5L0%j4o7M5On0O8K5J1q7nK9L7o5
6514c6oL1j3j2k9Q8m9M3pm3lO6nm2l1M6J4k0M3K9n7Mqk5N2l5J24j18J1Lk8O3k3
6547B7o5M9p2R6K3k5J4p1R2m1o4Qm2R8m9L0J4p7L9Pj2j4Q%K7K1k7k1KJlK7j8O5
6581D7l2l4L9l9J2L6j1l3R6p3l1L3L0o2oP8q8J5P3n8j6J0P8m2k6k4L4j1l1P1j13
6612g8M9L9l8K4K2l1K6k0Ol2J8Q9o0Qm2N0jL0k2j00N6M9Pl6m0Q4m5Jm1N7m1PN9
6645E4jqm9kl5Ll3J4Q9k7l5N3p9M1L8j0j1K9n1J1N3o3M9j5l1O2k5n2N9n1K7k3
6677a9LN2j6j1J1KpQl4j3N0q7M7j1K3j7J7nL4J7p6N6l5l8L8j9N0%%J4j7K8k1j2
6711A2nN3q0Q8p6L4j0m7P1n9kN7n3pL2pMK9m1L4kk5MJ3n4MLP9o1k2K5o7P3j3N
$$ plain form
6481 -58 -18 18 3 5 20 -14 18 -18 20 22 -37 15 -34 -12 62 -17 16 1 31 31 17 -50 -5 1 -49 19 44 55 -32 -37 -8 29 -36
6514 -36 -42 -11 -24 -36 -65 23 -26 17 10 -33 -36 30 25 -17 -48 -2 12 -8 35 64 7 11 3 -22 30 -5 119 1 12 15 -13 50 27
6547 27 -38 11 -61 35 58 33 47 -24 68 27 -37 -29 -71 27 -22 8 22 -55 -16 -9 -21 -35 -27 -27 0 21 -6 -27 -25 -24 -27 0 -18 47
6581 47 15 -19 20 -19 -7 29 18 -15 81 8 -23 10 40 -22 -28 50 -38 -23 50 -8 -24 -14 64 22 -4 -28 6 -5 -36 35 -78
6612 -78 -29 10 -28 -4 18 -13 13 -7 -1 -33 -15 74 14 22 -20 30 29 59 37 -63 -7 42 49 13 -27 57 12 13 -28 29 -12 -5 54
6645 54 53 45 -4 -6 -41 -38 -71 -57 32 5 -30 23 -56 -15 23 13 2 31 -20 -9 44 -19 30 15 -16 46 21 -31 28 -23 4 -19
6677 -19 -16 36 20 9 20 22 15 23 -11 -24 26 -61 -14 -25 -2 -19 -2 -7 27 44 -32 24 -11 -49 -11 -30 20 20 20 34 17 45 24 12
6711 12 7 60 -20 68 -8 26 16 -31 40 -19 -21 36 -17 -24 8 1 5 34 -7 27 25 0 4 17 -37 -33 -30 49 -12 -34 -9 -76 -3 -16 -11
6746a1K7pk9K8J6k3j5K5L0L5j17J00o1QL1n9K9J4k5L0j3kql2K7K2l4L2k2j1kM2
6778B5k8J0J7ol8N2l3k8K0JL3j5l3K0j3KL8%pm5J0N0O7o4o4Q7r8M9M5l1oJ3Rk7
6812A2l8L7J7j9l5qj8L4J9k2M0Qm7O4J1n7J3n7O6o4L8L8j3k8J8j9QrkL3K8n8l4
6845d4L6K8j4jl5O9n8L8J1l9M4k1l9M1Jk6J3J0k4k6L2k5M0J4Mjo5KO7o8nJ2O1
6878C2o4J41j28N3Qq8Q9p7PO4l8K5M6r3j3P1j0RJ5r4N6lkk9JL6kl5J2N0l5J5j12
6911i3J53r8L8%j0J2K3k8KqnL6K8k2nk9J5J4o5N6L8j2o1O0k8l8j4K0OK0K5j7p4
6944f1M4lK3mj9N3j6L6j3q7K3K8K4m7P1j14J06m7J1p7M4PM3l2j3nL2L0o9l0J4
6975d8L4onP4m2k5M2j7kn4N2J1%k6L7Rq5O7rL4p9K8ol1L6o4Q6QM9j00L8JN0o2
$$ plain form
6746 -11 16 9 -20 8 24 1 -14 11 41 76 -41 59 -2 6 37 -22 7 21 -4 26 13 11 3 -29 -2 20 -14 18 -4 -15 -17 25
6778 25 -3 7 24 18 -20 32 -1 -29 -9 -8 25 10 -23 -3 -16 -14 24 24 17 -28 -18 32 99 35 -29 58 -40 9 54 23 17 30 39 12
6812 12 -26 11 28 9 -26 -34 -52 -18 1 -21 19 27 -20 44 55 -2 11 -46 20 -44 -6 32 19 -9 9 -10 -2 -11 -13 20 48 -10 -44
6845 -44 -8 20 6 5 -30 39 -19 19 30 -9 35 14 -25 16 17 -9 4 14 -10 -36 -4 -29 11 25 29 28 -37 -35 32 -36 -41 -29 32
6878 32 -32 109 -19 34 42 -46 43 -34 -27 37 -1 24 70 -23 -36 35 25 34 49 -45 11 8 6 -23 -22 14 12 -23 -11 39 4 19 -93
6911 -93 60 -38 0 0 -10 2 25 -3 -1 -9 -14 22 50 28 23 -6 9 23 -42 14 52 40 -21 39 11 -27 -41 -21 -15 5 30 13 -61
6944 -61 -17 -20 3 -1 -20 33 17 53 40 -47 -24 4 28 -19 52 -62 44 -3 8 -69 -25 -18 25 -7 -20 -25 7 37 -32 -62 -48
6975 -48 -14 -20 -25 49 7 -18 24 7 5 -49 3 14 14 -12 25 34 -51 16 7 41 -38 -10 -16 -47 -11 -75 11 19 68 -32 6 7 57 -5
7009eQ7r7j1N1j5Mj4J6j7mPL2p8L4K0K1j8l6K6llrmQ4l8jm6l4J3L4m6N3L1j4k0
7044@j3mK5j9R4r7P0j04J9R2r0K4J2m8N8k1qj4J5j4mM2k1J2m5k8R7k2K%k5P8p9
7077a6k5k4M3K3kJK5j1p6L9K8pL4J7k0Nm9K5QK4l1j4L5mj2l9QL0L1p2J2l2N5J8
7111B7l3m3O6M2n1qj1RN4l3p9M8L0l7M4k3k4J3j2M3jJ0n0j0K9K4k3M0lqj6l6J9
7144cj3M1n0L9K7k6m5LJ1M5l3L1l9JM1l8K3k9m6P3L1q7K0M2J3k8J4n9O8m7K7k6
7176a9l1O1K7nm2O9q2P7j8n9J7L0l1J4k9m1L8J8M4n6M5%k6j1J9J4j7j6QM4j9p
7208A6k8kj8K7n6N6J9k8M1m4N2Mj1Nmn3O1m6K9j8l2k0j2N6N9j5n6L6pm8M3k2l8
7241e4L9k4l7P2L5j03O5j4k7jO5l7L5jk7J2LL2l8O7n0l0mL5j7K0jJ3Klk5%J0p
$$ plain form
7009 -5 82 -15 -26 25 10 14 0 16 -1 -5 2 34 -44 -10 10 31 13 -23 3 0 -3 -12 -16 68 30 29 -17 -51 -38 -4 -50 3 34 20 0
7044 0 -13 -17 8 -11 83 -14 56 -48 -29 63 -27 -3 9 -39 19 -2 -10 -24 -9 -23 -27 15 -6 6 -39 -67 30 8 10 10 -15 63 -16
7077 -16 -41 -65 -22 1 -1 0 25 14 -62 -23 5 -2 32 49 29 34 -15 10 18 42 11 -3 32 28 16 -23 -15 15 46 -26 -14 -46 9 27
7111 27 -6 -49 17 59 8 0 -11 -2 52 19 -60 -12 18 -19 25 2 -22 -9 -21 22 21 31 -19 -29 0 24 1 41 38 30 14 -22 -3
7144 -3 -16 25 -25 14 41 15 -30 -27 -16 29 -4 27 -12 -11 30 -8 15 -14 -60 13 44 -43 -23 19 32 4 18 -41 27 -20 7 -19
7176 -19 -50 11 38 33 -9 60 -22 55 37 -22 -5 25 -6 8 -21 -62 -24 -6 38 -18 27 27 1 -10 9 23 6 -10 -2 42 23 16
7208 16 -12 -14 -32 -5 -61 -5 14 -14 27 -17 35 39 28 33 29 -24 37 -9 20 2 -30 -50 -62 -6 53 38 -18 18 11 -37 6 -16 -54
7241 -54 -15 -39 -76 -4 31 -72 -7 -21 -48 -49 16 -21 14 13 -14 -2 1 33 -5 62 12 -18 -22 13 -4 16 15 28 30 27 2 2 12 5
7275Ej0N0j10K3k1R5n1K1L6nl1J0k5pj2J1J4n0L8M7m0M1k7%K4n2P5ol4l2K7k9
$$ plain form
7275 5 -5 45 -65 -42 -63 32 -19 2 38 33 2 12 -13 -20 -32 -21 -7 -57 -19 28 -12 29 2 2 26 -26 49 43 9 -23 4 -25
$$ [...]
8191D0
##END NTUPLES=NMR FID
##END=
